##TITLE=1H_AM_NVYNE_AN100
 
 8 sc, 
 5.04.2022
##JCAMPDX= 6.0         $$ Bruker NMR JCAMP-DX V2.0
##DATA TYPE= NMR FID
##DATA CLASS= NTUPLES
##ORIGIN= UXNMR, Bruker Analytische Messtechnik GmbH
##OWNER= root
$$ XWIN-NMR		Version 3.5
$$ Tue Apr  5 12:54:20 2022 Russian Standard Time (UT+4h)  she@DPX200
##.OBSERVE FREQUENCY= 200.131346
##.OBSERVE NUCLEUS= ^1H
##.DELAY= (6, 6)
##.ACQUISITION MODE= SIMULTANEOUS
##.ACQUISITION SCHEME= undefined
##.AVERAGES= 8
##.DIGITISER RES= 18
##SPECTROMETER/DATA SYSTEM= spect
##.PULSE SEQUENCE= zg30
##.SOLVENT NAME= CDCl3
##.SHIFT REFERENCE= (INTERNAL, CDCl3, 0, 15.7039)
##AUDIT TRAIL= $$ (NUMBER, WHEN, WHO, WHERE, WHAT)
$$ ##TITLE= Audit trail, XWIN-NMR		Version 3.5
$$ ##JCAMPDX= 5.01
$$ ##ORIGIN= Bruker BioSpin GmbH
$$ ##OWNER= she
$$ F:/spectra/data/she/nmr/H-F/1/audita.txt
$$ ##AUDIT TRAIL=  $$ (NUMBER, WHEN, WHO, WHERE, WHAT)
(   1,<2022-04-05 12:53:19.57 +0400>,<she>,<DPX200>,
      <created by zg, POWCHK disabled, PULCHK disabled
       configuration hash MD5:
       00 E9 B6 7A A2 85 ED C7 34 08 36 98 17 FE 4E 26
       data hash MD5: 16K
       72 6B 32 31 BE 10 92 84 82 D5 2C 8B 2F 61 B4 FB>)
$$ ##END=
$$ 
$$ hash MD5
$$ DC 85 C2 1D 79 39 1B 17 8C 53 E4 12 0F 25 13 2F
##$RELAX= 
##$RELAX= 
##$RELAX= 
##$RELAX= 
##$RELAX= 
##$RELAX= 
$$ Bruker specific parameters
$$ --------------------------
##$DU= <F:/spectra>
##$EXPNO= 1
##$NAME= <H-F>
##$PROCNO= 1
##$TYPE= <nmr>
##$USER= <she>
##$AMP= (0..31)
100 100 100 100 100 100 100 100 100 100 100 100 100 100 100 100 100 100 
100 100 100 100 100 100 100 100 100 100 100 100 100 100 
##$AQSEQ= 0
##$AQ_mod= 1
##$AUNM= <au_zg>
##$AUTOPOS= <>
##$BF1= 200.13
##$BF2= 200.13
##$BF3= 200.13
##$BF4= 200.13
##$BF5= 200.13
##$BF6= 200.13
##$BF7= 200.13
##$BF8= 200.13
##$BYTORDA= 1
##$CFDGTYP= 0
##$CFRGTYP= 5
##$CHEMSTR= <none>
##$CNST= (0..31)
1 1 145 1 1 1 1 1 1 1 1 1 1 1 1 1 1 1 1 1 1 1 1 1 1 1 1 1 1 1 1 1 
##$CPDPRG= <>
##$CPDPRG1= <>
##$CPDPRG2= <>
##$CPDPRG3= <>
##$CPDPRG4= <mlev>
##$CPDPRG5= <mlev>
##$CPDPRG6= <mlev>
##$CPDPRG7= <mlev>
##$CPDPRG8= <mlev>
##$CPDPRGB= <>
##$CPDPRGT= <>
##$D= (0..31)
0 1.2 0 0 0 0 0 0 0 0.06 0 0.03 0 0 0 0 0.0002 0 0 0 0 0 0 0 0 0 0 0 0 
0 0 0 
##$DATE= 1649148798
##$DBL= (0..7)
120 120 120 120 120 120 120 120 
##$DBP= (0..7)
150 150 150 150 150 150 150 150 
##$DBP07= 0
##$DBPNAM0= <>
##$DBPNAM1= <>
##$DBPNAM2= <>
##$DBPNAM3= <>
##$DBPNAM4= <>
##$DBPNAM5= <>
##$DBPNAM6= <>
##$DBPNAM7= <>
##$DBPOAL= (0..7)
0.5 0.5 0.5 0.5 0.5 0.5 0.5 0.5 
##$DBPOFFS= (0..7)
0 0 0 0 0 0 0 0 
##$DE= 6
##$DECBNUC= <off>
##$DECIM= 32
##$DECNUC= <off>
##$DECSTAT= 4
##$DIGMOD= 1
##$DIGTYP= 9
##$DL= (0..7)
0 120 120 120 120 120 120 120 
##$DP= (0..7)
150 150 150 150 150 150 150 150 
##$DP07= 0
##$DPNAME0= <>
##$DPNAME1= <>
##$DPNAME2= <>
##$DPNAME3= <>
##$DPNAME4= <>
##$DPNAME5= <>
##$DPNAME6= <>
##$DPNAME7= <>
##$DPOAL= (0..7)
0.5 0.5 0.5 0.5 0.5 0.5 0.5 0.5 
##$DPOFFS= (0..7)
0 0 0 0 0 0 0 0 
##$DQDMODE= 0
##$DR= 18
##$DS= 0
##$DSLIST= <SSSSSSSSSSSSSSS>
$$ [...]
##$SUBNAM2= <"">
##$SUBNAM3= <"">
##$SUBNAM4= <"">
##$SUBNAM5= <"">
##$SUBNAM6= <"">
##$SUBNAM7= <"">
##$SUBNAM8= <"">
##$SUBNAM9= <"">
##$SW= 18.0517287032376
##$SWIBOX= (0..15)
0 0 2 0 0 0 0 0 0 0 0 0 0 0 0 0 
##$SW_h= 3612.71676300578
##$TD= 16384
##$TD0= 1
##$TE= 0
##$TE2= 300
##$TE3= 300
##$TEG= 300
##$TL= (0..7)
0 120 120 120 120 120 120 120 
##$TP= (0..7)
150 150 150 150 150 150 150 150 
##$TP07= 0
##$TPNAME0= <>
##$TPNAME1= <>
##$TPNAME2= <>
##$TPNAME3= <>
##$TPNAME4= <>
##$TPNAME5= <>
##$TPNAME6= <>
##$TPNAME7= <>
##$TPOAL= (0..7)
0.5 0.5 0.5 0.5 0.5 0.5 0.5 0.5 
##$TPOFFS= (0..7)
0 0 0 0 0 0 0 0 
##$TUNHIN= 0
##$TUNHOUT= 0
##$TUNXOUT= 0
##$USERA1= <user>
##$USERA2= <user>
##$USERA3= <user>
##$USERA4= <user>
##$USERA5= <user>
##$V9= 5
##$VALIST= <valist>
##$VCLIST= <CCCCCCCCCCCCCCC>
##$VD= 0
##$VDLIST= <DDDDDDDDDDDDDDD>
##$VPLIST= <PPPPPPPPPPPPPPP>
##$VTLIST= <TTTTTTTTTTTTTTT>
##$WBST= 1024
##$WBSW= 4
##$XGAIN= (0..3)
0 0 0 0 
##$XL= 0
##$YL= 0
##$YMAX_a= 291230
##$YMIN_a= -225365
##$ZGOPTNS= <>
##$ZL1= 120
##$ZL2= 120
##$ZL3= 120
##$ZL4= 120
##$ABSF1= 10
##$ABSF2= 0
##$ABSG= 5
##$ABSL= 3
##$ALPHA= 0
##$AQORDER= 0
##$ASSFAC= 0
##$ASSFACI= 0
##$ASSFACX= 0
##$ASSWID= 0
##$AUNMP= <proc_1d>
##$AZFE= 0.1
##$AZFW= 0.1
##$BCFW= 1
##$BC_mod= 2
##$BYTORDP= 1
##$COROFFS= 0
##$CY= 11.3945322036743
##$DATMOD= 1
##$DC= 2
##$DFILT= <>
##$DTYPP= 0
##$F1P= 2.36226072786647
##$F2P= -0.459571619588291
##$FCOR= 0.5
##$FTSIZE= 0
##$FT_mod= 4
##$GAMMA= 1
##$GB= 0.15
##$INTBC= 1
##$INTSCL= 1
##$ISEN= 128
##$LB= 0.24
##$LEV0= 0
##$LPBIN= 0
##$MAXI= 10000
##$MC2= 0
##$MEAN= 0
##$ME_mod= 0
##$MI= 1.114404
##$NCOEF= 0
##$NC_proc= 0
##$NLEV= 6
##$NOISF1= 3.799351
##$NOISF2= 2.8
##$NSP= 1
##$NTH_PI= 0
##$NZP= 0
##$OFFSET= 15.70392
##$PC= 1
##$PHC0= -17751.2
##$PHC1= 16.00078
##$PH_mod= 1
##$PKNL= yes
##$PPARMOD= 0
##$PSCAL= 0
##$PSIGN= 0
##$REVERSE= no
##$SF= 200.130013532006
##$SI= 16384
##$SIGF1= 3
##$SIGF2= 2
##$SINO= 400
##$SIOLD= 16384
##$SREGLST= <1H.CDCl3>
##$SSB= 0
##$STSI= 0
##$STSR= 0
##$SW_p= 3612.71676300578
##$SYMM= 0
##$S_DEV= 0
##$TDeff= 0
##$TDoff= 0
##$TI= <>
##$TILT= no
##$TM1= 0
##$TM2= 0
##$TOPLEV= 0
##$USERP1= <user>
##$USERP2= <user>
##$USERP3= <user>
##$USERP4= <user>
##$USERP5= <user>
##$WDW= 1
##$XDIM= 8192
##$YMAX_p= 0
##$YMIN_p= 0
$$ End of Bruker specific parameters
$$ ---------------------------------
##NTUPLES= NMR FID
##VAR_NAME=  TIME,          FID/REAL,        FID/IMAG
##SYMBOL=    X,             R,               I
##VAR_TYPE=  INDEPENDENT,   DEPENDENT,       DEPENDENT
##VAR_FORM=  AFFN,          ASDF,            ASDF
##VAR_DIM=   8192,          8192,            8192
##UNITS=     SECONDS,       ARBITRARY UNITS, ARBITRARY UNITS
##FACTOR=    0.0002768,     1,               1
##FIRST=     0,             0,               0
##LAST=      2.2672688,     0,               0
##MIN=       0,             -225365,         0
##MAX=       2.2672688,     291230,          0
$$ Real data points
##PAGE= N=1
##DATA TABLE= (X++(R..R)), XYDATA
$$ [...]
1342a992K659K27k293K065j35j567J408M86k310K185K07l080L937j713k223M855
1358B716l922l6L992m779J763K475m276K138J837l920K094K043m644L070J634
1373B185n448M848j06m829N784k035l007M987k507j774L808j806k168M098j782
1388B48k909N661l616j894O312n912R51M595o458L460J700m859L856n6l024K856
1404I11j5k589K508J33k959L463j099k340M179k966l78L231l463J178J510k349
1420a045R08J146j656j04K581l151N65L558n693L473J926o413O302j497m285O605
1436C220l847j448M747l566m81L350k342j407M039k744j569N146m762N34M192
1451C062n724L050J436m119L303l88j724J375M73j451K15K181l393J903J627m632
$$ plain form
1342 -1992 667 894 -1399 666 531 -1036 372 858 -1452 733 940 -2140 1797 84 -2139 2716
1358 2716 -1206 -1242 2750 -2029 -266 2209 -2067 71 1908 -2012 82 2125 -2519 551 2185
1373 2185 -3263 1585 1479 -3350 2434 399 -2608 2379 -128 -1902 1906 100 -2068 2030 248
1388 248 -2661 3000 -616 -2510 3802 -2110 -1159 3436 -3022 438 2138 -2721 1135 1079 -1945 911
1404 911 896 -1693 815 948 -2011 1452 353 -1987 2192 -774 -1152 2079 -1384 -206 1304 -1045
1420 -1045 -137 1009 -647 -751 1830 -1321 -756 2802 -2891 582 2508 -3905 2397 900 -3385 3220
1436 3220 -627 -2075 2672 -894 -1375 1975 -367 -1774 2265 -479 -2048 3098 -1664 -1130 3062
1451 3062 -2662 388 1824 -2295 1008 620 -1104 271 744 -707 -492 1689 -1704 199 1826 -2806
1467b806M691j499k810N243m182N83K899l963K271N27k093J299Q04j868M00K603
1483B099m256K332K397o358O040j094n060P771m946j177N805n586J452K514l023
1498a090M69J801j088j978M027k400k074N733n217O54M297n734K881J403l414
1513a730J980P15j582k63K785l046R6M046n955L710J387n872O732l533j518N360
1529C312n998L413O75l908M572k644k56K087j909N42K55M57j818J937K45l554
1545b592N144l012j794N694n550J558K892m360K324N72j290m97K180r55l002O095
1561C407m588j372P355q317L107M266q053N726J35m431M102n72k047J108J992
1576A818l483J181L270n960M338N43n014O078l567m24L421m215L207j388n76K322
$$ plain form
1467 -2806 1885 386 -2424 2819 -1363 -780 2119 -1844 427 954 -1139 160 964 -904 -504 2099
1483 2099 -2157 175 2572 -3786 2254 1160 -3900 3871 -1075 -2252 3553 -2033 -581 1933 -1090
1498 -1090 -621 1180 92 -1886 2141 -259 -2333 3400 -1817 -1163 3134 -2600 281 1684 -1730
1513 -1730 250 965 -617 -880 1905 -1141 -1045 3001 -2954 756 2143 -3729 3003 -530 -2048 3312
1529 3312 -2686 727 1402 -2506 2066 -578 -834 1253 -656 -114 141 598 -1220 717 962 -2592
1545 -2592 2552 -460 -2254 3440 -2110 -552 2340 -2020 304 876 -414 -911 1269 314 -2688 3407
1561 3407 -1181 -2553 4802 -3515 -408 3858 -4195 1531 1666 -2765 1337 765 -1282 -174 1818
1576 1818 -1665 -484 2786 -3174 1164 1707 -3307 2771 -796 -1220 2201 -2014 1193 -195 -771 1551
1592A551l321K996j308r04K471k752K070j114L7J412k988L656k370p87M001m854
1608b204K505J303l616K834j99j369K26K064k284r26N229o348K183M749r010O868
1624B005K50o892Q147l701k216M845l135K0J028N63k114R72K466n026L971L05
1640A488m579N554k738j273L359k648P61K00L12q93L4K001l449K802j72k871M443
1657B331l640J048J889l906M261k771j11L235m913L841m29k998M022k306l16J565
1673H02o81p58N60J605l664L010P51m973N985k544k667N559m315O32K200k313
1689h11P44K4J039k440J799J468n003N380j573l719O441m611j41M031m407J764
1705a5J135j907N09J012p05j251K791k183l26K948l817K406K18k489L418k849
$$ plain form
1592 1551 -1770 1226 -82 -986 1485 -1267 803 -311 -274 1138 -1850 1806 -564 -1351 2650 -2204
1608 -2204 301 1604 -2012 822 623 -746 -520 1544 -740 -1666 3563 -2785 -602 4147 -4863 2005
1624 2005 2255 -4637 3510 -191 -2407 2438 -697 -677 351 914 -1200 -228 2238 -2788 1183 1488
1640 1488 -3091 2463 -275 -1548 1811 -837 -76 124 436 -457 -423 1578 -1871 931 759 -2112 2331
1657 2331 -1309 -261 1628 -2278 1983 -788 -899 2336 -2577 1264 835 -2163 1859 -447 -763 802
1673 802 121 -637 -77 1528 -2136 874 1625 -3348 2637 93 -2574 2985 -1330 -698 1502 -811
1689 -811 -67 -43 996 -1444 355 1823 -3180 2200 627 -3092 3349 -1262 -1403 2628 -1779 -15
1705 -15 1120 -787 -278 734 29 -1222 1569 -614 -940 2008 -1809 597 815 -1674 1744 -1105
1721a105J162R73k751L451k550K58K168l238K513p80p47J397j457J544j612Q96
1737A22Q49k729L330j822j044L156k936Q65J110j474L89N12J31j783K485q40k340
1754b019M522l625p2L883m975K725R55l334L060j012p30R24j61j25o86J841j872
1771g01K20K014l146K305p1k010K623j726L41N98r28J068j257J219n50o65J758
1788A092k129J548j60j387K332k276J199M85k046K688j971J66J699k386J543o3
1804C34q17P25k05J00o84J301j030l98K114k730J533P95k577K587j122n29J353
1821G50j263Q14o10O53l12q02K151k576J269J225l182L155j186j348K784k389
1837h67P72P89j329R34l58K17m19L90J99j017J436j133K37Q10j536J620j019j2
$$ plain form
1721 -1105 57 1030 -1721 1730 -820 -562 1606 -1632 881 101 -646 751 -706 838 -774 122
1737 122 971 -1758 1572 -250 -1294 1862 -1074 -209 901 -573 -184 328 459 -1324 1161 321 -2019
1754 -2019 2503 -1122 -1194 2689 -2286 439 1394 -1940 1120 108 -622 302 141 16 -670 1171 -701
1771 -701 -481 1533 -1613 692 621 -1389 1234 -492 -151 447 -481 587 -670 549 -1 -666 1092
1788 1092 -1037 511 351 -1036 1296 -980 219 704 -1342 1346 -625 -459 1240 -1146 397 334
1804 334 -483 242 37 137 -547 754 -276 -674 1440 -1290 243 1038 -1539 1048 -74 -603 750
1821 750 -513 301 -309 344 32 -770 1381 -1195 74 1299 -1883 1272 86 -1262 1522 -867
1837 -867 -95 694 -635 299 -59 158 -261 129 328 -689 747 -386 -149 661 -875 745 -274 -286
1855b86J072j721J674r49k07J338j887J651q16l35J440k080J896q07q40K227k512
1872a142J449L43j832K207j347K0Q42r41O31m62O18p07K05R09j920J929p29j025
1890i52K276k245J040N18j568J762j290N82J42r09J583j783J138K09j603K243
1906A143j762M47R94j801J696r56O7O46j101J289j149N96K62j121J642j574Q54
1923A72L38j584K267j934O51J073k379K563j475l47J907k413J728m11p86J471
1939H41j571J186m91l37J122j565J407o47m61J340j541J088l81k73P96j212J448
1956G49j213K81J092k253K453j308p10K479k948J875M0j732K492k154R96M56j647
1973a052K128j721O23O74j566J705j138K56M77q85J099j156Q99k22p84J663j860
$$ plain form
1855 -286 786 -935 739 -210 -417 921 -966 685 -131 -466 974 -1106 790 -17 -857 1370 -1142
1872 -1142 307 650 -1182 1025 -322 -302 540 -401 230 -232 386 -321 -116 793 -1127 802 73 -952
1890 -952 1324 -921 119 637 -931 831 -459 123 265 -644 939 -844 294 503 -1100 1143
1906 1143 -619 -172 822 -979 717 -239 -172 474 -627 662 -487 109 371 -750 892 -682 172
1923 172 510 -1074 1193 -741 -90 983 -1396 1167 -308 -655 1252 -1161 567 156 -630 841
1939 841 -730 456 -35 -372 750 -815 592 -55 -516 824 -717 371 -10 -283 513 -699 749
1956 749 -464 -183 909 -1344 1109 -199 -909 1570 -1378 497 537 -1195 1297 -857 139 595 -1052
1973 -1052 1076 -645 -22 652 -914 791 -347 -91 386 -499 600 -556 343 121 -663 1000 -860
1990h60J186Q0j391K148j961Q95N84j822K288j773M67J073k160K235j274k29J521
2007A007k006J595n98m38J112j314J162p85J93O31j484J880j389P3J374k169J932
2024G76q34n37J594j968J589o21o27J688k105J559k12j209J910j639P01K82q84
2041e37J098j064Q19l38l59J078j515J362n21o70J658j919J312j00j180J963j879
2058g92R19M68j587J960j485L93Q32j639J672r60q1R18j227J060o45J19M11q45
2076e09J101j049N39L06j147J567j289M20O58j503J768j286J24J202j979J775
2092F98o82p08J654j697R36J15r17J160q64L60P0l60N21n84N78m37R6M09r27J133
2112E54p87m4R80j493J300m72o21J450j617J026N2j118J664j414M79O65j448J502
$$ plain form
1990 -860 326 406 -985 1163 -798 97 681 -1141 1147 -626 -159 914 -1246 989 -285 -514 1007
2007 1007 -999 596 -2 -440 672 -642 520 -265 -72 559 -925 955 -434 -361 1013 -1156 776
2024 776 -58 -595 999 -969 620 -1 -628 1060 -1045 514 302 -907 1003 -636 65 347 -537
2041 -537 561 -503 316 -22 -381 697 -818 544 23 -647 1011 -908 404 304 -876 1087 -792
2058 -792 127 595 -992 968 -517 -124 708 -931 741 -219 -300 618 -609 451 -194 -75 336 -509
2076 -509 592 -457 82 388 -759 808 -481 -61 597 -906 862 -424 -300 902 -1077 698
2092 698 16 -692 962 -735 201 316 -601 559 -305 55 125 -235 286 -298 280 -157 -61 348 -579 554
2112 554 -233 -277 703 -790 510 38 -583 867 -750 276 328 -790 874 -540 -61 604 -844 658
2130F58p96k43J004j145P14p0m00N46m38K68j81J58l9k60N91o89M27Q3n73Q08
2150D23p31L65K00p40J025q69K66N26j148J233o34l25J071j229P52K2o52R12p95
2169c28L78J64o01P72o32K30L00o73O86l43j34L99l45J78j04J24r6o7L27n26M63
2190A72q6l84O57n87K36J47m18N93o25L93J49p38R91p12j0P79j088P29J2o62P98
2211C46m33mK13k22K12k36K48j40j26L72m13K31P0k50J79n6J18k85K96M8o05R01
2233D64n96k36J026j183N75M03j084J037l93l34O95o10L21k1k01L24l78K87m1
2252E5j88K65j94O1oQ5j53L5K54n15M91r2m38P36o37J97L21o47O95m63M4M24p78
2275d48Q08m17k71R01j040N02L61r19Q00j52m62N42j37k60K49J53n28M30J35p30
$$ plain form
2130 658 -138 -381 623 -522 192 122 -278 268 -170 98 -83 75 36 -224 367 -322 105 188 -385 423
2150 423 -308 57 257 -483 542 -327 -61 465 -683 550 -84 -409 662 -567 185 207 -445 467 -328
2169 -328 50 214 -387 385 -247 -17 283 -390 296 -47 -181 218 -127 51 -53 71 -25 -92 235 -291 172
2190 172 86 -298 359 -228 8 155 -263 330 -295 98 247 -491 500 -212 -222 557 -531 198 210 -452 346
2211 346 -87 -91 122 -100 112 -124 124 -16 -142 230 -183 48 118 -132 47 -9 109 -176 120 168 -437 464
2233 464 -132 -368 658 -525 50 453 -631 406 13 -321 374 -236 85 64 -137 187 -191 96 55
2252 55 -133 132 -62 -1 -7 78 -75 -40 214 -301 190 98 -340 396 -241 -44 277 -370 325 -138 -94 330 -448
2275 -448 360 -57 -328 573 -467 35 396 -523 277 125 -337 205 68 -192 57 210 -318 112 247 -483
2295d83Q22l02l96P41n46J02J85j99J28j84L64m31J53M12q86Q34j97n89J015q16
2315b73J74M49p09N93k49j22K97k65K17k40K20p1j64L97m90L45k8l72O61o11K27
2336a4K84o25N97k76j08L27l10J78j16K09k53qN26q96P02O6r19J218p18k15R39
2357E88r47L41K82m27J05J55N0n22O97k58n66J174j043J71Q58j317R00J8p10P66
2377C15l78KO7N8o1k24O23p37L34L98r99J029m09l98Q82q52M16R6m09M66l49K36
2399A06j91J16J09m91Q24p91K26O60j350J316m40p98J580j361L21P71j170P49
2417A86k9l27J53J54q4m49R45q02q5J135j524Q80L30j221J224n10k50N01k81J29
2437G5l39O74o47l2J052j627J173J58j466J862j103k37J246j387P53Q0n89N52
$$ plain form
2295 -483 339 37 -359 382 -164 -62 123 -76 52 -132 232 -199 -46 366 -520 314 117 -472 543 -273
2315 -273 -99 350 -359 234 -15 -137 160 -105 112 -128 92 21 -143 254 -236 109 81 -291 370 -241 -14
2336 -14 270 -355 242 -34 -142 185 -125 53 -63 146 -107 -115 411 -485 217 283 -636 582 -136 -351 588
2357 588 -359 -18 264 -163 -58 97 147 -375 322 64 -502 672 -371 -200 658 -659 241 259 -451 315
2377 315 -63 -61 6 64 3 -221 402 -335 -1 397 -602 427 18 -380 502 -350 66 162 -247 219 -130 106
2399 106 -85 31 140 -351 473 -318 -92 568 -782 534 94 -704 876 -485 -164 607 -563 186
2417 186 157 -170 -17 137 53 -396 549 -253 -338 797 -727 153 483 -738 486 -24 -274 227 -54 75
2437 75 -264 410 -237 -269 783 -844 329 487 -979 883 -220 -457 789 -598 155 235 -354 198
2455A98k40O4j85L97l38j22P89j208R65j3j169J796j351N1J246j708J140o7p34
2474d89R07o14L26k98K82J06q84J487j209m6J493k010J178L86j493J399m04n56
2492d39O32M5n56K06Q08j503J008M99j929K170r58q75K105k022Q16O37j454J386
2510E76p51K4M79p15P40o03L64j4m24Q50j024P47k5q63J385j196L40O88j231J006
2530C53l00k50L12j06J85p38J212q62m92K028k435J107J192k812K494m91j631
2547a234K290j223l83J095n26m34N99K85j331J370j19j502K194j375l43J677j773
2564g33Q64J73o76O88o13O46o09J96O14j370J491p45n03J508j710J055P3j114
2582g65J587j281L46P27j286J015k08m81M81O4m02k3R75j518Q00R96k527K390
$$ plain form
2455 198 -42 22 -163 234 -104 -226 563 -645 320 307 -862 934 -417 -366 880 -828 312 245 -489
2474 -489 418 -196 130 -168 114 220 -664 823 -386 -432 1061 -949 229 615 -878 521 117 -439
2492 -439 193 238 -318 -112 696 -807 201 700 -1229 941 -17 -892 1213 -809 7 644 -810 576
2510 576 -175 -151 328 -387 353 -250 114 100 -324 526 -498 249 224 -639 746 -450 -110 578 -653 353
2530 353 53 -197 115 9 194 -544 668 -194 -686 1342 -1093 14 1206 -1606 888 397 -1234
2547 -1234 1056 -167 -550 545 19 -415 184 469 -862 508 389 -1113 1081 -294 -637 1040 -733
2564 -733 131 304 -372 316 -297 349 -260 -64 550 -820 671 -74 -577 931 -779 276 349 -765
2582 -765 822 -459 -113 614 -672 343 135 -346 135 199 -203 -226 749 -769 31 1027 -1500 890
2600H90m18j992L007j892l59J953j840N50N33n33j62M02L45j426J599k96j606
2617a245K519j594m67J996j905N15Q21j022K28N03l08o36J308q25o23J891j934
2634g78O62J023k030J825o96o20J480j588R84J7r21J285r52J88M58n57K45n7L56
2653C24q01O96K45j476J918r62q34K092j845L58J099j376N21L78l44n11J016k51
2671B47j375K333j453q23K745k706O61J778k677J482N59j644J033L61r82K48J003
2688G90j418M52J163k044J431J93j609J846r57k40R66j041P47l81%M34p70Q34
2706C96n73Q2M07p53Q75p29K87M44j176J392p65m58J460j456M17P56j067M01M68
2725D08n77k67J194j064l56J971k242O92J612k821J908L69k137K067m97j020J228
$$ plain form
2600 890 472 -1520 1487 -405 -764 1189 -651 -101 432 -101 -263 139 484 -942 657 361 -1245
2617 -1245 1274 -320 -787 1209 -696 -181 640 -382 -154 349 41 -595 713 -112 -735 1156 -778
2634 -778 -116 907 -1123 702 6 -614 866 -722 262 279 -642 643 -309 -121 337 -220 25 -32 324
2653 324 -477 219 464 -1012 906 -56 -890 1202 -643 -285 814 -562 -41 337 -7 -518 498 247
2671 247 -1128 1205 -248 -1071 1674 -1032 -371 1407 -1270 212 771 -873 160 521 -461 -213 790
2688 790 -628 -176 987 -1057 374 567 -1042 804 -153 -393 573 -468 279 -102 -102 332 -438 396
2706 396 -177 -95 312 -441 434 -295 -8 436 -740 652 -113 -571 889 -567 -150 606 -461 -60 408
2725 408 -169 -436 758 -306 -662 1309 -933 -241 1371 -1450 458 827 -1310 757 260 -760 468
2742D68k46p00N52N17j346R11N81j830J712k67j342J847j009l12J028p86Q6K87
2760A51k4m16M13J79r25J153n81m51J278j381P14L48j206J394q24j83J026j179
2778e14N87K50o89M56J34l95rP09r50K38J021j738J144M18j758J811n41r55J487
2797G06p91l40P57j70o24O18L38j373J363o6j538K094j063p61J944j594J55J096
2815G51j213L30N57o01j14P67o33k55J142j223L57Q27j469J151j37q27J156p98
2833b32J00M45n76L77j24J9q9J52K2m35P97p23O0Q58j362R86J10j165J409o63
2853c4m67J039o75j46N81j99n62Q02j13r74J494q10o68J780j601K21J233j636
2871g35Q07M07r62N57K19n13M1O60p94P8R56j397P60N00j408J302l56o81J073
$$ plain form
2742 468 222 -478 74 591 -755 156 737 -1093 619 352 -990 857 -152 -464 564 -222 -136 151
2760 151 127 -289 124 303 -622 531 -50 -501 777 -604 110 458 -748 646 -178 -361 665 -514
2778 -514 73 323 -366 90 224 -171 -180 529 -421 -183 838 -900 244 662 -1096 715 174 -781 706
2797 706 -85 -425 332 162 -462 156 494 -879 484 418 -1120 974 -89 -850 1094 -500 -345 751
2815 751 -462 -132 425 -176 -290 477 -156 -411 731 -492 -135 692 -777 374 237 -590 566 -232
2833 -232 -132 313 -263 114 -10 9 -80 72 94 -341 456 -267 -207 651 -711 275 385 -780 629 -34
2853 -34 -501 538 -137 -283 298 99 -463 339 226 -748 746 -64 -732 1048 -553 -332 901 -735
2871 -735 72 479 -483 74 293 -220 -179 481 -313 -235 721 -676 84 584 -824 478 122 -559 514
2890E14o72k3M26l05o0J99P5n10O36k21m91J032r77K72O77j255J077k36p14J129
2910E73p92L9N27n43J58J58o8l31N24j38o35J142q19k22J225j363N08O31j186
2929f12Q01R1o63M55J99n35J23O84j044M80O58j463J219o7j127J493q30k72R69
2948E59q69K70K30k84K9J08J02m48N54k28l73Q36q07K69M46q81P71k36l38O04
2968C14m58R6J38r2r8J23J67n87P23k79n69J221j094J67R67j488R84J59j082J110
2988D22l46m53O46j87l20K94K46p17N63K01r82J077l73n96J066p46J0M91m53J12
3008d5N5J26l75L20J77p87R71m62m42J117j082L75N03r91Q71k90l42O68n58J56
3028c5J97k66O0J45j14j74M89n05N3O26j007P16J35r54J131n57l03Q14o91K08
$$ plain form
2890 514 -158 -181 245 -60 -120 79 154 -356 280 59 -432 600 -377 -105 572 -683 394 158 -556 573
2910 573 -219 -180 347 -196 -38 120 52 -279 245 107 -528 614 -205 -427 798 -565 -57 574 -612
2929 -612 189 280 -383 72 271 -264 -141 543 -501 -21 637 -826 393 326 -801 692 -138 -410 559
2948 559 -310 -40 190 -94 -65 43 145 -303 251 23 -350 486 -321 -52 394 -487 284 48 -290 314
2968 314 -144 -48 90 -2 -100 23 190 -397 326 47 -522 699 -395 -228 739 -749 235 394 -688 422
2988 422 76 -377 269 82 -238 56 302 -415 148 349 -633 444 71 -525 541 -205 -195 296 -157 -45
3008 -45 10 136 -239 81 258 -529 442 -20 -462 655 -427 -52 451 -540 331 41 -301 367 -191 -35
3028 -35 162 -104 -44 101 -13 -187 302 -203 -150 476 -531 185 320 -634 497 -60 -363 451 -240 -32
3048c2J46j38kq2M44p11M34L59j090J105k89p48J200p53j62P67o38RM53k90k74
3069b92O40l75l64R32q23J01O99j028P11l2n44P40n61K07J29l91N29m80K05J76
3089A79m49M75k93P2R5k38L71m31K94O0m64O39l94r2M46m26J14J11k0k23K27K04
3111B57p37Q19k09p08J233r10q0R86j133M83L71p33M47N9k53jL07k53j94O51o51
3132b49J31N14q00N12L8l94L93k13J02j18J02J24m44N83l55j49O07o98L84Q5m16
3153b61N18m15K14O0l58N25m37Q8L08m66L05k9j16M6P5kk89N34m13j42P30q64
3175c89L92L80q65P13j41l60M61k41K7l0J76j67j48N46o24K26L87p49N78o0l72
3196b60M54k21j0K1R5j10j34M73n40J97L50p07O23j79l09N49m86K39L7k46L70
$$ plain form
3048 -32 114 -24 -26 -108 336 -375 59 418 -672 433 144 -604 596 -157 -319 448 -190 -181 272 -18 -292
3069 -292 348 -27 -391 541 -282 -181 518 -510 201 169 -375 365 -196 11 140 -251 278 -202 3 179
3089 179 -270 205 -88 -16 79 -159 212 -219 75 135 -329 310 -84 -176 270 -156 -42 69 49 -174 53 257
3111 257 -480 339 130 -578 655 -255 -335 651 -482 1 372 -361 86 145 -108 -109 198 -55 -249 402 -249
3132 -249 -118 396 -404 108 146 -248 145 -68 34 -84 18 142 -302 281 -74 -223 384 -314 70 155 -261
3153 -261 257 -158 56 116 -242 283 -154 -66 242 -224 81 52 -64 -18 57 55 -234 300 -113 -255 475 -389
3175 -389 3 383 -482 231 90 -270 191 -50 -23 -53 123 -44 -192 354 -270 -44 343 -406 172 112 -260
3196 -260 194 -27 -37 -16 79 -31 -165 308 -232 -35 315 -392 231 52 -257 292 -194 45 82 -164 206
3217B06l95K59J0k98M30l19O5J34j72J35j37K04k07J7K97n23M52p5l58N76m30
3238a29P1K14l10K71k25K01q4j83M67n46L01J69n84O47l07j88M85m19J53O4j12
3259d4M7p4K23l15K25O3l79M96l18l9L40m19K84q0p2J82k88L29k47K3K64m45M13
3282A69j61j57L69m05K53l0j57L05l59K73o9j92L74l76K01L4k32L12k64J50Qj63
3304a17K73l12K42m1k18L81l61J74R9k95L43k55R2P8k30L22l15J86O9l41M61l45
3326a10N3K59m22L51j32r9K32k46K04j53N4R9k48L25k47N9J72l42L31k00NK11
3348A56l43L32k20J1K41m12M12k05j25M07m81L18pk81M09l31J23P9k10K54k25
3369i8J54l6j15K44k85K00m0j22K45l01K42o7j39L04l70K74l5k45M31m08J97Q4
$$ plain form
3217 206 -189 70 80 -218 212 -107 -42 92 -80 55 -82 122 -85 -68 229 -294 158 83 -275 301 -129
3238 -129 -58 156 -154 117 -108 93 9 -174 293 -253 48 217 -367 280 -27 -215 270 -149 4 68 -44
3259 -44 3 -71 152 -163 62 125 -254 242 -76 -115 225 -194 90 10 -62 120 -168 161 -86 -63 201 -244 169
3282 169 8 -149 220 -185 68 38 -119 186 -173 100 31 -161 213 -163 38 72 -160 152 -112 38 46 -117
3304 -117 156 -156 86 45 -173 208 -153 21 120 -175 168 -87 5 83 -147 175 -140 46 115 -226 235 -110
3326 -110 -57 202 -220 131 -1 -100 132 -114 90 -63 -9 90 -158 167 -80 -21 151 -191 140 -60 -55 156
3348 156 -187 145 -75 -64 177 -235 177 -28 -153 254 -227 91 84 -197 212 -119 4 83 -127 127 -98
3369 -98 56 20 -95 149 -136 64 24 -98 147 -154 88 21 -118 186 -184 90 55 -190 241 -167 30 114
3391A14l38M53l66J13J81l83M26k74mK52l66L35j60o0K20k68K28j37L6Q8k28L04
3413A66k59J04J10l18M14l07J8K74m10L45j71m4K32l56L63k17l6K98m55M07j31
3434B7k00L99m05K19K6j95K69k60J86m3j08K33l07K79j30j07L14l90L16p9k18
3455a74M18m48K77K7l11M37l75J81Q4l16M05l30J01J58l24L59k41N6J28k58K77
3476A31k13Q9O4k02K81k83J81J3k19L78l99K31O8l91N52m28P7L12n35N10k28j36
3498a47L88m49L15p9j51K97l21K46j01p9K11k65K32j29j1J71k90K97k07L2J97
3519A57l93M44k81m3L67n32M45j28k48M98n07K91M1l26M37l51J28J06k60L11k50
3540i4J26K7j51K34k60K08q6r8K81l92L40j07k19M64m91K74Q8m01N26m19J15K39
$$ plain form
3391 114 -224 229 -137 -24 157 -226 200 -74 -78 174 -192 143 -17 -77 143 -125 103 -34 2 90 -138 166
3413 166 -93 11 121 -197 217 -90 -72 202 -208 137 -34 -78 154 -202 161 -56 -92 206 -249 158 27
3434 27 -173 226 -179 40 66 -129 140 -120 66 23 -85 148 -159 120 -10 -117 197 -193 123 44 -174
3455 -174 244 -204 73 100 -211 226 -149 32 116 -200 205 -125 -24 134 -190 169 -72 -16 112 -146 131
3476 131 -82 7 71 -131 150 -133 48 61 -158 220 -179 52 120 -271 281 -147 -70 242 -293 217 -11 -147
3498 -147 241 -208 107 28 -123 174 -147 99 -2 -81 130 -135 97 -32 -43 128 -162 135 -72 -40 157
3519 157 -236 208 -73 -116 251 -281 164 36 -212 286 -221 70 111 -215 222 -129 -1 105 -155 156 -94
3540 -94 32 59 -92 142 -118 90 4 -94 187 -205 135 28 -191 273 -218 56 144 -257 269 -150 -35 204
3562B04m54M59k65l8K98m13L20r9q9J94k12J93j54Q3J4j61L06l39K09M1l29M84
3584B52l98J26K15m72N18l33%L45n53N05k00k03M87n26L01O0l34L87k28K9Q5j07
3606d4Q2j12J81k02R3J27l22L86k56k5L13m68M10j82j46M50n39L75k5l24N18m64
3628a74J64J70l90M17k50J0J61k59K59j81N8P1j68K11j72J14k9p9K10l24L19j63
3650b5j62N02n93L35J42n42O28l41j13M39m64K64j5j38J77j90K10j83N3J54l08
3671a70L03j32p8J93k07J55j06N5L3j78L22l46J64J61m47M99k80r7M24n14L53
3692A07m2k60M34l99J91Q6k88L28j98qJ39j36Q2p3J18j67R9J20l64M12j73k01
3714a93M48m03J37J43k70K11j26J16r8l0K57m31L61k3l91N79l80n7M08m36J91
$$ plain form
3562 204 -250 209 -56 -94 204 -209 111 12 -77 117 -95 98 -56 27 41 -120 186 -153 56 97 -232 252
3584 252 -146 -20 195 -277 241 -92 -92 253 -300 205 5 -198 289 -237 64 124 -210 177 -51 -22 63 -44
3606 -44 38 -74 107 -95 -2 125 -197 189 -67 -92 221 -247 163 -19 -165 285 -254 121 96 -228 290 -174
3628 -174 -10 160 -230 187 -63 -53 108 -151 108 -73 -15 56 -112 99 -73 41 12 -67 143 -181 138 -25
3650 -25 -187 315 -278 57 199 -343 285 -56 -169 270 -194 70 55 -83 94 -96 114 -69 -16 138 -170
3671 -170 133 1 -77 116 -91 64 -42 13 46 -132 190 -156 8 169 -278 221 -59 -156 268 -246 107
3692 107 65 -195 239 -160 31 117 -171 157 -41 -49 90 -46 36 -37 81 -86 13 133 -231 181 8 -193
3714 -193 255 -148 -11 132 -138 73 -53 63 -35 -65 192 -239 122 99 -292 287 -93 -150 258 -178 13
3735A3R3k13J18J7Pj33K13j20j26L50l74J66J35l45L62k00m2K20k88K65j49l5
3757f6K10k93K37p7q3J82k18K02j39J6J58l08L14j32j49L52l24R2J40j99P9M1
3779C5lj52K20n1k77M99l72q4N31n92K43K54n25L77k2k21K03j3j05rK07k33K2
3802f8K85m27K48J04l71L79j58r9K15j78Q6l2M4m4m2J83k59J81K7k31L16k40N9
3825b2J64l30L30j50j18L13l06J15J24k26J27L7q9m1K05j87o9L69m25J30L21n61
3847b89L85N1m27M39j18j96K48l9j60J18J30l17K13J40m54M41o8l76N24k85j12
3868a52L42k72K0J57j02p0J48j9k01L10j95j05L53l74J71J32l49L37j48r0K46
3889A39k40J26L2j34J21l7rm9J14r1o3K76l33J30K08m32L66j5l44M09j40k01K93
$$ plain form
3735 13 106 -107 11 28 35 -98 115 -5 -131 219 -155 11 146 -199 163 -37 -79 141 -147 118 -31 -66
3757 -66 144 -149 88 11 -72 110 -108 94 -45 -29 129 -179 135 3 -146 206 -118 -26 114 -85 -6 35
3779 35 32 -120 100 49 -228 271 -101 -185 346 -246 -3 251 -274 103 81 -140 63 50 -55 -64 143 -90 -68
3802 -68 217 -210 38 142 -229 150 -8 -107 108 -70 16 -16 28 -16 -58 125 -134 47 74 -157 159 -81 -22
3825 -22 142 -188 142 -8 -126 187 -119 -4 120 -106 21 58 -31 -72 133 -54 -123 246 -179 -49 272 -289
3847 -289 96 147 -280 159 41 -155 93 54 -106 12 142 -175 38 178 -276 165 97 -279 245 -40 -152
3868 -152 190 -82 -62 95 -7 -77 71 52 -149 161 -34 -139 214 -160 11 143 -206 131 -17 -107 139
3889 139 -101 25 57 -77 44 7 -2 -51 63 -28 -91 185 -148 -18 190 -242 124 109 -235 174 34 -167 126
3912A26p8k09K46L2l61M11p8m05O14l53j75N59n22J07L21m26J98Q2j74M9J23r8
3934a1j09L03k52n0L42m03J80J67l74L05n0j81K23q9o1R3Jj08J26mj85K95k20
3957f2m1L49m70K85J21m82N14j92k45M61l25k8K70k21k3K00r3j87L26j56k15M79
3979B65l69l6M25m76J68K01l40J61J26k10LK52k52m0M08m99J72L27o20M71J1m57
4001c09N34k38j44L41k45K0J45j22m9J47r7p9K43k50N6K10l67L16o0k36L83k76
4023g7PK18k47J09M1l9p1J03O4l13L91j61k76N78m80J6M75n95K56K39m93L16J26
4046A87l85K24J74m26K78J65n25M65k7m44N78k89j62M11l33P3J13j26N0j6R3j86
4068a08J39O7l03L70j85j28L79l69J46J34l23K83n7j60K26r0j24K09p2k03L46
$$ plain form
3912 126 48 -161 85 117 -244 167 89 -316 298 -55 -230 329 -193 -86 235 -191 7 89 -85 -36 87 -11
3934 -11 -120 183 -69 -119 223 -180 0 167 -207 98 48 -133 90 1 -60 33 34 -74 52 48 -137 158 -62
3957 -62 -103 246 -224 61 182 -300 214 22 -223 238 -87 -115 155 -66 -89 111 18 -169 157 1 -214 265
3979 265 -104 -140 285 -191 -23 178 -162 -1 125 -85 -82 170 -82 -122 286 -213 -41 286 -334 137 148 -309
4001 -309 225 -13 -157 184 -61 -41 104 -18 -67 80 -17 -96 147 -103 -47 163 -204 112 52 -184 199 -77
4023 -77 -70 148 -99 10 51 12 -59 44 108 -205 186 25 -251 327 -153 -137 338 -257 -1 238 -255 61 187
4046 187 -198 26 200 -226 52 217 -308 157 130 -314 264 -25 -187 224 -109 -36 77 -49 1 -15 78 -108
4068 -108 31 98 -205 165 -20 -148 231 -138 8 142 -181 102 45 -115 111 21 -103 106 34 -169 177
4089A77k13j50N03n11R8M26o76M45J01n39N52j80k40L80j91q8J60K1j89J27J40
4110A53l75L16L9m00M43j12k78L97j61j90L11q2k69L87j24k98N18l35j35N35n77
4131b37K26K63n64M78j15k53M20l27N4J94k74J67J8j25Q1L9j06M1J25k20J46Q0
4153A11k88K83o3j71K34r3r3R7P5k00R5K08m37L45Q9n55O40k24l91P04m82q4N35
4176C35n10Q7L34m03R6K52l02K9K85l55J07K38l86K36Q6l02K58p6p7J14n3K5n5
4199c7Q2p8nJ46k20J55J1j72K74k25L6J83l20K48j1k18K83j29j10K18r3j23K07
4222A02n3k38L68j74k29M99l78n8M45m83J52K65m06J85J56k79R2J99k74N1K91
4243B33m11J60K41m69L17O9l56L52j02j60K07p4n3O7M2j30P2J03k40J99k4j68
$$ plain form
4089 177 -36 -186 317 -194 -96 330 -346 99 200 -339 213 33 -207 173 -18 -106 54 75 -114 13 153
4110 153 -222 94 133 -267 176 64 -214 183 22 -168 143 61 -208 179 55 -243 275 -60 -195 340 -237
4131 -237 -11 252 -312 166 51 -202 218 -109 -55 139 -135 32 50 -75 6 45 -61 -20 105 -115 31 111
4153 111 -177 106 43 -128 106 13 -80 17 92 -108 -13 195 -242 103 192 -363 277 53 -338 366 -116 -200 335
4176 335 -175 -88 246 -157 -61 191 -111 -82 203 -152 -45 193 -193 43 129 -173 85 9 -68 46 -7 18 -37
4199 -37 45 -33 -38 108 -112 43 54 -118 156 -69 -33 150 -170 78 67 -151 132 3 -107 111 18 -105 102
4222 102 49 -189 179 5 -224 275 -103 -161 284 -199 -47 218 -188 -3 153 -126 -34 165 -109 -58 233
4243 233 -178 -18 223 -246 71 140 -216 136 34 -126 81 7 -46 21 63 -67 5 108 -132 67 43 -125
4265a25K61j91K1J32k05J58k6r3J49j01j6O6pq2J16j4j78K90j94j16M10m10R6
4288e9L10m95L00J06l86L43k7k34K06J9j93J31J25l13K09R1l54L35m0k63L19j20
4310A0j12J83m7j25J17O5k46K30J6k95L78j89j46L83l63J18J63k83K25o7q1J42
4332G6j26N9J4k9OjL5r5J47j16k7K07k81J58R1k90K79q5j32K07j02l9O2M6j51
4357h7R2J23l17K74J8l43M38j96j81L94l05L2J85j80K3R0m0j27J99o1j89L43k52
4380f7m0K88l28J61P4k00J73p1j2K2LK3j04J62j34K2J16k02J98j01n9K14k58J61
4404D1J8j93K70j70k3J47j37M6J9J5q4P3N7k21K65j00j66L33k91N1J99k72J50
4427B7K0p1jM6J7j57K28j24j25L35l26R9K00l52K52j6j66J85p4k0RN2m7l8J36
$$ plain form
4265 -125 136 -55 -34 98 -107 51 25 -68 81 -20 -36 30 23 -59 57 43 -135 155 -39 -155 255 -155 -59
4288 -59 251 -244 56 162 -224 119 92 -142 64 83 -110 21 146 -167 42 133 -221 114 74 -189 130 10
4310 10 -102 81 34 -91 26 91 -155 75 91 -204 174 -15 -161 222 -141 -23 140 -143 82 15 -66 76
4332 76 -50 9 23 -6 0 -1 34 -61 86 -30 -57 150 -131 27 118 -172 107 22 -110 97 -5 -44 18 64 -87
4357 -87 5 128 -189 85 103 -240 198 2 -179 215 -90 -58 127 -53 -30 60 20 -107 92 31 -158 185 -67
4380 -67 -107 181 -147 14 88 -112 61 -10 -22 0 3 26 -78 84 -50 -28 88 -114 84 -17 -76 138 -120 41
4404 41 59 -134 136 -34 -57 90 -47 -1 18 33 -51 22 79 -142 123 23 -143 190 -101 -50 149 -123 27
4427 27 47 -24 -25 21 38 -119 109 -15 -140 195 -131 -32 168 -184 68 52 -114 71 -3 -23 -14 38 -9 -47 89
4452H9j75J09L5j60J94j57O1Q0j86K27j61J7J31k17J77n3o9J42j55J41j10MJ26
4475I0k34K52j22r8K57k57R0J22j83J00Nm3j5J07q3q0K45k57O7K01l56K89m7j91
4499a41K75k00N8N3r4J08j36J38m6j05K21k35J09P6j97J95r6j2Q1r3O8o0N0j1
4523Fn2J14j41J22o0k9J37k29K19p8j34L00k94J14J40l09K94j24q7J99j64O7q
4546ClJ7q2J50j34L5Q8j77J65m4n8Q7p0M2p3J16p0o8K29k84J43J01k98L21j48
4571a2q3K42k58J43Kj11J67j55Q6Pr5J38j14L4L8n6M1l9O8q0M0M0j44J98j33j9
4597e5J60k02J50m8o3J48j99J77o1j04K25k60J51Q4k49K48j12p1J74j41L8K5k0
4620ej3K2M6j27J37o1p1J62j51O5K8q9J32j34R0Kj34K18j98O3J20k40K13o6j02
$$ plain form
4452 89 -86 23 58 -102 92 -65 -4 76 -110 117 -44 -27 104 -113 64 11 -58 84 -71 70 -40 -36 90
4475 90 -144 108 -14 -112 145 -112 -22 100 -83 17 22 -21 -36 71 -12 -92 153 -104 -37 164 -192 97 50 -141
4499 -141 134 -66 -8 45 -49 59 -77 61 15 -90 131 -104 5 81 -116 79 -17 -29 52 -41 27 -33 17 6
4523 6 -46 68 -73 49 -11 -40 97 -132 87 9 -125 175 -119 -5 135 -174 120 -4 -91 108 -56 11 3
4546 3 0 17 -65 85 -49 -14 74 -103 62 18 -40 47 -23 19 -54 62 -8 -76 153 -131 12 113 -185 136 -12
4571 -12 -95 147 -111 32 34 -77 90 -65 21 28 -67 71 -43 -9 29 -27 14 -25 43 -37 3 43 -101 97 -36 -55
4597 -55 105 -97 53 5 -58 90 -109 68 7 -97 128 -132 19 103 -146 102 -10 -81 93 -48 -10 15 -5
4620 -5 -18 4 50 -77 60 -1 -72 90 -61 4 32 -57 75 -59 31 33 -101 117 -81 -18 102 -138 75 9 -93
4645i3J80j53N4L3n4M2l5M9m9K4K4o1P9p5M4J1p2J22j40P8O5j90K22j18n8J97
4671A26k25J16M2j48J61r6JM7p1R2o6K7J9p3Q2m9J9noOl4Q0j01M5P6j71J70o1
4699Cr7K03j76M9Q6j64J46m3m3P5q5P3m2nO5q5O9j6m0N5m6J9qJ2kj5M8q7P1Qr3
4730f5J29q6kQ1j31J17m5m6J11j23O9J9q7J03o4PM0p0N1kj0jQRl2N5m6j0N9p2
4760c4N6mn9Q3p9M6J1o3Q6o6J6M3j00J12n2l5Q2r7N2K7q4Q9m4pL8l3J8jOk7K4
4791DJ6n5P2l5j9P2r0M4Pn8P7m7K1Mm0O7q2N8Lq5J09p0J1N7r1Q0l3k4M4l8K9j0
4823bnK2m4N0k9j0M7o5N6pj7K7m3M9l4j3O6q5N0Jm8P4n1J7Kl8N8p2P5k8m7J20
4855G6j31N3L6j02J04m9j1L2l9M2l5M1j6l2Q2q9L6L7q1P9l0j7L9m1N3n3K2J9o7
$$ plain form
4645 -93 87 -66 -12 21 -33 9 -26 23 -26 -2 22 -39 40 -35 9 20 -52 70 -70 8 73 -117 105 -13 -71 126
4671 126 -99 17 59 -89 72 -24 -23 24 -47 45 -21 6 25 -48 34 -15 4 -1 -7 -1 -35 45 -56 -11 65 -106 64 3
4699 3 -94 109 -67 -18 68 -96 50 7 -36 39 -46 27 -15 -20 45 -40 29 13 -27 28 -18 1 -7 5 3 -12 36 -51 20 28 -65
4730 -65 64 -22 -24 57 -74 43 -2 -48 63 -60 9 28 -59 44 -20 -13 27 -43 8 6 -4 -5 3 12 -20 35 -11 -21 38 -34
4760 -34 22 18 -41 42 -37 9 20 -43 43 -23 -7 36 -64 48 -4 -39 43 -54 -2 25 -59 30 -14 -21 17 -16 2 1 7 -20 4
4791 4 20 -35 37 2 -17 55 -35 9 16 -42 35 -12 9 13 -27 40 -42 16 19 -66 43 -27 -16 41 -50 30 -3 -27 17 -21 8 -2
4823 -2 -7 15 -29 21 -8 -18 29 -36 20 13 -4 23 -20 29 -5 -18 48 -37 13 14 -34 40 -11 6 8 -30 28 -44 31 3 -44 76
4855 76 -55 -2 34 -68 36 -13 -24 8 -31 11 -24 17 1 -31 51 -38 -2 35 -46 33 3 -14 25 -16 37 -16 6 25 -42
4884d2J13j07K2P3j27J06m3k8P1p6N1qk4L6n1N4k9j7N8n6L3j4MOm2P3q0N3L5j12
4914f8J35q7l1J36j44O0L7q6R7p1M4j0m6Q5q5L6K7p1P3l2j8K7j7Oj5N2p5K4P5
4943E8j28J13m0n9J27j21N8K1p6R1q5N8Np5J23j02J7P3j18Q7j0n4O1k5qj5N3m3
4971a4j2P7j20R1Or9J41r2%M6o7Q2q1K6N1r2J09p0j4R1j14Q0j5l6M4l8L2l7L1
5000FRn8R5p0RN2q7P6n3K9K4q5J10j07L0Q6j55J31j9r5J32q0kN0l2nJL6p7N7L7
5031D5j31J38o2l4J04r6M3J1m2L2l2O8n7J1N1j15J13m1l5R6j03L8J7n0O3m8K9
5058A3j7k0N5o7N2j9j3M6p7Q5m5k6J00j52J12J0j32J73j01k1J05j06L4L5k8j1
5084a5L1J2p8J00l5p6J39j18K5P9j14P0k1Mj5J4M0j09J15l8r2J81j64L2J19j83
$$ plain form
4884 -42 71 -36 -14 59 -68 38 -5 -33 38 -38 13 5 -19 17 -34 20 -9 -26 32 -24 9 -5 -1 5 -37 36 -44 9 44 -68
4914 -68 67 -20 -51 85 -59 1 38 -48 49 -22 22 12 -34 51 -34 2 29 -42 31 -1 -19 8 -9 -3 -18 34 -41 -17 58
4943 58 -70 43 3 -56 71 -50 8 29 -47 44 -41 17 22 -53 70 -32 -15 58 -60 27 17 -37 24 -1 -9 -24 29 -14
4971 -14 -26 51 -69 22 28 -71 70 -22 -22 24 -43 39 -42 -16 35 -57 52 -18 -32 59 -55 25 10 -26 18 -20 12 -25 6
5000 6 15 -43 52 -18 -9 43 -44 32 -21 8 32 -53 57 -50 -20 66 -89 42 23 -72 60 -20 -22 28 -4 -9 -8 28 -49 8 45
5031 45 -86 52 -10 -44 60 -36 7 18 -24 8 -24 44 -13 -2 49 -66 47 6 -29 67 -36 2 19 -31 32 -16 13
5058 13 -4 -24 31 -36 16 -3 -16 30 -47 38 -7 -33 67 -85 27 37 -95 78 -23 -44 61 -45 -11 24 -4 -15
5084 -15 16 28 -50 50 15 -61 78 -40 -15 64 -50 20 -1 3 -12 2 42 -67 48 10 -82 99 -65 -33 86 -97
5110i7J36j6j03J42q7MN5o1K1LMj9L3j8k6O7q7O6J3r0J29p8l1J06j11N9Mm3N0
5139B5m0M1o9L5N4j44J51m2r5J80j48LJ27j48O1N5j05N9N6r6J9R0j24N1Q0j66
5165i0J14J3j20J47p3m1R2n5NK0j7Oj3M2p0N4J2q1J10p5j4R5j17N9L2j02J00m7
5193a4k4P8o2j2M9k7m4R5m7n5J48j35J7J23j83J06M9j58J34or3R4pn6K3N4q0K6
5221gQ0j55J15K8j80J84m3j21J75r4m9J37q9k7R6p7k1J06r2k1J24j37N5P4j49
5246h8J35l3p2J30j13L2M0o8N1k3J8j6NK2o5R8m8o2J50j46K9J01j59J02L0j32
5272h2J28%j14R1K7j40J19K8j92K21o4j53K54j74k9J97k09Q0Q2j25N8K1m1rP5
5297D9l9o8J49j30QJ20j77J10M4j47J30l5n0N7k1j8K7K1r3R9k0r8J75j46kJ63
$$ plain form
5110 -97 39 23 -80 62 -25 -21 34 -27 -6 -3 1 -18 15 -3 -29 38 -49 17 30 -60 69 -9 -40 66 -45 14 18 -25 25
5139 25 -15 26 -43 -8 46 -98 53 11 -84 96 -52 -49 78 -70 -9 46 -59 0 56 -40 -21 69 -55 -4 76 -90
5165 -90 24 37 -83 64 -9 -50 42 -13 -8 12 -5 1 -12 30 -40 14 26 -55 55 -20 -34 61 -56 3 35 -67 33 -14
5193 -14 -38 40 -22 -34 15 -12 -56 39 -8 -63 85 -50 -33 90 -93 13 62 -96 38 32 -61 33 26 -30 -7 47 -33 -7
5221 -7 73 -82 33 61 -119 65 22 -99 76 -18 -67 70 -19 -46 50 -27 -48 58 -34 -55 69 -68 -13 61 -88
5246 -88 47 14 -58 72 -41 -9 31 -37 14 -9 9 -7 -2 20 -45 53 5 -57 93 -53 -24 77 -82 20 50 -82
5272 -82 46 46 -68 23 50 -90 29 57 -135 86 22 -131 123 -51 -80 117 -92 -12 70 -55 3 24 -17 -26 49
5297 49 10 -58 91 -39 -31 89 -88 22 66 -81 49 14 -36 21 0 -18 9 30 -63 36 16 -82 93 -53 -55 108
5323A08k32J41M5j83K03r4n9J55j24RQ1m0n6Q5j7r7J64q6r0K09j75%J50j68N9
5348a2P2j01K8O4n8o2J66j44oK05k74J20J15k80K41l1j64K15j11l5J13p4k1N8
5372B4j8n5Q9m6m0J32j41M8Q2j64J51o3n5J28j02K1L8k5j6J2L4j05J06J2j58K21
5398A10j23q7K42k32N6J43k06R8P3j56P1P4j29N3J17k11J18Q0k35K14l1j63K23
5421I9j08m4J24p9j6M6Kp3P2J4j17J57q7n4J74j77O5Q2j59J16k5o6P7k4l1L2J7
5448A7p2P6Rj18J75j07p2K22k07N1J27k02J30M1j56J12K2j07O1P7j48P2R5k19
5472a21J75Pj95K22p6j09J77q6m8J02l2r4J13j3j33J87q1j04K24j73LJ55k05J19
5496A4K7j22J12k3m3N5Ln3L0L4q6R7k9q8J68j37OJ31j87J12K1j13J10k1o7N6L5
$$ plain form
5323 108 -124 17 62 -121 82 -12 -71 84 -40 -31 50 10 -46 39 22 -75 89 3 -87 122 -53 -53 97 -71 -12
5348 -12 60 -41 -13 51 -7 -69 97 -47 -53 152 -122 -2 113 -167 74 43 -121 94 -17 -52 61 -13 -34 24
5372 24 6 -49 40 -6 -46 86 -55 -7 75 -89 62 -1 -56 72 -30 -9 29 4 -12 0 34 -71 35 47 -111 110
5398 110 -13 -100 142 -90 -34 109 -97 1 74 -82 -11 63 -66 -13 104 -107 11 91 -144 70 39 -124 99
5421 99 -9 -53 71 -8 -24 22 24 -49 23 37 -80 77 -10 -64 110 -67 -2 80 -79 37 12 -54 23 -1 -32 0 17
5448 17 -55 21 30 -88 87 -20 -92 130 -77 -26 101 -101 29 70 -86 26 48 -59 2 79 -69 3 98 -121
5472 -121 54 61 -134 88 12 -97 80 -6 -54 48 16 -78 35 22 -111 76 -5 -109 115 -58 -55 100 -105 14
5496 14 41 -81 31 8 -35 20 23 -30 0 34 -52 45 16 -72 96 -41 -35 96 -91 21 42 -71 39 18 -49 7 42
5523D2r6L8J11j95J15N8k08K09n7j35K08j17o0J54q2n2J12l8r3J69p9j06K29j68
5547d1k0J91k33J03Q0j63J24j1p1O2Jm7RO3r4N2L7j15J36o9n1J40j34L6O4j07
5573e8Q1j3n2L6J8l9LQ0j23P1P9j94J64qj69K27j18p3J94j41%J03r2k4J12o7o5
5600f8J76j49l1J99k17P2J16j90J11L2j23R4Ko9M6L9q3K8O6j26R9J7j22J43p7
5625a5m0J28j25N4L1q0N8kl0J0L7n1J6O2j17R2J3j30J67q2p1J69j36lJ23j27K9
5652b0P8j03J5P7p6k2J36j35J2J32j82P7Q5j65J06L5j17Q9J9r6O4M9j33R0M5j47
5678h7J41k9j00J41q5k2R9q2J1L7n5L9Rm1L0Lm1K0K8n2M7jo2P2k6n2J02o7k1Q8
5708D4p5nP1o0LP1p6JJ03j32N3O6j28Q6L4j34J16Jj09J17l1o9J00m1o5R2k9o0
$$ plain form
5523 42 -54 -16 95 -100 15 73 -135 74 17 -118 90 -27 -87 67 -15 -67 45 7 -86 83 4 -102 127 -41
5547 -41 -61 130 -103 0 80 -83 41 30 -41 21 22 -25 -16 47 -47 5 42 -73 63 -6 -57 83 -51 -15 49 -58
5573 -58 23 10 -42 -6 12 -27 -24 56 -67 4 83 -111 53 45 -124 103 -15 -88 106 -35 -35 68 -24 -48 64 -3 -68
5600 -68 108 -41 -72 127 -90 -18 98 -92 19 51 -72 22 24 -45 1 40 -43 -15 51 -75 24 41 -81 62 -15
5625 -15 -55 73 -52 2 33 -47 11 9 -21 -11 26 -25 -9 53 -64 28 41 -89 78 -4 -75 94 -42 -45 78 -49 -20
5652 -20 58 -45 -30 47 -29 -51 85 -50 -38 94 -88 -11 74 -91 15 50 -67 22 41 -55 9 58 -75 15 60 -87
5678 -87 54 25 -75 66 -19 -41 58 -24 -13 24 -31 8 17 -24 6 9 -32 -12 16 -36 11 10 -52 20 -6 -58 44 -23 -44 44
5708 44 -31 -36 35 -25 -22 49 -27 -26 77 -55 -2 64 -64 22 56 -78 38 39 -70 47 16 -53 47 6 -59 33 4 -56
5736e6Q1j6o7J09n5l7Q9o4k1P4o3J0M9o6K5L2m8J5L5n0K4K4o7O3j0n1Q3m6k3P6
5766D9p6K0M0p2M6J6n0L4Pm5K4L3o6M7J6r2R4j1p1R8n7k9Q8o0j1N3k9k7O1k3n9
5797e2R5m5n5J14q2mQ9j10O7K3p7N4Jl3K0J6m2J4M0q1O4Kp6J04n9k4P7p0K8J5
5827A3l2K2j4K0j9QLk5N1n0K0M1q5O4j1m1P9o3J0L8n3L3kkj3K9j2m4P9n7k0R2
5859E9j03L0M3p0Q0l1l7L4oJ1j7K2m3J6M3q0P3mo3Q7o1LM8o2L8j1Jjj3L6n1N8
5891B9j6m3O4o8L3K1n8O0k8kL2m7L5k7J1%j5L8n0M5on2P3m9RN1q8N6km1M3j8O
5924dJ2j3MpK7l7J4J9o0Q2m0j9N3o4M5j7lJ9l7L0j6j0L5n7O9m2j6P2p6L9Mm1N2
5957A7k7%Pj9K4j6L0l8K3J9m7M9k4j6N1n7L3qk0M5n4L7j8j5L7m1M4j1l8O0n4K2
$$ plain form
5736 -56 25 9 -58 51 -4 -41 48 -16 -37 37 -26 -16 33 -33 -8 24 -24 -9 26 -24 0 24 -43 20 10 -41 42 -4 -27 49
5766 49 -27 -7 33 -39 7 23 -27 7 14 -31 -7 26 -40 7 23 -69 25 14 -57 41 -16 -45 43 -17 -28 25 -4 -31 30 7 -52
5797 -52 43 -2 -57 57 -25 -29 60 -50 17 40 -37 17 18 -15 5 21 -21 -7 33 -48 16 18 -58 46 -13 -37 40 -30 -2 13
5827 13 -19 3 -11 9 -10 -2 1 -24 27 -23 -3 38 -47 17 6 -35 44 -19 -9 29 -24 9 7 5 -8 21 9 -35 44 -13 -33 59
5859 59 -44 -14 29 -41 39 8 -29 5 -1 10 -7 15 -28 -12 31 -49 24 20 -43 44 -17 -14 34 -28 10 -1 0 -1 -14 22 -29 29
5891 29 13 -30 34 -34 -1 20 -38 22 -6 -8 24 -23 12 -15 -4 -4 -19 19 -31 14 8 -44 29 -20 -11 40 -48 8 6 -35 8 -10 -4
5924 -4 8 -5 -1 -8 19 -18 -4 15 -45 37 -3 -22 31 -33 12 -5 -8 11 -26 4 -12 -22 13 -44 25 -17 -33 39 -37 2 6 -35 17
5957 17 -10 -10 -3 -22 2 -14 16 -22 1 20 -27 22 -2 -18 33 -24 9 1 -19 26 -28 9 -9 -24 13 -28 16 5 -33 27 -27 -5
5989eJ7m6L5j7LJlJ1k3L6j6j0L0n0M9j7l1O3o2K9K1n3N3k2nJ4j4K3k8K1%k8L9
6022A5l7K1J0m3N8m5J5Nk1M1n0K7J1k2K9l4J5J6m3N5m2OL9o1M2j1j4K7k2K7k9
6053a5OK3l3M4m9J8M0n4L5k8j0M3m0K6mk0J9k6K9k2PJ6l9M2j7oJ7l7K8Oj4J9k9
6086b5K4mj2L1l5J2j%K9m9M4j2j7M4n0J9J8l2OOjoOjj9L8k4nM4o8M6J3n8O9m7
6121a7lL1l7K5rrJ2j3J9j2RJ2m0L4mj6L2k6K2j6JKpK3l1K7ml5M2l6J0L3o1N2j2
6156bl4N9m3J7J8l9K6pj7RNlKK2k4J3J6m3L4pk1L6l1nL0k9K3j1LRl3M8l5J9Ol9
6192b8M0nk3L1k8oM1l4MJ5j5%J3j7pL6l8J6Nm0N9k2j3M3o2M6kl8M5m1J9J5k4L1
6226A6j5nLj0K6k5KJ6l8L4j4MK5k5JrJ2MoK1k4Rj1k2M2k5lL0l9M6k4j6L2k2K0
$$ plain form
5989 -5 12 -34 1 -16 -13 -12 -15 -4 -27 9 -7 -17 13 -37 12 -5 -36 27 -35 -6 15 -38 15 -7 -12 2 -12 11 -17 4 4 -24 15
6022 15 -22 -1 9 -34 24 -21 -6 -1 -22 19 -31 -4 7 -15 14 -20 -5 11 -32 23 -19 -13 26 -35 7 -4 -18 9 -13 14 -15
6053 -15 -9 14 -19 25 -24 -6 34 -20 15 -13 -23 20 -20 6 2 -18 1 -25 4 -18 -11 5 -34 8 -9 -15 2 -35 -7 -1 -15 4 -25
6086 -25 -1 -5 -17 14 -21 -9 -10 -10 19 -30 14 2 -15 29 -21 -2 16 -16 -10 -4 -5 -11 -5 -6 -25 13 -11 -16 28 -40 6 19 -39 30 -17
6121 -17 -20 11 -26 -1 -10 -19 -7 -20 -1 -13 -4 8 -32 2 -2 -18 14 -12 10 -6 -5 -3 -10 13 -18 9 5 -30 12 -24 -14 19 -42 10 -2
6156 -2 -36 23 -20 -3 15 -24 2 -5 -22 -13 -8 -11 -9 13 -11 2 18 -25 9 2 -19 17 -14 -19 11 -18 5 -6 -3 6 -27 21 -14 5 11 -28
6192 -28 12 7 -16 15 -13 -19 22 -12 -8 7 -8 -8 5 -12 -19 17 -21 -5 0 -40 19 -3 -16 27 -35 11 9 -29 16 -25 -6 9 -15 16
6226 16 1 -4 -1 -11 15 -10 -8 8 -30 4 -10 -6 19 -6 -5 -14 -2 2 -4 17 -7 2 -9 -31 11 -14 -17 13 -26 20 -4 -20 12 -10 10
6261A0j0k0K0j9L1j5oJ8k0J8%k5M5m4J6Rj9J6k2LK2k1J4mRj0qJ9k1K6j3k8M8m1
6295b2K2Pl3M4k7PJ5m5M9j8j0K5l7M4k4j6L5k4J1Qj3RqLOk5J8%Oj8J1Lk5L3j8
6330gJ2mk2M0l8jM8o9M4ol1M5l2J5J5k1J4pO%pJ6k2K1j3j4L4j4PqnOj6L2k6qK9
6367A3l3K6j2pK7l8K5Om4O0k7rRk5K3J6k1RmoRJ3k3QL7m2J6J1m8N6k4j2K6k9M
6402a0J0%nLK7n1L4j0k8M0k0mJ8l0J7MkMmQj4J8j3qK8l0J9K1m2L7k5j5M9m0K5
6437A1qj8J4LomJ0j3ML4n4L1J6n8O5l5k6N3l2jJ4lk8K1K1l2K7ll8P0m4rN6n3J
6472a4L6k7J3Jj3lK0k2rL5l1J1K1m1M6j3l4N4m6K0J2k8J3JrJJ8j3j6L9m0J8K9
6505B9p8P1om8O5l6k4N3m6OL3j5k5N2k3n0P6k8k6N7o5PN7p4L9J1l8K2K3l1rL8
$$ plain form
6261 10 0 -20 0 -19 12 -3 -9 9 -11 7 7 -18 27 -17 -1 8 -11 5 -17 -14 8 -13 1 -3 6 -4 -12 7 -14 12 -1 -29 19 -22
6295 -22 0 7 -26 18 -9 -2 13 -32 17 -1 -11 14 -23 21 -3 -19 16 -8 3 11 -2 7 -1 2 8 -17 1 1 7 -11 0 3 -22 11 -7
6330 -7 5 1 -21 19 -19 -20 28 -41 3 -3 -34 11 -21 -6 9 -12 2 -5 1 1 -6 10 -12 9 -4 -18 16 2 9 1 -4 2 -14 18 -8 -16 13
6367 13 -20 6 -6 -13 14 -24 1 7 -37 23 -4 -13 -4 -29 -6 10 -11 -2 -6 -12 -3 10 -13 -5 32 -10 6 17 -31 25 1 -11 15 -14 -10
6402 -10 0 0 -5 -2 25 -26 8 -2 -30 10 -10 -14 4 -26 -9 -5 -7 -3 -7 1 -13 5 -8 -16 12 -18 1 22 -20 17 -8 -23 26 -14 11
6437 11 3 -15 -1 2 -4 -8 2 -11 -7 27 -27 4 20 -38 27 -8 -34 19 -13 -14 0 -3 -31 -10 11 -21 6 3 -35 35 -9 -18 38 -15 -14
6472 -14 22 -5 8 9 -4 -7 13 -9 -18 17 -14 -3 18 -23 23 10 -24 30 -16 4 16 -12 1 2 -7 -6 12 -1 -17 22 -18 0 29
6505 29 -49 22 16 -32 33 -3 -27 26 -20 -14 19 4 -21 31 8 -42 34 6 -20 37 -28 -21 36 -38 1 12 -26 -4 19 -12 -21 17
6537A7m8RN2o3L5J5p3P1j8m2Q2m7lL5l4NRj1nK9k6JM1n8L2J1n5P2k9l6Q2p0jM4
6571B3m3kL9k1j2M2l8k0P5o3oO1p1K7M0p8L6L2n8L0L1o2K5M1p1N2J2o5O9rn6P7
6603C7l9k2N8m8J1L4m8MK6l0ML4m5JL6l7K3J0n5N2rl6N8l3k5O0l2j4M2k5k8P3
6635C7o6mQ3q7K3N0q6M6M1q9N1K1o6N7Ro3O6mn5N5qn0P5k6n7Q4m8k2P6o0j1N3
6667B5l8mN4o5K2L1o7K9L9o1M0J7o0O0j7n1P2l6k0N5m3jN3n1mO1o2J6M7o8K1M0
6699C4o6L4J7o5O2Oo4O9j3o4Q0l4m4P2k7m9P3k5m6Q8o0qP2o8NP4q9L5K6o7L9L5
6731C2o2K5L5o7M1K4o6O1ro2Q5n1j7N7m5oN3m5J5L8n9J4L9o5K7L7p9M6K2p6P0
6762A2Lo6P6l5k9O7k8k8N2k7l8P3l7k3P9p2%P0q7L5L6p8N8J4p6N5Qn3L7K5n6L8
$$ plain form
6537 17 -31 -22 30 -33 2 17 -56 15 -3 -45 37 -10 -13 22 -12 -7 2 -9 -14 15 -11 -10 31 -27 5 16 -39 33 4 -32 50 -20 -21 23
6571 23 -20 -22 17 -4 -16 26 -12 -32 43 -20 -26 35 -36 -9 31 -47 -11 21 -37 -7 24 -38 -13 28 -43 9 21 -44 25 16 -40 37
6603 37 -2 -24 34 -14 -3 31 -17 -13 13 -17 -13 21 -24 -23 13 -24 -1 9 -46 6 -3 -39 19 -14 -39 21 -11 -25 17 -8 -36 37
6635 37 -29 -33 50 -37 -14 36 -50 -4 37 -52 -1 20 -46 11 20 -43 23 19 -36 19 11 -39 36 10 -47 37 -11 -33 43 -17 -28 25
6667 25 -13 -17 37 -28 -6 25 -42 -13 26 -35 5 22 -38 22 5 -46 26 -10 -30 25 -18 -19 34 -17 -21 40 -22 -6 41 -27 -6 34
6699 34 -32 2 19 -46 16 22 -42 27 14 -50 30 -4 -48 24 -3 -52 21 -4 -50 38 -22 -30 42 -26 -21 53 -36 -1 25 -42 -3 32
6731 32 -30 -5 30 -37 4 28 -38 23 14 -48 37 -14 -31 26 -19 -25 28 -17 -2 36 -23 -9 30 -35 -8 29 -50 -4 18 -58 12
6762 12 15 -51 25 -10 -39 28 0 -28 24 -3 -41 32 -5 -28 51 -21 -21 49 -38 -3 33 -45 13 27 -49 6 14 -39 -2 23 -33 5
6794EK0p3O8j2o2Q3m5k1P9o3LM6n2J3K9l8MM1n2K1L4o9N6Op8Q3j6m6P0n2j3O1
6826C0m3k2N2l2j4N4n1j8Q7p8J9O2r6M8L2p3N2Qn9N4mm8N6qn0N7pm1O6k1n1P9
6858D0n5k2P1o4MO1o1J1L9m8LN4p2K1M4o7N1j0m7P4m3k7P3m5pM6m0k2O5m1oN0
6890C0n9NN2o1J9M6p5N0K6p0M3J3m9K9J9o2O5nn4O0k3n5Q9m9k2P5o4jO1o1jN3
6922B4n7J6M6o9K8L3o0M7jn3M5Jk7M3k9rM5k0k3M9l3k6N8n1pO0o4J2M4m7J9K5
6954A9o0L3K2n9N3Oo4O8j4o0Q3l6k3P1n5nN6n5%M8m7ON3o8J4M2n0J2M3o3M1J5
6986B6n5L7Nm2L7Kl4L4lm0N2k4k4N7m4j0M9n4J7L5n1K6J6l7L2ml3L6nk3K9%m4
7019c7O4l2l0N0k6rM8l8LM0n1LK7k6j5N0m6%O9p5L1L2o7M8Nn7N2j7k3L8j0j8K8
$$ plain form
6794 5 25 -48 20 8 -54 29 -16 -37 42 -21 -18 28 -24 -11 18 -20 -16 25 -27 -6 28 -41 15 21 -57 26 10 -36 34 -18 -31 30
6826 30 -13 -35 17 -15 -29 25 -26 -44 43 -35 -16 46 -50 -2 30 -43 9 17 -42 12 8 -40 16 8 -42 15 8 -33 33 12 -39 40
6858 40 -15 -37 34 -30 -26 35 -26 -15 24 -24 -21 33 -39 -18 26 -41 10 0 -47 27 -16 -43 30 -15 -22 24 -16 -38 27 -14 -20 30
6890 30 -29 -24 28 -33 -14 32 -43 7 33 -37 6 19 -30 -1 18 -44 21 16 -38 22 -1 -56 33 -16 -38 37 -27 -28 33 -28 -29 24
6922 24 -33 -17 29 -40 -12 21 -39 8 7 -46 -1 0 -27 16 -13 -22 23 3 -20 29 -4 -30 28 -23 -30 30 -34 -22 22 -25 -6 19
6954 19 -41 -8 14 -45 8 14 -50 18 4 -56 27 -9 -32 39 -16 -21 35 -20 -20 28 -19 -13 40 -28 -14 28 -22 -10 33 -30 11 26
6986 26 -29 8 13 -29 8 10 -24 10 7 -33 19 -5 -29 28 -16 -26 23 -31 -14 21 -30 -4 12 -25 7 3 -30 6 1 -22 7 7 -37
7019 -37 27 -5 -35 15 -11 -20 28 -10 -7 33 -18 -15 12 -14 -29 21 -25 -25 44 -31 0 32 -35 13 18 -39 13 -4 -27 11 1 -17 11
7052A1ok6M2k0m1N3k6kL8n3L4lj2J6J1j8pK7l3OL2m8K9J2m6M5k2k0N3l4JK7l8
7085a8J0L9n3QK3l1PL2m1K4L0o1L8J1n6M8j4k4L2Jj5MJj6K5Pl3L6j3k8N5l8j0
7118b0M0l6J2J1k5J2K0k3Rpk1K1%k1L5j0k5M8l0qL0l1K2Pl6J9J1j4JOj4J3K2k9
7152a1rL9n4K0J6l1L3ll9M9qk5K0Mk3J3Jj9L5j3j7L3l3LK8k9OJ1j7J9m%kK0j5
7187bjJ8l4QPj1J9nrJ9j8NNk0LMmN%Nj6K0k1J7J2k7J2J1l5L0nj6L1k4j3K0Nj7
7225b2K4j2j3K5j6oK7k3LK8k7RPj3J2Mj2MljoJ2qj2J3j5J6jk1K2Qj7J8j8OmJp
7263a8RLoPj1RJ2j4MJ6k7J5pkJ4k0QJ0j1MkoOKmpK6j2qRq%Kj0QLj1J3jJnPj4J0
7307fJ4j2Jnj0K2j5j0J9%%Kj6J7Ljj7J8pkJ2j3OopNPj1J2j1kJJ3j8J2JqMLj3K3
$$ plain form
7052 11 5 -21 21 1 -40 13 -13 -15 23 -30 4 1 -11 5 16 -2 -9 18 -15 -9 23 -25 4 16 -30 15 -7 -27 26 -8 -7 20 -18
7085 -18 -8 31 -22 -14 9 -22 -15 17 -24 0 30 -31 7 18 -38 10 -4 -28 4 5 -10 -6 -5 -21 4 11 -22 14 1 -27 28 -10 -20
7118 -20 20 -16 -4 7 -18 -6 14 -9 0 -7 -28 -7 -7 -28 7 -3 -28 20 -10 -18 12 -19 3 10 -26 -7 4 -10 -9 -3 -17 -4 18 -11
7152 -11 -20 19 -35 -15 1 -30 3 0 -39 10 2 -23 -3 1 -22 -9 -8 -27 8 -5 -22 11 -22 -19 9 -20 -14 -3 -20 -1 -5 -5 -7 13 -2
7187 -2 -3 15 -19 -11 -4 -15 4 -1 -10 9 -9 -4 1 -19 -16 -12 -16 -11 -11 -6 -22 -2 -23 -6 6 -21 -9 2 -33 -3 -8 -24 7 -17 -30 -10 -5 -22
7225 -22 2 -10 -23 2 -14 -20 7 -16 -13 15 -12 -3 4 -9 3 7 -5 -1 -4 -5 -11 1 -7 -19 -6 -21 -5 -6 -27 -5 3 -14 4 -14 -8 -12 -11 -18
7263 -18 -9 -6 -12 -5 -16 -7 5 -9 -5 11 -16 -1 -8 -10 4 -16 -8 2 -9 -5 -7 -13 -7 -5 -9 -16 10 -2 -10 -1 -9 -9 -7 -17 -9 -6 -17 -4 -5 -4 -9 -2 -16 -6
7307 -6 8 -4 -3 -8 -18 4 -11 -21 -2 -2 -2 0 -16 1 4 3 -14 4 -3 -5 7 -6 0 -6 -13 -8 -1 -12 0 -11 -13 -12 1 -17 -5 -4 -12 -8 -5 -18 5
7348EpmJ1j2j0J3j1J1J0j2mJ4Ok7J5%j4J7oj2J3j6J5mlMj0j0K3j6J3LNj3POqk
7386a0PnlMKKj2J1Pjj8K1j5NRorJ3j0J0jj9K1pj3J5oj0J8onJj2kJ4koK4k1KNJ
7428g%%qJ7koJkmOj5J1MMkjMj7J9pk3K0OrOjKkj3J6Jj7pL0k3J4kojmmK7k5NK7
7473A2l6OJ4qOJj0QmPj6K4j1RprQJ3qjrNPj0kJ0qj1J4Kj5J4qlJKqJ4j4J4k%Nk
7517fjKLlj0J1nOkqRoOmOnlkJ2lj6QMMqJ5j4JJ4k6J4jk3L0rj4J8j8POMJ%Jj1O
7563a0kRJ2l0LJ9j4J2RrnjRkkjqJ4j9J1Kk1K7j7KQj8J8lmploJ9lkMJ0j1PnpJ4
7606aJj7oPJJ6j1NpOnLOoRJj3J9j6%Kj1J5Nj1oJJkNNlmnOkJ4pjoLOJnnJ5j5N%
7655g%kKLpNkpLK%J4j5kJ2rKlJJ3j5J4%klrPj7QNkpQjJ3ooJ1j7J9nrOlJ3Mk3J6
$$ plain form
7348 5 -2 -6 5 -7 -17 -4 -15 -4 6 -6 -10 4 10 -17 -2 -2 -16 1 -5 -17 -4 -20 -5 -9 -12 -8 -18 -28 -5 -21 -8 -5 0 -13 -6 0 -8 -10
7386 -10 -3 -8 -11 -7 -5 -3 -15 -4 3 2 -16 5 -10 -5 4 -2 -11 2 -8 2 1 -18 3 -4 -17 -2 -8 -18 0 -6 -11 -10 -22 -24 -10 -12 -18 6 -15 -13 -8 -7
7428 -7 -7 -7 -15 2 0 -6 -5 -7 -11 -5 -20 -9 -5 -1 -3 -4 0 -17 2 -5 -28 -8 -2 -11 -5 -6 -4 -6 -19 -3 -2 -19 -26 4 -19 -5 -7 -13 -14 -18 -22 5 -20 -15 12
7473 12 -24 -18 -4 -12 -6 -5 -15 -7 -11 -4 -20 4 -7 2 -5 -14 -6 7 -1 -2 -11 -6 1 -9 -11 -1 -9 -20 -6 -4 -19 -5 -13 -16 -15 -13 -21 -7 -21 -7 -9 -9 -4 -6
7517 -6 -7 -5 -2 -5 -15 -4 -9 -3 -5 -13 -4 -10 -4 -8 -2 -7 -10 -12 0 -3 -19 -11 -7 -3 -11 4 -10 -9 5 -21 -7 -8 -31 -1 -10 -24 -6 -24 -17 -11 -7 -6 -6 -5 -16 -10
7563 -10 -12 -3 9 -21 -18 1 -13 -1 8 -1 -6 -7 2 0 -2 -3 -11 3 -16 -5 -3 -24 3 -14 -12 -4 -22 -4 -7 -11 -18 -21 -27 -8 -11 -13 -9 1 -10 -3 -8 -15 -1
7606 -1 0 -17 -23 -16 -15 1 -10 -5 -12 -6 -11 -8 -2 -8 1 2 -11 8 -8 -8 -6 -17 -2 3 -8 -14 -13 -12 -14 -9 -4 -7 -11 -16 -10 -12 2 -5 -6 -12 -9 -3 -2 -7 -12 3 -12 -7 -7
7655 -7 -7 -9 -7 -4 -11 -6 -8 -15 -12 -10 -10 4 -11 -13 -1 -10 -8 -11 -10 3 -12 2 2 0 -3 -12 -5 -22 -14 -9 -11 -18 -10 -11 2 -4 -10 1 -16 3 -2 -11 -5 -8 5 9 -14 2
7703BJj6MMj1J5Kj5%J4j2PJ2k0KljOkMJKokJ9j3%Qj0J4rkjRJj4Rno%%J2j5JJ8
7748Drj%lRqjJojK4k5NpMJ7kj4mM%J8qk0K9j1mJ4j7J1kloNJopK3j4J3oj4K8k0
7792iJ1Mj1kkrjJmJ3Mj1OQj7K4nj5J8k1NJ7j9J9j1mJ5j1lRPokJ1k1J1Pl0K4%K
7833BPk3J0Oj9MmOKLlj6K4k4MK4l0K5qj1K5nJPj8NNj0KOojK1j5pK0k1OOk2K0m
7875frJ1mjKJ2j5J4k2jJ2opJ7j2KJ7k2lK5j5jJ4k7K4Ko%J2k2K4Kk2RLj5J7j1r
7914a7K1roRoJJ2j1lOj4%J4j6%K0k3K2j0j3J6%j0K7k1kJ4j3rK7j3mJ1rLK1k5L
7952gK2j9kJ0j6MJ7k1LMj6J8Qk9K1Pk5K1ok6L5j2k3J8rJ0J7k2rK8k2J1J4k6NJ7
7988@k5J3J3j8J8j0j7J5kmJ6j5j2K7j6pJ4jj0L2l4J1J5l6K3J5l7J6Rk4J9J1k3
$$ plain form
7703 2 3 -13 -9 -5 -16 -1 1 -14 -14 0 -12 -5 7 -13 -11 -14 -15 -9 -11 -7 -6 -4 -10 -12 7 -6 -6 2 -8 6 -3 -5 -6 3 4 -10 -1 -6 -12 -12 -12 0 -15 -14 4
7748 4 -5 -6 -6 -9 0 -8 -9 -8 -14 -15 9 -16 -11 -18 -14 3 1 -13 -17 -13 -13 5 -3 -23 6 -5 -9 5 -12 -1 -3 -6 -12 -7 -6 -12 -19 4 -10 3 -3 -17 11 -9
7792 -9 2 6 -5 -7 -9 -18 -19 -18 -22 -9 -5 -16 -10 -2 -19 5 0 -15 3 -18 -13 4 -15 4 -7 -11 4 -7 -10 -1 6 0 -2 9 -12 -1 6 -24 0 0 2
7833 2 9 -14 -4 2 -17 -13 -17 -11 -9 -6 -9 -25 -1 -25 -21 3 -27 -2 -10 -21 4 -1 0 7 -11 -6 -1 -11 -9 -3 -9 -10 11 -4 -11 9 -12 -6 0 -22 -2 -6
7875 -6 -15 -4 -8 -9 -7 5 -10 4 -18 -19 -7 -13 -20 -3 -15 -13 4 -18 -21 4 -11 -12 2 -25 -1 1 -5 -5 7 -15 9 11 -11 -2 1 -14 3 -8 -17
7914 -17 4 -5 -11 -2 -8 -7 5 -6 -9 -3 -17 -17 -3 -19 -19 1 -22 0 -10 -23 -7 -7 -17 10 -11 -13 1 -12 -21 6 -7 -11 0 -9 -6 15 -10 -7
7952 -7 15 -4 -6 4 -12 -8 9 -12 -9 -5 -21 -3 5 -24 -3 4 -21 0 -6 -32 3 -9 -32 -14 -23 -13 4 -18 -27 1 -21 -10 4 -22 -17 0
7988 0 -25 -12 1 -17 1 -9 -26 -11 -13 -17 -1 -16 -28 -1 -17 -24 -10 -11 -21 11 -23 -12 3 -33 -10 5 -32 -16 -7 -31 -12 -1 -24
8021b4L2j8j2K8rk2K1o%K4k6%J2rJQj8RJ4k3LPk1J3J3k2J4J7l2L4qk0L2k0qK6
8057A0l7QJ7j9RJ1k3J2J4k4J4J0k2J9Lk2K2pmK3j4j3J2nrK5k0j6L3k1j7L8k6q
8091b7L5l7J5K1l3J1L1l5J4Ml3L2qk1K7lk2K5qk0L9k6mL5l2J0J3k1J5Rk4J0J4
8124Fj5kjmPQm2L7poJ6j3pL3l3kK6k6MK3k3JL5m0OL0m2K3J8m7L8J3l6K9j4k0K7
8161@%k2K4kj8K7j8nK3k5rK8j8j0K2j5KJ1j3nK8l5K0J6l2K6mj8K4j3
$$ plain form
8021 -24 8 -10 -22 6 -3 -25 -4 -10 -10 14 -12 -12 0 -9 -8 0 -18 -9 5 -18 -15 -8 -29 -16 -3 -25 -11 6 -26 8 0 -20 12 -8 -16 10
8057 10 -27 -19 -2 -21 -12 -1 -24 -12 2 -22 -8 2 -20 -1 2 -20 2 -5 -9 14 0 -13 -1 -6 -15 10 -10 -26 7 -14 -31 7 -19 -27
8091 -27 8 -29 -14 7 -26 -15 16 -19 -5 -1 -34 -2 -10 -31 -4 -7 -29 -4 -12 -32 7 -19 -23 12 -20 -10 3 -18 -3 6 -18 -8 6
8124 6 -9 -11 -12 -16 -9 -1 -43 -6 -13 -19 -3 -16 -23 10 -23 -25 1 -25 -21 2 -21 -20 15 -25 -19 11 -31 -8 10 -37 1 14 -22 7 -7 -27 0
8161 0 0 -22 2 0 -18 9 -9 -14 9 -16 -25 3 -15 -25 -3 -18 -16 -5 -18 -23 5 -30 -10 6 -26 0 -4 -22 2 -11
8191a1
$$ Imaginary data points
##PAGE= N=2
##DATA TABLE= (X++(I..I)), XYDATA
0@%%%%%%%%%qJ6j6J6k4L2m0M8n6P2q8J05j29J54j79K11k51K96l43L95m54N23n98
32c18O79p71Q71r83J109j245J392j555J732j926K140k371K625k901L204l537L899
49B044m296M731n209N738o325O977p708Q534r474J0555j1811J3292j5072J7256
63I232k0006K3592k8487L5608m7047O9286j75785L13642j49224k56176M98990
74B73625m41658J70822J09032k41332K11438j02544o53O7938j08373J24627j01096
85c8174L3314M0425o6964L3570J2927j1096m7532J00193o8983n7498J96264k30172
97a03726J09115J00038k59453K64006j17942p9166K15632k36360J55068k1799
107B5413j10742J98212k04921J16220L5692j71910K11043j29281j3586J15191
$$ plain form
0 0 0 0 0 0 0 0 0 0 0 -8 8 -8 8 -16 16 -24 24 -32 40 -48 57 -72 82 -97 114 -137 159 -184 211 -243 280 -318
32 -318 361 -410 461 -522 587 -658 734 -821 911 -1015 1125 -1246 1379 -1522 1682 -1855 2044
49 2044 -2252 2479 -2730 3008 -3317 3660 -4048 4486 -4988 5567 -6244 7048 -8024 9232
63 9232 -10774 12818 -15669 19939 -27108 42178 -133607 180035 30811 -225365 273625
74 273625 -168033 2789 111821 -129511 81927 -20617 -21270 46668 -61705 62922 -38174
85 -38174 -4860 35565 -31399 2171 15098 4002 -43530 56663 -12320 -69818 126446 -103726
97 -103726 5389 105427 -154026 109980 -7962 -87128 128504 -107856 47212 25413
107 25413 -85329 112883 -92038 24182 59874 -112036 99007 -30274 -43860 71331
117G1331j17213N1182K301N072m2889L7203M4390j45839J69097o8056r9995K14625
129A21209j90876N0824R9627j64986J29303m7379j7985M8228o5148Q4114q5993
140c9062M1103M5575j21838J27945n2519m9809J03040p6985J0327L1524j8284
151A017k0891K9947J5645q0369J00510m5082n5129J31597j31526N6054M6529j20539
163g2237J34776q8418L727Q4420j37880J27393m9836n9094J37071j35177N5365
174A10M7565j05926R0650k9616k3835L8599k4281J1275j5880K5210j6375j3841
186a6345M2236m2434J3343J7551k2647M403P982P570l8689M7988j0723n4812R6401
199E1824p2444q259Q9215j10885N8951K5162q0662P6856l1454j4207L2978k7778
$$ plain form
117 71331 -45882 5300 7601 12673 -30216 6987 51377 -94462 74635 6579 -93416 121209
129 121209 -69667 -18843 80784 -84202 45101 -2278 -20263 27965 -37183 46931 -39062
140 -39062 2041 47616 -74222 53723 1204 -48605 54435 -22550 -12223 19301 1017
151 1017 -19874 10073 25718 -54651 45859 777 -54352 77245 -54281 1773 48302 -72237
163 -72237 62539 -25879 -22152 62268 -75612 51781 1945 -57149 79922 -55255 110
174 110 47675 -58251 32399 2783 -21052 17547 -6734 4541 -11339 13871 -2504 -16345
186 -16345 25891 -16543 -3200 14351 -8296 -3893 4089 11659 -27030 20958 10235 -44577 51824
199 51824 -20620 -28879 60336 -50549 8402 33564 -47098 29758 -1696 -15903 17075 -10703
211a0703J8433j7372J7921n752k0355M3617m3945J6725K1069m4351M0958j8594
223b349o763K3532k8424K3757j2351l499J8688k5653K0072n165r634J5689j2453
236d553O805m468L600J592j1848J9211j4523j421J6613j8298N772P873q534m041
250f220J4733p743j5954L5675k8725o288M4645n4755K4935K4691n7593N0576j0954
263G023l1289M7627l1927J436K0897k4451J4646l662j868M608q925J3290j1816
276d411J430J2746j9906J3068L920j8502J9198m885j3689K1976j3218o401K2399
289A3725k2727O629J5273k8259K2839j633k1492L0918k0213l298K3393k6881J3307
302A581O142j7989J5944n069l981N379k047J051n242R427o038n472J6462j6702
$$ plain form
211 -10703 7730 -9642 8279 2527 -17828 25789 -18156 -1431 19638 -24713 16245 -2349
223 -2349 -9112 14420 -14004 9753 -2598 -6097 12591 -13062 7010 1845 -7789 7900 -4553
236 -4553 2252 -2216 1384 2976 -8872 10339 -4184 -5605 11008 -7290 -1518 6355 -2179 -6220
250 -6220 8513 770 -15184 20491 -8234 -14522 30123 -24632 303 24994 -32599 17977 7023
263 7023 -24266 23361 -8566 -7130 13767 -10684 3962 300 -1568 3040 -5885 7405 -4411
276 -4411 -2981 9765 -10141 2927 6847 -11655 7543 2658 -11031 10945 -2273 -8674 13725
289 13725 -9002 -2373 12900 -15359 7480 5847 -15645 15273 -4940 -8238 15155 -11726 1581
302 1581 7723 -10266 5678 609 -3372 2007 -40 1011 -4231 5196 -842 -6314 10148 -6554
316f554L752J3594k1499J3178N053j8869J7315k209j3388J6901o642q022J5129
329G739r768k579J1745j1348K922O076q806M856N88k596Q06Q93J147n787P921
344C809l595o200J5004j4888L479J2744k2479J7683l86j7903K4660j5420l337
357f829J8889k1033R593O043j4829J2099k437n186N763j658j267k48L974m589
371a715l44P165r251L460O144j1076O238M491j1363P692L852j3163J1373J044
385D547j4355J7532p087r627J9968j6376J944J2726j8047J2164q28q346J1402
398E617r100M583k07l886Q047j0774R212j898q610J6046j4802M743Q454j7117
412i692J6141o184o635J4870j4191N714M686j0522R159k843l435N256j963k545
$$ plain form
316 -6554 -2802 10792 -10707 2471 7524 -11345 5970 3761 -9627 7274 632 -7390 7739
329 7739 -2029 -4608 7137 -4211 -1289 4787 -4019 837 1425 -1171 -365 528 1675 -4112 3809
344 3809 214 -5986 9018 -5870 -2391 10353 -12126 5557 5171 -12732 11928 -3492 -6829
357 -6829 12060 -8973 620 6663 -8166 3933 1496 -3690 2073 415 -852 -1100 2874 -1715
371 -1715 -2059 5106 -4145 -685 5459 -5617 621 5112 -6251 1441 5293 -7870 3503 4547
385 4547 -9808 7724 637 -8990 10978 -5398 -3454 9272 -8775 3389 2561 -5785 5617
398 5617 -3483 1100 893 -2993 5054 -5720 3492 1594 -7016 9030 -5772 -1029 7425 -9692
412 -9692 6449 265 -6370 8500 -5691 23 4709 -5813 3346 503 -2932 2324 361 -2184
426b184L325R49o526P581j877o635J1226q253J11P065q722N435j333k97J65k079
442b049P487j2077R314K524j6794K2432j3201n899K2016k4233J1444P062j8644
455a0618J7250p274k399O525o361O301p594O810q71q506J5294j3718L560Q891
469G290j5584J2972m167m440Q467q186O103l345l14M463p386P223l952l84L605
484B365m983N328n550M812j094n742J2344j3418O130N986j5178J5871q539j756
498c424R564j2472J1655q488K147P654j7694K1473j3015o156K4683k9274J5566
511B219P752k5030K5398j0753o696J5321j2738N161j14m27L80l518Q319r716M820
526C78L594r485R266m636L59R59j484M385r160J1319o201n538J6814j9334J0389
$$ plain form
426 -2184 1141 2090 -4436 3145 1268 -5367 5859 -2394 -2283 4782 -3940 1495 162 -135 30 -2049
442 -2049 5438 -6639 2675 5199 -11595 10837 -2364 -8263 13753 -10480 964 8026 -10618
455 -10618 6632 -642 -3041 3484 -2877 3424 -4170 2640 1769 -6737 8557 -5161 -1601 7290
469 7290 -8294 4678 511 -3929 4538 -3648 2455 -890 -1204 3259 -4127 3096 -856 -1240 2365
484 2365 -2618 2710 -2840 1972 878 -4864 7480 -5938 192 6178 -9000 6871 -1668 -3424
498 -3424 6140 -6332 5323 -3165 -1018 6636 -11058 10415 -2600 -8756 15927 -13347 2219
511 2219 9971 -15059 10339 -414 -7110 8211 -4527 634 520 93 473 -3045 5274 -4442 378
526 378 3972 -5513 3753 -883 -524 435 -1049 3336 -5824 5495 -706 -6244 10570 -8764 1625
541A625M812j7058J9663j2652J328Q844j5051J6165j1650J796J0649j9686J9305
554H090q525o970J8256j9071J0148J564r184J1178j0129Q015m045l243J2163j6908
568h661J2433p9j2638J7556j2031R29P453q638N334l125L955m505N90P536j4120
583h011J2948l505q545J5905j4632O440L025r124J1384j1220Q536j908q328J7604
597A0569j9151R720O396j9762K2362j2816k742J4924j7856J2499l815m066R633
610E895j2516J1554n626l646J1576j3682R112r75n995Q773p872N758l550K31N166
625D203j0908J2647p236l317J2696j5254R919k81q165J1583r960N628n86m359
639c390Q704j1046R227k434o652J2953j2914O832J886q837J1315r631N461J27
$$ plain form
541 1625 6437 -10621 9042 -3610 -2282 6562 -8489 7676 -3974 -2178 8471 -11215 8090
554 8090 -435 -7405 10851 -8220 1928 3492 -5692 5486 -4643 3372 -673 -3916 8247 -8661
568 -8661 3772 3693 -8945 8611 -3420 -2491 4962 -3676 1658 -1467 2488 -2017 -1427 6109 -8011
583 -8011 4937 1432 -7113 8792 -5840 600 3625 -5499 5885 -5335 3201 1293 -7035 10569
597 10569 -8582 1138 7534 -12228 10134 -2682 -5424 9500 -8356 4143 328 -3738 5895
610 5895 -6621 4933 -693 -4339 7237 -6445 2667 1692 -4303 4470 -3402 2356 -1194 -963 4203
625 4203 -6705 5942 -1294 -4611 8085 -7169 2750 2469 -5696 5887 -4073 1555 969 -3390
639 -3390 5314 -5732 3495 1061 -5591 7362 -5552 1280 3166 -5671 5644 -3987 1474 1601
653A601o399J1775j3476Q892J550j2860J8130j3715K011J0328j6542J4006n452
666a51m044J0458j1984Q918k807m099R142j0102O435j54n201P122n492K362j93
681B10n72J335l242N631o327L548K275q352J1042q234P71P720j2691J1623n189
696d52l715J1158j3687R978j452p984J3666j2739N712L835j1134J2617p820j14
710b131O651r082P392l327j034M299n688N106l043K52K432m389N008l791J132
725b13J841m250N442m732J921K165n673O740m714N66L779o531O415l347j075M611
741B945n880M809k194r66L780n332M985k762o57M182o418O022k640k336O342p315
757c435M890l57m259P028o652L214J664n713P067n170Q55L896o593N755j946k460
$$ plain form
653 1601 -4798 6977 -6499 2393 3943 -8917 9213 -4502 -2491 7837 -8705 5301 -151
666 -151 -4195 6263 -5721 3197 390 -3709 5433 -4669 1766 1612 -3589 3533 -1959 403 210
681 210 -362 973 -2269 3362 -2965 583 2858 -5494 5548 -2686 -1915 5805 -6886 4737 -452
696 -452 -4167 6991 -6696 3282 1830 -6154 7512 -5227 485 4320 -6814 5803 -2017 -2131
710 -2131 4520 -4562 2830 -497 -1531 2768 -2920 2186 -857 -605 1827 -2562 2446 -1345 -213
725 -213 1628 -2622 2820 -1912 9 2174 -3499 3241 -1473 -907 2872 -3659 2756 -591 -1666 2945
741 2945 -2935 1874 -320 -1286 2494 -2838 2147 -615 -1272 2910 -3508 2514 -126 -2462 3880 -3435
757 -3435 1455 1098 -3161 3867 -2785 429 2093 -3620 3447 -1723 -868 3028 -3565 2190 244 -2216
773b216M900m339J706J034k389K030p07k73J65N54q14P4J274k294K211r27j060
790a071K979l805K772q3l069N057m638J673K538n737N971k923j737N353n994L548
806H34L86l746N060l961J216J801l735L855k307j22K312l277K633p89j159K186
822A187j988R89J14q75J132q67K79K52l87J71P1r6j56N85q99P18J83j421K104
841A096j569l2J761k710K381q13j341L025l246J828N21k736L808l129P25K388
857A957m447M065j289k280M489m061J273K185m136L353m77k377L268j849n89K318
873A403k312P17J366k540K008j14j876K786k206M67J642l168L202j472j296L628
889B235m129K392P25l634M650l046l16L385m265K623K22k367K711j448k15J028
$$ plain form
773 -2216 2684 -1655 51 1085 -1304 726 19 -254 -89 465 -349 -275 999 -1295 916 -11 -1071
790 -1071 1908 -1897 875 792 -2277 2780 -1858 -185 2353 -3384 2587 -336 -2073 3280 -2714 834
806 834 1220 -2526 2534 -1427 -211 1590 -2145 1710 -597 -719 1593 -1684 949 160 -999 1187
822 1187 -801 188 302 -573 559 -308 -29 223 -164 7 78 -18 -174 411 -488 230 413 -1008 1096
841 1096 -473 -505 1256 -1454 927 114 -1227 1798 -1448 380 901 -1835 1973 -1156 -431 1957
857 1957 -2490 1575 286 -1994 2495 -1566 -293 1892 -2244 1109 632 -1745 1523 -326 -915 1403
873 1403 -909 -192 1174 -1366 642 528 -1348 1438 -768 -301 1341 -1827 1375 -97 -1393 2235
889 2235 -1894 498 1223 -2411 2239 -807 -1123 2262 -2003 620 842 -1525 1186 -262 -477 551
905E51o29k73N14L47j533J809o46j283K664k548J003J072k474K493j347n5R51
922F16j337J595j814J505k11j756L357l462J686J182l641M275k789J85K137l324
938a796L384k582R61J368l753M992m080R51L191o280O433l157j988O179p096M366
954A093L80m531O013m372R45K086l202K555j449R15q13K30J353l350M338l096
970i05l46M266o257M937j097k909N113n075L536j299j446M467o755O593k785l732
986c694R523j0560N378L254r891J0512n368j621O203o679M312j558k33J432k974
1001a964M757n279L065J476n903P552n494R71L679o468O588m318N80L405o287
1016c640O913m762L86M416p358P061l835p57M893p248P019l954j213O332q653
$$ plain form
905 551 -78 -351 163 510 -1023 786 140 -1143 1521 -1027 -24 1048 -1426 1067 -280 -335 616
922 616 -721 874 -940 565 354 -1402 1955 -1507 179 1361 -2280 1995 -794 -609 1528 -1796
938 -1796 1588 -994 -33 1335 -2418 2574 -1506 -555 2636 -3644 2789 -368 -2356 3823 -3273 1093
954 1093 1473 -3058 2955 -1417 -472 1614 -1588 967 -482 433 -380 -150 1203 -2147 2191 -905
970 -905 -1251 3015 -3242 1695 598 -2311 2802 -2273 1263 -36 -1482 2985 -3770 2823 38 -3694
986 -3694 5829 -4731 647 3901 -5990 4522 -846 -2467 3736 -2943 1369 -189 -422 1010 -1964
1001 -1964 2793 -2486 579 2055 -3848 3704 -1790 -819 2860 -3608 2980 -1338 -758 2647 -3640
1016 -3640 3273 -1489 -1103 3313 -4045 3016 -819 -1576 3317 -3931 3088 -866 -2079 4253 -4400
1031d400O705j484l989O703n804L020p42l90J815m798P952p676J671P724j4194
1046g887J2325k379r340J5084j1476J810O992r819O846k119p56J496k253M178
1060B702n776M557J4n351P766n692R03L082m112L077k399L013l103K83N159r659
1076e536R067k380o764J2684j1747M535M847j1510J2477p654o12Q633j2612J0169
1090C597k245o659J1083q430J284M668n450J910J286n24l156N241k206m635R800
1105E564q537J169O993j0165O996j033l203M292m188M816n218K618L955j1003
1119f944J2463n342o646J5039j3259K614Q652j2301O878J675o036L786J217l141
1133a345O8M670o070K115M330q311P156k082l610P211p764N289l19n562R510q717
$$ plain form
1031 -4400 2305 821 -3168 3535 -2269 751 9 -381 1434 -3364 4588 -3088 -1417 6307 -7887
1046 -7887 4438 2059 -7281 7803 -3673 -1863 5129 -4690 2156 37 -719 777 -1476 2702
1060 2702 -3074 1483 1497 -3854 3912 -1780 -877 2205 -1907 1170 -1229 1784 -1319 -1036 4123 -5536
1076 -5536 3531 1151 -5613 7071 -4676 -141 4706 -6804 5673 -1981 -2593 6040 -6572 3597
1090 3597 1352 -5307 5776 -2654 -1370 3298 -2152 -242 1044 520 -2636 2605 399 -4236 5564
1105 5564 -2973 -1804 5189 -4976 2020 987 -2216 2076 -2112 2704 -2514 104 4059 -6944
1119 -6944 5519 177 -6469 8570 -4689 -2075 6577 -5724 1154 2829 -3207 579 1796 -1345
1133 -1345 -1277 3393 -2677 -562 3768 -4543 2613 531 -3079 4132 -3632 1657 1338 -4224 5286 -3431
1149c431K880M831r730Q784k955l512O586n408K339q5q99J876l486M378k600j514
1165a946M949m729Q99L063l250o03M299l004l382R158p816j523J2036j4524N830
1180e43P918j6210J2762o28j0564J2870o209k673O821m852P97Q50L29j287k94
1195i13L316m513K046K312m782L298N05k967K016R42k525Q84K441m202K576J437
1211A871m932N421k625j703N223o202M018N64n361P580n386n56O609q296M072
1226B97K994p427N689N77n707N083N20n575N087P05o456O625p28o100P825l045
1242C64l856O847l814j668M199k029j688K559M52l946L652J011n991O369j067
1257A394n758Q187l946l374P623n598n93N640n644J120L826n141K052K607m914
$$ plain form
1149 -3431 -551 4280 -5450 3334 379 -3133 3453 -1955 384 299 -600 1276 -2210 2168 -432 -1946
1165 -1946 3003 -1726 -827 2236 -1014 -1617 2682 -322 -3704 5454 -2362 -3885 8151 -6373 -543
1180 -543 7375 -8835 3927 3299 -7265 5605 -604 -3277 3544 -1308 -511 339 668 -619 -913
1195 -913 2403 -2110 -64 2248 -2534 764 1269 -1698 318 1260 -1265 -381 2060 -2142 434 1871
1211 1871 -3061 2360 -265 -1968 3255 -2947 1071 1635 -3726 3854 -1532 -2088 4521 -3775 297
1226 297 3291 -4136 1553 2130 -3577 1506 2026 -3549 1538 2243 -4213 2412 1684 -4416 3409 364
1242 364 -3492 3355 -459 -2127 2072 43 -1645 914 1366 -2580 1072 2083 -3908 2461 1394
1257 1394 -4364 3823 -123 -3497 4126 -1472 -2065 3575 -2069 -949 2877 -2264 -212 2395 -2519
1272b519L147J023m329M512j621k360M851m211P61L237n008L351M56l579L901
1287A612j514j527K745j347r70J644O4k214K140P00l808L922l51m045N400k246
1303B05k954N656l336j918N215l461j695N278l733j676N968n054n14O017o658
1318b660J748M596p032L676K343n796M072P75m228L393N51l761L272M67m058M237
1334A595p31l538N065k696j539M322l757O72K349l123J431R69j960Q53J144j996
1350i40O80J832l284K071J206m125M178r70l206N105l106j262M421l774nL470
1366B291l462Q1L487l793K96L988n135J784L462o092L755J597n384M499p0l765
1382b461L713k03l215L136N08m232M234om961O220k408l516O782m903m66N052
$$ plain form
1272 -2519 628 1651 -2678 1834 213 -2147 2704 -1507 -746 2491 -2517 834 1290 -2289 1612
1287 1612 98 -1429 1316 -31 -1001 643 707 -1507 633 1333 -2475 1447 1096 -2949 2451 205
1303 205 -2749 2907 -429 -2347 2868 -593 -2288 2990 -743 -2419 3549 -1505 -2019 3998 -2660
1318 -2660 -912 3684 -3348 328 2671 -3125 947 1722 -2506 887 1438 -2323 949 1416 -2642 1595
1334 1595 864 -2674 2391 -305 -1844 2478 -1279 -607 1742 -1381 50 1019 -941 -88 1056 -940
1350 -940 -260 1572 -1712 359 1565 -2560 1618 648 -2558 2547 -559 -1821 2600 -1174 -1179 2291
1366 2291 -1171 -1090 2397 -1396 -1100 2888 -2247 -463 2999 -3093 662 2259 -3125 1374 1304 -2461
1382 -2461 1252 1049 -2166 970 1478 -2754 1480 1474 -3487 2733 325 -3191 3591 -1312 -1778 3274
1398C274n438J778K584m100J968J462k975J342J694l237J848J374l795L381l62
1413G98k968M085k197j051L015k344OJ696j257p61K252j304j769M319l612n62
1429a654N216o411K713L270o923N413m1m850N476j773k651L871j146k550L392
1444A352m07l621M784j721l155N848m144n78M544m828J715J837k987J420P03j103
1460c41m59K127j810p35L610m280J794K340n193M642j080k996M815l383P6K578
1476A705k807Q78J206j400n28K584k285q99M646n477J905L863p483N891rn794
1492d004P183l390k132M865l196m25K153n78k083K476M56m214N086j720l469O275
1508C283m388n11M306m203J041J791j761m91K104r46k289M651l565p59N279o618
$$ plain form
1398 3274 -2164 -386 2198 -1902 66 1528 -1447 -105 1589 -1648 200 1574 -2221 1160 798
1413 798 -2170 1915 -282 -1333 1682 -662 -656 1040 -217 -978 1274 -30 -1799 2520 -1092 -1654
1429 -1654 3562 -2849 -136 3134 -3789 1624 1583 -3267 2209 436 -2215 1656 510 -2040 1352
1444 1352 945 -2676 2108 387 -2768 3080 -1064 -1642 2902 -1926 -211 1626 -1361 59 762 -341
1460 -341 -800 1327 -483 -1218 2392 -1888 -94 2246 -2947 1695 615 -2381 2434 -949 -873 1705
1476 1705 -1102 -224 982 -418 -946 1638 -647 -1546 3100 -2377 -472 3391 -4092 1799 1790 -4004
1492 -4004 3179 -211 -2343 2522 -674 -1099 1054 476 -1607 869 1325 -2889 2197 477 -2992 3283
1508 3283 -1105 -1616 2690 -1513 -472 1319 -442 -933 1171 225 -2064 2587 -978 -1737 3542 -3076
1524c076L663J650n848O459l467j123M663n392L205L70l059L411j743k54R30j00
1540B89p57J11J976l662K780R30m929N846k542k571N535m291M01K497k237K3J092
1557D91O00l453L859p8n427P816m292k974Q324p549J487M793o544L250J393l128
1573a432J046J822j900j227M459m268K36M616o439L948P89m506N265l303L34K003
1589A443l175L269k372N52J620l098L120j767l7J354k060K475k439J353R45l530
1605b347M581k815r71M120m297J589J520k346N84J259n57k442M543k645k808P578
1621D546p184J109O242r185N597J474o442N983j666k053K330k37r13o47L206l554
1637a394M48L887n816L636R76m428M385j666r90J678p93J65r16K147k064N1K675
$$ plain form
1524 -3076 587 2237 -3611 2848 -619 -1742 2921 -2471 734 1104 -1955 1456 -287 -541 389 289
1540 289 -468 -357 1619 -2043 737 1667 -3262 2584 42 -2529 3006 -1285 -884 1613 -624 -601 491
1557 491 1091 -2362 1497 1419 -4008 3808 -484 -3458 4866 -2683 -1196 3597 -2947 303 1696 -1432
1573 -1432 -386 1436 -464 -1691 2768 -1500 -1264 3352 -3087 861 1650 -2856 2409 -894 -560 1443
1589 1443 -1732 1537 -835 -283 1337 -1761 1359 -408 -445 909 -1151 1324 -1115 238 1183 -2347
1605 -2347 2234 -581 -1552 2568 -1729 -140 1380 -966 -382 877 320 -2122 2421 -224 -3032 4546
1621 4546 -2638 -1529 4713 -4472 1125 2599 -3843 2140 474 -1579 751 514 -399 -1046 2160 -1394
1637 -1394 -946 2941 -2875 761 1737 -2691 1694 28 -962 716 -77 88 -828 1319 -745 -694 1981
1654A981m189L317m90k596M276l917J884R53l502M627l543M28L153m815L368o9
1670H66k484K612q60o09J51J554k141R6L417n253L151J825n804N563j541k811
1686b268M313k589J7Q45J14q11m96L109m332K047K714o203N400p58m191N807l317
1703e99p95L199k556K69J110l26j391J823j05k395L546k345m56K964l714K568
1719G97l87j764L096l161J930K08k447L559k732N27J586k470K044j091L70J46
1735B11j013K168k650J583Q43l130L476j496j230K565j830J41O96N2j170Q58J225
1752A299l364L324m92l298N096l358o01L865m238J896J005k316J596k71j09n45
1768e11J037k86j475K747k234J13K182l095K106j05j452J824j363P70l54r3Q54
$$ plain form
1654 1981 -2208 1109 619 -1977 2299 -1618 266 1219 -2283 2344 -1199 -771 2382 -2433 935 866
1670 866 -1618 994 134 -475 -324 1230 -911 -815 2602 -2651 500 2325 -3479 2084 543 -2268
1686 -2268 2045 -544 -527 318 432 -379 -875 2234 -2098 -51 2663 -3540 1860 1102 -3089 2718 -599
1703 -599 -1394 1805 -751 -482 628 302 -1089 734 629 -1766 1780 -565 -1021 1943 -1771 797
1719 797 410 -1354 1742 -1419 511 719 -1728 1831 -901 -374 1212 -1258 786 -305 65 211
1735 211 -802 1366 -1284 299 1142 -1988 1488 -8 -1238 1327 -503 -362 334 386 -784 74 1299
1752 1299 -2065 1259 767 -2531 2565 -793 -1394 2471 -1767 129 1134 -1182 414 143 34 -511
1768 -511 526 240 -1235 1512 -722 -609 1573 -1522 584 479 -973 851 -512 258 -96 -189 665
1785F65j649J824j066l03J653k336J943o60r36K204k541J681O8j870K704j968
1801e87J47J397j657Q75n9q5l03M64K06j446K142j394o03K527k890J385Q18k146
1819a209J981r40k5M31m74P32j362J696r24r62K819l108J312J392l151K906j000
1836A14j135K150j703N44L05m15J89k48P22j091Q07N8j021J573j419O17M63j374
1854h64J724j391M92O55j583J878j360K61Q98j704J894j381K60J132k203K328
1870A036j233n85K104k457J511J33j414J650j028K44J37j24J91p00J350j424N03
1887a06J037k222K212r06q75K045k079J173K4r23J342j420J216n66n39J657k133
1904a063J540j16j357K111j827P38M89j274J445j147O46j4p10J298j492J125k61
$$ plain form
1785 665 -984 840 -226 -529 1124 -1212 731 71 -865 1339 -1202 479 547 -1323 1381 -587
1801 -587 -440 957 -700 175 116 31 -272 192 398 -1048 1094 -300 -903 1624 -1266 119 937 -1209
1819 -1209 772 -168 -193 238 -236 496 -866 830 -94 -1056 1763 -1345 -33 1359 -1792 1114 114
1836 114 -1021 1129 -574 -30 275 -140 49 -199 523 -568 239 297 -724 849 -570 47 510 -864
1854 -864 860 -531 -39 616 -967 911 -449 -188 710 -994 900 -481 -221 911 -1292 1036
1870 1036 -197 -782 1322 -1135 376 509 -905 745 -283 -39 98 -26 165 -535 815 -609 -106
1887 -106 931 -1291 921 15 -860 1185 -894 279 303 -620 722 -698 518 -48 -587 1070 -1063
1904 -1063 477 361 -996 1115 -712 26 515 -759 686 -461 185 171 -539 759 -733 392 131
1921A31p92J671j981J457j51j386K389k315J112P02k212K596j670J1J425j978
1937i91J647q20j22R19j391J428j004J65Q10j514J586r42q5R04j231J192r19M60
1955I2K67j201J921j895Q42R17k470K830j662m10K213k789K015m65j090K086k205
1972a004J440j40j173J920j811R52K09j091J390j174P23k27l32R69j481J485p41
1989h6m87J600k070J619m02j045K046k170J360N9j471K265k070R30O54j898K205
2006A039j495K10J002j624J524r14J63M86r99J368j419Q78K72j525K148j727M37
2023a76J033j966J984j203K9J120j859J903j177j33J482k137J708m87p90J460
2039G91j398R00k93k65P57j126J222q71P9R11j657J695r14l22J462j998J636n28
$$ plain form
1921 131 -661 1010 -971 486 335 -1051 1338 -977 135 837 -1375 1221 -449 -438 987 -991
1937 -991 656 -164 -286 633 -758 670 -334 -169 641 -873 713 -229 -314 590 -641 551 -368 92
1955 92 359 -842 1079 -816 26 943 -1527 1303 -359 -769 1444 -1345 670 205 -885 1201 -1004
1972 -1004 436 296 -877 1043 -768 184 393 -698 692 -482 241 14 -318 651 -830 655 -86
1989 -86 -573 1027 -1043 576 174 -871 1175 -995 365 424 -1047 1218 -852 78 732 -1166 1039
2006 1039 -456 -246 756 -868 656 -258 -95 391 -608 760 -659 219 491 -1034 1114 -613 -176
2023 -176 857 -1109 875 -328 -299 821 -1038 865 -312 -445 1037 -1100 608 121 -669 791
2039 791 -607 293 0 -265 492 -634 588 -283 -204 707 -950 745 -169 -491 971 -1027 609 81
2057H1q31J846j986J216L7j221J833j628P24M45j328J521j061K94L90q20R99r28
2075d17O03n7o05J188j373R53l4r82J612j558Q47K61j361J942j595M19R67j864
2093a054J803q53m10J321j472R50j24n23P62p10N16k97M7K28n33P87q08M60K43
2112C33r99J363j062J84Q24j498J495p52l63J327j682J256k28r17J589j495O83
2129E8M53j276J379p91p1P08q71O03j87r7J95k08K84m26M68k46k14O47q00N86
2149A94j08m15Q01r04O25l4o52J099j059M95M04j157J287p16j94R12j087P54j80
2168F5l85P51q02N18m5m21P31p07L23K15n86N65k54m2J36j11J43k55L53k91J9
2189h0L76o49N69j69l16N85n87M16j32k50O57q45N72P9p57J072p63nP38r81O05
$$ plain form
2057 81 -750 1096 -890 326 363 -858 975 -653 71 516 -812 709 -352 -58 332 -488 511 -417
2075 -417 186 129 -476 712 -661 292 258 -724 888 -670 177 438 -923 1019 -576 -157 810 -1054
2093 -1054 749 -104 -514 807 -665 285 161 -362 400 -310 206 -91 -44 184 -349 438 -370 90 333
2112 333 -666 697 -365 -181 643 -855 640 -112 -475 852 -830 426 198 -719 870 -625 58
2129 58 511 -765 614 -177 -248 460 -411 192 5 -92 103 -105 179 -247 221 -25 -239 408 -392 194
2149 194 86 -329 472 -432 193 159 -493 606 -453 42 446 -711 576 -140 -334 578 -509 245 65
2168 65 -320 431 -371 147 102 -319 412 -295 28 243 -343 222 -32 -74 62 -49 94 -161 192 -99 -80
2189 -80 296 -353 216 47 -269 316 -271 145 13 -237 420 -425 147 226 -531 541 -222 -227 511 -470 135
2210A35N5m89N00k80J13m8j7J51l28L96k05j06L48l80J68L5l9m5l1L41o13M80
2232A41J34q58J098o07l22J094j172N03M03r41Q28l25j53M22m59L52j82l5K53
2251A74l43K58q4p2J27m4nj44L32l35Q2L67o86N89j24m06P15o72L15J52n40P24
2273C80o47K62L26q26R41n19k78R42r89L73M19p74M95P1l84J95K26l97Q2M84p56
2294c74M07L19q25P26j62l68N18l24J08p4J21k0k96O53o87J95N45j011Q55j77
2314A29n64R07o99J85K82n08M49k38N6K1q8K15l62L88k02j08M10n79N04j44l50
2335b96O86o45K77J84m92M99k63QR1n2P5l01N76n50OP54j125P53J44r69J151n74
2357f3k81P52n73O9J84L2l46K39L27r01R41k48p54J327j036P3Q55j117O45N6m20
$$ plain form
2210 135 190 -299 201 -79 34 -14 -31 120 -208 188 -17 -123 225 -155 13 48 9 -36 -67 274 -339 141
2232 141 275 -583 515 -92 -414 680 -492 11 414 -527 301 -24 -177 245 -214 138 -44 -79 174
2251 174 -169 89 5 -67 60 16 11 -133 199 -136 -54 313 -373 216 92 -314 401 -271 44 196 -344 380
2273 380 -267 -5 321 -505 436 -83 -361 581 -408 -35 384 -390 105 176 -208 -13 213 -184 -102 382 -374
2294 -374 33 352 -473 253 91 -277 241 -83 25 -49 72 52 -244 409 -278 -83 462 -549 306 129
2314 129 -435 472 -227 -42 240 -268 181 -57 -1 20 -68 147 -215 173 -29 -137 273 -306 198 54 -296
2335 -296 390 -255 22 206 -286 213 -50 -42 49 -3 72 -229 347 -203 -197 557 -568 185 329 -640 511 -63
2357 -63 -344 408 -165 -96 88 120 -226 13 340 -561 380 132 -622 705 -331 -258 597 -520 125 181 -239
2378b39L60j52J09k84M24k20l27Q58r36M03M39j022R68l98k68O77o82L96q1j14
2398h9J89k48L85n17M61o6n86J109j098L71P35j523J423m31q25J483j120J54O22
2417D29p19K93P5L0m21N35k5q45J338r16k24J290j489P29L47r56Q08k79j7q0K05
2438A08N1o93J200r68r1J327j842J190K24j436J687r55j71R37r87N15Oj99P5M5
2458B3J20n14Q12o56o1J000j540J202m1j277J873j314M4J075j386R01j78k65L35
2477A53l23N56r04Q15K4j230J879j301k15J592j840Q41N14j167P60J04m59n6Q31
2496E74q75j43J483j962J021P43k136K186q85q27J878j746P65L32r66J029p52
2513b81L67Ml47O20p70P29l88k12Q72j253J030j95q06J382j185L53N14q77O26
$$ plain form
2378 -239 121 -31 78 -206 218 -2 -329 529 -407 -4 435 -587 381 -17 -285 392 -290 106 25 -89
2398 -89 100 -148 237 -280 181 115 -471 638 -460 -89 646 -877 546 115 -710 773 -347 -193 429
2417 429 -290 3 78 108 -313 222 197 -648 690 -226 -450 840 -649 80 427 -529 279 0 -17 -97 108
2438 108 159 -534 666 -302 -393 934 -908 282 506 -930 757 -198 -369 568 -419 96 102 -97 -22 23
2458 23 143 -371 441 -215 -276 724 -816 386 345 -932 941 -373 -329 746 -640 261 83 -182 153
2477 153 -170 386 -518 297 321 -909 970 -331 -546 1046 -794 47 561 -606 154 258 -201 -257 574
2496 574 -301 -444 1039 -923 98 841 -1295 891 6 -821 1057 -689 76 408 -558 471 -281
2513 -281 86 90 -257 363 -407 322 -66 -278 594 -659 371 176 -630 752 -433 -80 434 -443 183
2532A83k27J84m28M21K72j380J919j095q41K556k648Q92J483k730J998k6j489
2549i56J494l58n96M46M68j016M08R93j926J473J42j742K121j128l53J273j245
2566e02O91k10j4K09o13J053j106N03N73j506J660r24l05J344j665J203j80q97
2584f86J482j260L66N94r65N67R1k92j82P88o79m34J807k113P29J545k958K294
2602F94Mk165K616j260n78J385q67m4K21M72j037M99R83k152J792N0j980K439
2620A072j127p38J664j143m5O58k14o18P47J66j372J747p60r35K089j923O35Q97
2638H00j790J699q30l09J187j461J035j39o97R88o68J24J14Q2k64q4R03j454R64
2657B00M94j903K059p41j067J938j280q9Q77n18l07M46M66j543J431K15k197K757
$$ plain form
2532 183 -44 140 -288 133 405 -975 944 -151 -992 1564 -1084 -192 1291 -1439 559 533 -956
2549 -956 538 180 -416 30 498 -518 -110 883 -1043 430 572 -1170 951 -177 -530 743 -502
2566 -502 189 -21 -35 174 -439 614 -492 11 584 -922 738 -186 -491 853 -812 391 211 -686
2584 -686 796 -464 -98 496 -469 98 189 -103 -285 503 -176 -610 1197 -916 -187 1358 -1600 694
2602 694 698 -1467 1149 -111 -689 696 -171 -215 6 478 -559 -60 923 -1229 563 613 -1367 1072
2620 1072 -55 -793 871 -272 -317 341 127 -491 256 422 -950 797 37 -898 1191 -732 -97 800
2638 800 -990 709 -121 -430 757 -704 331 192 -505 483 -185 -61 53 135 -129 -213 690 -764 200
2657 200 694 -1209 850 109 -958 980 -300 -389 488 -30 -337 109 575 -968 463 678 -1519 1238
2675A238j186j384K938k266K2J881j994N44R10j033m9J037p86n40J673j511O4
2692d42J541k067J202L10j377J448q06N3M47o93P63o59L20J77o42Q45p23L91O0
2711A48n70J008j095O02M01j356J551p17o01J380j032k5P66n01l95Q57k00j144
2729i23J861j012r99K568k255J77K044k640J252Q14j849J218J83r11L75O67r45
2746c75LJ309j702O39J076k012J447R2j330J392n19l50N56j55k28O6M98q56N36
2765H7L58j174J301o27m27J254j422Q17K34j122J344p87j68Q75q80K87L28m10
2783a32q8N73l94m73J295j162o9J484j903R16P37j763J395p7r73R37o7n95K87
2802g2O48j121M26J000j898J346L53j872J999o51j020J686r88k74R38n72k84O66
$$ plain form
2675 1238 52 -1332 1606 -660 -638 1243 -751 -207 703 -330 -379 658 -128 -668 1005 -506 -442
2692 -442 1099 -968 234 544 -833 615 -191 -138 309 -384 379 -280 40 217 -425 420 -303 88 148
2711 148 -422 586 -509 93 494 -862 689 -28 -629 751 -281 -306 460 -41 -436 421 221 -923
2729 -923 938 -74 -1073 1495 -760 -583 1461 -1179 73 887 -962 256 439 -472 -97 570 -375
2746 -375 -372 937 -765 -126 950 -1062 385 477 -853 539 20 -330 226 71 -157 -91 407 -449 87
2765 87 445 -729 572 -55 -482 772 -650 167 401 -721 623 -164 -332 543 -337 -50 278 -132
2783 -132 -220 353 -41 -514 781 -381 -450 1034 -869 47 784 -979 416 339 -634 303 236 -359 -72
2802 -72 576 -545 -119 881 -1017 329 682 -1190 809 158 -862 824 -164 -438 500 -72 -356 310
2820C10j69o96J077n25o03J400j235K32Q95j380R75q3o61Q77o06J25K11k51J39
2839C2q5K36m50M42l2o49J121r16RJ037j466R09K75j184J129k68n76O97q2n29
2859c50M14L86j086Q83K57j471J671n79j005J833j288j32J205j161K73N43n55
2876a62p8N73l31m87J113q42k41J287j447N68O70j321J016j34o00P07k99j31J96
2895E7J09l68K03L27q05Q22k55o02J169j060K78P15j246R70j42o50Q81m93q1L24
2915A53j12k16J99K74p84P58mr74J341p27m49J293j162K36P05r16L27L80m65j11
2935b54O89n75k81J156j226K98R68j590J080J36j118J236n49k95O59m57O2Q2J01
2954A22k98J74K61o97P38k56m43R09q31K69L99p62O21j75k28L65j93j3pK32m13
$$ plain form
2820 310 141 -555 522 -3 -606 794 -441 -209 686 -694 281 198 -463 414 -192 -67 144 -107 32
2839 32 -53 183 -267 175 143 -506 615 -301 -292 745 -721 188 463 -721 408 140 -436 261 179 -350
2859 -350 64 450 -636 247 504 -967 704 125 -880 953 -335 -467 738 -423 -150 393 -162
2876 -162 -240 333 2 -485 628 -214 -455 832 -615 -47 623 -698 318 184 -416 291 -8 -139 57
2895 57 166 -202 1 328 -477 345 90 -512 657 -403 -125 590 -656 314 172 -478 403 -90 -171 153
2915 153 41 -175 24 298 -486 272 268 -706 635 -92 -541 752 -410 -174 531 -385 -58 322 -143 -254
2935 -254 435 -140 -421 735 -491 -193 775 -815 265 401 -717 519 -30 -325 334 -123 -61 21 122
2954 122 -176 -2 259 -438 300 44 -399 510 -321 -52 347 -415 206 31 -197 168 -25 -38 -45 187 -226
2975b26K26L59r32R59k55p86J420j112K7J071j377P13L44r44O84L6m53K13L17
2994B84n18Q0O58r84N08M48j113R73j75o27Q26m22p1K08rj35o4M89p11M14L25
3015C84j006J075m20n23J114r97L29M29q32P09k29k68M64l12J8J40k6k24L06p5
3035E6l89P62o50qQ14j133O64K62r72R73l79k66N21l37P9j14L17k82j87Q15r91
3056d45M19N76j229J001o9q27R81l79l56N76j63l78M55M4o68P96k30n92J032p91
3076b47L6O72r02O29j08l41N48n36L72q8k60N21n39K87O5k98L53l10K46j26j08
3097a34M03n56L92N5m89O05l04j25K94j32p8mL47n55K64M47j027R27r3q99J267
3118F05p43k45R24q21J75L62l97M7K08l5l75N55k24l89P84o32M7N06o52L68J6
$$ plain form
2975 -226 0 359 -573 386 131 -655 765 -347 -320 751 -626 87 431 -513 171 207 -246 -33 284
2994 284 -234 -154 504 -480 28 476 -637 336 161 -466 360 -62 -133 75 66 -69 -133 356 -355 59 384
3015 384 -622 453 33 -490 624 -373 -44 385 -447 262 33 -235 229 -83 -65 75 49 -175 131 56
3035 56 -333 429 -221 -229 585 -548 116 378 -594 379 0 -266 255 -82 -3 -117 200 -82 -269 546 -445
3056 -445 -26 550 -679 322 253 -574 407 28 -328 248 85 -293 162 206 -462 334 104 -488 544 -247
3076 -247 -211 461 -441 188 80 -261 287 -249 123 35 -225 296 -243 44 109 -189 164 -146 100 -26 -134
3097 -134 269 -287 105 160 -329 276 -28 -153 141 9 -69 -73 274 -281 -17 430 -597 330 237 -662 605
3118 605 -138 -383 541 -280 -105 257 -140 -93 115 80 -295 260 36 -353 431 -201 -154 352 -300 68 84
3139H4j70J34j30K78l94K55J41n69P00l95j47N62o27L77l1k33L97m72L75o6l18
3160b49N38m37Q1K46k99J29j3O8k25K64M0n30P52m46k56Q53q44K66M16p16M96
3181A34o6j82J40rO4l09M63k33k86P04o62J52M35o70M29lk30J76k9L9k41L76k00
3204hk52O33o25J85L70o67N60j87j95M01m07L08j25j14L38m40L38n4k44L44k42
3225h3R8k2J1N2k16L82l56O1L45n85M72q4l04M61l64J42K5j05K03l43L98k29j60
3248b01N57o55L48J67n68N85k49j36L09k44J09o7J29j28m8L00m30K93N7l89M84
3269B23l01kK39l05K78k18J02O6k75M08l39P7K33m28M07k07o5K84l52K91j58l6
3291g8K36l76L62j71r8L09l63K58o5j19K39k76K30j19n0K48l73L30j19j55L59
$$ plain form
3139 84 -86 48 -82 196 -198 57 198 -371 329 -66 -213 349 -278 99 68 -165 232 -240 135 69 -249
3160 -249 289 -148 -67 179 -120 9 -4 64 -161 103 143 -387 365 -81 -337 516 -328 -62 354 -362 134
3181 134 68 -114 26 17 81 -228 235 2 -284 420 -242 -90 345 -325 104 101 -129 47 18 57 -184 192 -8
3204 -8 -260 373 -252 -67 303 -364 196 9 -186 215 -192 116 -9 -123 215 -225 113 59 -185 159 -83
3225 -83 15 -7 4 56 -160 222 -134 -73 272 -313 159 75 -229 232 -132 10 35 -70 133 -210 188 -41 -201
3248 -201 356 -299 49 216 -352 233 -16 -152 157 -87 22 -45 84 -44 -92 208 -222 71 128 -261 223
3269 223 -78 -80 159 -146 132 -86 16 82 -193 215 -124 -47 186 -242 165 -42 -107 177 -175 116 -42 -78
3291 -78 158 -218 144 -27 -125 184 -179 79 14 -105 134 -142 88 -31 -81 167 -206 124 5 -150 209
3312B09l78K23Lj98L03k99K09n1j42L28m11K75Ql09M64l59Q2J90l32L12j92M2
3334b3Q4j70K35k52J64K2k24L33l02J31J17l07L71k78R4J24l08L88l23J06J90
3355A72m22M72k95n3L66m60L31p3k04L33k94J76l4r6J92k39K29j31m1K00k83K54
3377A00j43k3K09l20L15j80n5K84m16L69j44j56L94m47K96j2k68M24m03K11Q5
3398A20l29M03l12J05J35k96L20k08M8Q2j79K25k19J36lj64L07l38K17M2l06M21
3420B07l23R3J53l25L56k68Q8J41l41M26l22O4K49m49M17j78j16L08l44K57j01
3441ho5J93k61K50j55RJ78l24L48k41JK62m25M18k03j19L68m48L29q3j97L86m21
3464b08K80k1k41M00l69J93L7k36L22k79J48K6j75K67k65J85n1j26K64l25K92
$$ plain form
3312 209 -169 54 57 -141 162 -137 72 21 -121 207 -204 71 79 -230 234 -125 -43 147 -185 127 -65 -23
3334 -23 61 -109 126 -126 38 60 -164 169 -133 -2 115 -192 179 -99 -5 119 -189 199 -124 -18 172
3355 172 -250 222 -73 -126 240 -220 111 38 -166 167 -127 49 15 -81 111 -128 101 -30 -71 129 -154 100
3377 100 -43 -66 143 -177 138 -42 -97 187 -229 140 -4 -160 234 -213 83 71 -197 227 -176 35 120
3398 120 -209 194 -118 -13 122 -174 146 -62 -14 68 -111 114 -105 31 28 -136 171 -167 50 92 -214 207
3420 207 -116 -23 130 -195 161 -107 -19 122 -219 207 -115 -51 198 -251 166 -12 -128 180 -164 93 -8
3441 -8 -73 120 -141 109 -46 -37 141 -183 165 -76 -75 187 -238 180 -23 -142 226 -222 107 24 -173 213 -208
3464 -208 72 51 -190 210 -159 34 71 -165 157 -122 26 52 -123 144 -121 64 13 -113 151 -174 118
3485A18j30j36L87m88L46pl54N60m78J49K31m75M89k74l6K77l76L22j58l4J87
3506A20k68K68j77K7J20k33K74k27J08O7k41L43l22J61J24l95M99l76M1L23n33
3527b97M96k12j53M27m89L32n1k11L54l54K04jj61K46k59K00r2l1J71k92L10k11
3549g4PK43m44M40j89j59M44n22L51j0l27N12m56J94J43l68M19l07N9J97l17K65
3571A01j45K4N8j19J85k25K12j00j07L07m09L18m2k83N00m65K22J08m12N38m20
3592a54J08K62n07N06k53j23M21m74K71K2k23K48j48P4o7O9j2j26K79l10J74P6
3614A13l32M32l27Q5K17m54M82k89o0M06n65M38j06k50M60m38K13P5k71L21k43
3635i3J24K8j71K30k05J31k0q3J47k03K34j85L8J91m06M70k67j57N45o50L67J39
$$ plain form
3485 118 -12 -148 239 -249 97 90 -264 296 -182 -33 198 -277 212 -62 -98 179 -197 125 -33 -67 120
3506 120 -148 120 -57 -30 90 -143 131 -96 12 79 -162 181 -141 20 144 -251 248 -128 -87 236 -297
3527 -297 199 -13 -166 261 -228 104 53 -158 196 -158 46 45 -116 130 -129 71 -21 -52 119 -173 137 -74
3549 -74 -67 176 -268 172 -17 -176 268 -254 97 87 -240 272 -184 10 153 -215 204 -103 -44 153 -164 101
3571 101 -44 -20 38 -81 104 -121 91 -9 -116 191 -218 100 58 -225 275 -190 32 140 -272 266 -154
3592 -154 -46 216 -291 215 -38 -161 260 -214 57 79 -144 104 -44 30 -37 32 20 -106 173 -137 37 113
3614 113 -219 213 -114 -29 188 -266 216 -73 -133 273 -292 146 40 -210 250 -188 25 100 -171 150 -93
3635 -93 31 59 -112 118 -87 44 24 -59 88 -115 119 -66 -28 163 -243 227 -40 -197 348 -302 65 204
3657B04n26N73l15n0L02l32K16j04L0M4j66K81k70J08J13k66K70j47J4O9j38J89
3679I9k26K09o5j72L92m42K28J43m48N18l25k1L38m72L84j27j70L79l83K10K2
3700G1k20K62j52L8JK2qj03K60l26J58J68m43M56j83j92L86l26J38L0r1J17j86
3723a23K79k53J5L40n42M09J1m24N47l06q5L20k87Q5O3m1p3Q6N5k55L30j65j41
3746a55L64l69J80R2k88L24k22N8J18k60K89k10K2J53k30K31j44K6Q6j85K48k21
3768i3Q0J51l40L38j28j51L09k30K1J07m4r1Q0J20l36L23om22N99l40j73N56n21
3791a91J29K68l82J94N7j26oJ41q0j62L42k70m2L55m13J99J14l04K73j06m0P6
3813B6m1M8j17J72j21m8K31k89K06j3j89L07k98J23J35l23L39j56j17K74k33M5
$$ plain form
3657 204 -322 251 -64 -114 188 -144 72 -32 -2 42 -124 157 -113 -5 108 -158 112 -35 -21 48 -90 99
3679 99 -127 82 17 -155 237 -205 23 166 -282 236 -89 -110 228 -244 140 13 -157 222 -161 49 71
3700 71 -149 113 -39 -1 0 22 14 -89 171 -155 3 171 -272 184 1 -191 195 -131 7 37 -54 63 -123
3723 -123 156 -97 -82 258 -284 125 136 -288 259 -47 -132 188 -99 -14 49 8 -65 21 76 -179 151 -14 -155
3746 -155 209 -160 20 112 -176 148 -74 -16 102 -158 131 -79 -57 96 -134 97 -47 -21 65 -120 128 -93
3768 -93 -13 138 -202 136 8 -143 166 -64 -43 64 20 -71 9 129 -207 116 110 -312 287 -53 -226 330 -191
3791 -191 -62 206 -176 18 75 -51 -57 84 4 -158 184 -86 -128 227 -186 13 127 -177 96 -10 -50 26
3813 26 -15 33 -84 88 -33 -81 150 -139 67 54 -135 172 -126 -3 132 -191 148 -8 -125 149 -84 -39
3835c9J19j22k3J28l3j98L22j78j80M83m54O2L94n42K90J43l80K61K4j89Q0J67
3857A35k28j9L40m25J66K75n34L99L8l96M19j68j40K40j06o0R2O6k18J67M6k92
3879b03L60j69j32L51l52J48J11k74K83j56l3J84k02R6J7m6%M2K2j50K30j52j17
3902a42L73l76Q6K93m59K83Q9l51K81K4k44J61J28l34K05J99n11M10N6n23O13
3923B61k50k68N23l65j2K72k38J9J33n9j32J98l5k46L84k10j25L83l72J03K00
3944A64l10J98Pj39J11J3r4L4J01j95J70K0k71L94k73p1M18n08K45J86m96M51
3966A55q9k71L63j60j12J94k1j92J88O5l46L84q1l43N19l01j29M31l52QK46j93
3988c7o2K25j05k17M08k49j84N46n14Q4M20o09L62R7m30M04j17j60K29r1p4J17
$$ plain form
3835 -39 80 -42 -65 63 30 -168 154 -24 -204 279 -175 -113 281 -261 29 172 -208 53 77 -112 -32 135
3857 135 -93 -112 228 -197 -31 244 -290 109 147 -249 170 2 -138 102 -4 -64 28 94 -124 43 89 -203
3879 -203 157 -12 -144 207 -145 3 114 -160 123 -33 -66 118 -84 12 29 -17 -17 25 47 -103 127 -25 -142
3902 -142 231 -145 -59 234 -225 58 147 -204 77 101 -143 18 146 -188 17 216 -295 115 171 -352 261
3923 261 11 -257 266 -99 -111 161 -77 -58 75 16 -116 82 47 -199 185 -25 -150 233 -139 -36 164
3944 164 -146 52 59 -80 31 44 -50 -16 85 -110 60 80 -191 203 -70 -141 277 -231 14 200 -296 155
3966 155 66 -205 158 -2 -114 80 59 -133 55 120 -226 158 77 -266 253 -48 -177 254 -98 -90 156 -37
3988 -37 -99 126 21 -196 212 -37 -221 325 -189 -105 315 -294 68 165 -265 139 22 -138 91 0 -74 43
4010D3pj48J97p9j41L12k83O7K27m05L26m2k41L28j91k0J41j11%J5J19k40J57
4033B4J46m40M62j14l87O33m18r8N15m99Q8L42m03O7L03l52K8L72m87J66L44n96
4055c04L89Q9m68M77j60j77K91j84K8K2L6o4k7J97k94J80J02l40L72j74j43L54
4077B02l35J23J39k77J97L2j90J56L4k30K16K6l48M45j78l04O33n07PM95o37L21
4099B0J92m91M00m6k25K03J4j39J9K15k87P0K88m46K36J74m30L26K6l17K65N1
4121A18k98K22J35m29L70J5m50N73k80k19N73n51J80K70m98M01r6k04L27k42M3
4142d0J40j77N4P3p1l1J52j52rK13k77J28J25k74K09Mj70J18O1j34j9K51k90L0
4166h6L74n71L16K34o62N96p5m91O49l00k39M98l10r9L52k21j29L41k18j20L68
$$ plain form
4010 43 36 -112 85 6 -135 177 -106 -39 188 -217 109 67 -174 154 -37 -57 84 -27 -27 -12 107 -133 24
4033 24 170 -270 192 78 -309 324 -94 -192 323 -176 -88 254 -149 -82 221 -131 -103 269 -218 -52 292 -304
4055 -304 85 174 -294 183 23 -154 137 -47 -19 3 39 -25 -52 145 -149 31 133 -207 165 -9 -152 202
4077 202 -133 -10 129 -148 49 81 -109 47 81 -149 67 93 -255 190 12 -292 341 -166 -159 336 -301 20
4099 20 212 -279 121 75 -150 53 67 -72 -53 162 -125 -55 233 -213 23 197 -233 93 119 -198 67 118
4121 118 -180 42 177 -252 118 133 -317 256 -24 -243 330 -221 -41 229 -269 132 36 -168 159 -83 -40
4142 -40 100 -77 -23 50 -21 -52 100 -52 -61 152 -125 3 128 -146 63 67 -103 15 76 -58 -77 174 -116 -86
4166 -86 288 -283 33 267 -395 201 126 -365 284 -16 -255 243 -67 -166 186 -35 -164 177 -41 -161 207
4187B07k95qK85l43J53J01k05J57m2k3J1J0J8r7J57j22j8J62k37J98l1j73L03
4210A68k58M8J99l26K22K0k21K14j9j73J64N4k71K30P2l77M08q1l56N37k85j75
4232b06M62l57j3L08k82qK53j91j13L47k48j07M10l88M4L35m34J99J27l07K24
4253E5Nj36Q2L7p7k1J48j72M6J33k51K15k8j55K28j59K8J12j96J51k5p5P9j8m6
4278d0M3P5j91J58L9k92L76j57k23M90m08QL74m54J87J75l25J63J14k16N2J91
4300A39k44K9K59l52J48J89l67K55M8k59K12jj36O9J12j76M2K01l51K22R9l71
4322b33L87j50j66L44k92R3J16k06J83p5m2Q5p5L5j4K7p1P1Jj30K20j53n2K52
4346A55k99J36J22k66K15k5j21R6K6q0k1J87k36O0K55m15K64J01m01L94j25j89
$$ plain form
4187 207 -88 -96 189 -154 -1 100 -105 52 10 -13 -2 8 26 -71 86 -36 -54 108 -129 69 38 -135 168
4210 168 -90 -42 157 -169 53 73 -148 66 47 -126 38 92 -179 51 123 -254 154 73 -283 254 -31 -206
4232 -206 256 -101 -114 194 -88 -96 157 -34 -147 200 -48 -155 255 -133 -89 246 -188 11 138 -169 55
4253 55 60 -76 6 43 -34 -55 93 -79 -33 100 -151 64 36 -119 109 -50 -22 90 -106 45 20 -55 24 6 -40
4278 -40 3 78 -113 45 84 -208 168 11 -212 278 -130 -122 252 -202 -15 160 -165 -2 112 -104 -52 139
4300 139 -105 -76 183 -169 -21 168 -199 56 104 -155 57 56 -80 -11 101 -75 -33 168 -183 39 138 -233
4322 -233 154 4 -162 182 -110 -17 99 -107 76 1 -41 44 -31 4 -10 17 -54 17 18 -112 108 -45 -97 155
4346 155 -144 -8 114 -152 63 38 -83 13 39 -41 -62 125 -111 -51 204 -211 53 154 -247 147 22 -167
4368a67L05j59n0J20j9j10R7Q7k73K54j9k77L79k16n9K60k61J04O4j15O9l4M1
4391B1p1O7pj08K02j71M7J03k06K31j36l3K08k72J85jj81K14j14j4O1rl4qJ14
4416H8j88J07J15l11L01q2j92L32k54K4J65j65L2J8L9j08R5P1k62L05j21j81L82
4439B10l23N0K17k90J73jr3Q1j8Ko1J10p1m4J56j98J39Mj39J99j88R6N3j78K19
4464A05j60K6J17j97J69r6J1O1j31J80j60O9J04k45K51j13j02K46k02L2J06r7
4486b6MN5Mj35J93q5j44L19k97O3K11l36K43l8j27J97j60Q6l1k8J07k07K19j02
4510a5p6K22k39J05N8j48J50q8K4K1n3P2r2J14q0OQ2j54J70j27J6J31k43K58j02
4535A2j40L07l10J25J20k68K40q3n7J10r1N7o4P7k6q4J69j60N3P7j50J18m1nK
$$ plain form
4368 -167 138 -21 -71 49 30 -80 17 104 -169 85 66 -211 168 -48 -107 153 -108 -4 60 -55 14 -20 21
4391 21 -50 17 10 -98 104 -67 -20 83 -123 108 -28 -61 147 -125 60 59 -122 92 -22 -36 25 16 -18 -26 88
4416 88 -100 7 122 -189 112 30 -162 170 -84 -60 105 -60 -28 -10 29 -79 16 87 -175 130 9 -172 210
4439 210 -113 -63 154 -136 37 36 -57 24 6 8 -53 57 -14 -58 98 -100 39 43 -96 103 -85 11 64 -114 105
4464 105 -55 -29 88 -109 60 -36 -25 36 -95 85 -75 -6 98 -147 104 -9 -111 135 -67 -35 71 -26
4486 -26 -22 33 37 -98 95 10 -134 185 -112 -49 162 -174 69 31 -96 101 -59 27 -4 -32 75 -132 87 -15
4510 -15 -91 131 -108 -3 55 -93 57 -31 -7 14 -39 33 -59 55 -25 -19 63 -91 79 -48 -32 99 -144 114 12
4535 12 -128 179 -131 -6 114 -154 86 3 -54 56 -35 22 -42 35 9 -75 94 -66 -13 64 -86 32 -9 -14 -12
4560a2jN9j65K18j28p7K80l17J60J03k92L02j42n8J88k11J48m5n9J27j50J10k6
4583A2o3J11r9L7jMQm7J06j51J04K3j47K02j44J5J04j67J70j06RJ02k04K29j23
4608a6p6K41k70J47P2k21K01p5m7R4m6pj5P0q6L6O0j58J50n9n2J46j59J13l3n1
4634d1J18j84J63l8j24K33k24P7J21k20J90n9o3J07r1M6k6K0ql5Q4p6M5mm7Q3
4660D7j00Q9l7n3J65j95R5O8k09K35j26o0J93j98J05J0r5J12q3L8Om1O1o7N7j0
4686Gl4L9l8K7k2M0j5n6J29j37M8R4j89J81o6r0J90j67O0N8j19J11o1RK6o7P6
4713C4o4J4M4o6N8j7k5K5j6K1l7N3m6rP0j07P8J6r6J38r7J5P7j26J08m8l7J07
4741F7j21O1K7p7Q9n6%L2l2J0kQk7K5J3m8N1m2NM9q0N8j3l4O8o5M8j6l4O9p8M4
$$ plain form
4560 -12 -13 46 -119 99 -29 -106 174 -143 17 120 -172 130 -12 -70 118 -93 55 10 -49 78 -72 38 12
4583 12 -51 60 -39 -2 -3 1 9 -38 68 -83 21 44 -103 99 -45 -30 74 -93 77 -29 -20 82 -122 107 -16
4608 -16 -92 149 -121 26 98 -123 78 3 -44 50 4 -3 -18 52 -34 2 62 -96 54 -5 -57 89 -70 43 10 -41
4634 -41 77 -107 56 18 -106 127 -97 -20 101 -119 71 12 -51 56 -35 11 -15 5 -3 -38 46 -30 15 11 -36 47
4660 47 -53 36 -1 -54 111 -84 11 79 -130 105 -21 -81 112 -86 19 29 -66 46 -37 1 7 -34 27 -40 17 7
4686 7 -27 12 -26 1 -21 19 4 -52 77 -60 -12 82 -107 74 8 -82 108 -59 1 59 -60 51 -10 -1 25 -42 34
4713 34 -30 -16 28 -38 20 3 -22 3 -13 8 -29 24 -22 -31 39 -68 10 26 -70 68 -29 -14 63 -63 45 -3 -40 67
4741 67 -54 7 34 -43 46 -10 -10 22 -10 0 -2 6 -21 4 17 -31 20 -22 -17 32 -48 10 -3 -37 31 -34 14 -2 -36 33 -45 -1
4773aL5r0R8n9j6Q0q2M3J9p0P4l1jQpnkL9o2L7J7p0P3l7nM6o5M0jl4M4l6L9l5
4807a7j3O8r6P0Kp1R3o0KN9r1P2l0pM6m1L7k7PK5n8M9l6J5K3n6N9l4J8K2o9P7
4839C8n6oO5r0O9j3l9N1m7M5m2K1K9r0R9m7l2J08j13M0L9p8P0l8J0J3j8M1p0P8
4869C7m2l2Q9r0L7K3p4R1n6K2Ml3O7q9O7rq3J33j03K3O4j05Q9l6k2N1n3N2m9K0
4899gL8p9P8l6k2M2l0L1m2M5qm0J01j15N3M1j44J60p6l4J15j16O7rm6O8p8O3k9
4928ik2Q4q9N1mm6N4k9J2j4K8j4m7J10j01K3P6j32J11l7m1R8j00N8ln4R0j05Q4
4957C2j4q4J42j23L7N0p7N7ok6j3L5mn2R9q7KJ03j38Q7Or3J19q7L8J1n4R6r6M9
4987IJ4q6J05n8kN5p3N9k5PLl3O1o4L9jn8J02q9L9Nm2O3q2P1k1p4J56j35L3Q1
$$ plain form
4773 -1 34 -56 42 -17 -33 47 -35 8 27 -43 31 0 -1 7 0 -5 -7 32 -30 7 24 -46 27 -10 -15 31 -34 6 5 -29 15 -21 18 -17
4807 -17 -30 38 -58 12 14 -57 36 -24 -22 37 -54 18 -12 -19 27 -14 23 -4 3 28 -30 19 -17 -2 21 -35 24 -10 8 30 -39 38
4839 38 -18 -24 41 -49 20 7 -32 19 -28 17 -25 -4 25 -65 34 -13 -45 63 -50 -10 29 -49 21 -17 -7 6 -12 29 -41 37
4869 37 -5 -37 52 -38 -1 22 -52 39 -17 5 9 -24 43 -46 21 12 -71 62 -41 -18 46 -59 30 -6 -28 23 -30 22 -27 -7
4899 -7 31 -48 30 -6 -28 14 -16 15 -27 18 10 -30 71 -44 9 50 -94 66 -10 -44 71 -45 22 13 -33 35 -43 20 -9
4928 -9 -31 53 -36 15 11 -35 19 -10 2 -12 16 2 -45 65 -36 -13 63 -69 42 5 -36 62 -38 20 17 -37 53 -52 32
4957 32 18 -66 76 -47 -10 40 -37 20 14 -12 -25 10 6 -46 53 -34 -32 71 -67 20 26 -67 52 -35 3 14 -40 56 -40 9
4987 9 23 -63 42 -16 -18 37 -36 23 -2 5 8 -25 36 -28 11 10 -48 54 -35 4 9 -33 30 -52 19 -2 -76 80 -55 -22 59
5018E9j46J12j9o1R0l4k5LM5m2qQ2j24Q2L8j31J29n4l6Q7p1L5j2JJ5n1Q2q1J9
5047a6O3j14J10n1l4Q7p9M6j0k6K4l8M6j5%K4n7O5m5J5L4q7J18q2j5J20j63J12
5075C2mj13J52q8k5P6m6mK9J9n7M2J9j19J33m5o9J25p9KL6l3Rj1N7p9L7O4j61
5104a01J50l5j07K02j74K5J12j58J16rp5R7m7qL1k9J2rJ6l2N3m3qP8j03O8%q8
5132f6J20p1j4Q3r9N6j7%J7m3Q0r9O3N4j60J57n1j16J97j15l6J38j18J7P3o3k2
5159c5Q9p6k7J30j26J8J14j61R7K7j15J13n7k1M8l1Oj0L3l2KN8j01P3J2j02J22
5186D8q0j3J04j18P1J4p4P5j6l9N3qn7O6Lq4J12m4r0J77j26k3J55j82Q3O7j34
5213f0O3L7p0J9N5n8k3J00q9j7J33j78R6P3j83J53kj42J47m8q0J10k8p5J15l6
$$ plain form
5018 59 -87 25 6 -55 35 1 -24 -21 24 -18 -26 56 -68 14 52 -79 50 -4 -40 47 -24 11 -1 0 15 -36 46 -35 -16
5047 -16 47 -67 43 -8 -42 45 -34 12 2 -24 0 -38 8 -7 -7 17 -40 25 -20 -5 29 -58 60 -22 -37 83 -80 32
5075 32 28 -85 67 -21 -46 30 -16 -20 9 28 -29 13 32 -87 46 1 -68 57 -22 -20 16 -17 -8 -19 38 -41 -4 60 -101
5104 -101 49 14 -93 109 -65 -40 72 -86 30 21 -54 43 -4 -12 19 -10 2 -7 9 -23 30 -13 -21 57 -46 22 22 -66
5132 -66 54 -17 -31 52 -47 9 -8 -8 9 -34 46 -53 10 64 -96 61 10 -106 91 -24 -60 78 -40 -23 50 -13 -35
5159 -35 54 -22 -49 81 -45 -27 87 -74 23 50 -65 48 -9 -30 18 -13 -7 -17 16 -16 -14 44 -57 16 28 -74 48
5186 48 -32 -45 59 -59 12 26 -48 27 11 -28 25 17 -40 26 29 -55 57 13 -77 100 -26 -49 106 -76 7 74 -60
5213 -60 3 40 -30 -11 44 -14 -37 63 -26 -43 90 -88 8 81 -102 51 49 -93 54 6 -74 36 8 -67 48 12
5239A2q2J37p6n0J43j41M7R0j59J35m6n3R6p5K5J8l4K8l9L9l9K4L6j09J28n4p4
5266g3J66j42OJ31j60P1P0j42N7O7j20N6J02j76R8P7k22J94j3j73K39j30n9J73
5290I7j40K7O0n9JK8Mp9J11k7j16J94j35j3J46j74O5M3r3O6J5n3L1K8o5L2O5j44
5318h5J15Lj43K27j63j6J86k31J28N2j66J60n5p1J05m2l2M1L2j11Q7L2j59J81
5342G5n6j20K06j45j3J20j05KO8k3p4J06l6j22K28j56n5K47k55R1J36k57J90m
5366D8j46J52m8n7P0Ko6P2J3j17J31n7n6J53j62N7P7j56J33l9n8R6o8J4jM0o5
5393c8K2Q8j73J40J4j99K39r4j13K39j74j5J60j44RJ23j07m9J77j53j9K10k39
5416i6Q7J32k63J77J4j61J67l6o8P0oo4M6M6j26R8L9j66J82q3q1J81j47L4P5j22
$$ plain form
5239 12 -70 67 -9 -59 84 -57 -10 80 -79 56 10 -43 53 -22 3 21 -13 15 -24 15 -24 0 36 -73 55 1 -73
5266 -73 93 -49 -43 88 -72 -1 69 -73 -16 51 -69 -13 89 -87 11 88 -134 60 47 -126 113 -17 -76 97
5290 97 -43 -16 44 -15 -14 14 18 -61 50 23 -93 101 -34 -47 99 -75 -10 33 -60 6 21 -32 -1 27 -38 -6 59 -85
5318 -85 30 33 -110 117 -46 -62 124 -107 21 73 -93 67 12 -59 46 4 -28 13 45 -66 21 53 -106 75
5342 75 19 -101 105 -40 -53 67 -38 -36 32 9 -65 41 5 -117 111 -45 -100 147 -108 -17 119 -138 52 48
5366 48 -98 54 6 -51 19 21 -45 27 40 -77 54 -3 -59 94 -68 -11 66 -90 43 4 -54 42 -26 -12 -13 27 -38
5393 -38 -16 72 -101 39 53 -146 93 -1 -114 125 -49 -64 96 -48 -39 84 -23 -72 105 -48 -67 143 -96
5416 -96 -9 123 -140 37 51 -110 57 21 -47 23 17 -47 -1 45 -81 17 56 -110 72 -11 -92 89 -58 -24 51 -71
5442g1P7Pm3M4Qm7K2O6j35J03K8j69K15r5j17K47k01K0J45j72N5P7j10K1R9j03
5468b9k7J64j86L2J67k33J21O6j94J70k0j04J05op8N4N4j40J06M0j80J89m3j40
$$ plain form
5442 -71 6 13 -30 14 22 -25 -3 63 -72 31 59 -110 105 10 -107 140 -61 -41 104 -68 -13 64 -46 -25 74 -29
5468 -29 -56 108 -78 -46 121 -112 9 75 -119 51 31 -73 32 26 -52 2 56 -84 22 62 -118 71 28 -112
$$ [...]
8191b6
##END NTUPLES=NMR FID
##END=
