##TITLE=1H_AM_NVYNE_AN
 
 8 sc, 
 5.04.2022
##JCAMPDX= 6.0         $$ Bruker NMR JCAMP-DX V2.0
##DATA TYPE= NMR FID
##DATA CLASS= NTUPLES
##ORIGIN= UXNMR, Bruker Analytische Messtechnik GmbH
##OWNER= root
$$ XWIN-NMR		Version 3.5
$$ Tue Apr  5 11:44:45 2022 Russian Standard Time (UT+4h)  she@DPX200
##.OBSERVE FREQUENCY= 200.131346
##.OBSERVE NUCLEUS= ^1H
##.DELAY= (6, 6)
##.ACQUISITION MODE= SIMULTANEOUS
##.ACQUISITION SCHEME= undefined
##.AVERAGES= 8
##.DIGITISER RES= 18
##SPECTROMETER/DATA SYSTEM= spect
##.PULSE SEQUENCE= zg30
##.SOLVENT NAME= CD2Cl2
##.SHIFT REFERENCE= (INTERNAL, CD2Cl2, 0, 15.7039)
##AUDIT TRAIL= $$ (NUMBER, WHEN, WHO, WHERE, WHAT)
$$ ##TITLE= Audit trail, XWIN-NMR		Version 3.5
$$ ##JCAMPDX= 5.01
$$ ##ORIGIN= Bruker BioSpin GmbH
$$ ##OWNER= she
$$ F:/spectra/data/she/nmr/H-F/1/audita.txt
$$ ##AUDIT TRAIL=  $$ (NUMBER, WHEN, WHO, WHERE, WHAT)
(   1,<2022-04-05 11:43:38.96 +0400>,<she>,<DPX200>,
      <created by zg, POWCHK disabled, PULCHK disabled
       configuration hash MD5:
       00 E9 B6 7A A2 85 ED C7 34 08 36 98 17 FE 4E 26
       data hash MD5: 16K
       49 47 51 30 3D 20 1B B7 16 63 2A C3 2C 51 B4 94>)
$$ ##END=
$$ 
$$ hash MD5
$$ DB 78 72 56 56 D9 E0 BD 38 57 54 BC 73 5B 5D EF
##$RELAX= 
##$RELAX= 
##$RELAX= 
##$RELAX= 
##$RELAX= 
##$RELAX= 
$$ Bruker specific parameters
$$ --------------------------
##$DU= <F:/spectra>
##$EXPNO= 1
##$NAME= <H-F>
##$PROCNO= 1
##$TYPE= <nmr>
##$USER= <she>
##$AMP= (0..31)
100 100 100 100 100 100 100 100 100 100 100 100 100 100 100 100 100 100 
100 100 100 100 100 100 100 100 100 100 100 100 100 100 
##$AQSEQ= 0
##$AQ_mod= 1
##$AUNM= <au_zg>
##$AUTOPOS= <>
##$BF1= 200.13
##$BF2= 200.13
##$BF3= 200.13
##$BF4= 200.13
##$BF5= 200.13
##$BF6= 200.13
##$BF7= 200.13
##$BF8= 200.13
##$BYTORDA= 1
##$CFDGTYP= 0
##$CFRGTYP= 5
##$CHEMSTR= <none>
##$CNST= (0..31)
1 1 145 1 1 1 1 1 1 1 1 1 1 1 1 1 1 1 1 1 1 1 1 1 1 1 1 1 1 1 1 1 
##$CPDPRG= <>
##$CPDPRG1= <>
##$CPDPRG2= <>
##$CPDPRG3= <>
##$CPDPRG4= <mlev>
##$CPDPRG5= <mlev>
##$CPDPRG6= <mlev>
##$CPDPRG7= <mlev>
##$CPDPRG8= <mlev>
##$CPDPRGB= <>
##$CPDPRGT= <>
##$D= (0..31)
0 1.2 0 0 0 0 0 0 0 0.06 0 0.03 0 0 0 0 0.0002 0 0 0 0 0 0 0 0 0 0 0 0 
0 0 0 
##$DATE= 1649144618
##$DBL= (0..7)
120 120 120 120 120 120 120 120 
##$DBP= (0..7)
150 150 150 150 150 150 150 150 
##$DBP07= 0
##$DBPNAM0= <>
##$DBPNAM1= <>
##$DBPNAM2= <>
##$DBPNAM3= <>
##$DBPNAM4= <>
##$DBPNAM5= <>
##$DBPNAM6= <>
##$DBPNAM7= <>
##$DBPOAL= (0..7)
0.5 0.5 0.5 0.5 0.5 0.5 0.5 0.5 
##$DBPOFFS= (0..7)
0 0 0 0 0 0 0 0 
##$DE= 6
##$DECBNUC= <off>
##$DECIM= 32
##$DECNUC= <off>
##$DECSTAT= 4
##$DIGMOD= 1
##$DIGTYP= 9
##$DL= (0..7)
0 120 120 120 120 120 120 120 
##$DP= (0..7)
150 150 150 150 150 150 150 150 
##$DP07= 0
##$DPNAME0= <>
##$DPNAME1= <>
##$DPNAME2= <>
##$DPNAME3= <>
##$DPNAME4= <>
##$DPNAME5= <>
##$DPNAME6= <>
##$DPNAME7= <>
##$DPOAL= (0..7)
0.5 0.5 0.5 0.5 0.5 0.5 0.5 0.5 
##$DPOFFS= (0..7)
0 0 0 0 0 0 0 0 
##$DQDMODE= 0
##$DR= 18
##$DS= 0
##$DSLIST= <SSSSSSSSSSSSSSS>
$$ [...]
##$SUBNAM2= <"">
##$SUBNAM3= <"">
##$SUBNAM4= <"">
##$SUBNAM5= <"">
##$SUBNAM6= <"">
##$SUBNAM7= <"">
##$SUBNAM8= <"">
##$SUBNAM9= <"">
##$SW= 18.0517287032376
##$SWIBOX= (0..15)
0 0 2 0 0 0 0 0 0 0 0 0 0 0 0 0 
##$SW_h= 3612.71676300578
##$TD= 16384
##$TD0= 1
##$TE= 0
##$TE2= 300
##$TE3= 300
##$TEG= 300
##$TL= (0..7)
0 120 120 120 120 120 120 120 
##$TP= (0..7)
150 150 150 150 150 150 150 150 
##$TP07= 0
##$TPNAME0= <>
##$TPNAME1= <>
##$TPNAME2= <>
##$TPNAME3= <>
##$TPNAME4= <>
##$TPNAME5= <>
##$TPNAME6= <>
##$TPNAME7= <>
##$TPOAL= (0..7)
0.5 0.5 0.5 0.5 0.5 0.5 0.5 0.5 
##$TPOFFS= (0..7)
0 0 0 0 0 0 0 0 
##$TUNHIN= 0
##$TUNHOUT= 0
##$TUNXOUT= 0
##$USERA1= <user>
##$USERA2= <user>
##$USERA3= <user>
##$USERA4= <user>
##$USERA5= <user>
##$V9= 5
##$VALIST= <valist>
##$VCLIST= <CCCCCCCCCCCCCCC>
##$VD= 0
##$VDLIST= <DDDDDDDDDDDDDDD>
##$VPLIST= <PPPPPPPPPPPPPPP>
##$VTLIST= <TTTTTTTTTTTTTTT>
##$WBST= 1024
##$WBSW= 4
##$XGAIN= (0..3)
0 0 0 0 
##$XL= 0
##$YL= 0
##$YMAX_a= 242935
##$YMIN_a= -218074
##$ZGOPTNS= <>
##$ZL1= 120
##$ZL2= 120
##$ZL3= 120
##$ZL4= 120
##$ABSF1= 10
##$ABSF2= 0
##$ABSG= 5
##$ABSL= 3
##$ALPHA= 0
##$AQORDER= 0
##$ASSFAC= 0
##$ASSFACI= 0
##$ASSFACX= 0
##$ASSWID= 0
##$AUNMP= <proc_1d>
##$AZFE= 0.1
##$AZFW= 0.1
##$BCFW= 1
##$BC_mod= 2
##$BYTORDP= 1
##$COROFFS= 0
##$CY= 11.3945322036743
##$DATMOD= 1
##$DC= 2
##$DFILT= <>
##$DTYPP= 0
##$F1P= 2.36226072786647
##$F2P= -0.459571619588291
##$FCOR= 0.5
##$FTSIZE= 0
##$FT_mod= 4
##$GAMMA= 1
##$GB= 0.15
##$INTBC= 1
##$INTSCL= 1
##$ISEN= 128
##$LB= 0.24
##$LEV0= 0
##$LPBIN= 0
##$MAXI= 10000
##$MC2= 0
##$MEAN= 0
##$ME_mod= 0
##$MI= 1.114404
##$NCOEF= 0
##$NC_proc= 0
##$NLEV= 6
##$NOISF1= 3.799351
##$NOISF2= 2.8
##$NSP= 1
##$NTH_PI= 0
##$NZP= 0
##$OFFSET= 15.70392
##$PC= 1
##$PHC0= -17749.95
##$PHC1= 14.00078
##$PH_mod= 1
##$PKNL= yes
##$PPARMOD= 0
##$PSCAL= 0
##$PSIGN= 0
##$REVERSE= no
##$SF= 200.130013532006
##$SI= 16384
##$SIGF1= 3
##$SIGF2= 2
##$SINO= 400
##$SIOLD= 16384
##$SREGLST= <1H.CDCl3>
##$SSB= 0
##$STSI= 0
##$STSR= 0
##$SW_p= 3612.71676300578
##$SYMM= 0
##$S_DEV= 0
##$TDeff= 0
##$TDoff= 0
##$TI= <>
##$TILT= no
##$TM1= 0
##$TM2= 0
##$TOPLEV= 0
##$USERP1= <user>
##$USERP2= <user>
##$USERP3= <user>
##$USERP4= <user>
##$USERP5= <user>
##$WDW= 1
##$XDIM= 8192
##$YMAX_p= 0
##$YMIN_p= 0
$$ End of Bruker specific parameters
$$ ---------------------------------
##NTUPLES= NMR FID
##VAR_NAME=  TIME,          FID/REAL,        FID/IMAG
##SYMBOL=    X,             R,               I
##VAR_TYPE=  INDEPENDENT,   DEPENDENT,       DEPENDENT
##VAR_FORM=  AFFN,          ASDF,            ASDF
##VAR_DIM=   8192,          8192,            8192
##UNITS=     SECONDS,       ARBITRARY UNITS, ARBITRARY UNITS
##FACTOR=    0.0002768,     1,               1
##FIRST=     0,             0,               0
##LAST=      2.2672688,     0,               0
##MIN=       0,             -218074,         0
##MAX=       2.2672688,     242935,          0
$$ Real data points
##PAGE= N=1
##DATA TABLE= (X++(R..R)), XYDATA
$$ [...]
1090d888J0766j0584O763j510k752M808m952M401l989L489k168k46L098m969M827
$$ -4888 5878 -4706 2057 547 -2205 2603 -2349 2052 -1937 1552 -616 -862 2236 -2733 2094
1105B094k965Q58q7J027k182J175L080q938J2532j0213J535R881j8039J8034r392
$$ 2094 -871 -13 -100 927 -1255 -80 3000 -5938 6594 -3619 -2084 7797 -10242 7792 -1600
1120a600l430J3742j6460J1104k005n065O800m032M69M83J663m536N013j994k835
$$ -1600 -5030 8712 -7748 3356 1351 -3714 3086 -946 -477 6 1669 -2867 2146 152 -2683
1135b683O448o565L389M47k063P58J521j780j346O248r523Q276k139o177J2604
$$ -2683 3765 -2800 589 1036 -1027 -269 1252 -528 -1874 4374 -5149 3127 988 -5189 7415
1150G415j3915R345j072p020J1734j1878Q302k832k838P277r277Q171m216j098
$$ 7415 -6500 2845 1773 -5247 6487 -5391 2911 79 -2759 4518 -4759 3412 -804 -1902
1164a902N284o366M055P6l269L185L08m764O545l674k538Q323r966O402L8n519
$$ -1902 3382 -2984 1071 1147 -2122 1063 1371 -3393 3152 -522 -3060 5263 -4703 1699 1737 -3782
1180c782P415n722K671q70J084j608K2M431r466J1047o574k680J1813j5302J0862
$$ -3782 3633 -2089 582 -288 796 -812 -790 3641 -5825 5222 -1352 -4032 7781 -7521 3341
1195C341r65q705J2703r200J072O133p845L549L115p173N721J42o371R024o716
$$ 3341 2376 -6329 6374 -2826 -1754 4379 -3466 83 3198 -3975 1746 1888 -4483 4541 -2175
1210b175J040M664p504O649l521L69J452k186K799l776M528l864J282K354n330
$$ -2175 -1135 3529 -3975 2674 -847 -478 974 -1212 1587 -2189 2339 -1525 -243 2111 -3219
1225c219O279m818J697J607l769M328l631K233m80j304K689l033J895L05k102
$$ -3219 3060 -1758 -61 1546 -2223 2105 -1526 707 227 -1077 1612 -1421 474 779 -1323
1240a323J964L40l301M531k394k567P547r103N441K030r252J1901q207K37P273
$$ -1323 641 981 -2320 2211 -183 -2750 4797 -4306 1135 3165 -6087 5814 -2393 -2156 5117
1255E117j0120P223j035m264N486k600j513L403j576k469N416m667L48M726p073
$$ 5117 -5003 2220 1185 -3079 2407 -193 -1706 1697 121 -2348 3068 -1599 -1251 3475 -3598
1270c598N105j68m401N571k787j632M305l212q63N009o088K939K672p306Q132
$$ -3598 1507 1339 -3062 2509 -278 -1910 2395 -817 -1680 3329 -2759 180 2852 -4454 3678
1285C678m590j331O349p905N583j081l116N043m207J634R21k074J501O8j445J605
$$ 3678 -912 -2243 4106 -3799 1784 703 -2413 2630 -1577 57 978 -1096 405 473 -972 633
1301F33l01j769L378l474J699J363m183N119l535K36K977m338L257o30j710K208
$$ 633 332 -1437 1941 -1533 166 1529 -2654 2465 -1070 -834 2143 -2195 1062 432 -1278 930
1317I30o59j609K647j214k101N040n253K066K898o642O778l119k170N887n768
$$ 930 271 -1338 1309 95 -2006 3034 -2219 -153 2745 -3897 2881 -238 -2408 3479 -2289
1332b289K043K599m910L252J126m970N384j822l529P168o731K342L438p162O755
$$ -2289 -246 2353 -2557 695 1821 -3149 2235 413 -3116 4052 -2679 -337 3101 -4061 2694
1347B694k703k288N023m133Q21K297k973Q56K379m272L278K91m339O329m856O78
$$ 2694 -9 -2297 2726 -1407 -586 1711 -1262 -406 1973 -2299 979 1270 -3069 3260 -1596 -918
1363i18L797o074N082j701j963L911l348R37J606k596J420J115l216L361j321
$$ -918 2879 -3195 1887 186 -1777 2134 -1214 -277 1329 -1267 153 1268 -1948 1413 92
1378I2j882M432m882K880O09l743M812l294K74K244k691J019J277k262R52J988
$$ 92 -1790 2642 -2240 640 1249 -2494 2318 -976 -702 1542 -1149 -130 1147 -1115 -163 1825
1394A825m597M777j780l029O882p253L664J926o284O974l802j049M474m467J370
$$ 1825 -2772 2005 225 -2804 4078 -3175 489 2415 -3869 3105 -697 -1746 2728 -1739 -369
1409c69K460m211K519J518n105N692k663k174N859o308L424Q70l982M294k159
$$ -369 2091 -2120 399 1917 -3188 2504 -159 -2333 3526 -2782 642 1512 -2470 1824 -335
1424c35n98J936r99j285K910k328m40L819n690M734j206l137O079o122L325P24
$$ -335 -933 1003 4 -1281 1629 -699 -1139 2680 -3010 1724 518 -2619 3460 -2662 663 1387
1440A387l829M481k706m4J937j822r3K377l239J679J761n160O342m181m45N080
$$ 1387 -2442 2039 -667 -711 1226 -596 -689 1688 -1551 128 1889 -3271 3071 -1110 -1555 3525
1456C525p255N834j757k558M739l902J137J266j494m86K858l312Q50L270o360
$$ 3525 -3730 2104 347 -2211 2528 -1374 -237 1029 -465 -951 1907 -1405 -555 2715 -3645
1471c645O204k619k475O150o361L267R57l579L158m53k154K460j6l518N632m631
$$ -3645 2559 -60 -2535 3615 -2746 521 1478 -2101 1057 604 -1550 910 894 -2624 3008 -1623
1487a623O86M233p516P442l999j046N239o809N477k425o62K578k966K268j331
$$ -1623 -937 3296 -4220 3222 -777 -1823 3416 -3393 2084 -341 -1003 1575 -1391 877 -454
1502d54Q14r18J247j088nJ847l669M407l385P72K363m563M661k635j61J934j642
$$ -454 360 -558 689 -399 -404 1443 -2226 2181 -1204 -432 1931 -2632 2029 -606 -767 1167 -475
1519d75j00J420o70k226N456o328L345K531q270J0399p223K98O513r485P338j958
$$ -475 -575 845 175 -2051 3405 -2923 422 2953 -5317 5082 -2141 -1843 4670 -4815 2523 565
1535E65l035M728k789n89K413j147k255N148n109J657L311o816O833l622o99L693
$$ 565 -2470 2258 -531 -1120 1293 146 -2109 3039 -2070 -413 2898 -3918 2915 -707 -1406 2287
1551B287m120K631r82N03j225J996j432r11L975n916N379k400j594M797n977N016
$$ 2287 -1833 798 -184 319 -906 1090 -342 -1253 2722 -3194 2185 -215 -1809 2988 -2989 2027
1567B027k691j4K341l744L929k923J177N40j423J154j94l44m95K551m471M416
$$ 2027 -664 -678 1663 -2081 1848 -1075 102 642 -781 373 179 -165 -660 1891 -2580 1836
1583A836j422l454P552q308M962P81n826P579n491J371J879k522R67O77l26k270
$$ 1836 414 -3040 4512 -3796 1166 1947 -3879 3700 -1791 -420 1459 -1063 -96 581 255 -2015
1599b015N137n554K386K980p438Q175m594j139N554o136L018J190l297J828J853
$$ -2015 3122 -2432 -46 2934 -4504 3671 -923 -2062 3492 -2644 374 1564 -1733 95 1948
1614A948m606L974Lm910P656o465K011L185o445O510m067R23J333k270K518k790
$$ 1948 -2658 1316 1319 -3591 4065 -2400 -389 2796 -3649 2861 -1206 -283 1050 -1220 1298 -1492
1630a492L047k719J377P11k713L722l381K100o51m82J258j894K527k909K425q06
$$ -1492 1555 -1164 213 924 -1789 1933 -1448 652 1 -481 777 -1117 1410 -1499 926 120
1646A20j334K889l023J855l54k84k87J170r68r84L925n932N107j044m406Q179
$$ 120 -1214 1675 -1348 507 153 -131 -418 752 -216 -1200 2725 -3207 1900 856 -3550 4629
1662D629p926L654K210o338O529l237q86L014k123n66K526j876j137M303n173
$$ 4629 -3297 357 2567 -3771 2758 -479 -1365 1649 -474 -1040 1486 -390 -1527 2776 -2397
1677b397K907J155m485N099k967q1J876j544l0J054k84k022M160m244J707K293
$$ -2397 510 1665 -2820 2279 -688 -769 1107 -437 -467 587 303 -1719 2441 -1803 -96 2197
1693B197n583O337m157L45L116m787M425k659N25J111j989K185j853J184l97k62
$$ 2197 -3386 2951 -1206 -861 2255 -2532 1893 -766 -241 870 -1119 1066 -787 397 0 -262
1709b62N73m40N3K9O00j728K507k093K71K225m013L983k127n31K597l134K179
$$ -262 311 -129 -76 -47 553 -1175 1332 -761 -490 1735 -2278 1705 -422 -953 1644 -1490 689
1726F89p35L6l58Q54m16j283L386m342L036K25l629N220m154J070K186l568K395
$$ 689 -46 -10 -368 486 70 -1213 2173 -2169 867 1092 -2537 2683 -1471 -401 1785 -1783 612
1743F12P3j802J524N17k676L172j427j580M025m495K740K59k835L669k726J023
$$ 612 685 -1117 407 924 -1752 1420 -7 -1587 2438 -2057 683 942 -1893 1776 -950 73
1759G3K97p46N86n00Q60j488J822j421K70J222k357K519j651L25P84j301J300
$$ 73 370 -376 210 -290 570 -918 904 -517 -247 975 -1382 1137 -514 -189 595 -706 594
1776E94j058Q00n25J94J49l93N71q00J071j239J186p30l34J783k943L083j823
$$ 594 -464 336 -189 5 154 -239 332 -468 603 -636 550 -180 -514 1269 -1674 1409 -414
1793d14m90K734l686K920j038q92J949j803Q97j50J29o53J025o29o15K007k580
$$ -414 -904 1830 -1856 1064 26 -866 1083 -720 177 27 156 -497 528 -101 -716 1291 -1289
1810a289J816j31j457K125j627M05O38p12r6J024j218L07J328k696K824j466o97
$$ -1289 527 396 -1061 1064 -563 -158 480 -232 -328 696 -522 -215 1113 -1583 1241 -225 -922
1827i22K594l351K678j017p11J789k013J627j056N55j37l47R38j448J594j273
$$ -922 1672 -1679 999 -18 -729 1060 -953 674 -382 173 36 -311 627 -821 773 -500
1843e00N23L61j024J320j267R32m68lL80o39P74p96P69p13N93k83k99J097j860
$$ -500 23 384 -640 680 -587 345 -123 -126 254 -385 389 -407 362 -351 242 -41 -340 757 -1103
1862a103K175j642L12J329k550K814k001M75J036j898J914j293N18m4m2M3l32
$$ -1103 1072 -570 -258 1071 -1479 1335 -666 -191 845 -1053 861 -432 86 42 0 43 -289
1879b89R25j511J669j186J34J040j808J861j285M58K00m95N83q15J255j582J443
$$ -289 636 -875 794 -392 -258 782 -1026 835 -450 8 208 -287 296 -519 736 -846 597
1896E97o54o25J897k590K354j266k26J529k129J990j391O21J27p19J105j252J175
$$ 597 -57 -682 1215 -1375 979 -287 -513 1016 -1113 877 -514 107 234 -485 620 -632 543
1913E43r33N94j56l74R06j307J479j354Q94j34q08J650k069J875j174J93Q08j620
$$ 543 -390 204 48 -326 580 -727 752 -602 292 158 -650 1000 -1069 806 -368 -175 633 -987
1931i87K082k068J528n79n72J653k389K497j808M85J016k091K355j799Q31R2o86
$$ -987 1095 -973 555 -24 -596 1057 -1332 1165 -643 -158 858 -1233 1122 -677 154 246 -440
1948d40Q80q35Q17r57J107r54L35O53j580J997j793J132k29o73J400j888K017
$$ -440 440 -395 422 -535 572 -382 -47 606 -974 1023 -770 362 133 -540 860 -1028 989
1965I89j703R07K55j523K448k640J963o77p21J766k196K015j413N79K77r53J379
$$ 989 -714 193 448 -1075 1373 -1267 696 19 -702 1064 -1132 883 -530 49 326 -627 752
1982G52j532J437j101N33J86r21J484j708J607j157L89N55j451K084k219J707
$$ 752 -780 657 -444 89 275 -646 838 -870 737 -420 -31 524 -927 1157 -1062 645
1998F45o60o44J830k444K240j366K22P60j354J571j545J318q75J96O17j359J777
$$ 645 -15 -659 1171 -1273 967 -399 -177 583 -771 800 -745 573 -302 -106 511 -848 929
2015I29j728J239m92l06R63j432J738j785J401n04p27J900k528K325j393R6J151
$$ 929 -799 440 -52 -358 605 -827 911 -874 527 23 -704 1196 -1332 993 -400 -304 847
2032H47j935K099j704R92j93n11J038j373J497j334Q69k02n40J181j577J616j259
$$ 847 -1088 1011 -693 299 106 -405 633 -740 757 -577 292 90 -450 731 -846 770 -489
2049d89N99J49q44J404j771J814j362L88Q71j972K447k117J114J84j318J925j898
$$ -489 110 259 -585 819 -952 862 -500 -112 759 -1213 1234 -883 231 415 -903 1022 -876
2066h76J368o19q6O48j034J218j144Q46m44N2L04o60J055j349J374r86K33P02
$$ -876 492 -127 -213 435 -599 619 -525 321 -123 -71 233 -427 628 -721 653 -333 -100 602
2084F02j580K075j986J255j00j071J920k243J935j061j22J223j926J981j459O18
$$ 602 -978 1097 -889 366 266 -805 1115 -1128 807 -254 -376 847 -1079 902 -557 61
2100F1K67r68J350j321R31m09l3L24m83N68o27P07p25N92k47l36J012j484J504
$$ 61 328 -640 710 -611 320 -89 -122 202 -281 287 -340 367 -358 234 -13 -349 663 -821 683
2119F83j005J78P14j427J769j592R26qq74J466j625J382q39R6O67j248J514j396
$$ 683 -322 -144 570 -857 912 -680 246 238 -636 830 -795 587 -252 -156 511 -737 777 -619
2137f19Q90j47o29J176j345J084n55L2L27n21O33p02P33o35L39J04n68R01r80
$$ -619 271 124 -505 671 -674 410 -145 -113 214 -307 326 -376 357 -278 61 165 -403 498 -482
2156d82P96m10mL57o18Q33r68R05n68l2P67j363J544j194M30M83j231J518j286
$$ -482 314 -96 -100 257 -361 472 -496 409 -159 -191 576 -787 757 -437 -7 476 -755 763 -523
2175e23P15n9n31R06j048J003p32K29L49p97R48q03M34j0k46K65j90J83l50O38
$$ -523 192 133 -398 508 -540 463 -269 -40 309 -488 460 -343 91 81 -165 100 -90 93 -257 381
2195C81p76N89m5o51J171j280R86l63l65R37j215J198q89L45L23r61J353j306
$$ 381 -395 194 149 -502 669 -611 375 12 -353 584 -631 567 -322 23 346 -615 738 -568
2213e68P62O1p63J056r14M55Jk24K07p9j1j12M07o55O31k95j55N28p68Q15o64
$$ -568 194 255 -508 548 -366 89 90 -134 73 -6 -17 -129 278 -377 254 -41 -196 332 -436 379 -285
2234b85M23o4m38R55j291J282p75j62J184j792J637p84k85J091j319R43l13j65
$$ -285 138 74 -364 591 -700 582 -193 -355 829 -963 674 -110 -395 696 -623 320 7 -158
2252a58L24j91j6J0K66n89O62m16nL62n36N29m62M00l29J62J41n76R93j132Q09
$$ -158 166 -25 -41 -31 235 -354 308 -108 -113 249 -287 242 -220 180 -149 13 154 -422 571 -561 248
2273B48j00o82J194j262R10l16k75P29r45Q84n93K26J45m31N97o08M69k77R0L2
$$ 248 148 -534 660 -602 308 -8 -283 446 -499 385 -208 18 163 -268 329 -279 190 -87 3 35
2293C5j12K72n28P62p53M18J17o88J045j001N48O0n14O15m26J86j74L90n50L78
$$ 35 -77 195 -333 429 -324 94 211 -477 568 -433 115 175 -339 276 -150 36 -138 252 -298 80
2313H0J43p97J275j236O12K96j026J211q48K65J58k26J04o7K95o68R45q49K73
$$ 80 223 -574 701 -535 77 373 -653 558 -290 -25 133 -93 11 -56 239 -429 516 -333 -60
2332f0N59j240J432r92J71N80r38Q21m62J27J7K7j30P8K09o35R34q73M12K72q79
$$ -60 499 -741 691 -301 -130 450 -488 333 -129 -2 15 42 -88 -10 199 -436 498 -375 37 309 -570
2353e70J145j016N99m8m67P60p96O44m05J71K5j89L87n91P82q45O45j07o25J250
$$ -570 575 -441 158 110 -357 403 -393 251 -154 17 42 -147 240 -351 431 -414 231 124 -501 749
2373G49j432J049k50o02J083j023O01j47p3j1J86j17l47R70j353J124k71q25J590
$$ 749 -683 366 116 -486 597 -426 175 28 -45 -56 130 13 -334 636 -717 407 136 -689 901
2392I01j644R60K9p61R30n98J27M9K20o50Q09l90n14J441j831J385k82r21J677
$$ 901 -743 217 246 -515 415 -183 -56 -7 213 -437 372 -18 -532 909 -922 463 181 -740 937
2411I37j687J045j55m87P06n90M22m27N58o14M17M6o34J130j307J031l82m06J031
$$ 937 -750 295 140 -347 359 -231 191 -236 322 -292 125 171 -463 667 -640 391 9 -397 634
2430F34j286J100o15P0L36n20M98m60N76q22R08n54k93J353k058J962r61n13J741
$$ 634 -652 448 -167 -97 239 -281 217 -243 333 -489 419 -135 -428 925 -1133 829 -132 -645 1096
2449A096k172J644m68o49J108q02J67K30k1o23J152j052J91J028j936J982j106
$$ 1096 -1076 568 100 -549 559 -243 -76 154 133 -490 662 -390 -199 829 -1107 875 -231
2466b31k32J301j602J179n13R7o5J70l9n20J266j745J537n68q25J952k285J701
$$ -231 -463 838 -764 415 -98 -1 -66 104 65 -455 811 -934 603 35 -790 1162 -1123 578
2484E78n19o69J413j535J127m60j05L77l10Q1j0K74p49J165j173N87M95j624K225
$$ 578 59 -610 803 -732 395 -65 -170 207 -103 -22 -32 242 -507 658 -515 72 567 -1057 1168
2503A168j928P83O82j749J959j366M19K77m62K95j88M65j068J545j371K92J269
$$ 1168 -760 23 705 -1044 915 -451 -32 245 -217 78 -110 355 -713 832 -539 -247 1022
2520A022k431K468j319l99J699j886J056P9o72L29N77j193Q64M26j929K642j999
$$ 1022 -1409 1059 -260 -659 1040 -846 210 289 -383 -54 523 -670 194 620 -1309 1333 -666
2537f66K91J564k642K521j387n5J118j465J209p46M24l01K01M8m72R03j152J097
$$ -666 -375 1189 -1453 1068 -319 -374 744 -721 488 -258 166 -135 66 114 -358 545 -607 490
2555D90p29J22N68j159J408j232O74O0o91R99r27O14l36L01m27L99J15j099K087
$$ 490 -239 -117 451 -708 700 -532 142 202 -489 510 -417 197 -139 162 -265 134 249 -850 1237
2574A237k342J422M52k400L336k669P19J440k591K200o98p56J172m04p58J269
$$ 1237 -1105 317 769 -1631 1705 -964 -245 1195 -1396 804 106 -650 522 118 -640 629
2590F29o04r02K200k346J137P46k189K362j330q3R22q07J19L33l8q98J726j707
$$ 629 25 -877 1323 -1023 114 860 -1329 1033 -297 -380 542 -265 -146 187 149 -749 977 -730
2608g30O20J074k451K742j764O4J474k154J864r68M5N45p15O34m74L43k94L23
$$ -730 -110 964 -1487 1255 -509 -445 1029 -1125 739 -229 -184 361 -354 280 -194 149 -145 178
2626A78l62L18q1m18J077j568J527p33o42J920k401J758l30j078J680j273L56
$$ 178 -184 134 53 -365 712 -856 671 -62 -704 1216 -1185 573 243 -835 845 -428 -72
2643g2K78j72m86R70o22o09K030k581J654L29k211K851j871k4J559j770O65Q18
$$ -72 206 34 -452 518 -104 -713 1317 -1264 390 719 -1492 1359 -512 -536 1023 -747 -82 736
2661G36j459P08R58k341K331p37j515L072k999J395P41k185K310j343Q9O42n94
$$ 736 -723 -15 943 -1398 933 196 -1319 1753 -1246 149 890 -1295 1015 -328 -239 403 -191
2678a91J32J31J25p23J148j018L05O10j228J326r58L48K13n97P63p47N98l42M4
$$ -191 -59 72 197 -526 622 -396 -91 519 -709 617 -341 7 220 -377 386 -361 237 -105 -61
2697f1J98k82K15j95M25q41J128q36j66J497k389K190q06j092K479k552J274N49
$$ -61 137 -145 70 -125 300 -541 587 -249 -415 1082 -1307 883 77 -1015 1464 -1088 186 735
2715G35j732J584l84q77J194l27j106J975j530p0J845k656J956j94j509K102j360
$$ 735 -997 587 203 -674 520 193 -913 1062 -468 -538 1307 -1349 607 413 -1096 1006 -354
2732c54j1R23p76j71J069j084N5J390k252J841l07j468K468k142Q01P06j536J402
$$ -354 -365 558 -218 -389 680 -404 -349 1041 -1211 630 323 -1145 1323 -819 -18 688 -848 554
2750E54o03k01N16k91j79N10m31m1O33j030J027o04r8Q34j336J368q61k0Q55j270
$$ 554 -49 -250 266 -25 -204 306 -125 -166 467 -563 464 -140 -238 596 -740 628 -233 -253 602 -668
2770f68J076m56j91M61k65j19K45J40q55J366j145J04J257k104J856n75r67J849
$$ -668 408 -48 -239 222 -43 -162 83 223 -632 734 -411 -307 950 -1154 702 127 -840 1009
2788A009j546L36Q73j246N51O97j524J221J44j685K364j654n4J724k369J707k67
$$ 1009 -537 -201 672 -574 -23 674 -850 371 515 -1170 1194 -460 -514 1210 -1159 548 281
2805B81j030J424q81n7O29m15l49R92r58J60R32j641J516o11n69J381j467Q80
$$ 281 -749 675 -206 -263 366 -49 -398 594 -364 -204 728 -913 603 -8 -577 804 -663 217
2823B17k9n81P04l88m0K25n3l20O60o92L11L70j056J411j150L22O97j431J521
$$ 217 188 -393 311 -77 -117 108 55 -265 395 -297 14 384 -672 739 -411 -89 608 -823 698
2842F98r29k9Q30j068O46N9m88K99L32q94Q60q1j020J731j565N18Q70j782J669
$$ 698 -231 -260 570 -498 148 207 -281 18 350 -544 316 235 -785 946 -619 -101 769 -1013 656
2861F56o74n14J141q66LP02o72q0J018j457R76K70j529K042j477J53J167j712
$$ 656 -18 -532 609 -257 -254 448 -224 -304 714 -743 233 503 -1026 1016 -461 -308 859 -853
2879h53J308l57m97P54l99j67M39j64m77J035j070M38N22j283J431r47J00O81
$$ -853 455 98 -399 355 -44 -211 228 64 -413 622 -448 -10 512 -771 660 -287 -187 494
2897D94j062R17m27r9L48k45l7K39j44k45P37j003P85p6q41J510j511Q08K81j180
$$ 494 -568 349 -78 -177 171 -74 -111 128 -16 -261 476 -527 258 182 -659 851 -660 148 429 -751
2917g51J430r67J64M74o09K70J90l19p4P25j120Q67K0j071J648j388M00P22j327
$$ -751 679 -288 -124 350 -259 11 201 -118 -192 533 -587 280 300 -771 877 -511 -111 611 -716
2936g16J123l39m49O65k46m54Q55n48l46J267j597J064Q7j224J777j483N55M63
$$ -716 407 68 -381 284 38 -416 439 -109 -455 812 -785 279 366 -858 919 -564 -9 454
2954D54j057J033n94J22J15p7o3Q8J25m54P21p39M30J10o54R60q94M82O4m78O06
$$ 454 -603 430 -164 -42 73 -4 -67 21 146 -308 413 -326 104 214 -440 520 -374 108 172 -306 300
2975C00m63J79nN7k85M46k91k62R69j401J181k89q89J736j785R78K60j236J466
$$ 300 -163 16 11 68 -217 229 -62 -324 645 -756 425 136 -753 983 -802 176 436 -800 666
2994F66r02J3O05n86P4M65n68J20O25j152J051l18o12J188j114N16J27m31L48
$$ 666 -236 -223 382 -204 -130 335 -233 -113 512 -640 411 93 -519 669 -445 71 198 -233 115
3013A15r9J8k57O59q75N98J19r66J491j358O06L95j148J332r90L42K89o62O94
$$ 115 16 34 -223 436 -439 159 278 -688 803 -555 51 446 -702 630 -360 -18 271 -391 303
3032C03m50J25R9j17m2K28k75Q9L01p16R37p50J29O52j181J212p15l2O25q26O55
$$ 303 -147 -22 77 -40 -82 146 -129 -40 261 -455 482 -268 -139 513 -668 544 -171 -203 422 -404 251
3053B51l34J25j34K25j34k88Q68j230R99j77q20J424j295N23M03r09P33j18m45
$$ 251 -83 42 -92 133 -1 -289 579 -651 348 171 -649 775 -520 3 406 -503 230 112 -333
3072c33M89N1p39J035o52k35J094j427J084k59n77J025r64N56j29q6J49j74K97
$$ -333 156 207 -532 503 -149 -384 710 -717 367 108 -469 556 -408 148 19 -67 82 -92 205
3091B05n05O20m92J39K85o18P17n76L06l0k07L57m52M99m59K75K3l00M31m18L33
$$ 205 -300 320 -172 -33 252 -366 351 -225 81 51 -156 201 -251 248 -211 64 87 -213 218 -200 133
3112A33k97L05k33k9M76r16J070p41mQ29j269J107m37l30P28n94J51J97j36k57
$$ 133 -164 141 -92 -121 355 -561 509 -232 -236 593 -676 431 -6 -336 392 -202 -51 146 10 -247
3132b47O36o33J37N89j103J074n08k59P84q20M67q8o5m5J82j22k14O86r56P70
$$ -247 389 -244 -107 482 -621 453 -55 -314 470 -350 117 29 -36 -81 101 -21 -235 451 -505 265
3152B65j65n83J052j023N49M3m29N15l83K34j79K21k31J05J52m19N63n14L28q1
$$ 265 100 -483 569 -454 95 138 -291 224 -159 75 -104 117 -114 -9 143 -276 287 -227 101 20
3172B0j27L15m91O23o20L82O2n54Q49p99M45K0l76M88l92K35k11K87k94J06K80
$$ 20 -107 208 -283 340 -280 102 164 -390 459 -340 105 125 -251 237 -155 80 -131 156 -138 -32 248
3193B48o68Q03n88J04L79o10N15k29j6M2J35k63J32K58p01R04o47M2O21r97R27
$$ 248 -420 383 -205 -101 278 -332 183 -46 -62 -20 115 -148 -16 242 -459 445 -202 -160 461 -536 391
3214C91m86o4M36n11L73k36K05k36K17j1l15N72o40M56j01k45M36m50L21j88J24
$$ 391 -95 -159 277 -234 139 -97 108 -128 89 78 -237 335 -305 151 50 -195 241 -209 112 -76 48
3235D8r8J0J76l89N11m74K63L3l00M59n01M37k87R0J57l99N80o03M18o8k96N32
$$ 48 -50 -40 136 -253 258 -216 47 80 -220 239 -262 175 -112 -22 135 -264 316 -287 131 63 -233 299
3257B99n40L81j76J1R2j52K38l57M16l64J67J48m51N72m66K17N7k36K55k24K23
$$ 299 -241 140 -36 -25 67 -85 153 -204 212 -152 15 163 -288 284 -182 35 92 -144 111 -113 110
3278A10k65K88k13QK89n53O30m59R6K72m85N16l99K21m0q9K03l14L88l97L06p3
$$ 110 -155 133 -80 -72 217 -336 294 -165 -69 203 -282 234 -165 56 16 -73 130 -184 204 -193 113 40
3300D0k08M02m63L81j99pJ51k07K42k66K58k17J24L2k34M08m71L73j71r2L26m53
$$ 40 -168 234 -229 152 -47 -54 97 -110 132 -134 124 -93 31 63 -171 237 -234 139 -32 -124 202 -251
3322b51M58l59J74N6k69M09m57L83k00m9K67l85L94k78J37jj16K11k60K74k37
$$ -251 207 -152 22 78 -191 218 -239 144 -56 -105 162 -223 171 -107 30 29 -87 124 -136 138 -99
3343i9J54m0j00K34l16L25k72J55Jj87L55m48M04k39LK49m37M80m04K01M9k55
$$ -99 55 15 -85 149 -167 158 -114 41 42 -145 210 -238 166 -73 -70 179 -258 222 -182 19 68 -187
3365a87L78l81L01j80M6Q5k14L06l36K98j51l2K17l29L25k37J21j4o3J15j85K90
$$ -187 191 -190 111 -69 -23 62 -152 154 -182 116 -35 -67 150 -179 146 -91 30 16 -47 68 -117 173
3387A73l35K74r7j44L69m83M26k34j6K18l41L61l28K29r8o6K43l54L81l19J63
$$ 173 -162 112 15 -129 240 -243 183 -51 -67 151 -190 171 -157 72 -26 -92 151 -203 178 -141 22
3408B2M9k55L79l83K78j25l9J69k22K42k34K04j34M2Q5k45L61l68K70q6j27L16
$$ 22 71 -184 195 -188 90 -35 -74 95 -127 115 -119 85 -49 -7 78 -167 194 -174 96 10 -117 199
3430A99m14M00k87R5J27l13M02l82K47p3r5K21k81K73k47J71o0q0K30l21L10k16
$$ 199 -215 185 -102 -7 120 -193 209 -173 74 1 -94 127 -154 119 -128 43 -17 -97 133 -188 122 -94
3452i4Q0N9j58K38k93L04k33J20M8k59M23m64L68j43j32L70m90M66k87L8J85l25
$$ -94 -14 45 -113 125 -168 136 -97 23 71 -188 235 -229 139 -4 -136 234 -256 210 -77 -39 146 -179
3474a79L34k53J48p1RO0j46K33k85K64j69RJ58k89L28k95K28j02p1K47l98M36
$$ -179 155 -98 50 -21 -12 48 -98 135 -150 114 -55 -46 112 -177 151 -144 84 -18 -89 158 -240 196
3496A96l35J37R6l00M34m34L00r2j30L14l80L38k20O6P7j59K00k19K22j94J50
$$ 196 -139 -2 94 -206 228 -206 94 2 -128 186 -194 144 -76 -10 67 -92 108 -111 111 -83 67
3517F7n9r6K33l38L65k84J13J06l09M33m37K99r2j39L28m21L89k50Q0Q7k31L06
$$ 67 8 -88 145 -193 172 -112 1 107 -202 231 -206 93 1 -138 190 -231 158 -92 -12 75 -156 150
3539A50l09K44j11l0J43j97K10k03J82j40O5L9j82L35l76L19j52p8L00m46M46
$$ 150 -159 85 -26 -56 87 -110 100 -103 79 -61 4 43 -139 196 -180 139 -13 -91 209 -237 209
3560B09l22J14J17l26M47m25K67o5j39K70l32L13k01N1P4j66J83j61J47j42J36
$$ 209 -113 1 118 -208 239 -186 81 16 -123 147 -185 128 -73 -22 52 -114 69 -92 55 -87 49
3581D9q8LJ43l07M06l55J78P5k99M16m28L36j45o5K77m08M09l04J24R3k80L56
$$ 49 -39 -36 107 -200 206 -149 29 104 -195 221 -207 129 -16 -81 196 -212 197 -107 17 110 -170 186
3603A86l16K06p2n5J16j67J85j91J69j16M4L5j43K39k84K61j72K0J68l34M33l80
$$ 186 -130 76 4 -51 65 -102 83 -108 61 -55 -11 24 -119 120 -164 97 -75 -55 113 -221 212 -168
3625a68K11M3l05M74m63K99m3j98L05k84J81o8K3l1L0N3j82K78k89J94j9j57K49
$$ -168 43 86 -219 255 -208 91 48 -150 155 -129 52 -16 7 -24 6 59 -123 155 -134 60 41 -116 133
3648A33k51J82j20Q0m7l7K04l63M17l13M6K50m51M75l35Q2J80l12L10k21R4nk8
$$ 133 -118 64 -56 24 -23 -60 144 -219 198 -115 -69 181 -270 205 -130 -48 132 -180 130 -91 3 -2 -30
3671c0O5q1J20j59J73j42P4J6j39K52k93K55j50j5J93l26L50k51P5R9k02K25k11
$$ -30 35 -46 74 -85 88 -54 20 36 -103 149 -144 111 -39 -54 139 -187 163 -88 -13 86 -116 109 -102
3694a02J72j46R4J6j87L44l86K70k8k45L68k98J08Q7j48M9J07j43QK26l89L72
$$ -102 70 -76 18 34 -153 191 -195 75 47 -198 170 -128 -20 67 -81 -32 75 -68 -60 166 -223 149
3716A49j25k24M77m94K80K6k47L01k11R0j7L0o4N0M3k01L02k93J20J09k85L24
$$ 149 24 -200 277 -217 63 89 -158 143 -68 22 5 35 -29 21 64 -137 165 -128 -8 101 -184 140
3738A40k28P8N4j13J06p5O2q3J20j21M9N1j56K36k49K00q6q4K83l97L68j90p3
$$ 140 -88 -10 44 -69 37 -38 24 -59 61 -60 -11 40 -116 120 -129 71 -15 -99 184 -213 155 -35 -108
3761a08L02l75K61m7j29J70o1p4R7K9k12L13k25l7L07m40L27n6k03K94j96kJ32
$$ -108 194 -181 80 33 -96 74 13 -61 36 65 -147 166 -59 -96 211 -229 98 42 -161 133 -63 -65 67
3784F7p0j31K78k47KL18n13M45j16k74N25m99K38J07l22L08j23n8J04lj26J82
$$ 67 -3 -134 144 -103 -101 217 -296 149 33 -241 284 -215 23 130 -192 116 -7 -65 39 36 -90 92
3806I2j12o3K44l19K41o1j26K46k64J85q7kP5j35J47j28R6p4M8j0n9J69k67K79
$$ 92 -20 -83 161 -158 83 22 -104 142 -122 63 -24 -26 49 -86 61 -67 29 -45 3 -7 -66 103 -164 115
3830A15j68n8K98m24L47r9j83L56k91O7J54k02O8J59l08K20P3l86N20l67lL92
$$ 115 -53 -111 187 -237 110 11 -172 184 -107 -40 114 -88 -20 139 -169 51 124 -262 258 -109 -112 280
3852B80n60M03n3k56L45k09k9J60q8j25L02k83K5L07m99M32j30k43M66m39J86
$$ 280 -280 123 70 -186 159 -50 -79 81 -7 -132 170 -113 -88 219 -280 152 22 -221 245 -194 -8
3873hJ02k55K19m9r7J17qj48K57k11K5K09l40L37j92l2K33l28K98j44m4J45j46
$$ -8 94 -161 58 9 -88 29 21 -127 130 -81 -56 153 -187 150 -42 -74 159 -169 129 -15 -59 86 -60
3896f0Q6qj3o9J65j93R4J24l59M42l11NL27n20M33j25k10L76k79KK36k52L7K65
$$ -60 26 18 5 -64 101 -92 2 126 -233 209 -102 -97 230 -290 143 18 -192 184 -95 -93 143 -109 -72 193
3920A93m13K94O2m28N77m04J6L61n02L51n0j88K12m5j39J71j3k42M04l24N3K95
$$ 193 -220 74 136 -292 285 -119 -103 258 -244 107 57 -131 81 36 -103 68 55 -187 217 -107 -54 241
3942B41n29M83k02j61L94l99K04L2j88J91m3j36J83q2j20L05l43J97O6l06M43
$$ 241 -288 195 -7 -168 226 -173 31 63 -125 66 23 -113 70 -12 -132 173 -170 27 93 -213 230
3963B30l78J39J44l37L58k19J8J32j34M8N5n0p8K40l25K15O2l76N27l96N2L03
$$ 230 -148 -9 135 -202 156 -63 -45 87 -47 1 56 6 -72 168 -157 58 120 -256 271 -125 -73 230
3985B30m75L43j9k53L04r7k28L98k83q4M72o28M13L2m68O57m97J20K59m34L48
$$ 230 -245 98 79 -174 130 33 -195 203 -80 -164 308 -320 93 125 -343 314 -183 -63 196 -238 110
4006A10r9j05J46k0j36J66nk08L54l26J23J55l52L53j91m3K03k09P7P9j42P5Q8
$$ 110 11 -94 52 32 -104 62 57 -151 203 -123 0 155 -197 156 -35 -78 125 -84 -7 72 -70 5 93
4029I3k53K93j70j04L83n21M19r0l15N73n70L13Q1l94M63k64l5K27k05RJ97k29
$$ 93 -160 133 -37 -141 242 -279 140 50 -265 308 -262 51 132 -262 201 -63 -98 129 -76 -67 130 -99
4051i9N4K28l96L39p1k50M13l20O1K04k75J04J52k81J52J58m49N07k56k03N96
$$ -99 -45 183 -213 126 55 -195 218 -102 -41 163 -112 -8 144 -137 15 173 -276 231 -25 -228 368
4072C68p00M32N7m91O29m32M9K70l81K52j3j61J78m5j31K38j87J3J78k91K74j37
$$ 368 -332 100 157 -334 295 -137 -88 182 -199 53 40 -121 57 12 -119 119 -68 -55 123 -168 106 -31
4094c1m0J75k20J79q4PJ9Qk3k3J49k63K85j75q7L84n36M24r3k99N35m85J57K25
$$ -31 -71 104 -116 63 -21 -14 5 13 -10 -33 116 -147 138 -37 -124 260 -276 148 55 -244 291 -194 -37 188
4118A88m27L27j3l03L84j79j83M73m84J81K42n25N13k16j41L66l51J48Q4j58M5
$$ 188 -239 88 75 -228 156 -23 -206 267 -217 -36 206 -319 194 -22 -163 203 -148 0 84 -74 -29
4139b9J38k03P5J87l82L81j63j65M16m50K50N2k82L19j92k4J56j44K6J26k02J33
$$ -29 109 -94 -19 168 -214 167 4 -161 255 -195 55 107 -175 144 -48 -72 84 -60 -34 92 -110 23
4161B3K1k11L26k84R9J44l44L91k41j8K38l12K24k5j47J63l2j19K09j01j33L44
$$ 23 44 -167 159 -125 -26 118 -226 165 -76 -94 144 -168 56 31 -116 47 15 -104 105 4 -129 215
4183B15l72J56J72m22M55k38j04L53l57J39J37k60J38J09l02K58j0k87M52l48
$$ 215 -157 -1 171 -251 204 -34 -138 215 -142 -3 134 -126 12 121 -181 77 67 -220 232 -116
4203a16J3L31m76L38j8k60L17j62p0K19j76k5K36l07J92P6l11L82k65K7K12l26
$$ -116 -103 228 -248 90 72 -188 129 -33 -103 116 -60 -85 151 -156 36 112 -199 183 -82 -55 157 -169
4225a69K86j41k7J56j86J23j7o4P5ro9Q2m0o6J73k03J24M2k09K56j74%J54j90
$$ -169 117 -24 -51 105 -81 42 25 -39 36 27 -42 40 0 -66 107 -96 28 70 -139 117 -57 -57 97 -93
4249i3R2P3j60Q0J07k73K82q7k21M55m33J55K24m79M53j68j72L86l35P2J94k80
$$ -93 -1 72 -88 -8 99 -174 108 21 -200 255 -178 -23 201 -278 175 7 -165 221 -114 -42 152 -128
4271a28J68P3k69K59n0k00L07k36L7J63k46J90n5q5J06k9p3R4pj23K10j84O1R6
$$ -128 40 113 -156 103 53 -147 160 -76 -39 124 -122 68 13 -72 34 5 -68 26 19 -104 106 -78 -17 79
4295G9k30K68j79J8J49k36K23j23k6J44j60J01J0r6J08j8j03J70j19m7K16k80
$$ 79 -151 117 -62 -44 105 -131 92 -31 -57 87 -73 28 38 -58 50 32 -71 99 -20 -67 149 -131
4317a31J92K2k35L14k22%J86k22Q6Q4j67J00Q2k38K36q5j66L46l28J26J53l15
$$ -131 61 83 -152 162 -60 -60 126 -96 -10 74 -93 7 89 -149 87 2 -164 182 -146 -20 133 -182
4339a82K84j07q8J93j31j3J25j15j5J70k15J12O3k27K67j56j7J57j91J25k6m4
$$ -182 102 -5 -93 100 -31 -44 81 -34 -49 121 -94 18 81 -146 121 -35 -52 105 -86 39 13 -31
4361c1N9k4l5O5k3p0J28j41R7pj10J96k14J36Qj51K31j98P3N5j17J02l2l6M8J8
$$ -31 28 4 -31 34 11 -59 69 -72 25 18 -92 104 -110 26 34 -117 114 -84 -11 44 -73 29 -3 -39 9 27
4387B7j01J36p9o1K06k34J43L2j81K00r9j8Q6q3j1J15j21lJ73k68J98kk04L11
$$ 27 -74 62 -17 -78 128 -106 37 69 -112 88 -11 -29 57 -26 -37 78 -43 -46 127 -141 57 55 -149 162
4411A62k63P8J12k21J97p9m8J00m5l8O7l0n3J24j49J05nr9J67j40P4km1P1p7P3
$$ 162 -101 -23 89 -132 65 -14 -62 38 -7 -45 22 -8 -61 63 -86 19 14 -85 82 -58 16 14 -27 44 -33 40
4437D0p5O1k8J1L1q6J42j59J03j3j09J99k15J42k4j04J67j48M7N9r1J7P9j21P1
$$ 40 -35 26 -2 9 40 -46 96 -63 40 27 -82 117 -98 44 20 -84 83 -65 -18 41 -50 -33 46 -75 -4
4462dN5j74K15j36j6J58k36K01n8n3R6o5K2l2P9j06R1j6j08K05k06J22K5j48J90
$$ -4 51 -123 92 -44 -60 98 -138 63 5 -48 48 -17 5 -27 52 -54 37 21 -87 118 -88 34 59 -89 101
4487A01j50M4L9p2M7J0l9%N1j00J13o8j4Q8j31J35r5J7N8j35J85j52O7K9r7J39
$$ 101 -49 -5 34 -38 9 19 -20 -20 31 -69 44 -24 -38 50 -81 54 -41 -24 34 -101 84 -68 -1 28 -69 70
4513G0j40J04m7PK4n5J00j17J11n6k7J05j24P1pl5L5Jn3N4jj00J75j72N5J04k13
$$ 70 -70 34 -13 -6 18 -37 63 -54 57 1 -26 79 -45 26 19 -16 19 20 -33 21 20 -80 95 -77 -22 82 -131
4540a31K28j52K6R3j57J50j01L5Nk5N4p5J08j09N2K3q9J17q6M3Qk2J0J8j2k8P7
$$ -131 97 -55 -29 64 -93 57 -44 -9 -4 -29 25 -50 58 -51 1 24 -65 52 -34 9 17 -5 5 23 11 -17 60
4567F0j05R0m6l4R8j33J35j04M2L3j21J59j51P9K1j17J62j29N8J9m7M3k9Rj8M3
$$ 60 -45 45 -1 -35 63 -70 65 -39 3 36 -85 74 -77 2 23 -94 68 -61 -3 16 -31 12 -17 -8 -26 17
4593A7n7L8J4m8Q3q1N7k1k3K6k9O0q2J13q6MQ2j41J53j01nR2j46J20m8j9M1m0
$$ 17 -40 -2 12 -36 47 -34 23 2 -21 5 -24 36 -46 67 -19 -15 67 -74 79 -22 -27 65 -81 39 -9 -28 13 -27
4621b7K9k3L2n7N0k1j4M6n0M7l4J8j1OK4o7J03r6N0K4r2J32j09N7Ro4R3p5M0j6
$$ -27 2 -21 11 -46 4 -17 -31 15 -35 12 -22 -4 -15 -9 15 -52 51 -45 5 29 -63 69 -40 17 26 -38 55 -20 20 4
4651DoK8n8O1m0K4Rl9J7lPj6K8n5N4j7m6Q7r8O7mn8P8p5N7j2oK2m0M5n0O0j3m3
$$ 4 -2 26 -32 29 -11 13 22 -17 0 -3 4 -12 16 -39 15 -2 -48 39 -59 8 4 -54 24 -51 6 -6 -12 10 -30 15 -35 25 12 -31
4685c1P5o4K3Jk4M2j5j7J9Nl2N6m9J2L3p8P2l6j6M6n7O1m3J5oj5L0m8N7m3J9P
$$ -31 44 -20 3 4 -20 22 7 -10 9 14 -18 38 -11 1 34 -44 28 -8 -24 22 -35 26 -17 -2 -8 -23 7 -41 16 -27 -8 -1
4717am1N1k8J0J0k7M3l0J5pNmJ6rqK8l0K6j5j0L1m6M8l5j1N1n5M3m0%K5l3L1j6
$$ -1 -42 9 -19 -9 1 -26 17 -13 2 -5 0 -4 12 3 -5 23 -7 19 4 -6 25 -21 27 -8 -19 32 -23 20 -20 -20 5 -28 3 -13
4751a3J6j0kJ6l3L9k8J3Jk0K1rNJ4k6K0KrMPk6L2j7j1M2m9M7k0k4M9m8L2pj3K1
$$ -13 3 -7 -9 7 -26 13 -15 -2 -1 -21 0 -9 -4 10 -16 4 6 -3 1 8 -18 14 -3 -14 28 -21 26 6 -18 31 -17 15 8 -5 16
4786A6l9K0k0K1j6NJ3k8L8m8K3K0m3N8l8%K6l5J3J2j1mK3l1L6rk0N1m7L0lk4M7
$$ 16 -23 -3 -23 -2 -18 -13 0 -28 10 -38 -15 5 -38 20 -18 -18 8 -27 -14 -2 -13 -17 6 -25 11 2 -18 33 -14 16 13 -11 36
4819C6n1L0q%Rl6M7n2M0j0k1K7l8L6j8mJ1k2L4m3K2Pj1OpQpK6l4L0j8lM1o4O7
$$ 36 -15 15 7 7 16 -20 27 -25 15 5 -16 11 -27 9 -9 -13 -2 -24 10 -33 -11 -4 -15 -9 -16 -8 -15 11 -23 7 -11 -14 27 -37 30
4854C0k6j9N8o9N7k0l0L8l5L3k2J5j1MJk1L5l8K1Ol7L5k1NjOrPPl5N6n3M4Oo0
$$ 30 4 -15 43 -26 31 11 -19 19 -16 17 -5 10 -1 3 4 -17 18 -20 1 7 -30 5 -16 -11 -12 -6 -15 -8 -1 -36 20 -33 11 17 -43
4889d3P6p2M5qj0K8m5M7j8LK0k5K7k9K4%j6PnjpL0m9N0k6k1L5n3M1l2NK5l6L2
$$ -43 33 -39 6 -2 -12 16 -29 18 0 3 23 -2 25 -4 20 20 4 11 6 5 -2 28 -21 29 3 -18 17 -36 5 -27 -22 3 -33 -1
4923am4M3k4ML4n5O1l6KM1n5L1Nj7J5Rj5J5Mm0N4l4J1J9n3N1l7K1j0qL1m5N3n1
$$ -1 -45 -2 -26 -22 12 -43 18 -18 -16 25 -30 1 6 -11 4 13 -2 13 17 -23 31 -3 8 27 -26 25 -12 9 -1 -9 22 -23 30 -21
4957b1K1J9o2O7m9J5Oj8J2nJ0mPk2K5j5j4K8j4J7nj2K2qJ6l0M8l6qL2m9N2j2k2
$$ -21 0 19 -43 24 -25 -10 -4 -22 -10 -15 -5 -9 -2 -24 1 -14 -28 0 -14 3 -2 -14 8 0 16 -14 34 -2 -10 22 -27 25 13 -9
4991iL7l3J8j7JPomNOk0K5k0oJ4j4L0l6J9j7kK1k3M7m0J5J5l4L9l2K5n%J0j4K9
$$ -9 28 -5 13 -4 -3 4 -2 -6 -1 5 -15 10 -10 -16 -2 -16 14 -22 -3 -20 -22 -1 -24 23 -17 -2 13 -21 18 -14 11 6 6 16 2 31
5027C1l6L2j5qL2m1J5jokRj4J0Qn4N9k4k0O0o8M9j5l0L7l1J2pJ2j4K0qj1L2l4
$$ 31 -5 27 12 4 36 -5 10 9 3 1 10 -4 6 14 -40 19 -5 -25 35 -33 16 1 -29 8 -23 -11 -18 -6 -20 0 -8 -19 13 -21
5061b1L5rj7K8k8K9j5P%JkrL5n0L6j8k3N8o2M2k6lM2o3N0l9JM3o1K6Mj3J7j2M
$$ -21 14 5 -12 16 -12 17 2 9 9 10 8 -1 34 -16 20 2 -21 37 -25 17 -9 -12 30 -33 17 -22 -21 22 -39 -13 -9 -22 -5 -17 -13
5096a3K1l3j2O4o2M6%l0M7l9J4Rj4QMpj9N8n5J4K9o4P0m2j1M5n7N2k5k5M3j8j0
$$ -13 8 -25 -37 27 -35 11 11 -19 28 -11 3 12 -2 6 10 3 -16 42 -13 1 30 -34 36 -6 -17 28 -29 23 -2 -27 16 -2 -12
5129a2K2k2nK8m4K7lj9L2k3Rjj2K4j3K5k7K2j3%J3k2M1l5QJ8l7O4n3K0K2o5N3
$$ -12 10 -12 -17 11 -33 -6 -9 -28 4 -19 -10 -11 -23 1 -12 13 -14 8 -5 -5 8 -14 27 -8 0 18 -19 45 -8 12 34 -31 22
5162B2k5j7M7m5ML0m0K2J7m9N1l7oN1o9M6Kl8M0k7NJ4Mj9K7oj7M2m9L0J5n7O5
$$ 22 -3 -20 27 -18 -14 16 -24 -2 15 -34 17 -20 -26 25 -44 2 4 -34 6 -21 -16 -2 2 -17 10 4 -13 29 -20 10 25 -32 33
5195C3m0%N5p0L0J2n1O1m2nM6n5K2K4n6N4l4rN2n9K7Nk0L6l6OJmMJ6j6KK2k5K3
$$ 33 -7 -7 48 -22 8 20 -31 30 -12 -17 29 -26 -4 20 -36 18 -16 -25 27 -32 -5 0 -20 16 -20 -14 -13 -17 -13 3 -13 -11 11 -14 9
5230Ipk0N1k8j0L9n3L6nk7N5m5KL9o7M6Ln9O4l4k0O3p4M0J0m1M1j4l5N1l1j0M3
$$ 9 2 -18 33 5 -5 34 -19 17 12 -15 40 -5 -3 36 -31 15 18 -41 23 -11 -31 32 -42 -2 8 -33 8 -6 -41 10 -21 -31 12
5263A2m8K1K2m7M9jl1L9k4LM0n9L5J0n4O0k0j1M3n1J4K1m9N5ql0M2m9K5J1n2M9
$$ 12 -36 -15 7 -40 9 8 -23 16 -8 -5 35 -24 11 21 -33 27 7 -4 39 -12 2 23 -26 29 21 -9 33 -16 9 20 -32 17
5295A7k6j7M8n0J4K1m2L7qj6L5k2j7M8n3J8L3n6N1mm8P5m3nM1n8M1K2o8O0j6m2
$$ 17 -9 -26 22 -28 -14 7 -35 2 -6 -22 13 -9 -26 22 -31 -13 20 -36 15 11 -37 38 -5 -10 31 -27 14 36 -32 28 12 -30
5327c0P9p2K9L5q8O7j8j7N2n0j2L7m3J9J6l8K5Pl7N4m6QL4n3N0j0k1L0j2oK4l8
$$ -30 49 -23 6 41 -47 20 2 -15 37 -13 -25 12 -31 -12 4 -34 -9 -2 -39 15 -31 -23 11 -42 8 -2 -23 7 -5 -11 13 -25
5359b5K3J9m0L7j4j9N7o0K1L0p0O2k9k1N9o3K5K4n6M5On9O0k9j7O2p5K4L6o4N8
$$ -25 -2 17 -23 14 0 -19 38 -22 -1 29 -41 21 -8 -29 30 -33 -8 16 -40 5 11 -48 12 -17 -34 28 -47 -23 13 -51 7
5390Gk2j9M7k4mJ9l2J6L3n4N0j5l0O8o7K6L1o7O1j1k9M1l6jL9m8K0K6n3M3j7k1
$$ 7 -15 -34 13 -11 -15 4 -28 -12 21 -33 17 2 -28 40 -27 -1 30 -37 24 13 -16 25 -11 -12 27 -21 -1 25 -28 15 -2 -23
5422b3M4n5K6mk2M7k6qK6l4J1L8m7L5Rn2N7m8LN8p5M8Pm4P0l7j8M6l8KM5o9M3
$$ -23 21 -34 -8 -12 -34 13 -13 -21 5 -29 -18 20 -27 8 17 -35 22 -26 -23 35 -40 8 15 -29 41 4 -14 32 -6 -4 41 -28 15
5455A5Mo4P9l5j8N2o6L6Pm4L8j2k3L9l2j4O1o8M1J9o0O4k5k2M1l4J8J6l0J9Pj9
$$ 15 19 -45 34 -1 -19 33 -33 3 10 -34 4 -8 -31 8 -24 -38 23 -45 -4 15 -45 19 -6 -28 13 -21 -3 13 -17 2 9 -10
5487a0L1j2j5M1n5M2Qo3O8m7J5K2n2M5rl4N1k2k9M5n0J9L6p8O3rl8O5o2K6K1m7
$$ -10 21 9 -6 35 -20 22 30 -33 35 -12 3 25 -27 18 9 -25 26 4 -25 20 -30 -11 25 -53 10 1 -37 28 -34 -8 13 -34
5519c4M1mj3J1Ql4M8k8oM8n9L0K7p2P5m8lM8m1NK5m7K2K1m4M6m2JM4p1N5j5k5
$$ -34 7 3 -10 1 9 -25 23 -5 -11 37 -22 8 35 -37 38 -10 -13 35 -6 -1 24 -23 -1 20 -24 22 -20 -19 25 -46 9 -6 -31
5552c1O0o2K0J0k5K8nj1J4lj7L8k5pL9n1M3j5j4M8m6JK4k3J6J9m1M6ln2O5o2K0
$$ -31 29 -33 -13 -3 -28 0 -5 -16 -2 -5 -22 16 -9 -16 23 -28 15 0 -14 34 -12 -11 13 -10 6 25 -16 30 27 -25 40 -22 -2
5585bL9p7O2k5k9O2o4J9L4n1K3Rl2L0Nm5O3l8LM0n7M4qj9K2k1PJ2rNK5l1J4J5
$$ -2 37 -40 22 -3 -32 30 -34 -15 19 -32 -9 0 -32 -2 3 -42 21 -17 -14 26 -31 13 5 -14 8 -13 -6 6 -3 2 27 -4 10 25
5619B5l3L3m4J4K7m7M3k3lL7n1K5Lk9L0j8nJ8k0j8M5m4J7J7m3M7j9rM2m0J9K2
$$ 25 -8 25 -19 -5 22 -25 18 -5 -8 29 -22 3 6 -23 7 -11 -16 2 -18 -36 9 -35 -18 -1 -44 3 -16 -25 17 -23 -4 18
5651A8k6J7Ml3L4Nm3O4m2jM0o2M0j0k3M5k5j2K1l4K4Ol5L3mk4L4l2J1K3k2J0q
$$ 18 -8 9 13 -20 14 19 -24 40 -2 -3 37 -25 15 5 -18 27 2 -10 11 -23 1 7 -28 5 1 -23 11 -21 -10 13 -9 1 -7
5684gqNlLJ1k2K7Opklj0L4l4J8J8l5L0j7j0M0l4J9Lk7K2nk7L5k5j1L0m1J9J5l5
$$ -7 -15 -10 -13 -10 1 -21 6 12 5 3 0 -10 24 -10 8 26 -9 21 4 -6 34 0 19 22 -5 17 12 -15 20 -5 -16 14 -27 -8 7 -28
5720b8K9onK7l4LJ4l0K1J2l3M0j8j0L1k1MK9m2J9J5l3L7k4J5J4k4RQk5K1rpJ1
$$ -28 1 -5 -10 17 -17 -14 0 -30 -9 3 -30 10 -8 -18 13 -8 -4 25 -17 2 17 -16 21 -3 12 26 2 11 19 -6 15 6 -1 10
5754A0j5mJ0j4LJ1k0K1k7J3%j8L0jj4J6mj1K0j9K1jk1L0oj1K3k8J8Nk2K3rj3K8
$$ 10 -5 -9 1 -13 -10 1 -19 2 -25 -12 -12 -30 0 -1 -15 1 -3 -14 6 -13 8 7 -14 16 10 -1 22 -6 12 17 -5 18 9 -4 24
5789B4k3KJ3j3pK4l2K1j2k5L6k3J0QomjkO%j8K9k2%L0m2L3qqK4k5QNj3J6LqQn
$$ 24 1 3 16 3 -4 20 -12 9 -3 -28 8 -15 -5 3 -3 -7 -8 -10 -4 -4 -22 7 -15 -15 15 -27 6 -2 -10 14 -11 -3 2 -11 5 8 0 8 3
5828CnPNj4J9k8J2J0k2K3njpjQj2rNOj8J6pqJ9k7L7j6j7L2j4J1nj3J4jLNkkOq
$$ 3 -2 5 10 -4 15 -13 -1 9 -13 10 5 4 -3 -4 4 -8 -17 -12 -6 -24 -8 -15 -23 -4 -31 6 -10 -27 5 -9 2 -3 -16 -2 -3 0 5 3 1 7 -1
5869aJ3Mk5K0mpnQQlroJ5j8JJ5k1Rj2KRk3K1ooK6k3QkNnJ4j1MPj7J7rJ6Pj4J3
$$ -1 12 16 -9 11 7 0 -5 3 11 8 -1 -7 8 -10 -9 6 -15 -6 -18 -16 -7 -30 -9 -15 -21 5 -18 -10 -12 -7 -12 2 -9 -5 2 -15 2 -7 9 16 2 15
5911A5k2K1rjnjP%%jkQj5Qj9K7j8J%j8QLoQj5J7j2J3rJJ4j8J9qOlmJ1j0J1PpK
$$ 15 -7 14 5 4 -1 -2 5 5 5 4 2 10 -5 3 -16 11 -7 -6 -6 -24 -16 -13 -19 -11 -26 -9 -21 -8 -17 -16 -2 -20 -1 -9 -3 -6 -10 1 -9 2 9 2 4
5954DLQj7K0k7J1JkPj1%NkokJ3j3J4j8JQk2J3j2K0j3JPj3J2OKnN%kQNpPlNqRq
$$ 4 7 15 -2 18 -9 2 3 1 8 -3 -3 2 0 -6 -8 5 -8 6 -12 -11 -3 -25 -12 -24 -4 -17 -16 -9 -22 -10 -4 -2 -7 -2 -2 -4 4 9 2 9 6 11 3 12 4
5999DPMk4J7qnJ2j2Oj7J6nlJkOk3QQQj0j0J5lQj0OKnJ3j5J4mjNkJ0kpOoRrJ7j6
$$ 4 11 15 -9 8 0 -5 7 -5 1 -16 0 -5 -8 -7 -9 -3 -26 -18 -10 -2 -12 -22 -7 -10 -2 -12 -6 -4 -9 4 -11 3 -1 -2 3 1 11 9 2 8 2 11 2 19 3
6044ClkmPoMnj0K1j4J7k3MJOLj9K3l3K3Lk0K2j8J4PpOnJ0lQj0MkllnL6k0nJ8k1
$$ 3 0 -2 -6 1 -5 -1 -6 -16 5 -9 8 -15 -11 -10 -4 -1 -20 3 -30 -7 -4 -24 -2 -20 -6 1 -6 0 -5 5 2 10 0 4 2 -1 -4 -9 27 7 2 20 -1
6087aNKkr%Lj1RjNOk4J9j2JKnPk0J7kMlpQJ4lj2J0%PJ6l5K4npJ7j8K1l3J5Rqj
$$ -1 4 6 4 -5 -5 -2 -13 -4 -5 0 6 -18 1 -11 -10 -8 -13 -6 -26 -9 -11 -7 -10 -17 -9 5 2 -10 0 0 7 23 -12 12 7 0 17 -1 20 -13 2 11 3 2
6131BpMqRj2kJ2r%krJ4mllLQlo%KlK3j6J1Pj4J4Jk3L2k1Rj0NJ5j8J0lPKj3jkP
$$ 2 -5 -1 -9 0 -12 -14 -2 -11 -11 -13 -22 -8 -12 -15 -18 -15 -7 -10 -16 -16 -14 -17 6 -10 1 8 -6 8 9 -14 18 -3 6 -4 1 16 -2 8 5 12 14 1 0 -2 5
6176Eqmlj1NQPk0QkLnLOj3QqjK3j5R%nJ0qK3%j1mkRj5RJ0joJJlkqJOjjoj1J1n
$$ 5 -3 -7 -10 -21 -16 -8 -1 -21 -13 -15 -12 -17 -14 -8 -21 -13 -21 -22 1 -14 -5 -5 -10 0 -8 15 15 4 0 -2 7 -8 1 11 10 4 5 6 3 1 -7 -6 0 -1 -2 -8 -19 -8 -13
6225a3qJ3Qj4JQQkj4J6ok2K1pJ1n%QloJ4nlMJpJ7qJrJ4j7RmrJ4j5Okj1PLj0KO
$$ -13 -21 -8 0 -14 -13 -5 3 1 -13 3 -3 -25 -4 -11 0 -5 -5 3 0 -6 8 3 0 4 5 -2 15 7 8 -1 13 -4 5 1 -8 6 -9 -3 -5 -16 -9 -6 -16 -14 -8
6270hnrJ7oJRj1%Pj6K7k4K4lmMpQj%lJ0j0LQjkloRj3J6k9J9mj1J2j3K1k8J7j2
$$ -8 -13 -22 -5 -11 -10 -1 -12 -12 -5 -21 6 -18 6 3 -1 3 -4 4 3 3 0 10 0 3 11 10 8 5 -1 8 -5 11 -18 1 -3 -14 -2 -15 6 -22 -5 -17
6312a7JNj0J3lj4K1j0PM%j0NlJ0MnMMnLmQj0J4pj5MLRj4J3jj7RLrjJ1ojonNMj2
$$ -17 -16 -11 -21 -8 -11 -25 -4 -14 -7 -3 -3 -13 -8 -11 -1 3 -2 2 6 1 4 0 8 -2 12 5 -10 -6 -3 6 -8 5 4 -13 -4 -1 -10 -11 0 -6 -7 -13 -18 -13 -9 -21
6358b1NNKMlJ6k5J8qQK%LoOjJ3oj2PkkMlPj3J5j1rj1RKoJj0N%j1K9k9L2j5MOj6
$$ -21 -16 -11 -9 -5 -8 8 -17 1 -7 1 3 3 6 0 6 5 18 12 0 7 5 3 7 4 11 -2 13 2 -7 -18 -9 -7 -13 -12 -22 -17 -17 -28 1 -28 4 -11 -7 -1 -17
6403a7J4qJ0Nj0mJJ1KjJ4j5KjMkmJ1nr%JPJ0j4%ojJ2rj2K0k3J1jnQJk1K6nj8J6
$$ -17 -3 -11 -1 4 -6 -10 -9 2 4 3 17 2 4 3 7 5 1 12 7 -2 -2 -1 6 16 2 2 -4 -5 7 -2 -14 6 -17 -6 -7 -12 -4 -3 -24 2 -3 -21 -5
6446ej1K1%j6J8j0jPj1PkQLojmOmJ4j7%LqJ7nkLkj5Lj3K2qkQnpPj0QJj0J9j0O
$$ -5 -16 5 5 -11 7 -3 -4 3 -8 -1 -3 5 8 2 1 -3 3 -1 13 -4 -4 -1 -9 8 3 1 4 2 -13 -10 -23 -1 -9 -11 -3 -8 -15 -8 -18 -10 -9 -19 0 -10 -4
6491dlrJ6nJQnjJ7j0NJ0j5Moj9K2j6J2Nk5J6Qj1KloK1j0k1L4k5qNMNjoJ3j3J3
$$ -4 -7 -16 0 -5 -4 4 -1 -2 15 5 10 20 5 9 3 -16 6 -10 2 7 -18 -2 6 -5 -3 -6 -12 9 -1 -22 12 -13 -21 -16 -12 -7 -8 -14 -1 -14 -1
6532aKlNJpJ1ooJ2j6K2pj3K9j9J3opMoPpJj%j0LPk6L1j5qJ4j5oJ7j2J4%j0QKk1
$$ -1 1 -2 3 4 -3 8 2 -4 8 -8 14 7 -6 23 4 17 11 4 8 2 9 2 3 2 2 -8 -5 2 -24 7 -8 -16 -2 -17 -23 -6 -18 -4 -4 -14 -6 -4 -25
6575b5K8moK4l2K1Oj7K0j4JQkkJ1j6NJ1l1K4j5nJ9j9RnmJ1k1J6Lj0PppJ2mj4K6
$$ -25 3 -1 -7 17 -15 6 12 -5 15 1 2 10 8 6 17 1 6 17 -14 10 -5 -10 9 -10 -1 -6 -10 1 -20 -4 -1 -11 -4 -11 -18 -6 -10 -24 2
6614Bk0J4Qj9J7oRQqN%j4J4kj6J7JqJ1lj3K8m3L0qqOj4MJ6j9jJ0l3L1j8pL0k7
$$ 2 -18 -4 4 -15 2 -4 5 13 5 10 10 -4 10 8 -8 9 10 2 13 10 -3 25 -18 12 4 -4 2 -12 -8 8 -11 -12 -2 -35 -4 -22 -29 1 -26
6653b6QRj1J8JlPmjJ1j9J2J1k5J5kj3K6j1LJ4k7K4j3j2K0k0JMlJ1qk5J4KqK3k8
$$ -26 -18 -9 -20 -2 -1 -4 3 -1 -2 9 -10 2 13 -12 3 1 -12 14 3 6 20 -7 17 4 -8 12 -8 -7 -3 -6 5 -3 -28 -14 -12 -20 3 -25
6691b5J2Qk0K8k3pK3rKJ1j8J4J1j5J1nkK3k2JK3l0J9Jj8K7k3KK5l0J5kj6J3nk0
$$ -25 -13 -5 -25 3 -20 -27 -4 -13 -11 0 -18 -4 7 -8 3 -2 -4 19 -3 -2 21 -9 10 11 -7 20 -3 -1 24 -6 9 7 -9 4 -1 -21
6727b1J9j1qL0l1J1Qk0K8k0pK3j6J5oj0J6j1nK9j9J0%j0L1k7JK0k0NMlJ2qqJ1
$$ -21 -2 -13 -21 9 -22 -11 -3 -23 5 -15 -22 1 -15 0 -6 -16 0 -11 -16 13 -6 4 4 -6 25 -2 -1 19 -1 4 8 5 17 9 1 12
6763A2j3j1K1j1pJ3k8L2j6k0L7k9J0J1j9J9Nj8RojJ0j4PK0k8K2LrJ7j3oJ9j6q
$$ 12 -1 -12 9 -2 -9 4 -24 8 -8 -28 9 -20 -10 1 -18 1 6 -12 -3 -9 -10 0 -14 -7 13 -15 7 10 1 18 5 -1 18 2 -6
6798fJ9k0K0Qk7J9k0kK1k2NPj2J4j4%JnLNqMokJ6j4MJ1k1K5ooK1k1J3Nj9K9mk9
$$ -6 13 -7 13 21 -6 13 -7 -9 12 -10 -5 2 -10 4 -10 -10 -9 -14 -11 -6 -14 -10 -16 -18 -2 -16 -12 -1 -22 3 -3 -9 12 -9 4 9 -10 19 15 -14
6838a4L3j1j1J5k8J4J2k3K7j2j5K7k7JJ9k6J3Nk2K4lj9K6j3OKk1K1oj4K5k0J2
$$ -14 19 8 -3 12 -16 -2 10 -13 14 2 -13 14 -13 -12 7 -19 -6 -1 -23 1 -2 -21 5 -8 -2 0 -21 0 -6 -20 5 -15 -3
6871cPrLKnJ1mpL0l2QJ3k4K1j4oJ7rPln%jpJ5j4lJ9k4J4%k4K4pnRokK3k4J8Jk8
$$ -3 4 -5 -2 0 -5 6 2 -5 25 -7 1 14 -10 11 -3 -9 8 -1 6 3 -2 -2 -3 -10 5 -9 -12 7 -17 -3 -3 -27 -3 -10 -15 -6 -12 -14 9 -15 3 4 -24
6914b4L5rnJ6k1J4J8l2K0Nj1J9k4L%j0PQl5L9j0j2Oj8PJ5k0mJ3j5K4j1oJ2k3K6
$$ -24 11 2 -3 13 -8 6 24 -8 12 17 6 25 1 4 4 -6 1 9 -26 13 3 -9 -3 -21 -14 1 -19 -23 -10 -25 -1 -12 -18 -6 -29 -3
6950cnj1J1J1qK1k4QPj2J3p%J1oJRk6K5j6j5K2j6ROj7J2prJ6pqJ8j6nJ8k6J7P
$$ -3 -8 -19 -8 3 -5 16 -8 0 7 -5 8 1 1 12 6 7 16 -10 15 -1 -16 6 -10 -1 5 -12 0 -7 -16 0 -7 -15 3 -13 -18 0 -26 -9 -2
6989bl5L4rkK1k2J2Qj7K9qk1L0j4mJ7k1K0Mk1K3j9OPk4J0Kj%j0kJ4pj4J9j5NN
$$ -2 -37 -3 -12 -14 7 -15 -3 5 -12 17 9 -12 18 4 0 17 -4 16 20 -1 22 3 9 16 -8 2 4 3 3 -7 -9 5 -2 -16 3 -12 -7 -2
7027bk3K1pNJ9l3J2Nj3J1LjJ6k3J6J1l0K4Mk3K3j8J2J3k0J5lrQj5JRj4jJ1j6P
$$ -2 -25 -4 -11 -6 13 -20 -8 -3 -16 -5 -2 -3 13 -10 6 17 -13 11 15 -8 15 -3 9 22 2 17 14 5 13 -2 -1 8 -6 -7 4 -12 -5
7064eNj1PoOlj2PMqJ5%j2J3lMjj5J2Nj0K5k9J4Rj2PLqRj3NM%j4RqJ2nj2J7j0n
$$ -5 0 -11 -4 -10 -4 -7 -19 -12 -8 -16 -1 -1 -13 0 -3 1 0 -15 -3 2 -8 17 -12 2 11 -1 6 9 1 10 -3 2 6 6 -8 1 -7 5 0 -12 5 -5 -10
7107a0Qj6N%qMOj8J8Qk3K6k1J8ljjJJOj5J9Mj0Nmj1J9nqJ4j0QKj5J7k2OJ7j5J
$$ -10 -2 -18 -13 -13 -21 -17 -11 -29 -11 -3 -26 0 -21 -3 -6 -7 -8 -7 -6 0 -15 4 8 -2 3 -1 -12 7 2 -6 8 -2 6 8 -7 10 -12 -6 11 -4 -3
7148cqJ0j8J1mNqLJpJjJ0Nj6LQJRNrQmLPppJ7j7PJ1k0J0pKOj4PLnj1oRJnkJ3p
$$ -3 -11 -1 -19 -8 -12 -7 -15 -12 -11 -18 -17 -18 -8 -3 -19 -16 -8 -7 2 7 -2 6 2 5 12 5 -2 15 -2 5 16 -4 6 -1 1 7 -7 0 3 -2 -13 -19 -10 -9 -14 -16 -3 -10
7196a0Mpj2J8pjJk%QOj3K3opQoJ3mRj2j0K6mj3p%J0j0%M%mrJ1Jj4K%mkOJ0j3J1
$$ -10 -6 -13 -25 -7 -14 -15 -14 -16 -16 -8 -2 -15 8 2 -5 3 -3 10 6 15 3 -7 19 15 2 -5 -5 5 -5 -5 -1 -1 -5 -14 -3 -2 -16 -14 -14 -18 -20 -14 -4 -17 -6
7241fm%%rOrJJ0J2j6J4m%J0k2J9Lj0J2Oj0OnK%pjKj5J6noLj4J5omJjjJJ1nkMJ0
$$ -6 -10 -10 -10 -19 -13 -22 -21 -11 1 -15 -1 -5 -5 5 -17 2 5 -5 7 13 3 9 4 6 6 -1 -2 0 -15 1 -4 -10 -7 -21 -6 -12 -16 -15 -16 -17 -16 -5 -10 -12 -8 2
7287Bkj3PnOokP%J0kKnoLMoJ7j7J4j4Qj3kJ3pOp%nKl%%pMJjQrRoMJ1j9OKJ0j4
$$ 2 0 -13 -6 -11 -5 -11 -13 -6 -6 4 2 4 -1 -7 -4 0 -6 11 -6 8 -6 2 -11 -13 0 -7 -1 -8 -8 -13 -11 -14 -14 -14 -21 -17 -16 -17 -9 -18 -9 -15 -11 0 -19 -13 -11 -1 -15
7336a5J3oRLoJ1rJqJ0oOj0J2jpmKL%j8K3j1JolrPmLJ2lqPRrKLmOJ0j4RkkMJ%M
$$ -15 -2 -8 1 4 -2 9 0 1 -7 3 -3 3 -7 5 4 -3 -7 -5 -2 -2 -20 3 -8 -7 -13 -16 -25 -18 -22 -19 -7 -10 -18 -11 -2 -11 -9 -6 -10 -4 6 -8 1 -1 -3 1 2 2 6
7385FmJjrPOk2J4Qj1LlQj3jKokQkj4J6j8lK2mkOm%kJLpJ4J3j8MJ1pOmL%KkpQp
$$ 6 2 3 2 -7 0 6 -16 -2 6 -5 -2 -5 3 -10 -11 -9 -15 -17 -9 -11 -25 -9 -27 -30 -8 -12 -14 -8 -12 -12 -14 -13 -10 -17 -3 10 -8 -4 7 0 6 2 5 5 7 5 -2 6 -1
7434aLoRkkpJ0j5JLj0J1jKpklPKlMNj0lRKkjOmJ4Jj5kJ1j2JJ0jjOmrMRrJ1krQ
$$ -1 2 -4 5 3 1 -6 4 -11 -10 -7 -17 -6 -7 -5 -12 -14 -17 -10 -8 -11 -7 -2 -12 -15 -6 -4 -6 -7 -1 -5 9 10 -5 -7 4 -8 -7 3 2 1 7 3 -6 -2 7 -2 9 7 -2 6
7484Fqj2KkRj0Rj0oLNrRJjOj1J5j1kK0mJJ0j1J5j7J1lJJkLJPj4KlppNoQ%NpMm
$$ 6 -2 -14 -12 -14 -5 -15 -6 -16 -22 -19 -14 -23 -14 -13 -14 -8 -19 -4 -15 -17 3 -1 0 10 -1 14 -3 8 5 6 7 5 8 9 16 2 4 1 -6 -13 -8 -14 -6 -6 -1 -8 -4 -8
7532hJnJmj%QoJ1j2K0%k3K1j1J3kqJJ2j0KPlMJLpqJjLplNnOpOj0qKMkRmkjJMo
$$ -8 -7 -12 -11 -15 -16 -16 -8 -14 -3 -15 5 5 -18 3 -8 5 3 -5 -4 8 -2 0 7 4 8 9 12 5 -3 -2 -3 0 -7 -10 -5 -10 -4 -11 -5 -15 -23 -21 -17 -19 -10 -14 -16 -17 -16 -12 -18
7583a8J0mPMkqlJ2Nn%J3rJmnJ0l%mLPj3OKlmj8J5lJ2j0NoJpjJ3knkJOj0RJ4j5
$$ -18 -8 -12 -5 -1 -3 -11 -14 -2 3 -2 -2 11 2 3 -1 -6 4 1 1 -3 0 7 -6 0 2 -1 -5 -23 -8 -11 1 -9 -4 -10 -9 -16 -17 -4 -6 -11 -13 -12 -6 -16 -7 7 -8
7630hK1j8LkNNjPj6J7mpPrLjjKj2J0r%MLlqNqK%Kj3J3pMQj4J3Qj1J3J%KjllMJ
$$ -8 13 -5 -2 -4 1 6 5 12 -4 13 9 2 9 0 3 2 1 3 -9 1 -8 -8 -4 -1 -4 -12 -7 -15 -13 -13 -11 -24 -11 -18 -14 -6 -20 -7 1 -10 3 4 4 6 5 2 -1 3 4
7679DpOkJ0rjKnjNnNr%rLrKQkOoONrM%Rj7MMjkJL%K2k1J0PjnKNkpNlj%joQJj1
$$ 4 -3 3 1 11 2 1 3 -2 -3 2 -3 2 -7 -7 -16 -13 -22 -20 -12 -14 -8 -14 -8 -3 -12 -8 -8 1 -16 -12 -8 -9 -11 -10 -7 -7 15 -6 4 11 10 5 7 12 10 3 8 5 4 4 3 -3 5 6 -5
7734emJ3lnjllrJ7k1J3%qK0j5JJ5qoJ9j2kkkJ3lMmqK1Pj5Rj0oJ4qlJJ2lKj1Jj5
$$ -5 -9 4 1 -4 -5 -8 -11 -20 -3 -24 -11 -11 -19 1 -14 -13 2 -6 -12 7 -5 -7 -9 -11 2 -1 3 -1 -9 12 19 4 13 3 -3 11 3 0 1 13 10 12 1 2 -13
7779a3MjrPmMQnPOj2mJ0KnJ2rjLj2K1j3J1MnRjmKpNkrJ0kmRk4J5%j1LljJ4j5Q
$$ -13 -9 -10 -19 -12 -16 -12 -4 -9 -2 4 -8 -12 -2 0 -5 7 -2 -3 0 -12 9 -4 7 11 6 15 14 10 12 5 10 8 -1 9 7 3 12 -12 3 3 -8 -5 -8 -9 5 -10 -2
7826booNmjPnJJ7nmOknQrJ7j1O%rRpnJ4JpOj3RjoQnmNr%MjMoMj1Qj0J0mOjj1J3
$$ -2 -8 -14 -9 -13 -14 -7 -12 -11 6 1 -3 3 1 -4 4 -5 12 1 7 7 -2 7 0 -5 9 10 3 9 -4 5 4 -2 6 1 -3 2 -7 -7 -3 -4 0 -6 -2 -13 -5 -15 -5 -9 -3 -4 -15 -2
7878bNrNj3J6jOj1LkK0j1lKmPKj7JJ0jKpOnpMJj2J3j5MKnPjqNKL%NkPj4J5nJp
$$ -2 3 -6 -1 -14 2 1 7 -4 -1 -3 17 6 3 5 1 8 10 -7 -6 4 3 5 -2 4 -1 -8 -4 -3 -15 -2 -17 -13 -11 -16 -9 -10 -18 -13 -11 -8 -8 -3 -5 2 -12 3 -2 -1 -8
7927hJ3lkjMOqK0j8LpRMnj2P%j4J1lOnrjJj1J2Jj0J4j0jPjJ5j0jJ1LmOj9J5Mr
$$ -8 5 2 0 -1 3 9 1 21 3 6 -1 8 12 7 -5 2 2 -12 -1 -4 2 -3 -12 -13 -12 -23 -11 -10 -20 -6 -16 -17 -10 -11 4 -6 -7 4 7 3 9 -10 5 9 0
7972@J6roJ9j7mK1j8ORj7PqmPrj0J2mQj6QLqkJ0pQQj7J4%j6K2rJJ%l%KMQj4J1
$$ 0 16 7 1 20 3 -1 20 2 8 17 0 7 -1 -5 2 -7 -17 -5 -9 -1 -17 -9 -6 -14 -16 -6 -13 -5 3 -14 0 0 -16 6 -3 -2 -1 -1 -4 -4 -2 2 10 -4 7
8017Gj0J7j0JRnrJ3j8%J5j0Oj6KOj7J4Rj9QKj6J8qnJ8j1JPoJ3pnK2k0LQmJ0pk0
$$ 7 -3 14 4 5 14 9 0 13 -5 -5 10 0 6 -10 -8 -2 -19 -5 4 -15 -7 -5 -21 -3 -11 -16 2 -9 -8 -1 -7 6 -1 -6 16 -4 -1 7 3 13 6 -14
8059a4K1KJqJ0lokJjpMmJOj5J1jrJ6j5lKnJ6%j1J7qoJ0MrJ4j4QMk5L4j4kJ4k0
$$ -14 7 9 10 2 12 9 3 1 2 1 -6 -2 -6 -5 1 -14 -3 -4 -13 3 -12 -15 -13 -18 -2 -2 -13 4 -4 -10 0 4 -5 9 -5 3 7 -18 16 2 0 14 -6
8102fJ6pJJo%J3j6J0Nj9JRj2J2k0jJ7lkLj2J3nLOj8OJ6qLNj1QoN%lMJ9k3J2Pj6
$$ -6 10 3 4 5 -1 -1 12 -4 6 11 -8 -7 2 -10 2 -18 -19 -2 -5 -7 -4 -16 -3 -8 -5 1 -17 -11 5 -3 0 5 -6 2 -4 1 1 -2 2 21 -2 10 17 1
8146AJ0rQMl5K4mlPj2MKj3OJj0K0j9RJ1j8pK4j1LmkJ6j2NKoOOlJLrJ6j0LQj7J1
$$ 1 11 2 10 14 -21 3 -1 -4 3 -9 -5 -3 -16 -10 -9 -19 1 -18 -9 2 -16 -23 1 -10 -7 -11 -13 3 -9 -4 -2 -8 -2 4 1 2 5 -4 12 2 5 13 -4 7
8190Gj
8191F
$$ Imaginary data points
##PAGE= N=2
##DATA TABLE= (X++(I..I)), XYDATA
0@%%%%%%%%%qJ6j6J6k4L2m0M9n7P2q8J06j30J60j90K23k59K99l50M06m68N38o15
$$ 0 0 0 0 0 0 0 0 0 0 -8 8 -8 8 -16 16 -24 25 -32 40 -48 58 -72 88 -102 121 -138 161 -189 217 -251 287 -328
32c28P00p95R01j016J145j289J445j615J800k002K222k462K725l013L330l675
$$ -328 372 -423 478 -538 607 -682 763 -852 948 -1054 1168 -1294 1431 -1582 1748 -1927
48a927M048m460M912n408N956o560P233p986Q836r802J0907j2186J3688j5481
$$ -1927 2121 -2339 2573 -2835 3121 -3439 3794 -4192 4644 -5158 5749 -6437 7251 -8230
62h230J7666k0399K3924k8666L5438m6045O5939j56803K94871k16788p9657L30942
$$ -8230 9436 -10963 12961 -15705 19733 -26312 39627 -117176 177695 -39093 -118750 212192
74B12192m19406L33330j51980j6335J04385j12921Q4394o0907N3232m3299J2012
$$ 212192 -207214 126116 -25864 -42199 62186 -50735 33659 -27248 25984 -17315 -5303
85e303L5543o8409O2786k5726o920j736N5496j16656J28709n7569p7920K10484
$$ -5303 30240 -38169 24617 -1109 -8029 -9765 45731 -70925 57784 215 -77705 132779
97A32779k62854J96784l7133j41011K55592k65239J82351n4507o7548J51829j88416
$$ 132779 -130075 66709 29576 -111435 144157 -121082 61269 6762 -60786 91043 -97373
108i7373J79076j27324L9534O4388j48990J77534j33473L7104N7539r6481O4796
$$ -97373 81703 -45621 -6087 58301 -90689 86845 -46628 -9524 48015 -48466 16330
119A6330L747n0337L2465M3061j21606J39965p2261n0879J61928j98835J43940
$$ 16330 20077 -30260 2205 45266 -76340 63625 -8636 -59515 102413 -96422 47518
130D7518l4016o8483J19961j17439Q8049o0912M3268j8625l0613R8032j49719
$$ 47518 13502 -54981 64980 -52459 35590 -25322 17946 -679 -31292 66740 -82979
141h2979J46637p5250l6959J33180j61519J09865j4901o3825Q3722m4681j4901
$$ -82979 63658 -11592 -48551 84629 -76890 32975 18074 -45751 37971 -6710 -21611
152b1611M6441k5266l2705Q4290r1386M5361K9715r3740J16025r2447M1625J2840
$$ -21611 24830 -436 -33141 51149 -40237 5124 34839 -58901 57124 -35323 6302 19142
164A9142n5527Q1456r0796Q2046n1271o63O0122j02958J08283p1852J0829M5267
$$ 19142 -36385 45071 -45725 36321 -14950 -15613 44509 -58449 49834 -22018 -11189 34078
176C4078p2436O6281m1239J6518k896k093Q783k2958L8797m3587K9743k794k1259
$$ 34078 -38358 27923 -13316 3202 306 -1787 6996 -15962 22835 -20752 8991 6197 -15062
189a5062K7520j5213q64K413J6160m1415M9902k5388k6768P9119r8634O9140l561
$$ -15062 12458 -2755 -3619 -1206 14954 -26461 23441 -1947 -28715 50404 -48230 20910 17349
202A7349o3078R5213p8871K9326K0869m4561L6760j3618k413q56J7706k9658K0942
$$ 17349 -45729 49484 -29387 -61 20808 -23753 13007 -611 -3024 -3880 13826 -15832 5110
215E110P645l9116N3172m0427Q843K1853l4671K7286j0794p97K19Q680j4380P294
$$ 5110 12755 -26361 26811 -13616 -4773 17080 -17591 9695 -1099 -1896 -1677 7003 -7377 -83
229h3J1896l2337M0764l0373N381K1809l8806L9876k7048O901J2844k5935K8966
$$ -83 11813 -20524 20240 -10133 -4752 17057 -21749 18127 -8921 -2020 10824 -15111 13855
242A3855k1776P887O700j5809J5549o610n154J1397o767o769K0222k2958J0537
$$ 13855 -7921 -34 6666 -9143 6406 -204 -5358 6039 -728 -7497 12725 -10233 304
255C04J1154k9570L3866k1243j228K0820k7650K0595o743l955N796j482q09m466
$$ 304 11458 -18112 15754 -5489 -6717 14103 -13547 7048 305 -3650 2146 664 -145 -4611
269d611J4953k2253J7962p29k1084L4342l0038R287J6643l2631K9409r717j3560
$$ -4611 10342 -11911 6051 5322 -15762 18580 -11458 -2171 14472 -18159 11250 1533 -12027
282a2027K6113k1238L495J4900k2658J6053m6j5293K1191j5288K203J0193j5510
$$ -12027 14086 -7152 -3657 11243 -11415 4638 4592 -10701 10490 -4798 -2595 7598 -7912
295g912J2318m358k862N871m476R36J393k42l633P273p452K433O103j3288J4345
$$ -7912 4406 48 -2814 3057 -1419 -483 910 668 -2965 4308 -3144 -711 5392 -7896 6449
310F449p941l038J2864j5887J0266N46j0231J3042p206l212J0855j0497K350Q174
$$ 6449 -1492 -4530 8334 -7553 2713 3259 -6972 6070 -1136 -4348 6507 -3990 -1640 6534
324F534j3881J0602j81j0818J5590j1032k22J0916j4083P997K981j1307J1191
$$ 6534 -7347 3255 3074 -7744 7846 -3186 -3408 7508 -6575 1422 4403 -6904 4287
337D287k742q062J3879j0730K05J1399j6811J2688j642r838J5293j2230L661M611
$$ 4287 1545 -6517 7362 -3368 -3163 8236 -8575 4113 2471 -7367 7926 -4304 -643 3968
351C968q279O623k141j408J450J469m398M393k48o335J1183j0770M583M630j2315
$$ 3968 -4311 2312 171 -1237 213 1682 -2716 1677 1429 -4906 6277 -4493 90 4720 -7595
366g595J4472r787O11Q438j2814J0332k712n177Q549n874n23O119o941K290M952
$$ -7595 6877 -2910 -2299 6139 -6675 3657 945 -4232 4317 -1557 -2080 4039 -2902 -612 4340
381D340j0166R697l145n918J2030j1613N233L027q171P726l118j708L028O0n027
$$ 4340 -5826 3871 726 -5192 6838 -4775 458 3485 -4686 3040 -78 -1786 1242 1302 -3725
396c725P296l598n134J3896j6685J0452K373j4986K0545j6369N042P204j4118
$$ -3725 3571 -27 -5161 8735 -7950 2502 4875 -10111 10434 -5935 -893 6311 -7807
409g807J3157o809K73K424r00j534Q70L910r830J2400q942L20R390j5118J4009
$$ -7807 5350 -1459 -1186 1238 338 -1196 -326 3584 -6246 6154 -2788 -2468 6922 -8196 5813
424E813p151j453P434q512N870k613J211j980L233k945J41M505r054J1295r686
$$ 5813 -1338 -2791 4643 -3869 2001 -612 599 -1381 1852 -1093 -952 3553 -5501 5794 -3892
439c892M234L191j0025J4095j4012R609k179o089J2549j4700J1874n924k98M720
$$ -3892 342 3533 -6492 7603 -6409 3200 1021 -5068 7481 -7219 4655 -1269 -1567 3153
453C153o841P532q178R194r052N639J739j1391J9035j9805J2161N48j2197J7543
$$ 3153 -3688 3844 -4334 4860 -4192 1447 3186 -8205 10830 -8975 3186 3734 -8463 9080
467I080j5265Q595k460l53P17j803O166j3079J8134j6128N517R703k2017K4881
$$ 9080 -6185 2410 -50 -403 314 -1489 4677 -8402 9732 -6396 -879 8824 -13193 11688
481A1688j7072L331Q931j4369J2379o858K833k661M915n734J782O571j5050J8627
$$ 11688 -5384 -2053 6878 -7491 4888 -1970 863 -1798 3117 -2617 -835 5736 -9314 9313
495I313j4920N524N332j3314J6388j5505J2469p830J395O833j5855K2527k2613
$$ 9313 -5607 -83 5249 -8065 8323 -7182 5287 -2543 -1148 5685 -10170 12357 -10256
508a0256J4291j3j4628K3782k4288J7206o668l268J0736j5476J7503j6381J1388
$$ -10256 4035 4022 -10606 13176 -11112 6094 -574 -3842 6894 -8582 8921 -7460 3928
521C928k694p527J5450j7806J4011o791L10K866l344M005p505J3203j7029J4685
$$ 3928 1234 -6293 9157 -8649 5362 -1429 -1119 1747 -1597 2408 -5097 8106 -8923 5762
535E762m774r644K2146k6562K0766p895n850J4935j7303J4958j1621R094o075
$$ 5762 988 -8656 13490 -13072 7694 -201 -6051 8884 -8419 6539 -5082 4012 -2063
548b063K58R039j9188K5007k2013J0064O107j9525K4790k0910J1538k154m074
$$ -2063 -1805 7234 -11954 13053 -8960 1104 7211 -12314 12476 -8434 3104 950 -3124
561c124P701j0956J4746j7441J5804p731n049J7270k3493K1293j2351J074P906
$$ -3124 4577 -6379 8367 -9074 6730 -1001 -6050 11220 -12273 9020 -3331 -2257 5649
574E649j2339J3228j2785J1849r461M292L729j2464J8257j8398J3027m570l977
$$ 5649 -6690 6538 -6247 5602 -3859 433 4162 -8302 9955 -8443 4584 14 -3963
587c963J0461j4047J5174j4564J1805n670l966J4901k2977K4062j6577L135J0726
$$ -3963 6498 -7549 7625 -6939 4866 -804 -4770 10131 -12846 11216 -5361 -2226 8500
600H500j9822K1685j7140R270j414m695R354j3308J5984j5576J0371p78r856J6977
$$ 8500 -11322 10363 -6777 2493 1079 -3616 5738 -7570 8414 -7162 3209 2431 -7425 9552
614I552j7859J3177n984n11M653o945R046j1726J3618j2106N447N368j6177K1824
$$ 9552 -8307 4870 -1114 -1625 3028 -3917 5129 -6597 7021 -5085 362 5730 -10447 11377
628A1377j9526J0581R12j0634J5866j6032J2593p542K080L325q418J2533j4275
$$ 11377 -8149 2432 3344 -7290 8576 -7456 5137 -2405 -325 3000 -5418 7115 -7160
641g160J2171o163j548P961j1317J1556r609O622l404k03M697r760J3898j4950
$$ -7160 5011 -1152 -2700 5261 -6056 5500 -4109 2513 -891 -1094 3603 -6157 7741 -7209
655g209J1132k619p729J5710j8346J5285q169n61Q380j3455J5046j3085Q058j085
$$ -7209 3923 1304 -6425 9285 -9061 6224 -1945 -2506 5874 -7581 7465 -5620 2438 1353
669A353o277J2048j4236J1921n937j040O141q152P570n693L847k615J556J09k808
$$ 1353 -4924 7124 -7112 4809 -1128 -2168 3973 -4179 3391 -2302 1545 -1070 486 595 -2213
684b213O136q754R099o427J457M048q467J0754j0370P400k477l440Q858j2097
$$ -2213 3923 -4831 4268 -2159 -702 3346 -5121 5633 -4737 2663 186 -3254 5604 -6493
698f493J2065q535K213N001j0569J2467j0242N213N70n209P538p593O097l745
$$ -6493 5572 -2963 -750 4251 -6318 6149 -4093 1120 1690 -3519 4019 -3574 2523 -1222
712a222J223J079l064M642n535N350l888J495J227l727N471n986N205l234K76
$$ -1222 1 1080 -1984 2658 -2877 2473 -1415 80 1307 -2420 3051 -2935 2270 -964 -688
727f88L005n732P051o441L909l8l924O528o988N235j969j427L726m493L900k573
$$ -688 2317 -3415 3636 -2805 1104 1066 -2858 3670 -3318 1917 -52 -1479 2247 -2246 1654 -919
743i19J190j20o05J204j900K648l122K877j640l11K342l839M410l847K226J66
$$ -919 271 151 -454 750 -1150 1498 -1624 1253 -387 -698 1644 -2195 2215 -1632 594 760
759G60k739M685n372M543k248r63M096o023N785l363j46L274m912M673k929M82
$$ 760 -1979 2706 -2666 1877 -371 -1334 2762 -3261 2524 -839 -985 2289 -2623 2050 -879 -397
775c97J687k833K761j815O62K09p78J079j022N79k7k58R0L72p15O40r9p46J597
$$ -397 1290 -1543 1218 -597 65 274 -504 575 -447 132 105 -153 -63 309 -406 234 135 -611 986
794I86k045J655l23j399K612k732J841m18r96K072k526K197j224kJ129j912K267
$$ 986 -1059 596 273 -1126 1486 -1246 595 177 -819 1253 -1273 924 -300 -302 827 -1085 1182
811A182k096J234J59j524K246k114J413n58l02J068j633J827j548Q49Q8j139K029
$$ 1182 -914 320 479 -1045 1201 -913 500 -58 -360 708 -925 902 -646 203 291 -848 1181
828A181k307J632j97j266K064j901J045J0q65J269j115N18J80n93O16l96J38J37
$$ 1181 -1126 506 309 -957 1107 -794 251 261 -604 665 -450 68 248 -345 271 -125 13 150
846A50m78P78p24J52P52j517J689j080j95J694k747K668j247r69K889l529K557
$$ 150 -328 450 -274 -122 630 -887 802 -278 -473 1221 -1526 1142 -105 -1074 1815 -1714 843
863H43n14j622K957k980J757R2j705K347j873P31M56j241J468j187N07L85j146
$$ 843 329 -1293 1664 -1316 441 533 -1172 1175 -698 33 489 -752 716 -471 36 421 -725
880g25J482j263N91L48j306J974j982J109M33j966K744k368R97P76k188K600j852
$$ -725 757 -506 85 433 -873 1101 -881 228 661 -1305 1439 -929 68 844 -1344 1256 -596
897e96L55J073j653J145o5p45P25O3j105J717j421J69J554k882K992j727l13K144
$$ -596 -241 832 -821 324 259 -486 239 302 -803 914 -507 -338 1216 -1666 1326 -401 -714 1430
915A430l006K732j622K71Q36j465J648j638J632j471Q18M40j907K860k731J608
$$ 1430 -1576 1156 -466 -195 641 -824 824 -814 818 -653 165 605 -1302 1558 -1173 435
931D35q0j145J661j514J094q55J017j387J349l61j569L679m869M331j985j489
$$ 435 355 -790 871 -643 451 -404 613 -774 575 214 -1355 2324 -2545 1786 -199 -1688
947a688M834o738O304l520n47M240o196N907l877J117J424l069L631l340K689
$$ -1688 3146 -3592 2712 -808 -1355 2885 -3311 2596 -1281 -164 1260 -1809 1822 -1518 1171
962A171j989J142J52j948L733m628M057k082n51K799l843L478k269J225r70J149
$$ 1171 -818 324 476 -1472 2261 -2367 1690 -392 -943 1856 -1987 1491 -778 447 -523 626
978F26o41j402M586p162P138l753j932P431j0157Q775m029j736N869p002N577
$$ 626 -15 -1417 3169 -3993 3145 -608 -2540 4891 -5266 3509 -520 -2256 3613 -3389 2188
993B188l248J534o75r3J531l678N668o288M747j247k945O132p076N774l225O54
$$ 2188 -1060 474 -201 -294 1237 -2441 3227 -3061 1686 439 -2506 3626 -3450 2324 -901 -247
1009b47J405l083M631n860O067m617J441K765o642Q704q036M852l26m096P219
$$ -247 1158 -1925 2706 -3154 2913 -1704 -263 2502 -4140 4564 -3472 1380 1054 -3042 4177
1024D177q379P332m198k83M606p066O687l978O79J320j248q0P35Q44m507Q060
$$ 4177 -4202 3130 -1068 -1351 3255 -3811 2876 -1102 -423 897 -351 -431 304 1148 -3359 4701
1040D701q598M573K835j0054J3342j1049M514K948q090R511p955N289k951R86
$$ 4701 -3897 676 3511 -6543 6799 -4250 264 3212 -4878 4633 -3322 1967 -984 2
1054BJ622n386R315j1051Q468j688o493J2016j1971O586Q76o166O692l086j342
$$ 2 1624 -3762 5553 -5498 2970 1282 -5211 6805 -5166 1420 2296 -3870 2822 -264 -1606
1069a606K936m01m338P563o531J265N631j0627J1326p739J735M347q751J0702
$$ -1606 1330 929 -3409 4154 -2377 -1112 4519 -6108 5218 -2521 -786 3561 -5190 5512
1083E512j0024O756j360m936J0156j2141R829m148k471P281q659P016m009J367
$$ 5512 -4512 2244 884 -4052 6104 -6037 3792 -356 -2827 4454 -4205 2811 -1198 169
1097A69K66j444K862m446N344m592K097R21k782K746j533R14k390N397p308N205
$$ 169 435 -1009 1853 -2593 2751 -1841 256 1177 -1605 1141 -392 522 -1868 3529 -3779 1426
1113A426J681j0594J6426j4952N674P188j6959J8585j1488k3R384j2124Q381k151
$$ 1426 3107 -7487 8939 -6013 -339 6849 -10110 8475 -3013 -3036 6348 -5776 2605 454
1127D54j902J812P11k277P22L193o513O663l278j543M692m395J749L49K86l238
$$ 454 -1448 364 1075 -1202 -480 2713 -3800 2863 -415 -1958 2734 -1661 88 437 723 -2515
1143b515N649m607m81P372j2143J1724n822l060J0835j4010J1572n221k054P631
$$ -2515 3134 -1473 -1954 5418 -6725 4999 -823 -3883 6952 -7058 4514 -707 -2761 4870
1157D870j0247R713o454J419L856p521P971n000K89L584m488K013K016m434K914
$$ 4870 -5377 4336 -2118 -699 3157 -4364 3607 -1393 -1104 2480 -2008 5 2021 -2413 501
1172E01K060p170Q702n132j706P750r594O797j748k351L656k785K107l334N779
$$ 501 2561 -4609 4093 -1039 -2745 5005 -4589 2208 460 -1891 1765 -1020 1087 -2247 3532
1187C532o599L175M127j1524J4112r347p45J0582j4637J0801j688p023J0190o530
$$ 3532 -3067 108 4235 -7289 6823 -2524 -3269 7313 -7324 3477 1789 -5234 4956 -1574
1201a574p53O268o285J142N246q304O004O1o146Q888p162K467K292m859M919l706
$$ -1574 -2327 3941 -2344 -1202 4044 -4260 1744 1805 -4341 4547 -2615 -148 2144 -2715 2204 -1502
1217a502K602j926R85R69l654N717n726L383L12l759N547n129L086n76j509K852
$$ -1502 1100 -826 159 1128 -2526 3191 -2535 848 1160 -2599 2948 -2181 905 329 -1180 1672
1233A672l387L025j715k95K115k558J052J430k896J809J695n539O778l718k660
$$ 1672 -1715 1310 -405 -700 1415 -1143 -91 1339 -1557 252 1947 -3592 3186 -532 -3192
1248c192Q880j0984P139R03q639J1600q265J012N614p919N236j24l468L222J40
$$ -3192 5688 -5296 1843 2746 -5893 5707 -2558 -1546 4068 -3851 1385 1261 -2207 1015 1155
1263A155l541L942o69m032O691n172L10M725o645M309M47m166M263r13l252M991
$$ 1155 -2386 1556 887 -3145 3546 -1626 -1316 3409 -3236 1073 1520 -2646 1617 704 -2548 2443
1279B443k763k169O513p250L655K314p253Q419n333p8M819o669N202j707j720
$$ 2443 -320 -2489 4024 -3226 429 2743 -4510 3909 -1424 -1502 3317 -3352 1850 143 -1577
1294a577L373k833R54Q43j453N97J102k412K353p32j822M020m527K759N87l742
$$ -1577 1796 -1037 -83 760 -693 -96 1006 -1406 947 215 -1607 2413 -2114 645 1232 -2510
1310b510N021l755P44K164l269K135J93j851J453Q69l397L923j470k803O200o320
$$ -2510 2511 -1244 -500 1664 -1605 530 723 -1128 325 1194 -2203 1720 250 -2553 3647 -2673
1326b673K736K563o455O582k919k129N282m532N68L623m923K265K603o269O086
$$ -2673 63 2626 -3829 2753 -166 -2295 2987 -1545 -977 2646 -2277 -12 2591 -3678 2408
1341B408j922l746P494p071K736K837o279N740k039k028L778k366p65L102k811
$$ 2408 486 -3260 4234 -2837 -101 2736 -3543 2197 158 -1870 1908 -458 -1223 1879 -932
1356i32n5L652n503M112n0m387O564n241J323K851n061M378j580j483L008k256
$$ -932 -987 2665 -2838 1274 1224 -3163 3401 -1840 -517 2334 -2727 1651 71 -1412 1596 -660
1372f60n7K263k765J064J795m025M189k021j405M330n154L398n9k943L908k454
$$ -660 -717 1546 -1219 -155 1640 -2385 1804 -217 -1622 2708 -2446 952 893 -2050 1858 -596
1388e96j53J932j571o05K878l306J081K835o061O239k778k628O913p522M084J274
$$ -596 -749 1183 -388 -993 1885 -1421 -340 2495 -3566 2673 -105 -2733 4180 -3342 742 2016
1404B016n335N826k822j441M030l258k16L825m868K366K197n870O260l141j582
$$ 2016 -3319 2507 -315 -1756 2274 -984 -1200 2625 -2243 123 2320 -3550 2710 -431 -2013
1419b013N157n642L146M16k764K635n68j483J767J22k884M445l438J01L879o297
$$ -2013 3144 -2498 648 1064 -1700 935 367 -1116 651 773 -2111 2334 -1104 -1003 2876 -3421
1435c421N762k455j925N143n656L441j1k595L034j408r16K162j318j257L947m805
$$ -3421 2341 -114 -2039 3104 -2552 889 878 -1717 1317 -91 -1007 1155 -163 -1420 2527 -2278
1451b278K784J419n591P263n351Q06L928o339N362j968j527K949j763o14J921
$$ -2278 506 1925 -3666 3597 -1754 -948 2980 -3359 2003 35 -1492 1457 -306 -920 1001
1466A001p32k316M956m908J610L229o732O789l331j540M947n047K254J118k612
$$ 1001 269 -2047 2909 -1999 -389 2840 -3892 2897 -434 -1974 2973 -2074 180 1298 -1314
1481a314J281J689l813L181J93m449P028o240K269K976o909P679n207R54K953
$$ -1314 -33 1656 -2157 1024 1217 -3232 3796 -2444 -175 2801 -4108 3571 -1636 -682 2271
1496B271m928M656k926R03M83r09P00n35R65j944K873k962J676P84l424M972m527
$$ 2271 -2657 1999 -927 -24 459 -450 250 -285 680 -1264 1609 -1353 323 1107 -2317 2655 -1872
1513a872K149J061l375L588j877k10Q55N42k769L636j578k963P435q785N486J259
$$ -1872 277 1338 -2037 1551 -326 -536 319 861 -1908 1728 150 -2813 4622 -4163 1323 2582
1529B582p894J0624p935J556M668p302N477j207k204K480M4k922L538r53l387
$$ 2582 -5312 5312 -2623 -1067 3601 -3701 1776 569 -1635 845 889 -2033 1505 552 -2835
1544b835O604o421K760K227n709O054l690N52J380j450N90k66J322l215M412l543
$$ -2835 3769 -2652 108 2335 -3374 2680 -1010 -458 922 -528 62 -204 1118 -2097 2315 -1228
1560a228N02L336o031O293m109O53K549m489M874l901J992K27k072K934k572J356
$$ -1228 -726 2610 -3421 2872 -1237 -584 1965 -2524 2350 -1551 441 668 -1404 1530 -1042 314
1576C14j63r9p89J964k009jL527o553O752l287k388P257q620N850o91l851N372
$$ 314 151 52 -737 1227 -782 -783 2744 -3809 2943 -344 -2732 4525 -4095 1755 1064 -2787 2585
1593B585l743R52N77K29k260L108j057l199O937p402L796K076o822P693m393p04
$$ 2585 -1158 -206 371 600 -1660 1448 391 -2808 4129 -3273 523 2599 -4223 3470 -923 -1627
1609a627M197l971P31K640l241L64L932o482N238o98m595P682p031L345J115m141
$$ -1627 2570 -1401 -670 1970 -1271 -907 3025 -3457 1781 1083 -3512 4170 -2861 484 1599 -2542
1625b542M826l806K373j321N05O13k151L503l867K878q96j136K416k750K473j987
$$ -2542 2284 -1522 851 -470 35 648 -1503 2000 -1867 1011 115 -1021 1395 -1355 1118 -869
1641h69J468o94n97K234l406L266j759k76J674j714P93j56P57k365L592k882k76
$$ -869 599 -95 -692 1542 -1864 1402 -357 -633 1041 -673 120 -36 721 -1644 1948 -934 -1210
1658a210M632p612O957k528l449P662p798L985J235m603M425j594j343K071j47
$$ -1210 3422 -4190 2767 239 -3210 4452 -3346 639 1874 -2729 1696 102 -1241 830 683
1673F83k724L990k264j502M871n616L283N34l340L601j798j99P29M97k195K547
$$ 683 -2041 1949 -315 -1817 3054 -2562 721 1255 -2085 1516 -282 -481 248 745 -1450 1097
1689A097o46k681N384n651L048J158m764O032m683J783J153l010L412k743J607
$$ 1097 451 -2230 3154 -2497 551 1709 -3055 2977 -1706 77 1230 -1780 1632 -1111 496
1704D96m24n88J216j373J128o45K04j95O86j163Q70M69k311L593l276J225J560
$$ 496 72 -516 700 -673 455 -190 14 -181 505 -658 212 681 -1630 1963 -1313 -88 1472
1721A472l620L947k546L83J267j590R31m66R79k121K740j714r45L886n213L893
$$ 1472 -2148 1799 -747 -364 903 -687 244 -222 757 -1364 1376 -338 -1283 2603 -2610 1283
1737A283n78k894M609l663Q28J785k387Q53J324k319J188J419l684L986k050j084
$$ 1283 705 -2189 2420 -1243 -415 1370 -1017 -164 1160 -1159 29 1448 -2236 1750 -300 -1384
1753a384L717m455L036n10j562K296j852J038n82O43p48L96N24j643K374k233
$$ -1384 2333 -2122 914 404 -1158 1138 -714 324 -258 385 -363 33 557 -1086 1288 -945
1769i45J124M80j752K148j714R08j69l03N67p60Q63q33P11o05M57j54l21R57j734
$$ -945 179 659 -1093 1055 -659 249 80 -223 344 -416 447 -386 325 -280 177 23 -298 659 -1075
1788a075K257j968O75J294l119L740k643L53J885k986K639j280j59Q15n60L1L7
$$ -1075 1182 -786 -111 1183 -1936 1804 -839 -486 1399 -1587 1052 -228 -387 428 -132 -101 -64
1805f4O13j567K005j321k93J930k578J938m83r02J426q74j47P04k71r01J963k024
$$ -64 549 -1018 987 -334 -627 1303 -1275 663 180 -722 704 -170 -317 387 116 -785 1178 -846
1823h46P52J272k947L316k213J94J779k806K600j573L51N62j019J169j244J272
$$ -846 -94 1178 -1769 1547 -666 -472 1307 -1499 1101 -472 -121 441 -578 591 -653 619
1839F19j086N53K58j050J549j547J090m11k43P33r81R96q41O02l18K8K37m89P96
$$ 619 -467 86 344 -706 843 -704 386 -25 -268 465 -516 480 -361 241 -77 -49 188 -301 495
1858D95j141J369j267O24N67j862K631k453J268M46j951K613k231J121R7r17J114
$$ 495 -646 723 -544 80 647 -1215 1416 -1037 231 677 -1274 1339 -892 229 326 -591 523
1875E23q81O68p45R45q93L54N73j514K016j776Q57K92j133J423j215Q55o92O45
$$ 523 -358 310 -435 510 -383 -29 544 -970 1046 -730 127 419 -714 709 -506 349 -343 302
1893C02l85k51J207k053K281j646L20J212k324K562j904P31M23j211J550j521
$$ 302 -83 -334 873 -1180 1101 -545 -225 987 -1337 1225 -679 52 475 -736 814 -707
1909g07J235p75K15L02p13J018j219J232r89N15J18q12J413j792J743j153J52
$$ -707 528 -247 -32 270 -443 575 -644 588 -401 114 232 -580 833 -959 784 -369 -217
1926b17R19j713K071j913J310m07o42J605k185K245j727O89O64j921K606k409
$$ -217 702 -1011 1060 -853 457 50 -592 1013 -1172 1073 -654 35 699 -1222 1384 -1025
1942a025J398j4j140J664j595J150o18K80j39l3M48j094J655j756J182j76q56
$$ -1025 373 359 -781 883 -712 438 -180 100 -39 -72 376 -718 937 -819 363 187 -669
1959f69J601j905J788j317N56L70j331K101k406K041r78m92J830k538K421j603
$$ -669 932 -973 815 -502 54 424 -907 1194 -1212 829 -149 -641 1189 -1349 1072 -531
1975e31M82N90j384J774j731J349p67J34N04j073J485j631J406q35P8P04j406
$$ -531 -49 541 -843 931 -800 549 -218 -84 420 -653 832 -799 607 -228 -150 554 -852
1992h52J853j902J481o27n07J603k316K388j718M70Q77j825K101j791J133m07
$$ -852 1001 -901 580 -47 -554 1049 -1267 1121 -597 -127 750 -1075 1026 -765 368 -39
2008c9k35Q17j340J670j639J187l78n38J282j666J654j328Q45k01o20J514k175
$$ -39 -274 543 -797 873 -766 421 43 -495 787 -879 775 -553 292 91 -529 985 -1190
2025a190K268j608L36J055k084K441k050J127j7r40J506j649J479j102N57O7p27
$$ -1190 1078 -530 -194 861 -1223 1218 -832 295 278 -662 844 -805 674 -428 129 196 -531
2042e31J281j557J486j088M22L75j080J519j625J409r39K27O77j591K213k176
$$ -531 750 -807 679 -409 13 388 -692 827 -798 611 -328 -101 576 -1015 1198 -978
2058i78J398j09j223K112k298J764p46l08J092j458J446j182P61k38l16P40r55
$$ -978 420 311 -912 1200 -1098 666 -80 -388 704 -754 692 -490 271 33 -283 457 -498
2075d98J005r80Q78n97Q1O06j307J743j737J210k54q85J843k255J987j155MJ140
$$ -498 507 -473 405 -192 -111 495 -812 931 -806 404 150 -735 1108 -1147 840 -315 -311 829
2093H29j962K196j780Q52K80j190J641j621J219n43j90P27r38Q97o97M86l09J49
$$ 829 -1133 1063 -717 135 415 -775 866 -755 464 -79 -269 458 -480 417 -280 206 -103 46
2111D6O2l67P26j060J189r45K90N82j331J679j551R88j19q15J501j759J504q28
$$ 46 108 -259 467 -593 596 -349 -59 523 -808 871 -680 308 189 -626 875 -884 620 -208
2129b08k0P73j317J555j384Q68j57o04J215j478J320p91O2O11r61R46p51N31l07
$$ -208 -228 545 -772 783 -601 267 110 -494 721 -757 563 -228 -166 445 -516 430 -321 210 -97
2148i7R1J92n29Q22r38Q04m27q2N55q44Q90p52N44k91r0N80j050J305j192O31
$$ -97 -6 186 -343 479 -459 345 -82 -164 391 -453 437 -315 229 -62 -152 428 -622 683 -509 122
2168A22K20j058J552j542J016j57o55J136j266J066o30J37L62q00J052r98O43
$$ 122 342 -716 836 -706 310 153 -502 634 -632 434 -196 -59 303 -497 555 -443 200
2185B00j13l79O70o70M57k28J42k11K92j46k76P99j127J033n19k14Q82j278J259
$$ 200 87 -292 378 -292 165 -63 79 -132 160 14 -262 537 -590 443 -76 -290 592 -686 573
2204E73q78K94L39q90J223j262R44k89n21J162j331R53k96l21O60o26L59j16N5
$$ 573 -305 -11 328 -562 661 -601 343 54 -467 695 -636 317 21 -300 360 -266 93 -23 32
2223C2j73L42l05J3M13p46Q09o08K66J19m68P45r29R49o82J17O39j356J684j339
$$ 32 -141 201 -104 -91 322 -424 385 -223 43 162 -306 439 -490 459 -223 -106 533 -823 861 -478
2243d78L70P87j566J614j023J28N90q16O17k76L7o7K86l97J89K34o14P15n61K94
$$ -478 -108 679 -887 727 -296 -168 422 -394 223 -53 -16 -83 203 -194 -5 229 -385 330 -231 63
2263F3j4j50K69m30O23p46O80l25l12R74j317J159n66j73Q01j104J050p35K52
$$ 63 49 -101 168 -262 361 -385 295 -30 -342 632 -685 474 -92 -265 536 -568 482 -253 -1
2282aK50o12P52p08N34k69m2K82l97M16l92L94m21L33k5m49Q41r82P87k58m03
$$ -1 249 -363 389 -319 215 -54 -96 186 -211 205 -187 207 -214 119 94 -355 486 -496 291 33 -370
2303c70Q82r37O11j66j25J24J7j1k77P38j003Q41k28o29J292j378Q56m4n94P97
$$ -370 512 -425 186 20 -105 19 36 25 -252 486 -517 324 96 -533 759 -619 237 193 -401 396
2323C96n95K80j77L10m43L37R5p35J213j230O95J95j006J316j046M24J70m60M24
$$ 396 -199 81 -96 214 -229 108 203 -532 681 -549 146 341 -665 651 -395 29 199 -261 163
2342A63k45J46k36M47n97M75k1n77J041j122P77j65m57Q93j022Q56m62J6L25n09
$$ 163 -82 64 -172 275 -322 153 132 -445 596 -526 251 86 -371 522 -500 356 -106 -90 235 -274
2362b74N58n41N36m83L19l1l74Q27j172J144o33k19J020j406J206n45j76N67n67
$$ -274 284 -257 279 -204 115 84 -290 537 -635 509 -124 -343 677 -729 477 -68 -244 323 -244
2381b44L34j61K73o09Q33o09j32J046j646J550p02m24J244j401R33k05k93L18
$$ -244 90 -71 202 -407 426 -183 -315 731 -915 635 -67 -491 753 -648 285 80 -213 105
2399A05lk42P0N26j182J402q99j93J348j950J710p76l59J138j309R63m53R3K0
$$ 105 102 -140 -70 456 -726 676 -223 -416 932 -1018 692 -84 -443 695 -614 349 -104 -11 9
2418Ij9J14m06P79j035R52n01j88R02j344J334q89J74N15r17R73p50M40k23J53
$$ 9 -10 104 -302 477 -558 394 -107 -295 607 -737 597 -292 -118 397 -520 453 -297 143 -80 73
2438G3j06j16O30j256J612j327L22J034k079K266j463O8J215j765J406m93k98
$$ 73 -33 -149 481 -775 837 -490 -168 866 -1213 1053 -410 -342 873 -892 514 21 -277
2455b77M63n0m62N15O1j007J697j605O58P11j791K006j318K40N85q28O31m24N08
$$ -277 186 136 -326 189 250 -757 940 -665 -7 704 -1087 919 -399 -159 426 -402 229 -195 313
2474C13q31J037p49j04J231k060K096j225j58J417k031J816j005N3O93j001Q65
$$ 313 -518 519 -230 -334 897 -1163 933 -292 -450 967 -1064 752 -253 -200 493 -508 357
2491C57m77J45j09L22n39M70J9q23J572j831J321j31j269K203k186J244M8j030
$$ 357 -120 25 -84 238 -301 169 188 -635 937 -894 427 296 -973 1230 -956 288 336 -694
2509f94J316r96N17k77L95o42N25K29j358K217k113Q96Q73k218K399j376q9J099
$$ -694 622 -374 143 -134 261 -381 144 373 -985 1232 -881 15 888 -1330 1069 -307 -396 703
2527G03j117L32M77n70k36J399k001J401K20j983K894k454R27Q45k002K173j523
$$ 703 -414 -82 395 -175 -411 988 -1013 388 608 -1375 1519 -935 -8 837 -1165 1008 -515
2544e15N41K24n49N53n47O67q27Q44n90O9N44j051J303j210P70o5o62J174j295
$$ -515 26 250 -299 254 -293 374 -453 391 -199 -130 414 -637 666 -544 226 161 -501 673 -622
2563f22R98m55q2L87l97L33m51Q71j349J380n68r46K456l052K190j82j976L133
$$ -622 376 -79 -161 226 -171 162 -289 582 -767 613 45 -901 1555 -1497 693 511 -1465 1668
2581A668k674R41R61j878J376r5q65P12M12j595J854q08r81K403k572J382L69
$$ 1668 -1006 -65 896 -982 394 299 -566 146 558 -1037 817 9 -972 1431 -1141 241 610
2598F10j610J734r12k8L27J45q24R52j64j195K299k367J232N91k153K667j996
$$ 610 -1000 734 -178 -206 121 266 -558 394 230 -965 1334 -1033 199 790 -1363 1304 -692
2615f92O33O65j355J362r55M62j03p3J33j50J81l09N41q24R72p65O4R87j918K133
$$ -692 -59 606 -749 613 -342 120 17 -56 77 -73 108 -201 340 -484 488 -277 -213 774 -1144 989
2635I89j359j32J587k230J739n19n81R16m65j78K88L96j383J854j154n60K297
$$ 989 -370 -502 1085 -1145 594 75 -506 410 -55 -233 55 451 -932 922 -232 -792 1505
2652A505k921J950Q4j896K406j426k38J347j122k03J562j821N90J434k904K774
$$ 1505 -1416 534 618 -1278 1128 -298 -536 811 -311 -514 1048 -773 -183 1251 -1653 1121
2668A121j069j236K808k852J529K23j398J511q55J10J15K07n96N77J1q43J399
$$ 1121 52 -1184 1624 -1228 301 524 -874 637 -218 -108 7 214 -382 195 206 -637 762
2685G62j326O85J58p97J078j001O82k93p1L72n53N86m61K77j76K56l66K00M21
$$ 762 -564 121 279 -518 560 -441 241 -52 -123 249 -304 282 -179 98 -78 178 -188 12 433
2704D33j297J870j577K97J394k593K545j195p40K146k194R76N79j374Q81L93j403
$$ 433 -864 1006 -571 -274 1120 -1473 1072 -123 -863 1283 -911 65 644 -730 151 544 -859
2721h59J285Pj619K436j816M9J786k534J817k07j189J467o36m50Q70k64r01J716
$$ -859 426 433 -1186 1250 -566 -517 1269 -1265 552 345 -844 623 -13 -463 407 143 -758 958
2739I58j435P8J583k521K117n95j143K106j885Q08L67r64Q20k38k91L57Pn08Q06
$$ 958 -477 -399 1184 -1337 780 185 -958 1148 -737 71 438 -526 294 56 -235 122 129 -379 427
2758D27o93J96M86j049J264j056M00M68j187J455j115L32M83q99P81l07r7O9L50
$$ 427 -266 -70 416 -633 631 -425 -25 443 -744 711 -404 -72 411 -488 293 -14 -111 -42 308
2777C08p28O33J03j161J847j590L82J148k065J827n94q31J507j053j24J113j134
$$ 308 -420 213 316 -845 1002 -588 -206 942 -1123 704 110 -721 786 -267 -391 722 -412
2794d12R8J282k000J413J92j840K505j777J41J398j978J396k03p52Q88k61n02
$$ -412 -314 968 -1032 381 573 -1267 1238 -539 -398 1000 -978 418 215 -537 351 90 -412
2811d12P23j77p68J435j284L47Q50j634J603q29k16R78j121P17j07l08K89K4l21
$$ -412 311 134 -634 801 -483 -136 714 -920 683 -146 -362 616 -505 212 105 -203 86 110 -211
2830b11L72p0m60R38j099P34Q1r91J555j459P09L38j181J391r25J05N55o60J91
$$ -211 161 91 -369 569 -530 204 285 -706 849 -610 99 437 -744 647 -278 -173 382 -278 -87
2849h7M07n74R4P64j378J220k59j021J883j750O82O75j502J351m28n23Q24l27
$$ -87 320 -254 -160 604 -774 446 187 -834 1049 -701 -19 656 -846 505 77 -446 378 51
2867E1n28J036p31k74J384j854J272Q6j435J998j518L29P93j235R10j93l56L59
$$ 51 -477 559 -172 -446 938 -916 356 442 -993 1005 -513 -184 609 -626 284 91 -265 94
2885I4J08o22P20k32o13J287j334P10K49j055J338j032L53L34o92O37k79o9J39
$$ 94 202 -420 300 68 -545 742 -592 118 367 -688 650 -382 -29 305 -387 250 -29 -98 41
2904D1R8m32O02l90j92Q82j327J217m58o21J450j594R92qq15J052p01R5K93k01
$$ 41 139 -293 309 -81 -273 609 -718 499 41 -580 870 -724 268 260 -555 497 -204 -109 184 -17
2924a7k64O51n31j37R98j490J194j94r45J564j357M77N15r66O85Rn56N18J33r27
$$ -17 -281 370 -161 -298 700 -790 404 210 -735 829 -528 -51 464 -502 183 192 -364 154 287 -640
2944f40J254p78k91J365j810J368k70q79J502j378O97R0n49N63l18R6j16K93m59
$$ -640 614 -164 -455 910 -900 468 198 -681 821 -557 140 230 -319 244 -74 22 -94 199 -260
2963b60M22j10l80Q04r54P21j97l77P72q32N69j55j72K73j53l0K4K63o82R35p00
$$ -260 162 52 -328 476 -478 243 46 -331 441 -391 178 23 -149 124 -29 -59 -35 228 -454 481 -219
2984b19p3J044j679J571o73n77J549j731J060K9q91J053n50j45M94k63l34Q41
$$ -219 -292 752 -927 644 -29 -606 943 -788 272 301 -590 463 -87 -232 262 -1 -335 506
3002E06p98J47P21j277J173m91l82Q83q23M04k5k0j98L66j97l24R39j269J019
$$ 506 -292 -145 576 -701 472 -19 -401 482 -341 63 38 18 -180 186 -11 -335 604 -665 354
3021C54k21p59J430j455Q77Jp38J048r19M99ol17L74k21MJ06ok56N27n94L65J47
$$ 354 133 -626 804 -651 226 227 -511 537 -382 117 111 -206 168 -53 -49 57 51 -205 322 -272 93 240
3043B40p73J158j044M50L57j000J145p99K42K10l87K98k03L25o18P99n84q9R34
$$ 240 -533 625 -419 31 388 -612 533 -266 -24 186 -201 97 -106 219 -399 400 -184 -273 661
3062F61j460J273m20n97J213j086M06L25o25L19L08o91M86K40j020J308q82k9
$$ 661 -799 474 54 -543 670 -416 -10 315 -310 9 317 -374 112 352 -668 640 -242 -271
3080b71R28j346J122m76j98N77o11M51l17K98l10J78J25n03P47p15M19j6l36N43
$$ -271 657 -689 433 -43 -241 336 -275 176 -141 157 -153 25 150 -353 394 -321 98 82 -254 289
3100B89n60M64l16J51M2k70M80n57M56k27J0J01j67K74m71O85p06L67K92r73J306
$$ 289 -271 193 -123 28 70 -200 280 -277 179 -48 -38 63 -104 170 -301 384 -322 45 337 -636 670
3121F70j032K70N90j073R37l73k08L95j34k55L62l6n36R64r13L20M84j041J053
$$ 670 -362 -92 498 -575 362 -11 -219 176 42 -213 149 113 -423 541 -372 -52 432 -609 444
3140D44n74m7M32m35K05n0J65m38O11m47p6P20j104R87m10l03P83q42N48j61p8
$$ 444 -130 -177 255 -180 25 -25 140 -298 313 -134 -210 510 -594 393 -17 -320 463 -379 169 8 -70
3161g0J36j07J25k34L96m76L47o7k29M45n18M69l90K65j9l38O84q40O71k38k93
$$ -70 66 -41 84 -150 246 -230 117 50 -179 266 -252 217 -173 92 73 -265 419 -421 250 12 -281
3182b81O73p57N32k05k8J11r0J31l34N77o24L75J12n86Q01o50K36J72l35K37m7
$$ -281 392 -365 167 -38 -66 45 -45 86 -248 329 -295 80 192 -394 407 -243 -7 165 -170 67 20
3203B0Jj96N05o28L91J58p59J046q62K99L51p79Q02n08J52P6j40J18j73L27m90
$$ 20 21 -175 330 -298 93 251 -508 538 -324 -25 326 -453 349 -159 -7 69 -71 47 -126 201 -289
3224b89M90k63j07M63o27N40k74j2J76k17K29k53L22l59K67j9k84M99n43M42k31
$$ -289 201 -62 -169 294 -333 207 -67 -79 97 -120 109 -144 178 -181 86 67 -217 282 -261 181 -50
3245e0k4K43l99N03n09L91j38j91M90o52N62k87l7K80l83L50k90K42j94J02Q9
$$ -50 -74 169 -230 273 -236 155 17 -174 316 -336 226 -61 -98 182 -201 149 -141 101 -93 9 98
3266I8l24M96n39L62l9k75M48m24K93j40N2on0J69l39M76m63K46J22m60O41n72
$$ 98 -226 270 -269 93 54 -221 227 -197 96 -44 8 2 -48 121 -218 258 -205 41 163 -297 344 -228
3288b28L10ok29L50l70L35k74J82n4j35L36m69M43k73LK33l60L74k87J76r2qJ11
$$ -228 82 76 -153 197 -173 162 -112 70 16 -119 217 -252 191 -82 -79 154 -206 168 -119 57 -35 -43 68
3311F8k06K97l68L53j93m3K94m59M79l59J57Q4l01M47m68L67j88l2K50m09M45
$$ 68 -138 159 -209 144 -49 -92 202 -257 222 -137 20 104 -197 250 -218 149 -39 -71 179 -230 215
3332B15l45J53N3k15K87k92K52j84Q4L1j40K34k94K97k26R2O8k16L35l88L44k28
$$ 215 -130 23 76 -139 148 -144 108 -76 8 39 -101 133 -161 136 -90 2 70 -146 189 -199 145 -83
3354h3K2K24m17M88m16K41Mk48M25m55L54j72k2J90k90L29l02K18r7o0K16l25
$$ -83 -61 163 -254 234 -182 59 63 -185 240 -215 139 -33 -55 135 -155 174 -128 90 -7 -67 149 -176
3376a76L56k84J28M7j83K29k25K13j91J45o7q8K71m01M08k83N0K16m03M46l58
$$ -176 180 -104 24 71 -112 117 -108 105 -86 59 -8 -96 175 -226 182 -101 -51 165 -238 208 -150
3397a50J82j5j43K81l40L42k77J26N9k22L70m20L36j50o1K39l20K98k23J39m3
$$ -150 32 17 -126 155 -185 157 -120 6 65 -157 213 -207 129 -21 -82 157 -163 135 -88 51 8
3418Ho0J32k11K79l09K64j00j23L08m11L97k93J09J08l13M28l99K67p8j31K83
$$ 8 -52 80 -131 148 -161 103 3 -120 188 -223 174 -119 -10 98 -215 213 -186 81 3 -128 155
3439A55l45L21k20R8J2j26K28k85K98k25Q5R0k14K95l03K38j51M5R1k28L28l79
$$ 155 -190 131 -89 9 21 -105 123 -162 136 -89 -4 86 -128 167 -136 102 -49 -4 87 -141 187 -192
3461a92L37j83p3L19m63M75l48J03J68l71M40l62J81rj13J80k08K17k20J85j06
$$ -192 145 -38 -111 208 -255 220 -128 -25 143 -228 212 -150 31 22 -91 89 -119 98 -122 63 -43
3482d3kJ50k76L33k81J74k8j29K47l30L64k97J46P2k89M20m27L18j16j20L15m18
$$ -43 -45 105 -171 162 -119 55 27 -102 145 -185 179 -118 28 100 -189 231 -196 122 6 -114 201 -217
3504b17M03k68O2J18k50L08k66J90j15L3L7j12J97k81L02k39Q8R5k69L90m18L32
$$ -217 186 -82 -20 98 -152 156 -110 80 -35 -2 35 -77 120 -161 141 -98 -10 85 -184 206 -212 120
3526A20j32j09L29m50M27k76O8J43k95L56l34K58j18m4J83k63K79k31J18k3l4
$$ 120 -12 -121 208 -242 185 -91 -23 120 -175 181 -153 105 -13 -57 126 -137 142 -89 29 6 -28
3547b8R7j71K30k73K52j49l6K44l99M38l40J29J14l39M62m49L14r9j40L31m08
$$ -28 69 -102 128 -145 107 -42 -78 166 -233 205 -135 -6 108 -231 231 -218 96 -3 -143 188 -220
3568b20L66k35P1J02k27K83k47J64o6jL0o0J15j94K81k89J88qk27M00m36L35j43
$$ -220 146 -89 -18 84 -143 140 -107 57 -9 -10 20 -40 75 -119 162 -127 61 53 -174 226 -210 125 -18
3591a8p9K73m03M24l29J41Q2k87M01l93K74q5j15K38k61K26j60J01m6k6J01j54
$$ -18 -97 176 -227 197 -132 9 91 -196 205 -188 86 1 -114 124 -137 89 -71 30 -16 -42 59 -95
3613i5K02k17J87j08j2J62k94L53l16K06j1k21M21m96L87j51j32L54m25L41j65
$$ -95 107 -110 77 -31 -43 119 -175 178 -138 68 57 -164 257 -239 148 -3 -135 219 -206 135 -30
3634c0k9J39j43J09j12J51k01J76n2j17K60l20K62j30j6J04j31J45j90K59k46
$$ -30 -59 80 -63 46 -66 85 -116 60 8 -109 151 -169 93 -37 -53 51 -80 65 -125 134 -112
3655a12J22J18l56M77m21K14Q3l45M42l69J88J8j54J97j81J39j10Q0m7J8L7j21
$$ -112 10 128 -228 249 -172 42 125 -220 222 -147 41 59 -95 102 -79 60 -50 30 -17 1 38 -83
3677h3J96k34K05j10k4J47k67L41k91J33O0k38L20k82J67m2m5Q6j50K41k82K63
$$ -83 113 -121 84 -26 -50 97 -170 171 -120 13 73 -165 155 -127 40 -2 -47 39 -111 130 -152 111
3699A11j33q4L22m32L44r8j53K62j97L6P8l0j32K63k40L3K63m74M63k23j22L83
$$ 111 -22 -106 216 -216 128 30 -123 139 -58 -22 56 26 -106 157 -83 -50 213 -261 202 -21 -143 240
3721B40m56L00p0r5J45j01M9p7J42k03J78l1j76L34l38K01jj67K27j91J20l4%
$$ 240 -216 84 14 -81 64 -37 12 -65 77 -126 52 21 -155 179 -159 42 41 -126 101 -90 30 -4 -4
3744dj2K0K8j02J81k10J63o9n4J86k83L17k48O5J81l89M01k44QK04k68J80m5p1
$$ -4 -16 4 32 -70 111 -99 64 -5 -59 127 -156 161 -87 -22 159 -230 171 -73 -65 139 -129 51 6 -65
3768f5M8R1j78J33N5k94M09k94KK76l87K85m0j61J90n7j19J75j2k48M13l45N3
$$ -65 -17 74 -104 29 84 -210 199 -95 -93 183 -204 81 41 -120 70 13 -106 69 57 -191 222 -123 -70
3791g0L17n62N22k02j81M41m33K09M6j94J49Jj10P7O1k14K67j78k8K19l09K72
$$ -70 247 -315 207 5 -176 265 -168 41 87 -107 42 43 -67 10 71 -143 124 -54 -82 137 -172 100
3813A00j33k4J27j71J69j39Q3j1m1O4p1J06j41J70j53M8J33l03L81k79M0K34m06
$$ 100 -33 -57 70 -101 68 -71 12 1 -40 24 -47 59 -82 88 -65 -17 116 -187 194 -85 -45 189 -217
3836b17L52j12j47K57j70l5K09k04j2K83m22K95N1m17N68m06K2L40m74L31m2j94
$$ -217 135 23 -124 133 -37 -72 137 -67 -79 204 -218 77 128 -289 279 -127 -105 235 -239 92 50 -144
3858a44K12m6j55K01j7k50M26l69O9L09n07M51j76j64L65l33J39O8j58Q8P2j70
$$ -144 68 22 -133 68 51 -199 227 -142 -73 236 -271 180 4 -160 205 -128 11 79 -79 9 81 -89
3880h9J25L1k07L09k68J07J27l16L54k67O8J34k44K35j46K1N1l9k0O0k1j24K79
$$ -89 36 67 -140 169 -99 8 135 -181 173 -94 -26 108 -136 99 -47 -26 25 -14 -34 26 5 -119 160
3903A60l28K08Q1l73N06m08R8K59m47L81j02j92L06j60j15L00k48m0L64n09L53
$$ 160 -168 40 121 -252 254 -154 -56 203 -244 137 35 -157 149 -11 -126 174 -74 -114 250 -259 94
3924I4K9m11N72m09N8K48l49K06K0j51P8J12k63K39ql00M89m32J30K49m87M66
$$ 94 123 -288 284 -125 -67 181 -168 38 58 -93 -15 97 -166 73 65 -235 254 -178 -48 201 -286 180
3946A80k25q0K89k86J32N3j59J10O2k19K57j13j31L38m11K95l7k36M12m03K21
$$ 180 -45 -125 164 -122 10 63 -96 14 76 -143 114 1 -130 208 -203 92 55 -181 231 -172 49
3967D9L9k43K65j58J9O5j4j13J86j30r4L44m56L36nl71N43m04N6K84l86K16Q3
$$ 49 88 -155 110 -48 -29 36 22 -91 95 -35 -129 215 -241 95 90 -281 262 -142 -86 198 -188 28 111
3990A11k88K47K6l56N13l54o2M98o74M86m4l74N66m59J36J82k93J94qj01L7J28
$$ 111 -177 70 96 -260 253 -101 -163 335 -339 147 103 -271 295 -164 -28 154 -139 55 47 -54 -17 111
4012A11k53K29m8k08L76l69J75J04k98L01j56l8J56j40lJ55j85Q4J33l50M15k88
$$ 111 -142 87 39 -169 207 -162 13 117 -181 120 -36 -74 82 -58 -61 94 -91 -7 126 -224 191 -97
4034i7k1L82n83N28k14j97N13n52L26K4k89L31j62q9K10j20j15L06k87N4K55m41
$$ -97 -118 264 -319 209 -5 -202 311 -241 85 109 -180 151 -11 -100 110 -10 -125 181 -106 -52 203 -238
4056b38L60p6k20L42k35k1K11j80n2K98l69J75K09n55O22l45j35N69p06M65j2
$$ -238 122 46 -174 168 -67 -88 123 -57 -109 189 -180 -5 204 -351 271 -74 -209 360 -346 119 107
4077A07l71N04l51N6J97k56J31P1k06J79kj89K86k43P5J19k51K70j89M5P8j41
$$ 107 -264 240 -111 -55 142 -114 17 88 -118 61 59 -130 156 -87 -12 107 -144 126 -63 -18 60 -81
4099h1J26p2N0q6J34j52N4J43l52M45l16LL58n68M92j56k46M88m16R8K44l89K47
$$ -81 45 -27 23 -63 71 -81 -27 116 -236 209 -107 -104 254 -314 178 22 -224 264 -152 -54 190 -199 48
4122D8J00l95M31j66k43N39n26K05K20m72M52k03q6K42j97%J32r5q5K65k82R2
$$ 48 148 -247 184 18 -225 314 -212 -7 213 -259 193 -10 -96 146 -51 -51 81 -14 -99 166 -116 -24
4144b4J89m25M33k04j20L57l93K33K3k10K26j04o2J57j15k5J81k55K10k3j98L49
$$ -24 165 -260 173 -31 -151 206 -187 46 69 -141 85 -19 -81 76 -39 -64 117 -138 72 49 -149 200
4166B00l61J86Q8l01L62k35J4J78k42J52K0j61J26N8k53K94j27j65M13m38K07
$$ 200 -161 25 113 -188 174 -61 -47 131 -111 41 61 -100 26 84 -169 125 -2 -167 246 -192 15
4187A5J40m08M31k07j11K97k55K6K05k45O6K13l77L03pl25M86l60K9K94m11K62
$$ 15 155 -253 178 -29 -140 157 -98 -72 133 -112 -46 167 -210 93 86 -239 247 -113 -84 210 -201 61
4209F1L1k32K34n6j66K53j48p1K85l53K18L8k77L68k92R7J11k51K59j52J0J00
$$ 61 92 -140 94 38 -128 125 -23 -94 191 -162 56 94 -183 185 -107 -10 101 -150 109 -43 -33 67
4231F7j27P4Qn4K3N0j26J42q7m9J96k41J67Jj62K33j45k7J40j34LJ60j94O5J76
$$ 67 -60 14 22 -32 -9 41 -85 57 -30 -79 117 -124 43 44 -118 115 -30 -57 83 -51 -48 112 -82 -17 159
4256A59l73L70j07k52M83m56J68K15m55M01j35j83L30k46JK17k46P9J67l05K36
$$ 159 -214 156 49 -203 280 -176 -8 207 -248 153 18 -165 165 -81 -80 137 -109 -30 137 -168 68
4277F8l5j85K87k23O0J11j75J07J3p0M1N6j46J46k1j27K26k33J29M3k06K72k14
$$ 68 33 -152 135 -88 -28 83 -92 15 28 -42 -1 55 -91 55 34 -93 133 -100 29 72 -134 138 -76
4300g6P4Q2j83J97j25kJ04j30N9M4j22J05J3j67K38j56m8K47l18K21lk07K67j67
$$ -76 -2 80 -103 94 -31 -33 71 -59 0 44 -78 27 40 -127 111 -45 -93 154 -164 57 54 -153 114 -53
4324e3j6J66j37j2J66j95O3J55l11K90q9j80L53l21J20J28k61K15n6r1J33n8q6
$$ -53 -69 97 -40 -52 114 -81 -18 137 -174 116 27 -153 200 -121 -1 127 -134 81 25 -66 67 9 -77
4347g7J71j10n1K03k64J61L1k00K38j55J7R4j21O8Km0K8L0q5J00m5m7J38j81J59
$$ -77 94 -16 -67 136 -128 33 64 -136 102 -53 -36 58 -63 5 7 -33 -5 25 -60 40 -5 -52 86 -95 64
4372F4n7p2J82k30J77l8r9J85j75P3L9q4M3L0q2N0N6j61K02j21n4K06k52J52J5
$$ 64 7 -65 117 -113 64 26 -73 112 -63 10 49 -35 8 38 -44 6 62 -99 103 -18 -72 134 -118 34 49
4397D9j41J43n7m1Q1l9q9J96j51j1K01l05K39l8j55K70k53R6Q1j59J32k6n7N7
$$ 49 -92 51 -6 -47 34 -5 -94 102 -49 -60 141 -164 75 37 -118 152 -101 -5 76 -83 49 23 -34 23
4421B3K0r4J18o6m4J36j66J32n7m0J01j21J03p5M3ml0L9p6R7r6Q2l5m4J31j92
$$ 23 43 -51 67 1 -43 93 -73 59 2 -38 63 -58 45 -30 13 9 -21 18 -58 39 -57 25 -10 -54 77 -115
4447a15J88j01k7J47j95J50l5p7J20q2NO0n9qJ12j53R2M5j78K37j72J8J22j80
$$ -115 73 -28 -55 92 -103 47 12 -65 55 -27 -22 38 -21 -29 83 -70 22 67 -111 126 -46 -28 94 -86
4471h6J39n8QkJ9k8j9R3j60J51o5o2J82k25J54k9q1J42j09L0J2j0j1M7m6QN5j06
$$ -86 53 -5 3 1 20 -8 -27 66 -94 57 -8 -70 112 -113 41 12 -69 73 -36 -6 6 -4 -15 32 -14 -6 49 -57
4499e7J26j08N0L3j04J49j60J05jq8J52j75J16l7k1O5q6Q4p4O4m1j1O3j23J31
$$ -57 69 -39 11 44 -60 89 -71 34 33 -55 97 -78 38 1 -20 45 -41 43 -31 33 -8 -19 44 -79 52
4524E2p9j4Q5q4M1Jk7rP5j25J22j4j18K13k04J01L9j60J99j50O8L8r2Q7q8Q9p6
$$ 52 -27 -41 44 -40 1 2 -25 -34 41 -84 38 24 -94 119 -85 16 55 -105 94 -56 12 50 -42 45 -43 46 -30
4551c0N8rn2J00j32R2k2l8O5n0K1pK2m0N0m2kO6j18J22q8L0K5q9J32j37J03k3
$$ -30 28 19 -33 67 -65 27 5 -33 32 -18 3 -4 18 -22 28 -14 -16 50 -68 54 -34 -4 21 -68 64 -73 30 7
4579Gp3J56j81J37m3n5J16r7N7k1o%K5j9j6N9q8P0j6k9N1n4M1l4M0m7J3L8r7J39
$$ 7 -66 90 -91 46 3 -52 64 -33 24 3 -3 -3 22 3 -13 46 -42 28 12 -17 34 -20 21 -13 27 -20 -7 31 -66 73
4609G3j31O5M6j48J67j16K5N5r2Q8m3J2mQj1LL0m9N8n8L2Rl2L8m4N9o7N8j1o1
$$ 73 -58 7 53 -95 72 -44 -19 36 -56 32 -11 1 -3 5 -6 -3 27 -22 36 -22 10 19 -13 25 -19 40 -27 31 20 -41
4639d1J11j33J04k2o1J01j08Q2l5rM3n2N1n5L9j7j0L3m0L7l8J7j2K8k5j2O0p7
$$ -41 70 -63 41 19 -42 59 -49 33 -2 -11 32 -20 31 -24 15 -2 -12 21 -19 18 -20 -3 -15 13 -12 -24 36 -41
4667d1Q0m2k1Q9j11P9l2nM5n9N6o0M5k2mL8q6Q9m4j0N3n6K3lnjJ4l1K8Lm5P6p6
$$ -41 39 -3 -24 65 -46 33 1 -4 41 -18 38 -22 23 1 -3 35 -51 38 -6 -16 37 -19 4 1 -4 -5 9 -22 6 9 -36 40 -36
4700c6K4L2p1Q7n5K7J5m4M4m0M2k6PJ3l5M6m6K5J1k5M5m1J4lj0J8rkkJ7l5L2k2
$$ -36 -12 20 -51 36 -19 8 23 -21 23 -17 25 -1 6 19 -16 30 -16 9 20 -5 40 -1 13 10 0 18 9 7 5 22 -13 19 -3
4733cpL0n3N6m7J2L1n2M9l3RJ6k6K8k7J1MJJ2j3K0k9J1J1j5K9l2K6j2j5L9m0K4
$$ -3 -10 20 -33 23 -24 -12 19 -33 16 -17 -8 8 -18 10 -17 -6 -2 -1 11 -2 18 -11 0 11 -4 25 -7 19 7 -8 31 -9 15
4766A5lj9J2%rK2nl2L7l8PL5o4O2l2qL7m0L1j2qPJJ1k3L7m0L3%l0M8m6K5kk2L7
$$ 15 12 -7 5 5 -4 18 13 -19 18 -20 -13 22 -42 20 -12 -20 17 -23 8 -4 -12 -5 -4 7 -16 21 -19 14 14 -16 32 -14 11 9 -13 24
4802B4l0MJ6j0JJ2k2NK3n0M8k7jL9o8N6k2j2K4k0L0m0K0Kk4L3l5M3k5LQk4M4m2
$$ 24 -6 -2 14 4 5 17 -5 0 23 -27 21 -6 -7 32 -36 20 -2 -14 10 -10 20 -20 0 2 -22 11 -24 19 -6 -3 5 -19 25 -17
4836a7L0qj9L1k8L0j7MNNk1OK3m5O1m4ML0p0P5m1KK3o1N0k9PK1k7K2j1J1k4K1
$$ -17 13 5 -14 17 -11 19 2 6 11 16 -5 1 24 -21 40 -4 0 30 -40 35 -6 -4 19 -42 8 -21 -14 7 -20 2 -9 2 -22 -1
4870arj5L8m0K6kqPPKkJ9m0N5l2k0P4r0N6j0k6M6o5N8m0J4Rk0L7m7L3rj2K0k4
$$ -1 -10 -25 13 -27 -1 -3 -11 -4 3 5 3 22 -18 37 5 -15 59 -31 25 15 -11 35 -30 28 -12 2 11 -9 28 -19 14 5 -7 13 -11
4905a1nJ5pqK7l1NK4m1N6n0J7K4l9M6l2K8j4oJ9m8O2l6J0M0p2O0m6mL2j9J1Pj7
$$ -11 -16 -1 -8 -16 11 -20 -15 9 -32 24 -26 -9 15 -24 22 -10 18 4 -2 17 -31 31 -5 5 45 -27 33 -13 -17 15 -4 7 14 -3
4939cmL6n5M3j0k7L9m7L4mj5L1l2K6k7K2nk0O1p0L5Kj6L3m7L5kr%J3qpJ4l2M5
$$ -3 -7 29 -26 17 7 -20 19 -28 6 2 -13 18 -14 12 -15 7 2 -18 43 -27 8 10 -6 27 -20 15 13 4 4 17 9 2 16 -16 29
4974B9k4oK3k3J8l2K2k0%L2n1O0m6QK0m2O0m8K1J2l8K0oJ2j8K9k5J5J5k0K7l0
$$ 29 5 -1 22 -1 17 -15 7 -13 -13 19 -32 28 -18 -10 10 -32 28 -20 1 13 -25 -5 -11 1 -17 12 -13 2 17 -3 24 -6
5006fK0j5QJ1k3L4l3K0jk8M4m7L1qk1K7j7PqK0j5NQk3K9l6J0J3k6K0oJ3j6K9l3
$$ -6 14 -1 7 18 -5 29 -4 16 15 -13 31 -16 15 7 -14 13 -4 3 -5 15 0 5 13 -10 19 -17 -7 6 -20 0 -6 7 -9 20 -13
5041a3J0J8m8O0m3J2M1o7M9nj7K8k6PJ1j7jK2k2nJ7k8L3j5j0J1oMnlqK7j4j3L0
$$ -13 -3 15 -33 27 -16 -4 37 -30 19 14 -3 25 -1 6 17 0 -1 21 -1 -6 11 -17 16 1 -9 2 -4 0 -5 -8 -16 11 -3 -16 14
5076A4n7O3k4j8L2n9P2l0J0J5n1N5k8mL1l0J0J9k6K0J0m3N9l8oM3n6L4nk2K9k0
$$ 14 -43 20 -4 -22 10 -49 23 -7 3 18 -33 22 -6 -10 21 -9 1 20 -6 14 24 -19 40 2 -4 39 -17 17 12 -10 19 -1
5108aJ7j9Rk8K6lk4N0o1L2K6o7O4m0oN3n8M9rl0L2%k8L0j7kL1m6K7joL1l5K6j4
$$ -1 16 -3 6 -22 4 1 -23 27 -34 -2 24 -43 21 -19 -25 28 -30 19 10 -20 12 12 -16 14 -3 -5 26 -20 7 6 0 31 -4 22 8
5143HqRnKj5K3k4K0nk4L7m5K9Jl2N8n9J8L1m4M7l1k0M0k9ON1o7L3Ol4N7l8kM3
$$ 8 0 9 4 6 -9 14 -10 10 5 -19 18 -27 2 3 -29 29 -30 -12 19 -25 22 -9 -29 11 -18 -12 39 -28 5 11 -23 34 -4 -6 37
5178C7n1L1jk1J1klJ0J7m1L3k4rO2p8L7J3o2O8m4jL8n0L0J3m4N4l7j2M3m8K7J5
$$ 37 -14 17 16 -5 6 4 1 11 28 -13 20 -4 -13 49 -29 8 21 -41 27 -17 -18 20 -30 0 13 -31 23 -14 -26 17 -31 -4 11
5211A1m9N4k5KL5l6K3kj9K0po%MlK6k5qK9n7N4pl0M8l8lM0o9N0rl6O6m3j0N7p3
$$ 11 -38 16 -9 -7 28 -8 15 13 -6 14 7 1 1 5 2 28 3 -5 24 -33 21 14 -16 32 -6 -9 31 -38 12 3 -33 33 -10 -20 37 -36
5247c6L2K3n8O6l1k0O3o6L9J0m8N8j4l8M4k2rL9k7rL6m1J9J8m5M6l2lM3o0K6J0
$$ -36 -4 19 -39 27 -4 -24 39 -27 12 22 -26 32 18 -20 24 2 -7 32 5 -4 32 -9 10 28 -17 29 -3 -6 37 -23 3 13
5279A3m8M6j6k6M7l3J2K7m7N1k7qL4m7J7K4n2M5j1nL0k9J2J0l2K2J5k9L3j9k9
$$ 13 -35 11 -5 -31 16 -17 -5 22 -25 26 -1 -9 25 -22 -5 19 -33 12 1 -4 26 -3 9 19 -13 9 24 -5 28 9 -20
5310b0O4n9K4L5q1P4j9m0O2m6j1M6o2K9L1p1N7j3m6Q1n8J1M3o6O0j9k5M4k5KK2
$$ -20 44 -15 9 44 -37 37 18 -22 40 -6 -17 29 -33 -4 27 -44 13 0 -46 35 -23 -12 31 -35 25 6 -19 25 0 2 24
5341B4l5K5J6m5N1j9l1N4m5K2J7l4J6nk1L7k8mK5k2%K1l7M2k0j4L8o1M4On7O2
$$ 24 -11 14 30 -15 36 17 -14 40 -5 17 34 0 16 11 -10 27 -1 -5 20 -2 -2 19 -18 24 4 -10 28 -33 11 17 -40 22
5373B2k4j1K9l7J5L8n8L6L1p2O6k8k9O7n7K7K4m7L6pk7M1l4j1N0n5NL9o5O5k5
$$ 22 -2 -13 16 -21 -6 32 -26 10 41 -31 35 7 -22 45 -12 15 39 -8 28 21 -6 35 1 -10 40 -15 -10 29 -36 29 4
5404Dl2O5o0K3K5m4K7Jl3M9k8j2L9m3K7K1n9N2k0j2N1o5L3K1m4M0k8jL3l1kM2
$$ 4 -28 37 -23 0 25 -19 8 9 -24 25 -3 -15 24 -19 8 29 -30 22 2 -10 41 -24 9 30 -14 26 -2 -3 30 -1 -3 39
5436C9o0M3jm5N4l9pO7q1L9J2n5O5k1l9N4l6j3O7q3N0J2o8Q1m9rN4n4L5Pl8L8
$$ 39 -21 22 21 -24 30 -9 -16 51 -30 9 21 -34 31 10 -29 25 -11 -24 43 -40 10 22 -46 35 -14 -23 31 -23 12 19 -19 19
5468A9jl9M6l1j5O9o3M0nl0L6l5PK2l0K1Pk8J3J7n0M3k3mM7o8O1j7m5O3m7J6L1
$$ 19 18 -21 25 -6 -21 48 -15 25 20 -10 26 -9 -2 20 -10 11 18 -10 3 20 -30 13 -10 -14 33 -35 26 9 -36 27 -20 -4 27
5501B7o1M8pk6M7j7l2N7n6J3L9p3Q2l0l2O3n4OK6l1J1K8n3L2J8n7O8l9j7N3o3
$$ 27 -34 14 7 -19 28 11 -21 36 -20 -7 32 -41 41 11 -21 42 -12 -6 20 -11 0 28 -25 7 25 -32 36 -3 -20 33 -30
5532c0L5J5o1P0l0j7L4l1%L2m3K9J3n3O5n0J6K7m7N1k5j4L7l7K7Jj5J8j3mJ7j
$$ -30 5 20 -41 29 -1 -18 16 -15 -15 17 -26 3 16 -37 28 -22 -6 21 -26 25 0 -14 23 -14 13 14 -1 17 4 0 17 16
5564A6k6L8l8QK2n1M7k7nL0k9QK2m6K5K3m6M5rm4O3n1RN1q1P6l3k8O0l4KK5l3
$$ 16 -10 28 -10 -2 20 -31 16 -11 -16 14 -15 -7 15 -31 -6 17 -29 16 7 -37 26 -25 -16 35 -46 30 -3 -31 29 -5 -3 22 -11
$$ [...]
8190Ij7
8191h
##END NTUPLES=NMR FID
##END=
