##TITLE=1H_AM_NVYNE
 
 8 sc, 
 4.04.2022
##JCAMPDX= 6.0         $$ Bruker NMR JCAMP-DX V2.0
##DATA TYPE= NMR FID
##DATA CLASS= NTUPLES
##ORIGIN= UXNMR, Bruker Analytische Messtechnik GmbH
##OWNER= root
$$ XWIN-NMR		Version 3.5
$$ Mon Apr  4 10:24:10 2022 Russian Standard Time (UT+4h)  she@DPX200
##.OBSERVE FREQUENCY= 200.131346
##.OBSERVE NUCLEUS= ^1H
##.DELAY= (6, 6)
##.ACQUISITION MODE= SIMULTANEOUS
##.ACQUISITION SCHEME= undefined
##.AVERAGES= 8
##.DIGITISER RES= 18
##SPECTROMETER/DATA SYSTEM= spect
##.PULSE SEQUENCE= zg30
##.SOLVENT NAME= CDCl3
##.SHIFT REFERENCE= (INTERNAL, CDCl3, 0, 15.7039)
##AUDIT TRAIL= $$ (NUMBER, WHEN, WHO, WHERE, WHAT)
$$ ##TITLE= Audit trail, XWIN-NMR		Version 3.5
$$ ##JCAMPDX= 5.01
$$ ##ORIGIN= Bruker BioSpin GmbH
$$ ##OWNER= she
$$ F:/spectra/data/she/nmr/H-F/1/audita.txt
$$ ##AUDIT TRAIL=  $$ (NUMBER, WHEN, WHO, WHERE, WHAT)
(   1,<2022-04-04 10:23:11.17 +0400>,<she>,<DPX200>,
      <created by zg, POWCHK disabled, PULCHK disabled
       configuration hash MD5:
       00 E9 B6 7A A2 85 ED C7 34 08 36 98 17 FE 4E 26
       data hash MD5: 16K
       C4 BB 03 AA B0 89 8C 3A 78 BE 0F 7E DD 13 C9 DF>)
$$ ##END=
$$ 
$$ hash MD5
$$ C1 60 F0 4E A7 43 D4 F5 73 DA B6 3D 32 CA 40 9C
##$RELAX= 
##$RELAX= 
##$RELAX= 
##$RELAX= 
##$RELAX= 
##$RELAX= 
$$ Bruker specific parameters
$$ --------------------------
##$DU= <F:/spectra>
##$EXPNO= 1
##$NAME= <H-F>
##$PROCNO= 1
##$TYPE= <nmr>
##$USER= <she>
##$AMP= (0..31)
100 100 100 100 100 100 100 100 100 100 100 100 100 100 100 100 100 100 
100 100 100 100 100 100 100 100 100 100 100 100 100 100 
##$AQSEQ= 0
##$AQ_mod= 1
##$AUNM= <au_zg>
##$AUTOPOS= <>
##$BF1= 200.13
##$BF2= 200.13
##$BF3= 200.13
##$BF4= 200.13
##$BF5= 200.13
##$BF6= 200.13
##$BF7= 200.13
##$BF8= 200.13
##$BYTORDA= 1
##$CFDGTYP= 0
##$CFRGTYP= 5
##$CHEMSTR= <none>
##$CNST= (0..31)
1 1 145 1 1 1 1 1 1 1 1 1 1 1 1 1 1 1 1 1 1 1 1 1 1 1 1 1 1 1 1 1 
##$CPDPRG= <>
##$CPDPRG1= <>
##$CPDPRG2= <>
##$CPDPRG3= <>
##$CPDPRG4= <mlev>
##$CPDPRG5= <mlev>
##$CPDPRG6= <mlev>
##$CPDPRG7= <mlev>
##$CPDPRG8= <mlev>
##$CPDPRGB= <>
##$CPDPRGT= <>
##$D= (0..31)
0 1.2 0 0 0 0 0 0 0 0.06 0 0.03 0 0 0 0 0.0002 0 0 0 0 0 0 0 0 0 0 0 0 
0 0 0 
##$DATE= 1649053390
##$DBL= (0..7)
120 120 120 120 120 120 120 120 
##$DBP= (0..7)
150 150 150 150 150 150 150 150 
##$DBP07= 0
##$DBPNAM0= <>
##$DBPNAM1= <>
##$DBPNAM2= <>
##$DBPNAM3= <>
##$DBPNAM4= <>
##$DBPNAM5= <>
##$DBPNAM6= <>
##$DBPNAM7= <>
##$DBPOAL= (0..7)
0.5 0.5 0.5 0.5 0.5 0.5 0.5 0.5 
##$DBPOFFS= (0..7)
0 0 0 0 0 0 0 0 
##$DE= 6
##$DECBNUC= <off>
##$DECIM= 32
##$DECNUC= <off>
##$DECSTAT= 4
##$DIGMOD= 1
##$DIGTYP= 9
##$DL= (0..7)
0 120 120 120 120 120 120 120 
##$DP= (0..7)
150 150 150 150 150 150 150 150 
##$DP07= 0
##$DPNAME0= <>
##$DPNAME1= <>
##$DPNAME2= <>
##$DPNAME3= <>
##$DPNAME4= <>
##$DPNAME5= <>
##$DPNAME6= <>
##$DPNAME7= <>
##$DPOAL= (0..7)
0.5 0.5 0.5 0.5 0.5 0.5 0.5 0.5 
##$DPOFFS= (0..7)
0 0 0 0 0 0 0 0 
##$DQDMODE= 0
##$DR= 18
##$DS= 0
##$DSLIST= <SSSSSSSSSSSSSSS>
$$ [...]
##$SUBNAM2= <"">
##$SUBNAM3= <"">
##$SUBNAM4= <"">
##$SUBNAM5= <"">
##$SUBNAM6= <"">
##$SUBNAM7= <"">
##$SUBNAM8= <"">
##$SUBNAM9= <"">
##$SW= 18.0517287032376
##$SWIBOX= (0..15)
0 0 2 0 0 0 0 0 0 0 0 0 0 0 0 0 
##$SW_h= 3612.71676300578
##$TD= 16384
##$TD0= 1
##$TE= 0
##$TE2= 300
##$TE3= 300
##$TEG= 300
##$TL= (0..7)
0 120 120 120 120 120 120 120 
##$TP= (0..7)
150 150 150 150 150 150 150 150 
##$TP07= 0
##$TPNAME0= <>
##$TPNAME1= <>
##$TPNAME2= <>
##$TPNAME3= <>
##$TPNAME4= <>
##$TPNAME5= <>
##$TPNAME6= <>
##$TPNAME7= <>
##$TPOAL= (0..7)
0.5 0.5 0.5 0.5 0.5 0.5 0.5 0.5 
##$TPOFFS= (0..7)
0 0 0 0 0 0 0 0 
##$TUNHIN= 0
##$TUNHOUT= 0
##$TUNXOUT= 0
##$USERA1= <user>
##$USERA2= <user>
##$USERA3= <user>
##$USERA4= <user>
##$USERA5= <user>
##$V9= 5
##$VALIST= <valist>
##$VCLIST= <CCCCCCCCCCCCCCC>
##$VD= 0
##$VDLIST= <DDDDDDDDDDDDDDD>
##$VPLIST= <PPPPPPPPPPPPPPP>
##$VTLIST= <TTTTTTTTTTTTTTT>
##$WBST= 1024
##$WBSW= 4
##$XGAIN= (0..3)
0 0 0 0 
##$XL= 0
##$YL= 0
##$YMAX_a= 285263
##$YMIN_a= -215374
##$ZGOPTNS= <>
##$ZL1= 120
##$ZL2= 120
##$ZL3= 120
##$ZL4= 120
##$ABSF1= 10
##$ABSF2= 0
##$ABSG= 5
##$ABSL= 3
##$ALPHA= 0
##$AQORDER= 0
##$ASSFAC= 0
##$ASSFACI= 0
##$ASSFACX= 0
##$ASSWID= 0
##$AUNMP= <proc_1d>
##$AZFE= 0.1
##$AZFW= 0.1
##$BCFW= 1
##$BC_mod= 2
##$BYTORDP= 1
##$COROFFS= 0
##$CY= 11.3945322036743
##$DATMOD= 1
##$DC= 2
##$DFILT= <>
##$DTYPP= 0
##$F1P= 2.36226072786647
##$F2P= -0.459571619588291
##$FCOR= 0.5
##$FTSIZE= 0
##$FT_mod= 4
##$GAMMA= 1
##$GB= 0.15
##$INTBC= 1
##$INTSCL= 1
##$ISEN= 128
##$LB= 0.24
##$LEV0= 0
##$LPBIN= 0
##$MAXI= 10000
##$MC2= 0
##$MEAN= 0
##$ME_mod= 0
##$MI= 1.114404
##$NCOEF= 0
##$NC_proc= 0
##$NLEV= 6
##$NOISF1= 3.799351
##$NOISF2= 2.8
##$NSP= 1
##$NTH_PI= 0
##$NZP= 0
##$OFFSET= 15.70392
##$PC= 1
##$PHC0= -17386.47
##$PHC1= 11.40078
##$PH_mod= 1
##$PKNL= yes
##$PPARMOD= 0
##$PSCAL= 0
##$PSIGN= 0
##$REVERSE= no
##$SF= 200.130013532006
##$SI= 16384
##$SIGF1= 3
##$SIGF2= 2
##$SINO= 400
##$SIOLD= 16384
##$SREGLST= <1H.CDCl3>
##$SSB= 0
##$STSI= 0
##$STSR= 0
##$SW_p= 3612.71676300578
##$SYMM= 0
##$S_DEV= 0
##$TDeff= 0
##$TDoff= 0
##$TI= <>
##$TILT= no
##$TM1= 0
##$TM2= 0
##$TOPLEV= 0
##$USERP1= <user>
##$USERP2= <user>
##$USERP3= <user>
##$USERP4= <user>
##$USERP5= <user>
##$WDW= 1
##$XDIM= 8192
##$YMAX_p= 0
##$YMIN_p= 0
$$ End of Bruker specific parameters
$$ ---------------------------------
##NTUPLES= NMR FID
##VAR_NAME=  TIME,          FID/REAL,        FID/IMAG
##SYMBOL=    X,             R,               I
##VAR_TYPE=  INDEPENDENT,   DEPENDENT,       DEPENDENT
##VAR_FORM=  AFFN,          ASDF,            ASDF
##VAR_DIM=   8192,          8192,            8192
##UNITS=     SECONDS,       ARBITRARY UNITS, ARBITRARY UNITS
##FACTOR=    0.0002768,     1,               1
##FIRST=     0,             0,               0
##LAST=      2.2672688,     0,               0
##MIN=       0,             -215374,         0
##MAX=       2.2672688,     285263,          0
$$ Real data points
##PAGE= N=1
##DATA TABLE= (X++(R..R)), XYDATA
0 0 0 0 0 0 0 0 0 0 0 0 0 0 0 -8 8 -8 8 -8 8 -16 16 -16 20 -24 24 -31 32 -38 43 -48 53 -60 68 -76 84 -92
36 -92 100 -112 121 -135 146 -162 177 -193 212 -232 254 -278 304 -333 369 -406 449 -498 556 -625
56 -625 705 -805 925 -1076 1274 -1532 1889 -2392 3151 -4367 6506 -10870 22509 -100845
70 -100845 -196178 285263 -189177 -3663 157913 -190154 115682 -13682 -46821 55960
80 55960 -41619 35087 -34458 22091 9705 -39264 39378 -13665 -9824 869 32290 -51301
92 -51301 19182 56419 -122099 117641 -28463 -94181 170529 -147703 41389 79897 -147457
103 -147457 136482 -67807 -16010 80730 -109486 98769 -51247 -20027 84452 -107317
113 -107317 71930 1814 -64204 71028 -25996 -25228 34525 5506 -53346 55222 2715 -78249
125 -78249 109281 -65552 -25125 99654 -108588 56103 12319 -53898 59397 -47193 36267
136 36267 -24583 -3900 50342 -88404 82378 -22798 -58324 106292 -86201 13411 56836
147 56836 -75478 38712 14253 -37000 15400 23588 -37976 10644 36350 -63530 47519 1569
159 1569 -49495 66177 -47793 11779 21844 -42520 48795 -41658 19668 14985 -49576 63463
171 63463 -44776 1695 40548 -56876 41191 -9240 -16233 24738 -20731 15067 -12718 8656
183 8656 3025 -18857 27025 -19646 1217 13495 -13506 2981 2859 5737 -21117 24507 -4181
196 -4181 -30742 53616 -42040 -1148 46978 -62709 37591 8592 -42049 42296 -16738 -9291
208 -9291 16705 -6806 -3974 1424 12792 -22447 13654 9712 -29579 29687 -9878 -13959 23754
221 23754 -15564 1015 6309 -2357 -5367 5339 5866 -19071 21211 -7524 -13946 28298 -25650
234 -25650 8462 11803 -23696 22539 -10923 -3915 14595 -16854 10780 -691 -7675 9898 -5357
247 -5357 -1995 5797 -2397 -5395 10122 -5797 -5905 15811 -15298 3892 10589 -17987 13343 -1312
261 -1312 -8626 10306 -5177 60 -329 3908 -3711 -3479 12875 -15544 6303 10057 -21315 18138
275 18138 -1918 -15746 21525 -11246 -6431 17242 -13385 -644 12625 -12987 2518 9450
287 9450 -13465 6819 4673 -11985 10159 -1756 -6429 8636 -4647 -980 3687 -2478 -446
300 -446 1931 -154 -3248 4830 -2553 -2884 7707 -7622 1901 5543 -9459 6987 322 -7081 8168
315 8168 -3106 -4015 7441 -4049 -3130 7646 -5438 -1936 8436 -8434 1501 6919 -10227 5802
329 5802 3035 -9235 7676 -76 -6900 7444 -1284 -5999 7803 -2559 -5312 9323 -5948
342 -5948 -2456 9116 -8919 2331 5350 -8269 4909 989 -4413 3460 15 -2296 1156 2222
356 2222 -4184 2369 2485 -6905 6828 -1588 -5233 8974 -7037 654 5969 -8453 5430 661
370 661 -5510 5766 -1777 -2666 3856 -1192 -2668 4114 -1577 -3122 6141 -4774 -515 6033 -7433
385 -7433 3618 2319 -5990 4959 -777 -2653 2668 200 -2690 1798 2483 -6543 5949 217 -7902
400 -7902 11196 -6855 -2489 10280 -11282 5303 3096 -8057 6892 -2010 -1727 1708 555 -1232
414 -1232 -1680 5887 -6894 2515 4765 -9987 9235 -2625 -5229 9090 -7106 1658 2848 -3670
428 -3670 1857 -400 1027 -2873 3416 -1246 -3028 6785 -7326 3896 1980 -6941 8497 -6335
442 -6335 1766 3294 -6884 7795 -5746 1312 3425 -6256 6403 -4558 1743 1030 -3369 5431
456 5431 -6833 6060 -2115 -4284 10127 -11380 6213 2366 -9058 10243 -6322 993 2186
469 2186 -2899 3366 -5247 7420 -6617 518 8745 -14952 12782 -2611 -9220 15102 -11857
482 -11857 2952 5048 -7660 5280 -2063 1446 -2949 3344 165 -6563 10962 -9302 1990
495 1990 6463 -11202 10148 -5148 -220 3974 -6621 8501 -8886 6147 902 -10022 15650
508 15650 -13461 3999 7485 -14725 14367 -7954 -286 6827 -10256 10437 -7684 2483 4100
521 4100 -9635 11206 -7680 1144 4588 -6822 6063 -4646 3963 -3141 -113 6035 -11511
534 -11511 12307 -6267 -4286 13384 -15470 9654 -61 -7653 10328 -8752 5901 -3391 67
547 67 5095 -10784 13455 -9650 -423 11499 -16814 13296 -3538 -6249 10913 -9881 6501
560 6501 -3587 907 3070 -8354 12305 -11090 3344 7244 -14427 14128 -7093 -2041 8312
573 8312 -9685 7782 -5126 2281 1457 -6043 9864 -10319 5968 1616 -8541 11440 -9613
586 -9613 4536 1236 -5779 8574 -9718 8321 -3389 -4323 11677 -14573 10545 -1131 -8618
599 -8618 13686 -12230 6014 1246 -6380 8554 -8641 7065 -3321 -2536 8625 -11672 9299
612 9299 -2434 -4934 8989 -8614 5423 -1879 -741 2983 -5863 8534 -8529 3970 4122 -11526
626 -11526 13465 -8496 -423 8280 -11621 9740 -4497 -1171 5293 -7466 7698 -5959 2165
639 2165 3010 -7652 9210 -6549 1356 3500 -6198 6417 -4882 2715 -441 -2348 5607 -7990
653 -7990 7542 -3208 -3767 9691 -11031 7154 -390 -6008 9582 -9181 5402 -43 -5054
666 -5054 8280 -8509 5517 -157 -5424 8455 -7381 3083 1610 -4440 4910 -3751 2100 -709
680 -709 -466 1811 -3377 4516 -4128 1598 2176 -5265 6122 -4631 1463 2397 -5517 6676 -5339
695 -5339 1753 2740 -6267 7451 -5479 888 4176 -7096 6519 -3216 -845 3911 -4949 4052
709 4052 -2071 -138 1906 -2852 3125 -2699 1427 495 -2375 3325 -3143 2014 -217 -1814 3318
724 3318 -3746 2789 -627 -1909 3850 -4323 2944 -108 -2871 4372 -3772 1609 1074 -2923 3207
739 3207 -2146 497 913 -1485 1433 -1168 922 -568 -64 889 -1602 1848 -1383 303 997 -2027
755 -2027 2343 -1774 493 1138 -2511 2986 -2177 202 2109 -3520 3230 -1246 -1365 3125 -3194 1709
771 1709 444 -2070 2439 -1607 261 866 -1343 1181 -658 57 498 -786 607 -166 -187 267 -79
788 -79 -174 219 37 -509 819 -603 -211 1099 -1384 781 244 -1114 1375 -986 182 665 -1166 1083
806 1083 -624 25 542 -1002 1163 -782 -58 869 -1202 968 -417 -209 760 -1045 927 -432 -218
823 -218 790 -1129 1068 -441 -503 1297 -1320 628 284 -936 1072 -746 109 546 -855 671 -197
840 -197 -229 482 -535 359 70 -554 675 -247 -468 888 -719 -9 872 -1340 960 201 -1423 1822
858 1822 -983 -496 1626 -1739 866 392 -1354 1513 -818 -234 987 -1075 621 -47 -432 745
874 745 -747 361 289 -826 894 -453 -329 1002 -1213 661 455 -1445 1578 -670 -710 1633 -1578
891 -1578 578 684 -1478 1303 -322 -699 996 -474 -294 572 -191 -481 815 -541 -282 1135 -1405
908 -1405 773 417 -1390 1561 -945 -23 811 -1183 1135 -774 242 372 -992 1452 -1457 690
924 690 667 -1905 2128 -1149 -405 1505 -1590 789 129 -468 124 364 -267 -664 1752 -1969 759 1297
942 1297 -2975 3176 -1670 -794 2966 -3696 2631 -379 -1834 3013 -2875 1760 -198 -1316 2388
957 2388 -2619 1955 -604 -1000 2328 -2862 2245 -641 -1246 2495 -2570 1602 -171 -1006 1455 -1268
973 -1268 894 -875 1082 -769 -689 2809 -4091 3152 37 -3761 5704 -4550 842 3112 -4998
988 -4998 4056 -1448 -861 1798 -1778 1843 -2221 2175 -800 -1695 4052 -4630 2713 784 -3767 4504
1004 4504 -2915 458 1158 -1513 1507 -1954 2652 -2484 555 2614 -5326 5558 -2635 -2031 5715
1019 5715 -6325 3792 111 -3380 4778 -4237 2256 309 -2485 3421 -2903 1449 51 -924 1115
1034 1115 -1174 1673 -2486 2542 -747 -2498 5333 -5517 2565 1911 -5249 5856 -3850 695 1996
1049 1996 -3601 4299 -4272 3088 -70 -4306 7653 -7286 2431 4332 -8663 7719 -2231 -3875
1063 -3875 6393 -4143 -317 2959 -1671 -1771 3499 -1323 -3205 6232 -5056 330 4755 -6890
1077 -6890 5155 -1272 -2230 4019 -4352 3932 -2738 153 3548 -6656 6785 -3107 -2554 6983 -7586
1092 -7586 4179 828 -4602 5368 -3584 950 1073 -1956 1974 -1631 1063 -454 174 -205 9 1022
1108 1022 -2901 4314 -3454 -414 5679 -8782 6782 -35 -7497 10734 -7335 -202 6681 -8171
1122 -8171 4682 153 -2727 2386 -1062 1134 -2496 2976 -830 -3131 5655 -4300 -43 3987 -4417
1137 -4417 1099 2363 -2558 -859 4369 -4045 -844 6723 -8683 4321 3700 -9815 9760 -3719
1151 -3719 -4114 8637 -7771 3192 1650 -4361 4640 -3466 1688 277 -2242 3560 -3301 1428
1165 1428 1004 -2445 1991 -445 -518 -45 1258 -1423 -96 2231 -3296 2378 -170 -1811 2666 -2627
1181 -2627 2203 -1468 -199 3005 -5695 5776 -1798 -4536 8917 -7776 1322 6068 -9124 5869
1195 5869 942 -6016 5775 -1127 -3410 3848 -179 -3749 4044 -259 -4312 5615 -2569 -2220 5015
1210 5015 -3955 542 2110 -1958 114 685 840 -3033 3124 26 -4388 6388 -3967 -1413 5971
1225 5971 -6629 2991 2144 -5155 4374 -1159 -1849 2725 -1561 -246 1234 -930 -229 1426 -1767
1240 -1767 750 1203 -2900 3127 -1387 -1607 4186 -4461 1895 2031 -4678 4236 -1201 -2021 3189 -2007
1256 -2007 113 719 -32 -838 372 1592 -3300 2651 527 -4008 4736 -1829 -2516 4689 -2997 -1017
1272 -1017 3829 -2942 -872 4097 -3615 -500 4845 -5570 1682 3800 -6555 4494 630 -4884
1286 -4884 5289 -2024 -1963 3647 -2165 -577 1982 -943 -1203 2173 -885 -1558 3079 -2372 -100 2573
1302 2573 -3252 1787 609 -2177 2070 -696 -634 933 -262 -540 619 228 -1394 1895 -985 -1018
1318 -1018 2825 -3052 1243 1615 -3621 3316 -855 -2111 3449 -2223 -489 2463 -2033 -248 2277
1333 2277 -2044 -397 2997 -3317 843 2695 -4449 2929 800 -3795 3837 -1035 -2135 3046 -1180
1348 -1180 -1496 2382 -583 -2200 3316 -1400 -2213 4572 -3566 -277 4046 -4845 2154 1833 -3990 2938
1364 2938 96 -2390 2177 -7 -1991 1920 202 -2496 2893 -888 -2001 3532 -2527 -155 2476
1379 2476 -2859 1277 860 -1910 1168 534 -1558 869 1046 -2502 2070 260 -2877 3826 -2230 -1018
1395 -1018 3778 -4107 1719 1622 -3566 2843 -297 -1871 2060 -386 -1444 1654 75 -2286 2846
1410 2846 -912 -2194 3956 -2818 -411 3222 -3489 1217 1548 -2535 1107 1206 -2032 464 2183 -3305
1426 -3305 1537 1991 -4491 3863 -421 -3338 4755 -2966 -537 3154 -3174 1014 1251 -1765 441
1441 441 1219 -1503 55 1972 -2853 1678 936 -3216 3560 -1662 -1144 3034 -2886 1163 739 -1559
1457 -1559 1073 -95 -225 -476 1491 -1472 -203 2639 -3834 2509 864 -3981 4603 -2149 -1611 3957
1473 3957 -3258 325 2276 -2312 -8 2304 -2192 -483 3487 -4052 1363 2765 -5248 4217 -396
1488 -396 -3388 4582 -2768 -213 1980 -1731 521 3 695 -1634 1326 563 -2870 3742 -2222 -865
1504 -865 3477 -3878 2004 685 -2364 2313 -1040 -228 657 -207 -462 547 350 -1739 2539 -1801
1520 -1801 -483 3116 -4440 3235 191 -3826 5310 -3540 -286 3499 -4032 1991 605 -1644 769
1535 769 557 -547 -1113 2872 -2600 -124 3516 -4821 2773 1198 -4055 3780 -966 -1706 2082 -243
1551 -243 -1581 1164 1479 -3844 3361 308 -4640 6123 -3354 -1693 5382 -5319 2044 1732 -3419
1566 -3419 2478 -515 -588 242 578 -546 -643 1998 -2269 1158 598 -1960 2392 -1913 826 483 -1737
1583 -1737 2497 -2269 996 733 -2083 2385 -1664 539 313 -818 1458 -2251 2463 -1273 -1319 3909
1599 3909 -4490 2186 1692 -4501 4262 -1203 -2228 3344 -1470 -1300 2161 -249 -2585 3377 -876
1614 -876 -3078 5187 -3575 -699 4396 -4853 2061 1390 -2854 1787 -31 -350 -827 1872 -955 -1684
1630 -1684 3958 -3738 804 2964 -4806 3466 -87 -2701 3190 -1569 -355 1052 -405 -374 340 521
1646 521 -1447 1623 -710 -740 1849 -2144 1649 -504 -995 2397 -2996 2152 130 -2616 3636 -2495
1662 -2495 56 2007 -2449 1370 -17 -392 -111 432 363 -1834 2564 -1312 -1328 3291 -2892 516 1944
1679 1944 -2517 964 1095 -1514 -101 2150 -2334 -11 3188 -4427 2318 1762 -4741 4520 -1363
1694 -1363 -2363 4019 -2842 268 1540 -1566 475 222 243 -1102 1100 96 -1620 2200 -1327 -403
1710 -403 1619 -1556 632 223 -358 -32 211 294 -1083 1367 -738 -410 1478 -1814 1330 -316 -759
1727 -759 1687 -2092 1586 -178 -1529 2601 -2268 536 1456 -2321 1588 -31 -1091 950 135 -850
1743 -850 313 996 -1820 1242 618 -2314 2492 -941 -1138 2242 -1724 241 856 -748 -46 335 325
1760 325 -1347 1540 -295 -1616 2726 -2008 -153 2204 -2688 1331 665 -1692 1259 -89 -667 404
1776 404 421 -870 427 603 -1406 1337 -407 -809 1441 -1279 639 85 -735 1085 -1078 709 -69
1793 -69 -624 1051 -1069 771 -187 -492 1001 -1124 908 -371 -474 1263 -1478 909 202 -1155 1351
1810 1351 -693 -216 698 -493 -104 514 -209 -676 1269 -835 -425 1638 -1857 832 680 -1640 1562
1827 1562 -684 -318 783 -638 369 -456 658 -473 -329 1309 -1688 1018 345 -1500 1779 -1028
1843 -1028 -217 1111 -1116 451 167 -278 -22 282 -117 -377 837 -881 399 431 -1150 1289 -769
1860 -769 -77 796 -1181 1088 -602 -83 720 -1096 992 -530 -39 530 -890 944 -707 184 425
1877 425 -930 1107 -817 149 599 -987 860 -355 -45 176 -189 332 -615 843 -665 -29 981
1894 981 -1566 1368 -355 -903 1635 -1465 638 299 -897 1001 -781 486 -139 -226 630 -955 956
1911 956 -527 -258 933 -1125 809 -213 -294 561 -615 605 -567 393 31 -604 1104 -1207 722
1928 722 178 -1080 1511 -1314 574 419 -1231 1566 -1253 385 640 -1312 1403 -912 107 609
1944 609 -971 926 -647 262 99 -446 778 -915 697 -163 -434 863 -958 741 -318 -179 644
1961 644 -979 1079 -810 144 797 -1533 1601 -884 -301 1319 -1683 1276 -386 -548 1102 -1163
1977 -1163 830 -368 -87 523 -905 1035 -769 190 483 -957 1067 -806 309 244 -755 1056 -1064
1994 -1064 721 -12 -894 1489 -1429 660 398 -1206 1390 -1041 356 342 -859 1024 -913 540
2010 540 -22 -585 992 -1035 696 -138 -418 816 -997 931 -527 -169 879 -1308 1241 -651
2026 -651 -262 1122 -1494 1223 -447 -454 1079 -1223 942 -369 -254 758 -985 882 -561 18 526
2043 526 -923 945 -651 131 319 -660 877 -920 627 -14 -787 1369 -1382 717 349 -1262 1541
2060 1541 -1100 216 629 -1070 1078 -758 226 336 -761 897 -711 292 143 -487 661 -667
2076 -667 490 -209 -146 495 -809 869 -633 63 618 -1172 1267 -824 -65 993 -1541 1362 -518
2093 -518 -508 1233 -1353 933 -187 -566 987 -1001 623 -78 -376 619 -623 453 -201 -29 225
2110 225 -398 536 -556 335 64 -492 743 -738 472 -26 -525 942 -990 581 82 -744 1088
2127 1088 -983 452 227 -826 1048 -849 353 217 -737 997 -819 272 310 -686 725 -549
2143 -549 233 78 -395 580 -570 396 -90 -298 560 -613 405 -67 -204 364 -424 423 -352 110 222
2162 222 -563 744 -645 212 415 -933 992 -537 -134 709 -922 726 -298 -170 575 -757 660
2179 660 -355 -129 586 -824 630 -116 -374 558 -400 103 11 31 -72 -12 279 -529 548 -230 -302 740
2199 740 -785 460 36 -476 708 -695 465 -37 -468 802 -831 481 134 -709 938 -657 64
2216 64 488 -692 436 -60 -141 161 -64 7 -96 266 -338 209 100 -398 554 -440 177 156 -494 748
2236 748 -682 255 409 -931 999 -537 -219 824 -950 587 -10 -430 525 -390 250 -154 9 233
2254 233 -415 457 -244 -64 305 -303 149 -29 31 -162 223 31 -470 770 -584 -41 751 -1038 736
2273 736 -18 -646 899 -636 101 303 -365 282 -228 253 -233 45 323 -597 582 -240 -220 565 -590
2292 -590 312 13 -192 248 -261 276 -260 134 127 -377 485 -398 142 161 -424 514 -425 185 147 -443 567
2313 567 -440 135 205 -404 375 -239 151 -84 -19 246 -488 625 -391 -125 692 -930 647 22 -650
2332 -650 825 -499 0 311 -291 90 -18 179 -401 370 15 -577 887 -634 -48 684 -866 496
2350 496 48 -366 330 -122 49 -183 348 -286 -111 645 -902 591 123 -753 961 -625 26 450 -590
2369 -590 454 -190 16 35 -67 206 -416 527 -370 -57 508 -800 721 -278 -320 767 -827 455 75
2388 75 -461 535 -383 141 -4 2 -1 -146 462 -682 536 65 -778 1120 -801 23 733 -1013 696 -66
2408 -66 -385 367 -134 47 -273 577 -477 -127 894 -1225 800 168 -1053 1272 -713 -190 735 -656
2426 -656 189 123 -35 -287 380 -55 -557 999 -875 161 765 -1279 1090 -321 -521 984 -906 502
2444 502 3 -353 493 -466 405 -321 142 181 -555 808 -702 229 430 -925 982 -524 -202 726 -736
2463 -736 333 78 -146 -88 253 13 -629 1094 -892 -73 1275 -1809 1186 203 -1447 1700 -907
2480 -907 -222 901 -819 305 70 14 -315 347 144 -845 1134 -700 -271 1093 -1219 651 172 -667
2498 -667 635 -303 79 -140 300 -214 -261 863 -1117 698 213 -1102 1449 -1063 126 846 -1358
2515 -1358 1178 -446 -439 960 -901 395 137 -316 121 113 -32 -440 904 -800 -37 1114 -1614 1081
2533 1081 168 -1261 1449 -764 -193 668 -476 49 2 446 -875 603 425 -1522 1748 -772 -823
2550 -823 1897 -1705 432 917 -1402 775 213 -658 230 528 -766 130 873 -1408 952 198 -1268
2567 -1268 1555 -949 -82 869 -1076 813 -384 -20 387 -669 753 -585 175 254 -593 738 -709
2584 -709 416 73 -683 1080 -980 342 557 -1138 979 -214 -528 633 -116 -425 326 386 -1154
2601 -1154 1063 39 -1485 2106 -1289 -542 2050 -2155 789 877 -1623 1073 46 -658 331 414 -635
2618 -635 -33 1086 -1468 667 785 -1777 1458 -168 -1047 1276 -574 -305 547 -66 -494 468 226
2635 226 -1046 1203 -460 -717 1490 -1368 481 557 -1218 1205 -675 -91 675 -919 701 -236 -246
2652 -246 463 -354 69 66 140 -452 469 58 -874 1287 -825 -307 1335 -1474 631 535 -1109 754 51
2671 51 -450 70 605 -702 -156 1317 -1703 713 1022 -2166 1776 -107 -1553 1929 -842 -670 1341
2688 1341 -686 -531 1106 -466 -779 1462 -927 -445 1575 -1566 488 826 -1405 1026 -119 -492
2704 -492 512 -211 48 -204 424 -361 -94 632 -891 650 -42 -591 879 -777 318 221 -655 760
2722 760 -511 -9 445 -524 184 211 -252 -147 606 -587 -116 1051 -1404 731 630 -1711 1626 -396
2740 -396 -1064 1632 -953 -293 1007 -687 -213 750 -350 -599 1182 -716 -523 1532 -1391 174 1153
2757 1153 -1511 718 466 -1019 595 310 -769 324 603 -1149 673 502 -1451 1360 -316 -932
2773 -932 1483 -1064 74 754 -967 549 13 -325 257 -28 -82 -52 273 -387 240 96 -495 711 -549
2792 -549 24 570 -860 629 -43 -489 620 -329 -127 289 -30 -376 400 130 -829 1052 -454 -684
2810 -684 1456 -1271 144 1061 -1491 815 347 -1062 775 130 -732 486 361 -984 712 302 -1236
2827 -1236 1282 -364 -852 1411 -935 -124 889 -825 157 424 -400 -122 564 -448 -191 872 -989
2844 -989 363 578 -1173 984 -200 -608 936 -657 69 368 -422 166 117 -140 -119 374 -372 -5 504
2863 504 -800 637 -15 -695 1016 -733 -8 680 -864 440 168 -460 254 150 -314 3 554 -782
2881 -782 355 531 -1222 1081 -153 -933 1310 -795 -211 867 -778 96 458 -438 -136 617 -515
2898 -515 -185 908 -1030 346 630 -1192 921 -76 -686 845 -394 -158 357 -131 -246 264 120 -633
2916 -633 733 -278 -487 1020 -937 278 529 -984 850 -252 -386 654 -505 117 193 -220 2
2933 2 165 -115 -217 523 -534 95 528 -902 690 -47 -607 847 -536 -33 400 -354 39 123 59 -434
2953 -434 539 -122 -626 1084 -850 -48 978 -1284 728 258 -964 898 -218 -435 541 -87 -407
2970 -407 413 71 -636 785 -312 -473 980 -862 188 504 -808 606 -176 -167 295 -278 232 -239
2988 -239 231 -96 -181 495 -624 419 39 -528 742 -567 116 384 -625 496 -92 -269 335 -77
3006 -77 -206 199 122 -517 601 -188 -547 1085 -938 113 846 -1287 857 34 -778 900 -450 -102
3024 -102 314 -172 -76 6 304 -570 373 216 -783 825 -312 -390 733 -529 4 348 -281 -105 340 -154
3044 -154 -363 696 -551 -62 738 -975 629 80 -699 894 -623 96 371 -587 519 -309 6 225
3062 225 -343 322 -184 61 1 -38 130 -303 416 -305 -30 425 -624 460 -36 -361 455 -265 7 21
3082 21 114 -157 -87 506 -732 466 244 -916 1040 -468 -400 958 -802 146 444 -519 128 239 -216
3101 -216 -200 527 -426 -109 675 -811 411 246 -696 648 -246 -136 256 -199 148 -216 290 -208 -106
3120 -106 440 -621 423 0 -414 566 -424 139 109 -253 312 -318 219 -37 -170 288 -285 179 -55 -26
3140 -26 65 -171 325 -440 298 98 -595 777 -500 -129 637 -738 354 134 -396 289 -52 -66 -108 298
3160 298 -239 -153 574 -658 270 303 -655 544 -134 -229 284 -120 -25 -58 269 -367 113 354 -702 610
3180 610 -120 -457 727 -564 114 272 -415 321 -150 46 -24 -23 165 -305 310 -145 -107 272 -312 230 -115
3201 -115 9 110 -251 344 -339 119 190 -446 454 -234 -64 266 -302 267 -210 126 34 -271 471 -448 159
3222 159 246 -541 502 -190 -165 329 -254 61 4 63 -130 50 164 -387 403 -167 -218 487 -462 188 139 -298
3244 -298 252 -162 110 -110 40 126 -325 406 -278 -51 377 -506 340 -39 -239 332 -264 147 -60 -35 133
3265 133 -217 257 -200 26 167 -281 286 -168 -8 131 -212 234 -231 111 61 -215 315 -275 120 83 -239
3286 -239 316 -251 111 51 -182 287 -296 198 3 -233 359 -315 132 85 -247 267 -175 51 32 -76 116
3307 116 -170 202 -156 -13 179 -304 275 -124 -62 211 -269 227 -135 -5 126 -252 302 -224 25 193
3327 193 -360 339 -175 -92 250 -312 217 -60 -93 152 -169 134 -118 65 31 -137 220 -209 121 35 -181
3348 -181 242 -212 111 0 -119 191 -245 217 -72 -119 298 -330 221 -26 -191 328 -296 155 31 -173
3368 -173 230 -225 137 -21 -109 190 -196 154 -67 -47 163 -225 184 -94 -38 139 -187 194 -140 18 105
3389 105 -190 216 -187 66 93 -219 252 -199 65 93 -225 288 -243 74 136 -277 269 -167 4 118 -197
3410 -197 175 -141 60 7 -96 174 -225 172 -19 -159 216 -217 128 -8 -101 171 -204 147 -74 -31 154
3431 154 -261 250 -136 -79 242 -324 238 -70 -146 262 -249 125 -7 -94 123 -142 129 -118 25 67 -181
3452 -181 209 -171 65 78 -200 239 -195 76 71 -211 267 -233 92 87 -230 281 -231 89 80 -222 283 -206
3474 -206 59 97 -204 214 -144 44 54 -117 127 -136 107 -71 -20 117 -228 233 -145 -32 201 -315 273
3495 273 -113 -115 254 -298 198 -58 -115 213 -243 189 -73 -66 165 -215 190 -98 -46 149 -190 164 -100 21
3517 21 57 -138 173 -183 119 -7 -167 272 -282 144 53 -245 307 -255 87 88 -244 265 -200 51 90 -200
3539 -200 197 -169 55 33 -121 140 -139 103 -57 -21 114 -197 197 -134 4 143 -274 277 -161 -38 213
3560 213 -307 268 -122 -68 232 -309 235 -84 -111 218 -244 174 -43 -80 147 -133 107 -84 37 17 -105
3581 -105 163 -176 114 -14 -108 217 -235 163 -25 -130 266 -299 210 -5 -209 337 -302 119 103 -246 280
3602 280 -172 16 89 -130 100 -81 78 -74 3 101 -197 189 -112 -26 135 -197 177 -111 10 82 -190 240
3624 240 -215 63 137 -314 307 -169 -49 221 -290 212 -58 -80 146 -165 111 -72 2 48 -84 106 -125
3645 -125 101 -51 -36 146 -220 198 -89 -102 241 -302 207 -10 -192 274 -221 80 53 -128 142 -152 125
3666 125 -74 -46 181 -254 191 -22 -180 241 -161 -14 91 -63 -30 28 66 -192 202 -55 -194 342 -295
3687 -295 58 206 -345 258 -70 -109 171 -164 85 -62 22 3 -87 152 -180 94 43 -172 202 -154 28 54
3709 54 -115 116 -111 56 -38 -47 102 -154 118 -62 -40 115 -179 186 -128 -19 186 -308 253 -35 -206 300
3731 300 -210 1 156 -172 49 64 -47 -84 174 -95 -127 291 -282 50 199 -319 205 1 -170 154 -38
3752 -38 -57 8 111 -166 25 191 -336 257 27 -306 391 -220 -68 291 -273 92 85 -110 38 44 -33 -58 134
3775 134 -115 11 114 -193 169 -51 -82 148 -190 114 -20 -94 162 -154 70 7 -69 65 -64 79 -111
3796 -111 72 45 -192 256 -177 -58 264 -321 162 110 -261 184 13 -158 115 76 -215 149 101 -341 335
3817 335 -54 -290 457 -302 -62 339 -341 111 138 -187 53 96 -92 -68 206 -212 -4 251 -353 176 105
3838 105 -297 260 -78 -121 174 -101 -36 75 -13 -96 133 -41 -136 230 -213 46 143 -293 259 -95 -137 266
3860 266 -259 98 84 -185 138 -54 -43 41 35 -87 19 141 -258 194 44 -296 352 -169 -148 326 -274 22
3882 22 210 -212 -5 194 -181 -60 291 -328 58 296 -470 292 84 -399 398 -151 -173 278 -145 -52 126
3903 126 -25 -144 162 -15 -212 323 -219 -73 342 -361 140 142 -291 226 -29 -129 130 -18 -84 85 4
3924 4 -167 193 -100 -130 276 -295 115 137 -333 307 -119 -123 278 -227 38 110 -135 3 82 -48 -109 228 -188
3947 -188 -55 303 -378 170 161 -380 293 -19 -232 241 -33 -193 183 12 -286 326 -83 -300 488 -339 -90
3968 -90 442 -484 198 183 -383 283 -15 -180 168 10 -131 78 111 -248 184 15 -262 306 -165 -71 245
3989 245 -246 76 83 -137 57 49 -86 -26 147 -212 103 118 -331 347 -149 -189 434 -416 122 221 -415 317 -37
4012 -37 -254 284 -101 -136 197 -25 -190 248 -56 -232 363 -236 -80 328 -327 93 180 -238 85 121 -151
4033 -151 -37 242 -256 13 330 -489 296 131 -500 515 -205 -241 462 -354 12 245 -278 80 127 -192
4053 -192 50 145 -230 124 98 -259 260 -97 -122 253 -218 93 57 -140 117 -58 9 -47 57 -17 -114 238 -249
4076 -249 81 212 -405 350 -60 -286 443 -276 -91 342 -309 32 259 -296 55 277 -385 164 228 -484
4096 -484 375 6 -390 463 -237 -130 324 -244 25 121 -71 -70 120 -4 -205 302 -160 -152 367 -345 81 227
4118 227 -332 219 47 -231 204 -16 -172 176 -5 -186 238 -128 -109 303 -315 120 150 -348 328 -112 -173
4139 -173 308 -246 39 144 -179 57 66 -95 -32 180 -163 -19 249 -322 160 127 -357 308 -34 -240 292
4160 292 -93 -156 230 -41 -209 280 -87 -248 418 -274 -99 406 -419 126 235 -383 221 72 -249 171
4180 171 44 -197 115 80 -253 213 10 -246 328 -176 -93 265 -255 103 95 -172 148 -23 -53 74 -14 -53
4202 -53 53 32 -117 146 -53 -88 201 -202 63 121 -249 181 -10 -155 154 -27 -115 113 28 -184 202 -1
4224 -1 -259 352 -188 -160 417 -361 37 287 -390 184 132 -299 189 80 -243 181 88 -262 241 8 -257 296
4246 296 -125 -141 265 -179 -5 146 -113 -10 88 -42 -83 161 -102 -82 225 -231 69 147 -263 213 -46 -140
4268 -140 224 -157 -1 113 -153 76 35 -114 82 30 -137 135 10 -166 230 -129 -95 250 -249 54 142
4289 142 -245 127 48 -149 84 60 -141 38 135 -211 116 110 -294 247 -21 -245 317 -151 -104 260 -163 -47
4311 -47 191 -142 -59 199 -150 -36 222 -242 79 162 -270 190 18 -175 174 -66 -60 88 -32 -45 66 14
4333 14 -110 118 -55 -57 159 -157 69 52 -161 181 -90 -37 139 -133 52 53 -91 43 30 -70 0 91 -121
4356 -121 52 91 -194 163 -3 -159 212 -103 -67 153 -100 -28 102 -53 -76 167 -94 -93 252 -222 22 210
4378 210 -300 158 75 -225 212 -44 -103 126 -24 -68 86 14 -125 136 -28 -109 174 -132 2 109 -135 78
4400 78 -11 -43 46 -33 12 -44 49 -35 -12 75 -127 109 -25 -86 160 -149 72 68 -149 145 -54 -49 99 -68 -7 62
4426 62 -21 -58 101 -68 -76 165 -172 34 140 -217 150 8 -135 146 -54 -27 30 15 -44 9 93 -156 111 45
4450 45 -175 216 -89 -80 182 -141 32 69 -89 32 36 -47 -22 92 -118 13 84 -156 127 -31 -79 143 -137
4473 -137 59 3 -94 108 -91 43 20 -57 76 -69 51 -21 -19 65 -93 90 -32 -43 114 -110 53 29 -66 52
4497 52 12 -27 -8 67 -95 19 91 -192 142 -10 -160 222 -146 -7 125 -163 89 -9 -30 41 -24 35 -68 73
4521 73 -18 -69 121 -98 20 50 -77 54 -12 -28 -3 14 -25 -30 82 -109 53 34 -118 148 -100 12 87 -143
4545 -143 145 -74 -26 111 -149 98 -18 -77 109 -76 14 18 -25 13 -23 32 -62 49 -10 -44 90 -84 24 24 -39
4570 -39 26 -46 51 -58 18 67 -144 139 -66 -59 164 -167 74 57 -120 114 -35 -18 42 -23 11 -15 46 -48 27 30
4596 30 -69 65 -31 -17 28 -24 40 -62 49 -4 -61 106 -106 47 44 -104 111 -66 -7 69 -80 82 -37 11 30
4621 30 -63 68 -38 -2 25 -37 34 -11 14 -13 16 15 -60 102 -71 12 77 -111 93 -17 -40 82 -80 41 -9 -29
4647 -29 36 -62 61 -51 -30 66 -89 40 13 -48 50 -14 0 7 20 -33 23 41 -83 68 -8 -64 95 -76 17 29 -62
4674 -62 64 -52 6 11 -39 54 -68 33 21 -62 70 -51 -1 32 -48 18 -19 -16 -12 -9 -9 -24 34 -38 5 15 -61 39 -38
4703 -38 -7 26 -45 50 -28 -9 41 -50 45 -8 -32 45 -48 26 3 -10 24 -21 26 -12 -4 20 -28 32 -21 -9 13 -27 3 -6 7
4734 7 -11 -5 20 -45 48 -6 -38 61 -64 24 25 -65 58 -9 -7 29 -29 20 -9 7 1 -13 32 -18 21 -7 -35 48 -25 -2 26 -24
4766 -24 16 7 -20 8 7 3 6 31 -33 -6 19 -51 46 -26 -29 47 -57 26 10 -33 36 -19 16 9 -21 26 -40 20 -1 -15 24 -42 21
4799 21 -9 -33 26 -22 7 2 -22 16 -18 2 -8 5 -21 -15 29 -35 27 7 -40 42 -49 12 24 -51 46 -24 -32 48 -38 15 -11 -14
4831 -14 18 -19 19 -25 19 5 -38 43 -26 -8 32 -24 14 -2 1 -15 25 4 -33 50 -40 -8 40 -78 45 -11 -61 46 -43
4860 -43 1 8 -38 23 -16 18 -3 -13 33 -38 29 -5 -14 18 -11 10 -12 10 -7 -9 26 -37 21 3 -42 63 -37 10 10 -34 47
4891 47 -39 26 8 -47 56 -42 8 35 -74 47 -4 -33 22 -1 -9 -4 15 -41 16 21 -29 55 -32 -6 41 -42 25 -12 -9 13 -38
4922 -38 42 -47 18 41 -71 55 -22 -35 52 -47 7 19 -12 5 3 6 -29 24 -20 -16 36 -34 9 -8 -14 14 -31 23 -31 -9 38
4953 38 -65 51 -5 -33 67 -53 22 27 -40 22 -8 11 17 -8 3 -22 36 -24 15 16 -37 37 -13 -6 -5 -5 22 -41 32 -22 -32
4984 -32 59 -55 26 23 -51 43 -15 -3 15 -17 37 -20 24 -1 -14 33 -35 9 12 -13 5 -7 14 -29 31 -1 -47 61 -48 16
5014 16 45 -55 49 -1 -16 31 -29 3 -13 10 -16 -6 31 -53 29 6 -42 56 -28 -18 17 -17 -1 -10 22 -36 22 12 -48 60
5044 60 -40 -9 53 -77 44 1 -31 52 -36 23 -3 -29 41 -23 2 -9 -5 -1 -8 0 -34 16 -10 -15 40 -38 11 -2 -39 18 -25
5075 -25 12 -1 -5 11 -33 41 -42 -23 60 -96 51 0 -74 82 -52 -28 51 -45 -6 17 -34 -12 33 -40 -22 44 -48 15 24
5104 24 -65 41 -29 -27 3 -21 -13 -18 21 -31 -9 37 -70 28 -4 -61 70 -60 0 40 -69 47 -9 -37 40 -26 -2 22 -18
5133 -18 -2 27 -31 -10 49 -38 14 28 -67 57 -25 -31 41 -37 -4 9 -21 -15 -6 13 -48 33 -2 -62 73 -64 -25 77 -97
5162 -97 21 35 -87 42 9 -61 42 -4 -54 66 -12 -54 68 -38 -28 66 -56 24 30 -55 24 -9 -18 10 -8 -17 -6 34
5190 34 -28 -2 25 -57 33 -7 -53 60 -46 -7 55 -62 12 32 -60 33 8 -59 39 -25 -56 66 -46 -40 75 -57 2
5217 2 45 -84 34 29 -68 38 7 -43 27 7 -55 17 20 -67 44 5 -74 75 -25 -61 83 -69 -31 77 -78 9 45
5244 45 -70 23 39 -68 32 22 -79 44 -14 -76 63 -37 -40 52 -61 8 30 -43 11 17 -31 7 20 -37 11 13 -51 45
5272 45 6 -54 60 -33 -39 68 -63 9 46 -70 14 27 -75 24 27 -71 55 1 -72 89 -37 -63 84 -66 -22 77
5298 77 -73 17 46 -66 14 38 -63 16 52 -80 46 40 -102 74 2 -81 92 -35 -42 88 -46 -21 57 -56 -12
5323 -12 53 -67 -5 57 -85 34 24 -85 66 -15 -54 68 -57 -9 35 -54 9 19 -47 4 37 -59 20 36 -69 47
5349 47 7 -68 71 -37 -29 77 -57 -8 49 -50 -10 55 -56 -10 64 -93 26 57 -113 76 11 -102 97 -29 -63
5374 -63 89 -50 -20 79 -24 -38 79 -58 -27 86 -83 18 71 -86 49 19 -65 58 -10 -38 48 -14 -30 46 0
5399 0 -28 71 -42 -20 78 -84 25 35 -80 58 -8 -61 58 -15 -31 48 -21 -36 71 -42 -42 77 -79 8 70 -111
5425 -111 70 34 -92 79 -5 -52 66 -6 -50 60 -8 -52 93 -39 -49 108 -75 -10 78 -96 31 45 -76 34
5449 34 32 -72 34 37 -82 54 10 -79 94 -30 -41 87 -73 12 53 -75 29 28 -49 30 14 -33 33 21 -63 50
5475 50 -22 -52 88 -56 5 63 -66 36 28 -49 29 19 -43 24 30 -72 60 27 -100 95 -33 -73 110 -78 -25 94
5501 94 -97 8 65 -83 16 47 -85 17 60 -96 54 16 -97 87 -27 -47 79 -46 -5 54 -31 -19 35 -11
5525 -11 -34 64 -48 -13 69 -66 36 41 -81 62 -5 -44 59 -40 -15 46 -45 -4 46 -51 -6 53 -83 40 28 -85
5551 -85 89 -26 -51 95 -55 1 59 -60 -7 37 -40 -7 48 -52 -11 73 -87 32 57 -88 78 14 -67 64 -10
5576 -10 -43 58 -24 -55 63 -16 -58 90 -61 -21 88 -99 31 35 -74 54 5 -35 39 -21 -27 18 -3 -31 28 1 -40
5603 -40 40 -39 9 38 -52 29 9 -49 46 -6 -15 35 -3 -25 43 -14 -39 54 -45 -14 77 -89 25 53 -86 58 1 -76 59
5632 59 -22 -55 46 -8 -45 55 -10 -55 79 -31 -18 77 -55 9 56 -70 20 30 -54 17 35 -46 31 35 -57 43 15
5659 15 -60 65 -28 -42 64 -54 3 31 -40 14 12 -29 8 11 -31 24 2 -34 40 -21 -21 38 -38 -7 23 -35 16 7 -38 35 12
5690 12 -34 24 19 -38 39 7 -47 44 -12 -40 75 -43 -15 59 -75 -3 45 -61 16 29 -53 25 22 -53 25 20 -51 44 -1 -47
5720 -47 53 -22 -25 49 -36 6 31 -33 -7 10 -41 2 13 -41 12 24 -36 31 13 -43 34 -24 -21 19 -36 -10 10 -32 7 8 -33
5751 -33 9 11 -33 16 -1 -47 24 -12 -35 38 -40 -4 38 -51 12 17 -42 16 18 -21 3 14 -31 12 5 -59 37 -12 -36 53 -32 -3
5783 -3 27 -30 -4 14 -17 -4 26 -33 -11 28 -36 7 24 -40 37 -4 -41 24 -27 -21 23 -25 -17 22 -12 -17 13 -9 -17 16 -37 6 6
5816 6 -29 34 -18 -16 25 -32 6 5 -7 8 5 0 -11 -2 -28 -12 20 -36 9 10 -41 24 -5 -13 15 -19 -3 0 -23 -15 9 -11 -18 23 -41 2
5852 2 25 -47 26 -2 -35 30 -23 0 12 -21 -11 -5 5 -19 19 -1 -16 28 -20 4 22 -37 14 -7 -12 11 -5 -11 -8 20 -10 6 8
5885 8 -32 16 -10 -27 24 -29 3 0 -19 23 -11 -1 -3 -4 -3 -10 12 2 1 14 -13 20 -21 0 15 -15 17 -13 1 6 5 3 -18 8 -6
5920 -6 -7 22 -18 9 0 -18 13 -21 4 14 -20 9 -1 -9 -11 -10 0 -12 19 -19 -1 15 -30 23 -11 -18 9 -17 -2 -9 -4 4 -1 3 -8 9
5956 9 1 -1 19 -19 -4 2 -14 19 -15 -1 -6 -15 -4 -19 10 -8 -8 0 -19 0 -11 -16 15 -26 2 -6 -1 -7 -7 5 -10 -3 8 -8 9 -7 11
5993 11 10 -22 26 -9 0 5 -21 15 -25 3 -2 -11 10 -18 12 -1 -22 22 -16 3 3 -8 4 -16 3 -2 -7 -7 -1 -6 -11 7 -2 -17 23 -21 2
6030 2 6 -22 27 -15 -13 15 -11 -2 -6 -11 -7 -10 5 -7 7 -1 -13 3 -17 -1 1 -9 -2 -18 -6 -6 -2 5 -14 9 -24 2 18 -40 17 -8 -14 26
6068 26 -24 2 12 -19 7 -3 -1 -6 4 4 -9 15 -1 10 -1 -10 4 -19 -5 2 -10 12 -13 2 -4 -13 9 -16 9 -5 -12 17 -21 5
6102 5 5 -13 2 -1 -17 2 -16 -6 7 0 -2 10 -6 -4 8 -25 -3 12 -33 19 -9 -3 21 -23 19 6 1 9 -6 5 -3 7 -1 -13 18 -15
6138 -15 -2 16 -11 17 -3 0 10 -8 -1 5 7 -7 -4 5 -20 13 -3 -20 14 -18 -2 4 -9 8 -16 -5 0 -14 0 -9 -10 -8 1 -3 -18 0 -13
6175 -13 -8 -1 -14 15 3 -18 -4 -13 -11 0 -4 -3 1 -11 -14 2 -13 -11 11 -35 2 13 -16 15 -13 -12 8 -19 -1 2 -1 -5 -2 -3 0 -7 -1 -16 5
6214 5 -3 -9 -2 -11 -2 11 -16 1 -1 -12 2 -11 -10 2 -1 -11 2 -6 -14 6 -24 -1 -2 -22 12 -12 -7 18 -18 13 1 -17 20 -11 6 -11 -18
6251 -18 9 -9 3 18 -8 11 -5 -7 6 -16 2 6 -7 3 -3 -10 4 -2 -13 5 -16 -13 13 -26 -2 -7 -21 20 -10 -4 1 -18 6 -16 -5
6286 -5 -5 -20 18 0 3 9 8 2 1 -17 14 6 6 4 3 -11 -2 -1 -8 16 -2 -2 10 -23 5 -5 -10 21 -16 9 -5 -17 11 -15 1 3 -9 13 -14
6325 -14 4 -2 -2 10 -7 10 -3 2 -3 -9 23 -8 5 5 -9 12 -7 8 9 -14 5 -11 0 6 -1 11 -15 4 1 -2 2 -8 11 0 -20 8
6361 8 -2 7 -2 -9 2 -8 1 -3 7 2 -15 16 -3 2 16 -9 -1 -4 -4 6 -6 -2 2 -3 -3 -3 -5 -5 12 0 4 13 -16 8 -7 -11 8 -12 -3 8 -11
6402 -11 1 -8 0 -1 -8 9 -5 4 -12 13 11 -20 19 7 -17 8 2 -5 1 2 -6 1 9 -12 15 7 -13 26 -16 10 16 -21 1 9 -20 4 -7 -12 -5
6441 -5 12 -20 8 5 -7 5 -20 -13 20 -25 -4 3 -6 0 -14 6 -14 6 -1 -1 0 -20 3 7 -6 24 -13 -6 10 -14 17 4 -3 8 -2 -1 -4
6478 -4 6 -11 -6 6 -13 12 -14 -20 28 -33 -1 17 -16 14 5 -13 3 3 -14 0 23 -15 11 9 -17 41 -6 -9 17 -17 2 9 0 -5 -2 8
6514 8 -2 17 -8 -12 22 -19 19 15 -13 34 -15 -13 10 -14 13 7 0 7 5 0 2 13 -23 8 20 -21 32 0 -13 25 -24 6 12 -5 3 10 -5
6551 -5 4 8 -12 2 26 -34 23 13 -35 30 2 -11 19 -13 -11 25 -10 -18 16 -6 -23 30 -20 -12 32 -20 12 20 -33 22 8 -18 17 -3
6585 -3 -19 17 11 -18 28 7 -16 20 -19 7 17 -28 4 1 -25 17 -6 -3 17 -8 -7 13 -14 -9 12 -24 -7 5 -30 11 8 -36 19 -8
6619 -8 -31 13 -7 -27 15 -5 -23 17 -14 -28 45 -22 -3 33 -32 7 24 -38 22 7 -31 26 9 -24 12 8 -20 25 3 -13 18
6650 18 -10 -11 27 -22 -3 24 -11 5 8 -8 -1 11 -18 14 13 -27 22 -4 -16 32 -6 0 25 -32 11 20 -21 16 5 -14 21 -2 -26
6683 -26 17 -3 -28 39 -25 -14 32 -26 -13 15 -25 9 8 -29 7 5 -38 23 -5 -46 23 7 -29 28 -17 -21 39 -17 -19 29 -21 -1
6715 -1 23 -32 15 15 -23 17 9 -20 13 5 -32 26 8 -18 38 -15 -9 30 -14 -3 8 -9 8 14 -18 7 11 -23 14 6 -14 27 -5 -18
6749 -18 36 -27 -6 29 -27 14 8 -28 14 7 -23 12 12 -35 21 10 -26 36 -19 -21 36 -16 -1 35 -35 12 21 -32 7 14 -34 9 13 -28
6783 -28 10 -12 -39 34 -15 -21 24 -33 -5 25 -25 -9 24 -17 -1 11 -15 7 20 -38 13 12 -14 28 -12 -6 27 -7 0 22 -20 -1
6815 -1 12 -8 7 23 -18 14 16 -35 30 -6 -34 25 -18 -12 30 -22 4 20 -24 -4 23 -16 8 29 -30 10 13 -27 27 -5 -33 24
6847 24 -26 -13 36 -2 -6 29 -11 -11 35 -16 -10 31 -27 -3 12 -25 26 -7 -29 25 0 -18 12 -4 -12 18 -11 -3 29 -32 0 17 -26
6880 -26 11 19 -19 26 -3 -17 27 -5 -10 27 1 -10 12 -12 -9 40 -20 17 25 -20 10 7 -21 17 15 -12 25 -2 -24 31 -8 -5 31 -20
6914 -20 -8 32 -27 6 7 -25 17 12 -8 24 16 -31 20 8 -20 28 -3 -14 25 -20 -15 23 -16 10 21 -13 5 25 -18 14 25 -35
6946 -35 20 7 -25 28 -9 -10 22 -17 4 16 -24 6 10 -20 11 16 -19 19 14 -20 29 -6 -18 19 -5 -15 30 -15 -1 17 -15 4
6978 4 27 -21 2 24 -31 11 20 -32 29 8 -31 26 -13 -15 27 7 -7 13 -12 -16 14 -16 -10 16 -26 3 4 -23 15 -5 -6 12 -4 -21
7012 -21 -1 -1 -11 16 0 -7 20 -8 0 13 -20 17 15 -23 16 0 -15 18 -28 -8 15 -13 -5 15 -4 -4 12 -30 8 8 -25 21 3 -16
7046 -16 23 -5 -13 14 7 -19 9 10 -11 9 -5 -10 25 -20 -4 20 -25 15 15 -31 15 -1 -8 12 0 -4 4 8 -26 12 -7 -8 14 -20 6
7081 6 8 -16 10 -10 2 9 -5 2 -4 6 -8 5 1 -9 19 -5 -5 16 -23 -10 17 -20 17 -5 -3 1 10 -2 9 -4 -20 14 -11 -12 20 -21
7117 -21 -5 7 -25 4 4 -12 11 4 -5 -1 14 -9 9 15 -18 -1 0 -16 11 -12 -5 10 -8 -13 6 -4 -1 7 2 -10 12 -3 2 8 -10 10 6
7154 6 1 10 -4 -5 2 -17 18 -2 -7 1 -4 -6 6 -3 -4 7 1 -19 6 -4 -9 13 -19 2 2 -21 -5 1 -13 0 -8 -13 -5 3 -6 -1 5 -22 2 1 -15 6
7196 6 -4 -12 10 -5 -11 7 -6 -1 4 -8 -7 8 -15 -6 0 -17 0 -12 -7 -2 -5 -5 -12 -6 -3 -9 -2 -9 -3 9 -4 9 -9 -2 6 -7 7 -6 -2 4 -6 4
7238 4 8 -11 -9 0 -7 6 -2 -8 10 1 -8 4 3 -14 9 -1 -10 6 -2 -1 -1 4 -17 -3 -1 -7 9 9 -13 10 -18 5 9 -7 8 9 -6 -3 -3 12 -6
7279 -6 -2 -8 5 7 6 5 12 7 10 3 3 -5 -5 -1 5 -8 -2 0 2 -10 10 7 2 7 -11 -3 -14 -5 6 -1 -1 7 -11 5 -7 -12 6 8 -5 4 -4 -7 5 -8 -9 1
7325 1 5 5 4 -5 10 2 -8 4 -1 3 -7 -2 -9 6 -3 -19 -6 -1 -7 3 4 -13 0 4 -6 7 4 6 12 10 -2 7 4 6 -4 3 10 -3 -1 8 9 7 8 1 2 -2
7371 -2 12 -9 -1 -10 -12 1 -12 -5 8 -5 6 -6 -8 -11 4 2 2 -3 -9 -8 -3 -10 7 -2 -5 6 2 9 2 3 6 8 5 8 -8 -8 -2 10 -2 9 -2 5 4 -7
7415 -7 0 -1 -4 -12 -1 -3 4 2 -3 -5 -4 -6 -2 6 -4 -1 -2 -4 -6 -11 -2 -10 -9 -1 6 -1 -1 15 2 -1 5 -4 12 4 5 0 1 4 5 13 1 16 4 2 -3 3 3 7 -7 3 9
7466 9 0 6 0 6 2 8 -7 10 10 -5 8 10 -9 4 6 2 4 6 0 7 3 0 6 0 5 3 7 10 8 -6 5 7 -6 8 -3 10 9 4 2 2 0 0 1 1 2 -10 8
7513 8 2 12 -12 5 14 -3 14 8 2 11 0 7 6 13 7 7 7 6 6 4 4 13 -3 18 10 -14 17 1 3 15 1 3 -1 -2 3 -3 0 -12 12 3 4 7 -3 2 -2
7558 -2 -11 -3 -11 4 -8 4 4 8 10 -5 11 0 1 11 -2 12 9 -6 14 2 8 13 -1 15 4 0 9 9 1 12 -6 -3 -2 1 -2 0 -4 -9 10 -1 -1 0
7600 0 -4 -3 10 1 7 5 -1 -9 -1 -9 -1 11 -9 -6 -1 -7 2 5 -7 8 -4 18 1 5 0 12 -1 -3 10 0 2 -6 0 6 -6 -3 7 -8 -2 1 -8 -8 3 0 1
7645 1 1 4 -5 12 -5 2 5 -6 7 -5 -7 4 -9 4 -3 -3 -5 -2 4 0 -1 -2 2 -2 -4 -3 0 1 -4 -6 6 7 2 -1 -4 -5 -5 -12 1 0 -4 -5 -1 -1 -5 -13 4 -2 -1 -12
7695 -12 -5 5 -2 9 4 -3 -6 -4 2 8 -3 -2 4 -1 9 11 -7 3 -3 -5 -6 0 7 9 -6 2 -6 0 -15 -13 -2 0 -10 -2 -2 3 -7 1 -1 4 -2 -7 8 4 4 -4 12
7742 12 -1 1 1 3 -3 -11 2 11 6 -1 -2 5 -3 2 2 -5 14 -13 -1 -1 -1 8 -13 0 1 -8 -6 3 6 3 6 2 -4 -2 4 -4 6 1 -8 -2 -2 4 2 8 -8 7 -5 0 7
7791 7 -3 4 10 2 16 -6 -3 -5 4 4 1 -12 -4 4 2 -4 -5 0 1 -5 -12 -3 8 -10 7 -8 -6 2 -2 5 9 0 6 4 -3 0 -1 -2 1 3 -16 15 3 -6 22 5 1 10
7839 10 5 3 0 -10 -2 4 -13 -2 11 -8 8 -1 -13 16 -3 -11 -3 -6 -9 -4 -5 -2 4 -8 -5 12 -16 4 6 -15 13 9 -3 2 0 0 5 -8 0 2 -7 6
7881 6 14 6 -7 0 10 -8 3 0 17 3 -9 3 5 -12 1 3 0 3 -12 -6 6 -6 2 12 -2 -7 -4 -15 3 11 -6 -2 5 -8 6 -5 -7 -2 -2 -12
7921 -12 -2 -4 0 5 -6 3 4 -4 -5 -3 -10 -1 8 3 1 -5 -4 -4 -19 -5 4 -13 -3 -1 -13 5 5 -9 -8 6 -8 4 -5 -13 9 -8 -13 6 -5 5 10 0
7963 0 -1 6 -9 8 9 -21 7 -1 -15 15 6 -5 21 -4 -8 9 -1 6 4 -13 -9 0 -8 1 -2 -8 -4 7 -3 -8 -6 -7 5 -4 -9 8 -7 -8 7 -10 0
8004 0 1 -11 8 10 -4 2 3 0 -2 -2 2 1 -5 -8 5 -2 -3 7 2 -2 -5 -16 2 6 -7 4 7 -8 9 2 -5 12 -7 -10 9 -13 -2 8 -18 -7 -2 -10
8046 -10 8 4 -4 19 3 -1 14 5 8 12 -6 -11 16 -12 -9 15 -7 -3 17 -3 1 4 -14 7 4 -11 7 -5 -7 6 3 4 13 -3 -1 9 -13 -9 15
8085 15 8 12 13 -10 17 8 2 15 -3 -9 14 -7 -8 12 0 -3 14 -14 7 9 -10 3 11 -17 2 5 -11 9 -2 -2 8 2 -12 10 -6 -13 20
8122 20 -10 7 16 -3 12 8 -7 3 9 -10 3 9 -2 8 8 0 5 -10 -7 13 -9 -5 7 -12 2 4 -5 9 -17 -7 -8 3 -13 -6 -10 -7 9 -5
8160 -5 -18 11 -10 -7 15 -8 -3 3 -17 5 4 -5 12 13 -6 17 4 -10 7 -4 4 4 -14 -9 8 -10 -2 3 -17 1 7
8191G
$$ Imaginary data points
##PAGE= N=2
##DATA TABLE= (X++(I..I)), XYDATA
0 0 0 0 0 0 0 0 0 0 0 -8 8 -8 8 -16 16 -24 25 -32 40 -48 58 -72 86 -98 118 -137 161 -185 215 -247 282 -322
32 -322 365 -415 467 -528 595 -666 741 -830 924 -1028 1140 -1262 1395 -1542 1701 -1877 2069
49 2069 -2277 2509 -2762 3044 -3356 3704 -4097 4540 -5046 5631 -6315 7129 -8115 9333
63 9333 -10890 12953 -15823 20120 -27330 42454 -133988 176553 26803 -215374 266171
74 266171 -170101 14609 94470 -111164 67794 -18324 -4690 12214 -24572 45397 -52873
85 -52873 31215 4401 -21899 7564 17825 -16166 -25722 77283 -85657 22497 81594 -155648
97 -155648 139333 -35333 -94090 166841 -144824 52160 52250 -116849 124210 -84494 20928
108 20928 46176 -95951 107603 -69029 -4586 74105 -96244 56615 10687 -50724 35355
119 35355 12776 -41779 16057 46012 -87348 63054 17319 -96946 116868 -62676 -24452
130 -24452 84157 -87241 50571 -9222 -15613 29719 -47094 64659 -59124 14000 54730
141 54730 -102995 91790 -22283 -59805 96807 -66818 101 48619 -46805 7037 27679
152 27679 -23638 -14166 48077 -44152 1803 48405 -69655 48208 -1547 -39377 55982 -48201
164 -48201 26070 888 -27942 49506 -55366 35735 5267 -46814 64110 -46415 6108
175 6108 30234 -42629 31618 -12428 -1244 6580 -10404 17523 -23004 17806 -702 -17689
187 -17689 23929 -14158 -614 5505 2596 -10901 4140 18349 -39060 35686 -2326 -40974
199 -40974 61980 -42554 -5117 47487 -55778 28278 10303 -31114 24858 -5563 -6038 1503
211 1503 9693 -10882 -4371 23875 -29101 13018 13105 -29541 24704 -5198 -11387 13735 -5178
224 -5178 -2529 379 9242 -14670 6800 10994 -25579 24853 -7873 -14211 27267 -24520 9677
237 9677 7873 -19190 19899 -11494 -855 10625 -13381 8797 -365 -6166 6320 -420 -5841
250 -5841 5894 1746 -11277 13608 -4962 -9034 18014 -15326 2642 10589 -15241 9763 -416
263 -416 -4988 3646 -159 1093 -6784 10550 -5909 -6540 18015 -18169 4769 13179 -22487 15793
277 15793 2067 -17281 18299 -5344 -10125 15675 -7818 -5838 13619 -9860 -1669 11550 -12269
290 -12269 3997 6214 -10890 7580 -27 -5468 5556 -1959 -1432 1902 420 -2851 2252 1446
304 1446 -5595 6587 -2554 -4418 9007 -7658 1020 6371 -9268 5393 2068 -7357 6509 -209
318 -209 -6128 6767 -1063 -6085 8445 -3668 -4719 9880 -7462 -731 8412 -9624 3235 5288
332 5288 -8821 4753 3089 -7834 5209 2298 -8079 7090 3 -7711 9683 -4199 -4312
345 -4312 9275 -7286 443 5415 -6104 2370 1783 -2940 645 2285 -2469 -798 4687 -5780
359 -5780 2165 4153 -8361 7130 -1118 -5768 9013 -6484 59 5823 -7362 3900 1680 -4886
373 -4886 3549 497 -3465 2728 1074 -4614 4551 -532 -4781 7217 -4542 -1596 6463 -6607
387 -6607 2369 2706 -4646 2603 897 -2333 256 3312 -4515 964 5395 -9302 6751 1419 -9691
402 -9691 11876 -6285 -3022 9692 -9649 3834 2738 -5285 3318 -249 -225 -2217 4173 -2137
416 -2137 -3544 8548 -8527 2755 5328 -10248 8683 -2226 -4323 6826 -4706 990 880
429 880 -249 -935 274 2437 -5239 5625 -2484 -2831 7394 -8381 5131 371 -5420 7993 -7333
444 -7333 3900 867 -5326 7611 -6587 3078 933 -3956 5390 -5334 4321 -2502 -713 5107
458 5107 -8789 9210 -4701 -3435 10429 -11685 6749 830 -6264 7163 -5072 3133 -2596
471 -2596 1847 1365 -7143 11842 -10507 1815 9547 -16120 13215 -2936 -7657 12059 -9105
484 -9105 2690 1900 -2364 951 -1236 4315 -7696 7002 -790 -7408 12105 -10350 3545 4020
498 4020 -8376 8694 -6942 4411 -933 -3877 9447 -13021 10605 -1643 -9443 16202 -14733
511 -14733 6143 4358 -11376 12683 -9522 4008 2022 -7252 10470 -10305 5932 1252 -7706
524 -7706 10018 -7648 3093 486 -2209 3381 -5620 8267 -8204 3175 5506 -13317 14930
537 14930 -8510 -2424 11439 -13820 9733 -2913 -2529 5349 -7105 8777 -8914 5250 2685
550 2685 -11810 16332 -12386 1637 9570 -14954 12391 -5083 -1715 5207 -6597 7759 -8469
563 -8469 6552 -441 -8258 14508 -13634 5539 5049 -12227 12749 -7804 1423 3116 -5635 7303
577 7303 -8141 6923 -2593 -4083 10108 -11887 8295 -1394 -5370 9364 -9711 7331 -3565
590 -3565 -1218 6725 -11292 12132 -7505 -1563 10820 -15136 12072 -3751 -5232 10659 -10996
603 -10996 7605 -3035 -1398 5574 -9049 10112 -7096 231 7304 -11304 9713 -4205 -1688
616 -1688 5306 -6287 5920 -5431 4149 -565 -5262 10662 -11834 6709 2569 -10697 13248
629 13248 -9486 2148 4951 -8894 8969 -6423 2677 1447 -5393 8101 -8299 5007 780
642 780 -6154 8336 -6958 3433 378 -3233 4772 -5576 5667 -4193 422 4943 -9426 10011
656 10011 -5454 -2033 8424 -10727 8480 -3066 -3124 7592 -9037 7315 -3040 -2341 6985
669 6985 -8966 7072 -1997 -3662 6867 -6466 3687 -480 -1817 2854 -3092 3087 -2893 1958
683 1958 109 -3074 5400 -5561 3149 607 -4095 6090 -5951 3503 359 -4331 6818 -6633
697 -6633 3755 811 -5346 7693 -6439 2232 2647 -5682 5977 -3906 766 1989 -3529 3741
711 3741 -2841 1423 122 -1716 3002 -3391 2515 -732 -1206 2711 -3473 3055 -1570 -616 2779 -4009
727 -4009 3690 -1888 -868 3435 -4620 3585 -878 -1985 3742 -3717 2017 205 -1919 2477 -1947
742 -1947 929 -99 -415 774 -1169 1451 -1327 687 365 -1452 2077 -1951 1059 325 -1680 2508
758 2508 -2469 1350 469 -2363 3360 -2807 775 1736 -3464 3324 -1546 -893 2642 -2906 1729 57
774 57 -1480 1891 -1425 491 343 -835 964 -739 210 304 -528 354 -44 -154 81 201 -463 383 120
793 120 -828 1177 -742 -299 1211 -1407 864 73 -905 1300 -1093 394 368 -885 1031 -903 453
810 453 241 -997 1289 -920 121 581 -984 1009 -721 138 512 -965 1032 -741 140 607 -1229
827 -1229 1291 -596 -447 1169 -1215 675 79 -688 976 -763 162 416 -653 544 -272 -85 439
844 439 -600 365 238 -730 687 -86 -675 1073 -819 -91 1147 -1634 1017 360 -1629 1821 -915
861 -915 -499 1495 -1632 861 289 -1206 1318 -716 -131 691 -822 653 -237 -292 762 -833 396
878 396 305 -891 1010 -551 -342 1219 -1426 699 597 -1616 1605 -626 -709 1576 -1481 510 687
895 687 -1306 954 -28 -673 585 22 -563 500 91 -845 1105 -675 -391 1353 -1574 852 292
912 292 -1210 1422 -1047 369 314 -845 1112 -1140 845 -182 -807 1743 -1939 1036 548 -1828
928 -1828 1998 -1063 -241 1025 -948 308 139 92 -809 1170 -488 -1097 2500 -2640 1164 1172 -3104
945 -3104 3539 -2209 -249 2540 -3523 2843 -1062 -874 2222 -2723 2314 -1187 -361 1788 -2615 2530
961 2530 -1538 -133 1861 -2847 2605 -1225 -520 1836 -2188 1641 -685 -92 356 -413 857 -1883
977 -1883 2662 -2027 -422 3477 -5177 4012 -425 -3632 5683 -4576 1179 2176 -3646 3062 -1641
992 -1641 698 -265 -439 1887 -3407 3647 -1911 -1297 4187 -4959 3052 198 -2739 3287 -2342 1234
1008 1234 -787 511 525 -2451 4225 -4211 1682 2462 -5869 6298 -3333 -1251 4806 -5733 4101
1023 4101 -1166 -1768 3658 -4054 2884 -785 -1248 2323 -2305 1584 -958 721 -589 -296 2204 -4131
1039 -4131 4299 -1738 -2464 5745 -6028 3263 792 -3955 5019 -4178 2429 -438 -1785 4271 -6131
1054 -6131 5528 -1560 -4350 8592 -8034 2647 4133 -7922 6373 -1181 -3477 4239 -1298
1067 -1298 -2027 2190 1001 -4421 4506 -608 -4486 7030 -5288 542 3959 -5793 4797 -2460
1081 -2460 120 1905 -3932 5437 -5082 1898 3167 -7217 7590 -3901 -1774 6070 -6753 4068
1095 4068 -95 -2829 3659 -2883 1500 -322 -504 994 -1088 906 -979 1485 -2065 1577 793
1110 793 -4320 6665 -5336 -120 6810 -10244 7545 48 -7512 9971 -6335 -295 5058 -5459
1124 -5459 2827 -340 -104 -641 204 2111 -4522 4313 -681 -3762 5572 -3200 -1148 3586 -2081 -1586
1140 -1586 3381 -938 -3980 6829 -4357 -2463 8798 -9664 4050 4243 -9781 9082 -3356
1153 -3356 -3177 6670 -6186 3254 -109 -2140 3303 -3577 2862 -936 -1508 3143 -3006 1230 742
1168 742 -1343 426 565 -203 -1376 2559 -2023 -141 2431 -3314 2525 -977 -455 1583 -2706 3813
1184 3813 -3686 1054 3640 -7557 7240 -1863 -5418 9510 -7282 312 6266 -7840 3724
1197 3724 2273 -5212 3088 1524 -4054 2072 2414 -5174 3489 1292 -5181 5138 -1557 -2507 3916
1212 3916 -2218 -303 939 556 -1756 517 2727 -5067 3846 759 -5527 6832 -3653 -1859 5855
1227 5855 -5764 2073 2126 -3985 2902 -407 -1480 1632 -494 -804 1296 -698 -790 2178 -2401 989
1243 989 1432 -3565 3867 -1776 -1811 4605 -4630 1679 2156 -4211 3306 -606 -1511 1729 -566 -252 -346
1260 -346 1724 -2025 119 2898 -4392 2613 1487 -4681 4228 -529 -3317 4079 -1238 -2661 3958
1275 3958 -1329 -3001 5127 -2838 -2321 6114 -5313 436 4661 -6240 3356 1443 -4524 3860 -668
1290 -668 -2149 2376 -404 -1579 1512 462 -2404 2381 -322 -2253 3353 -2185 -415 2536 -2781
1305 -2781 1292 669 -1628 1180 -73 -597 298 578 -1198 775 643 -2169 2526 -1174 -1338 3318
1321 3318 -3350 1139 1866 -3661 2963 -304 -2343 2911 -1123 -1398 2359 -898 -1694 2979 -1521 -1647
1337 -1647 3941 -3323 42 3442 -4426 2129 1535 -3671 2711 237 -2446 1974 557 -2564 2017
1352 2017 858 -3596 3647 -604 -3313 5013 -3044 -1131 4274 -4127 1052 2257 -3241 1487 1123
1367 1123 -2264 984 1371 -2611 1431 1232 -3237 2844 -335 -2421 3362 -1967 -531 2263 -2108
1382 -2108 437 1223 -1429 81 1552 -1857 285 2048 -3281 2196 674 -3454 4126 -2097 -1342
1397 -1342 3850 -3659 1102 1817 -2945 1688 570 -1811 1040 977 -2254 1363 1205 -3357 3045 -277
1413 -277 -2911 3990 -2201 -1056 3070 -2498 66 1908 -1628 -523 2396 -1915 -815 3567 -3792
1428 -3792 993 2868 -4877 3563 90 -3432 4161 -2099 -945 2586 -1860 -143 1407 -872 -907
1443 -907 2119 -1593 -555 2745 -3348 1722 1129 -3317 3386 -1478 -1009 2397 -2096 712 465 -586
1459 -586 -165 652 -56 -1598 2785 -2125 -524 3455 -4465 2515 1233 -4164 4200 -1413 -1974 3344
1475 3344 -1797 -994 2360 -960 -1873 3362 -1830 -1790 4642 -4344 870 3326 -5249 3649 -34 -2933
1491 -2933 3338 -1661 -205 682 15 -513 -294 1928 -2917 1908 768 -3403 4069 -2250 -858 3097
1507 3097 -3241 1570 416 -1487 1255 -368 -250 21 800 -1477 1093 513 -2521 3547 -2551 -310
1523 -310 3566 -5086 3588 160 -3837 4976 -2976 -460 2756 -2568 727 628 -312 -1131 1761 -306
1539 -306 -2485 4152 -2973 -661 4091 -4682 2051 1570 -3358 2206 276 -1581 400 1902 -2662
1554 -2662 469 3235 -5343 3594 1114 -5410 6081 -2794 -1900 4647 -4057 1254 1267 -1828 855
1569 855 90 103 -1124 1660 -866 -849 2252 -2476 1495 -46 -1324 2121 -2270 1649 -344 -1284 2440
1586 2440 -2536 1459 120 -1389 1792 -1586 1337 -1081 267 1353 -3131 3696 -1964 -1453 4407
1601 4407 -4684 1942 1953 -4178 3185 -52 -2359 1957 569 -2504 1647 1562 -4213 3704 -42 -4060
1617 -4060 5407 -2985 -1224 3994 -3565 992 1094 -1128 -142 643 647 -2656 3079 -950 -2481 4694
1633 4694 -3880 473 3052 -4249 2632 206 -1996 1816 -507 -364 114 691 -1062 474 798 -1868
1649 -1868 1969 -1068 -250 1496 -2283 2323 -1377 -465 2527 -3539 2549 6 -2443 3226 -2092
1664 -2092 51 1334 -1291 443 -108 725 -1469 1079 777 -2799 3076 -1062 -1775 3156 -2178 -231
1680 -231 1888 -1401 -578 1832 -851 -1713 3511 -2503 -946 4284 -4734 1869 2229 -4659 3870 -784
1696 -784 -2136 2935 -1665 -63 715 -134 -511 98 1087 -1893 1335 248 -1810 2088 -1029 -387 1062
1713 1062 -832 198 -15 421 -822 506 492 -1434 1668 -1034 -149 1250 -1776 1680 -989 -249
1729 -249 1623 -2408 2040 -490 -1466 2635 -2096 342 1325 -1722 846 423 -791 -42 1086 -1100
1745 -1100 -160 1780 -2365 1180 976 -2490 2241 -631 -1098 1659 -911 -150 334 329 -876 381 1021
1762 1021 -2201 1918 -106 -2044 2896 -1799 -420 2114 -2089 684 720 -1064 386 460 -552 -181
1778 -181 1024 -1157 386 792 -1574 1391 -442 -548 1106 -1188 906 -330 -336 883 -1165 961
1794 961 -428 -250 782 -1110 1017 -554 -129 723 -1206 1260 -726 -305 1242 -1525 906 185
1810 185 -977 967 -336 -304 462 43 -695 743 123 -1258 1665 -877 -628 1795 -1813 746 528
1827 528 -1291 1195 -539 -11 90 -35 327 -935 1279 -835 -370 1516 -1837 1064 259 -1364 1536
1844 1536 -815 -218 713 -560 78 119 108 -519 597 -204 -482 1057 -1155 604 313 -1066 1272 -930
1862 -930 276 453 -988 1139 -867 259 435 -882 967 -788 367 182 -702 984 -953 543
1878 543 113 -803 1107 -929 298 360 -654 562 -370 308 -336 208 207 -845 1267 -1075 158 983
1896 983 -1692 1492 -509 -654 1335 -1284 739 -82 -381 633 -757 759 -600 179 455 -1018
1912 -1018 1162 -731 -22 667 -916 756 -453 135 91 -358 670 -894 836 -372 -446 1180 -1451
1929 -1451 1039 -167 -792 1433 -1488 932 0 -957 1521 -1401 678 254 -996 1251 -979 409
1945 409 160 -561 739 -744 642 -356 -142 683 -982 900 -465 -93 578 -874 923 -711 283
1962 283 295 -936 1352 -1279 533 581 -1519 1719 -1132 36 958 -1475 1291 -652 -79 622 -881
1979 -881 910 -776 406 177 -760 1091 -998 529 113 -663 970 -1000 720 -228 -398 999 -1357
1996 -1357 1149 -358 -685 1434 -1507 877 21 -803 1169 -1121 681 -121 -446 836 -1020 870
2012 870 -408 -261 770 -1007 889 -564 49 510 -1023 1210 -939 238 611 -1283 1448 -1007
2028 -1007 92 827 -1362 1309 -730 -36 691 -1057 1031 -685 162 369 -798 988 -838 368
2044 368 210 -696 892 -790 533 -153 -343 879 -1218 1061 -381 -606 1388 -1551 964 75 -1014
2061 -1014 1377 -1140 482 168 -713 963 -909 527 -6 -477 760 -752 537 -199 -162 451 -649
2078 -649 695 -576 236 267 -782 1074 -988 432 378 -1152 1445 -1159 245 790 -1475 1408 -762
2095 -762 -159 906 -1226 1008 -458 -212 708 -854 657 -305 -62 329 -478 466 -409 270 -67 -260
2113 -260 573 -723 563 -183 -284 676 -867 761 -312 -347 896 -1083 813 -185 -524 1001 -1056
2130 -1056 681 -62 -554 903 -945 641 -74 -548 894 -828 426 29 -397 563 -593 476 -184
2147 -184 -151 443 -594 559 -289 -104 437 -539 436 -252 64 133 -348 546 -577 379 24 -494 874
2166 874 -877 411 315 -867 1003 -666 64 478 -750 778 -521 66 343 -687 779 -567 35
2183 35 500 -754 572 -144 -216 278 -159 90 -161 297 -329 105 332 -677 732 -345 -214 654 -783
2202 -783 582 -199 -202 587 -779 678 -270 -296 773 -939 626 21 -621 836 -609 67 345 -407
2220 -407 251 -78 -18 -63 151 -84 -145 380 -467 315 -13 -333 545 -585 428 -63 -467 874 -887 425
2240 425 317 -913 1035 -587 -106 643 -771 525 -110 -135 226 -295 366 -360 153 144 -400 432 -242
2259 -242 -19 136 -101 -2 -16 250 -490 416 40 -660 954 -689 -27 741 -1016 722 -66 -498 675
2278 675 -459 146 13 -44 108 -283 476 -459 150 305 -620 628 -299 -135 427 -438 288 -134 56 51
2298 51 -207 369 -424 265 6 -309 465 -490 290 -7 -300 481 -522 338 -7 -344 520 -463 201 67
2318 67 -190 212 -264 336 -355 183 192 -627 810 -554 -80 699 -949 617 8 -515 586 -326 15
2337 15 81 67 -147 -24 403 -683 544 23 -703 947 -625 -70 575 -652 323 4 -119 -13 80 95
2357 95 -444 668 -494 -117 770 -981 628 53 -646 822 -555 122 208 -337 294 -218 227 -274 160
2376 160 147 -514 703 -564 111 439 -826 815 -410 -210 662 -726 441 -61 -224 300 -233 167
2394 167 -240 324 -289 -119 634 -979 710 11 -811 1122 -802 65 595 -767 463 -48 -69 -102 196
2413 196 83 -627 969 -676 -154 1034 -1318 808 180 -965 1034 -479 -182 398 -186 -123 67 301
2431 301 -675 638 -95 -706 1204 -1030 229 685 -1197 1034 -412 -261 659 -741 524 -236 -21
2448 -21 178 -360 520 -602 450 -37 -527 911 -881 416 303 -864 949 -492 -138 490 -384 65
2466 65 40 237 -595 580 33 -986 1515 -1124 -141 1433 -1872 1122 225 -1258 1313 -642 -155
2483 -155 452 -253 -40 -47 472 -820 571 223 -1065 1284 -727 -246 943 -1000 498 48 -292 186
2501 186 -58 174 -545 742 -481 -280 1063 -1352 883 71 -1022 1442 -1158 307 630 -1202 1088
2518 1088 -486 -262 644 -570 184 55 40 -387 461 -12 -807 1335 -1022 -114 1275 -1650 978 210
2536 210 -1050 1053 -433 -132 150 204 -322 -199 1023 -1419 767 646 -1825 1853 -652 -928 1754
2553 1754 -1340 108 840 -860 119 527 -392 -383 1054 -889 -103 1179 -1578 964 187 -1165 1364
2570 1364 -902 121 449 -734 748 -620 325 84 -501 752 -699 462 -76 -336 738 -912
2586 -912 740 -168 -612 1155 -1069 364 541 -963 639 72 -467 154 503 -781 171 953 -1705
2603 -1705 1253 277 -1875 2265 -1130 -767 1981 -1726 372 841 -1060 315 393 -349 -426 1038 -751
2620 -751 -451 1558 -1610 439 1023 -1652 1084 90 -854 720 -12 -414 155 529 -914 499 541 -1372
2638 -1372 1338 -448 -722 1410 -1311 565 318 -958 1068 -726 116 440 -716 571 -230 -138 193
2655 193 -1 -181 11 503 -919 709 170 -1168 1485 -809 -436 1304 -1231 317 561 -682 92
2672 92 432 -213 -632 1252 -800 -597 1871 -1882 467 1351 -2193 1416 302 -1549 1391 -148 -957
2689 -957 954 73 -1095 1071 26 -1300 1621 -723 -723 1616 -1356 291 740 -1012 613 -54 -160
2706 -160 12 107 83 -489 715 -533 -59 657 -947 736 -180 -423 773 -783 454 63 -532 686
2724 686 -433 -65 381 -241 -179 403 -98 -595 1038 -719 -375 1431 -1623 625 865 -1796 1387 -51
2742 -51 -1123 1240 -392 -578 727 -45 -766 800 79 -1152 1411 -494 -903 1669 -1160 -177 1184
2759 1184 -1139 214 656 -727 -22 768 -783 -110 1103 -1355 487 789 -1580 1263 -179 -909
2775 -909 1260 -822 26 552 -606 262 36 -126 -62 186 -149 -132 402 -552 397 16 -546 818 -624
2794 -624 57 549 -785 522 11 -398 383 -5 -263 117 403 -739 460 404 -1215 1237 -321 -925
2812 -925 1559 -1127 -83 1118 -1223 366 570 -831 192 590 -779 87 855 -1221 559 629 -1427
2829 -1427 1197 -129 -950 1204 -572 -318 702 -364 -246 459 -93 -536 816 -424 -429 1095 -1049
2846 -1049 276 646 -1110 844 -135 -514 692 -415 -10 230 -150 -130 221 -60 -346 609 -517 -5
2864 -5 604 -948 710 -28 -725 989 -651 -75 604 -609 169 244 -261 -135 502 -367 -283 909 -998
2883 -998 282 766 -1364 996 29 -967 1108 -483 -356 690 -335 -293 520 -125 -563 893 -459
2900 -459 -464 1115 -1043 207 704 -1086 688 44 -574 491 -89 -248 112 279 -523 280 340 -880 869
2919 869 -281 -536 1042 -935 263 471 -863 697 -190 -291 438 -285 -20 136 9 -267 350 -99
2937 -99 -393 749 -652 72 602 -931 648 -21 -549 643 -309 -93 196 8 -267 138 345 -801
2955 -801 736 -53 -849 1250 -847 -153 1004 -1172 510 365 -793 516 104 -453 229 316 -622 368
2973 368 303 -872 863 -258 -544 957 -753 165 371 -565 435 -225 44 25 -98 217 -405 447 -289
2992 -289 -109 540 -724 497 -56 -461 710 -573 118 319 -518 321 27 -239 98 201 -405 187 336
3011 336 -820 807 -168 -722 1266 -962 45 867 -1132 688 83 -583 547 -196 -80 0 236 -270
3029 -270 -101 589 -786 377 320 -834 733 -173 -402 545 -245 -171 272 33 -437 468 -24 -604 892
3048 892 -608 -110 767 -971 635 -5 -554 748 -583 209 169 -394 454 -353 130 82 -198 201 -180
3067 -180 179 -225 142 70 -393 546 -435 2 409 -602 401 -49 -249 199 -74 30 -240 442 -345 -147
3087 -147 748 -949 513 332 -993 982 -340 -456 781 -489 -56 358 -158 -235 351 -47 -489 726
3105 726 -444 -218 750 -797 326 233 -517 424 -192 32 -38 23 126 -375 492 -348 -59 454 -644 431
3125 431 -72 -296 422 -400 221 -88 -105 251 -343 289 -124 -75 190 -206 177 -186 200 -123 -124 466 -648
3146 -648 431 110 -671 813 -463 -139 551 -561 218 106 -166 -10 127 42 -375 535 -273 -250 667
3165 667 -658 213 287 -525 351 -50 -119 10 129 -82 -221 523 -523 107 436 -768 625 -118 -390
3184 -390 603 -447 137 120 -187 180 -157 207 -203 67 151 -336 339 -191 -15 148 -225 245 -232 166
3204 166 -9 -245 412 -436 195 128 -393 411 -252 58 71 -177 258 -356 298 -82 -271 516 -513 209
3224 209 213 -463 400 -148 -93 152 -55 6 -106 248 -289 125 206 -483 475 -185 -189 416 -390 162 24 -103
3246 -103 97 -152 223 -297 155 83 -385 501 -341 -11 341 -442 308 -85 -90 182 -202 210 -176 75 50
3267 50 -207 293 -251 98 91 -233 263 -200 117 -6 -128 258 -300 204 -40 -160 293 -312 202 -19 -159
3288 -159 257 -281 200 -84 -97 257 -349 276 -75 -166 312 -311 163 10 -142 187 -147 135 -94 50 77
3309 77 -205 281 -218 57 152 -270 274 -177 37 111 -205 237 -230 125 52 -243 344 -311 98 147 -322 335
3331 335 -219 11 180 -249 192 -114 1 30 -94 149 -179 146 -58 -101 215 -247 178 -22 -102 189 -213
3352 -213 181 -116 -19 158 -290 291 -161 -59 241 -339 267 -103 -118 249 -283 191 -66 -91 176 -217 194
3373 194 -105 -32 118 -190 211 -146 31 94 -195 202 -151 45 48 -164 201 -186 85 23 -155 237 -246 138
3395 138 23 -160 259 -241 163 3 -184 308 -291 130 70 -206 246 -201 67 23 -111 145 -170 147 -98
3416 -98 -45 183 -264 212 -76 -81 175 -219 172 -106 -27 115 -190 218 -185 55 119 -277 298 -193 -8 195
3438 195 -299 267 -101 -77 187 -193 136 -72 13 46 -118 172 -168 114 16 -147 221 -231 124 3 -156
3459 -156 231 -253 154 -27 -179 258 -294 161 -11 -169 266 -270 167 8 -173 258 -224 119 34 -141
3479 -141 180 -159 93 -22 -24 78 -134 182 -163 53 100 -219 286 -220 35 156 -305 302 -162 -22 183
3500 183 -267 237 -126 -15 142 -230 217 -142 5 93 -207 209 -153 22 68 -134 165 -160 103 -25 -81
3521 -81 184 -246 209 -77 -111 271 -316 205 -9 -176 288 -278 155 11 -185 248 -219 101 -2 -120 163
3542 163 -169 112 -30 -41 87 -135 165 -151 46 63 -180 234 -224 81 99 -270 295 -216 37 131 -274
3563 -274 295 -196 9 175 -270 267 -128 -24 164 -209 177 -76 -11 54 -86 110 -155 111 -49 -59 149
3584 149 -217 180 -100 -59 193 -269 242 -122 -81 240 -342 259 -65 -164 309 -290 153 22 -176 211 -152
3605 -152 56 10 -27 60 -95 163 -143 64 71 -176 213 -144 38 89 -142 190 -163 123 13 -166 292 -293
3627 -293 122 108 -271 312 -202 -1 159 -225 189 -98 -8 72 -111 117 -94 68 -20 -24 92 -140 169 -125
3649 -125 24 136 -238 261 -147 -42 230 -301 237 -45 -125 227 -190 105 -35 -31 99 -161 205 -146 12
3670 12 190 -273 194 -10 -156 170 -72 -25 6 66 -129 37 150 -282 273 -61 -214 373 -289 65 178
3691 178 -269 216 -82 -20 67 -75 98 -122 112 -57 -66 183 -218 128 11 -141 159 -122 66 -8 -33 86
3713 86 -108 120 -85 3 82 -135 160 -114 45 61 -182 249 -207 22 201 -320 250 -32 -194 251 -139
3734 -139 -20 124 -44 -65 86 31 -206 250 -72 -170 332 -260 28 199 -257 142 33 -98 23 66 -56
3755 -56 -117 234 -231 -3 261 -387 245 59 -314 341 -160 -88 209 -163 2 56 -30 -60 79 -19 -114 167 -148
3778 -148 30 109 -187 178 -93 -29 123 -180 143 -53 -47 127 -130 77 -30 13 0 -65 144 -191 128 34 -238
3801 -238 310 -184 -72 285 -285 85 135 -203 58 117 -160 5 218 -282 123 212 -411 339 1 -328 431
3822 431 -203 -113 276 -198 -10 124 -50 -91 169 -35 -168 305 -206 -65 301 -329 142 115 -251 185 -25
3843 -25 -104 79 1 -89 55 71 -192 170 -39 -160 270 -232 78 145 -296 263 -103 -102 237 -213 76 59 -100
3866 -100 60 13 -40 -44 158 -150 -5 217 -340 188 89 -323 334 -117 -187 283 -153 -92 216 -92 -155 271 -136
3889 -136 -191 405 -330 -24 356 -462 232 134 -362 291 -50 -158 174 -1 -112 75 116 -241 210 44 -285
3910 -285 379 -188 -116 333 -302 102 134 -221 133 20 -116 49 60 -150 89 80 -237 251 -112 -140 310 -304
3932 -304 129 137 -310 292 -109 -143 214 -146 -18 76 -7 -108 145 -11 -213 323 -204 -110 370 -367 113 223
3954 223 -339 194 88 -222 136 120 -257 145 157 -406 345 12 -399 508 -281 -157 436 -402 115 190 -280
3975 -280 140 61 -132 26 142 -168 15 204 -297 190 56 -276 284 -138 -82 203 -164 29 81 -65 -50
3996 -50 116 -80 -66 233 -278 135 144 -387 406 -142 -212 448 -373 89 236 -373 213 46 -234 156 61 -209
4018 -209 121 109 -311 257 10 -304 384 -181 -129 313 -236 -23 183 -120 -87 207 -89 -169 380 -293 -51
4039 -51 422 -526 263 196 -506 463 -111 -246 385 -221 -58 225 -154 -41 187 -147 -34 219 -253 91 124
4060 124 -281 239 -93 -101 207 -185 75 29 -57 27 -23 66 -133 153 -49 -161 323 -312 75 249 -436 338
4082 338 -5 -325 401 -176 -172 327 -193 -134 335 -243 -95 389 -405 69 318 -507 318 71 -401 381 -137
4103 -137 -148 205 -102 -63 68 68 -217 153 74 -318 332 -118 -199 369 -299 19 236 -276 121 101 -200 91
4125 91 89 -209 148 60 -250 279 -141 -138 327 -342 118 161 -350 293 -81 -172 249 -168 -24 118 -89 -53 126
4148 126 -50 -150 254 -185 -84 321 -336 112 182 -353 228 50 -250 183 48 -241 163 108 -332 302 15
4169 15 -352 440 -212 -172 424 -351 34 249 -290 76 127 -188 35 153 -215 52 174 -307 188 48 -295
4190 -295 309 -141 -94 234 -204 66 78 -118 72 2 -51 11 57 -106 41 66 -171 171 -73 -107 228 -204 51
4213 51 149 -217 122 65 -140 78 84 -164 68 145 -293 210 76 -349 384 -123 -246 421 -298 -64 304 -311
4235 -311 61 196 -249 51 196 -256 70 172 -317 179 102 -269 245 -54 -150 182 -96 -59 103 -16 -96
4256 -96 105 8 -182 198 -86 -118 251 -222 50 138 -257 187 -32 -129 181 -130 -4 112 -130 11 71 -136
4278 -136 28 93 -202 124 34 -230 246 -107 -130 259 -206 9 163 -184 40 117 -112 -31 152 -138 -36 228
4300 228 -255 73 180 -341 216 53 -272 258 -73 -175 206 -60 -124 186 -56 -146 224 -130 -102 257 -232
4321 -232 21 168 -244 128 47 -149 97 -15 -74 29 34 -88 59 35 -140 152 -57 -50 163 -171 79 50 -162
4344 -162 159 -80 -50 114 -104 5 49 -50 -25 62 -68 -53 131 -177 31 136 -227 145 28 -179 167 -54
4366 -54 -94 109 -18 -98 120 9 -171 202 -58 -180 287 -213 -14 226 -269 120 93 -182 115 25 -106 55
4388 55 55 -111 58 70 -162 122 -13 -130 165 -116 -13 79 -107 41 -12 -11 -26 -1 10 -73 80 -70 0 84 -141
4413 -141 128 -51 -71 153 -143 67 46 -138 110 -31 -62 64 -3 -69 63 20 -128 139 -57 -123 203 -170
4435 -170 17 146 -195 111 23 -95 57 -13 -40 -37 87 -89 -32 142 -200 96 50 -200 185 -71 -84 136 -87
4458 -87 -17 60 -30 -44 80 -29 -70 135 -120 12 95 -155 128 -52 -51 106 -140 78 -31 -60 80 -97 61
4481 61 -22 -27 48 -73 73 -70 11 43 -100 103 -63 -52 95 -100 15 29 -49 -16 48 -23 -67 134 -128 14 143
4506 143 -209 154 -1 -142 209 -122 14 83 -106 49 -19 22 -31 -7 56 -100 86 -33 -65 94 -88 14
4528 14 34 -43 14 6 -1 -60 59 -46 -46 104 -137 73 16 -104 135 -121 33 57 -136 136 -96 -2 92 -123 98
4553 98 -16 -35 75 -36 13 -11 20 -23 -3 54 -88 68 -22 -56 70 -68 21 -13 2 -7 -53 93 -120 39 63 -157
4579 -157 162 -81 -58 150 -149 59 47 -87 68 -39 -2 -12 14 -11 -34 57 -67 28 21 -63 57 -32 30 -7 -27
4604 -27 57 -90 75 -30 -44 106 -116 63 18 -86 94 -86 15 29 -65 69 -67 23 4 -57 61 -44 5
4627 5 3 -9 -4 -24 38 -53 50 5 -64 110 -81 15 59 -101 90 -41 -19 60 -64 51 -37 3 31 -72 81 -64
4653 -64 -14 59 -66 31 6 -37 3 10 -19 -27 39 -61 6 46 -105 62 -24 -51 75 -68 39 10 -48 49 -58 48 -7
4680 -7 -26 57 -65 44 3 -57 53 -42 6 5 -24 12 -5 7 -22 11 -5 -38 46 -48 2 3 -45 45 -49 6 17 -70 57 -40
4710 -40 -15 28 -58 51 -15 -18 26 -30 16 -18 3 8 -20 28 -33 4 14 -34 26 -17 -2 3 -11 -6 -10 18 -30 6 13 -63 45 -27
4742 -27 -34 58 -66 25 18 -59 33 -25 -6 12 -16 12 -21 11 -15 -10 28 -41 27 -3 -35 30 -27 2 13 -24 13 14 -1 -7 19 -20
4774 -20 -15 43 -48 9 28 -60 46 -34 -27 31 -60 10 -23 -23 20 -43 10 -13 -17 17 -20 30 -12 1 30 -33 30 -8 -22 19 -15 13
4806 13 0 3 -5 -8 12 -23 23 -16 2 35 -47 31 -12 -37 53 -60 17 20 -52 48 -34 -24 17 -32 11 -17 3 -8 -7 11 -53 26
4838 26 1 -49 40 -26 -16 19 -1 -12 13 16 -33 34 5 -43 65 -55 -4 55 -83 50 -15 -35 42 -40 16 -9 -7 8 -34
4867 -34 19 -18 -10 13 -34 24 -22 -13 -3 -12 9 -26 4 -38 -9 16 -60 25 -2 -35 31 -46 30 -10 -20 54 -65 35 0 -46 64
4898 64 -44 2 30 -45 16 6 -20 -10 0 -10 -18 30 -50 14 14 -55 48 -39 -5 19 -40 40 -36 21 5 -48 44 -50 8 29
4928 29 -64 60 -20 -32 38 -38 6 13 2 -8 2 8 -35 32 -16 -4 28 -33 27 -21 -2 0 -40 34 -48 -4 26 -68 54 -30 -42
4959 -42 34 -52 9 10 -26 11 -5 2 -17 15 -4 -21 21 -26 7 5 -18 19 -13 9 -12 -8 28 -58 55 -30 -11 64 -54 31 4
4990 4 -30 35 -34 11 -11 -9 20 -41 26 -17 -24 16 -33 -12 -14 -9 -27 -8 20 -45 42 0 -47 76 -51 9 43 -50 36 -2 -11 12
5022 12 -7 -3 -18 28 -33 -10 36 -54 23 5 -44 27 -17 -5 4 15 -20 -7 33 -52 25 8 -61 68 -49 -11 46 -55 34 -17
5052 -17 -13 28 -36 13 -6 -19 19 -12 13 -4 9 -10 8 22 -32 40 -6 -14 38 -48 14 -8 -15 19 -31 10 -32 17 8 -70 73 -47
5084 -47 -17 55 -94 47 8 -72 62 -29 -30 40 -22 -25 28 -13 -45 38 -26 -28 56 -36 12 28 -30 33 -2 -6 -8 11 0 -34 54
5115 54 -29 -2 48 -70 60 -8 -56 60 -52 -5 33 -63 20 0 -31 30 -11 -24 8 -7 -40 37 -17 -26 62 -63 11 27
5143 27 -60 43 -15 -22 33 -16 -8 -7 18 -28 5 44 -59 53 6 -66 79 -41 -31 79 -85 12 45 -70 14 28 -66 19
5171 19 22 -82 37 -8 -73 65 -30 -32 52 -59 -1 24 -43 14 1 12 -5 14 -5 -30 51 -47 6 37 -64 44 -5 -55
5199 -55 64 -41 -22 43 -48 -2 34 -60 28 24 -64 36 8 -71 64 -20 -60 60 -59 -18 56 -70 5 21 -54 9 24
5226 24 -33 -2 37 -57 10 39 -68 30 33 -81 67 4 -60 84 -31 -40 78 -55 -19 68 -67 -10 61 -71 15 48 -83
5253 -83 48 7 -67 62 -19 -40 54 -36 -25 29 -43 -10 22 -34 -10 33 -46 -5 37 -61 33 17 -69 67 -20 -38 70 -44
5281 -44 -14 75 -51 -3 46 -64 15 39 -86 23 35 -99 77 -13 -82 95 -50 -33 87 -63 -12 55 -46 -11 59
5306 59 -57 -25 71 -85 6 47 -114 57 27 -87 71 -8 -53 58 -18 -39 56 -17 -44 65 -36 -24 75 -74 21
5331 21 29 -83 52 -2 -51 65 -28 -24 34 -39 -24 38 -36 -20 46 -64 7 56 -83 39 21 -87 68 -20 -49 62 -30
5358 -30 -39 58 -30 -43 62 -42 -35 86 -100 -6 87 -114 58 34 -107 68 5 -70 63 -1 -67 50 -13 -69 81 -48
5384 -48 -51 81 -74 -14 65 -86 17 21 -72 26 11 -40 22 6 -52 28 2 -57 64 -33 -31 75 -83 15 47 -75 41
5411 41 9 -63 29 4 -48 54 5 -65 68 -19 -46 92 -78 0 93 -110 38 47 -78 43 12 -69 34 19 -83 54
5437 54 17 -112 76 -19 -78 101 -58 -27 79 -66 11 58 -70 -1 54 -63 -6 60 -92 45 15 -99 84 -23
5461 -23 -62 73 -59 -10 52 -72 -1 21 -45 -15 20 -51 6 30 -71 55 -12 -56 73 -49 -31 55 -58 8 24 -48
5487 -48 -4 39 -67 2 63 -89 46 45 -119 96 -9 -91 98 -48 -41 93 -67 -27 66 -59 -24 80 -82 -6 66
5512 66 -108 38 27 -86 65 -2 -53 47 -18 -27 38 -4 -43 47 -7 -57 70 -39 -43 68 -86 12 31 -80 45 -14
5538 -14 -44 48 -21 -29 43 -37 -34 53 -52 -11 72 -99 29 25 -113 68 -20 -74 73 -34 -26 39 -36 -42 48 -35 -47 70 -44
5567 -44 -22 83 -89 14 68 -90 31 23 -81 32 17 -61 40 21 -72 66 2 -75 87 -51 -36 90 -89 4
5591 4 38 -77 21 4 -40 12 5 -42 2 11 -57 26 -20 -51 52 -50 -13 34 -50 22 5 -38 34 11 -33 26 1 -44 53 2
5621 2 -55 81 -44 -32 80 -80 2 53 -86 29 33 -72 33 17 -60 29 9 -64 41 -4 -69 66 -32 -54 76 -60
5647 -60 -22 52 -53 -14 31 -35 -7 55 -41 1 46 -67 28 26 -65 57 -13 -37 59 -26 -11 26 -41 6 14 -43 -4 7 -47 4
5677 4 3 -50 28 -20 -28 36 -40 -27 25 -41 -14 12 -42 -2 18 -45 0 20 -51 13 20 -70 46 -1 -48 73 -35 -42 56 -40 -11
5708 -11 48 -38 -8 42 -45 5 41 -54 10 25 -66 36 1 -43 31 -18 -48 22 -31 -21 22 -24 -31 22 -23 -23 29 -35 12 28 -32
5739 -32 18 8 -43 26 -23 -23 22 -11 -14 16 -24 -8 17 -16 -3 13 -31 14 18 -40 35 -14 -33 45 -41 -12 40 -35 -13 4 -40 -24
5771 -24 16 -29 -16 25 -47 -2 7 -55 28 2 -37 33 -10 -17 31 -12 -19 15 -5 -22 23 -23 -15 42 -37 -2 26 -43 12 7 -28 15 -22
5804 -22 -25 1 -7 -18 6 -4 -17 20 -18 -11 20 -37 7 1 -44 18 -17 -18 4 -16 -2 -8 -3 -19 4 5 -24 25 -18 8 35 -32 16 3
5838 3 -32 23 -23 -24 5 -4 -13 -2 -4 -35 21 -9 -34 27 -46 4 19 -48 24 0 -24 10 -6 -9 -5 -2 -14 -10 0 -35 17 -6 -34 23 -22
5873 -22 -4 2 -22 2 -10 -10 14 9 6 -2 20 -27 2 27 -38 26 -12 -14 13 -33 3 0 -21 12 -21 -7 -5 -1 -7 -15 17 -16 17 4 -21 18
5909 18 -21 15 9 -28 9 2 -9 -13 0 1 -17 3 -10 -8 14 -19 23 -2 -24 25 -10 -2 3 -4 3 1 0 -11 0 -13 -15 12 -24 -3 4 -26 12
5946 12 -15 -10 15 -20 1 0 1 1 2 24 -19 21 -12 -6 18 -28 3 -1 -13 1 -22 1 -16 -4 -2 -17 18 -17 -4 1 -25 11 -11 -16 5
5981 5 -27 5 -10 -11 8 -19 -5 -11 -14 -11 -14 14 -27 9 6 -15 14 -11 6 9 -5 16 -5 17 -14 -2 12 -17 19 -3 -2 10 -26 16 -8
6016 -8 -16 -1 -18 7 -13 0 -6 -18 9 -22 14 2 -25 23 -23 1 2 -30 11 -8 5 4 -19 16 -14 12 12 -2 8 -10 17 4 -8
6049 -8 19 -10 5 -5 -6 5 1 5 -10 15 1 -17 29 -22 -4 18 -32 15 -24 -15 15 -20 3 -2 -19 12 5 -4 -16 10 -17 -6 16 -25
6083 -25 19 -1 -8 7 -11 5 1 -11 25 -11 13 -3 4 12 -3 20 6 -10 22 -10 2 -3 -11 10 -16 -4 -2 -11 2 -14 -15 -10 5 -4 -13 23
6119 23 -27 5 10 -20 19 -3 -9 20 -3 12 -2 0 1 -15 19 -2 2 9 -12 17 -17 5 15 -4 16 1 3 0 -1 -4 -5 16 -14 -2 -10 -32
6155 -32 4 -9 -18 13 -21 0 -6 -20 4 -10 7 -2 -10 -4 -2 5 -2 9 1 -12 10 -3 -5 10 -14 -2 -7 -22 -8 -10 -4 -7 -5 -16 -3 -8 -17 8 -9
6194 -9 -13 17 -15 -8 15 -23 -11 -10 -20 3 -6 2 -8 -5 -17 -6 -5 -12 -9 3 -9 14 -4 4 14 -11 -4 14 6 -4 1 -18 1 3 -22 5 5 -21
6232 -21 1 -14 -15 6 -19 -4 -10 -20 13 -14 -3 6 -20 6 -11 -1 8 -9 4 -4 0 4 -14 5 1 -8 3 -4 -6 6 -8 2 -2 -9 -7 17 -11
6269 -11 8 11 -16 14 -7 -17 15 -16 0 -6 -29 5 -26 -13 -1 -13 11 -13 -14 5 0 5 -8 -5 8 -7 7 -6 -5 -4 -3 -3 -2 12 -9 4
6305 4 11 -1 10 -29 0 1 -18 12 -6 4 11 -25 4 -11 -8 9 -9 -3 -16 -14 -15 -10 -6 -17 -5 -7 -21 -1 -20 -3 -13 -7 5 -10 12 -4
6341 -4 -2 5 -14 7 1 -10 8 -11 3 -8 -1 -3 -8 7 -8 -9 9 -22 4 -20 -7 -10 -13 7 -15 -7 -6 -12 2 -26 2 -4 -16 9 -10 -5 6 -15
6379 -15 -3 -7 -4 6 -9 0 -7 -2 -4 15 9 -8 18 -6 -1 10 -30 3 -2 -10 5 -16 1 -5 -4 3 -19 2 -14 2 0 -22 9 -18 -1 -1 -23 7
6417 7 -10 -11 -7 -15 -7 -5 2 -8 3 2 -28 6 -4 -19 20 -21 6 18 -11 6 6 -3 5 11 -7 3 1 -18 0 1 -19 7 -23 -28 14 -19 -9 -11
6455 -11 1 0 5 -5 -5 5 -10 -2 5 -24 9 -12 -20 6 -25 -2 -1 -24 -1 -8 -10 -8 7 -6 -12 15 -20 -1 7 -29 12 -16 -21 26 -38 -13 -1
6492 -1 -17 -10 1 -18 -22 5 -28 -20 4 -35 4 7 -27 18 8 -11 9 -8 3 5 3 -20 5 3 -18 15 -21 -16 17 -34 5 4 -24 16 -9
6527 -9 -1 5 -3 -14 4 -5 -12 2 -7 -23 10 -35 -2 -6 -36 14 -18 -22 1 -21 0 6 -11 -1 19 -14 -16 26 -12 -9 25 -28 -1 16 -28 16
6563 16 0 -30 4 -14 -21 2 -8 -31 4 0 -39 21 -21 -22 12 -29 -9 18 -28 3 -5 -29 -9 0 -26 -7 8 -32 2 -9 -34 22 -18
6596 -18 -15 19 -34 9 9 -20 16 -1 0 14 -1 -17 14 -9 -18 7 -25 -21 14 -31 -8 1 -40 10 -15 -31 12 3 -29 9 -3 -55 17 0
6630 0 -39 33 -17 -27 29 -26 -18 23 -35 6 14 -30 10 7 -28 7 7 -26 25 -10 -29 22 -4 -13 24 -18 -6 14 -28 -3 0 -22 -11 3
6664 3 -25 4 6 -37 9 -8 -29 24 -11 -19 20 -26 1 17 -21 5 3 -11 8 0 -28 14 5 -29 17 -9 -29 37 -16 -14 30 -17 -7 17
6698 17 -28 -1 24 -34 1 9 -40 0 11 -43 17 1 -36 25 -8 -22 27 -41 -13 16 -28 -3 9 -28 -2 20 -19 9 14 -27 32
6729 32 4 -33 22 -8 -15 18 -26 -8 10 -23 -5 3 -27 -6 18 -30 -4 -2 -41 12 -13 -39 21 -32 -24 9 -36 -24 8 -36 -9 0 -41
6762 -41 -12 21 -35 15 9 -46 27 -5 -36 30 -10 -27 32 -21 -9 26 -16 -25 8 -38 -11 8 -42 -1 -5 -51 5 -8 -44 9 -25 -25
6794 -25 4 -19 -16 16 -24 -18 15 -33 -10 12 -34 6 0 -39 18 -12 -18 18 -10 -20 7 -9 -16 22 -21 -11 19 -27 -2 13 -40 4 -1
6827 -1 -32 21 -22 -27 14 -18 -34 13 -26 -17 9 -28 -21 19 -38 -12 16 -45 -2 2 -36 9 3 -38 6 -1 -37 23 -13 -28 18 -23 -18 38
6861 38 -40 -6 25 -29 -4 8 -28 13 -5 -35 14 -1 -21 19 -20 -27 17 -37 -19 1 -37 -9 -2 -31 -12 0 -19 10 1 -22 5 2
6893 2 -26 14 -17 -27 25 -19 -8 16 -31 4 21 -31 5 17 -39 23 0 -30 27 -12 -19 25 -18 -28 30 -34 -12 8 -41 -4 12
6924 12 -24 -2 4 -31 -2 -10 -41 13 0 -33 15 -18 -20 22 -5 -8 22 -15 -3 25 -25 -6 15 -32 6 -7 -27 8 -19 -24 5 -22 -14
6957 -14 6 -26 3 15 -19 -21 -5 -27 -3 5 -33 13 1 -29 20 -4 -22 8 -8 -21 6 -27 -21 17 -23 -17 28 -23 7 22 -44 28
6989 28 5 -25 12 -8 -22 14 -13 -15 13 -13 -28 16 -27 -22 18 -29 -6 -14 -30 5 -9 -12 -8 -10 -26 5 -1 -14 7 -11 -24 7 -21 -23
7023 -23 19 -31 4 -4 -29 17 -2 -19 9 -12 -20 12 -10 -13 8 -20 -19 16 -12 -8 8 -33 5 -11 -14 -2 -10 -18 -3 1 -25 4 4 -19 21
7058 21 -3 -27 20 -18 -30 23 -27 -6 11 -24 -1 -2 -12 -8 2 -22 7 -11 -27 4 -14 -18 6 -24 -3 -5 -3 4 -10 -10 1 -5 -17 -5
7092 -5 -6 -21 0 -8 -26 12 -27 -30 7 -29 -3 0 -22 -1 4 -12 4 14 -19 12 6 -19 5 3 -21 16 -16 -11 15 -18 -5 5 -19 -15 -5
7127 -5 -18 -8 2 -13 -13 1 -25 3 -13 -11 -5 -8 -7 6 -13 -15 2 -7 -11 -6 -4 -8 11 -14 2 16 -13 -6 15 1 9 -6 -7 12 -7 -3 4 -8 -19
7166 -19 -1 -17 -9 -4 -22 -8 -6 -25 -16 -11 -21 4 -6 0 0 -19 -4 0 -15 -4 1 -1 -9 3 -14 2 -10 -20 0 -1 -17 7 -3 -11 12 0 -15
7203 -15 4 -3 -24 5 -4 -20 6 -5 -5 -7 -15 -5 -14 -9 3 -13 -8 -16 -9 0 -16 -9 -15 9 -13 -4 2 -18 4 3 -6 3 -1 -8 -3 -13 -12 -5 -11 -3 8 0 6 2
7247 2 -22 0 7 -19 7 -5 -18 -6 -8 -5 -3 -6 -10 -9 -13 -19 -10 -15 -27 -11 -11 -23 1 -14 -8 -1 -14 -1 1 -9 2 0 -6 2 1 -3 -10 7 -2 -2 2 -6 -12 -7
7291 -7 -7 -4 -1 3 -12 0 -12 -14 -10 -14 2 -14 -12 -11 -15 -4 -16 -16 -2 -16 -12 -10 -13 2 -15 -11 -7 -9 -6 5 3 -16 3 -1 2 3 -8 -6 5 -14 -2 -10 -6
7334 -6 -16 -6 -3 -8 0 -7 -13 8 -13 -7 -14 -22 -4 -4 -12 -1 -2 -15 2 -11 -18 -7 -3 -9 -5 -10 -11 -3 -16 -10 -11 -10 -3 -15 -5 -10 1 -6 -2 -6 -1 -8 0 -2 -4 -17
7380 -17 -7 -10 -5 -2 -4 -8 -5 -22 -15 -19 -9 -16 -10 3 -15 1 -18 -12 -6 -9 2 0 -4 -8 -9 -12 -15 -10 -16 -8 -7 -19 6 -10 -13 -8 -7 -3 7 5 -9 1 -14 -12 -2
7425 -2 1 -5 -8 -21 -23 -5 -14 -15 -15 -16 -12 0 -16 -8 -10 -16 -1 -1 -16 4 -14 -1 0 -12 7 -2 -10 0 -8 -5 -8 -7 3 -3 -9 -8 6 -11 -13 -12 -9 0 0 -22 2
7470 2 -8 -4 -2 3 -4 -15 -2 -20 -3 -12 -19 -11 -13 -20 -7 -24 -13 -1 -14 -11 1 -7 -5 -14 -8 0 -3 -3 -2 -4 -13 -3 -10 -3 2 -13 -3 -5 -1 6 -14 -14 -5 -2 1 -12
7516 -12 -3 -13 -4 3 0 -7 2 -9 3 -5 -21 -5 -15 -14 1 -1 -8 1 -3 -10 -8 -5 4 -10 4 1 -4 8 2 -4 5 7 -1 -11 -8 -11 -1 -10 -3 -9 0 -8 -8 -11 -9 -5 -7 1
7564 1 -1 -1 2 -5 -9 3 3 -6 -17 7 -7 2 5 -5 2 -5 -5 2 -5 -2 -2 -5 6 14 -2 1 3 -3 8 -15 -7 2 -11 -18 -9 -12 -2 -8 -5 -11 -15 2 -9 0 -8 -2 0 -12
7612 -12 -7 7 -5 7 4 -11 -5 0 -11 2 -1 -1 -16 -6 -15 -11 -7 -15 -2 -11 0 -10 2 -1 -2 -1 -2 1 -10 -2 -1 -18 -15 0 -15 -13 -21 -16 0 -13 -15 5
7654 5 -17 -9 -12 -3 0 -10 0 2 0 -4 7 5 6 11 -3 -6 1 -7 2 0 -11 -3 -4 5 -10 -4 -18 -4 -5 5 -5 2 -9 -13 -11 0 -12 -15 -4 -9 -19 -6 -3 -2
7698 -2 -5 -11 -10 -6 -16 -3 -20 -1 5 -5 -4 1 -5 5 6 -4 -3 3 -1 6 -9 -17 2 3 -11 -2 -8 -1 1 -2 -4 -21 3 -13 -1 -13 -12 10 -13 -11 -3 0 -12
7741 -12 -8 -2 -6 -2 -11 -4 -4 -3 1 -6 -9 -7 -11 -1 7 -3 7 -21 2 5 -12 1 3 -9 -4 -1 -7 -16 -16 -13 -7 -3 -9 -5 -17 -17 -12 -9 -2 0 7 2 -11 -1 -10 1 4 -6
7789 -6 8 -2 -9 -5 -11 1 1 -9 2 -9 2 -4 0 0 -4 -11 0 -18 -5 -2 1 -6 -4 1 -10 7 -16 -17 -7 -1 -7 -10 -9 -9 -10 -9 -3 -2 -13 -2 1 -4 6 6
7833 6 -18 0 0 -1 -6 -18 0 3 1 -10 3 -5 -9 -3 -17 -9 0 -13 -7 -5 -4 -1 -10 -15 -1 -13 -15 -4 -15 -10 -6 -11 -14 -6 -5 -4 -5 -14 1 2 -12 5 -13 -1
7877 -1 8 6 -6 11 -11 1 -3 -8 -2 -9 -11 -5 -10 -17 -12 -5 -13 -1 -7 -6 0 3 -15 5 -8 -23 -6 -12 -5 7 -9 -7 8 -17 -8 -3 -22 -14 -10 -11 -1 -7 -14 5
7921 5 2 -2 4 -6 3 1 -12 -8 -9 1 -3 -3 -6 -7 -2 -7 4 -4 -9 -9 -10 -5 0 -6 -20 -1 -11 -17 -3 -20 -3 -10 -3 4 -8 -6 2 -5 -7 0 -6 -16 -1 -24 -7 6
7967 6 -6 9 -5 -18 8 9 -13 2 -6 -13 16 -3 3 11 -12 -17 1 -11 -19 -1 -14 -13 4 -11 -10 16 -20 1 -2 -14 6 -12 -15 3 3 -6 7
8004 7 4 -4 3 -5 -15 6 -10 -7 -5 -20 9 -1 -12 -2 -5 -7 0 -8 -11 1 -10 -6 -3 -14 -2 3 -15 4 -11 -30 -6 -12 -15 -1 -21 -21 5 -16 -10 7
8044 7 -11 -16 13 -4 -2 8 -22 9 -2 -14 3 -4 -21 -1 1 -22 0 0 -6 -1 -13 -10 5 -14 -18 -1 -17 -14 3 -9 -4 -10 -21 -9 -13 -22 -1 -11
8082 -11 -19 3 -12 -13 4 -18 -6 1 -20 -2 9 -18 1 0 -5 9 5 -13 9 -7 -5 11 -14 -10 4 -21 -1 8 -30 -4 5 -18 -5 -11 -16 -3
8118 -3 -16 -21 -1 1 -22 12 -9 -12 16 -20 -15 3 -12 -15 0 -14 1 14 -14 -13 5 -13 3 1 -16 6 -8 -8 9 -5 -6 5 -7 2 3 -6 -7
8155 -7 -13 -18 -3 -11 -17 -8 -22 -15 5 -17 -8 7 -27 0 -7 -15 13 -1 -10 6 2 -16 -3 -6 -11 0 -9 -22 7 -4 -5 3 -19 4 12 -9
8191i
##END NTUPLES=NMR FID
##END=
