##TITLE=1H_AM_NVSTERU645
 CDCl3
 8 sc, 
 14.04.2022
##JCAMPDX= 6.0         $$ Bruker NMR JCAMP-DX V2.0
##DATA TYPE= NMR FID
##DATA CLASS= NTUPLES
##ORIGIN= UXNMR, Bruker Analytische Messtechnik GmbH
##OWNER= root
$$ XWIN-NMR		Version 3.5
$$ Thu Apr 14 15:03:15 2022 Russian Standard Time (UT+4h)  she@DPX200
##.OBSERVE FREQUENCY= 200.13135
##.OBSERVE NUCLEUS= ^1H
##.DELAY= (6, 6)
##.ACQUISITION MODE= SIMULTANEOUS
##.ACQUISITION SCHEME= undefined
##.AVERAGES= 8
##.DIGITISER RES= 18
##SPECTROMETER/DATA SYSTEM= spect
##.PULSE SEQUENCE= zg30
##.SOLVENT NAME= CDCl3
##.SHIFT REFERENCE= (INTERNAL, CDCl3, 0, 15.7039)
##AUDIT TRAIL= $$ (NUMBER, WHEN, WHO, WHERE, WHAT)
$$ ##TITLE= Audit trail, XWIN-NMR		Version 3.5
$$ ##JCAMPDX= 5.01
$$ ##ORIGIN= Bruker BioSpin GmbH
$$ ##OWNER= she
$$ F:/spectra/data/she/nmr/H-F/1/audita.txt
$$ ##AUDIT TRAIL=  $$ (NUMBER, WHEN, WHO, WHERE, WHAT)
(   1,<2022-04-14 15:02:01.57 +0400>,<she>,<DPX200>,
      <created by zg, POWCHK disabled, PULCHK disabled
       configuration hash MD5:
       00 E9 B6 7A A2 85 ED C7 34 08 36 98 17 FE 4E 26
       data hash MD5: 16K
       06 52 3F BB 31 61 9B A3 60 18 AC 92 6D 82 7E B6>)
$$ ##END=
$$ 
$$ hash MD5
$$ E6 35 38 4C 91 90 55 D3 CF 01 B2 9A 56 A0 2E FB
##$RELAX= 
##$RELAX= 
##$RELAX= 
##$RELAX= 
##$RELAX= 
##$RELAX= 
$$ Bruker specific parameters
$$ --------------------------
##$DU= <F:/spectra>
##$EXPNO= 1
##$NAME= <H-F>
##$PROCNO= 1
##$TYPE= <nmr>
##$USER= <she>
##$AMP= (0..31)
100 100 100 100 100 100 100 100 100 100 100 100 100 100 100 100 100 100 
100 100 100 100 100 100 100 100 100 100 100 100 100 100 
##$AQSEQ= 0
##$AQ_mod= 1
##$AUNM= <au_zg>
##$AUTOPOS= <>
##$BF1= 200.13
##$BF2= 200.13
##$BF3= 200.13
##$BF4= 200.13
##$BF5= 200.13
##$BF6= 200.13
##$BF7= 200.13
##$BF8= 200.13
##$BYTORDA= 1
##$CFDGTYP= 0
##$CFRGTYP= 5
##$CHEMSTR= <none>
##$CNST= (0..31)
1 1 145 1 1 1 1 1 1 1 1 1 1 1 1 1 1 1 1 1 1 1 1 1 1 1 1 1 1 1 1 1 
##$CPDPRG= <>
##$CPDPRG1= <>
##$CPDPRG2= <>
##$CPDPRG3= <>
##$CPDPRG4= <mlev>
##$CPDPRG5= <mlev>
##$CPDPRG6= <mlev>
##$CPDPRG7= <mlev>
##$CPDPRG8= <mlev>
##$CPDPRGB= <>
##$CPDPRGT= <>
##$D= (0..31)
0 1.2 0 0 0 0 0 0 0 0.06 0 0.03 0 0 0 0 0.0002 0 0 0 0 0 0 0 0 0 0 0 0 
0 0 0 
##$DATE= 1649934120
##$DBL= (0..7)
120 120 120 120 120 120 120 120 
##$DBP= (0..7)
150 150 150 150 150 150 150 150 
##$DBP07= 0
##$DBPNAM0= <>
##$DBPNAM1= <>
##$DBPNAM2= <>
##$DBPNAM3= <>
##$DBPNAM4= <>
##$DBPNAM5= <>
##$DBPNAM6= <>
##$DBPNAM7= <>
##$DBPOAL= (0..7)
0.5 0.5 0.5 0.5 0.5 0.5 0.5 0.5 
##$DBPOFFS= (0..7)
0 0 0 0 0 0 0 0 
##$DE= 6
##$DECBNUC= <off>
##$DECIM= 32
##$DECNUC= <off>
##$DECSTAT= 4
##$DIGMOD= 1
##$DIGTYP= 9
##$DL= (0..7)
0 120 120 120 120 120 120 120 
##$DP= (0..7)
150 150 150 150 150 150 150 150 
##$DP07= 0
##$DPNAME0= <>
##$DPNAME1= <>
##$DPNAME2= <>
##$DPNAME3= <>
##$DPNAME4= <>
##$DPNAME5= <>
##$DPNAME6= <>
##$DPNAME7= <>
##$DPOAL= (0..7)
0.5 0.5 0.5 0.5 0.5 0.5 0.5 0.5 
##$DPOFFS= (0..7)
0 0 0 0 0 0 0 0 
##$DQDMODE= 0
##$DR= 18
##$DS= 0
##$DSLIST= <SSSSSSSSSSSSSSS>
$$ [...]
##$SUBNAM2= <"">
##$SUBNAM3= <"">
##$SUBNAM4= <"">
##$SUBNAM5= <"">
##$SUBNAM6= <"">
##$SUBNAM7= <"">
##$SUBNAM8= <"">
##$SUBNAM9= <"">
##$SW= 18.05172834244
##$SWIBOX= (0..15)
0 0 2 0 0 0 0 0 0 0 0 0 0 0 0 0 
##$SW_h= 3612.71676300578
##$TD= 16384
##$TD0= 1
##$TE= 0
##$TE2= 300
##$TE3= 300
##$TEG= 300
##$TL= (0..7)
0 120 120 120 120 120 120 120 
##$TP= (0..7)
150 150 150 150 150 150 150 150 
##$TP07= 0
##$TPNAME0= <>
##$TPNAME1= <>
##$TPNAME2= <>
##$TPNAME3= <>
##$TPNAME4= <>
##$TPNAME5= <>
##$TPNAME6= <>
##$TPNAME7= <>
##$TPOAL= (0..7)
0.5 0.5 0.5 0.5 0.5 0.5 0.5 0.5 
##$TPOFFS= (0..7)
0 0 0 0 0 0 0 0 
##$TUNHIN= 0
##$TUNHOUT= 0
##$TUNXOUT= 0
##$USERA1= <user>
##$USERA2= <user>
##$USERA3= <user>
##$USERA4= <user>
##$USERA5= <user>
##$V9= 5
##$VALIST= <valist>
##$VCLIST= <CCCCCCCCCCCCCCC>
##$VD= 0
##$VDLIST= <DDDDDDDDDDDDDDD>
##$VPLIST= <PPPPPPPPPPPPPPP>
##$VTLIST= <TTTTTTTTTTTTTTT>
##$WBST= 1024
##$WBSW= 4
##$XGAIN= (0..3)
0 0 0 0 
##$XL= 0
##$YL= 0
##$YMAX_a= 20003
##$YMIN_a= -12865
##$ZGOPTNS= <>
##$ZL1= 120
##$ZL2= 120
##$ZL3= 120
##$ZL4= 120
##$ABSF1= 10
##$ABSF2= 0
##$ABSG= 5
##$ABSL= 3
##$ALPHA= 0
##$AQORDER= 0
##$ASSFAC= 0
##$ASSFACI= 0
##$ASSFACX= 0
##$ASSWID= 0
##$AUNMP= <proc_1d>
##$AZFE= 0.1
##$AZFW= 0.1
##$BCFW= 1
##$BC_mod= 2
##$BYTORDP= 1
##$COROFFS= 0
##$CY= 11.3945322036743
##$DATMOD= 1
##$DC= 2
##$DFILT= <>
##$DTYPP= 0
##$F1P= 2.36226072786647
##$F2P= -0.459571619588291
##$FCOR= 0.5
##$FTSIZE= 0
##$FT_mod= 4
##$GAMMA= 1
##$GB= 0.15
##$INTBC= 1
##$INTSCL= 1
##$ISEN= 128
##$LB= 0.24
##$LEV0= 0
##$LPBIN= 0
##$MAXI= 10000
##$MC2= 0
##$MEAN= 0
##$ME_mod= 0
##$MI= 1.114404
##$NCOEF= 0
##$NC_proc= 0
##$NLEV= 6
##$NOISF1= 3.799351
##$NOISF2= 2.8
##$NSP= 1
##$NTH_PI= 0
##$NZP= 0
##$OFFSET= 15.70392
##$PC= 1
##$PHC0= -18550.91
##$PHC1= 14.00074
##$PH_mod= 1
##$PKNL= yes
##$PPARMOD= 0
##$PSCAL= 0
##$PSIGN= 0
##$REVERSE= no
##$SF= 200.130013532006
##$SI= 16384
##$SIGF1= 3
##$SIGF2= 2
##$SINO= 400
##$SIOLD= 16384
##$SREGLST= <1H.CDCl3>
##$SSB= 0
##$STSI= 0
##$STSR= 0
##$SW_p= 3612.71676300578
##$SYMM= 0
##$S_DEV= 0
##$TDeff= 0
##$TDoff= 0
##$TI= <>
##$TILT= no
##$TM1= 0
##$TM2= 0
##$TOPLEV= 0
##$USERP1= <user>
##$USERP2= <user>
##$USERP3= <user>
##$USERP4= <user>
##$USERP5= <user>
##$WDW= 1
##$XDIM= 8192
##$YMAX_p= 0
##$YMIN_p= 0
$$ End of Bruker specific parameters
$$ ---------------------------------
##NTUPLES= NMR FID
##VAR_NAME=  TIME,          FID/REAL,        FID/IMAG
##SYMBOL=    X,             R,               I
##VAR_TYPE=  INDEPENDENT,   DEPENDENT,       DEPENDENT
##VAR_FORM=  AFFN,          ASDF,            ASDF
##VAR_DIM=   8192,          8192,            8192
##UNITS=     SECONDS,       ARBITRARY UNITS, ARBITRARY UNITS
##FACTOR=    0.0002768,     1,               1
##FIRST=     0,             0,               0
##LAST=      2.2672688,     0,               0
##MIN=       0,             -12865,          0
##MAX=       2.2672688,     20003,           0
$$ Real data points
##PAGE= N=1
##DATA TABLE= (X++(R..R)), XYDATA
0 0 0 0 0 0 0 0 0 0 0 0 0 0 0 0 0 0 0 0 0 0 0 0 8 -8 8 -8 8 -8 8 -16 16 -16 16 -24 24 -25 32 -32 40 -40 48 -52 57
43 57 -64 72 -80 88 -96 106 -116 130 -140 155 -171 190 -211 235 -260 292 -327 373 -427 494 -581
64 -581 703 -875 1151 -1653 2879 -12865 -4321 17780 -7465 -7473 9592 2875 -9840 691 5405
79 5405 884 -1313 -1248 -761 3698 632 -1897 2223 492 -3986 2893 4980 -518 -333 562 -2862 -1230
96 -1230 1321 227 -849 -1662 -2265 132 1421 -541 -1097 386 -867 -1011 1161 775 -181 -811 -2456
113 -2456 495 3752 -101 -1254 2610 1141 -1433 1256 2618 -256 -2059 -765 819 1141 112
128 112 -1274 -785 -68 -1099 -366 1529 394 -1925 -2259 360 1769 -1660 -2139 1672 -82 -2112 2307
145 2307 2933 -1344 -1000 1149 599 1111 1536 -703 -675 460 -1199 539 3340 -1455 -2904 2306 191
162 191 -2580 2346 1261 -4267 -1484 1777 -662 -759 533 -1273 -943 846 14 1350 2360 -2212
178 -2212 -2002 3044 899 -1519 1790 619 -2110 541 1715 591 1182 -213 -1860 556 1454 -1384
194 -1384 -815 828 -1754 -2002 1375 647 -1030 -549 -929 -59 1266 -238 -137 930 -1377 -1573 1744
211 1744 1586 -993 -59 1546 46 -53 1650 761 -636 -588 -266 837 647 -1276 -827 321 -905 -622
229 -622 1271 676 -1542 -1619 582 523 -1052 -249 575 -672 -1013 753 1484 72 -689 272 959 1020 589
248 589 -176 397 17 -1358 706 2367 -700 -1581 660 38 -772 774 586 -1395 -978 -226 -665 421
266 421 351 -1807 -522 1184 -585 38 1823 -669 -1517 1065 1159 202 594 -124 -598 459 537 251 1408
285 1408 235 -2045 291 1829 -931 -698 929 -1154 -1550 513 250 -337 -308 -1079 -310 1042 -34
302 -34 -701 600 -57 -1433 862 1892 -564 -433 641 -281 448 1385 147 151 316 -835 60 1444
320 1444 -213 -1349 59 218 -924 75 837 -801 -1277 -19 298 319 -220 -871 -186 7 -404 623
338 623 1254 -236 -989 420 1343 403 -54 598 149 -518 66 887 595 -594 -875 267 528 -122 -207
357 -207 -293 -478 -925 -429 827 235 -1286 -736 229 -122 39 681 274 -554 -352 511 855 550 -198 -183
377 -183 783 221 -160 1256 590 -1490 -163 1247 12 -426 69 -593 -798 -37 62 228 10 -1266 -1042
396 -1042 908 342 -929 435 377 -1234 121 1266 137 92 5 -435 809 1146 -382 83 905 -833
414 -833 -692 1840 741 -1568 -122 306 -1003 174 660 -741 -416 -485 -1095 545 908 -1121 -778 827
432 827 -101 -522 1134 487 -1082 24 794 341 801 239 -560 186 321 27 854 607 -940 -658 420
451 420 265 -414 -128 -39 -693 -672 211 622 -211 -1267 -471 795 -10 -274 537 81 -729 -124 848 1081
471 1081 117 -602 74 571 200 431 543 -43 -444 -178 317 358 44 -733 -625 263 -66 -381 285 -682
491 -682 -1218 333 436 -286 119 -147 -795 34 580 408 593 -10 -851 492 1362 -322 -106 1190 -488
510 -488 -1084 1299 692 -790 8 -254 -641 765 303 -1019 -68 -171 -1433 173 1334 -774 -1040 384
528 384 -298 -269 1184 205 -537 335 -136 -13 1230 235 -773 286 459 -234 742 779 -628 -676 396
547 396 221 84 75 -685 -618 -272 -531 408 684 -969 -972 416 153 -254 243 216 -434 -311 278 735 556 -290
569 -290 -452 629 796 35 364 407 -493 -544 314 673 203 -827 -566 223 -213 -255 427 -250 -889 -341 200
590 200 165 31 -334 -601 114 385 80 591 375 -928 -11 1361 188 -146 682 -350 -584 605 490
609 490 142 125 -681 -706 655 304 -865 151 160 -1329 -187 1037 -396 -715 20 -528 184 845 -230
628 -230 -152 531 -504 -245 1397 677 -806 108 463 -276 419 730 -240 -170 -32 -393 549 422 -1062 -458
648 -458 352 -569 -292 591 -393 -1064 -120 304 140 351 -117 -554 140 92 -41 889 292 -870 186 884
668 884 119 194 410 -88 -281 139 468 261 -354 -744 -311 351 30 -260 51 -402 -764 -127 566 221 -417
689 -417 -663 17 214 -77 497 426 -380 -209 500 533 393 72 -263 -37 475 201 123 445 -523 -979 535
710 535 703 -473 -81 4 -846 -246 377 -92 -97 -255 -735 86 755 -126 -291 446 -169 -468 902 816 -392
731 -392 -87 80 -39 669 395 -173 204 -185 -590 568 637 -756 -638 326 -292 -431 410 -96 -723 -291
751 -291 -163 162 631 -390 -713 531 169 -407 712 569 -655 -223 741 409 107 271 -164 -211 299
770 299 113 165 357 -542 -766 359 164 -432 -60 -81 -465 -341 201 359 -295 -657 -239 270 246 72 151
791 151 162 -384 -128 718 641 112 -212 -13 395 91 62 364 -135 -588 76 393 78 -266 -407 -365 -94 70
813 70 47 26 -281 -808 -196 667 168 -244 245 -110 -327 424 522 210 16 -216 28 674 270 -233 84 232
835 232 -399 60 645 -168 -643 -187 -236 7 354 -276 -389 -35 -511 -112 633 -69 -543 162 108 -344 334
856 334 509 -365 -123 524 155 277 516 -415 -166 634 -66 -39 609 -229 -870 98 362 -215 -132 -109 -531
877 -531 -195 225 -144 17 88 -680 -210 704 117 -193 206 -30 -208 446 625 131 -235 -20 192 218 298
898 298 163 37 -368 -388 270 417 -213 -375 -289 -273 -73 23 2 -65 -475 -477 267 341 -82 -257 -43 87 96 327
922 327 441 48 -375 -88 490 540 -31 23 45 -330 -29 517 148 -223 -271 -361 105 210 -356 -230 -1 -413
944 -413 -290 527 162 -644 -107 216 -98 312 555 -204 -129 106 -144 508 666 -340 -217 492 46 -212
964 -212 447 260 -600 -160 278 -74 50 -192 -665 35 125 -396 210 219 -739 -460 462 245 -173 162 54
985 54 -215 118 372 249 235 -74 -258 542 405 -113 133 94 -447 7 475 107 -264 -378 -269 -5 128
1006 128 -95 -119 -126 -409 -346 433 226 -393 -171 145 44 185 249 176 1 -214 224 615 245 -124 -83 62
1028 62 67 64 299 90 -375 -424 -40 239 -94 -325 -63 -208 -414 165 268 -223 -196 -132 -34 351 119 -126 141
1051 141 80 -136 353 753 25 -467 224 284 -60 334 224 -255 -137 -214 -49 459 -108 -720 0 110 -430
1072 -430 -94 351 -422 -613 180 314 22 63 -184 -263 323 160 132 597 -32 -561 338 542 -35 109 211
1093 211 -223 -208 148 205 -76 -207 -490 -63 394 -178 -247 147 -298 -500 286 331 -210 -251 -130 13 302 197
1115 197 90 186 -6 -231 329 628 -45 -315 179 118 -6 210 136 -120 -283 -209 186 191 -310 -304 -199 -154 -110
1138 -110 102 209 -193 -430 -52 377 195 -58 32 170 -134 33 584 206 -252 -43 108 182 278 -5 -179
1159 -179 -52 -158 -59 406 90 -553 -335 70 -47 -63 187 -191 -391 -50 1 250 261 -319 -233 373 54 21
1181 21 464 166 -378 26 528 228 74 6 -231 -26 135 -108 286 158 -682 -338 411 -89 -334 106 -240
1202 -240 -402 36 249 -110 -133 -166 -137 277 311 -139 55 175 -249 103 677 153 -200 -31 14 67 193 94
1224 94 19 -102 -308 -41 318 0 -535 -220 128 -228 -136 209 -155 -429 -156 240 271 -29 -87 50 -6 80
1246 80 379 234 6 -174 27 298 287 76 -89 49 -92 -142 185 312 -402 -490 17 40 -27 -33 -144 -181 -237
1269 -237 -226 388 335 -304 -281 184 94 21 331 268 -176 -153 237 219 223 -37 -267 157 179 -136 195 139 -479 -309
1293 -309 247 195 -241 -136 -136 -244 -83 37 20 136 -308 -439 365 341 -281 135 262 -223 -11 483 272 -28
1315 -28 -77 -89 154 339 -33 -191 137 -139 -349 346 286 -485 -347 4 -103 -85 73 -82 -169 -278 -122 279
1337 279 189 -209 -204 168 146 -23 330 233 -122 -100 182 323 235 -124 -154 106 -103 -7 218 31 -351 -347 6 140
1361 140 -98 -247 -64 -126 -130 6 255 12 -414 -52 240 100 69 60 -10 -20 -24 237 466 77 -261 -17 231
1384 231 50 20 229 -159 -340 -29 123 20 -39 -291 -202 113 -42 -57 208 -165 -482 170 413 3 -18 115
1406 115 -84 7 262 247 178 50 -276 65 524 -19 -190 223 -37 -281 209 217 -255 -302 -149 -18 72 36 -229
1429 -229 -102 -60 -266 139 450 -43 -290 85 38 44 233 206 -26 -45 -15 303 322 -46 -159 78 100 -128 107
1452 107 145 -188 -420 -71 143 49 -102 -256 -123 -97 -75 216 160 -232 -271 38 238 101 7 153 46 -47 165
1475 165 320 220 -182 -195 171 136 -3 55 -102 -181 -100 -47 224 46 -381 -243 113 -105 -71 210 -37 -345
1497 -345 -39 217 132 22 18 -96 199 190 13 226 186 -279 -96 497 203 -163 -15 27 -185 2 156 -10
1519 -10 -111 -261 -262 158 119 -249 -119 58 -312 -37 361 -25 -199 -89 69 149 159 132 45 25 -109 24 451
1542 451 207 -167 -49 115 -58 46 187 -44 -239 -153 -92 126 2 -290 -197 77 -121 -56 182 28 -327
1563 -327 -136 268 152 14 48 -12 -11 -12 184 327 61 -178 19 162 110 -37 -27 -4 -156 -114 135 56 -256 -299
1587 -299 -20 40 -65 -33 90 -153 -212 -18 96 160 -47 -161 124 152 -79 189 224 -72 -79 188 307 8 -58
1610 -58 -40 -129 6 58 6 53 -222 -322 132 171 -191 -128 -11 -146 -75 68 133 -92 -128 -89 122 231 70 -54
1634 -54 143 -14 -81 265 247 -161 -63 41 7 134 114 -70 -125 -120 -143 82 218 -189 -374 -16 -40 -180 128 72
1658 72 -191 -108 34 93 160 -43 -120 107 166 49 226 248 -198 -253 166 231 18 46 -46 -130 -47 6 126 21 -209
1683 -209 -247 17 59 -70 -72 -11 -47 -119 122 164 -56 -110 -74 198 142 57 91 25 -100 -38 239 204 84 -116 -47 72
1709 72 35 -57 52 -53 -274 -85 153 74 -163 -212 -41 -111 24 83 44 -92 -259 -15 327 88 -58 98 13
1732 13 -15 113 257 26 -63 -51 15 110 124 -108 -73 -40 -144 52 258 -109 -355 -102 -31 -56 40 -43 -127 -113 -99
1757 -99 17 203 82 -145 -9 187 8 99 335 -78 -174 130 179 117 17 -56 -96 39 -19 41 80 -214 -336
1780 -336 -83 159 -5 -138 -48 -168 -137 67 110 53 -114 -170 48 231 55 17 71 -28 -56 162 263 96 -95
1803 -95 -72 80 158 13 30 2 -182 -209 76 143 -127 -143 -170 -2 -23 1 40 -49 -159 -94 181 203 -22 -70 -12 7
1829 7 62 195 179 60 -88 -61 206 226 -104 -75 60 -110 -112 134 30 -200 -167 -122 39 112 -60 -149 -32 -85 -111
1854 -111 227 183 -259 -92 156 28 71 194 16 -119 40 100 212 177 -141 -170 70 56 -58 110 2 -261
1876 -261 -103 24 11 -27 -119 -197 -29 13 21 71 -12 -248 -138 207 172 -9 67 18 -53 82 182 158 76 -127 -58
1901 -58 195 72 -53 -15 -122 -172 -51 121 17 -181 -258 -93 -4 24 -30 -14 -95 -172 12 166 112 -44 -71 40
1925 40 129 141 40 114 -42 -78 159 236 59 -151 -69 -86 1 60 39 -62 -120 -201 -15 127 -55 -185 -5 -19 -125
1950 -125 121 173 -79 -146 1 69 107 107 -7 -46 16 -51 157 291 -31 -182 47 103 4 69 41 -135 -105 -25 35
1975 35 62 -52 -196 -7 56 -52 -3 103 -158 -125 131 141 31 56 -53 -7 91 112 138 143 -43 -116 118 174 3
2000 3 -105 69 8 -90 69 106 -68 -137 -175 -3 140 -18 -80 -54 -98 -150 96 143 23 -135 -24 119 113 116 61 78
2026 78 -66 -43 147 133 16 -164 -19 11 -25 -17 11 -25 -209 -109 84 97 -112 -125 -71 -9 5 76 37 -90 -110 67
2052 67 153 172 -18 -40 75 -30 52 214 28 -65 -29 25 99 55 -45 -124 -41 -112 -41 93 5 -173 -214 18 -5 -70
2078 -70 14 -62 -98 -23 2 114 50 -90 -31 128 99 29 193 50 -95 46 209 123 8 -68 -85 -48 63 -32 35
2103 35 -11 -196 -154 99 -4 -78 -33 -53 -68 2 112 31 -40 -75 -1 156 120 18 43 4 -16 129 226 75 -102 -128
2129 -128 -15 70 -2 32 9 -118 -105 -6 57 -24 -154 -81 -12 -9 32 54 -15 -114 -60 172 175 -18 -57 62 -7 4 153
2156 153 118 -27 -92 0 68 87 -43 -30 -27 6 -80 58 21 -116 -201 -46 34 36 -12 -107 -22 -68 -1 121 108 -48 -77
2183 -77 104 173 -3 71 55 1 0 111 114 57 -91 -117 41 -1 -38 -16 -13 -206 -202 86 87 -37 -73 -63 -97 53 70 61 64
2212 64 -126 -117 146 167 39 18 67 20 64 160 168 -32 -78 -17 15 148 -17 -45 -74 -100 -124 59 4 -118 -179 -25 86
2239 86 49 -11 68 14 -35 20 168 108 -54 -67 80 126 58 136 78 -70 -112 82 214 94 -70 -85 7 -35 0 42
2265 42 -3 -156 -136 45 73 0 -76 -22 -98 -34 48 158 31 -150 -3 113 64 113 65 -23 -67 -4 102 154 -24 -136
2291 -136 -14 29 -2 -48 92 -95 -172 -66 24 -15 -58 -68 -40 84 38 39 -1 -35 -156 -3 174 56 -34 42 -18 27
2317 27 104 87 114 -8 -87 13 131 2 -105 1 -25 -82 -29 89 -30 -174 -171 -1 80 34 -58 -45 -35 -74 80
2342 80 201 -8 -105 40 115 36 61 46 -25 -1 -13 121 29 1 -164 -11 7 -24 11 -13 -84 -223 -71 50 56 -21
2368 -21 -120 -26 -64 -44 50 66 -38 -122 46 136 53 0 3 53 -36 53 134 119 -109 -128 112 119 -14 29 -40 -50 -135 13
2396 13 25 2 -148 -77 -18 76 -43 17 22 -114 -65 79 77 6 -12 -27 43 104 96 96 37 -77 -79 123 66 -79 -44 30 -51
2425 -51 -25 68 -34 -36 -151 -152 47 73 -57 -58 -10 -20 16 147 33 -37 -23 63 115 119 23 -18 -19 -19 50 135 57 -118 -102 42
2455 42 -3 69 55 -29 -83 -90 -11 1 -33 -132 -83 50 13 76 84 -25 -68 -3 121 177 54 24 16 36 96 109 86 -20 -78
2484 -78 35 77 27 -33 -34 -72 -61 -15 27 23 -63 -187 -34 61 7 -59 -10 -38 -46 47 108 148 11 -57 77 76 75 82 102 39 -29
2515 -29 103 105 20 -45 -55 42 16 -27 36 54 -115 -124 21 101 -18 -124 4 -69 -50 77 81 40 -36 26 105 123 -18 -62
2543 -62 28 -6 55 75 113 -95 -94 -40 69 24 -92 -31 -11 -72 -65 56 101 -46 -151 -50 11 -48 33 34 -42 -24 55 157
2571 157 74 -61 -58 17 4 38 59 56 -56 -97 78 115 18 -119 -81 -89 -92 -10 27 -26 -162 -140 29 46 -65 -42 -53 -35
2599 -35 -8 6 139 52 -56 -78 116 126 29 86 12 -27 -30 60 35 -45 -95 -13 28 2 -22 4 -50 -126 -49 41 84 -80 -73
2628 -73 -52 32 45 36 68 -3 -57 12 140 54 -9 1 42 25 62 56 52 -53 -45 39 54 21 -119 -80 -45 -89 21 68 -70 -117
2658 -117 -115 50 12 12 -22 -3 -35 -73 106 99 22 -103 -1 74 95 62 38 34 -43 -14 86 49 -45 -83 -48 -36 0 12 15 -66
2688 -66 -74 -86 114 -45 6 -85 -23 -27 -15 68 34 -63 -97 51 145 71 9 44 -34 -55 19 120 11 -51 -38 -24 2 47 -54
2717 -54 -46 -79 -107 -44 74 -30 -91 -64 -1 29 3 31 7 -15 -24 104 114 17 -39 0 -45 30 71 45 21 -83 -60 91 30
2746 30 -61 -50 -64 -32 -82 59 -21 -70 -101 -26 30 30 13 -84 -4 -19 11 93 98 -15 -20 63 110 67 45 21 -7 -5 72 118 34
2777 34 -44 -31 -54 4 -7 -37 -19 -92 -56 47 44 41 -33 -45 -55 -28 54 81 -4 -60 -63 126 125 58 30 21 2 42 84 64 -17 -83
2809 -83 -42 97 54 -29 -62 -19 -73 -24 27 29 -42 -95 -18 73 53 72 22 -51 -49 2 140 17 9 -23 7 99 9 44 21 -77
2839 -77 -81 39 104 24 -47 -38 -45 -28 33 43 -25 -110 -24 8 68 -16 -14 23 40 -1 44 92 -8 -50 49 51 77 24 8 -8 4 33
2871 33 26 58 -40 -120 -25 30 50 -49 -70 -20 -15 -44 13 42 -55 -64 -13 18 37 50 45 -5 -57 49 75 77 3 -32 27 35 23 44 47
2904 47 -22 -66 49 34 9 -69 -52 -72 -62 -18 22 -24 -91 -99 28 44 -1 -26 -23 -45 -8 19 90 19 -94 -1 77 90 -9 28
2934 28 1 -62 -2 101 46 13 -59 -61 -14 -1 43 -33 -16 -56 -38 78 8 11 -47 10 7 -7 30 52 -39 -22 4 85 -8 -9 5
2965 5 0 -9 4 29 22 -31 -46 18 55 -37 -75 -48 -91 -30 -23 101 -6 -116 -11 6 30 25 -13 36 -11 -3 86 80 -20 -62 12 19
2997 19 41 20 21 10 -64 -20 27 46 -32 -88 -106 -58 13 28 5 -26 -63 -54 89 14 -38 -39 -45 52 81 47 15 -4 -66 44 122
3028 122 57 -20 11 -21 -2 1 80 9 -53 -29 -34 -13 3 4 -57 -40 -79 -28 44 -37 -114 4 2 34 43 46 38 -23 7 83 116 47 41
3061 41 -8 -8 35 9 40 -70 -61 -62 -2 -14 -100 -81 20 -26 -91 8 -7 -116 -79 -17 37 16 27 12 -12 -31 15 103 42 -33
3091 -33 -48 62 43 1 64 54 -19 -40 27 74 -8 -63 -54 -36 43 31 -30 -59 -110 -73 -9 41 -71 -49 -34 25 -3 84 73 -11
3121 -11 -91 0 76 66 7 -5 65 37 39 22 50 -36 -94 -15 9 17 -9 -96 -70 -90 -13 42 22 -78 -106 2 39 29 -10 25
3151 25 9 6 -29 136 75 -64 26 26 24 52 71 -27 -66 -45 -3 53 -13 -29 -47 -25 -5 -54 18 -46 -93 -12 24 39 28 -44 -19
3182 -19 -6 -17 1 86 26 -55 1 83 45 56 20 -2 -13 -16 72 -23 -15 -89 -92 -11 8 -59 -25 -36 -87 -43 23 11 -83 -51 -37 75
3214 75 43 75 19 -46 -35 27 110 85 -12 -12 14 54 22 25 -19 -33 -94 33 61 -29 -9 -64 -20 -48 -57 30 -26 -139 -38 -27
3244 -27 10 27 -1 -40 -30 10 94 86 29 -42 12 19 41 4 26 -81 -12 -14 63 54 -3 -92 -50 -13 -32 -6 -29 -14 -57 -8 32 80
3276 80 23 -60 -20 -11 47 34 13 11 -45 33 50 40 -20 27 -26 10 44 26 43 -78 -61 24 25 1 -4 -10 -61 -3 27 88 29 -74
3308 -74 -21 53 66 -23 -6 -6 -23 -6 19 85 -11 -8 -16 60 -7 6 40 -51 -76 -68 20 59 -30 -80 -61 -41 20 -38 27 -39 -33 -70 42
3341 42 10 -2 -45 -30 1 10 46 123 -55 -5 68 63 100 13 8 -76 -27 32 55 4 -61 -75 -3 8 -2 -56 -4 9 -46 -38 -23 13
3373 13 -42 -31 -31 17 22 3 -13 -75 -23 40 70 23 -14 -33 -17 6 -20 8 -25 -69 -59 43 43 -13 -67 -47 36 5 31 38 12 -66
3405 -66 -53 3 27 22 -25 -5 -17 9 16 12 -6 -58 27 18 7 -34 -42 -53 -43 -3 16 11 -69 -42 -52 20 -33 26 -65 -104 -24 -61 41
3438 41 27 -63 5 -4 38 46 31 3 -14 -42 47 111 35 -21 -33 13 27 69 41 -36 -60 -30 10 -1 36 -18 -24 -37 -43 42 31 -10
3470 -10 -65 0 69 6 31 23 -24 -28 46 105 27 -14 -60 30 56 29 -6 41 -44 -51 -16 2 40 -70 -37 -15 -8 -30 -2 -35 19 -51
3502 -51 12 13 51 -16 -5 -8 13 83 127 61 -34 -72 27 30 12 1 -69 -3 -59 -13 61 -62 -53 -13 -11 34 -4 1 -33 -18 -58 26 -10
3535 -10 -2 -96 3 10 11 32 69 37 -14 25 31 120 -21 -46 10 -11 -23 37 7 -103 10 10 -6 6 -40 -65 -23 13 1 7 18 10
3567 10 -32 -3 56 22 -8 -14 36 14 65 75 58 -72 -27 95 56 -30 -11 -8 -58 -59 23 30 -92 -51 -42 -17 25 5 -35 8 -88
3598 -88 26 24 52 -28 -3 13 -6 1 -5 71 -2 -36 35 92 -16 17 -17 -12 -40 -18 40 5 -75 -50 -6 5 -27 -19 -10 -53 -48 -36 36
3631 36 24 -24 -3 45 55 51 13 -13 38 27 31 67 29 -33 -45 30 25 48 23 -28 -24 -19 9 63 1 -55 -4 45 0 -11 43 -55 -25
3664 -25 -47 36 74 25 11 -22 16 63 4 42 10 -32 9 30 47 -1 -10 -70 8 -1 63 30 -31 -56 -38 13 64 8 -46 -10 -120
3695 -120 19 66 27 -45 -58 72 -11 19 42 24 -23 1 37 105 -8 -5 5 57 25 19 61 -59 4 -100 74 -31 -7
3722 -7 8 -18 -1 1 19 32 17 -58 -33 79 39 -4 18 21 -10 52 60 33 -4 -7 -12 4 23 12 -31 -68 -17 -78 10 8 -89 -38 39
3755 39 -38 4 -3 -58 -58 -16 103 73 49 18 -46 32 23 7 38 -10 -29 -23 62 26 16 6 10 -42 -19 -28 34 24 -35 -44 -27 23 -46
3788 -46 -23 -39 -34 -48 29 18 -12 7 -37 24 39 63 42 11 -8 22 68 45 -8 -20 2 8 66 78 -48 -35 -85 -27 54 -21 -31
3819 -31 -48 -12 -8 64 28 -12 -29 -62 26 24 -8 18 -3 15 37 63 35 20 10 -12 7 92 14 -43 3 -4 2 10 28 -45 -88 -95 41
3852 41 34 22 -35 -27 -56 -14 47 58 13 -1 7 -13 89 98 73 -27 1 37 62 9 -7 -35 -11 -2 -3 -13 -16 -8 -72 -13 36 -10 -10 -40
3886 -40 -51 -43 -12 82 -40 -64 -67 32 11 42 65 70 13 5 17 36 66 -23 -34 25 -28 -16 22 13 -10 -14 1 58 1 -73 -29 30 -27
3919 -27 32 -7 -35 -78 3 44 32 25 -40 -12 40 30 30 4 56 -33 34 44 -3 -12 -40 -38 57 6 5 -12 -53 -39 27 33 -17 -42 -70
3952 -70 -39 -34 22 26 27 -27 -7 36 -37 11 18 33 -5 12 21 11 23 -33 -44 3 18 -7 12 -8 -20 -61 8 35 -1 -12 -48 17 46
3985 46 36 59 -32 -29 8 38 57 33 -31 41 27 28 57 39 -25 -20 -29 43 48 -2 -37 12 6 -34 64 20 23 -45 -9 -26 30 28 13 -6
4019 -6 15 45 56 -3 33 -13 -6 50 47 55 -8 -31 -1 30 85 -2 -26 0 -27 -23 12 -14 -7 -31 -108 39 -2 -38 0 -23 0 7 -14
4052 -14 71 -4 -23 -56 11 33 7 -3 23 -18 14 48 28 -63 -57 3 11 -57 -24 15 -31 -59 12 16 -23 -19 -24 -41 0 -20 4 -6 11
4085 11 6 -3 27 45 -25 0 -56 4 57 14 56 -54 19 40 17 22 -45 -30 -45 22 33 26 15 -17 -28 5 5 7 13 19 -73 -22 -14 69
4119 69 29 -68 -16 36 53 1 35 17 -10 4 71 42 -12 -22 -12 1 -33 10 37 -78 -65 1 18 14 -28 -5 25 -6 -8 0 9 -37
4151 -37 -23 21 62 3 9 19 14 -15 32 -2 18 4 -19 35 61 -25 20 -51 -20 6 10 13 -16 -68 -43 23 8 5 -21 -15 -11 -46 11 48
4185 48 1 57 -7 -4 -1 27 55 -6 -28 17 28 17 31 28 -22 56 12 -40 -11 15 -8 3 33 -6 -31 -12 -33 -26 27 -10 14 -4
4217 -4 26 16 88 7 50 -21 -10 0 28 40 20 -66 -15 14 35 19 -21 0 -42 -61 5 56 4 -23 -45 -11 1 6 21 -40 -16
4248 -16 -28 69 88 39 33 5 28 -13 55 19 -24 -12 -23 10 -3 -7 19 25 -10 -36 -16 -10 -12 -74 9 4 5 -28 -12 12 9 49 14 53
4282 53 -15 -20 34 22 76 45 -49 -1 47 49 31 -48 -19 -39 7 -25 6 -13 -49 -44 -47 -4 49 -27 -15 8 5 -29 35 45 23 -41 27
4315 27 3 39 19 -5 27 8 46 56 94 26 -58 21 29 -1 -39 11 -27 -83 -42 39 53 -28 -41 -56 -40 5 19 -59 -48 -33 9
4346 9 57 39 33 -7 0 -25 -9 -10 -10 5 -56 10 36 16 -15 -30 -30 -41 -6 -33 -21 -34 -34 12 30 32 -8 -2 -9 -52 -4 27 31 29 -20 16
4382 16 27 30 18 33 -71 -3 -7 -41 -23 -76 -13 -44 19 -37 6 -23 -40 -1 17 11 -23 -52 -47 26 7 7 4 -15 41 33 42 -17 29 -18
4416 -18 -24 -31 70 52 36 -24 -20 -4 55 12 -19 -33 -16 -33 -28 27 17 -11 -13 32 35 28 -7 -19 -4 -48 6 -5 41 8 -33 0 14
4449 14 50 12 22 27 36 35 54 22 9 27 27 -26 17 -18 -14 -13 7 -18 24 -24 -25 22 -29 37 5 71 3 -45 12 0 43 23 41 2
4483 2 26 25 43 58 -30 9 17 11 9 -15 -47 -7 -3 -5 28 22 -21 -45 2 -13 -19 45 35 -35 -2 40 18 -37 12 -21 53 -4 42 56 -43
4518 -43 -52 -9 13 8 1 -19 8 -37 6 11 45 -3 16 -57 8 49 -46 -27 -6 -5 13 13 55 3 12 30 27 28 30 -6 -30 3 -12 -15 -52 -30
4554 -30 5 -34 -19 37 -34 -3 -19 -69 4 5 -38 29 28 28 25 47 72 3 -14 9 30 1 4 39 53 1 10 -20 -8 6 4 -45 13 35
4588 35 -7 -54 15 -23 -30 -12 -12 -25 -16 15 7 -4 -35 -31 4 -37 28 20 -27 -43 7 -12 32 -26 28 12 -33 8 11 73 28 29 -69 -6
4622 -6 -26 34 27 -2 -35 -3 -35 49 10 -43 -24 54 -29 1 -36 -10 4 -6 -1 32 -2 19 14 -8 27 10 47 22 -35 -57 -19 16
4654 16 -8 4 -28 0 -28 2 42 -40 -31 4 24 10 -26 -20 -5 -48 -1 20 -4 -11 -39 -4 -12 51 56 -1 -79 20 25 73 17 10 -2 -8
4688 -8 28 38 45 -46 -28 -12 21 48 22 27 10 34 -6 42 40 -23 20 -12 33 15 2 5 -11 -11 -36 -15 14 -15 -46 -22 4 -22 51
4721 51 10 -5 -73 -7 24 -24 -31 10 -10 37 24 -14 30 58 -13 41 22 22 45 10 3 7 13 -13 -34 -55 -76 -4 14 -10 0 -6 -57
4754 -57 0 8 12 10 -45 -7 46 -13 -6 7 2 -19 2 -17 -5 39 26 -48 17 30 34 20 30 -15 -51 66 2 -8 -3 3 -26 -43 18 6
4788 6 -49 -11 -17 -23 -2 -46 -3 -25 40 -4 2 4 -36 -35 6 42 26 -31 28 14 29 25 -5 6 -45 -30 62 -7 3 22 8 -9 -2 -30
4822 -30 35 8 -15 -6 -30 15 29 25 5 20 -13 45 -9 60 6 4 6 -15 6 -45 -12 -46 -35 50 -9 -13 -34 -76 -5 -18 -29 3 -46
4855 -46 -42 33 -27 36 7 12 -10 -45 -23 22 45 6 -4 48 -38 46 -16 -32 -3 -21 30 -45 -1 -30 40 9 24 28 9 2 -12 -26
4887 -26 14 11 14 -2 14 -87 16 -32 50 55 46 -2 -5 50 35 38 -61 30 -2 43 -32 34 -17 13 -13 -33 28 11 20 -28 16 67 -1
4920 -1 -1 -14 -13 1 6 2 8 -17 6 6 9 -27 -19 -10 64 3 -20 -36 4 -19 -24 3 44 32 56 -2 -20 -13 20 -3 45 -13 5 -23 0 6 37
4957 37 11 -8 -37 45 36 -23 19 -19 24 10 15 1 -14 13 -16 1 -7 -25 -61 -16 21 -9 -41 28 21 -49 15 41 -6 -27 -4 -22
4989 -22 -21 -66 -4 23 -7 -25 -11 45 83 -12 14 -9 15 -5 -34 72 7 -4 -62 -2 -40 -11 -21 47 -8 3 -21 -25 -29 2 -32
5020 -32 26 -3 -12 -38 -14 -13 -4 -11 30 -19 71 35 16 5 58 -48 -51 -34 30 -15 -28 0 -26 -1 -35 18 -28 -32 -37 36 39 -11 -11 -38
5054 -38 62 -35 -6 76 36 -54 -70 26 13 47 22 37 -11 -10 -9 45 -12 -13 -6 36 33 6 -19 34 -51 -37 19 32 -36 -6 -16 -30
5086 -30 -10 17 39 -6 44 34 12 -10 6 -39 -38 -12 38 -29 11 -19 -45 -18 21 6 -5 2 -105 27 0 5 -51 26 -13 26 25
5117 25 52 -4 21 1 -9 -37 16 13 -21 20 -41 -35 42 37 14 40 0 21 34 -2 -16 3 -14 -10 10 -8 16 -29 -37 -28 59 -10 -19 -20
5151 -20 -30 9 -18 76 -13 -19 17 2 -5 37 0 -12 23 27 41 62 1 -18 -38 3 14 2 -13 -18 -31 -30 -21 -50 14 -44 -8 14 43
5184 43 30 -16 39 6 -5 23 42 -13 -15 26 10 51 16 38 -23 -18 6 0 -31 -15 14 14 -11 -16 -15 3 -3 -8 -49 21 -6 -38 -59 59
5218 59 -55 -30 42 29 -56 -56 -10 14 34 26 -3 -2 35 12 50 -71 -75 -10 -10 -29 27 -43 -33 -41 18 28 -19 18 -18 41 42 30 -13
5251 -13 -11 -26 -36 -28 23 67 -6 -25 -1 21 -14 -26 7 20 -30 -67 25 8 19 40 22 19 -1 20 52 9 36 50 4 31 -5 -22
5283 -22 56 18 66 32 18 52 -14 -7 21 15 54 26 10 -35 11 -5 0 25 -50 11 -34 -54 -29 14 -18 -21 -20 -22 -35 -13 18 -14 27
5316 27 25 34 -20 18 20 26 33 -31 4 -60 5 22 66 16 65 11 -1 1 8 -49 -39 8 -21 6 10 -18 -7 -34 27 16 42 41 -20 -30 16
5351 16 -28 26 -14 -77 40 44 6 12 9 -10 4 -41 -28 -13 58 -14 30 -70 -4 -55 18 -24 -21 19 26 -2 -21 -19 -16 19 29 32 38 39
5385 39 -48 -10 -42 53 1 12 -32 7 -30 -26 -15 -12 -19 23 44 23 23 36 -17 4 -10 -13 19 38 7 15 23 5 43 64 -70 10 20
5418 20 -36 28 26 -3 -3 52 -55 -15 -27 -23 -23 -12 -51 6 -42 13 -19 6 -26 4 -18 -55 35 -25 58 -33 40 -7 -30 -62 54
5449 54 -6 -49 20 41 -3 16 9 -8 -4 48 -39 -35 -19 16 -29 25 19 34 33 -40 8 -53 18 4 -35 -4 -10 12 -19 18 -37 43 45 -62
5483 -62 67 36 12 19 -43 38 35 19 -4 19 -44 -9 -21 27 5 -1 -6 -22 26 -19 18 14 4 -33 1 29 21 30 12 -16 -32 70 37
5516 37 40 -22 14 9 14 68 -38 -16 -21 58 9 43 -47 -5 4 -43 18 24 71 35 21 61 26 -4 12 51 8 5 -24 18 14 -23 31 66
5550 66 -27 37 -2 -40 19 -35 11 9 28 -54 -28 44 28 -8 -35 -9 4 3 49 -12 -20 17 -31 37 -6 28 3 59 -7 -15 34 40 52
5583 52 -9 -18 20 1 -7 6 52 -57 -50 50 1 -11 -38 -4 -5 -3 -2 -38 22 -13 -28 7 15 -4 -9 -2 -5 12 20 9 15 -34 4 38 -15
5618 -15 36 -23 9 8 39 -52 21 19 -9 -3 8 -9 -29 -51 -55 -7 5 15 1 55 -26 -16 64 55 28 -13 -51 -13 0 15 -12 -57 10
5651 10 55 -12 21 9 -20 21 -45 -24 53 -31 -14 -15 16 31 15 17 -19 -19 2 -42 -5 -11 28 24 -16 5 37 10 6 -1 3 -54 22 -5
5685 -5 -24 -35 -8 -6 46 -54 5 -29 -51 -5 8 30 24 -15 -14 -1 17 54 -33 33 16 -6 18 39 -31 -6 29 -2 -11 23 -25 -2
5717 -2 -22 2 22 17 -83 -53 -47 -17 -47 52 17 -20 1 -44 -10 46 49 -79 -13 12 57 19 3 -25 -66 25 13 -33 21 0 -1 13
5749 13 22 -22 8 25 -3 30 44 -22 12 -12 -17 24 29 45 -14 45 -73 -47 1 6 -6 -83 19 31 -38 17 -1 -49 35 -28 16
5780 16 -12 -3 45 3 4 -7 12 6 44 25 8 23 27 6 12 46 18 23 14 -4 1 -27 28 24 2 35 -13 42 5 13 60 69 -3 -9 -19 18
5816 18 27 -14 10 -10 -16 -5 0 26 -2 -37 -3 25 8 7 49 23 46 14 49 -50 1 -12 19 23 25 14 -17 -5 -16 9 4 -72 -36 -22
5850 -22 3 -6 28 -75 12 -11 -4 20 -32 16 -41 -16 -11 -23 13 20 35 -6 -40 1 44 30 -57 13 -48 20 -71 41 -26 -67 43
5881 43 13 -8 -2 45 -5 -54 -27 -19 21 59 40 14 -7 -17 45 -40 -22 -1 40 -21 14 28 11 12 24 -2 -49 -20 -4 11 24 9
5913 9 0 14 21 9 30 40 -30 -30 1 19 37 -37 73 -2 -20 113 -23 30 -43 -18 -59 33 -39 -15 2 27 -20 -18 26 -22 -38
5944 -38 -28 -16 2 -5 29 67 6 -12 -10 7 25 32 -17 14 27 -27 -30 8 1 28 -30 5 -23 29 3 6 19 14 75 -17 5 7 -48 -32
5978 -32 -29 -38 58 -30 -54 30 -14 -46 -37 -18 19 6 -61 -25 -7 -5 89 -13 1 -35 56 -1 4 -17 -4 -17 -22 -51 17 36 4 -15 1
6011 1 -6 9 -3 -22 23 -7 26 -41 46 -16 -5 -38 18 -3 13 17 31 -41 -43 -31 23 31 8 31 55 45 40 0 -24 68 -63 20 -19
6044 -19 23 5 -31 -20 -2 18 -28 28 -1 -17 32 10 -56 29 -20 21 -49 -39 14 -1 0 -11 38 -16 -18 11 -42 -3 -19 37 13
6075 13 1 7 41 -22 -6 12 -31 34 28 32 84 61 9 -14 16 -11 -1 -2 -15 -15 3 12 -3 -12 12 -11 -64 -56 -4 8 -38 -2 -45 -47 17
6110 17 -26 34 -14 -37 4 0 1 -23 12 -22 -25 -61 4 6 -6 7 30 5 13 35 -61 -13 23 -54 20 -16 -22 -6 -56 30 -45 -4 11
6143 11 0 0 -27 -4 25 7 -62 -18 -46 -6 -22 -31 -35 -17 -12 -14 -2 19 39 56 44 0 -8 -39 42 -1 25 70 29 -4 25 -17 28
6176 28 -6 -2 35 -16 -26 24 11 -24 -4 -67 1 -27 7 30 -57 -26 38 34 4 -25 37 19 -20 10 -5 -19 -13 24 10 8 35 47
6208 47 64 -36 -34 -67 -15 -19 19 13 -21 -16 -12 5 25 -24 21 29 -18 -52 21 -45 -23 -17 -15 -70 36 -2 -4 -22 15 -4 -12 -1 8 9 20
6243 20 58 29 -3 0 -33 22 30 9 -2 -33 23 -10 13 -29 17 -50 34 5 -14 24 42 -9 -57 53 15 16 -23 -11 -11 7 -26 -1
6275 -1 9 21 17 41 -1 23 9 -35 20 61 -11 -64 -20 12 -8 -6 -4 82 17 30 -47 38 20 38 18 52 31 10 34 -4 -25 -110
6307 -110 -23 0 -12 -25 50 -36 -16 10 19 -45 -3 25 -6 0 -5 28 38 28 -2 28 36 -16 18 13 27 38 -43 -18 -28 -11 -13 24 -13
6340 -13 -49 -43 56 -19 -44 41 -15 -37 3 -25 25 -4 -1 -30 9 3 19 23 64 -9 -15 19 -11 4 31 1 30 -19 11 -9 11 -43 -21
6373 -21 6 -50 23 5 20 -16 33 -41 -2 -19 70 -7 -24 75 0 -21 14 -31 1 -14 -9 -42 -5 -34 6 -25 -55 -24 1 -21 -2
6404 -2 67 -21 -19 17 -18 3 -19 35 17 -28 -82 -16 27 -3 20 14 40 10 32 41 -10 -14 -4 17 35 -28 -30 -7 2 -36 1 -15 -29 -5
6438 -5 -23 30 -36 8 -32 39 -9 50 -25 18 3 40 50 -12 4 12 16 -29 24 -14 3 34 3 17 -6 -31 -15 3 0 17 12 28 36
6471 36 25 3 42 -66 -52 74 -30 18 5 -23 8 1 -46 50 77 44 -3 -35 45 39 -16 -21 6 -3 -48 20 -29 5 20 -16 27
6502 27 -8 8 -20 -14 36 2 5 14 43 25 -18 -15 8 26 -45 -25 -49 38 -4 -39 -25 32 22 6 49 35 5 28 -29 -6 1 -30 -2
6535 -2 23 5 -2 -19 -13 21 12 24 -11 -9 0 61 -4 -31 -20 7 42 47 -13 0 -45 -21 53 -74 -5 -14 -19 -37 3 -20 -20 35 -22 -24 20
6570 20 -24 37 -21 -7 -6 16 -33 12 -3 -9 -32 -7 -19 -15 -48 -23 -7 31 3 -65 -56 20 -43 -39 -51 -56 -13 6 -24 -37 -32 -2 -8 -13 34
6605 34 22 22 -23 -18 30 38 -34 -7 42 49 28 -5 -45 23 35 -13 -8 34 -7 -20 -29 23 -25 5 49 4 -96 13 21 -32 -28 8 37
6638 37 28 22 19 -17 -19 -5 -77 -14 7 -14 -3 -54 37 -52 9 2 -34 -14 2 21 -18 42 -45 -37 -16 -34 -26 -36 -40 -57 61 15 -14 63
6672 63 5 6 -44 26 44 -3 15 13 -39 17 -72 6 -4 13 14 -48 -4 -11 -55 -13 -35 -13 -9 50 14 -11 -26 71 33 -6 54 0 35
6705 35 -14 -95 -27 22 -13 -6 35 -6 23 -17 -11 -18 47 -26 24 -5 -35 -59 26 -17 -6 -15 -95 -38 -10 9 20 7 3 42 10 46 19
6738 19 25 79 -28 7 8 38 -83 -51 -10 3 35 -22 8 3 -10 42 19 -34 -31 -44 7 57 1 20 -29 -31 8 -31 25 21 28 -1 12
6771 12 1 8 -4 -11 23 -36 3 -4 -2 5 17 -10 42 13 -8 0 -7 -68 -16 -45 -11 -31 4 20 -46 -10 -16 14 7 -28 43 46 51 -15 34 -68
6807 -68 14 2 57 42 58 -37 1 -35 20 31 38 43 -10 -7 38 46 -11 -40 -4 14 3 2 -51 35 35 -13 -45 -53 20 -25 -21 -2 -58 -26
6841 -26 19 22 7 42 28 -32 9 -63 -2 2 -31 23 -43 2 20 44 -37 -46 -45 10 5 -3 7 22 -12 -75 65 -10 6 -24 8 -26 31
6874 31 -14 33 22 51 -34 23 2 28 33 -31 -12 -6 -8 -14 -8 -6 -10 -4 58 1 -2 -46 -35 -45 11 30 -36 -8 6 -8 -28 -15 22 -17 7
6909 7 5 -10 14 -28 5 -17 1 33 28 27 -17 -9 35 27 -3 43 -7 -9 18 -25 26 30 -47 30 -50 1 -16 -15 7 29 -34 -11 -1 -50 -15
6944 -15 -32 16 -79 -3 -13 -19 -96 -1 18 30 30 -8 -34 -1 58 -2 -20 23 28 57 32 100 29 -27 1 -24 33 -3 46 0 -22 -30
6976 -30 -35 -3 -6 -29 22 -6 -16 -26 44 47 -70 -73 33 -26 0 13 2 -29 -38 32 -15 7 -32 -32 58 2 -42 8 -34 15 -42 41
7008 41 26 -36 21 27 11 -28 -27 61 22 28 6 16 -13 -19 -28 15 -44 -9 7 -57 -40 -35 28 23 24 -6 -11 -27 -32 19 -7 -9 29 46 31 10
7044 10 20 -47 28 37 9 -11 11 -9 -25 11 -21 9 19 38 -10 -35 -40 13 14 -40 -8 25 11 3 -21 -60 -2 -48 -2 4 -9 48 23
7077 23 -70 -10 -45 6 68 -32 -1 27 -15 -26 -30 -16 0 14 -19 4 -15 -10 -21 -16 23 -12 -53 -10 14 24 -11 -28 -50 -19 -16 -12
7109 -12 24 5 -55 2 35 -16 57 -8 74 -34 -37 19 16 19 -7 -4 -10 -9 32 15 -3 -37 -15 7 20 28 -9 -27 -17 -6 -31 -37 -45 -17
7143 -17 15 -8 -26 18 18 -76 -61 -49 -14 -26 -31 -54 -52 17 -22 -56 35 -22 -6 -6 35 64 -12 -44 -1 26 -1 14 0 7 24 5 -23
7176 -23 7 -35 22 15 22 -46 43 -29 -27 69 -4 17 16 11 3 37 42 -8 45 -2 -8 -32 -23 24 -7 -5 -56 -36 50 33 20 0 19 24 -7 14
7212 14 -7 -12 7 -14 16 7 41 -75 -14 -2 -22 -34 -31 0 7 37 -53 -22 9 -52 -2 -4 -44 -1 19 -29 -5 -46 1 -3 -27 27 8
7245 8 -24 7 -2 -39 -20 -14 -6 10 -16 -58 -14 21 2 6 8 20 -2 -31 -14 -7 -19 15 -26 24 3 -3 -21 19 0 -27 28 -4 55 37
7279 37 8 -38 4 -58 -21 5 22 -30 -4 -10 7 5 47 42 1 5 -1 23 15 -40 -51 -19 27 38 42 -26 22 20 -16 -27 16 38 45 34 -1
7314 -1 2 1 26 -32 1 -36 11 20 44 -15 -8 27 19 -34 -13 1 14 8 -30 17 37 8 -52 -30 22 -42 -12 -4 44 58 30 -26 22 -4
7348 -4 -60 27 16 -8 31 -22 -20 4 34 30 6 20 -78 -54 -47 22 -35 -21 -20 -36 -30 -30 -7 -9 -10 -50 3 12 13 -12 -45 -19 9 -49 1 5
7384 5 5 39 19 -3 39 8 -12 -38 -15 14 0 -15 -12 13 33 -24 13 -15 -33 -23 -12 -26 -15 -34 -6 -3 3 -6 -23 -20 -22 -1 2 -9 27
7419 27 -6 83 -5 -18 -30 61 -10 -49 -1 24 4 -28 1 -39 -21 -66 10 22 11 1 -24 29 -20 -38 6 -39 -33 -18 -30 -29 2
7450 2 -68 2 -24 16 -8 10 16 -9 -26 -11 19 55 -18 -23 3 -8 -28 -42 -3 -18 -10 25 -14 12 24 -10 -5 38 -25 -29 -6 -12 -21 5
7484 5 -23 -33 -46 50 -23 30 -31 12 -51 10 -10 4 -16 -58 -23 -14 -52 17 -45 -35 62 -34 -13 3 48 4 19 54 32 13 20 -26
7516 -26 -41 2 13 -25 11 -25 -2 -23 -41 -3 -5 -22 -65 -15 -44 -1 -28 -35 -8 -22 -56 25 -33 -35 56 -8 44 -11 -10 25 26 -11 -12
7549 -12 14 -4 9 -71 -24 7 -11 18 -17 23 9 28 46 -69 -17 -32 -34 15 18 21 -52 -28 -54 -9 -19 -7 -29 -47 -10 30 41
7580 41 28 -41 20 16 -76 36 -3 -21 18 -23 30 18 -14 -29 -48 -8 10 22 1 39 23 37 -25 47 -5 -1 -23 -7 26 -9 19
7611 19 -19 -75 42 -33 22 43 -48 -7 -39 -30 -28 -16 36 -47 -1 -23 0 -22 39 12 -60 -4 15 18 -25 -9 -48 35 -15 -32 -13
7642 -13 -27 -13 -4 6 19 29 3 -21 -22 -42 30 -12 11 -9 -59 10 -45 -33 23 -49 9 -7 6 -26 42 -33 27 17 -9 30 39 36
7674 36 -48 5 7 32 -6 3 13 8 34 0 -14 43 -13 28 16 -26 16 -27 -12 27 -6 -55 -23 24 27 86 -7 10 -3 0 -18 22 -19
7707 -19 10 -14 -4 4 8 34 -21 -58 -19 -27 15 47 -1 -17 40 -53 -21 7 15 29 14 -18 -48 21 -38 -21 2 16 -43 -54 29 -32
7739 -32 13 15 -13 55 14 -69 -17 -43 41 25 -57 -18 -22 4 -40 30 3 -57 -59 -18 50 28 10 -31 15 1 -1 -2 19 -33 2 2 -9
7772 -9 65 12 7 -24 59 -11 -17 -48 21 -42 -39 26 -16 -11 -46 -20 -7 2 -49 3 27 57 41 -23 3 24 -32 61 14 16 -13 51 33 -22
7806 -22 -30 29 18 3 -24 5 -20 -7 -17 -27 29 -47 8 0 0 10 -24 -32 -10 -5 15 2 30 28 26 -15 6 -30 4 25 32 -14 6 -6
7840 -6 26 2 -19 69 34 1 20 -19 10 -20 -28 5 6 35 7 -36 26 23 32 14 -22 51 69 -23 24 14 39 61 2 14 -5 39 2
7873 2 39 10 2 -5 13 -8 31 19 -6 -18 6 4 13 68 14 6 2 28 28 -15 28 29 40 -35 48 38 0 -5 -14 0 -6 -26 18 6 15 21 -45
7910 -45 66 -31 -41 -4 7 2 -13 9 31 8 12 -5 54 8 -8 -89 -29 11 26 28 49 21 29 55 7 54 31 17 -4 24 44 -14
7942 -14 -25 -45 -40 -28 -20 18 -9 5 -4 13 30 10 -5 32 5 -12 14 12 -15 11 30 -56 23 -11 -3 2 43 18 -19 -3 35 -24 21
7975 21 37 9 -17 53 -17 20 -39 -2 1 56 12 -36 5 1 -13 -21 -18 -36 14 66 3 1 12 -22 -33 -19 26 -5 -1 -1 -8 5 42 13
8009 13 13 -2 -6 -39 5 -13 58 44 -42 -18 -11 -4 -19 18 -74 -2 44 23 -7 33 -44 -2 -15 18 8 12 -22 -12 38 10 -8 -4 3 7
8043 7 -28 -16 39 23 -23 -41 -13 -55 -22 -14 -10 -75 -15 5 23 30 22 31 -2 37 -54 -23 -19 -1 -24 -66 50 1 -9 -4 37 0 -33 -17
8077 -17 -47 36 11 67 -11 4 19 34 -1 -56 -72 -23 24 -36 20 13 -5 35 46 2 -1 28 45 -14 -24 13 15 16 -41 -4 -8 0 -1 -29
8111 -29 5 -70 -30 -23 -12 48 -2 4 -19 -33 -33 36 -16 36 10 1 56 12 0 -6 52 -31 -7 56 36 -30 58 39 -29 40 15 11 8 -39
8145 -39 -4 22 -30 -21 25 -27 27 47 38 -8 -34 -5 10 -7 4 -64 -56 4 -1 -35 -33 -18 46 20 -13 12 -3 20 -16 -5 44 -33 -7
8178 -7 28 -56 41 13 -7 -28 -18 18 3 12 10 27 -47
8191d7
$$ Imaginary data points
##PAGE= N=2
##DATA TABLE= (X++(I..I)), XYDATA
0 0 0 0 0 0 0 0 0 0 0 0 0 0 0 0 0 0 0 0 0 0 0 0 0 0 0 0 0 0 0 0 0 0 0 0 0 0 0 0 0 0 0 0 1 -3 4 -4 5 -5 5 -5 5 -5 6 -6 8 -8
56 -8 9 -9 10 -10 12 -11 9 -7 0 13 -44 127 -414 2324 20003 -2186 -12779 8486 4092 -11136 -1618
77 -1618 7013 -940 -4012 -1731 -659 2056 642 -3310 647 1550 -2776 2095 5682 -1163 -2189 1116
93 1116 -1072 -262 2986 1259 -664 -657 -434 1192 2147 -250 -1467 139 -333 -1347 398 25 -1880
110 -1880 -1697 -1930 -6 3043 -387 -2710 1491 1256 -1931 377 2199 -650 -2136 99 2002 1629
126 1629 403 -528 58 1294 550 343 1688 298 -2099 -1753 468 1466 -1501 -2672 1155 771 -2331
143 -2331 969 2301 -2478 -2467 961 534 -147 485 -989 -1144 1070 466 693 3205 -278 -2857 2455
160 2455 2186 -2175 1437 2041 -3605 -1424 3154 283 -1430 451 -744 -1197 863 80 -426 600
176 600 -2459 -2989 2400 1333 -2581 553 1180 -1958 446 2532 352 192 25 -1225 750 2241
192 2241 -522 -921 1445 -214 -1260 1909 1454 -1463 -721 -259 -169 868 -535 -1315 0 -1285 -1737
209 -1737 1289 1412 -1596 -1029 1226 95 -684 1113 571 -1022 -278 606 1060 963 -708 -398 1280 370
227 370 -58 1356 749 -1501 -1371 872 901 -1114 -843 296 -680 -1193 371 892 -646 -1447 -74 714
245 714 285 -202 -673 -217 218 -576 713 2434 -300 -1644 1208 1292 -295 794 911 -1094 -785 502
263 502 130 153 414 -1442 -856 1365 -252 -1011 849 -845 -2190 535 1067 -700 -431 -293 -741 457
281 457 942 244 759 392 -1469 379 2487 -205 -1046 1245 -113 -1085 1213 1064 -428 -277 -555 -245
299 -245 877 -142 -1370 -147 -156 -1495 139 1448 -970 -1434 479 -4 -38 1060 -21 -486 278 -207
317 -207 175 1526 259 -1045 443 1177 -130 176 1105 -441 -1112 381 672 -21 -513 -998 -449 127
335 127 -420 42 483 -881 -1442 84 1083 -21 -720 103 157 -404 311 967 596 -405 -414 802 1124 180
355 180 -123 68 -17 -169 117 830 277 -1397 -844 555 14 -292 94 -301 -1060 -582 298 401 -176 -718
375 -718 -505 518 409 -308 672 671 -1156 -13 1887 510 -519 326 85 -244 437 616 203 -96 -874
394 -874 -732 952 564 -1233 -238 308 -1286 -476 1043 -302 -795 -232 -427 448 942 -579 -381 834
412 834 -260 -535 1757 1105 -1565 -175 1285 -153 292 1120 -426 -514 133 -479 395 873 -1123 -1124 694
431 694 75 -986 316 234 -1433 -498 866 72 -92 -109 -770 18 746 168 669 603 -697 -413 1045
450 1045 826 -120 0 242 -194 -244 513 625 -201 -1071 -312 877 -1 -894 -44 -215 -1007 -261 585 487
470 487 -463 -966 -11 653 191 105 314 -66 -328 299 667 559 210 -259 -70 747 510 -308 242 -237 -997
491 -997 359 768 -540 -519 -210 -795 -123 621 -28 -284 -401 -1022 135 1124 -376 -783 918 -18 -1062
510 -1062 1299 1288 -852 -16 615 -122 844 749 -823 -157 447 -753 113 1364 -580 -1520 330 86
528 86 -663 555 -7 -1275 -156 111 -365 686 120 -1061 122 763 -134 369 763 -503 -506 852 793
547 793 134 246 -222 -298 396 99 382 609 -869 -1069 609 401 -506 -223 -130 -681 -470 165 331 -74
567 -74 -681 -595 418 749 -171 -127 333 -327 -182 748 795 182 -621 -258 717 422 -14 462 16 -698 -140
588 -140 479 86 -286 -512 -564 -80 275 -271 -105 39 -939 -320 1252 119 -757 281 -77 -568 756
607 756 827 -30 94 -85 -131 959 760 -639 -12 613 -762 -217 1204 -302 -1140 89 -108 -108 550 -443
627 -443 -867 140 -367 -605 835 353 -1232 -306 784 -53 171 878 -190 -274 393 98 581 692 -697
646 -697 -307 874 80 -196 562 -124 -1037 67 542 -79 -175 -487 -776 -133 221 -344 238 96 -1078 -124
666 -124 942 30 -243 188 17 -221 412 635 282 -174 -325 219 784 379 -275 10 -98 -475 189 627
686 627 9 -659 -788 -37 223 -196 -130 85 -609 -503 409 390 -103 -250 -310 60 573 382 13 280 -158
707 -158 -548 737 1156 -279 -242 307 -392 -103 742 10 -379 -194 -582 -12 571 -228 -720 49 -80 -649
727 -649 545 551 -859 -487 250 26 443 431 -273 140 192 -289 657 887 -540 -537 634 302 -304 429 131
748 131 -651 -168 183 0 326 -467 -989 216 270 -686 133 366 -883 -469 697 350 -238 -19 -59 -144
768 -144 469 407 40 316 -196 -407 633 706 -273 -95 217 -199 -164 336 238 -482 -771 -228 330 118 -231
789 -231 -372 -199 -427 -221 538 303 -347 -453 -43 419 263 13 328 89 -320 350 745 182 -199 -208 -17
810 -17 248 292 66 -122 -302 -554 -121 602 8 -747 -161 -170 -499 92 313 -214 -204 -269 -70 552 176 -397
832 -397 20 338 -56 229 772 12 -553 144 324 218 430 -118 -461 72 -185 -162 487 -77 -805 -40 193
853 193 -408 -100 257 -569 -512 458 152 -117 245 -403 -236 693 233 -116 526 58 -627 370 855 69 -173
874 -173 168 -203 -84 419 -1 -240 -37 -521 -336 567 -43 -645 -95 -86 -359 108 394 -170 -443 -16 327
895 327 299 224 132 -36 -111 -33 482 641 -87 -301 46 112 186 181 -16 -147 -313 -301 321 268 -414 -519 -188 10
919 10 -32 -38 54 -275 -475 -100 483 430 -173 -231 130 -51 136 665 254 -214 -22 20 303 416 -145 -140 153 -95
943 -95 -268 437 74 -774 -390 325 -137 -156 200 -398 -464 83 -106 177 402 -412 -393 515 290 -242 308 449
965 449 -335 7 654 211 13 4 -299 99 505 -229 -92 254 -605 -510 519 193 -455 -265 -138 -371 -74
986 -74 298 -35 -140 -178 -256 433 490 -253 -82 284 -142 168 708 222 -224 -98 51 258 254 -4 -149 -115 -276
1009 -276 -220 376 221 -593 -431 62 -66 -92 13 -86 -257 -283 87 402 83 -320 -127 170 255 223 286 180
1031 180 -171 -116 315 487 80 -229 -39 65 -225 150 294 -349 -415 -137 -81 133 -71 -445 -159 35 -186
1052 -186 109 470 -217 -589 180 493 19 197 276 -272 -46 214 179 451 105 -532 96 458 -219 -125 281
1073 281 -243 -598 210 356 -269 -225 -271 -426 148 165 -193 161 -120 -647 221 609 -84 -176 220 -18 -128
1094 -128 351 360 13 -26 -99 126 518 16 -380 140 -62 -449 220 316 -372 -467 -142 -46 119 -42 -214 -172 -158
1117 -158 -200 197 454 -121 -418 232 333 8 160 259 -74 -99 115 394 296 -196 -178 52 37 25 51 44 -233
1140 -233 -509 -76 341 6 -349 -292 10 -197 -95 281 51 -455 -125 276 242 212 -16 -193 104 96 99 453
1162 453 227 -414 -264 381 189 -47 139 -162 -439 -56 110 74 -2 -458 -401 368 62 -321 71 -52 -464
1183 -464 -58 495 169 -152 -24 -95 104 390 155 164 190 -453 -162 664 177 -316 92 3 -321 87 234 -221
1205 -221 -263 -177 -154 156 146 -322 -274 58 -316 -17 585 -10 -359 15 160 172 282 147 79 78 -47 87 441
1228 441 138 -386 -54 416 17 -108 157 -195 -454 -91 216 94 -238 -320 -202 -68 -49 173 59 -217 -222
1249 -222 5 255 233 42 -119 100 127 34 269 337 -188 -323 287 308 46 7 -87 -208 -140 -80 214 178 -471
1272 -471 -483 113 101 -166 16 78 -337 -247 227 223 105 -99 -238 168 370 20 166 257 -256 -124 488 301
1294 301 -174 -92 26 -94 80 149 -60 -81 -258 -403 215 271 -413 -211 174 -268 -206 304 115 -313 -109 60
1316 60 194 310 92 -159 140 139 -135 397 431 -325 -343 218 115 23 73 -75 -258 -187 -80 125 46 -405 -377
1339 -377 79 65 -149 18 21 -316 -87 284 258 80 -138 -95 189 147 176 275 141 -219 -98 262 319 -49 -240
1362 -240 -13 19 -75 -27 130 -129 -512 -149 250 16 -174 -172 -175 -119 32 185 252 -106 -318 149 379 79 47
1385 47 237 -30 -222 191 330 117 -73 -127 -59 248 71 -181 41 -138 -486 100 349 -150 -339 -91 -131
1406 -131 -126 159 94 -91 -52 -199 39 488 66 -274 182 221 -189 323 436 -199 -159 103 175 146 100 -188 -138
1429 -138 -130 -158 26 302 -256 -550 -8 119 -62 44 -1 -180 -123 -11 238 194 -49 -226 111 231 99 185
1451 185 248 -136 -276 199 369 85 -119 -144 -55 37 -83 92 109 -289 -372 33 172 -59 -263 -105 -37 -133 30
1474 30 210 36 -258 -112 219 205 36 101 70 -43 96 113 225 159 -240 -163 217 111 -90 100 -66 -381
1496 -381 -98 188 9 -231 -139 -133 24 114 -129 -35 32 -212 -106 504 241 -200 2 197 17 191 322 37
1518 37 -84 -47 -66 254 216 -215 -168 132 -196 -175 273 -48 -394 -207 37 38 59 -78 -165 -64 -3 28 237 90
1542 90 -319 -61 244 62 89 230 58 -89 -8 106 240 57 -251 -143 143 7 -134 113 -38 -437 -186
1563 -186 236 27 -132 -132 -97 -108 45 63 156 -40 -224 19 255 128 19 4 97 30 -10 238 159 -169 -202 52
1587 52 212 -1 -99 -20 -203 -159 4 89 20 -186 -296 11 74 -112 -46 76 -181 -151 245 207 -39 -126 61 33
1611 33 145 208 40 73 -42 -128 205 323 -176 -96 85 -70 -90 55 45 -220 -243 -80 90 120 -126 -213 1
1634 1 -32 -134 190 210 -232 -136 207 89 133 122 11 -41 82 -5 193 199 -152 -269 119 175 -61 8 77 -295 -184
1659 -184 80 30 35 -192 -254 -8 130 -83 35 69 -153 -250 250 352 37 -85 59 18 90 158 152 61 -109 -120
1683 -120 124 186 -66 -147 -3 -72 -132 68 78 -150 -263 -108 91 70 -78 -76 -57 -169 18 232 148 -43 -101 37
1707 37 128 111 20 80 32 -125 85 275 87 -137 -140 19 32 22 41 -76 -180 -220 -90 215 -4 -238 -104 2
1731 2 -76 57 174 -18 -136 -62 99 164 158 -39 -19 118 5 65 299 -18 -301 31 180 16 75 -50 -191
1754 -191 -130 -46 30 124 -62 -305 -184 155 -51 -76 128 -122 -259 117 212 20 -40 -13 10 172 165 121 167 -56
1778 -56 -175 38 305 -29 -163 -45 -129 -65 27 48 -22 -161 -233 -43 147 -72 -109 -60 -80 -51 46 149 22 -116
1802 -116 -80 130 182 142 -3 16 -41 -42 144 213 -75 -166 3 22 68 -50 -78 -49 -167 -128 136 52 -120 -192 -84
1827 -84 -24 38 71 17 -31 -125 20 194 278 -63 -79 128 29 0 226 138 -174 -81 92 106 99 -103 -144 -54 -32 -64 79
1854 79 59 -350 -161 159 -36 -47 73 -79 -138 33 98 152 105 -39 -177 166 161 -39 79 61 -199 -19 236
1877 236 152 34 -69 -117 -8 125 -36 -45 -95 -275 -111 159 48 -147 -127 -31 -114 27 233 43 -36 -52 -19 226
1901 226 181 -49 14 37 -11 82 249 82 -151 -156 4 131 14 -104 -105 -127 -131 -44 140 5 -252 -151 35 77 1
1926 1 11 -4 -35 -63 112 225 -5 -130 10 100 89 125 150 4 -153 -33 62 197 10 -146 1 -55 -156 76
1950 76 93 -152 -212 -12 26 27 -42 -165 -64 66 12 71 196 -74 -238 97 194 52 50 74 -71 12 21 83 81 -30
1976 -30 -143 38 127 6 -137 -20 -116 -138 69 89 -76 -179 -115 -82 85 77 23 95 -73 -95 165 211 14 -70 9
2001 9 57 2 191 147 -54 -84 -90 89 155 -80 -151 -62 -95 -97 78 33 -170 -230 -85 111 65 19 -51 -25 -7 -4 145 165
2029 165 -101 -90 74 115 95 53 -44 19 -110 27 164 52 -223 -158 5 37 49 6 -20 -128 -142 -8 84 58 -152
2054 -152 -99 -2 12 -83 207 94 -172 22 137 118 79 -12 2 13 70 128 142 76 -218 -129 116 79 62 -21 -142 -161
2080 -161 -63 17 -2 -49 -212 -79 82 23 -21 52 -10 -51 92 241 143 -60 -23 43 38 204 115 32 -20 -100 -6 92 70
2107 70 -137 -42 -41 -85 -22 54 -78 -167 -117 -54 47 61 -155 -100 4 -2 25 134 66 -95 -6 109 104 41 25 -8 -74 -42
2135 -42 133 69 -38 -188 -42 38 -24 -57 -55 -82 -155 -48 96 63 -155 -155 -13 -21 49 84 79 -14 -122 21 176 108 -51
2162 -51 -41 95 85 -3 131 64 -89 -127 88 100 2 -54 -91 -100 -5 -22 83 9 -152 -167 47 79 -52 -27 46 -66
2188 -66 -32 157 113 54 -57 -32 107 157 43 76 23 -136 -43 180 189 -6 -128 -52 -8 16 2 -79 -16 -85 -123 45
2214 45 110 -49 -140 -5 43 8 89 141 15 -109 57 125 127 50 -90 -12 -5 -30 154 111 -89 -94 17 71 -1 -67 -87
2241 -87 -83 -125 -30 131 -2 -206 -154 23 105 -16 20 12 -55 -34 104 193 46 -42 -29 80 84 101 103 -61 -62 -13 68 126
2269 126 -32 -85 -75 -21 -80 3 8 -57 -178 -61 91 68 -34 -49 -26 -20 26 133 167 -58 -81 -4 155 71 20 82 -44
2296 -44 -47 32 124 35 -57 -171 -2 44 -62 -44 -40 -117 -164 -11 112 29 -114 -67 11 -13 94 62 26 -52 -43 54 197 42
2324 42 -100 45 54 -11 49 121 -33 -97 -16 89 47 5 -105 -95 3 -49 2 88 -37 -181 -67 45 47 -29 40 -40 -84
2351 -84 34 99 98 -58 -16 78 114 49 61 56 -32 -61 64 135 38 -74 -138 -12 41 -7 -57 -40 -93 -167 26 102 -41 -106
2379 -106 -64 -57 28 29 91 54 -57 -79 180 127 28 -13 -27 -24 -34 125 107 -27 -82 -69 20 14 -80 -28 -40 -113 -97 97 51
2408 51 -136 -85 -32 25 44 15 1 8 -89 -4 177 144 -83 -35 24 59 70 143 31 2 -66 7 106 91 -82 -105 -40 -9
2436 -9 -73 28 -3 -179 -108 -5 42 8 -101 -41 -14 31 77 96 96 -95 -24 146 58 1 52 -43 -14 -1 105 57 -61
2463 -61 -124 -100 50 23 -14 -32 -69 -152 -63 66 48 -61 -113 2 31 3 49 61 6 -37 55 155 121 44 -11 16 37 90
2491 90 78 96 -46 -118 -17 128 -5 -79 -41 -140 -98 0 47 -19 -112 -126 1 68 5 -51 43 -37 -36 131 147 38 -23
2518 -23 41 90 119 77 -36 24 -52 -79 47 80 -36 -132 -63 46 -64 -19 1 -67 -83 -36 29 48 -30 -86 -22 42 -16 84
2546 84 111 14 -75 -8 152 90 -12 16 -24 14 -10 50 119 -97 -195 26 72 -52 9 5 -75 -55 5 75 22 -82 -73 60
2574 60 125 9 20 43 -43 -65 123 125 27 12 -52 3 9 5 63 10 -109 -80 31 37 -50 -51 -93 -76 7 5 14 -87 -158 -48 103
2605 103 93 -32 -78 -14 6 41 63 79 -9 11 6 135 19 2 41 -3 -44 20 115 41 -161 -74 3 5 47 -13 -51 -88 -100
2634 -100 -51 128 20 -107 -81 -26 14 51 68 34 -50 -6 48 86 76 -46 21 34 30 43 79 -29 -59 -13 74 84 -26
2661 -26 -111 -114 -89 -27 28 45 -66 -124 -29 98 23 -36 64 -1 -57 78 149 67 -62 -41 3 61 81 66 33 -33 -79 85
2689 85 76 -4 -68 -106 -35 6 22 49 23 -70 -119 16 72 1 -59 -27 7 23 85 75 52 -76 -9 52 112 27 -33 -30 -17 4
2719 4 65 64 -29 -117 -75 43 2 -32 -24 -71 -43 -22 68 64 -43 -49 0 67 33 45 45 -30 -42 27 100 101 -33 -8 8 53 13 37
2751 37 16 -83 -76 13 46 -38 -87 -97 -80 6 22 -44 13 -112 -124 29 106 4 -37 -7 -2 -6 76 126 50 -37 -2 38 113 34
2781 34 -7 -7 -40 -44 106 19 -22 -118 -26 6 43 16 -52 -95 -56 -52 77 58 -75 -28 -61 -2 12 43 79 -44 -11 57 102 78
2811 78 -3 -19 18 -12 75 125 -4 -109 -128 40 70 75 -29 -14 -80 -116 2 107 -11 -33 -60 64 68 21 29 -35 -10 -66
2839 -66 66 174 18 -41 -4 93 72 67 45 -59 -96 -30 9 26 -91 -89 12 -7 -50 28 57 -31 -72 -21 88 74 9 10
2867 10 -45 30 42 96 72 -15 -51 33 104 43 28 -27 -47 12 1 32 -35 -75 -91 -21 5 8 -67 -14 -94 -103 27 88 37 -76
2897 -76 -50 46 70 59 28 32 -19 -46 82 105 6 -25 -1 37 36 62 70 -25 -109 -86 52 48 -57 -104 -35 -60 -22 61 8 -73 -100
2928 -100 -48 22 -6 54 33 0 -47 -9 111 114 -9 -83 10 88 74 26 -27 -53 24 13 66 34 -77 -81 -61 10 27 11 -34
2957 -34 -77 -78 5 46 20 -93 -35 28 28 28 51 -14 -73 5 45 104 -9 -32 -5 1 60 39 32 37 -47 -48 0 43 -32 -77 -52 -10 -55
2990 -55 -6 61 -38 -79 0 3 57 39 45 -6 -90 76 127 53 -61 -17 63 52 18 -9 -4 -34 -66 -14 37 12 -108 -116 -8 -33
3020 -33 -20 32 -25 -107 -76 57 57 37 -2 -28 -18 8 96 120 59 -21 -15 23 77 83 13 -2 -11 -23 40 66 -39 -98 -4 20 -30
3051 -30 -23 -84 -43 -45 1 57 73 -55 -76 9 5 62 44 -1 19 -21 30 46 77 -20 -59 -8 2 21 30 -40 -113 -73 -25 57 -12 -62
3083 -62 17 -37 -31 -13 -16 10 -97 -71 29 68 51 -32 23 -17 21 62 110 33 -34 12 10 23 40 30 -49 -67 -11 51 55 -3 -47
3114 -47 -28 -34 -28 -7 18 -51 -56 -12 56 86 15 -61 24 33 14 70 19 -23 -32 12 64 76 -28 -60 -77 -28 15 83 20 -97 -109 -45
3146 -45 22 19 17 -35 -46 -72 -19 51 24 -62 -6 63 49 13 -15 0 17 -16 70 60 20 -21 -14 -30 8 66 7 -32 -50 -85 -18 21
3178 21 -50 -51 -90 12 -22 -39 53 -10 -89 24 61 78 -59 -55 0 25 96 127 34 -31 19 28 82 62 21 0 -12 -37 21 31
3208 31 6 -109 -74 18 103 -4 11 7 -63 -65 28 31 60 -43 -65 34 90 54 31 21 20 -32 99 62 47 -26 -37 -32 11 38 -15
3239 -15 -22 -108 1 22 19 -36 -106 -14 -69 -36 68 43 -68 -3 18 42 117 28 9 -6 -61 42 97 53 -36 -24 -3 26 86
3268 86 46 5 -32 -79 20 43 -1 -51 -6 -37 -1 31 5 -5 -47 -16 29 11 -11 -31 -37 15 36 34 49 13 -56 14 50 66 25
3299 25 -4 20 -38 -14 9 8 -53 -93 -80 32 11 -36 19 6 -48 -6 75 84 22 -6 42 26 95 38 74 -13 -1 -28 68 72 3
3330 3 -24 -16 -2 10 78 -10 -18 15 18 43 3 -75 -108 -72 -44 -12 16 -26 -53 -35 10 12 56 1 -31 -26 6 72 101 78 -75 -37 43
3363 43 -4 -42 -20 23 -45 -16 31 27 6 -39 -2 31 -1 -50 -12 -44 -55 -18 32 49 26 -59 4 61 53 -17 46 8 0 32 7 85
3395 85 -52 0 -27 -21 28 22 -2 -60 -91 -24 45 13 -4 -35 -85 -35 -1 44 17 -3 -23 35 61 33 -49 -17 -20 61 34 30 28 -30
3427 -30 -22 -8 93 56 -8 -1 -25 -55 33 32 -17 -28 -51 21 -28 2 3 -21 -98 -2 105 76 3 25 -1 29 103 68 20 8 -59
3458 -59 -4 60 69 -41 -14 -33 -47 -1 6 -10 -59 -51 -75 16 23 -36 -45 -20 15 19 9 10 -40 3 7 17 24 60 -1 -8 16 34 92 44 2
3493 2 -25 18 -5 1 5 26 -87 -57 16 29 -41 -74 -13 -44 -11 -9 65 -38 -44 -67 26 50 -20 -3 -66 -47 -6 30 8 1 -34 4
3525 4 42 -21 12 -8 0 20 -13 41 19 -51 -34 31 60 60 33 32 -22 -35 -5 37 43 22 -26 61 43 35 33 14 -8 -70 39 48 26 -3
3559 -3 -7 31 36 -1 11 -43 -65 -63 -6 56 -84 -42 -41 -50 16 42 60 -10 -98 -31 62 89 9 2 25 -32 -17 75 45 9 -55 -52 -9 6
3593 6 -1 -31 -49 -40 -65 42 5 -5 -76 -75 -14 2 16 -16 -25 -53 46 111 35 -34 28 50 51 21 82 57 26 -11 -2 81 1 7 -42 -17
3627 -17 -2 -23 27 1 -42 -46 -32 -11 0 -29 -18 16 -42 62 32 -11 -42 -12 18 69 34 2 22 -61 0 36 65 -23 -23 -22 49
3658 49 -33 14 19 -67 -10 -13 9 -68 -47 -39 -23 -1 36 10 75 -58 -49 -5 34 -2 -17 3 6 11 3 35 -32 -34 -23 54 54 -51 7 4
3692 4 -23 45 -37 11 -36 -40 -18 -6 7 -6 -61 34 17 -77 54 62 40 -20 -15 40 44 -8 27 31 -35 28 16 20 -18 -15 12 -44 -7 -45
3726 -45 4 -59 -92 -29 18 -48 -13 -59 -91 -18 16 56 30 19 -13 21 73 66 -21 29 -30 55 34 163 60 -70 -34 11 8 -25
3756 -25 -2 -79 -60 -45 57 9 -58 -63 -34 3 -3 -7 -3 -30 -90 -25 42 -5 44 -31 -5 25 29 53 70 14 -52 -33 111 50 0 -47
3788 -47 18 -38 1 48 -1 -7 -70 -18 31 -40 -6 11 -59 -17 25 21 37 -46 -30 11 19 24 24 15 -13 -34 28 68 22 -62 -82 7 -6
3821 -6 22 23 -38 -83 -48 26 11 -6 -72 -1 7 -8 10 -38 9 -50 -13 50 75 33 -2 58 53 30 20 5 26 -58 -30 0 -25 -14
3853 -14 -30 -10 -37 -7 36 42 -13 -62 -13 -39 -46 3 -67 -52 10 -2 62 29 14 12 -12 -9 23 33 11 -33 15 45 57 38 -47 -62
3885 -62 -43 -54 -28 -45 -32 -84 -73 -26 22 30 -52 -13 0 4 5 72 -22 -7 15 32 53 -2 16 23 -33 -44 53 64 -16 -55 -25 64
3917 64 11 -12 -17 -20 -23 -26 -7 -24 -29 -50 -30 -26 10 6 24 -28 -29 6 43 -41 18 -84 -2 55 24 79 -32 -15 -55 69 -8 30 -68
3950 -68 17 -60 -24 10 -75 -6 -17 -46 16 82 44 -9 -28 4 -32 -36 43 -39 -36 43 36 35 -23 -26 -49 43 13 2 44 -35 6 6 7 16
3984 16 -14 12 -31 -115 26 18 30 -36 -102 15 15 -14 -5 8 -27 -30 67 55 26 20 27 -18 43 86 44 -8 -32 4 16 61 21 -14
4016 -14 -17 -39 -47 10 -22 16 -52 -60 21 5 -32 -51 17 2 -33 64 29 70 -32 28 59 24 28 33 -9 -36 55 8 22 -33 -17 -10 28
4049 28 -3 -1 -18 -21 -15 -4 -11 14 -54 -47 -14 -8 49 8 13 -19 1 15 91 11 17 -2 64 -11 49 45 -20 14 -53 -6 15 5 -28 13 -74
4084 -74 -91 6 9 -1 -45 5 -24 -33 23 34 44 -34 -12 36 29 16 -49 -17 5 9 43 -11 -32 -28 -30 -22 -6 -26 -13 8 14 -9 4 29
4118 29 -2 -38 2 50 75 -37 -22 -12 -8 26 39 -4 -30 -10 -13 44 -13 32 26 -47 -33 -25 69 39 -22 -76 33 27 -29 9 17 -105
4150 -105 -14 25 29 -2 -41 -41 21 47 26 -4 1 -27 -15 -14 12 60 30 -38 -47 -15 62 55 -16 -48 -26 50 -54 -10 -39 -92 -3 -38
4182 -38 68 28 -104 -25 -57 6 -26 44 8 -40 -25 24 -19 -4 -18 -12 15 30 16 36 90 -69 -31 -20 74 4 -39 -48 -8 -35
4212 -35 7 2 9 -53 -46 41 29 -5 -49 -36 -12 -9 -12 -14 17 -63 -12 24 -1 22 -38 18 15 -39 49 28 -16 -44 -45 -3 -40 -21 -30 -41 -25
4247 -25 -3 23 27 -19 -5 -6 0 43 1 86 -28 -20 32 -1 23 56 1 66 -44 8 95 -57 -87 -53 25 13 -27 -10 0 -15 -38
4278 -38 -21 9 -51 -83 -46 39 77 39 46 6 -24 61 30 12 38 -19 21 26 21 31 6 -1 -45 -5 40 57 -30 -44 -53 -66 -9 15 36
4311 36 12 -31 -5 34 24 -18 -64 -54 -42 50 47 60 -32 -38 0 63 28 20 32 -41 43 -25 35 3 -19 -2 -41 0 23 -18 -20 -61
4343 -61 -58 54 -23 12 -51 -49 -34 -40 -20 58 -55 -21 39 -7 58 -18 -14 4 1 13 51 5 -11 -95 9 8 -42 -35 -73 -28 -36 -44 -12
4376 -12 -21 2 -52 17 -34 -13 -24 16 -19 -34 -18 -37 82 -17 -50 -24 8 28 -27 -5 -38 10 0 -22 8 -54 -17 14 -5 17
4406 17 6 -12 -66 -17 5 42 -24 -28 -23 -43 17 31 -4 -24 -3 -21 25 56 29 5 -24 11 -64 53 46 -47 -60 26 -4 1 -6 4
4438 4 0 -96 -10 27 29 11 -109 8 0 -34 40 43 -23 -40 -25 89 -3 -9 -10 32 0 41 -7 29 2 -26 4 22 73 -98 8
4469 8 9 -18 15 7 -44 5 -47 -5 49 -13 -30 -26 1 25 40 25 -7 8 -19 19 63 -4 -23 -32 0 -40 -12 -2 -22 -18 4 -13 80
4502 80 -32 -12 -29 -37 -34 37 18 28 -62 -18 7 41 26 -31 40 -52 35 -11 37 -20 -31 10 -24 27 27 4 -5 19 -3 35 19 14
4534 14 -4 -70 -59 -14 -9 -11 -24 -7 17 23 43 22 20 31 73 23 54 -40 4 -15 29 38 3 -3 -22 -17 2 51 -4 31 23 -8 -16 18 41
4569 41 19 -13 -11 5 22 5 -17 -6 31 -25 61 22 40 -15 -32 4 92 49 -13 34 -106 19 12 -27 1 -21 -20 25 -1 0 -14
4600 -14 -35 11 -70 9 -22 43 -8 -35 -42 23 62 -32 35 -12 -28 57 71 29 46 -72 26 22 13 9 27 -61 -71 -12 61 59 10 16 -69
4633 -69 -28 15 14 7 -36 -38 -2 22 0 2 68 -34 14 5 35 -32 18 0 18 10 44 -31 -16 9 65 -21 38 -33 -46 -7 -35 -32 -5
4666 -5 10 -70 -3 23 -27 -3 45 -52 -14 48 33 18 -38 35 61 -11 49 12 -27 -61 0 9 18 -3 -25 -29 -6 33 3 4 -41 -27 4
4699 4 -9 42 -50 18 -7 -28 -10 -18 -6 0 37 5 -32 36 6 20 -49 -23 -20 66 -51 -38 16 -14 -6 12 36 9 -68 -52 9 21
4731 21 -37 -28 22 -1 -2 64 -13 -57 -41 -19 -3 8 51 30 -42 -53 40 14 33 -37 -4 15 -17 16 9 35 -15 -4 17 10 19 -20 -89
4764 -89 -13 43 20 20 14 -68 -8 40 10 25 -10 39 -38 -11 1 27 -40 16 13 35 -12 66 27 -13 -23 5 73 -12 -30 17 -46 10
4796 10 26 17 -14 -8 -57 15 -2 -20 -22 13 -46 2 29 18 -8 -7 -16 -14 25 -14 -12 41 -13 -41 31 -27 -13 -50 -23 6 23 -48 43 -40
4830 -40 -29 14 -55 -15 21 -14 -9 22 42 42 28 40 44 -27 17 -29 -4 -5 -42 20 24 -37 45 12 -36 11 -32 28 -19 -46 -18 -4 -1
4863 -1 -18 -13 -43 -4 1 62 24 42 16 -48 62 29 65 13 7 4 7 7 49 -1 5 -11 -41 25 72 22 -31 -20 -52 35 -25 -8 31 -8
4897 -8 -83 -8 49 13 -94 7 -19 0 14 -6 -9 -34 -3 -35 48 20 -33 16 -5 40 21 36 11 -31 15 14 71 14 -15 -12 -25
4928 -25 -16 -25 17 1 -31 -28 22 11 3 -43 -52 22 30 -10 58 -1 -9 15 -11 -83 -20 13 5 -31 32 42 -26 -38 13 3 -51 -59 -4 -37 -61
4963 -61 -21 26 62 -3 -36 -10 -28 22 44 29 15 -18 -66 -12 -6 36 29 0 -21 -7 35 -15 -37 -48 -22 -1 -13 -8 -33 -30 -48 -25
4995 -25 59 -70 54 0 43 -11 25 22 -46 7 -25 62 4 18 -10 34 -60 27 11 7 9 -33 -42 23 -1 -14 27 -71 -11 0 -28
5026 -28 -2 22 -11 -49 18 86 -25 0 13 -13 25 53 -35 52 -27 -21 32 -16 -33 13 1 -35 -24 52 13 -84 -55 -45 4 -50
5056 -50 0 -40 -3 -44 -32 23 -6 22 18 -34 61 38 3 0 -13 -66 -27 5 15 -33 -82 -59 -11 -11 34 -41 -27 -5 -30 11 4 -10
5088 -10 26 0 1 21 -19 -4 -9 53 -11 59 33 17 -25 -57 -18 41 -26 31 -14 3 -45 -11 1 -24 -7 -6 -4 52 66 -58 -63 -5
5120 -5 -29 18 3 24 -5 -22 -4 58 -29 -1 18 17 49 -2 37 -10 -77 -5 -4 52 -23 11 -9 7 27 -31 -14 -52 -80 39 14
5151 14 -6 -28 2 15 -11 -1 -4 42 6 -32 18 -13 57 6 53 6 29 -32 9 27 -14 63 -3 -7 20 62 -8 56 -33 -68 -13
5182 -13 48 44 -13 -11 -10 -61 2 -4 0 -44 14 30 36 -21 -2 18 -28 -39 55 33 -27 -15 -17 20 -30 -57 -9 12 16 2 17 -10 36 -31
5216 -31 -35 32 23 -34 -32 -30 -23 49 48 52 -60 -14 -16 -23 53 -18 38 -19 -20 -6 8 -46 -2 41 6 38 -11 1 -62 -24 26 0 20 24 14
5251 14 13 -3 19 102 27 -11 4 -33 -17 -2 36 43 -21 -21 16 2 60 46 7 29 -47 42 50 -4 8 65 43 -24 -22 10 33 -6 -33
5284 -33 19 25 -39 -47 -26 25 4 7 32 -37 -5 -19 42 33 -19 -81 -1 -10 22 7 23 3 14 14 29 25 -9 18 -21 9 -51 -17 35 -28
5318 -28 -28 1 45 14 19 -45 24 -10 3 17 10 -49 -12 18 57 67 31 19 -15 17 0 -27 14 -17 -22 -20 24 9 -11 51 37 -40 11
5351 11 13 -22 -24 8 21 71 4 -18 -24 -13 10 4 -20 -31 5 -37 1 46 -5 52 -5 -44 -26 -18 -9 -28 19 -1 23 14 -2 87 14 -45
5385 -45 11 -4 -14 26 -1 -4 -1 8 23 12 12 -51 16 21 17 -28 -29 -57 23 0 -33 -29 -7 -33 -26 39 -17 3 19 -22 -11 20 28 -7 6
5420 6 4 30 -8 43 7 14 -31 -27 25 -19 -10 19 -80 -34 48 6 43 -72 -2 -46 -9 -10 -5 -18 -20 55 -58 29 -7 13 -40 18 22 56
5454 56 8 5 4 -37 18 15 -15 -1 55 -2 -22 69 8 22 -24 -36 -12 -24 -30 6 16 -25 -5 -24 -19 7 -4 -37 23 17 38 -23 -33
5487 -33 39 -41 -38 40 2 14 20 37 -19 2 -5 -46 2 11 59 31 -19 -31 -57 6 24 8 4 -4 19 62 33 -12 29 14 14 19 -44 -12
5521 -12 -11 -7 -2 17 8 -31 -4 -1 -28 14 34 -2 2 -15 -16 2 -50 1 -9 -63 2 8 59 -5 -43 -13 -17 8 19 9 -35 0 8 1 51 -21
5557 -21 30 22 6 -4 82 -12 -25 -56 -22 -75 -42 79 -44 -39 -5 25 5 4 -64 1 18 -14 6 1 -34 -9 -13 -47 -28 -13 20 2
5589 2 -19 -13 26 6 -8 28 -24 25 -3 27 -5 -43 -10 3 53 -12 -3 16 11 -10 -60 34 19 2 17 -24 31 -24 -6 -24 -27 95
5621 95 3 36 -71 -48 -2 -1 9 65 -24 -6 -3 16 6 -27 -9 -72 6 0 30 2 32 1 3 -10 54 33 -27 12 27 59 -1 16
5653 16 -20 -12 7 21 -32 -42 5 24 -37 -7 -8 27 -25 -8 0 -28 -23 15 -39 -33 9 10 -11 1 -1 9 4 35 10 22 29 18 36 -4 -40
5688 -40 29 -24 -42 0 -35 14 -11 -40 -24 -42 -11 68 3 1 -17 -24 -33 -30 -13 -10 -11 -23 1 1 -4 -4 -50 20 44 16 18 35 -7 -30 -14
5723 -14 2 27 51 -57 -17 22 -33 30 -21 -19 -15 -32 9 -4 -10 -38 -14 -30 -25 6 35 10 -16 -11 -14 -21 4 25 -5 -1 -13 6 9 -1
5757 -1 -4 15 40 31 26 -18 20 -19 -43 -15 2 11 7 22 21 9 -10 -4 -35 -14 -33 -38 -19 5 -27 -7 8 0 0 -15 -19 -14 17 -18 -17 -43 -47 -10
5795 -10 11 -12 15 22 11 24 17 -1 7 16 26 12 7 20 5 -44 -8 10 -16 -1 16 49 -11 5 20 -21 -28 -35 31 -40 -10 -1 -3 13 -57
5830 -57 -38 -54 -45 36 -1 -70 6 -4 -1 35 -43 14 4 22 31 17 -1 0 18 -6 -34 -14 24 -8 -32 9 -12 -23 10 -6 19 -20
5862 -20 46 -17 -18 -33 -45 17 27 48 -27 -5 8 -9 -6 -3 21 47 -3 -18 -6 22 24 -54 -47 10 -55 1 -34 -28 -37 4 -22 18 9 -27
5896 -27 -36 -4 -3 -8 -19 -25 -68 2 -56 28 -31 -33 -17 -11 7 -6 10 -32 17 -1 -36 16 -23 -32 -17 14 -1 42 -10 -42 -19 -38 4 -13
5930 -13 -12 62 18 -13 66 24 19 35 -41 -18 5 39 -6 11 -3 -16 5 -14 31 -24 -15 -9 -22 14 -15 -7 -24 -39 5 53 -27 -19 -19 -13
5964 -13 -2 -3 0 -7 18 3 41 0 38 11 -4 -1 -9 43 18 15 12 9 -23 -28 -42 4 53 -24 -46 14 -24 4 -74 -49 -19 -14 37 -16 5
5999 5 8 -11 12 -10 4 -54 28 26 -22 -46 -23 -16 21 -23 12 15 -10 53 -5 -34 -12 -6 -7 7 40 39 3 -7 -22 -14 -16 -26 -28 18 9 -19
6035 -19 -21 26 10 26 52 4 -48 -15 -40 11 -48 -50 23 22 -30 -23 8 -25 -87 -4 22 -1 8 -8 -2 5 4 -31 18 44 -23 -61 23 0
6069 0 2 -52 22 18 -22 7 4 -18 -54 17 2 33 -9 -20 -29 -8 1 16 -30 6 -9 11 37 11 -23 11 27 -10 22 -9 -59 62 9
6102 9 -26 4 17 19 18 50 -12 -29 -13 11 -70 20 -13 -34 3 -6 -5 -22 -12 -2 27 -33 -33 12 22 18 -5 -27 13 -33 12 15 2 19
6136 19 13 -8 -20 42 -40 34 -64 1 -5 28 8 7 -37 -33 47 -4 -34 -20 52 -9 -13 -22 13 1 -26 -24 12 -33 32 11 27 -32 41 6
6170 6 22 34 -49 -6 36 2 11 -1 17 37 21 38 6 -18 2 -4 20 -25 22 49 -80 21 6 32 -14 63 -20 -17 -37 -12 -1
6201 -1 9 -24 4 -9 19 -57 -25 7 -33 68 24 -14 -17 -67 22 -21 -4 55 1 0 -31 33 -26 -14 -31 8 -3 45 78 44 24
6232 24 -24 24 16 -5 -50 -36 40 -47 16 -4 24 11 -47 9 -32 6 -97 -6 13 -3 9 -17 -5 -54 23 -1 15 -30 14 12 -22
6263 -22 10 -17 19 -33 35 -39 32 -1 19 27 -7 -16 -23 -13 -11 40 -65 -6 14 24 0 43 -11 -56 -19 16 -3 20 -20 -9 -32 29
6295 29 -10 41 -29 40 -26 -26 37 -11 31 17 16 -9 -27 -17 0 23 -38 -21 59 -50 -9 -30 -32 3 -6 26 -16 -13 17 46 -3 14
6327 14 18 -12 -16 1 38 -32 -19 -33 -15 -21 -52 -3 -58 51 -32 8 -9 -34 -50 11 -47 -27 28 17 -4 -37 -77 20 -3 -43 -2
6358 -2 18 -19 -38 4 -38 10 7 -16 -62 71 29 20 31 0 -2 23 -37 -43 54 -43 19 36 52 14 16 -18 -12 51 44 -1 24 -21 -27 56
6392 56 -4 52 -35 -65 71 32 28 -49 26 -22 -5 -51 12 -8 -6 9 -38 -21 -12 -2 2 12 5 25 -38 22 -34 -45 -48 -10 13 21 5
6425 5 -30 -5 12 -13 5 0 -33 8 67 -10 6 18 -18 -24 -41 0 36 34 -33 -7 63 30 1 -42 35 -6 -16 9 -20 -76 8 -20
6457 -20 15 19 -3 -53 -2 3 17 83 -9 57 -4 9 -37 -61 43 11 -15 -1 17 36 30 -30 17 -14 7 12 7 17 49 38 -9 4
6489 4 25 -29 -5 4 -14 -18 -73 37 -10 -20 -20 43 -39 12 -15 -9 -36 3 -52 -5 45 -22 39 59 -18 19 -15 -28 -47 -6 34 21
6521 21 21 8 51 33 26 -2 -35 -31 32 37 -4 -36 -8 -11 -4 -19 -18 -3 21 16 17 -6 -28 -19 -17 3 -1 60 4 24 -19 -4 -6 -3 35 -17 -39
6558 -39 -2 49 28 -12 9 -14 37 7 -9 44 46 -20 -6 10 22 -19 -10 32 -34 3 15 27 -5 -42 2 4 -21 17 -33 7 -28 23
6590 23 17 3 -56 -88 -12 -10 38 29 25 -4 -16 26 10 1 9 -38 2 -56 -6 -6 -50 -55 -35 9 8 11 -22 -11 -69 6 -12 28 8 -19 -31
6625 -31 -31 -1 33 -7 18 2 9 11 23 -1 29 -16 -2 -10 12 -4 52 20 -44 -10 6 14 -11 45 -21 -5 18 -32 -32 -32 -12 12 -20 46
6659 46 8 0 -15 35 28 -2 13 -40 -19 -2 23 36 11 -16 -2 50 36 -20 35 2 -22 28 37 -35 6 48 41 36 5 -13 15 7 6 -23
6693 -23 29 56 -32 -29 -18 19 -27 -58 18 1 -60 -1 -22 3 -22 -9 51 38 50 -18 18 -11 2 38 -13 14 -18 7 -12 -11 34
6724 34 8 -56 -7 -8 -20 -2 36 25 -44 31 28 -4 -29 -28 5 42 -12 -6 -3 2 14 55 -17 18 18 38 -10 -24 -6 35 67 -35 -52
6757 -52 3 42 -61 -12 19 5 28 -39 -48 15 -37 -6 33 -43 50 27 3 -6 2 36 13 -3 11 -10 -9 -38 42 2 -59 -36 -35 -4
6789 -4 -1 -59 -24 -52 -36 -12 -26 4 -19 -39 31 -43 -7 -33 -17 -40 33 12 -34 45 46 0 16 17 20 -15 16 -49 4 -1 21 5 17
6822 17 -4 -27 65 37 10 -24 -23 -7 27 -51 6 -5 -25 -59 -19 -1 -15 -16 7 -11 19 -60 13 -30 32 -10 -25 -39 -36 18 42 55
6854 55 2 -6 -68 -18 -2 18 -12 12 45 -16 -17 -42 -20 -71 6 31 29 10 23 32 -2 -13 -31 -22 -34 36 -17 -10 7 -43 55 39 2
6887 2 -29 -39 -3 25 9 -75 36 -4 -16 12 -9 28 45 -14 -4 0 -24 -37 13 -34 73 27 8 49 0 12 -8 -3 17 32 -42
6918 -42 -24 -34 -14 -17 39 -23 0 -19 -34 -7 11 -27 8 -32 29 -19 -8 52 -15 34 -1 47 44 -20 -9 40 -40 40 -11 29 2
6949 2 -50 36 26 -5 -13 -24 -10 27 24 0 -5 -33 -3 10 8 14 23 1 34 30 18 -47 44 4 -3 14 33 5 -31 -41 14 28 42 9 -20
6984 -20 18 -19 -2 76 -58 -10 -60 -75 -3 -51 19 34 13 -63 -47 32 -36 33 -17 -2 -13 -9 21 -22 -32 -26 24 -26 -26 4 -37
7015 -37 -20 27 -29 23 3 -49 -28 -8 2 11 -5 15 -1 -25 9 -3 21 -31 -42 -18 56 13 -14 61 -3 -43 51 32 16 -1 -4
7046 -4 -1 31 45 -20 -20 3 1 -45 55 10 6 -35 -1 -38 -19 67 -22 7 -52 -10 38 44 2 30 -8 -38 4 10 31 -33 16 41 -43
7079 -43 -5 27 -4 20 0 29 41 5 -49 -59 -25 25 -43 -4 -2 38 -28 -32 2 10 11 -31 24 47 -19 30 37 20 2 53 16 6 -18
7112 -18 -2 28 10 -21 -61 32 6 -20 -32 42 5 -37 -49 14 11 7 11 -24 -21 -37 32 39 22 -15 65 -17 -32 -40 -8 -33 0 -6 -20 3
7146 3 13 -15 17 -29 5 -31 41 6 27 49 11 -10 -17 38 -1 -51 11 -10 -14 -2 3 43 -11 8 -17 -37 11 34 30 24 -14 -42 -46 -12
7180 -12 -3 84 55 29 -7 -1 30 31 -16 -24 -14 11 -23 34 31 -1 -30 3 25 7 12 21 -41 -24 78 26 36 4 21 38 -47 -22 -49
7213 -49 -38 -12 -7 -8 -34 31 -19 -6 19 20 12 -1 10 23 -17 -11 56 37 24 -18 38 30 -16 -17 -10 0 -17 25 -37 -50 8 -73 -8 -9 -11
7248 -11 -34 -26 -27 10 -14 0 23 34 17 35 13 23 25 9 -46 12 31 15 -24 12 24 -3 31 -23 12 14 -22 31 -14 -45 -56 11
7280 11 30 -3 -3 -21 15 2 -12 -33 -21 12 0 -56 -48 15 -36 -14 33 -24 -41 -17 25 -20 64 -2 7 -34 -14 -40 52 20 -19 23
7312 23 0 -8 -42 2 -4 -11 0 -39 51 -29 -29 -17 -40 -9 9 24 15 22 -38 -16 -24 -18 -30 -48 -20 -54 8 -33 -11 28 -38 46 -17 -26 2
7347 2 5 -19 -12 39 -16 -40 -12 58 -12 50 -1 -53 19 14 48 -10 57 -19 17 -29 24 9 -23 41 15 -14 -16 2 6 -60 -93 -23 -30 -57
7381 -57 -18 11 13 -14 15 24 -17 24 -13 27 16 4 -18 2 5 -33 73 39 -22 18 -40 27 19 -12 5 0 -4 -42 18 23 -36 -6 -49
7414 -49 30 12 -35 32 12 -15 15 -32 -47 -48 -24 30 -77 -9 -57 -4 -4 7 -15 10 30 -9 40 5 32 -22 10 -40 -26 1 -10
7445 -10 6 -98 1 -6 -11 37 19 13 -13 34 17 -8 10 19 24 -1 -58 -39 -43 5 39 21 -15 18 35 -13 -38 -1 4 -26 -2 8 -22
7478 -22 -44 -9 39 -10 48 -41 -7 -32 88 -35 -40 -8 0 -12 -20 13 -1 43 -10 14 15 -3 28 -33 -33 14 -46 -31 -2 1 -11 1
7510 1 -4 15 -11 9 -13 -35 -15 27 -8 49 -12 14 70 32 -9 3 32 -7 3 8 34 -37 23 11 -1 7 -52 16 -4 -15 -21 -11 33
7543 33 30 16 10 16 -14 -30 26 -44 3 28 16 -16 43 -11 -68 28 -17 52 18 -15 13 3 10 10 -64 -29 -20 16 16 -45 -8 1 -43 6
7577 6 -8 1 42 35 3 -42 16 -5 -25 4 -43 -10 -20 38 12 0 -2 -33 20 23 49 12 -9 3 -8 28 -9 0 -16 -43 -11 -15 5 3
7611 3 -25 -38 17 20 32 57 -36 -3 -3 39 7 -24 -4 -17 9 -18 -17 -7 5 -2 -37 -22 -31 -54 -40 -20 14 -26 -20 1 22 41 42 -38
7645 -38 7 16 -5 6 10 -1 31 -29 -21 -24 25 -3 9 -9 -13 47 18 -29 23 19 41 28 -11 -24 20 -8 2 -18 -28 20 -17 4 -37
7678 -37 -18 0 12 18 12 -16 -21 -10 23 28 -6 -6 31 -26 10 -13 -19 -13 44 32 14 34 -21 12 19 3 -11 -20 -17 -63 3 10 -42 15 -48 -54
7714 -54 -39 -7 -21 26 1 -34 -19 38 -16 23 -35 3 -27 -33 -67 -12 0 8 -7 -17 41 -60 -7 38 -37 21 -1 -8 34 -12 -25
7745 -25 13 -48 7 -26 3 -20 -18 -5 19 1 -20 -15 -6 -41 3 -23 -62 -9 21 3 -9 19 -20 -10 -1 -34 1 19 -64 -18 51 21
7777 21 2 -10 -17 -32 -5 50 -3 5 2 -32 -13 -47 6 -2 9 -21 -26 -31 -3 -11 6 2 -27 -38 17 -9 34 -24 -4 7 -17 -16 -4 -21 19
7812 19 -90 26 37 -8 22 -51 87 -16 -36 13 -42 -4 20 2 30 15 17 2 -50 -23 7 -7 -18 -14 35 1 -56 12 -39
7841 -39 -27 4 -24 -28 11 -7 10 48 -49 21 -32 -26 -4 6 3 -48 -17 27 -27 -12 -49 -25 -11 -5 -19 -3 6 -1 -18 -1 -10 -9 25 -22
7875 -22 -26 -7 -20 -67 -19 -35 -45 -45 -33 16 0 -64 8 29 -37 9 17 34 13 -7 -16 -25 -15 8 27 -8 -23 10 28 19 15 -51 40 14
7909 14 4 -29 -12 37 4 -16 21 -14 -8 -52 -42 -42 -20 12 -23 -26 -10 -8 17 16 0 -41 -11 -46 -52 33 35 -38 -22 36 21 29 -9 -10 5
7944 5 9 16 -13 2 -8 -35 -6 -31 -35 -23 33 -11 -4 -11 -27 -61 -17 47 -3 -41 -51 -37 -22 -35 -12 -17 -24 -14 14 -5 -27 -10 5 -35
7978 -35 11 -7 -18 -42 -33 1 19 37 11 43 -16 -6 -52 14 65 3 45 -68 -10 8 -6 -6 -22 24 -8 12 49 -50 24 -55 -33
8009 -33 -46 -41 33 43 -5 -8 -59 -53 27 -37 -15 -27 13 11 -17 21 0 4 -19 3 19 -31 23 -23 -36 39 -23 21 -18 -44 -88 -15 75
8042 75 12 -5 -26 -20 -21 -12 -1 28 -19 24 -31 -32 -39 31 -19 29 -24 -8 95 -12 -19 11 8 6 -29 -42 8 0 -3 -8 -20 14 -3 28 -2
8077 -2 -14 19 -25 -5 11 14 -18 34 -45 3 -33 -59 15 -74 24 -29 -6 -30 50 -8 53 -14 -13 32 -7 6 19 0 47 33 -31 6
8109 6 10 -1 3 -15 33 41 37 33 -52 56 -16 8 2 -70 -34 -10 -44 27 -21 19 -26 -10 -9 18 -5 29 30 -41 -8 -2 -17 -12 -53 -1 40
8144 40 -9 -23 28 44 -1 -28 -28 6 -45 49 40 35 13 46 -19 -11 -12 -11 15 10 16 -4 32 21 31 -1 -42 -23 16 -16 -2 4 -33 -20 14
8179 14 -51 -12 -39 -15 12 17 -5 -7 10 33 44 -7
8191g
##END NTUPLES=NMR FID
##END=
