##TITLE=1H_AM_NVSTERD
 CDCl3
 8 sc, 
 6.04.2022
##JCAMPDX= 6.0         $$ Bruker NMR JCAMP-DX V2.0
##DATA TYPE= NMR FID
##DATA CLASS= NTUPLES
##ORIGIN= UXNMR, Bruker Analytische Messtechnik GmbH
##OWNER= root
$$ XWIN-NMR		Version 3.5
$$ Wed Apr  6 16:30:06 2022 Russian Standard Time (UT+4h)  she@DPX200
##.OBSERVE FREQUENCY= 200.131346
##.OBSERVE NUCLEUS= ^1H
##.DELAY= (6, 6)
##.ACQUISITION MODE= SIMULTANEOUS
##.ACQUISITION SCHEME= undefined
##.AVERAGES= 8
##.DIGITISER RES= 18
##SPECTROMETER/DATA SYSTEM= spect
##.PULSE SEQUENCE= zg30
##.SOLVENT NAME= CDCl3
##.SHIFT REFERENCE= (INTERNAL, CDCl3, 0, 15.7039)
##AUDIT TRAIL= $$ (NUMBER, WHEN, WHO, WHERE, WHAT)
$$ ##TITLE= Audit trail, XWIN-NMR		Version 3.5
$$ ##JCAMPDX= 5.01
$$ ##ORIGIN= Bruker BioSpin GmbH
$$ ##OWNER= she
$$ F:/spectra/data/she/nmr/H-F/1/audita.txt
$$ ##AUDIT TRAIL=  $$ (NUMBER, WHEN, WHO, WHERE, WHAT)
(   1,<2022-04-06 16:29:15.32 +0400>,<she>,<DPX200>,
      <created by zg, POWCHK disabled, PULCHK disabled
       configuration hash MD5:
       00 E9 B6 7A A2 85 ED C7 34 08 36 98 17 FE 4E 26
       data hash MD5: 16K
       9E 15 A3 70 CD 5E 98 C4 17 3B 25 AA C9 98 52 CE>)
$$ ##END=
$$ 
$$ hash MD5
$$ A9 5F 5F 20 81 47 14 DC 69 D2 45 FE 6A 88 66 3F
##$RELAX= 
##$RELAX= 
##$RELAX= 
##$RELAX= 
##$RELAX= 
##$RELAX= 
$$ Bruker specific parameters
$$ --------------------------
##$DU= <F:/spectra>
##$EXPNO= 1
##$NAME= <H-F>
##$PROCNO= 1
##$TYPE= <nmr>
##$USER= <she>
##$AMP= (0..31)
100 100 100 100 100 100 100 100 100 100 100 100 100 100 100 100 100 100 
100 100 100 100 100 100 100 100 100 100 100 100 100 100 
##$AQSEQ= 0
##$AQ_mod= 1
##$AUNM= <au_zg>
##$AUTOPOS= <>
##$BF1= 200.13
##$BF2= 200.13
##$BF3= 200.13
##$BF4= 200.13
##$BF5= 200.13
##$BF6= 200.13
##$BF7= 200.13
##$BF8= 200.13
##$BYTORDA= 1
##$CFDGTYP= 0
##$CFRGTYP= 5
##$CHEMSTR= <none>
##$CNST= (0..31)
1 1 145 1 1 1 1 1 1 1 1 1 1 1 1 1 1 1 1 1 1 1 1 1 1 1 1 1 1 1 1 1 
##$CPDPRG= <>
##$CPDPRG1= <>
##$CPDPRG2= <>
##$CPDPRG3= <>
##$CPDPRG4= <mlev>
##$CPDPRG5= <mlev>
##$CPDPRG6= <mlev>
##$CPDPRG7= <mlev>
##$CPDPRG8= <mlev>
##$CPDPRGB= <>
##$CPDPRGT= <>
##$D= (0..31)
0 1.2 0 0 0 0 0 0 0 0.06 0 0.03 0 0 0 0 0.0002 0 0 0 0 0 0 0 0 0 0 0 0 
0 0 0 
##$DATE= 1649248154
##$DBL= (0..7)
120 120 120 120 120 120 120 120 
##$DBP= (0..7)
150 150 150 150 150 150 150 150 
##$DBP07= 0
##$DBPNAM0= <>
##$DBPNAM1= <>
##$DBPNAM2= <>
##$DBPNAM3= <>
##$DBPNAM4= <>
##$DBPNAM5= <>
##$DBPNAM6= <>
##$DBPNAM7= <>
##$DBPOAL= (0..7)
0.5 0.5 0.5 0.5 0.5 0.5 0.5 0.5 
##$DBPOFFS= (0..7)
0 0 0 0 0 0 0 0 
##$DE= 6
##$DECBNUC= <off>
##$DECIM= 32
##$DECNUC= <off>
##$DECSTAT= 4
##$DIGMOD= 1
##$DIGTYP= 9
##$DL= (0..7)
0 120 120 120 120 120 120 120 
##$DP= (0..7)
150 150 150 150 150 150 150 150 
##$DP07= 0
##$DPNAME0= <>
##$DPNAME1= <>
##$DPNAME2= <>
##$DPNAME3= <>
##$DPNAME4= <>
##$DPNAME5= <>
##$DPNAME6= <>
##$DPNAME7= <>
##$DPOAL= (0..7)
0.5 0.5 0.5 0.5 0.5 0.5 0.5 0.5 
##$DPOFFS= (0..7)
0 0 0 0 0 0 0 0 
##$DQDMODE= 0
##$DR= 18
##$DS= 0
##$DSLIST= <SSSSSSSSSSSSSSS>
$$ [...]
##$SUBNAM2= <"">
##$SUBNAM3= <"">
##$SUBNAM4= <"">
##$SUBNAM5= <"">
##$SUBNAM6= <"">
##$SUBNAM7= <"">
##$SUBNAM8= <"">
##$SUBNAM9= <"">
##$SW= 18.0517287032376
##$SWIBOX= (0..15)
0 0 2 0 0 0 0 0 0 0 0 0 0 0 0 0 
##$SW_h= 3612.71676300578
##$TD= 16384
##$TD0= 1
##$TE= 0
##$TE2= 300
##$TE3= 300
##$TEG= 300
##$TL= (0..7)
0 120 120 120 120 120 120 120 
##$TP= (0..7)
150 150 150 150 150 150 150 150 
##$TP07= 0
##$TPNAME0= <>
##$TPNAME1= <>
##$TPNAME2= <>
##$TPNAME3= <>
##$TPNAME4= <>
##$TPNAME5= <>
##$TPNAME6= <>
##$TPNAME7= <>
##$TPOAL= (0..7)
0.5 0.5 0.5 0.5 0.5 0.5 0.5 0.5 
##$TPOFFS= (0..7)
0 0 0 0 0 0 0 0 
##$TUNHIN= 0
##$TUNHOUT= 0
##$TUNXOUT= 0
##$USERA1= <user>
##$USERA2= <user>
##$USERA3= <user>
##$USERA4= <user>
##$USERA5= <user>
##$V9= 5
##$VALIST= <valist>
##$VCLIST= <CCCCCCCCCCCCCCC>
##$VD= 0
##$VDLIST= <DDDDDDDDDDDDDDD>
##$VPLIST= <PPPPPPPPPPPPPPP>
##$VTLIST= <TTTTTTTTTTTTTTT>
##$WBST= 1024
##$WBSW= 4
##$XGAIN= (0..3)
0 0 0 0 
##$XL= 0
##$YL= 0
##$YMAX_a= 79693
##$YMIN_a= -111023
##$ZGOPTNS= <>
##$ZL1= 120
##$ZL2= 120
##$ZL3= 120
##$ZL4= 120
##$ABSF1= 10
##$ABSF2= 0
##$ABSG= 5
##$ABSL= 3
##$ALPHA= 0
##$AQORDER= 0
##$ASSFAC= 0
##$ASSFACI= 0
##$ASSFACX= 0
##$ASSWID= 0
##$AUNMP= <proc_1d>
##$AZFE= 0.1
##$AZFW= 0.1
##$BCFW= 1
##$BC_mod= 2
##$BYTORDP= 1
##$COROFFS= 0
##$CY= 11.3945322036743
##$DATMOD= 1
##$DC= 2
##$DFILT= <>
##$DTYPP= 0
##$F1P= 2.36226072786647
##$F2P= -0.459571619588291
##$FCOR= 0.5
##$FTSIZE= 0
##$FT_mod= 4
##$GAMMA= 1
##$GB= 0.15
##$INTBC= 1
##$INTSCL= 1
##$ISEN= 128
##$LB= 0.24
##$LEV0= 0
##$LPBIN= 0
##$MAXI= 10000
##$MC2= 0
##$MEAN= 0
##$ME_mod= 0
##$MI= 1.114404
##$NCOEF= 0
##$NC_proc= 0
##$NLEV= 6
##$NOISF1= 3.799351
##$NOISF2= 2.8
##$NSP= 1
##$NTH_PI= 0
##$NZP= 0
##$OFFSET= 15.70392
##$PC= 1
##$PHC0= -18030.79
##$PHC1= 13.80078
##$PH_mod= 1
##$PKNL= yes
##$PPARMOD= 0
##$PSCAL= 0
##$PSIGN= 0
##$REVERSE= no
##$SF= 200.130013532006
##$SI= 16384
##$SIGF1= 3
##$SIGF2= 2
##$SINO= 400
##$SIOLD= 16384
##$SREGLST= <1H.CDCl3>
##$SSB= 0
##$STSI= 0
##$STSR= 0
##$SW_p= 3612.71676300578
##$SYMM= 0
##$S_DEV= 0
##$TDeff= 0
##$TDoff= 0
##$TI= <>
##$TILT= no
##$TM1= 0
##$TM2= 0
##$TOPLEV= 0
##$USERP1= <user>
##$USERP2= <user>
##$USERP3= <user>
##$USERP4= <user>
##$USERP5= <user>
##$WDW= 1
##$XDIM= 8192
##$YMAX_p= 0
##$YMIN_p= 0
$$ End of Bruker specific parameters
$$ ---------------------------------
##NTUPLES= NMR FID
##VAR_NAME=  TIME,          FID/REAL,        FID/IMAG
##SYMBOL=    X,             R,               I
##VAR_TYPE=  INDEPENDENT,   DEPENDENT,       DEPENDENT
##VAR_FORM=  AFFN,          ASDF,            ASDF
##VAR_DIM=   8192,          8192,            8192
##UNITS=     SECONDS,       ARBITRARY UNITS, ARBITRARY UNITS
##FACTOR=    0.0002768,     1,               1
##FIRST=     0,             0,               0
##LAST=      2.2672688,     0,               0
##MIN=       0,             -111023,         0
##MAX=       2.2672688,     79693,           0
$$ Real data points
##PAGE= N=1
##DATA TABLE= (X++(R..R)), XYDATA
0@%%%%%%%%%%%%%%qJ6j6J6j6K4l2L2m0M8n6O7p5Q8j04J20j36J54j78K02k27K58
$$ 0 0 0 0 0 0 0 0 0 0 0 0 0 0 0 -8 8 -8 8 -8 16 -16 16 -24 24 -32 35 -40 48 -56 64 -72 82 -96 106 -121 137
36A37k91L25l64M08m55N05n61O24o90P62q41R28j022J126j241J365j503J659j831
$$ 137 -154 171 -193 215 -240 265 -296 328 -362 400 -441 487 -535 591 -650 715 -788 871 -960
55i60K023k241K492k783L120l519M004m607N373o391P821r980J3650k1526P0524
$$ -960 1063 -1178 1314 -1469 1651 -1868 2136 -2471 2902 -3489 4332 -5648 8002 -13524 57000
70E7000q0444o8768J71905l9658j12646N6571P0683o2774j2275K4846J481j836
$$ 57000 -23444 -92212 79693 40035 -72611 -16040 54643 -8131 -20406 4440 5921 4085
82D085o701j6737L0438N611l3802R434K2571l0974o64K4214j4711k810K6624j2537
$$ 4085 -2616 -19353 11085 16696 -17106 -7672 14899 -16075 -16739 7475 -7236 -10046 16578 4041
96D041r218J9497r876j5630K2627m264k1670K1099J1143k9406R45K3479p472j5934
$$ 4041 -5177 14320 4444 -11186 11441 7177 -14493 6606 17749 -11657 -10712 12767 5295 -10639
110a0639Q089J4555j033j8649m131K0764m473k9220J2460K7663j7124j6033K2381
$$ -10639 -2550 12005 10972 -7677 -11808 8956 4483 -24737 -12277 15386 -1738 -17771 4610
123D610Q713j7973j512J1670K4m893O56K11n33J150j679o790M524J3799p990j3812
$$ 4610 13323 -4650 -6162 5508 5532 639 1295 1506 973 2123 444 -6346 -1822 11977 3987 -9825
139i825J8871Q878k8946j389K6292j3141k0250J9369O980j5411K507N938k541
$$ -9825 9046 17924 -11022 -12411 13881 740 -19510 -141 6839 -8572 -6065 -127 -2668
152b668N809m347n299J7190l384k2261J7659J2268l0002N488L0044k1530j3916
$$ -2668 3141 -1206 -6505 10685 7301 -14960 2699 14967 -15035 -9547 20497 -1033 -14949
165a4949L1085l988k3951J6327O030j4871O058j247q705J4726n354k2023K2573
$$ -14949 16136 12148 -11803 4524 10554 -4317 1741 494 -8211 6515 1161 -20862 1711
178A711J4327l2668N124L1320j9468j5791K2258k030j1891Q997m851k708J6668
$$ 1711 16038 -16630 -11506 19814 346 -15445 6813 4783 -7108 1889 -2962 -5670 10998
191A0998j1886j2768K7040K22k8061J6599J8341k5606k871J9376j0820q170J0117
$$ 10998 -888 -13656 13384 13606 -14455 2144 20485 -5121 -7992 11384 564 -7606 2511
204B511n101j784R073r623j846J5863q408j2365J6180K276j7152O355R294q990
$$ 2511 -2590 -4374 4699 -4924 -6770 9093 685 -11680 4500 6776 -10376 -4021 5273 -3717
218c717n42N337k253L814J111p020P246P017j3830j749J5356o400j4412R653R302
$$ -3717 -4259 1078 -1175 2639 3750 -3270 3976 10993 -2837 -4586 10770 4370 -10042 -389 8913
233H913j1392n883J0399N132j0243m654J1091K754j2245r73J0231k057p720J741
$$ 8913 -2479 -8362 2037 7169 -3074 -7728 3363 6117 -6128 -7101 3130 1073 -6647 -4906
247d906N598K301m551m129R934N079j3467KJ5144p177j1819J1262K767j0074M116
$$ -4906 692 2993 -1558 -5687 4247 9326 -4141 -4139 11005 3828 -7991 3271 6038 -4036 80
262H0K900n589O031j91j0306J0281N001j7916N136J5194j6421o750J9505n480
$$ 80 2980 -2609 3422 3231 -7075 3206 8207 -9709 -4573 10621 -5800 -12550 6955 1475
276A475j3006J2941K924r154P024j81o063J0428k469j3624J4608O315k1097O555
$$ 1475 -11531 1410 4334 -4820 2204 2023 -4040 6388 3919 -9705 4903 11218 -9879 -3324
290c324J7201j6488n368J7514p045q149J1312n215o670J2416o795j1451J6475
$$ -3324 13877 -2611 -7979 9535 2490 -5659 5653 438 -6232 6184 -611 -12062 4413
303D413N54j8283J1501J1257j5946RJ3368p148l451O743m048L67N396q551J224
$$ 4413 4967 -13316 -1815 9442 -6504 -6495 6873 -275 -3726 3017 -1031 -664 4732 -3819 -2595
318b595J1856r471p339J5514o29j4429P669P829j0429j968O310j798k068m19j560
$$ -2595 9261 -210 -7549 7965 7336 -7093 576 8405 -2024 -3992 2318 520 -1548 -1967 -3527
333c527M759j6p812M156Q001p711m453R156J036o851M29M429J337l414k815N591
$$ -3527 1232 1216 -6596 -2440 5561 -2150 -6603 2553 3589 -3262 -2833 1596 2933 -481 -3296 2295
349B295M312p406k234Q160K55q029R84N526j266n277n45O169k98q172J779Q926
$$ 2295 6607 -799 -3033 5127 5382 -2647 -1663 3863 2597 -2680 -3225 2944 2646 -5526 -3747 5179
365E179o101n692P819J418p109K770K312k635K513o78l104P153l1r771P636P635
$$ 5179 -922 -6614 1205 2623 -4486 -1716 596 -2039 474 -204 -3308 3845 3814 -5957 1679 9314
381I314j3245p84J4334p318q768R993N02o992M050j235k910P869n410q440J3448
$$ 9314 -3931 -4715 9619 2301 -6467 3526 4028 -2964 1086 -149 -3059 4810 -600 -9040 4408
396D408J260j7022P906J2855j4252l608J4032m331o168O769k128r30O656p506
$$ 4408 5668 -11354 -3448 9407 -4845 -8453 5579 1248 -4920 1849 -279 -1209 5447 -2059
410b059k413J3932o640j2232J4817M344j7454N317J1226j0163k645P628m729K8
$$ -2059 -4472 9460 2820 -9412 5405 9749 -7705 -2388 8838 -1325 -3970 3658 -1071 -1043
424a043M068q448J647J0804j0114o725J5306j209j3739P724Q307r187j169O433
$$ -1043 3025 -5423 -3776 7028 -3086 -9811 5495 4286 -9453 -1729 6578 -2609 -3778 2655
438B655j759n29P47k457L795J717o442J716P005n566m685O792P57o794N43M832
$$ 2655 896 367 1114 -1343 2452 4169 -2273 -557 6448 882 -3803 2989 3746 -3048 -2505 2327
454B327o21m711n91N332P17p296j07Q298j444p251K346O328j573n881J210P402
$$ 2327 1706 -3005 -3596 1736 2453 -4843 -4950 3348 1904 -5347 -3001 3327 1754 -4127 -2917 4485
470D485o03q197K652Q775m821o644O113K669m808o8R70k74K284l059l483O537
$$ 4485 3882 -4315 -1663 7112 2291 -4353 1760 4429 -379 -447 523 249 2533 -526 -4009 2528
486B528Q8q401M775N237q891O11Q234o292l177Q152k526l752N374j867k130O553
$$ 2528 2616 -5785 -1010 4227 -4664 -4053 4181 -2111 -5288 2864 338 -3414 1960 93 -2037 4516
502D516m633m539J1028j207j2885R239Q155j3853l20J1459n745m881O297l141
$$ 4516 -117 -4656 6372 5165 -7720 1519 9674 -4179 -4499 6960 1215 -3666 2631 -510
516e10p16N259p747j844J1749o418j0146J2950L230j3649N251Q821q835k3O792
$$ -510 -1226 4033 -3714 -5558 6191 -227 -10373 2577 5807 -7842 -2591 6230 -2605 -2628 4164
531D164n470K86N558o366l0P842o166m061R832k513p715O961K551p613J320M486
$$ 4164 -1306 -1020 4538 -1828 -1858 5984 -182 -4243 5589 3076 -4639 2322 4873 -2740 -1420 3066
547C066l780r31R97j220K458j058m912N276L923q014l96R036k637p240M941N225
$$ 3066 -714 -1645 -648 -1868 590 -468 -5380 -104 3819 -4195 -4591 4445 1808 -5432 -491 4734
563D734m592l384L374L411j773l869K229M790l302m249L319L409l471l537K131
$$ 4734 142 -3242 132 3543 1770 -2099 130 4920 1618 -2631 688 4097 626 -2911 -780
578g80L372k404m505L406M289n125k811N977K84m875J892K064j601J063j292m82
$$ -780 2592 188 -4317 -911 3378 -1747 -4558 1419 1703 -3172 -1280 784 -817 246 -1046 -1528
594a528M365j941m749O697K648r289K815Q571p635m530Q507j182o043L306P57
$$ -1528 2837 896 -3853 2844 5492 -3797 -982 7589 -46 -4576 3931 2749 -3294 12 769
609G69j875K383l109j783P422k874q650Q887M378j1304J467Q926n599k718N576
$$ 769 -1106 1277 -1832 -3615 3807 933 -7717 1170 5548 -5756 -4289 4637 -962 -3680 1896
624A896k412M9M309n744j15R429o642o700J1134O90j1983N276P029q278p30N167
$$ 1896 -516 -467 3842 -1902 -2017 7412 770 -5930 5204 5894 -6089 -813 6216 -2062 -2792 2375
640B375k729M7J389m142K800L548p992M38R023n789o019R633K21p490L993M078
$$ 2375 -354 -307 1082 -3060 -260 3288 -4704 -4266 4757 -1032 -7051 2582 2803 -4687 -694 3384
656C384l905J98J823j622K533l81m661L701L309o718J88O891l188n039M070K033
$$ 3384 -521 -323 1500 -122 2411 2030 -2631 1070 4379 -2339 -2151 4740 1552 -3487 583 2616
672B616l111j746J131J868k76l922J150M769k823m487M554L729n040j189M576
$$ 2616 -495 -2241 -1110 758 482 -3440 -2290 2479 -344 -4831 -277 3452 -1588 -2777 1799
687A799J359m114r32L674J190m338n5N180j379l843J828K111k159n62k9J10J887
$$ 1799 3158 -956 -1888 1786 2976 -1362 -1417 3763 2384 -1459 369 2480 321 -241 -270 -160 1727
704A727k465k791M398O82o669K926O090n337k479N919r67l517L031o97k56K474
$$ 1727 -738 -3529 869 1551 -5118 -2192 3898 -1439 -3918 2001 1034 -2483 548 -149 -405 2069
720B069l095j101O754k922o318P354L052r267K280O917n591l259N141j479k377
$$ 2069 -1026 -2127 4627 1705 -4613 2741 5793 -3474 -1194 5723 132 -3127 2014 535 -1842
735a842K055k543J554L586n391k054Q896l179p689P452L564p861J266M869l022
$$ -1842 213 -2330 -776 2810 -2581 -4635 4261 1082 -6607 845 4409 -3452 -2186 2683 -339
750c39j56J366k178L386J708o811K916P153p829l837R374j702p974M726L674n214
$$ -339 -495 871 -1307 2079 3787 -3024 -108 7045 -784 -4621 4753 3051 -4923 -197 3477 -1737
766a737j4K527j887J076l44k456L504J532n870J348N861m298l350N450J318m123
$$ -1737 -1751 776 -1111 -35 -379 -2835 669 2201 -3669 -2321 3540 -758 -4108 1342 2660 -1463
782a463P38K423K72j488j276J828K103l158j917L879P55m451K22L114j11l018
$$ -1463 -725 1698 1970 482 -794 1034 3137 -21 -1938 1941 2696 -1755 -1533 1581 1470 -1548
798a548n44K834P96l858l86M201j269l995L013K580k834p77K370L88p60n85J62
$$ -1548 -2092 742 1538 -2320 -2706 1495 226 -3769 -756 1824 -1010 -1787 583 971 211 -374 -212
815b12K944j184m093L717K719n045r06N268j931l008K477m8j016J145k366k14
$$ -212 2732 1548 -2545 1172 3891 -1154 -2060 3208 1277 -1731 746 698 -318 827 -1539 -1753
831a753M276k996m351N813J735p023K465M892m580q24L867j640k21J972k518J153
$$ -1753 2523 -473 -4824 989 2724 -4299 -1834 3058 -1522 -2346 1521 -119 -340 1632 -886 267
847B67K983m543l03O024l961m109P340n74p195M331L114n653P99L320l848Q91
$$ 267 3250 -1293 -1596 4428 467 -3642 3698 3124 -4071 260 3374 -2279 -1480 1840 -2008 -1117
863a117K631m800J785N005o161j492P594k270n827N554J836m589J596J966k338
$$ -1117 1514 -3286 -1501 3504 -2657 -4149 3445 1175 -4652 902 2738 -1851 -255 1711 -627
878f27J800M74l336L029K186n474Q74N079m105k835M800j35m380J655K416j934
$$ -627 1173 1647 -1689 1340 3526 -1948 -1074 4005 -100 -2935 1865 1730 -2650 -995 1421 -513
894e13j255J017J226m86j766N29K771j740k240K631J596k279n88K000L99m49j538
$$ -513 -1768 -751 475 -11 -1777 -1248 1523 -217 -2457 174 1770 -509 -1097 903 1302 853 -685
911f85Q11K388j075k710K003J812k532j343J870P02j638j502J459K106k835j809
$$ -685 126 2514 1439 -1271 732 2544 12 -1331 539 1241 -397 -1899 -440 1666 -1169 -2978
927b978L690Q28m773J099M559l156j957L408j11j363J320o38N38J814k580j416
$$ -2978 712 1540 -3233 -2134 2425 -731 -2688 720 609 -754 566 -72 466 2280 -300 -1716
943a716N244j991m825M857K359o500J542M073l434j250K735k174l3K684l947q2
$$ -1716 3528 1537 -3288 1569 3928 -2572 -1030 3043 -391 -1641 1094 -1080 -1113 1571 -2376 -2458
959b458N214l442l843O366O72o262K744L776l630l35K306r82R36M48l108K388
$$ -2458 2756 -686 -4529 1837 2509 -3753 -1009 2767 -863 -1198 1108 126 1062 1510 -1598 790
975G90K969n686q4O235l526l887M716O17m329J715J544k007M26J15j353K203Q2
$$ 790 3759 -1927 -2011 4224 698 -3189 1527 2144 -2185 -470 1074 -933 -507 -392 -1745 458 540
992E40l529K526K613m071j74M733j801k854K587P78j319N2L30K52J196j843j018
$$ 540 -2989 -463 2150 -1921 -2095 2638 837 -2017 570 1348 29 81 411 663 1859 16 -1002
1009a002L115o06l215J364K846k658k171K515Q81j937r82J638J153j912r18J797
$$ -1002 2113 1507 -1708 -344 2502 -156 -2327 188 1069 -868 -1850 -212 941 -971 -1889 -92
1025i2Q64k016K28J498L65p90o64J049J131j337j109K465M50l086J025K441k472
$$ -92 772 -1244 -1016 482 847 57 -607 442 1573 236 -873 1592 2042 -1044 -19 2422 -50
1042e0j160K301m00j328O47n26J69J321k641l37L690j850l484M203J934n036R88
$$ -50 -1210 1091 691 -637 10 -516 -347 974 -1667 -2004 1686 -164 -3648 555 2489 -2547 -1559
1059a559L729k471o56J903j212R16R25k623J277L060l860j874N480j034m983L690
$$ -1559 2170 -301 -957 946 -266 650 1575 -1048 229 3289 -571 -2445 3035 2001 -2982 708
1075G08J853l884L26K000j707M65N38k292K130J537l993O28M496l769k250M733
$$ 708 2561 -1323 -997 1003 -704 -239 299 -1993 137 1674 -2319 -1691 2805 -964 -3214 1519
1091A519J09l846K199K003k301K04R29o93J490q79k098K749R05m114P99L719k402
$$ 1519 1628 -2218 -19 1984 -317 -113 816 123 1613 734 -1364 1385 2290 -1824 -1025 2694 292
1108B92k441K432P29j854J09J7N34M17j537k36K891r05k752K142K176k327j156
$$ 292 -2149 283 1012 -842 -733 -716 -182 235 -1302 -1538 1353 448 -2304 -162 2014 -313 -1469
1125a469K614M26j687m01J675L25j851k58J990J7k161K95J618n07j596R9J549
$$ -1469 1145 1571 -116 -517 1158 1483 -368 -626 1364 1381 -780 -485 1133 626 -970 -871 678
1142F78l63j776m4K760r50l060K211K112k754o05K730lj734P34Q6O05P36k025
$$ 678 315 -1461 -1505 1255 305 -2755 -544 1568 -1186 -1791 939 936 -798 -64 22 627 1363 -662
1160f62L94K573j575k358K844J235l971J292K152k349n60J248o21J56M20k188
$$ -662 -268 2305 730 -1628 1216 2451 -1520 -228 1924 -425 -985 263 -358 -202 218 -1970
1176a970J778J761l353n34M280k111k897L783R51l335J194J755j210J89L71j211
$$ -1970 -192 1569 -1784 -2318 1962 -149 -3046 737 1688 -1647 -453 1302 92 281 652 -559
1192e59J909L46l461K002K822l739r95L996j537l005K604N52k398J088K74j381
$$ -559 1350 1696 -1765 237 3059 -680 -1675 2321 784 -2221 383 935 -1463 -375 -101 -1482
1208a482J889n92j851K457P05l149J051L012k237j464L017k53j685M98R24J0k9
$$ -1482 407 -185 -2036 421 1126 -2023 -972 2040 -197 -1661 1356 1103 -582 -84 840 850 821
1225H21j246L72K278j873k140K650J067l235p5K737j148j937J263J020j157n79
$$ 821 -425 -53 2225 352 -1788 862 1929 -1306 -1381 1356 208 -1729 -466 554 -603 -1182
1241a182P19R18q28o89J047P87j169j35O65O77k63o87M36J406j434j305J953J079
$$ -1182 -463 455 -373 -1062 -15 772 -397 -532 133 810 547 -140 296 1702 268 -1037 916 1995
1259A995k472k56K297p73j930Q27Q84n04q53m19J417M58k250k42K949p91k663
$$ 1995 -477 -733 1564 791 -1139 -312 572 68 -785 -1204 213 671 -1579 -1821 1128 337 -2326
1276b326K155J737k618L42J538o62j86P31j077J055J149k729M20L186k735j878
$$ -2326 -171 1566 -1052 -710 828 166 -20 711 -366 689 1838 -891 -471 2715 -20 -1898
1292a898L671k43l465J554J787k058r0M17n41J062m72j735K193J365l804Q46M052
$$ -1898 1773 1530 -1935 -381 1406 -652 -742 -325 -866 196 -276 -2011 182 1547 -2257 -1411 2641
1309B641k563k499L502J15k341J629K66p35J207q69j384K442K11l699K010K312
$$ 2641 78 -2421 1081 1196 -1145 484 750 15 1222 353 -1031 1411 1622 -2077 -67 2245
1325B245k721j390K760k54k075R36N00q5l93p41O03J406j581p84K526N8k546J111
$$ 2245 -476 -1866 894 640 -1435 -499 1 -84 -477 -1218 -615 791 -790 -1574 952 1010 -1536 -425
1343d25J684q38q61J025L32n21l39o0J346q74j341J163J002j333q97O84O90n94
$$ -425 1259 421 -440 585 917 396 57 -3 1343 469 -872 291 1293 -40 -937 -253 437 -157
1361a57j333R56J578j830j117K129J015k681J89K122m91j189M60J214l60m31l23
$$ -157 -1490 -534 1044 -786 -1903 226 1241 -1440 -1251 871 380 -809 -349 865 505 74 -249
1378b49J169O55k033rK305j174k088K121J070k483L37R40j036l3M33o68P95K52
$$ -249 920 1575 -458 -467 1838 664 -1424 697 1767 -716 -379 561 -475 -508 -75 -743 52 304
1396C04k166J073K376k556r19L138p98k206K166R45j574k9Q67o31R86m52j721
$$ 304 -1862 -789 1587 -969 -1888 1250 452 -1754 412 1357 -217 -246 621 -10 976 524 -1197
1413a197K319O63l317J195K711k688j680K981j50k091O84P82o01K71p78j04J841
$$ -1197 1122 1785 -1532 -337 2374 -314 -1994 987 837 -1254 -570 212 -389 -118 -896 -1000 841
1430H41n71k002J965J226k797L87K798j527j159J550K86p87J2k38O55O44j573
$$ 841 270 -1732 233 1459 -1338 -951 1847 320 -839 711 997 210 222 -16 639 1283 -290
1447b90k10J876p02k136J419J257j843n77J175M37j076l47O55Q49j161q72J517
$$ -290 -500 1376 674 -1462 -43 1214 -629 -1206 -31 406 -670 -1017 -362 487 -674 -1546 -29
1464b9J016j522l85J760Nj254j53J404Q0j237J37J409l44j587M95J179o97j288
$$ -29 987 -535 -920 840 845 -409 -562 842 922 -315 -178 1231 887 -700 -205 974 277 -1011
1482a011R53M78q28j41J2P94k13j369P94J525j541r80K249%j910Q96J280j136
$$ -1011 -58 420 -408 -549 -537 257 44 -1325 -531 994 -547 -1527 722 722 -1188 -292 988 -148
1500a48j1M36j08P73j49j521J311J379k828j32K861j301k364K191R10k154K71
$$ -148 -159 277 169 942 793 -728 583 1962 -866 -998 1863 562 -1802 389 1299 -855 -584
1517e84M69n35N49k19q97J668K44k618J194K440k400o52K574m08j680J130N78
$$ -584 -115 -650 -101 -320 -1217 451 695 -1923 -729 1711 -689 -1341 1233 825 -855 275 853
1534H53p08M4r4j16J198q62j247J916K61k716R47J794j698q14J544k12k93l54
$$ 853 145 189 95 -21 1177 315 -932 984 1245 -1471 -524 1270 -428 -1242 302 90 -203 -557
1552e57l25Q10O61j484j73K277j234j512J981J055k132J85J566l8j479N71L90
$$ -557 -882 -72 589 -895 -1068 1209 -25 -1537 444 1499 -633 -448 1118 1080 -399 172 562
1569E62J44p31l84R63J77j286K19J294q10r39L59R48m51j166M59J333r85r40R55
$$ 562 706 -25 -409 554 731 -555 -336 958 148 -791 -432 516 65 -1101 -642 691 -294 -1234 -279
1588b79J201j368k51J076j1o56L88L39K14k8p37P66Q04j874m49J997l41j743Q23
$$ -279 922 -446 -697 379 368 -288 100 439 653 625 -112 654 1458 -416 -865 1132 791 -952 -129
1607a29R53j126m25O49Kk27L2r76J208M43j725N34J957j223j353J834O83j577
$$ -129 824 -302 -727 -78 -76 -303 -271 -1247 -39 404 -1321 -787 1170 -53 -1406 428 1111 -466
1625d66K90J087n39Pm07k24J422o40j371J415R78k261m5K125j342j242J402p2
$$ -466 -176 911 372 379 -28 -252 1170 530 -841 574 1552 -709 -754 1371 29 -1213 189 117
1643A17o16J11j09j43J207r59r56J925J7k013J227J955k296o05K083j02j147N19
$$ 117 -499 -388 -497 -640 567 -392 -1348 577 594 -1419 -192 1763 -533 -1138 945 843 -304 215
1661B15j21J53N81j621O72J433j650j010K027M46k274L26J345o02p16K96P12l30
$$ 215 94 247 828 -793 -121 1312 -338 -1348 679 1125 -1149 -823 522 -80 -796 -500 212 -118
1679a18j58n02J241Nj465J83J502m06q73N57J074r03l81M73N95m65r00Q49N37
$$ -118 -276 -778 463 468 -997 -814 688 282 -591 -34 1040 137 -244 229 824 359 -541 308 845
1698H45j092j83P79j40p43J78N88k00m02o82Q73O03j327m0J435J3j576P60J040
$$ 845 -247 -430 349 209 -534 -356 232 32 -370 -1052 -179 424 -903 -943 492 505 -1071 -311 729
1717G29o94l97O71J49j4m22j97R93r9j580P42J384j249j126J685q6j416Q58N2
$$ 729 35 -362 309 458 444 22 -175 818 719 -861 -119 1265 16 -1110 575 489 -927 -69 -17
1736a7m61K64k30l87J275o44r57J055O94j562L38J868j006r03J142L20r59M97
$$ -17 -478 -214 -444 -831 444 -200 -1157 -102 592 -970 -632 1236 230 -673 469 789 -170 327
1754C27k01J52M73r33l68J684m72j789J495Q17j977q8J607q89q03P47L92j78j40
$$ 327 126 278 751 -182 -550 1134 662 -1127 368 1185 -792 -880 727 -162 -965 -218 174 -4 -144
1773a44m58L50R43r66n49J840k67j551P38J060r58k95Q60P8k50m86K57L50k47
$$ -144 -602 -252 691 -275 -824 1016 749 -802 -64 996 38 -257 603 681 431 -55 202 552 305
1792C05r34O41O58j039k86O47L77j125Q4P57P1p26k94Q18N99j052r2J079k49p52
$$ 305 -629 12 670 -369 -655 -8 369 -756 -672 85 156 -570 -864 -46 553 -499 -591 488 239 -513
1812e13M00J077o41o39K42J028o7j227L77Q81p59r14J013L89r08p1M21J24l52
$$ -513 -113 964 323 -316 -74 954 887 -340 37 918 159 -755 258 647 -261 -332 89 213 -139
1831a39n13K14P23n37j125J371J209j831l86K078n37j492J024N65n51J72k17M86
$$ -139 -652 -438 285 -252 -1377 -6 1203 -628 -1014 1064 527 -965 59 624 73 245 28 514
1849E14O7n97m88J540K3k171R39J360j341o79J439k76j175N00J48q7K29o36J18
$$ 514 581 -16 -504 1036 1059 -1112 -173 1187 -154 -833 606 330 -845 -345 -197 -284 -55 -691 -573
1868e73J037p85p65J525O13j792L50J451r48m07Q04J35l01P1o20L37O25q63k40
$$ -573 464 -321 -1086 439 1052 -740 -390 1061 113 -294 510 645 344 415 -205 132 757 -106 -346
1887c46J409q70j159Q83P44j194l2Q96m32k69k41K58O80o95n83R68O92r94l38
$$ -346 1063 193 -966 -83 661 -533 -565 331 -101 -370 -611 -353 327 -368 -951 17 709 -285 -623
1906f23J146K70j335M94O74j7n85j18P13j29o71k50J059n84p21N31P20p71o28
$$ -623 523 793 -542 -48 626 609 24 -94 619 490 -181 -431 628 44 -677 -146 574 -197 -825
1925h25K34P06j64p73Q37M27n38o43Q30L86p01k17Q80K11m86RO9O75q27n41P94
$$ -825 -591 115 -49 -822 15 442 -96 -739 91 477 -224 -441 439 650 164 173 242 917 90 -451 343
1946C43O01j601K12J119n37r04Q83N91q90l33K2N17R5n64l90J315k19j405J329
$$ 343 944 -657 -445 674 137 -767 116 707 -183 -516 -494 23 118 -446 -836 479 260 -1145 184
1965A84R74j468k02J146J99j167O48R5M8r9m53L18P72r30q26J337r5j488M97J260
$$ 184 1158 -310 -512 634 833 -334 314 409 457 358 -95 223 995 65 -761 576 481 -1007 -510 750
1985G50r59n65P93j87pm64J60N14L05r75J84J228p76o04J169M06j344K27P66q0
$$ 750 -209 -774 19 -168 -175 -639 -479 35 340 -635 -451 777 1 -603 566 972 -372 -145 621 541
2005E41o96J25L74O4k36o01P47M26j496K36J211p19q41Q06M40p50l16M87O26o13
$$ 541 -155 -30 344 408 172 -429 318 744 -752 -516 695 -24 -865 -59 381 -369 -685 -198 428 -185
2025a85l10J24R79n68p18P42P30n40n37J90R00m66p49M84M08o60m38R68J15r40
$$ -185 -495 -371 608 40 -678 64 794 254 -283 -93 807 341 -408 76 484 -176 -614 354 469 -471
2045d71P8R12o77k06J58o5K83m53m45J148Jr25L44J109q31o29R36K97n30K65r4
$$ -471 -393 519 -158 -364 -206 -271 12 -441 -886 262 263 -662 -318 791 -40 -669 267 564 34 299 205
2066B05N12q3n16k43O39j39j233J347K10j380J00J098l06o13L46j16q0Mk05L77
$$ 205 717 634 118 -125 514 375 -858 489 699 -681 -581 517 211 -402 -56 -172 -252 -248 -453 -76
2086g6L46p25p1J281n67p43O20O23p27m28J269n95j69q1j3O49j58p13K66O04p11
$$ -76 270 -455 -526 755 188 -555 65 688 -39 -467 802 207 38 -43 -56 593 435 -278 -12 592 -119
2107a19o49J087j42p34Q2O69m45p0kK49J42n27L4R62j74o09K00Q18k65q25O31
$$ -119 -768 319 177 -557 -475 194 -251 -321 -323 -74 68 -459 -425 537 363 -246 -46 772 507 -318 313
2128C13J73k64k81O38J20p32O0J0M85n50k54L18J41o58p5P31k65m17k02P71J02
$$ 313 486 222 -59 579 699 -33 27 37 522 -28 -282 36 177 -481 -556 175 -90 -507 -709 62 164
2149A64o64Q3Q71n9p87O56K88m39n55N09N22m26l92K66M74k83p21O62P48r54n10
$$ 164 -500 -417 454 395 -392 264 552 113 -442 67 589 163 -229 37 511 228 -493 169 917 -37 -547
2170e47P53J80q10O1M22M4k90l85N18N11p07k45Q94p6r12K88J161p06n56P17K13
$$ -547 206 386 -424 -363 59 103 -187 -572 -54 457 -250 -495 399 323 -589 -301 860 154 -402 315 528
2191E28k29m33J56L43J03o85n7J040m46j430J041K41p21m8Q19l73l64K93j5N89
$$ 528 299 -134 22 365 468 -217 -274 766 320 -1110 -69 172 -549 -597 222 -151 -515 -222 -237 352
2211C52l63l76M64L23n89k18R83N4r78L01N50l33k46J30K89j82j49k58N90M5p44
$$ 352 -11 -387 77 400 -189 -407 576 630 -348 -47 503 170 -76 54 343 161 12 -246 344 389 -355
2232c55M08J13k18n61Q46L8o42MJ73O5J80k70L31L92p55J37L29L88n51Q2L88l76
$$ -355 53 166 -52 -613 233 271 -371 -367 -194 -129 51 -219 112 504 -251 -114 215 603 52 134 522 146
2254A46j30k83O04J14n83J0M71k55m02N22J96n06k88J90J65n8n68M98L23m40n18
$$ 146 16 -267 337 451 -132 -122 349 94 -308 214 410 -96 -384 -194 -29 -87 -655 -157 166 -274 -792
2275g92Q42K10p49K3R41j36n19j19N01L3l25j59O39K39r12K37N30j39q28K81Q80
$$ -792 50 260 -489 -466 475 339 -180 -299 202 235 -90 -249 390 629 -283 -46 484 345 -483 -202 678
2296F78j164q9O76p8l90K5J70K76k77k92M73M68n53l42O67L28q89Q1Q34m71j82
$$ 678 -486 -575 101 23 -367 -342 -172 104 -173 -465 8 476 -77 -419 248 576 -313 -232 602 131 -51
2317e1K60p5L21n21k38L37L15l75k08O40l86n82N54J26k94k60L09L74k63m91L07
$$ -51 209 134 455 -66 -304 33 348 -27 -235 405 19 -563 -9 117 -177 -437 -128 246 -17 -508 -201
2338b01N97m57m76O03M36l47l97O19j76k97J22K49K85n01k04M90K9q67J55O80
$$ -201 396 -61 -537 66 502 155 -242 377 201 -96 26 275 560 59 -145 345 374 -493 -338 342
2358C42j75n44J87L29l63j44L38J78k38k99J84P32n68m48N87L32l44m82N17K55
$$ 342 167 -377 -190 139 -224 -368 -30 148 -90 -389 -205 527 -41 -489 98 430 86 -396 121 376
2378C76k92j42M15Q3l89n43M92M10l93k21L98j17o95L17M42l53j14QJ86Nk41r7
$$ 376 84 -58 357 440 51 -492 0 410 17 -204 194 77 -618 -301 141 -212 -326 -318 -132 -127 -368 -465
2400d65O43Kn98O58L26o36kN60k76j42J15O7J38m30j70K80N06o28m57N17K20o45
$$ -465 178 180 -418 240 566 -70 -72 488 212 70 185 252 390 -40 -210 70 576 -52 -509 8 228 -417
2422d17K70L64m72r2q3O70j39l49o4M68J38m18k91Q48r9m11K13J90j55j83J43
$$ -417 -147 217 -255 -347 -430 240 101 -248 -312 156 294 -124 -415 433 334 -77 136 326 171 -12 131
2443A31q8r1k4J57r4j13l42O92L9n44l12P40j03l81K07J08O6m61M70K8n0l17K64
$$ 131 43 -48 -72 85 -9 -122 -464 228 267 -277 -589 151 48 -333 -126 -18 48 -413 57 85 35 -282 -18
2466a8M82k56m72M05M79l19n27O00P0l21k60K33J69k27m70P24k0n68j00N92j10
$$ -18 464 208 -264 141 620 301 -226 374 444 123 -137 96 265 38 -432 292 272 -296 -396 196 86
2487H6l82O6qM34m87M3K7K42n23K36Q28o13j44N13J2n9l54M47r0r3m12K33M86
$$ 86 -296 -230 -238 196 -291 -248 -221 21 -502 -266 562 -51 -195 318 330 271 -83 364 274 181 -231 2 488
2510D88o09k08M47L92p21p2L59j03m24J47M46q1k52k33O61K3o56L24M01k16n49
$$ 488 -121 -329 118 510 -211 -283 76 -27 -451 -304 142 61 -191 -424 237 260 -396 -72 329 113 -436
2531d36O69K90m68j46M39j10k35J53l46M50k48m91J47P48p27j27P86k38m70P8
$$ -436 233 523 55 -91 348 238 3 156 -190 260 12 -479 -332 416 -311 -438 348 110 -360 -282
2551b82N11k47j78J16J31L61m50j16M43P1p48L34O16k90m15L28Q6l26j6K82J38
$$ -282 229 -18 -196 -80 51 412 -38 -154 289 360 -388 -54 562 272 -143 185 271 -55 -71 211 349
2572C49l31j51n5N03l84m69N62J14m01k31L56K94n2m40N38j39l70O1O09Lm91j74
$$ 349 18 -133 -188 315 -69 -538 24 138 -263 -494 -138 156 104 -336 202 63 -307 -246 363 366 -125 -299
2594b99Q47k84m49K24K81j3l29j20N03R7m87r2L05k80l41L85K43k84k73L35K27
$$ -299 548 264 -185 39 320 307 -22 -142 361 458 -29 -121 184 -96 -437 -52 191 -93 -366 -31 196
2615A96l70j33L08K78k82j57L24Q5l95P4N49j37l69j53L86J46k76%L60j34n12
$$ 196 -174 -307 1 279 -3 -160 164 249 -146 -72 477 340 -29 -182 204 350 74 74 434 300 -212
2636b12K3M94k65m00N0K92j24l24M92J63l98N9j18K70j65j66L17K87m45j64P95
$$ -212 -189 305 40 -360 -310 -18 -142 -466 26 189 -209 -150 -268 2 -163 -329 -12 275 -170 -334 461
2657D61l95k48J71N29n55p0l9K78j79p5k20N20j83j52J79J69j68l58M00J28l95
$$ 461 66 -182 -11 518 -37 -107 -146 132 -47 -122 -342 178 -5 -157 22 191 23 -335 65 193 -202
2678b02k76O16J36m60J22K87r7j87j59M88q6m00J89M34j82l14J65K45j42l71J70
$$ -202 -478 138 274 -186 -64 223 126 -61 -220 268 182 -218 -29 405 223 -91 74 319 177 -194 -24
2699b4J99j14k35O8J31k38Ml6J75j42k05M93J44m67K4K67O6k21J47K14j60r8N5
$$ -24 175 61 -174 -106 25 -213 -209 -245 -70 -212 -417 76 220 -247 -223 44 110 -111 36 250 90 -8 47
2722D7L22O0k65n21P05J37p54J31M07j78k52j06N56m10k05K48J51j36o8M4K10
$$ 47 369 429 164 -357 348 485 -269 -138 269 91 -161 -267 289 -121 -326 -78 73 -63 -131 -87 123
2743A23j47k21L00L93l59l17K72K07m08Q2M33j13l93J38K84k93J5j53M26k26k20
$$ 123 -24 -245 55 448 89 -228 44 251 -157 -75 358 245 -148 -10 274 -19 -4 -157 269 43 -177
2764a77J93K5j08l44N02L1k75j08K25K06j58j29J72K57m33j68L43M83n21J92R2
$$ -177 16 41 -67 -411 91 122 -153 -261 -36 170 12 -117 55 312 -121 -289 54 537 16 208 300
2785C00K0k95jJ18K6o8j50J20J24n43K60J01l2m67O95r0k62o6N6M7K35j19j09
$$ 300 320 25 24 142 168 100 -50 70 194 -349 -89 12 -20 -487 208 118 -144 -210 -154 -107 128 9 -100
2808a00K99M2l35K50K23n31J6L95j13r2j38O5L29n94L41P3No18J25K45J29k32
$$ -100 199 241 -94 156 379 -152 -136 259 146 54 -84 -19 310 -284 57 130 135 -483 -358 -113 16 -216
2830b16K92j88J76l79j7K40M1o1J58K37k95q6L41J72n16P1L73k5l02J18OK12j37
$$ -216 76 -112 64 -315 -332 -92 -51 -112 46 283 -12 -98 243 415 -101 -30 343 318 16 134 140 352 215
2853B15J3l03K18l94j66O48l31k52J33K92pq7k39K56K13k93oK58j90j85K69ML5
$$ 215 228 -75 143 -251 -417 231 -100 -352 -219 73 66 -21 -260 -4 209 -84 -90 168 -22 -207 62 66 101
2876A01k0K80j00m26j24L55J54p8l47J18K71n74K48K04J61k55j05K64P0m95L21
$$ 101 81 361 261 -165 -289 66 220 142 -205 -87 184 -390 -142 62 223 -32 -137 127 197 -298 23
2897B3N4l61K81j46L26j6k35j12L30o1j82K81K11n39O9K05M9j60O5J75j30l7k43
$$ 23 77 -284 -3 -149 177 161 -74 -186 144 83 -99 182 393 -146 -77 128 177 17 82 257 127 90 -153
2920a53P5L16m20j7J32L19m03R5K14j27j45P6R6Kk86J14L70r4l66J96J19J36m47
$$ -153 -78 238 -182 -199 -67 252 -151 -56 158 31 -114 -38 58 60 -226 -112 258 164 -202 -6 113 249 -198
2943a98M58K15n14N7J30J29m3n54L22q2k31r8M27Nk27j98L35J69k03j76M04K54
$$ -198 260 475 -39 18 148 277 234 -320 2 -80 -311 -409 18 23 -204 -402 -67 102 -101 -277 127 381
2965C81p87K63L01J16n64M91k9K34o40K77J73j22l5j65K84k39k85K83MK0n7M89
$$ 381 -406 -143 158 274 -290 201 172 406 -234 43 216 94 59 -106 178 -61 -346 -63 -59 -39 -96 393
2987C93k32k64L6J66o5k99K06R1K3k22J08K02j69j96K04K34J00j96m04O23j00
$$ 393 161 -103 -67 99 34 -265 -59 32 55 -167 -59 143 -26 -222 -18 216 316 120 -284 339 239
3008B39m89K45L1J85m60M8K01j95J42k65K39J31k37J7L53l26l0L79m3l31J67k1
$$ 239 -250 -5 26 211 -249 -201 0 -195 -53 -318 -79 52 -185 -168 185 -141 -171 208 165 -166 1 -20
3030b0L44l20K39k42J94k86m1K89k10k81K86J29rk54P7J62k21RK60k4k11p1K79
$$ -20 324 4 243 1 195 -91 -132 157 -53 -334 -48 81 72 -182 -105 57 -164 -155 105 81 -130 -201 78
3053G8J24k75J8L94l06mk41M88nl90j3L87J4k30Rn5R2l63L04K31ol86n6K18j29
$$ 78 202 -73 -55 339 33 29 -212 276 271 -119 -132 255 269 39 48 -7 85 -278 26 257 251 -135 -191 27 -102
3078a02j02K50L04m56P6R1j5k28J08q5K94m9j05r8K72l43NL40K3n23N28K4o6m50
$$ -102 -204 46 350 -106 -30 61 46 -182 -74 -159 135 86 -19 -117 155 -188 -183 157 180 -343 185 209 143 -307
3102c07k7M83q7l62J53L09j43k47K23J76l12o3P6J46k43k3K71J26p4k39L42J06
$$ -307 -334 149 62 -300 -147 162 19 -228 -5 171 -141 -204 -128 18 -225 -248 23 149 75 -164 178 284
3124B84j44J9r9K4k18M1K13Kk45o5K12L8j22P2L3R4l82J48L20k18k26K8K66R4
$$ 284 140 159 60 84 -134 -93 120 122 -123 -188 24 62 -60 12 45 139 -243 -95 225 7 -219 -191 75 169
3148A69l05J51K98k77J2J13L24n97l3L10Q2l62K51J57k89J02r2K7K81n90j08N02
$$ 169 -136 15 313 36 48 161 485 -112 -145 165 247 -115 136 293 4 106 14 41 322 -268 -376 126
3170A26j45j40J46Q1j18r5OK95j32k19p6K59n2k21J01K68o7l03K44L49l98J4K65
$$ 126 -19 -159 -13 68 -50 -145 -139 156 24 -195 -271 -12 -64 -285 -184 84 17 -286 -42 307 -91 -77 188
3193A88rr6k48K09L2k7j16J02l4%k41K30J36p8j56L05j77k12L55K6j62j38O5M4
$$ 188 179 83 -165 44 76 49 -67 35 1 1 -240 -10 126 48 -108 197 20 -192 163 189 27 -111 -46 -2
3217bK00l04k4N20k84k35J89J26L8l74K89r3k46R7N8O7l4l9J35K7m64M48q5m1
$$ -2 198 -106 -130 390 106 -129 60 186 224 -150 139 46 -200 -103 -45 22 -12 -51 84 111 -353 95 10 -31
3241c1n3j33K63J12l43J77O1j82L4J55J43k40j27N48n8k00j92j1M34m13j10J25
$$ -31 -84 -217 46 158 -185 -8 53 -129 -95 60 203 -37 -164 384 326 126 -66 -77 357 -56 -166 -41
3263d1K60k15k62M24j99j4n0K43k2m01J24L35o4l32K41J73j04k23J22N67n49k82
$$ -41 219 4 -258 166 -33 -47 -97 146 124 -277 -153 182 118 -214 27 200 96 -127 -5 562 13 -269
3285b69J94N4j9J17k12K48j87k6J94Kk08J04Q2r9J2k18L67m2k59k1K14K02k35
$$ -269 -75 -21 -40 77 -135 113 -74 -100 94 96 -112 -8 74 -25 -13 -231 136 94 -165 -186 28 230 -5
3308eK57J07k44l08J83K57r1l15K63j84jm7J14J75m12L2r9M55j38r3J89J12l28
$$ -5 252 359 115 -193 -10 247 156 -159 104 -80 -81 -128 -14 161 -251 -219 -318 137 -1 -94 95 207 -121
3331a21q9M1J35j5j97L66Jj60j05L73q3q8L1K38l25j44k2K94J22l94J73M8j6q8
$$ -121 -210 -169 -34 -49 -246 120 121 -39 -144 229 146 58 89 327 2 -142 -164 130 252 -142 31 79 63 -25
3355b5J61l3j14J7k07J16o5p5L60N3l12q7K18o0N2l00K95P6j82K64J61j64l05
$$ -25 136 103 -11 6 -201 -85 -150 -225 135 188 -124 -211 7 -53 -1 -301 -6 70 -112 152 313 149 -156
3378a56O7L51l15J34L6j15J24j64K72k8k76mJ34o2R3k59J96j12j3J32k54K79j25
$$ -156 -89 262 -53 81 117 2 126 -38 234 206 -70 -74 60 -2 91 -168 28 -84 -97 35 -219 60 -65
3401f5J56Kj98Q1K77l15n5J2J2M95l29k73J69J16o8m83K90K79o5j94K7K57m48
$$ -65 91 93 -105 -24 253 -62 -117 -105 -93 402 73 -200 -31 85 17 -466 -176 103 38 -156 -129 128 -320
3424c20K20k2J65M8k81J87P6o1j91K66R5l44P1J59J80k76j6K64j15K8l31J56k8
$$ -320 -100 -122 43 91 -190 -3 73 12 -179 87 182 -162 -91 68 248 -28 -44 220 105 133 -198 -42 -70
3447g0k34K84N9L8j33J31p6k3m8J91j11JJ82j95O1j70O9L32j62P1j4J20p1l77
$$ -70 -304 -20 39 77 -56 75 -1 -24 -72 119 8 9 191 -4 57 -113 -44 288 126 197 183 303 232 -145
3471a45q6L90m9k01L4m3k1or7J1J51n8l6R3Q7k31K24k4m4J47j47J51k57K9L92
$$ -145 -231 159 110 -91 -57 -100 -121 -127 -224 -213 -62 -120 -156 -63 24 -207 17 -7 -51 96 -51 100 -157 -128 264
3496B64l82K34p5LQ6q5k18K68J83k5j65o8J07r8q9K48p4k19j35L56l02J53j36
$$ 264 -118 116 41 44 130 45 -173 95 278 253 88 20 127 29 -60 188 114 -105 -240 116 -186 -33 -169
3519a69o2J28Q4l1J25J1k57L05n9J57l36J16L97k91j35k74L59j70j09K12Pk06
$$ -169 -231 -103 -19 -50 75 86 -171 134 75 232 -104 12 409 118 -17 -291 68 -102 -211 1 8 -198
3541a98K32q7P6k1M6O6L0j90j03K25J22m24k7J90L27l90J10J40j78JJ02K50k39
$$ -198 34 -53 23 2 48 114 144 -46 -149 76 198 -226 -253 -63 264 -126 -16 124 -54 -53 49 299 60
3564F0%p7J73j29M8j73O3k3j18J16K68k61Q0k6K6l44L03j07J09m2m1K55k41q1
$$ 60 60 -17 156 27 75 -98 -35 -58 -176 -60 208 -53 27 1 27 -317 -14 -121 -12 -54 -95 160 -81 -162
3588a62J33M78k85j32j37K46l30R5L6K39j18k60M63k12P8k8j05j11J59l54J80
$$ -162 -29 449 164 32 -105 141 -189 -94 -58 181 63 -197 266 54 132 104 -1 -112 47 -307 -127
3609a27P2k15K31m2J14j77k15M24Q0l35J28K22m5Rk73J41J5Q8O6j93Q2k45K10
$$ -127 -55 -270 -39 -81 33 -144 -359 65 145 -190 -62 160 115 124 -149 -8 7 95 161 -32 50 -195 15
3632A5K17k77R5k69J82J39l35K86O4k05R8k21L25J29l32j8J51J42k80K78q9j64
$$ 15 232 -45 50 -219 -37 102 -233 53 117 -88 10 -211 114 243 -89 -107 44 186 -94 184 95 -69
3654f9j5J12K1N1r8q4O1K94j77j79K42l09J90O7J7n37N52J08l07l3J36L22l56
$$ -69 -84 28 49 100 2 -82 -21 273 96 -83 159 -150 40 107 124 -413 139 247 -60 -93 43 365 9
3677IK65j58l0j66o0L02k21J71j50J09j09R6j9K07j27k46N6R2J47l26J72M7n9
$$ 9 274 116 86 -80 -140 162 -59 112 -38 71 -38 58 39 246 119 -127 -71 21 168 -158 14 61 2
3700BN0k7j2k01J12J76j44M9r0K46j46nM3K60k51o5J56Pj6j63n7L12m30K25K36
$$ 2 52 25 13 -188 -76 100 -44 5 -85 161 15 10 53 313 62 -3 153 160 144 -19 -76 236 -194 31 267
3725B67q7K2k36K2K9r6M0L9qj98J02M2Ln9o1J33J23q9K6J64j55J10J1O9M3k74
$$ 267 180 202 -34 -12 17 -79 -39 0 -8 -206 -104 -62 -59 -118 -179 -46 77 -12 14 178 23 133 144 213 256 -18
3751a8j19ml2L4k3k3L42k65R8J28j13k51q0K65j19J95k78L47J03m05K27J15q4
$$ -18 -137 -141 -173 -139 -162 -185 157 -108 -10 118 5 -246 -326 -61 -180 15 -263 84 187 -218 9 124 40
3774D0J65m82L41k0N0J9R6l37p2L16p9r4J11J09j25j59n6L83k87j3J67m63M08
$$ 40 205 -277 64 44 94 113 209 -128 -200 116 37 -57 54 163 38 -121 -177 206 -81 -94 73 -390 18
3797A8r9j8J56j58K23j44M7L3j70N2K01r4o5P4J8q4j80R9L81l08L5L04l63J02
$$ 18 -81 -99 57 -101 122 -22 25 58 -112 -60 141 47 -18 56 74 -10 -190 -91 290 -18 17 321 -42 60
3821F0k16J97J07l67Q6J74j1p1J56k15R8j58J04n2m9J37J06J22j45M1O4j57J51
$$ 60 -156 41 148 -219 -133 41 30 -41 115 -100 -2 -160 -56 -108 -157 -20 86 208 63 104 168 11 162
3844A62j77n3J67j6l75M84k06o0O1J76j37r9j40L60k8l60J25R5j51J66j50nJ09
$$ 162 -15 -68 99 83 -292 192 -14 -74 -13 163 26 -73 -213 147 119 -241 -116 -21 -172 -6 -156 -161 -52
3867e2q1L54j90k5J12J11k55l3K7K5p9Q3k42K04J54k41J5J48l2j25l2L18k45n
$$ -52 -133 221 31 6 118 229 -26 -59 -32 -7 -86 -3 -245 -41 113 -128 -113 35 3 -122 -154 164 -81 -86
3891h6RK06k29J27n7P4%k71L98J8k01K6n1m5J99j8k10Q6J2r6L16O4k70J81K3j56
$$ -86 -77 129 -100 27 -30 44 44 -227 171 189 -12 14 -37 -82 117 99 -111 -25 -13 -109 207 271 1 182 205 49
3917D9j90Q2k54J56O1j29J31K41k19m1J30J8j08M8K61j55mo7K14k74J95K6pj37
$$ 49 -141 -59 -313 -157 -96 -225 -94 147 -72 -113 17 35 -73 -25 236 81 77 10 224 -50 145 171 164 27
3941B7j33J18K86k97n8R0o2K20k75m4K53l71K18k07K89O8l21K20K76r0k36L77
$$ 27 -106 12 298 1 -57 33 -29 191 -84 -128 125 -246 -28 -235 54 122 -199 21 297 207 -29 348
3963C48j17l46J42j36P9J58jJ4j93k04J84J8O2R5o3Mj23R2kq4J0K86k34K62l98
$$ 348 231 -115 27 -109 -30 128 127 141 -52 -256 -72 -54 8 103 40 44 -79 13 11 -73 -63 223 -11 251 -147
3988a47O5J53o0J85j12o0j24K08k08K01j87J67m1r5J48n2q4L04j57R5k4j66J98
$$ -147 -82 71 11 196 84 24 -100 108 -100 101 -86 81 40 -55 93 41 -43 261 104 199 175 9 207
4011B07l54J95l11M18l1k14J26J41k37K00M2j44K5K31j57J58l22J84j73K26j52
$$ 207 -147 48 -263 155 124 -90 36 177 -60 140 182 38 63 294 137 295 -27 157 -16 210 58
4032E8K0j33J77J73l50Q3j44J15L4%l17J73L5k7Q4OJ59j19j97K78j11O5m9j92
$$ 58 78 -55 122 295 -55 28 -116 -1 33 33 -284 -111 -76 -103 -19 -13 146 27 -170 108 -3 62 13 -179
4056a79K79k35K28O3j56qK2P5m9M0l17M16k26K15j98O1m2l1PK00j97J46n0j13
$$ -179 100 -135 93 156 0 -8 14 89 40 80 -237 179 -47 168 -30 31 -11 -42 -35 165 -32 114 64 -49
4080d9l2P4K2P1J0l43J93J31J85l26K4K17m91K55K25j00k41k3K84o7P7n4k0L3
$$ -49 -81 -7 15 86 96 -247 -54 77 262 -64 -40 177 -314 -59 166 66 -175 -198 86 19 96 42 22 55
4104E5j80l3L12k66K43%L4P1j10k43J98j10M7jJ46l36K93k4j93L8o9J80k47j5
$$ 55 -125 -158 154 -112 131 131 165 236 126 -117 81 -29 18 17 163 -173 120 96 -97 -59 -128 52 -195 -210
4128b10J71m4K40l92J70J22L0j72oj1J76n2q8J35K54l82j14J82Q0L2o6k2k88K49
$$ -210 -39 -83 157 -235 -65 57 87 -85 -91 -102 74 22 -66 69 323 -59 -173 9 89 121 55 33 -255 -6
4152fl03N41j96M8N3k07K73j55K4j38r4L8J31o0k94M69k35P9J06K1J9K56l71j33
$$ -6 -309 232 36 84 137 -70 203 48 72 -66 -160 -122 9 -51 -345 124 -111 -32 74 95 114 370 -1 -134
4176a34K25k43L63k14j16K93j74j21K42J48k56k13L64k01J39l54L14o3p0J79l7
$$ -134 91 -152 211 -3 -119 174 0 -121 121 269 13 -200 164 -37 102 -252 62 -1 -71 108 71
4197G1n9L06j07o2k03O0n2n4J84j05P6P7j45K4k0q6LJ58rq6p7o7K39K2k25N4m6
$$ 71 12 318 211 149 -54 6 -46 -100 84 -21 55 132 -13 11 -9 -95 -92 66 57 -29 -106 -173 66 88 -137 -83 -129
4224a29p8M9K11j5p1K00j33m4o6J1K88k50K66l52J98o0j30J01m5P7lp1j2K01k5
$$ -129 -207 -158 53 38 -33 167 34 -10 -76 -65 223 -27 239 -113 85 25 -105 -4 -49 28 25 -46 -58 143 118
4249A18j10K02j42k17L24r0k02K65j91L1k4K29j06J62k94L5Lm3P4k22J03J59P4
$$ 118 8 210 68 -149 175 85 -117 148 -43 -12 -36 193 87 249 -45 -10 -7 -50 24 -198 -95 64 138
4272A38k49K99j18m4oN0j50J55K08m60L49j48N4q1j3j27P3K2J94k61R9n4J02j32
$$ 138 -111 188 70 26 20 70 -80 75 283 -177 172 24 78 -3 -16 -143 -70 -48 146 -115 -16 -70 32 -100
4296a00K64j26j5M2P4j10m3q8P9L9M7p2j00J45J21j28K2L7q9o5K5r4R0k22K89
$$ -100 164 38 23 65 139 29 -14 -102 -23 16 63 -9 -109 36 157 29 51 88 -1 -66 -41 -135 -45 -267 22
4321B2l8j61K51r8j56J57Q6l05P2N8J60K6k08k30M71j25P8j71N5j70K98k65J77
$$ 22 -16 -177 74 -24 -180 -23 63 -242 -170 -112 48 74 -134 -364 107 -18 60 -111 -56 -226 72 -193 -16
4344a6M5j64l4K46m4K40l25J07R2r9MK93j55l12L0K07q9q3J58j07J81l15J64K
$$ -16 29 -135 -169 77 33 273 -52 55 147 48 52 345 190 -122 -92 115 26 -57 101 -6 175 -140 24 26
4368B6j19p0J1K89J33m18L56k98K12Ro9k12J29J57j85j71J96L38K1j62l00J74
$$ 26 -93 -163 -152 137 270 -148 208 -90 122 131 62 -150 -21 136 -49 -220 -24 314 335 173 -127 47
4390D7m1j03j07J49J26J11j70K8j25j85L40m4L4j31J70p1J72k1l01L31j46m62
$$ 47 6 -97 -204 -55 71 182 12 40 -85 -270 70 26 60 -71 99 28 200 179 -122 209 63 -399
4412c99K70j27J62p1klK62j12p2J77J0j73K6RL94m84K16j67J96Q0j58m9k02L64
$$ -399 -129 -256 -94 -165 -167 -170 92 -20 -92 85 95 -78 -52 -43 351 -133 83 -84 112 192 34 -15 -217 147
4436A47k15J04j16P7j22K25l6J67p3J3J6l62J17o6K43Kk7J65j47j33p9m2n4K80
$$ 147 -68 36 -80 -3 -125 100 64 231 158 171 187 -175 -58 -124 119 121 94 259 112 -21 -100 -142 -196 84
4460H4O2j74j17j58L76Q4j75J66m66L37O5J6J52Q5k79k51J13O5j92K01M8j41J90
$$ 84 146 -28 -145 -303 73 157 -18 148 -318 19 84 100 252 337 58 -193 -80 -15 -207 -6 42 -99 91
4483I1j97K67l40J47L7M3k13J7L30p3r4j80K46j27m5j08K51k20K77k72N5K2M3
$$ 91 -106 161 -179 -32 5 48 -165 -148 182 109 15 -165 81 -46 -91 -199 52 -168 109 -163 -108 -86 -43
4506d3Nk08M67l87L17l37P6l23K92K21q9K6k19K20J68k37n4j5J62j48N08n24K31
$$ -43 -38 -246 221 -166 151 -186 -110 -433 -141 80 -9 17 -202 18 186 -51 -105 -120 42 -106 402 -122 109
4529A09n8J06K2l38L11j67k96K17J31k24r6j7M31j71M9n1J40j20q4R0J4L2l36
$$ 109 51 157 179 -159 152 -15 -311 -94 37 -187 -283 -300 131 -40 9 -42 98 -22 -106 -16 -2 30 -306
4552c06L93R7l17J25J04K14j88J36k01p7k6P9l85K50J07j45J93M0R3k32j7J8j80
$$ -306 87 184 -133 -8 96 310 122 258 57 -20 -46 33 -352 -102 5 -140 53 93 186 -46 -63 -45 -225
4575b25N0m4J39r7J63K17m5j8k62J22P3p0j76m3M35m47O3j8J91k47K55n2P8j9
$$ -225 -175 -219 -80 -177 -14 203 158 140 -122 0 73 3 -173 -216 219 -228 -165 -183 8 -239 16 -36 42 23
4599B3j15j03P3N5J26L07m03O0j33J26j31K35o5m8m5j4K10p2l17K18J06j87J20
$$ 23 -92 -195 -122 -67 59 366 -37 23 -110 16 -115 120 55 7 -38 -52 158 86 -231 -13 93 -94 26
4622B6Q5M9O8l25Q9L45m52O6o9K20j8L3l45K92K90l07LJ41j39q9L0j23J71R7k08
$$ 26 111 160 228 -97 -8 337 -115 -49 -118 102 84 117 -228 64 354 47 50 191 52 -37 -7 -130 41 138 -70
4647g0K71k37k83N39NK9Qj49j84j57O12k02j6o0j11k5n1m6r4J45P4j79M35l63
$$ -70 201 -36 -319 220 225 254 262 113 -71 -228 384 182 166 106 -5 -30 -81 -127 -221 -76 -2 -181 254 -109
4671a09j32Q0J47pj35q4K65l3J12j59l7N4O4J13j19N7p9Q3p5R2j62LJ53m1L0k57
$$ -109 -241 -161 -14 -21 -156 -240 25 -8 104 -55 -92 -38 26 139 20 77 -2 81 6 98 -64 -61 92 51 81 -176
4697a76J06L19j49K0l7j38j04J25J6l77M11k6o9m2j07K73J64j75l15K66R6rj31
$$ -176 -70 249 100 120 83 -55 -159 -34 -18 -395 16 -10 -79 -121 -228 45 209 34 -281 -15 81 72 -59
4720e9k5L26k96J16o1N4k48j4L79l8q4M1Mk62o5M5K07J56j34J2r3J11q5L4q7r0
$$ -59 -84 242 -54 62 1 55 -193 -207 172 134 50 91 95 -167 -232 -187 20 176 42 54 -39 72 -13 21 -66 -156
4746a56J55K93O7l62L28l58j71K83k48j95K56O7K10j98PJ05k97L07N8J12k12r7
$$ -156 -1 292 359 -3 325 -33 -204 79 -169 -364 -108 -41 169 -29 -22 83 -214 93 151 263 51 -46
4768d6M3j82o4M97j84J71j68l5P9j25J04No4Oj79K48j67j33L68m3p3k64J69n9
$$ -46 -3 -185 -249 248 64 235 67 32 111 -14 90 95 31 37 -142 106 -61 -194 174 131 58 -206 -37 -96
4792i6J38j41J67j59J10n6J42J32l32J11j18L41j94J26J01k08q8m6K27k51j32
$$ -96 42 -99 68 -91 19 -37 105 237 -95 16 -102 239 45 171 272 64 -24 -70 157 -94 -226
4813b26M31k91l2mJ55n9k5J33N6j2l50L62k41J07J40k13J38j15j3O2J67j83l3
$$ -226 205 -86 -118 -122 33 -26 -51 82 138 126 -224 138 -103 4 144 -69 69 -46 -59 3 170 -13 -46
4836d6p3J5o0J85k05N07j99k33K05p2L5k95k4K76j27j9K47j10j03J46o2J65l31
$$ -46 -119 -104 -164 21 -184 323 124 -109 96 24 59 -236 -260 16 -111 -130 117 7 -96 50 -12 153 -178
4859a78K5K09j58K9lJ20j52m0K64l23K81p3L5RN7J4j31j39m5L27j07r5J35l11
$$ -178 -153 56 -102 -73 -76 44 -108 -148 116 -207 74 1 36 45 102 116 -15 -154 -199 128 21 -74 61 -250
4883b50L29J02j14j8r0L38m95L53n6k24q1J25J43J18j70k07J80J40j11n2n3M9
$$ -250 79 181 67 49 -41 297 -198 155 99 -125 -206 -81 62 180 10 -197 -17 123 12 -40 -93 -44
4905d4k58K40P0K19l16P0p9n3J90j05J25p9J34m5j26O8R6k34J60pl40L64O0j10
$$ -44 -302 -62 8 227 -89 -19 -98 -151 39 -66 59 -20 114 69 -57 11 107 -127 33 26 -314 50 110 0
4929@P7J41j90p4J3O6J13l37K93Ll0o6j5p5j07J72J60j23j88P2L63k02p7j13j74
$$ 0 77 218 28 -46 -33 33 146 -191 102 105 75 9 -6 -81 -188 -16 144 21 -167 -95 268 66 -11 -124 -298
4954b98K93o2J80l70J98j88J44K19j04j76K17n9K28m62L78j15p4J00J37L6l15
$$ -298 -5 -67 113 -257 -59 -247 -103 116 12 -164 53 -6 222 -240 138 23 -51 49 186 222 -93
4975i3O7J1j32j0P4J86P6j76JK9J0L0L9K4j71o3J90R8m48K22K07l81J81K2j57
$$ -93 -26 -15 -147 -157 -83 103 179 3 4 33 43 73 112 136 -35 -98 92 190 -258 -36 171 -210 -29 -7 -164
5000a64K46J28k68l1L03j88q2O3P2M4k97n3j49M24k03J28J84j82n5K01j3j61n5
$$ -164 82 210 -58 -89 214 26 -56 7 79 123 -174 -227 -376 48 -155 -27 157 -25 -80 121 108 -53 -108
5023a08Q5J94j07L9p1O7k10K4L03k27o6L2O9M7J72j51k07J66m2j18O1J99k55M15
$$ -108 -23 171 64 103 32 99 -111 -87 216 -11 -77 -45 24 71 243 92 -115 51 9 -109 -48 151 -104 311
5047C11l59n3L87l25L15k34l0L3J07m63L95k2J49k92J3L27l67j2J0K47k49K11
$$ 311 -48 -101 286 -39 276 42 12 45 152 -311 84 62 211 -81 -68 259 -108 -120 -110 137 -112 99
5069I9k9m1j39M38l02ok5J42l34L07j65K43j47k4j70K75j51M4k6rJ95j83jk11
$$ 99 70 29 -110 328 26 20 -5 137 -197 110 -55 188 41 17 -153 122 -29 15 -11 -20 175 -8 -9 -220
5093b20L20l09M55k38N4J40j94j07J17j79PM7Q0J7q5J88M0k28L24k95J34j00K39
$$ -220 100 -209 246 8 62 202 8 -99 18 -161 -154 -107 -27 -10 -95 93 133 -95 229 -66 68 -32 207
5116B07p6j12%l78L13q6ML1MJ15k94J88j65L6K3M34p5q8k14J86K45l61k94K20
$$ 207 131 19 19 -359 -46 -132 -128 -97 -93 22 -272 -84 -249 -213 -190 244 169 81 -133 53 298 -63 -357 -137
5140a37L1J94j96o6J99o6Mr2J03m4J42M4r1m7n7o6M02l53M4o9M27k62k53J73l1
$$ -137 -106 88 -108 -174 25 -41 -37 -129 -26 -70 72 116 25 -22 -79 -145 257 -96 -52 -121 306 44 -209 -36 -67
5165f7j95J09K62j92R5m8j3M3J65j96k8k76L44p5N4J18j63R6m2j5Jp0K81k62J47
$$ -67 -262 -153 109 -83 12 -36 -49 -6 159 -37 -65 -341 3 -72 -18 100 -63 33 -9 -24 -23 -93 188 -74 73
5190G3l0M7j68r3M2lJ76Q1j02q2lm5J88q5O6N4j6j33j11J33K8J73j55r9p1P2Q
$$ 73 43 90 -78 -171 -129 -132 44 125 23 -59 -62 -107 81 -4 62 116 100 -33 -144 -11 17 190 35 -64 -135 -63 -55
5217e5j54M10k96n9J71L0k97j16K19n5K58l3p5J15M2j98J31j59J00K2J16j83j8
$$ -55 -209 201 -95 -154 17 47 -250 -366 -147 -202 56 23 -52 63 105 -93 38 -121 -21 1 117 -66 -84
5240h4K13j17j77K30k53K32l2p0J80L9m92L53Q5k41j30P2OK74k03Q0P7K13k19
$$ -84 129 12 -165 65 -188 44 12 -58 122 161 -331 22 107 -134 -264 -192 -186 88 -115 -35 42 255 36
5263C6n6Pj03K92p1J28J23n46J88J38j40kM7M5q4p9R0K44j84r8kR4r1m1P4k20
$$ 36 -20 -13 -116 176 105 233 356 -190 -2 136 -4 -6 41 86 2 -77 13 257 73 -25 -27 67 -24 -65 9 -211
5289b11K58k64L48q3P9j80M4K83m73K82j84j06K44pR3N7l10J2M70qm18J97j29
$$ -211 47 -217 131 48 127 -53 -9 274 -199 83 -101 -207 37 30 123 180 -130 -118 352 344 -74 123 -6
5312fK7k41L48j45k48J44m7K56k72qK04R7j25K56k43k0R9j71qj40J27O8J36O5
$$ -6 21 -220 128 -17 -265 -121 -168 88 -184 -192 12 109 -16 240 -3 -23 76 -95 -103 -243 -116 -48 88 153
5336A53k58o6L45j07j35R1p7j00J17P5L7l9j34J32j52J26K5%L3r2R1K2j62J72
$$ 153 -105 -171 174 67 -68 23 -54 -154 -37 38 75 36 -98 34 -118 8 33 33 66 -26 65 87 -75 97
5360I7l33J70Q6j7J53j22k49j5L29q4j41j56J64J64n0r1N5J62j77j9K17J8j72
$$ 97 -236 -66 20 3 156 34 -215 -230 99 15 -126 -282 -118 46 -4 -95 -40 122 -55 -74 143 161 -11
5383a1J02q7K11k88n3L82m09K40k17K36k95K74M2m35L66j2N8k82N89m33q7J62
$$ -11 91 4 215 -73 -126 256 -153 87 -130 106 -189 85 127 -308 58 46 104 -178 411 -22 -109 53
5405E3J4n0r9j5m0j28J26M7J11j80K86J99k97j74J24kk67J28K47j79M3L03k8j15
$$ 53 67 17 -82 -97 -137 -265 -139 -92 19 -161 125 324 27 -147 -23 -25 -292 -164 83 -96 -53 250 222 107
5429A07j43m5K88l39K7O8Q1j02K09l54RJ3L7K45Q8m32J01M05m45K62r0O6q9K68
$$ 107 -36 -81 207 -132 -105 -37 44 -58 151 -203 -194 -181 -144 101 189 -243 -142 263 -182 80 -10 56 -33 235
5453B35p7r4j01j67m0M8Q0J9p9K1J23O3j72j16OK07j2J35k24qL31n0r2J33k31
$$ 235 158 64 -37 -204 -244 -196 -116 -97 -176 -155 -32 31 -141 -257 -251 -44 -56 79 -145 -153 178 128 36 169 -62
5478f2p3K88k89M19l37J52j73K03j84j85K80J95k68qJ07r1J82o3k14j6K24j64
$$ -62 -135 153 -136 283 -54 98 -75 128 -56 -241 39 234 -34 -42 65 -26 156 93 -121 -137 87 -77
5500g7J55J55k76r0Q0L1L9j10L51Q3m06rl4N7J33p3o0r3K9O3K06l01J51K24q9
$$ -77 78 233 -43 -133 -53 -22 17 -93 258 341 -65 -74 -108 -51 82 9 -51 -144 -115 -52 154 -147 4 228 139
5525A39k44J89J73j77k16K65j51L9j21k2L2Q5j26qK89l46J85j6n8K83l89K82k7
$$ 139 -105 84 257 80 -136 129 -22 17 -104 -126 -94 -9 -135 -143 146 -200 -15 -31 -89 194 -195 87 60
5548F0o0j49KK09n6Q6Q9j51J14l1k64J64K45j48r4l1k21L13q1k5K44k37QQ9q8
$$ 60 0 -149 -147 62 6 92 181 30 144 113 -151 13 258 110 16 -15 -236 77 -4 -29 215 -22 -14 75 -13
5573a3P9k32M8J81j62P1j81K38J77m54L26q6O9j75K51j54J6J54j70j56jO1K36
$$ -13 66 -166 -118 63 -99 -28 -209 29 206 -248 78 -8 61 -114 137 -17 -1 153 -17 -173 -174 -113 123
5596A23n4j39J17k9j23Q6K03r3j9j77J88m0k43J70O8NN8k76j03N36m04j55K67
$$ 123 69 -70 47 18 -105 -19 184 91 72 -105 83 43 -200 -30 38 43 101 -175 -278 258 -146 -301 -34
5619c4M5k65L18q4j41j99L88j02l4N1O4J40m01Q4J48N2J73r5l6J28l03J67N4n2
$$ -34 11 -254 64 -20 -161 -360 28 -74 -108 -57 7 147 -254 -170 -22 30 203 108 72 200 -103 64 118 66
5643F6j52jP9M4N7l54J54K33m3l11M88l53K51k88J28K30k62P1m48L09O2N7j80
$$ 66 -86 -87 -8 36 93 -261 -107 126 83 -228 260 -93 158 -130 -2 228 -34 37 -411 -102 -40 17 -163
5666a63M4Q9J88J1l01K39q1j15J5J44J43r0j76J27N3k49J27O3p6J11n76L07L38
$$ -163 -119 -30 158 169 -132 107 26 -89 -74 70 213 123 -53 74 127 -122 5 68 -8 103 -473 -166 172
5689A72K3j99J32j74j07K78%j92m2L50l68K36l09K03j20O7n0J17k41L11L9l00
$$ 172 195 -4 128 -46 -153 125 125 -67 -109 241 -127 109 -200 3 -117 -50 -100 17 -224 87 126 -174
5711a74K97j73N5j09J08L15l19j69J33N8j74q4L00M9l16J70J41Pj09K15l55K22
$$ -174 123 -50 5 -104 4 319 0 -169 -36 22 -152 -236 64 113 -203 -33 108 115 6 221 -134 88
5733H8J51m23L62l29R1J9K25l16J50r3N0R4K91k02P6m82L42j47K89k11k99K19
$$ 88 239 -184 178 -151 -60 -41 184 -132 18 -75 -25 69 360 158 234 -248 94 -53 236 25 -274 -55
5755e5n6J33o8j16L98j44j99l9J62j56K32o0r9r5LK65j37J82p7j32j08k8L56l19
$$ -55 -111 22 -46 -162 236 92 -107 -146 16 -140 92 32 -67 -162 -159 106 -31 151 74 -58 -166 -194 162 -157
5779a57kJ17mN9q2Q4n2j22K57l26J66pJ47j28J95k09L6J40p6P8l39L61J0j40j5
$$ -157 -159 -42 -46 13 -69 15 -37 -159 98 -228 -62 -69 78 -50 145 -64 -28 112 36 114 -225 136 146 6 -9
5804iQj04Q7K2P8j23N6j23o5J0Q3m5J75j45j62L58jj75J35K7q6m1J65o4k4L3j15
$$ -9 -1 -105 -18 4 82 -41 15 -108 -173 -163 -80 -125 50 -95 -257 101 100 -75 60 87 1 -40 125 61 37 70 -45
5831d5j3R3J47k10M5K09k90J1K33L5k31j64J96k01J36J07r4J3J40N9l30J45k32
$$ -45 -58 35 182 -28 17 226 -64 -53 180 215 -16 -180 16 -185 -49 58 -36 -23 117 176 -154 -9 -241
5854b41L86R3r1j56k60K29J16l37kL13M6N4k15K71k78nJ20Q1j33J6jQ2j36m5K53
$$ -241 145 238 147 -9 -269 -40 76 -261 -263 50 96 150 -65 206 -72 -77 43 124 -9 7 6 88 -48 -93 160
5879A60l24K43k83J20J72k71n3K64l9j27K72n5Q7k90K33j3kJ4j73N8K42j51J09
$$ 160 -164 79 -204 -84 88 -183 -236 28 -11 -138 134 79 166 -124 109 96 94 108 -65 -7 235 84 193
5902A93j44K3j27J37k22Q3J27l8J16j55J18n1q8J97j40J01m6N5n7j07L5P9k4J9
$$ 193 49 72 -55 82 -140 -57 70 32 148 -7 111 60 -28 169 29 130 84 139 82 -25 10 89 65 84
5926H4k1k96K98R6k69O4k22K36q8l1J10p2J67j08O5j34J21J33j55m4K21l17k85
$$ 84 63 -233 65 161 -108 -44 -266 -30 -118 -149 -39 -111 56 -52 13 -121 0 133 -22 -66 155 -162 -447
5949d47L50M7j3L01j44o7J21j22L9K35j39j60k7N9k30K51j59q3J58J4O1Kj18j92
$$ -447 -97 -50 -63 238 94 27 148 26 65 300 161 1 -26 33 -197 54 -105 -188 -30 -16 45 47 -71 -263
5973b63M14k64K19j39r2p3O8K22j37O9l6j83K25K3rk1J62k07K24j97q7M3K37j66
$$ -263 151 -113 106 -33 -125 -198 -130 92 -45 24 -12 -195 30 53 44 23 185 -22 202 5 -82 -39 198 32
5997C2j16K1M2J0J16p5j56L22l17k4Q0K56l05K33j13l6p0J06p1J49L6l33K89j52
$$ 32 -84 -63 -21 -11 105 30 -126 196 -121 -145 -65 191 -114 119 6 -30 -100 6 -65 84 120 -213 76 -76
6021g6Nn7j85K04J88l2j2J55j48L5j28K2N7j4p3J58N7j70j70J94K13k4j24j50
$$ -76 -71 -128 -313 -109 79 47 35 190 42 77 -51 -29 28 14 -59 99 156 -14 -184 10 223 199 75 -75
6045g5L17j7k93j89J66K4l5P8j49J75J91q9l23K87j95K96m7k41J02j42J22J31
$$ -75 242 225 -68 -257 -91 -67 -102 -24 -173 2 193 104 -219 68 -127 169 122 -119 -17 -159 -37 94
6067I4k72N0J11J24m5j70J57J65k19O5k76O8J02Q0j9J28j72J69j16o3j0k30L01
$$ 94 -178 -128 -17 107 62 -108 49 214 -5 60 -216 -148 -46 34 15 143 -29 140 24 -39 -49 -279 22
6090B2l5j87K13p7j89J6L23rP3k35K44k56Q7j06J55K83k05j06K7R6j50J67l64
$$ 22 -13 -200 13 -64 -253 -237 86 77 150 -85 159 -97 -10 -116 39 322 117 11 38 134 -16 151 -213
6113b13N33m92K36J12M8m2l85K25p0j57N17j08j44j06j02K0J49J02n6j8L4n4p2
$$ -213 320 -172 64 176 224 182 -203 22 -48 -205 312 204 60 -46 -148 -128 21 123 67 49 83 29 -43
6136d3kj60O0J80K46m19M37k25j14J59j18L3j88K48k03R9J98l25N2J38k7M1l17
$$ -43 -45 -205 -145 35 281 -138 299 74 -40 119 1 34 -154 94 -109 -10 188 -137 -85 53 26 67 -250
6159b50Q7J88J27k9jq4mj42P4RJ6J3l13K97p4j08k6K00j00Q6k61J37K16J17L1
$$ -250 -163 25 152 123 122 38 34 -108 -34 -25 -9 4 -309 -12 -86 -194 -220 -20 -120 -34 -295 -158 58 175 206
6184B06j86q7K13j62K17k59K48k5k9j06L31o28J13K23j77J72m6n4Q3n0K2N3j36
$$ 206 20 -67 146 -16 201 -58 190 165 136 30 361 -267 -154 69 -108 64 18 -36 47 -3 19 72 -64
6207f4n6J71M3j05j77M8J45j41K23k06p7o2K84l3K9j21L56j95j25K61j62n7r5
$$ -64 -120 51 94 -11 -188 -140 5 -136 87 -119 -196 -258 26 -7 22 -99 257 62 -63 198 36 -21 -116
6230a16Q9K41j34r7L4j00N1J79K3j57j6m1J07j27L3Q8k50J09J21o6K8J96n03J08
$$ -116 -27 214 80 -17 17 -83 -32 147 170 13 -3 -44 63 -64 -31 57 -193 -84 37 -29 -1 195 -308 -200
6254b00J11M01k01k80J3J52P2J7lj04J2R8k07K29j21R3J98k47j63J6RQ0J43Q9
$$ -200 -89 312 111 -169 -156 -4 68 85 82 -22 -10 88 -119 110 -11 82 280 33 -130 -114 -105 -25 118 207
6278B07N1l94kJ04k20L29k45J96j06J74j34k2k60M19O6k97K06j68j08K14J16j27
$$ 207 258 -136 -138 -34 -254 75 -170 26 -80 94 -40 -62 -322 97 163 -134 72 -96 -204 10 126 -1
6300aJ37J26m17Q3J20J14k63J12j45J56j51j87M58j81K71l93K54M0j87P7Q3j76
$$ -1 136 262 -155 -72 48 162 -101 11 -134 22 -129 -316 142 -39 232 -161 93 133 -54 23 106 -70
6322g0R2j88K33k46K40l43K44Op6j33K11K38l61K63m2J41j81O0j67J48k86J77
$$ -70 22 -166 67 -179 61 -282 -38 -32 -108 -241 -30 208 -153 110 68 209 28 88 -79 69 -217 -40
6344d0o8L3Q7jK7j88K38j5j35J50j05Q1K9k23J58j98K22J46k0k36K78k73J33q2
$$ -40 -108 -75 12 11 38 -150 88 73 -62 88 -17 64 93 -130 28 -170 52 198 178 -58 220 -53 80 -2
6368bJ62k2QL1j83J32J16l35L1K41n16K75R1j93K18J54l12K74k93K34m7j01j15
$$ -2 160 138 146 177 -6 126 242 -93 -62 179 -337 -62 29 -164 54 208 -104 170 -123 111 64 -37 -152
6391a52L9K29l13J62L56k82m6L5j65r7p6J45K72ol76L23j75K23m7K55j77p0l9
$$ -152 -113 116 -197 -35 321 39 -7 28 -137 -234 -310 -165 107 101 -275 48 -127 96 49 304 127 57 18
6414A8j05K57p9k08Q7o3J54M6j38N7L9pJ1j51l2l3N6J7k3L84k61Q3j04N8P8l34
$$ 18 -87 170 91 -117 -30 -93 61 107 -31 26 65 58 69 -82 -114 -147 -91 -74 -97 287 26 109 5 63 141 -193
6440a93R7j5p9K0N7K61j82p9K49j65R7P2j10K2k4k9j79J49K60L1l42j3K7j50K33
$$ -193 -96 -111 -190 -170 -113 148 -34 -113 136 -29 68 140 30 52 28 -1 -180 -31 229 260 -82 -95 -68 -218 15
6465A5Q9p0K3k10O6O5m5Q8J69m82J39J22O2J14j08o5j09N0K77j53O1j92K12k64
$$ 15 104 34 57 -153 -87 -22 -67 21 190 -292 -153 -31 31 145 37 -28 -137 -87 190 37 98 -94 118 -146
6489a46K27k82K85k53J57j67J82J00j36R8n5p5N9J01M6k58O7J44k84J04k8K34
$$ -146 81 -201 84 -169 -12 -179 3 103 -33 65 10 -65 -6 95 141 -117 -50 94 -190 -86 -114 120
6511A20j54k26L80j32j78J95r0J24k29L50m33M29J2k45k53L02J07Kn0m1K78j60
$$ 120 -34 -260 120 -12 -190 5 -85 39 -190 160 -273 156 168 -77 -330 -28 79 81 31 -10 268 108
6533A08m3j6o4O2n7k4K23l61M48l45lm8J13J50j66J00k2P3n7j28j18K50l1K8k21
$$ 108 65 49 -15 47 -10 -34 189 -172 276 -69 -72 -120 -7 143 -23 77 55 128 71 -57 -175 75 44 72 -149
6558a49K38O6r8j17j49J07j77J88j30M9k4L42j44n4N0N1J04o4o9P1k59K09l9J34
$$ -149 89 155 57 -60 -209 -102 -279 -91 -221 -172 -196 146 2 -52 -2 49 153 89 20 91 -168 41 2 136
6582A36p5j35p2N4O8J23j48j6k9n2J7MK40l46L33k16K65k79n7L73k02j26J76Q7
$$ 136 61 -74 -146 -92 -24 99 -49 -65 -94 -146 -129 -125 115 -231 102 -114 151 -128 -185 188 -14 -140 36 123
6606A23q2M2K1l0o6Q6J16k15J77j63m0j25LK38r5j31J62j26J50J61j86n6lj83
$$ 123 41 83 104 74 8 94 210 -5 172 9 -31 -156 -153 85 -10 -141 21 -105 45 206 20 -36 -39 -222
6630b22O0K96j4j11o0K3J15N0j87J29kj93L55L0j43j00K32j01r4M5l9j56J53j6
$$ -222 -162 134 120 9 -51 -28 87 137 -50 79 77 -116 239 269 126 26 258 157 63 108 69 -87 66 50
6654E0k83J55L3n8j52L16j30K21j67j41K39m5j43J37j73J82o5O6n6L0P7k12J32
$$ 50 -233 -78 -45 -103 -255 61 -69 152 -15 -156 83 38 -105 32 -141 41 -24 42 -14 16 93 -119 13
6677A3L13m23J78j42J48J92j35oj93l8K08k29Q0K5j8j98J01K61k29J52k67M05
$$ 13 326 -97 81 -61 87 279 144 138 -55 -93 115 -114 -34 -9 -27 -225 -124 137 -92 60 -207 198
6699A98l65J48J96k26L7L3J28j46o4J0j5q0K87k08L5M9p7p7P8J19N8l0O6L1k24
$$ 198 -167 -19 177 -49 -12 21 149 3 -61 -51 -66 -146 141 -67 -32 17 -60 -137 -59 60 118 88 154 185 -39
6724c9j9L1L9K6r7L7K26m10Q3O1J06O2l7r2k43L92l50L28o7m38N55j45O9J0j26
$$ -39 -58 -27 12 38 -59 -22 204 -206 -123 -62 44 106 69 -23 -266 126 -224 104 37 -401 154 9 78 88 -38
6749c8o6J91K0j20J7J8O5k0n1l1K31o6p5R3k17K18j4k97J97K9M7j82K31m17K27
$$ -38 -104 87 107 -13 4 22 87 67 16 -15 216 150 75 168 -49 169 155 -142 55 84 131 -51 180 -237 -10
6774a0M0L60l58p4k98K00K07l6L2N7j37j41J28R6L0l7o9j40J21n2pP1r1M8J41
$$ -10 30 390 32 -42 -340 -140 67 31 63 120 -17 -158 -30 66 96 59 -10 -150 -29 -81 -88 -17 -108 -60 81
6799H1j3j53J33n9k5J51j28R7nj76Q0R1N5j06k23K06j79K69J14k85Q6L11m77m2
$$ 81 68 -85 48 -11 -36 115 -13 84 79 -97 -17 74 129 23 -200 6 -173 96 210 -75 11 322 -155 -197
6823a97L20j46j82J24J56k85J32J64j51l3P6K04j01j5O6R3l99P5Q5K57k42o2L2
$$ -197 123 -23 -205 -81 75 -210 -78 86 -65 -98 -22 182 81 66 132 225 -174 -99 -14 243 1 -61 -29
6846b9q5J16K1j04j3l0L6J38j26J67j71j6j7J71j8J49j90j41J69K0J8q3J22k0
$$ -29 -114 2 23 -81 -94 -124 -88 50 -76 91 -80 -96 -113 58 40 189 -1 -142 27 47 65 -18 104 84
6870H4n0j75J43l2r4J15Q0m0K9n1J57l90L5K44j12O0j39J30l6J46l7o1J24N9p0
$$ 84 34 -141 2 -30 -124 -9 71 31 60 9 166 -224 -189 55 -57 3 -136 -6 -42 104 67 6 130 189 119
6895A19P1k15K02m94K65O7j37L83l35k10K40J89k31j08J41J1J58k0j83K98l70
$$ 119 190 -25 177 -317 -52 15 -122 261 -74 -284 -44 145 -86 -194 -53 -42 116 96 -87 211 -159
6916a59J79k54K98j58J58J32k98K55K3j64L7j58P7J54j77J59j38J07m1L4r9K5
$$ -159 20 -234 64 -94 64 196 -102 153 176 12 49 -109 -32 122 -55 104 -34 73 32 66 -33 -8
6938hM0p4J73k9k06M0j45M14k67J24K3p8j86N2J64l5j20K11k19K1K09j98L2K11
$$ -8 32 -42 131 102 -104 -64 -209 205 -62 62 85 7 -179 -127 37 2 -118 93 -126 -105 104 -94 -62 149
6962A49k15j1K96l22K16J35j75j36J68N1l66K32MM7O1j57J52k35RJ50N4j31o1
$$ 149 -66 -77 219 -103 113 248 73 -63 105 156 -210 22 26 73 134 -23 129 -106 -97 53 107 -24 -85
6985h5K45k98J39K4L7n7k0O0L8j45j24J61J00j37J61O2q0j05no9j59L3J95K22
$$ -85 160 -138 1 25 62 5 -15 45 83 -62 -186 -25 75 -62 99 161 81 -24 -29 -98 -257 -224 -29 193
7009A93j67J85n54O08l94j0j3k6P3M8PK55j81o4J75M2k30J29k10J90m9q7R8j04
$$ 193 26 211 -343 265 -129 -139 -152 -178 -105 -57 -50 205 24 -40 135 177 -53 76 -134 56 7 -80 18 -86
7033h6J11j67K55j01LK1l8r7M43l57K71l02NK33r4J38k49k13K07P7O2l46L50k69
$$ -86 25 -142 113 12 15 36 -2 -99 344 -13 258 -44 -39 194 100 238 -11 -224 -17 60 122 -224 126 -143
7057a43mj17L43j65O6R6J55k45J20J41ok10j34L3L09k29O0K0j11k8j20J39k41
$$ -143 -147 -264 79 -86 -20 76 231 -14 106 247 241 31 -103 -70 239 10 70 90 -21 -49 -169 -30 -271
7080b71K50K61k0j71O0j62R1j22L6j20J90R8k99L06R0j58k36J68P0k17L64l44
$$ -271 -21 240 220 49 109 -53 38 -84 -48 -168 22 120 -179 127 217 59 -177 -9 61 -156 208 -136
7102a36J05N8K3M0q7o1k64K84K63j58j8JJ64l5k33K53l3l68j40L26m1K7lJ01N9
$$ -136 -31 27 50 90 3 -58 -322 -38 225 67 49 50 214 179 -54 199 166 -202 -342 -16 -57 -30 -33 68 127
7127A27k50K32oj33jq7o0K85k88K17J43j15J96k01K15j33n7qm4J5n7K6M2j7J08
$$ 127 -123 109 103 -30 -31 -118 -178 107 -181 36 179 64 260 59 274 141 84 76 32 47 -10 16 58 41 149
7152A49r6J62j7j56o5j81K17J04P6k42K3m6Q2J24r0k63K02m6m4J97Nl9m3J09k49
$$ 149 53 215 198 42 -23 -204 13 117 193 -49 -26 -72 10 134 44 -219 -17 -63 -107 90 95 56 13 122 -127
7177a27K2P7m7J82N6k23j33J29l2O5J33k44R1j0j66K05J75j93J50l48M14l94L2
$$ -127 -105 -28 -75 107 163 -60 -193 -64 -96 -31 102 -142 -51 -61 -227 -22 153 -40 110 -238 176 -218 -186
7200a86L53j29O6J53j02l01J35J54k7k05N3N5L3k74K23rj86L09j03M3q7j41K07
$$ -186 167 38 104 257 155 -146 -11 143 116 -89 -36 19 52 -222 1 -8 -194 115 12 55 -32 -173 34
7223C4k3K6n1P5J1r0j47L22j31k20J51K06p7r3J03k49O8KJ81j53J97m7n3p7J27
$$ 34 11 37 -14 61 72 -18 -165 157 26 -194 -43 163 86 -7 96 -153 -85 -83 98 -55 142 95 42 -35 92
7248I2j3l78J85J96J46j97n7j56K21p3k10L54j0p2k51L17r9J30m3J49j71R5oj82
$$ 92 79 -299 -114 82 228 31 -26 -182 39 -34 -244 110 100 28 -223 94 -5 125 82 231 60 155 149 -33
7272c3K00l3m4k30K46p6k2J17j08r8O9J11K02m24K55M6k97MP8J94j17K6K6q9J20
$$ -33 167 134 90 -140 106 30 8 125 17 -81 -12 99 301 -123 132 178 -119 -115 -37 157 40 66 92 3 123
7297A23k61k3K13L8M6p9JN0k33K40k54L36l49N6K70j20L7k37l6J73k57L43j23
$$ 123 -138 -161 52 90 136 57 58 108 -125 115 -139 197 -152 -96 174 54 91 -146 -182 -9 -266 77 -46
7320d6n4P8j24M05n08K41J19r6R6j93N8M1N9r3m4l4L85k69k65N0M40j18j16J03
$$ -46 -100 -22 -146 259 -249 -8 111 15 111 -82 -24 17 76 -17 -61 -95 290 21 -244 -194 246 128 12 115
7344A15m1r0j01K48k36O3J11j54N7j8K09j97j32J87P2J09k06o4R5j16J65j04M
$$ 115 74 -16 -117 131 -105 -42 69 -85 -28 -46 163 -34 -166 21 93 202 -4 -68 27 -89 76 -28 -24
7367b4J56k68J38J73q0O2O6k29N1j94J57J13q2l54K70L3J14Kl52K35j83L3M6K96
$$ -24 132 -136 2 175 95 157 223 -6 45 -149 8 121 39 -315 -45 -12 102 104 -248 -13 -196 -163 -117 179
7391A79p3Q0j8kk31K74j46l71L46L5K4p8j32K08j8j95J11j17M4Q0L0j58J39o2
$$ 179 106 186 168 166 -65 209 63 -308 38 73 97 19 -113 95 77 -118 -7 -124 -80 0 30 -128 11 -51
7415e1J36M5K20k11j62K20L2l86J1K31J1l33J87K02j98Q7J11k89L07j79o3NJ14
$$ -51 85 130 350 139 -23 197 229 -157 -146 85 96 -237 -50 152 -46 41 152 -137 170 -9 -72 -67 47
7438D7J7k33J24J65p4o2O8J36j58k68M24l66J55p3L75k09r1Q4j37K50l10K26Q7
$$ 47 64 -169 -45 120 46 -16 52 188 30 -238 186 -180 -25 -98 277 68 -23 61 -76 174 -136 90 177
7461A77j87P2Pmk72M4J10N3L15m34L94j88j22Q3J67k48K82m67L61l5j53kJ93q1
$$ 177 -10 62 69 65 -207 -163 -53 0 315 -119 275 87 -35 48 215 -33 249 -218 143 108 -45 -47 146 65
7485F5k80K49r7K37j81k2n4J04op8R9p6J88p1k75K39k25P7K90j79L52m03n1K67
$$ 65 -215 34 -63 174 -7 -29 -83 21 15 -63 36 -40 148 77 -198 41 -184 -107 183 4 356 -47 -98 169
7509A69j72j54LK40jn4l1k60J89j3mK40j82j99K80k59M21j45k66K93l0o6J86k37
$$ 169 -3 -157 -154 86 85 31 0 -260 -71 -84 -88 152 -30 -229 51 -208 213 68 -198 95 65 -1 185 -52
7533e2J03j36j97M44n8j08J56j18j47K95p8J53j77r2J33L2j13j52K06j93J59j3
$$ -52 51 -85 -282 162 104 -4 152 34 -113 182 104 257 80 -12 121 153 40 -112 94 -99 60 47
7555D7p7p0l0q8L18L46n82J51k0q4J1J24J48j10k71K8J51P1m8J41k22N6K0j03
$$ 47 -30 -100 -130 -218 100 446 -136 15 -5 -89 -78 46 194 84 -187 -159 -8 63 15 156 -66 -10 10 -93
7579i3P3Q3l4J33j37j74j1J41j4j20Q3j23J80L7K72j79N9K5k38Nm6p2N70m39r6
$$ -93 -20 63 29 162 25 -149 -160 -19 -33 -153 -70 -193 -13 24 296 117 176 201 -37 -32 -78 -150 420 -19 -115
7604a15K01k74Q8J18j29K09K27j61j24q3J13j08N2Q2m1J34J36j59j59K1J0K1r7
$$ -115 86 -188 -100 18 -111 98 325 164 40 -43 70 -38 14 96 55 189 325 166 7 28 38 59 -38
7627c8M4j93K87k22K56P2m32M07J82l08Q4j44j09J54K2K4k07K68k19k6M00k62
$$ -38 6 -187 100 -122 134 206 -226 181 363 55 139 -5 -114 40 62 86 -121 147 -72 -98 302 40
7649D0j35J81p0K58j43l4n7O5J04l58jQ3K08j76J42M0j36Q6o4j85J36R9k78K18
$$ 40 -95 86 16 274 131 97 40 105 209 -149 -150 -67 141 -35 107 147 11 97 33 -152 -16 83 -195 23
7673B3k23K85o1J05j06P3j54Q7K78l53J80p1o2J1kK65j59j2N1l14J09k26K88j86
$$ 23 -200 85 24 129 23 96 -58 29 307 -46 134 63 1 12 10 275 116 104 155 -159 -50 -276 12 -174
7697a74K12j91K19L8j08j52L03j52J51k00J21K2O3o0j70R7j13K33j81J44r6M4
$$ -174 38 -153 66 104 -4 -156 147 -5 146 -54 67 89 152 92 -78 19 -94 139 -42 102 6 50
7719E0k15N6J29k47o2J04J69Q6q3K09k11o8J49k06J69k6j88N64m15k3L75l36k4
$$ 50 -165 -109 20 -227 -289 -185 -16 70 -13 196 -15 -83 66 -140 29 3 -185 379 -36 -59 316 -20 -44
7742d4N9J41k29Q2j3Q0J53K1n4j35O9k25m6j8J09j1J32O7k29l0J03r8Q6R9j19
$$ -44 15 156 -73 9 -4 76 229 250 196 61 130 -95 -141 -159 -50 -61 71 138 -91 -121 -18 -116 -30 69 -50
7767e0K53k54J16J77k67N3N7P1j78K97l23J6L8jj7N8j79K54o1j65K8M2k8J19J1
$$ -50 203 -51 65 242 -25 28 85 156 -22 275 -48 -32 6 5 -12 46 -133 121 60 -105 -77 -35 -63 56 67
7792F7k41L41k97j2L4L46j42j26k83J36R4L8Mj38Q6J79J38l76J01J80j80j13L8
$$ 67 -174 167 -130 -142 -108 238 96 -30 -313 -177 -83 -45 -41 -179 -93 86 224 -152 -51 129 -51 -164 -126
7815a26K62k32J10J04j48m6J7J36j14j08M3J13Q2J8q0j08K52J82n57Q9R0J98q1
$$ -126 136 -96 14 118 -30 -76 -59 77 -37 -145 -102 11 93 111 31 -77 175 357 -200 -111 -21 177 96
7838I6J8n9n3O3k71L37j13k15L89j36p7Q7l6j99jL34j35k10J82J42j94J47M4j48
$$ 96 114 55 2 65 -206 131 18 -197 192 56 -21 66 30 -169 -170 164 29 -181 1 143 -51 96 140 -8
7862hk24K25P3KO8k69R3j34K54j40J70l24L98k76J17l16K24O7M7J9j67K18j82
$$ -8 -232 -7 66 68 136 -133 -40 -174 80 -60 110 -214 184 -92 25 -291 -67 0 47 66 -101 117 -65
7885f5J45o6m2L3J69j79K71j38j62K39j44j7j4L08o14L82j60j34J11L81j48k87
$$ -65 80 14 -28 5 174 -5 266 128 -34 205 61 44 30 338 -276 106 -54 -188 -77 304 156 -131
7907a31O0L52k59l4M9k26J86l6K46l75K24p1j90J08K89j38J09n0j08Q5k74K12
$$ -131 -71 281 22 -12 37 -189 -3 -39 207 -168 56 -15 -205 -97 192 54 163 113 5 90 -184 28
7929B8Rk4Q6j13j74K70k2Qj0J13r2j75Q2j54J72J2J2o1K30k56m4K10l46N44l58
$$ 28 37 13 99 -14 -188 82 60 68 58 171 79 -96 -14 -168 4 16 28 -33 197 -59 -103 107 -239 305 -53
7954e3K63k60l2Q6M3K0l09K17J8J98l95L06k57J12J26nk72O0J32L3j21J69j87
$$ -53 210 -50 -82 4 47 67 -242 -25 -7 191 -204 102 -155 -43 83 78 -194 -134 -2 31 -90 79 -108
7977a08K07p3R3J04m18O0J39R9j82Q9L5J5n7j15J41J97l96J92l7n4J05r4O2q0
$$ -108 99 26 119 223 -195 -135 4 103 -79 10 45 60 3 -112 29 226 -170 22 -15 -69 36 -58 4 -76
8001g6k20K87q7L5K87q4m5O6J33q2k17r1K07M8k01KqK36k2k93n3J16o4J76j6m0
$$ -76 -296 -9 -96 -61 226 142 97 163 296 214 -3 -94 113 161 -40 -38 -46 190 168 -125 -178 -62 -126 50 34 -6
8027fO5j34J66m1o2J72j49k5N2JN8%j0J50l70J80j0k15j00N16m25K24R3j44O9
$$ -6 59 -75 91 50 -12 160 11 -14 38 39 97 97 87 237 -133 47 37 -178 -278 238 -187 37 130 -14 55
8052E5J51j42k12J48j08K87j81r3J53O6j4o6p3m0NJ20m7k4l8k63K41k5K76j81
$$ 55 206 64 -148 0 -108 179 -2 -95 58 124 110 44 -29 -69 -64 56 9 -15 -53 -316 -75 -100 176 -5
8076ej48J05J42n1j57j10P3J43o2N7j82J05J1J25L1l35K77o7K42j70QK23l53K52
$$ -5 -153 -48 94 43 -114 -224 -151 -8 -70 -13 -195 -90 -79 46 77 -258 19 -48 194 24 32 255 -98 154
8100A54k31Q9j27j65L48p9J45m3J4j57O4J57l17M18j86j97M03j46l95L15r5JK9
$$ 154 -77 12 -115 -280 68 -11 134 91 105 -52 12 169 -148 270 84 -113 290 144 -251 64 -31 -30 -1
8123aJ59k23j40j14N12k69k1O1o1J50J49k33k42L52r0ll64L63J03l3r9r2J31m9
$$ -1 158 -65 -205 -319 193 -76 -97 -36 -97 53 202 -31 -273 79 -11 -14 -378 -15 88 55 -44 -136 -5 -54
8147e4N1j31l5M9l3m0K68l7m1l0r9K00k07J15O7n9o2m7r9L00o9q5J30k44K14O1
$$ -54 -3 -134 -169 -120 -153 -193 75 38 -3 -33 -132 68 -139 -24 43 -16 -78 -125 -224 76 7 -78 52 -192 22 83
8173H3P1j59j76K65Kp2r7L0K61o1k3m7P7J6k83J15J25j59
$$ 83 154 -5 -181 84 86 14 -83 -53 208 147 124 77 154 170 -113 2 127 -32
8191c2
$$ Imaginary data points
##PAGE= N=2
##DATA TABLE= (X++(I..I)), XYDATA
0@%%%%%%%%%%%%%%%%%%Mj2J6j6J6j6J6k2L0l2L4m2M8n2O0o7P6q6R5j08J22j35
$$ 0 0 0 0 0 0 0 0 0 0 0 0 0 0 0 0 0 0 0 4 -8 8 -8 8 -8 8 -14 16 -16 18 -24 24 -28 32 -35 41 -45 50 -58 64 -71
40g1J50j66J83k00K21k46K69k95L27l61L99m39M82n34N91o56P30q16R16j035J184
$$ -71 79 -87 96 -104 117 -129 140 -155 172 -189 210 -229 253 -281 310 -346 384 -432 484 -551 633
61F33j367J601j914K352l007M087o152J1367m4235p4388J68283M518j39154N1573
$$ 633 -734 867 -1047 1305 -1702 2385 -3767 7600 -36635 -111023 57260 61778 -77376 -25803
75b5803R6390o5106l6826M4212L675j3199j115j2192J8809J2119l5709n98L0084
$$ -25803 70587 5481 -31345 12867 16542 3343 2228 -9964 8845 20964 -14745 -15343 14741
88A4741k3340j1395L0393o946j4238K3252o495k0506J7186q53j9529J8602O873
$$ 14741 -8599 -19994 10399 3453 -10785 12467 5972 -14534 2652 1799 -17730 872 7745
101G745k2531J4226J8184k5996m122K8349l957j9497R477J3626n851j7280l403
$$ 7745 -14786 -560 17624 -8372 -12494 15855 11898 -7599 1878 15504 9653 -7627 -11030
114a1030J8705Q4k5489Q673K9597j4829k2925K0122J1370k1427n181J4469L85
$$ -11030 7675 7759 -17730 -9057 20540 5711 -17214 2908 14278 -7149 -12330 2139 2524
127B524p979J86K456j2J117M42k466M059J1434n306j3895J3083J1195k5115o209
$$ 2524 -5455 -5269 -2813 -2825 -1708 -1266 -3732 327 11761 6455 -7440 5643 16838 -8277 -14486
142a4486K8700o311k3900J7309J3671j8742j939J1036m369M13p09p697J0491J239
$$ -14486 14214 7903 -15997 1312 14983 -3759 -5698 5338 969 1382 673 -7024 3467 4706
156D706k1952J0128J9484k4369l297L3027j3379k2507K8763M555k8583J1395J5420
$$ 4706 -17246 -7118 12366 -12003 -15300 17727 4348 -18159 10604 15159 -13424 -2029 13391
169A3391j7089P41Q106r412Q575L475k0209J4047K0037k9242n950L3187j4232
$$ 13391 -3698 -2957 5149 -4263 4312 7787 -12422 1625 21662 -7580 -13530 19657 5425
182E425k5529K1878N866j9021P329L915p519J2898l652j5769K0832P980k9073
$$ 5425 -20104 1774 7640 -11381 -4052 -137 -7656 5242 1590 -14179 6653 14633 -14440
195a4440Q705K4714k2717j0488K4105m778j3763J2098J386o410Q522l833p297
$$ -14440 -5735 18979 -3738 -14226 9879 5101 -8662 3436 4822 -1588 6934 3101 -4196
208d196J3400l912j6141J1961P217j8071J970J3772q453n027Q644j164r41K957
$$ -4196 9204 5292 -10849 1112 8329 -9742 -7772 6000 -2453 -7480 1164 0 -941 2016
222B016o263L250Q110j1271m608J5451k221j4654Q973J2247j0172o468J0628N478
$$ 2016 -4247 -997 7113 -4158 -8766 6685 4464 -10190 -1217 11030 858 -5610 5018 10496
236A0496j0327n554J0296K955j2174k624J1056j215r441K282O559J08m883l073
$$ 10496 169 -5385 4911 7866 -4308 -6932 4124 2909 -6532 -4250 2309 2417 -2466 -5539
250e539O613N459j2174l356J5257l528j3983J0448Q027j1244J813P696n239K064
$$ -5539 1074 6533 -5641 -8997 6260 2732 -11251 -803 7224 -4020 -2207 5489 250 2314
264B314L541r074N023P969j4934r61J7556j1520j2069J8712K43j7208R932P807
$$ 2314 5855 -3219 1804 9773 -5161 -6122 11434 -86 -12155 6557 6800 -10408 -476 7331
278G331j2648L023M987q513N859K545j2956R152J1228j8555N15K1162j1986j1420
$$ 7331 -5317 -2294 2693 -5820 39 2584 -10372 -1220 10008 -8547 -8032 13130 1144 -10276
292a0276J8371p29j3904J0370J212j0192R469r9j2858J2202O118j8504N384J5401
$$ -10276 8095 7366 -6538 3832 5044 -5148 4321 4222 -8636 3566 9684 -8820 -3436 11965
306A1965j5103n859J5458n166q961Q023q91l906N670m121k568J1555m761j0064
$$ 11965 -3138 -8997 6461 1295 -7666 357 -534 -4440 1230 -2891 -5459 6096 1335 -8729
320h729J3327L866j5648M987J1953j0033m792R185n76m267J125j35K457Q37p110
$$ -8729 4598 8464 -7184 -2197 9756 -277 -5069 4116 3540 -727 398 263 2720 3557 -3553
335c553J877P986o670o810Q265K462q714k32O134L47l516k119M645L944o032l035
$$ -3553 -1676 6310 -360 -7170 1095 3557 -5157 -5389 745 1092 -2424 -4543 102 4046 -1986 -5021
351e021Q222J402q190O88P383j288n041M55N248O48o974M23Q501m449p618P014
$$ -5021 3201 4603 -3587 -2899 4484 3196 -1845 -1390 3858 4506 -2468 -2045 6456 2007 -5611 1403
367A403L470q809J044M896l441o07J665k808L596J826q616L977R778j0973l929
$$ 1403 4873 -3936 -2892 2004 -1437 -2044 -379 -3187 409 2235 -6381 -2404 7374 -3599 -7528
382g528J4388l090j1701R342M933r036L021K971m060N035r17r358R114N790j6685
$$ -7528 6860 3770 -7931 1411 6344 -2692 329 3300 -760 4275 3358 -6000 3114 8904 -7781
397g781K820J5825j2129q689J4951j423j0728O716J513m648N367l160n444J1965
$$ -7781 -4961 10864 -1265 -9954 4997 3574 -7154 -438 1075 -3573 1794 -1366 -6810 5155
411E155j374j4485J1642R275j6689J128J5253q237o989R587j504m400N508m575
$$ 5155 3781 -10704 938 10213 -6476 -5348 9905 1668 -5321 4266 2762 -1638 3870 -705
425g05k063R994o028r706J2599K803j5422M446J1370r308m552Q094o27l529J811
$$ -705 -2768 7226 1198 -8508 4091 6894 -8528 -4082 7288 -2020 -6572 1522 895 -2634 -823
440h23r67J058L010m828M2P351l573n777O629K988o833K44N904p85m656k56M291
$$ -823 -1790 -732 2278 -2550 -2508 4843 1270 -4507 2122 5110 -1723 -1479 4425 3640 -1016 -1272 3019
457C019N93n985j168P490p77q181J976O556k353o167J375O671o04p893J354R293
$$ 3019 3612 -2373 -3541 3949 3172 -5009 -3033 3523 1170 -4997 -3622 3049 2445 -5448 -4094 5199
473E199l866p618N864N131n947p99L573o6Q71q55l428M904K056q044K019P198
$$ 5199 1333 -6285 -421 4710 -1237 -2036 1537 1471 2342 1487 -1941 2963 5019 -3025 -1006 6192
489F192p655k932Q888l818o210P470j09o387M489J051m534M449p27o196Q144K422
$$ 6192 -1463 -4395 4493 675 -5535 1935 1826 -4561 -72 979 -3555 894 167 -6029 2115 4537
505D537j2446N722J1523j2161m304J4050k989q392O824P82m036M743l730m443
$$ 4537 -7909 -2187 9336 -2825 -7129 6921 3932 -4460 2364 3146 -890 3853 123 -4320
519d320J0004k247j1868R886O658j4456J644J1322q146m342Q738l610l501N993
$$ -4320 5684 3437 -8431 1455 8113 -6343 -4699 6623 -1523 -5865 2873 -737 -4238 1755
533A755l312k764P754k624o251Q591J086q863N008N924q065j94O553l486k319
$$ 1755 -1557 -4321 3433 809 -5442 3149 4235 -4628 380 6304 -1761 -1955 4598 1112 -1207
548a207K400m83O18L67m107K751M456o949l115R065j524r087M402N857m886l456
$$ -1207 1193 710 1328 1695 -2412 339 4795 -2154 -5269 3796 2272 -6815 -2413 3444 -1442 -4898
564d898L913L412k023l620K096M813k408m509L255M233l584l011K803L234j945
$$ -4898 -985 2427 404 -3216 -1120 3693 1285 -3224 31 4264 680 -2331 472 3706 1761
579A761m127K781M503m506m061N671J403o352R46L208k063o52L21j112L004k07
$$ 1761 -2366 415 4918 412 -3649 2022 3425 -2927 -1981 1227 -836 -1488 -1167 -2279 725 518
595E18m972M625M146q114J06R340n147o196Q589J501p679L148L621l259J352o09
$$ 518 -4454 171 4317 -3797 -3691 5649 502 -5694 2895 4396 -3283 -135 3486 227 1579 970
611I70k699N359k24r160N740O726j0770k044J1076m453n919O061k70k697L873
$$ 970 -1729 3630 3406 -5754 -14 6712 -4058 -6102 4974 521 -5398 663 393 -2304 1569
626A569l193k654Q533l262q559R606M398j2047K758R869o839l973P513j194l115
$$ 1569 -1624 -4278 4255 993 -7566 2040 6438 -5609 -2851 7018 179 -3794 3719 2525 -590
641e90K601k426K60M077n740k274Q958l333q237Q096L144r104J672O004m253j753
$$ -590 2011 -415 -155 3922 -1818 -4092 4866 1533 -6704 1392 4536 -4568 -2896 3108 -1145 -2898
657b898L071j430O11J202l501K197M547n236j555P162j309n972L846L342m066
$$ -2898 173 -1257 -646 556 -2945 -748 3799 -1437 -2992 4170 2861 -3111 735 4077 11
672A1j610K519R20m03l162M09M407k441m586L543L867n077k028M385P41m039r02
$$ 11 -1599 920 1840 1437 -1725 -1316 3091 650 -3936 -393 3474 -1603 -3631 754 1495 -2544 -3446
689c446L558J831m113m63N160m47m306J871L324k342q89J084r9J421j436k917
$$ -3446 112 1943 -2170 -2633 2527 2080 -2226 -355 2969 627 -262 822 723 2144 708 -2209
705b209L747K213o677J121O806m863m258N722J60n191K306J121j834J972j253
$$ -2209 1538 3751 -2926 -1805 5001 138 -4120 1602 1762 -3429 -1123 -2 -1836 136 -1117
720a117k183N291k77p040N895N467q954k16Q644m253n432O232P83l890K419q89
$$ -1117 -3300 1991 1714 -5326 569 6036 -2918 -3134 5510 1257 -4175 2057 2840 -1050 1369 480
736D80m91L424l590l466P139p22q609N019N915q098j259O474k732k247K786j455
$$ 480 -11 3413 -177 -3643 3496 2774 -5835 -816 5099 -2999 -4258 2216 -516 -2763 23 -1432
752a432J450K380n257L87P659n271n873Q951K025r389L654O082n377j897M058
$$ -1432 18 2398 -2859 -2472 5187 -84 -5957 2994 5019 -4370 -716 5366 -11 -1908 2150
767B150j422l14P83k318J420K152n024m21O231l466m595N262K136m851j14L054
$$ 2150 728 414 1197 -1121 299 2451 -2573 -2994 3237 -229 -4824 438 2574 -2277 -2391 663
783F63l28j484o31J516K489k493k393L939J747l982j89L570J83l070j46K541L77
$$ 663 335 -1149 -1780 -264 2225 -268 -2661 1278 3025 -957 -1146 2424 2607 -463 -609 1932 2309
800B309l724k73L838n67m659K335L073l209j712K498K99j276l51j0K139j65l422
$$ 2309 -1415 -1688 2150 1583 -3076 -741 2332 -877 -2589 -91 208 -1068 -1419 -1429 710 545 -2877
817b877K290L916m191j803N397m85m127K658J377k087R66q09j044L503j574m872
$$ -2877 -587 3329 -862 -2665 2732 2247 -1880 778 2155 68 1034 225 -819 2684 1110 -3762
833c762M728K979o934M60O075m300k815M644j219j964K189r77r09L462k437k147
$$ -3762 966 3945 -2989 -2529 3546 -754 -3569 1075 -144 -2108 81 -896 -1805 1657 -780 -2927
849b927N765j624n149O022J993p372K642N698n699j347N071k809j122L227l221
$$ -2927 2838 1214 -3935 2087 4080 -3292 -650 5048 -651 -1998 3073 264 -858 2369 -852
864h52l79M608l984l833P015l25p279L900M174n509M4L855k684O54J562k836J351
$$ -852 -1231 3377 -607 -4440 2575 2250 -5029 -1129 3045 -2464 -2420 1435 -1249 -595 967 -1869 -518
881e18L109l839p57N493k579l599M550J322m892J344L277k292j686J564Q46r02
$$ -518 2591 -1248 -2005 3488 909 -2690 1860 3182 -1710 -366 2911 619 -1067 497 1343 441
897D41j756K62K198q33l009K102J949k593j047K194N99j077q45M89K224p57k255
$$ 441 -1315 -1053 1145 312 -2697 -595 1354 -1239 -2286 -92 507 -570 -1415 -926 1298 541 -1714
914a714J693K317k284j527K637J190k026r69J446J674j967k439L062J450m518
$$ -1714 -21 2296 12 -1515 1122 2312 286 -683 763 2437 470 -1969 1093 2543 -1975
929a975n4M355k373l152L254O33k174O94M95q27J831j580j851M452Q2n152L585
$$ -1975 -2029 2326 -47 -3199 55 688 -1486 -792 -297 -1124 707 -873 -2724 1728 1810 -3342 243
946B43L964n667n21N630k665k824L532n10j834K494j862j904M894k257m750N068
$$ 243 4207 -1460 -1981 3649 984 -1840 1692 1182 -652 1842 -20 -1924 2970 713 -4037 1031
962A031K429o926J046N376l782j837L033m43p92J555k667J136L699m488j103O256
$$ 1031 3460 -3466 -2420 2956 -826 -2663 370 -73 -865 690 -1977 -841 2858 -1630 -2733 3523
978C523j404n662M584K860n227O08L118k007q67J364j506J039Q33l030R08L184
$$ 3523 2119 -3543 1041 3901 -1326 -718 2400 393 -474 890 -616 423 1256 -1774 -866 2318
994B318l554j631M354p09l853K486J586k120j26R27J97O24r37j059K868N65l557
$$ 2318 -1236 -2867 1487 778 -3075 -589 997 -1123 -1249 -322 -125 499 -438 -1497 1371 1936 -1621
1011a621J302L339k364k389K797J077j822j445J573Q26j489j083J224J068j976
$$ -1621 -319 3020 656 -1733 1064 2141 319 -1126 447 1273 -216 -1299 -75 993 -983
1026i83n46J781l69p19n42P18J062q15j274K177R61k806M67L092j701j913K472
$$ -983 -1529 252 -117 -836 -1378 -660 402 -413 -1687 490 1451 -1355 -888 2204 503 -1410 1062
1043A062L32j478M57N55o30J213j801j248L491p91l963K935K772n038l89M351
$$ 1062 1394 -84 373 928 298 1511 -290 -1538 1953 1162 -2801 134 2906 -2132 -2521 1830
1059A830j811k356K103K59n88R16j673J69L278k246k902N397M06n472K468L830
$$ 1830 19 -2337 -234 25 -563 353 -1320 -1151 2127 -119 -3021 2376 2782 -2690 -222 3608
1075C608m075p58L320j531o60J430j665J41K610l848o15M283k084l895M639R47
$$ 3608 -467 -1225 2095 564 -96 1334 -331 -190 2420 -1428 -2043 2240 156 -3739 900 1847
1091A847m735J502K750k288l23J338k91O86j29j945J633K567l750k79M365j547
$$ 1847 -2888 -1386 1364 -924 -1247 91 -200 486 357 -1588 45 2612 -1138 -1417 2948 1401
1107A401l159K618J400k507k87J056J57P0j016q27J804n2l193J870K379k603j571
$$ 1401 -1758 860 2260 -247 -534 522 679 749 -267 -1094 710 658 -2535 -665 1714 -889 -2460
1124b460K757O24j932k49J597M31j278n57K142K33k104L75J968n03j476K83J736
$$ -2460 297 921 -1011 -1260 337 768 -510 -1067 1075 1308 -796 -421 1547 1044 -432 -149 1587
1141A587n20j562k02K112n16k864J485K452k564j520K832l27k028Q80N64l13O59
$$ 1587 1067 -495 -697 1415 899 -1965 -480 1972 -592 -2112 720 393 -1635 -755 -191 -504 155
1158A55j149j49K336o85k657K756J718l582O05K876j399j720K049l63l68N15j213
$$ 155 -994 -1143 1193 508 -2149 607 2325 -1257 -652 2224 825 -895 1154 791 423 938 -275
1175b75K09J971k677j239L953j079m062L102K161l789K4K737j575l45J000j235
$$ -275 -66 1905 -772 -2011 1942 863 -3199 -97 2064 -1725 -1701 1036 -539 -884 116 -1119
1191a119J295J034k770N63L756l090j782M368n06l878K580J716k642M17J138j455
$$ -1119 176 1210 -1560 -997 2759 -331 -2113 2255 1749 -2129 451 2167 -475 -58 1080 -375
1207c75Q00K12j878J151J723l298J38L236k149k367L005O23k445N81J203k47Q3
$$ -375 425 637 -1241 -90 1633 -1665 -1527 1709 -440 -2807 198 821 -1624 -1043 160 -87 -4
1224dl66J65J572p02k171K143J882l326k77L079r94k275J409J173j107j203O67
$$ -4 -370 -205 1367 665 -1506 637 2519 -807 -1084 1995 1001 -1274 135 1308 201 -1002 -335
1241c35R69q46r70R68O16r88o43R14L20m96l58N37P81p32j009J631J191k239m17
$$ -335 634 -212 -1182 -214 402 -586 -1229 -315 5 -491 -849 -312 469 -263 -1272 359 1550 -689 -1106
1260a106K581j68k090R00J162n06p32J0M92Q89k191p37K942m81l234J842K044
$$ -1106 1475 1307 -783 117 1279 773 41 51 543 1432 -759 -1496 1446 965 -2269 -427 1617
1277A617k926n49K419r17o49Q15k55L66J045j940j10K934j446k593L399Q85l656
$$ 1617 -1309 -1858 561 -356 -1005 -190 -445 -79 966 -974 -1084 1850 404 -2189 1210 2095 -1561
1294a561J066K604j839q79J538o74J10J62j765J400J561l414m30M145j831l182
$$ -1561 -495 2109 270 -609 929 255 365 527 -1238 162 1723 -1691 -2121 2024 193 -2989
1310b989L111J272k823N64J422j076M11K76j238J759Q48k766O45L303k474j978
$$ -2989 122 1394 -1429 -865 557 -519 -108 168 -1070 689 1537 -1229 -584 2719 245 -1733
1326a733L197N41k805O99J302j101k10j45K8J191j182j423J948M66k508M41K404
$$ -1733 1464 2005 -800 -101 1201 100 -110 -255 -227 964 -218 -1641 307 773 -1735 -1294 1110
1343A110j480j221J693L27m85n86P14N90k71q86O11J001r09q62J099Q79q21j155
$$ 1110 -370 -1591 102 429 -56 -642 72 662 391 -495 116 1117 208 -654 445 1324 503 -652
1361f52R92J030r78j620J424P63j910o95K311k76j655O36Q94m00l96m20J033Q32
$$ -652 340 1370 392 -1228 196 959 -951 -1646 665 389 -1266 -630 264 -136 -532 -952 81 913
1379I13j799j80K361n48k003J593J655k411m2K103r24j021Q53l17J47L89j552
$$ 913 -886 -1066 1295 747 -1256 337 1992 -419 -461 1642 718 -303 550 233 380 769 -783
1396g83L51J978j937j667K952k30k687J289J995j958m76J425n44K43J37j260J500
$$ -783 -432 1546 -391 -2058 894 664 -2023 -734 1261 -697 -1173 252 -292 -49 88 -1172 328
1413C28J117k553L40L195k060k200L096P22k982J093J230j366Q0j51n98J330j51
$$ 328 1445 -1108 -768 2427 367 -1833 1263 1985 -997 96 1326 -40 40 -111 -709 621 470
1430D70k083J553J185k353n10K797r43j962J704Q61j143o6L07J76O75p31n74K115
$$ 470 -1613 -60 1125 -1228 -1738 1059 116 -1846 -142 719 -424 -490 -183 -7 668 -63 -637 1478
1448A478l58k037J212J443j601j184J895O6j249n5N87M77p34j188R79J094j631
$$ 1478 1120 -917 295 1738 137 -1047 848 914 -335 -390 197 674 -60 -1248 -269 825 -806
1465h06n48J529K57j520N9J353J43r99j71J325K91j495L45J595p44j183J002P59
$$ -806 -1354 175 432 -1088 -1029 324 467 -532 -703 622 913 -582 -237 1358 614 -569 433 1192
1483A192q12m85K59O71k44j253L19J384j133j636J980P53k352K56J952j245o58
$$ 1192 380 -105 154 825 581 -672 -353 1031 -102 -1738 242 995 -1357 -1101 851 -394 -1052
1500a052R54Q2J24J88j069P50J643k087p81K868l89k649J745J492j717m15J154
$$ -1052 -98 -16 108 296 -773 -23 1620 -467 -1248 1620 1231 -1418 327 1819 102 -313 841
1517H41m96p5j9j019J044Q56k434K59K957k329j783K697K90k280Q88J035j201
$$ 841 345 270 251 -768 276 1132 -1302 -1043 1914 -415 -2198 499 789 -1491 -603 432 -769
1534g69L95L97m22J100l63j268J511Q55k231L10K108j167j091J325P3j116L16
$$ -769 -374 23 -399 701 338 -930 581 1436 -795 -485 1623 456 -635 690 763 -353 -37
1551c7K02O4K56r79l93J672p79j845J736J157k062k30J664k8j356O08O65j19l65
$$ -37 165 229 485 -494 -887 785 6 -1839 -103 1054 -1008 -1238 426 398 -958 -350 315 196 -169
1570a69j69Q52L52j028l32J400k6j330L69J076n34r80L21Q00n38j268P71J039
$$ -169 -338 514 866 -162 -494 906 880 -450 -81 995 461 -519 -198 602 64 -1204 -433 606
1588F06r99p78J217N66j616L17R01k4l22n18N42J077j161n39J620J95j794O86
$$ 606 -393 -1171 46 612 -1004 -687 214 190 -132 -650 -108 969 -192 -731 889 1084 -710 -24
1606b4J623j528m47R26j92%l07k86M80M85j266o81K462j047k069K262O50k231
$$ -24 1599 71 -376 550 358 358 51 -235 245 730 -536 -1217 1245 198 -1871 391 1041 -1190
1624a190K17J342o80j04J69j41J246j94j364J096J230k265k20K592q75j884J569
$$ -1190 -973 369 -311 -415 -246 -387 859 665 -699 397 1627 -638 -858 1734 859 -1025 544
1641E44O08j461L86n0l2M32n13j217J671M02k137N54J993j788q72J805L2j143
$$ 544 1152 -309 77 27 -5 427 -86 -1303 368 770 -1367 -813 1180 -608 -1480 325 357 -786
1659g86M89K91P4K36q22K14J426o99j430J720R48k291R4J550n38j094M74N97l47
$$ -786 -297 -6 68 304 -518 -304 1122 423 -1007 713 1661 -630 -536 1014 476 -618 -144 453 106
1678A06o00n3P69K64j446N0J360o38q43P80Q97p46o28O18O29n11n92Q22N99o56
$$ 106 -494 -547 222 486 -960 -910 450 -188 -1031 -251 646 -100 -728 -110 519 8 -584 238 837 181
1698A81n46J025q2p15J24O12p5m49m36J32Q13r29o41J327J87j702M97J427j026
$$ 181 -365 660 578 -137 -13 599 524 75 -361 -229 584 -345 -986 341 528 -1174 -677 750 -276
1717b76o96P21M10l43n9l74J223J41j513L23K062j341j270J955Q4j547P15N41
$$ -276 -972 -251 159 -184 -243 -617 606 747 -766 -443 1619 278 -992 963 1047 -500 215 756
1735G56o09j83L90p33Q73r0j380R49J180j893m68J992p69j510J403R44j489M82
$$ 756 147 -36 354 -379 494 404 -976 -27 1153 -740 -1208 784 15 -1495 -92 852 -637 -155
1753a55J08j35N89m14m17J518j64j752Q43J728k145k93J720m32j147P77K52o53
$$ -155 -47 -182 407 -7 -424 1094 930 -822 21 1749 -396 -689 1031 599 -548 229 481 -172
1771a72K56m45R8Q76j031p48J230N83j995P65J373j033n81Q14L90m33k10K75L74
$$ -172 84 -361 -263 613 -418 -1166 64 647 -1348 -583 790 -243 -824 -10 380 -53 -263 12 386
1790C86J3n60J62J123p46r20R07O64j136k64Q40J3p82r6N89L12r00n51J237R0
$$ 386 399 -161 1 1124 378 -542 365 1029 -107 -371 469 482 -300 -396 193 505 -395 -946 291 381
1810C81j297M16Q84l92n18N6Q71j26p67L16J115l29j096P51N28o71n26R43J3n69
$$ 381 -916 -500 384 -8 -526 -470 401 275 -492 -176 939 610 -486 265 793 122 -404 539 552 -17
1830a7k14J93P19o84j166R14J229j480p56J697J66j938R91J061r40m44N64l0K88
$$ -17 -231 -38 681 -3 -1169 -255 974 -506 -1262 435 601 -1337 -346 715 -225 -669 -105 -135 153
1849A53k73l91J092M38j668L06K014j487q92J379K24j102n7P33k63j69k39m37
$$ 153 -120 -511 581 1019 -649 -343 1671 184 -708 671 895 -207 -264 469 206 37 -202 -639
1867f39J243n89j179J244N12j392k14J633p14r17R51N57o63J62j52K96O12p84
$$ -639 604 15 -1164 80 592 -800 -1014 619 -95 -1012 -61 496 -167 -5 -157 139 751 -33
1885c3k74J225k05j437Q58R00j144m91J103m6r26J93K97J33k03p41O70Q29j167
$$ -33 -307 918 713 -724 134 1034 -110 -601 502 456 -470 -277 20 153 -50 -791 -121 708 -459
1904d59o29J147K55r05N1Q18k8n46L77N86K00r45R5N48R0j025K64Q98o33n09L06
$$ -459 -1088 59 314 -591 -540 278 250 -296 81 667 867 -78 17 565 655 -370 -106 792 159 -350 -44
1925d4M97k96m14O3Q16p65p94Q55L87q30q5N72r1l3j88L87J46j59m06Q14M31j145
$$ -44 453 157 -257 -194 622 -143 -937 -82 305 -525 -610 -38 -129 -162 -350 37 183 24 -382 432 863 -282
1947b82n5J441l49j486J066O33j164p0O37n1l72k05j75R83j79j412N49J440j390
$$ -282 -337 1104 755 -731 335 968 -196 -266 371 320 -52 -257 -432 551 372 -1040 -491 949 -441
1966d41o07J491k02j062N21O41j11k98l83L87M77m97o47J417K64j338P3J389q82
$$ -441 -1048 443 241 -821 -300 341 230 -68 -451 -64 413 -84 -731 686 950 -388 -315 1074 192
1985A92o13P64O4l62l14J37O10j63r74LJ165p43p73J041N50j220m7J094j04p21
$$ 192 -421 343 407 45 -269 -132 478 315 -659 -656 509 -234 -1007 34 584 -636 -683 411 307 -414
2005d14J68M81J14j08o52Q46M23j118q1J033n1j054N16O08m57o60K19N92m69j13
$$ -414 -246 235 349 241 -411 435 858 -260 -341 692 641 -413 103 711 254 -406 -187 405 -64 -177
2025a77k77O43j78q64O42N78o43l38P11L63m92m60N53P22p12l95R30Lq96J28Q84
$$ -177 -454 189 11 -853 -211 367 -276 -614 97 460 -32 -492 61 783 71 -324 606 609 -287 -159 725
2046G25m85m58J00M06K87q00j52O62Lr52K47R90n73j030P62P50q26p1M06K55l4
$$ 725 240 -218 -118 288 575 -225 -377 285 288 -664 -417 573 0 -1030 -268 482 -344 -415 -9 246 212
2067B12l25o1P26j77r29P33P34p57n84J335n21n31J25M27l86Jk77J88M50n77l12
$$ 212 -113 -174 552 375 -554 179 913 156 -428 907 386 -145 -20 407 21 22 -255 -67 383 -194 -506
2088e06R73l77q32M02R29j063k24R12j47m82M41J87j1O0l39L1Q90m71q58J010
$$ -506 467 90 -742 -340 589 -474 -698 214 67 -415 26 213 202 262 -77 -46 844 373 -485 525
2108E25K03r24N2Q09n88l22K79J13n9l54m70Q97On49J6O84k78m46K39Q16q03k46
$$ 525 728 -196 -144 665 77 -245 34 147 88 -266 -736 161 167 -382 -366 318 40 -406 -167 649 -154 -400
2130d00P69K47k32p99N49M51n12k91O30J9m02k45O43l0o77j24N18J39p55j96R69
$$ -400 369 616 384 -415 134 585 73 -218 412 431 29 -216 427 397 -280 -404 114 253 -502 -698 271
2151B71o3p45K2Q54p33r8M19L56l26n84P08K66p2o45N80L70o13k95N91O18j087
$$ 271 208 -537 -515 339 -394 -492 -73 283 -43 -627 81 347 275 -370 210 580 -33 -328 263 881 -206
2172b06K28M96j14n77j50L30K36m96m03O70M86j191P2J089n14n47L14P08o51L35
$$ -206 22 518 404 -173 -323 7 243 -253 -656 14 500 -691 -619 470 -44 -591 -277 431 -220 115
2192A15j5J19R7m24j00J178p82q45J023J49o54j85Q82k89o77K90K00k55M8k60
$$ 115 100 219 316 -108 -208 970 188 -657 366 515 -139 -324 558 269 -408 -118 82 -173 -125 -385
2212c85K51O24r83j44Q88m9r01M09O56n93k24N77J40j82q7j21N66L8p07K59M64
$$ -385 -134 490 -493 -637 251 202 -699 -290 366 -227 -451 126 266 84 -3 -124 442 480 -227 32 496
2233D96k07n71N29K13l98l63O40p4m17k28P8N41o18l43N03N66o17j84N85J5n24
$$ 496 289 -282 247 460 62 -301 339 265 -152 -380 -302 239 -379 -722 -219 347 -270 -454 131 146 -378
2254c78Q1O36O6n30j84Q93k05o85M36L54o2p24L23J07m0k02J84K27l67m73N25
$$ -378 -297 339 405 -125 -309 584 379 -306 130 484 422 -302 21 128 88 -114 70 297 -70 -543 -18
2275a8K73o18l19Q31L9o73L95K72k49N5j86K05J54j23m15O79Q9q08N08N16n08
$$ -18 255 -363 -682 149 188 -485 -90 182 -67 -12 -198 7 161 38 -377 302 391 -417 91 607 99
2296I9n78Q59J08m80j36M21k65J48n09K8P13l28p01N02M07m14k80P15l82k32K27
$$ 99 -479 380 488 8 -128 293 28 176 -333 -305 408 80 -621 -119 288 -126 -406 309 -73 -305 -78
2317g8J55j21k3J14P6L42o17J15N40q4p43M18M77l47m93J88K47l33l17L75K51
$$ -78 77 -44 -67 47 123 465 -152 -37 503 419 -324 94 571 224 -269 -81 166 -167 -484 -109 142
2338A42k8p66L64O80o60k39P21n2m47K41M05j64n09L26K75N8l31k60P49k18n11
$$ 142 114 -652 -288 392 -268 -507 214 162 -285 -44 361 197 -312 14 289 347 16 -244 505 287 -224
2359b24K50L33j25n66M31N0j42j01j67O78n72l71L63N50o05j82L16K81n57K99
$$ -224 26 359 234 -332 99 149 7 -94 -261 417 -155 -526 -163 387 -218 -400 -84 197 -360 -61
2379f1J76J77N8n86O23O5m71j89P31J36r31M23Ln5k39J55J07k26l31J77M77j67
$$ -61 115 292 350 -236 387 452 -19 -208 523 659 -272 151 154 99 -140 15 122 -104 -435 -258 219 52
2401E2n08K89M31l86k72N71K1n15K23K10J9J13k54R7O44o98k40N44K09p83J76
$$ 52 -456 -167 264 -122 -394 177 198 -317 -94 116 135 248 -6 91 735 37 -203 341 550 -233 -57
2422e7O10m33k87J52K24l68k16J08M46q6m94K69K21l11m15P91P0l45r5L20J3k86
$$ -57 553 120 -167 -15 209 -159 -375 -267 179 93 -401 -132 89 -222 -637 154 224 -121 -216 104 117 -169
2444a69L1M88j40Qm56L86M27p38q0O92Qn16PL9O6n08K94P6L2l37Q0L87j92k05
$$ -169 -138 350 210 218 -238 148 575 -163 -243 449 457 -59 -52 -13 53 -455 -161 -85 -53 -390 -310 77 -115 -320
2468c20N1M83n02l9M28lj03j38M28Q1k71k77M96L11o91M6J99J78o12P1K44K40
$$ -320 -269 214 -288 -327 101 98 -5 -143 285 366 95 -182 314 625 -66 -20 179 357 -255 -184 60 300
2490C00m45j65K68P6m81q3Q84l82o46O60K06m90j44N12K89m51N8j0L34o9l90M37
$$ 300 -145 -310 -42 34 -447 -530 354 -28 -674 -14 192 -298 -442 70 359 -92 -34 -44 290 221 -169 268
2512B68j38k6j11N74k17n28J84K37Q3l79l95L45L18m72k19N00N0m93P3P25p21
$$ 268 130 104 -7 567 350 -178 6 243 326 -53 -448 -103 215 -257 -476 24 74 -419 -346 379 -342
2533c42L9L64q5p2k27L04K31J44n18L49J92l20k02L35L46q17J16L23k6p20J95
$$ -342 -303 61 -24 -96 -323 -19 212 356 -162 187 379 59 -143 192 538 -279 -163 160 134 -586 -391
2554c91K16J97j43m10O03J4m49j99Q15k03p11M41O60o04j12M85J35k29j96J09
$$ -391 -175 22 -121 -531 72 86 -363 -562 253 50 -661 -220 440 -164 -276 209 344 115 -81 28
2574B8M00k14l56L36K32l96j87L13J59m04j95O33K6n06j85L35J22o81J91K81O8
$$ 28 428 214 -142 194 426 30 -157 156 315 -89 -284 349 375 -131 -316 19 141 -540 -349 -68 0
2595@k75K68q5L70m34L77N0nl10PL15k07k33M13K34p08j2M14j07j86j17NL07l96
$$ 0 -275 -7 -92 278 -156 221 271 266 -44 -37 278 71 -162 251 485 -223 -235 179 72 -114 -231 -226 81 -315
2619c15k50N86M0k39k06M08q2m03K57N04j93j37nL03j38rk65N76k65k89J87L49
$$ -315 -565 21 61 -178 -384 24 -58 -461 -204 300 107 -30 -35 268 130 121 -144 432 167 -122 65 414
2641D14m55j64K63j51J02l8n0J08j61k22K45J41n3k18L37l5o36M62M68m35k26
$$ 414 -41 -205 58 -93 9 -29 -79 29 -132 -354 -109 32 -21 -239 98 63 -573 -111 357 -78 -304
2662c04J33M34l15R3P0M48k39n31L62K74j68n24K99J31j75j39J76J74l27j08K56
$$ -304 -171 263 -52 41 111 559 320 -211 151 425 257 -267 32 163 -12 -151 25 199 -128 -236 20
2683B0q6j82O5K19J41k37OJ77J47m49j06O17k48k40J74M03l70o2K1K63l56q6J78
$$ 20 -66 -248 -183 36 177 -60 -54 123 270 -179 -285 332 84 -156 18 421 51 -11 10 273 -83 -169 9
2706IJ69k79j3J43j33K6j86NL76n46j24O27o5j93Q1K81j62M8j21K91J64m11k73
$$ 9 178 -101 -114 29 -104 -78 -264 -259 117 -429 -553 74 9 -184 -103 178 16 64 -57 234 398 -13 -286
2729b86N36l1k41r2M07l1n62J71K85k71j04L36p5j1m13J32N09j71n82L87K26l18
$$ -286 250 219 -22 -114 293 262 -300 -129 156 -115 -219 117 42 31 -382 -250 259 88 -494 -107 119 -199
2751a99K14P1j01o4j10K92J62jk84L53j16k10K29K71l26j98k2L48m79J94r0K39
$$ -199 15 86 -15 -79 -189 103 265 264 -20 333 217 7 236 507 181 -17 -39 309 -170 24 -66 173
2773A73k87k08K63J61l7m08L14K48j64l63O23m88J15j04L60p6k55j38M79k7k0
$$ 173 -114 -322 -59 102 65 -343 -29 219 55 -308 315 -173 -58 -162 198 122 -133 -271 208 181 161
2794A61p5RJ13n27M32o9O5m74K80L08k19l98L20J91k51r7k5N84n23l7L18j86j75
$$ 161 86 95 208 -319 113 44 109 -365 -85 223 4 -394 -74 117 -134 -231 -256 328 -195 -232 86 -100 -275
2817b75J17O6L38j90j10L51J0k59K3P9J4l45J74K5r1L7o0R7J5k52O1K78O1o05
$$ -275 -158 -92 246 56 -54 297 307 48 71 150 164 -181 -7 18 -73 -36 -96 1 16 -236 -175 103 164 -441
2841d41K72J01j50q0L00J97m68L98n9pj3j5r7O22n75k38K81Q0k02J56m7r1l04
$$ -441 -169 -68 -218 -298 2 199 -269 129 70 63 50 35 -62 560 -15 -253 28 108 -94 62 15 -76 -380
2864c80M93K66k37k66o0M6J20j87o8L12j0l85M38K37l59L0j8J56l12K85K22r3
$$ -380 113 379 142 -124 -184 -138 -18 -205 -273 39 29 -356 82 319 -40 -10 -28 128 -184 101 323 230
2886B30k9k76M92j87k89j35M52j92l13P9K72j36k83p9M42Qm25L83L53l95k24L41
$$ 230 201 -75 417 230 -59 -194 258 66 -247 -168 104 -32 -315 -394 48 56 -369 14 367 -28 -252 89
2908H9j46K70j69J07J55j04l69K09K86k67q1Q7L97k74k42K21Q2k87o9K17j26l11
$$ 89 -57 213 44 151 306 202 -167 42 328 61 -20 67 464 190 -52 169 251 -36 -105 112 -14 -325
2930c25l8N23l29N7j42L92q3j87q4R9J97M4l2J41l2n3j60L78l99l94N95q9j2o0
$$ -325 -363 160 -169 -112 -254 138 55 -132 -216 -117 80 124 92 233 201 148 -12 366 -33 -427 168 79 67 7
2954Gj2J35l67O6K19N1k15k75L00K86j83m42M39j25o5k1M61m66q1L40J96j43j73
$$ 7 -5 130 -237 -171 48 99 -116 -391 -91 195 12 -430 9 -116 -181 -202 259 -207 -288 52 248 105 -68
2977f8K19J32k66j24K35J00j64k57M98N3l34jk3J51n01J84N7J35j75J61K18j43
$$ -68 151 283 17 -107 128 228 64 -193 305 358 24 23 0 151 -350 -166 -109 26 -149 12 230 87
2999H7j06L5K53o7m34J06K55J09j50J25p4N6l61K21J61k53r6P4R0j24j96K36J82
$$ 87 -19 16 269 202 -232 -126 129 238 88 213 139 195 -166 55 216 -37 -133 -59 31 -93 -289 -53 129
3022A29l30J82K78k65o0Q3k54J95k9K0J42J15q8j87J95J0j57K84j05N6j46J19
$$ 129 -201 -19 259 -6 -66 17 -237 -42 -71 -51 91 206 118 -69 126 136 -21 263 158 214 68 187
3044A87j2j21l68K98K89m69O1K26j46j01P8j50J38J79l09J34L56m08r7M03pj86
$$ 187 175 54 -314 -16 273 -196 -135 91 -55 -156 -78 -228 -90 89 -220 -86 270 -138 -235 168 161 -25
3066b5R4J15J77l30Q7J6r6P8j84L7J16l05L88M1k48j8J32p2P1k02k3K31j40j12
$$ -25 69 184 361 31 118 134 38 116 -68 -31 85 -220 168 209 -39 -57 75 3 74 -128 -151 80 -60 -172
3090a72K89p5j10r6J03J18j96K57O0J2k48L01q9q8l9m2K59l93k1k1L76j72J4J47
$$ -172 117 42 -68 -164 -61 57 -139 118 178 190 -58 243 154 66 27 -15 244 -149 -170 -191 185 13 27 174
3114A74k33L0j09K74k97K69n98O70j34j09j89J89P3r5r9L75m7j6L4N4p5k58K90
$$ 174 -59 -29 -138 136 -161 108 -490 180 46 -63 -252 -63 10 -85 -184 191 144 128 162 216 141 -117 173
3137A73K28j84k00m3M4P8m91N10p0k19J0J86m6j21j6J18J50j20l89M08J27j93
$$ 173 401 217 17 -26 18 96 -395 115 45 -174 -164 22 -24 -145 -161 -43 107 -13 -402 6 133 -60
3159f0j8P0j13J0L61j29J50n14Q6K31L11l45j82J94j36jJ98jN4r2l00J61K48j03
$$ -60 -78 -8 -121 -111 250 121 271 -243 -157 74 385 40 -142 52 -84 -85 113 112 166 74 -226 -65 183 80
3183H0l75L84q2M9R4r7j02J84j54K14j92M2J74n5R1k97J15O0k05N8J91k51k00
$$ 80 -295 89 7 56 150 53 -49 135 -19 195 3 45 219 164 255 -42 73 133 -72 -14 177 -74 -274
3206b74J39o2N48n51r9K87P7k15PN11n23j23K41j5j56J56L5R4k5j61K49j33J0
$$ -274 -135 -197 351 -200 -299 -12 65 -150 -143 368 -155 -278 -37 -52 -208 -52 -17 77 52 -109 140 7 17
3229A7K0n6L4R0p0Q3J13k59j75L15l45J01j4K02P5l23K6K82k64j92L70P5O1l95
$$ 17 37 -19 15 105 35 118 231 -28 -203 112 -233 -132 -146 56 131 -192 -166 116 -148 -340 30 105 166 -229
3253b29K15p8N8K68j22J08l38q5L27m8l53K80N1O4k37j34K12J67l09Q9O8mn8p5
$$ -229 -14 -92 -34 234 112 220 -118 -203 124 76 -277 3 54 118 -119 -253 -41 126 -183 -94 -26 -30 -88 -163
3277a63J73N0o7k8K34j13j89J4M06m69j8J47K69k29l35L05K72m29N9R6r7l3K07
$$ -163 10 60 -7 -35 199 86 -103 -89 317 -152 -170 -23 246 17 -318 -13 259 -170 -111 -15 -112 -145 62
3300F2N5M5m27L5J36R3k27J28K56j13j39O3J29n1n0J53P7l18M63k90L42m25j78
$$ 62 117 162 -265 -230 -94 -1 -228 -100 156 43 -96 -33 96 45 -5 148 225 -93 370 80 422 -3 -181
3323a81L81j64k11r7M35N4k54J54o1L73o04K45k41J54J3j78L82k42%J44k96j9
$$ -181 200 36 -175 -272 163 217 -37 117 56 429 -175 70 -171 -17 -4 -182 200 -42 -42 102 -194 -213
$$ [...]
8191g6
##END NTUPLES=NMR FID
##END=
