##TITLE=1H_AM_NVSTER695
 
 8 sc, 
 14.04.2022
##JCAMPDX= 6.0         $$ Bruker NMR JCAMP-DX V2.0
##DATA TYPE= NMR FID
##DATA CLASS= NTUPLES
##ORIGIN= UXNMR, Bruker Analytische Messtechnik GmbH
##OWNER= root
$$ XWIN-NMR		Version 3.5
$$ Thu Apr 14 10:33:43 2022 Russian Standard Time (UT+4h)  she@DPX200
##.OBSERVE FREQUENCY= 200.13135
##.OBSERVE NUCLEUS= ^1H
##.DELAY= (6, 6)
##.ACQUISITION MODE= SIMULTANEOUS
##.ACQUISITION SCHEME= undefined
##.AVERAGES= 8
##.DIGITISER RES= 18
##SPECTROMETER/DATA SYSTEM= spect
##.PULSE SEQUENCE= zg30
##.SOLVENT NAME= CDCl3
##.SHIFT REFERENCE= (INTERNAL, CDCl3, 0, 15.7039)
##AUDIT TRAIL= $$ (NUMBER, WHEN, WHO, WHERE, WHAT)
$$ ##TITLE= Audit trail, XWIN-NMR		Version 3.5
$$ ##JCAMPDX= 5.01
$$ ##ORIGIN= Bruker BioSpin GmbH
$$ ##OWNER= she
$$ F:/spectra/data/she/nmr/H-F/1/audita.txt
$$ ##AUDIT TRAIL=  $$ (NUMBER, WHEN, WHO, WHERE, WHAT)
(   1,<2022-04-14 10:30:29.59 +0400>,<she>,<DPX200>,
      <created by zg, POWCHK disabled, PULCHK disabled
       configuration hash MD5:
       00 E9 B6 7A A2 85 ED C7 34 08 36 98 17 FE 4E 26
       data hash MD5: 16K
       E6 F1 DE 33 3A 8F 6A 76 F5 DA 92 52 B6 C1 9D F9>)
$$ ##END=
$$ 
$$ hash MD5
$$ D2 09 B1 E6 71 D4 13 98 1C F0 A5 6A 9C 88 1D 30
##$RELAX= 
##$RELAX= 
##$RELAX= 
##$RELAX= 
##$RELAX= 
##$RELAX= 
$$ Bruker specific parameters
$$ --------------------------
##$DU= <F:/spectra>
##$EXPNO= 1
##$NAME= <H-F>
##$PROCNO= 1
##$TYPE= <nmr>
##$USER= <she>
##$AMP= (0..31)
100 100 100 100 100 100 100 100 100 100 100 100 100 100 100 100 100 100 
100 100 100 100 100 100 100 100 100 100 100 100 100 100 
##$AQSEQ= 0
##$AQ_mod= 1
##$AUNM= <au_zg>
##$AUTOPOS= <>
##$BF1= 200.13
##$BF2= 200.13
##$BF3= 200.13
##$BF4= 200.13
##$BF5= 200.13
##$BF6= 200.13
##$BF7= 200.13
##$BF8= 200.13
##$BYTORDA= 1
##$CFDGTYP= 0
##$CFRGTYP= 5
##$CHEMSTR= <none>
##$CNST= (0..31)
1 1 145 1 1 1 1 1 1 1 1 1 1 1 1 1 1 1 1 1 1 1 1 1 1 1 1 1 1 1 1 1 
##$CPDPRG= <>
##$CPDPRG1= <>
##$CPDPRG2= <>
##$CPDPRG3= <>
##$CPDPRG4= <mlev>
##$CPDPRG5= <mlev>
##$CPDPRG6= <mlev>
##$CPDPRG7= <mlev>
##$CPDPRG8= <mlev>
##$CPDPRGB= <>
##$CPDPRGT= <>
##$D= (0..31)
0 1.2 0 0 0 0 0 0 0 0.06 0 0.03 0 0 0 0 0.0002 0 0 0 0 0 0 0 0 0 0 0 0 
0 0 0 
##$DATE= 1649917829
##$DBL= (0..7)
120 120 120 120 120 120 120 120 
##$DBP= (0..7)
150 150 150 150 150 150 150 150 
##$DBP07= 0
##$DBPNAM0= <>
##$DBPNAM1= <>
##$DBPNAM2= <>
##$DBPNAM3= <>
##$DBPNAM4= <>
##$DBPNAM5= <>
##$DBPNAM6= <>
##$DBPNAM7= <>
##$DBPOAL= (0..7)
0.5 0.5 0.5 0.5 0.5 0.5 0.5 0.5 
##$DBPOFFS= (0..7)
0 0 0 0 0 0 0 0 
##$DE= 6
##$DECBNUC= <off>
##$DECIM= 32
##$DECNUC= <off>
##$DECSTAT= 4
##$DIGMOD= 1
##$DIGTYP= 9
##$DL= (0..7)
0 120 120 120 120 120 120 120 
##$DP= (0..7)
150 150 150 150 150 150 150 150 
##$DP07= 0
##$DPNAME0= <>
##$DPNAME1= <>
##$DPNAME2= <>
##$DPNAME3= <>
##$DPNAME4= <>
##$DPNAME5= <>
##$DPNAME6= <>
##$DPNAME7= <>
##$DPOAL= (0..7)
0.5 0.5 0.5 0.5 0.5 0.5 0.5 0.5 
##$DPOFFS= (0..7)
0 0 0 0 0 0 0 0 
##$DQDMODE= 0
##$DR= 18
##$DS= 0
##$DSLIST= <SSSSSSSSSSSSSSS>
$$ [...]
##$SUBNAM2= <"">
##$SUBNAM3= <"">
##$SUBNAM4= <"">
##$SUBNAM5= <"">
##$SUBNAM6= <"">
##$SUBNAM7= <"">
##$SUBNAM8= <"">
##$SUBNAM9= <"">
##$SW= 18.05172834244
##$SWIBOX= (0..15)
0 0 2 0 0 0 0 0 0 0 0 0 0 0 0 0 
##$SW_h= 3612.71676300578
##$TD= 16384
##$TD0= 1
##$TE= 0
##$TE2= 300
##$TE3= 300
##$TEG= 300
##$TL= (0..7)
0 120 120 120 120 120 120 120 
##$TP= (0..7)
150 150 150 150 150 150 150 150 
##$TP07= 0
##$TPNAME0= <>
##$TPNAME1= <>
##$TPNAME2= <>
##$TPNAME3= <>
##$TPNAME4= <>
##$TPNAME5= <>
##$TPNAME6= <>
##$TPNAME7= <>
##$TPOAL= (0..7)
0.5 0.5 0.5 0.5 0.5 0.5 0.5 0.5 
##$TPOFFS= (0..7)
0 0 0 0 0 0 0 0 
##$TUNHIN= 0
##$TUNHOUT= 0
##$TUNXOUT= 0
##$USERA1= <user>
##$USERA2= <user>
##$USERA3= <user>
##$USERA4= <user>
##$USERA5= <user>
##$V9= 5
##$VALIST= <valist>
##$VCLIST= <CCCCCCCCCCCCCCC>
##$VD= 0
##$VDLIST= <DDDDDDDDDDDDDDD>
##$VPLIST= <PPPPPPPPPPPPPPP>
##$VTLIST= <TTTTTTTTTTTTTTT>
##$WBST= 1024
##$WBSW= 4
##$XGAIN= (0..3)
0 0 0 0 
##$XL= 0
##$YL= 0
##$YMAX_a= 317240
##$YMIN_a= -295912
##$ZGOPTNS= <>
##$ZL1= 120
##$ZL2= 120
##$ZL3= 120
##$ZL4= 120
##$ABSF1= 10
##$ABSF2= 0
##$ABSG= 5
##$ABSL= 3
##$ALPHA= 0
##$AQORDER= 0
##$ASSFAC= 0
##$ASSFACI= 0
##$ASSFACX= 0
##$ASSWID= 0
##$AUNMP= <proc_1d>
##$AZFE= 0.1
##$AZFW= 0.1
##$BCFW= 1
##$BC_mod= 2
##$BYTORDP= 1
##$COROFFS= 0
##$CY= 11.3945322036743
##$DATMOD= 1
##$DC= 2
##$DFILT= <>
##$DTYPP= 0
##$F1P= 2.36226072786647
##$F2P= -0.459571619588291
##$FCOR= 0.5
##$FTSIZE= 0
##$FT_mod= 4
##$GAMMA= 1
##$GB= 0.15
##$INTBC= 1
##$INTSCL= 1
##$ISEN= 128
##$LB= 0.24
##$LEV0= 0
##$LPBIN= 0
##$MAXI= 10000
##$MC2= 0
##$MEAN= 0
##$ME_mod= 0
##$MI= 1.114404
##$NCOEF= 0
##$NC_proc= 0
##$NLEV= 6
##$NOISF1= 3.799351
##$NOISF2= 2.8
##$NSP= 1
##$NTH_PI= 0
##$NZP= 0
##$OFFSET= 15.70392
##$PC= 1
##$PHC0= -18784.82
##$PHC1= -40.79925
##$PH_mod= 1
##$PKNL= yes
##$PPARMOD= 0
##$PSCAL= 0
##$PSIGN= 0
##$REVERSE= no
##$SF= 200.130013532006
##$SI= 16384
##$SIGF1= 3
##$SIGF2= 2
##$SINO= 400
##$SIOLD= 16384
##$SREGLST= <1H.CDCl3>
##$SSB= 0
##$STSI= 0
##$STSR= 0
##$SW_p= 3612.71676300578
##$SYMM= 0
##$S_DEV= 0
##$TDeff= 0
##$TDoff= 0
##$TI= <>
##$TILT= no
##$TM1= 0
##$TM2= 0
##$TOPLEV= 0
##$USERP1= <user>
##$USERP2= <user>
##$USERP3= <user>
##$USERP4= <user>
##$USERP5= <user>
##$WDW= 1
##$XDIM= 8192
##$YMAX_p= 0
##$YMIN_p= 0
$$ End of Bruker specific parameters
$$ ---------------------------------
##NTUPLES= NMR FID
##VAR_NAME=  TIME,          FID/REAL,        FID/IMAG
##SYMBOL=    X,             R,               I
##VAR_TYPE=  INDEPENDENT,   DEPENDENT,       DEPENDENT
##VAR_FORM=  AFFN,          ASDF,            ASDF
##VAR_DIM=   8192,          8192,            8192
##UNITS=     SECONDS,       ARBITRARY UNITS, ARBITRARY UNITS
##FACTOR=    0.0002768,     1,               1
##FIRST=     0,             0,               0
##LAST=      2.2672688,     0,               0
##MIN=       0,             -295912,         0
##MAX=       2.2672688,     317240,          0
$$ Real data points
##PAGE= N=1
##DATA TABLE= (X++(R..R)), XYDATA
$$ plain form
0 0 0 0 0 0 0 0 0 0 0 0 0 0 0 0 0 0 0 0 4 0 1 -8 8 -8 8 -8 11 -12 12 -16 16 -20 20 -24 28 -28 33 -36 43 -44 49 -56 61
43 61 -64 72 -80 87 -96 107 -115 129 -143 157 -173 194 -215 243 -277 316 -367 428 -514 627 -791
64 -791 1043 -1462 2245 -3998 9502 -59324 -295912 13936 296134 -17457 -288481 16653
76 16653 283754 -17531 -277891 17035 272794 -15753 -269700 16011 267117 -17942
86 -17942 -263860 20344 260416 -23614 -256043 27483 249747 -30027 -243071 30903
96 30903 237235 -30843 -232658 30303 229303 -30162 -227140 30685 225639 -32537
106 -32537 -224328 35400 222047 -38866 -218563 41842 214030 -44140 -209174 45573
116 45573 203961 -45667 -199464 44548 196589 -44016 -194668 44545 192767 -46069
$$ packed form
0@%%%%%%%%%%%%%%%%%%MmJrJ6j6J6j6J9k3K4k8L2l6M0m4N2n6O1o9P9q7R3j05J17
43F1j25J36j52J67j83K03k22K44k72L00l30L67m09M58n20N93o83P95r42J141j418
64g91J834k505L707o243J3500o8826k36588L09848K82198l13591k71024L05134
76A6653K67101l01285k60360K94926K55759k88547k53947K85711K51106k85059
86a7942k45918K84204K40072k84030k32429K83526K22264k79774k13044K73974
96C0903K06332k68078k01815K62961J99000k59465j96978K57825J94954k58176
106c2537j91791K59728J86647k60913j79697K60405J72188k58170j65034K54747
116D5573J58388k49628j53797K44012J52041k40605j50652K39213J48222k38836
$$ plain form
126 -46069 -190638 48505 187446 -51156 -183065 53167 178053 -54492 -172943 55006
136 55006 167810 -54460 -163676 53218 161034 -52831 -159117 53105 157382 -54100
146 -54100 -156185 56232 153959 -58924 -150428 60515 146606 -61527 -143272 62159 139710
157 139710 -62102 -136731 61070 135094 -60765 -134238 61462 133053 -62582 -131899 64345
168 64345 130092 -66712 -126887 68390 122862 -69023 -118978 68814 115536 -68114 -112743
179 -112743 67165 110675 -66674 -109211 66883 107693 -67739 -106104 69053 103760 -70642
190 -70642 -100707 71637 97213 -72159 -93841 71831 90828 -70931 -88938 70070 87757
201 87757 -69944 -86939 70414 86071 -71460 -85075 72906 83424 -74417 -81086 75431
$$ packed form
126d6069j44569K39143J38941k38602j31909K36232J24886k32545j18451K27949
136E5006J12804k22270j09216K16894J07816k13865j06286K12222J04277k11482
146e4100j02085K12417R7727k12883r1504K10943Q6091k08133q1745K05431P7551
157A39710k01812p4629J97801P4024j95859p3473J95700P1591j95635o9317J96244
168F4345O5747j96804o0175J95277N4472j91885m9955J87792M6722j83650m4629
179a12743J79908M3510j77349m2537J76094M0810j75432l8365J75157L4707j74402
190g0642l0065J72344K5576j69372k1682J65672J8997j61759j8007J59008J7687
201H7757j57701j6995J57353J5657j57531j3615J57981J0518j57841o669J56517
$$ plain form
212 75431 78426 -75932 -75657 75677 73206 -74733 -71697 73901 70742 -73552 -70037 73652
224 73652 69381 -74479 -68257 75595 66155 -76305 -63658 76336 61172 -76251 -58652 75505
236 75505 56236 -74087 -54969 72894 54247 -72480 -53546 72358 52947 -72866 -52187
247 -52187 73934 50528 -74746 -48244 74778 46171 -74431 -44349 73976 42687 -73042
258 -73042 -41647 72211 41266 -71964 -40930 72192 40489 -72815 -39690 73649 38269
269 38269 -74317 -36316 74389 34136 -73825 -32313 72755 30957 -71603 -30212 70639
280 70639 29710 -70159 -29293 69988 28782 -70277 -27911 70698 26476 -70851 -24743 70695
292 70695 22839 -69985 -21104 68778 20074 -67518 -19621 66766 19403 -66400 -19112 66444
$$ packed form
212G5431K995j54358K75J51334k471j47939L036J45598l159j44294L515J43689
224G3652m271j43860O222J43852r440j42460J2647J39994j5164j37423J7599J34157
236G5505j9269j30323J9118J27863j8647j26727J8934J25904j9411j25813K0679
247e2187J26121k3406j25274K6502J23022k8607j20602L0082J18325l1289j15729
258g3042L1395J13858l0945j13230L1034J13122l1703j13304L3125J13339l5380
269C8269j12586L8001J10705m0253j07961M1512J05068m1798j02560M1391J00851
280G0639m0929r9869M0866R9281m1206r9059M2366R8609m4222r7327M6108R5438
292G0695m7856r2824M8881Q9882m8704q7592M7897Q6387m7363q5803M7288Q5556
$$ plain form
304 66444 18791 -66866 -17973 67372 16644 -67453 -15223 67303 13676 -66786 -12172 65668
316 65668 11286 -64530 -11041 63778 10895 -63447 -10755 63393 10461 -63750 -9665 64060
328 64060 8306 -63797 -6956 63252 5727 -62527 -4445 61383 3670 -60056 -3456 59213
340 59213 3473 -58767 -3362 58729 3117 -58941 -2386 59202 1167 -58989 157 58358
352 58358 -1262 -57528 2192 56483 -2764 -55440 2884 54727 -2898 -54396 2917 54375
364 54375 -3231 -54606 3900 54721 -4976 -54535 6197 53903 -7284 -52964 8068 51876
376 51876 -8382 -50900 8446 50267 -8397 -49867 8398 49881 -8655 -49971 9382 49890
388 49890 -10221 -49593 11235 49034 -12286 -48022 12959 46790 -13076 -45896 12926 45349
$$ packed form
304F6444m7653q5657M8893Q5345n0728q4097N2230Q2526n3627q0462N4614P7840
316F5668n4382p5816N3489P4819n2883p4342N2692P4148n2932p4211N4085P3725
328F4060n5754p2103N6841P0208n7525o8254N8082O5828n7713o3726N6600O2669
340E9213n5740o2240N5405O2091n5612o2058N6555O1588n8035o0156N9146N8201
352E8358n9620n6266N9720N4291n9247n2676N8324N1843n7625n1498N7313N1458
364E4375n7606n1375N8506N0821n9697m9559O0732M7706o1187m5680O1032M3808
376E1876o0258m2518N9346M1821n8664m1470N8265M1483n8536m1316N9353M0508
388D9890o0111l9372O0828L7799o1320l5736O0981L3831n9866l2820N8822L2423
$$ plain form
400 45349 -12898 -45026 12838 44968 -13076 -45113 13752 44887 -14578 -44440 15326 43814
412 43814 -16142 -42868 16691 41678 -16696 -40780 16460 40324 -16330 -40012 16274 39964
424 39964 -16386 -40088 17040 39946 -17832 -39372 18496 38712 -19049 -37847 19428 36867
436 36867 -19435 -36050 19201 35565 -19035 -35345 18947 35272 -19097 -35394 19596 35245
448 35245 -20403 -34732 21034 33869 -21480 -32949 21594 32049 -21509 -31298 21277 30775
460 30775 -20957 -30529 20859 30466 -21048 -30321 21450 30087 -21987 -29607 22647 28806 -23083
473 -23083 -27722 23076 26874 -22837 -26342 22690 25854 -22472 -25627 22287 25667 -22605 -25608
486 -25608 23136 25184 -23602 -24724 24028 24092 -24536 -23144 24602 22187 -24294 -21700 24019 21371
$$ packed form
400D5349n8247l2128N7864L2130n8044l2037N8865L1135n9465k9862N9766K8488
412D3814n9956k6726N9559K4987n8374k4084N7240K3864n6654k3682N6286K3690
424C9964n6350k3702N7128K2906n7778k1540N7868K0216n7761j8798N7275J7439
436C6867n6302j6615N5251J6364n4600j6310N4292J6325n4369j6297N4990J5649
448C5245n5648j4329N5766J2835n5349j1469N4543J0455n3558r789N2575R498
460C0775n1732r572N1388R607n1514r273N1771Q637n2074p620N2254O159n1889
473b3083m639N0798L798m9711l505M9032L164m8326l155M7914L380m8272l003
486b5608M8744K048m8786j122M8752O4m8628J392M7746k415m6481K594M5719k648
$$ plain form
500 21371 -23845 -21142 23737 21139 -23940 -21025 24430 20590 -24808 -19953 25084 19290 -25280
513 -25280 -18418 25292 17566 -24926 -16993 24565 16702 -24323 -16566 24218 16510 -24420 -16399
526 -16399 24771 16019 -25188 -15466 25457 14735 -25561 -14026 25420 13343 -25196 -12902
538 -12902 24846 12634 -24604 -12593 24553 12599 -24793 -12424 25107 12123 -25426 -11616
550 -11616 25740 10857 -25707 -10109 25411 9643 -25093 -9275 24821 9001 -24465 -8940
562 -8940 24323 9006 -24535 -8803 24752 8385 -24917 -7973 25082 7259 -25099 -6547
574 -6547 24687 6044 -24305 -5856 23973 5672 -23780 -5622 23657 5593 -23786 -5445
586 -5445 24025 5073 -24190 -4599 24301 3993 -24189 -3359 23895 2950 -23491 -2652
$$ packed form
500B1371m5216K703M4879k598m5079K915M5455l840m5398M855M5037n794m4570
513b5280O862M3710p726m2492P933M1558p863m1025P757M0784p708m0930Q021
526a6399M1170q752m1207R722M0923j0722m0296J1535L9446j2077l8539J2294
538a2902L7748j2212l7238J2011L7146j1954l7392J2369L7531j2984l7549J3810
550a1616L7356j4883l6564J5598L5520j5768l4736J5818L4096j5820l3466J5525
562h940L3263j5317l3541J5732L3555j6367l3302J6944L3055j7823l2358J8552
574f547L1234j8643l0349J8449K9829j8301k9452J8158K9279j8064k9379J8341
586e445K9470j8952k9263J9591K8900k0308k8182K0830K7254k0945k6441K0839
$$ plain form
598 -2652 23102 2581 -22807 -2636 22816 2613 -22972 -2381 23071 2027 -23152 -1628
610 -1628 23154 1035 -22997 -494 22551 149 -22187 22 21782 -155 -21494 62
622 62 21362 -70 -21517 208 21636 -595 -21678 1068 21532 -1543 -21275 1948 20924
635 20924 -2251 -20512 2441 20086 -2421 -19804 2355 19772 -2412 -19771 2564 19813
647 19813 -2795 -19911 3276 19788 -3872 -19412 4186 18975 -4386 -18691 4519 18303
659 18303 -4571 -18061 4446 18015 -4527 -18100 4734 18060 -4993 -18081 5374 17989
671 17989 -5890 -17624 6231 17179 -6376 -16745 6431 16431 -6389 -16194 6337 16158
683 16158 -6386 -16116 6569 16051 -6751 -15985 7113 15802 -7527 -15409 7773 14948 -7902
$$ packed form
598b652K5754k0521k5388K0171K5452k0203k5585K0591K5452k1044k5179K1524
610a628K4782k2119k4032K2503K3045k2402k2336K2209K1760k1937k1339K1556
622F2K1300k1432k1447K1725K1428k2231k1083K2746K0464k3075j9732K3223J8976
635B0924k3175j8261K2953J7645k2507j7383K2159J7417k2184j7359K2335J7249
647A9813k2608j7116K3187J6512k3660j5540K3598J4789k3361j4305K3210J3784
659A8303k2874j3490K2507J3569k2542j3573K2834J3326k3053j3088K3455J2615
671A7989k3879j1734K3855J0948k3555j0369K3176J0000k2820r805K2531R821
683A6158k2544r730K2685R482k2802r234K3098Q689k3329p882K3182P175k2850
$$ plain form
696 -7902 -14542 7907 14159 -7838 -13987 7721 13927 -7811 -13989 8011 13917 -8311 -13833 8630
710 8630 13620 -8975 -13325 9224 12985 -9401 -12575 9425 12277 -9276 -12145 9271 12138 -9317
724 -9317 -12103 9478 12116 -9739 -11983 10107 11667 -10308 -11252 10375 10961 -10419 -10591 10382
738 10382 10190 -10170 -10035 10001 9992 -10053 -9954 10081 9866 -10244 -9772 10515 9466 -10758 -9058
753 -9058 10799 8731 -10765 -8471 10749 8258 -10627 -8149 10623 8148 -10661 -8103 10794
766 10794 8131 -11011 -8019 11355 7768 -11564 -7382 11652 7069 -11626 -6761 11499 6538
779 6538 -11351 -6477 11277 6419 -11335 -6343 11317 6243 -11409 -6131 11536 5822 -11614
792 -11614 -5459 11570 5085 -11438 -4778 11213 4585 -11000 -4509 10897 4514 -10889 -4455
$$ packed form
696g902o640K2449O252k1997o149K1708O206k1738o178K2000N906k2228n522K2463
710H630M990k2595m350K2549L761k2386l174K2000K852k1553k869K1416K867k1455
724i317k786K1581K638k1855k244K2090J560k1975r44K1627N86k1380j72K0973
738A0382j92k0360J35K0036rk0045R9K0035k15k0110M72K0287j049k0224J700
753i058J9857k068j9496K294J9220k491j8885K478J8772k475j8809K558J8897
766A0794k663j9142K992J9374l587j9332M182J9034m583j8695M865J8260m961
779F538j7889M874J7754m858j7754M992J7660n074j7652N278J7667n714j7436
792a1614O155J7029o485j6523O660J5991o628j5585O491J5406o383j5403O434
$$ plain form
805 -4455 11016 4384 -11189 -4155 11354 3921 -11404 -3664 11515 3393 -11511 -3058 11374
818 11374 2916 -11234 -2892 11247 2859 -11306 -2832 11394 2773 -11601 -2580 11715 2212
831 2212 -11682 -1980 11549 1734 -11478 -1485 11249 1317 -10978 -1282 10833 1286 -10731
844 -10731 -1234 10737 1204 -10771 -990 10857 723 -10756 -440 10645 246 -10492 -48
857 -48 10328 -35 -10212 63 10173 -118 -10214 154 10277 -231 -10453 389 10568
870 10568 -697 -10622 977 10528 -1225 -10416 1369 10212 -1459 -10098 1452 10030 -1462
883 -1462 -10008 1496 10039 -1616 -10000 1767 9949 -1915 -9858 2153 9725 -2364 -9428 2484
897 2484 9134 -2428 -8986 2431 8905 -2453 -8825 2457 8864 -2546 -8956 2792 8893 -3003
$$ packed form
805d455J5471o632j5573P034J5509p433j5325P740J5179q122j4904Q453J4432
818A1374q458j4150Q342J4139q388j4165Q474J4226q621j4374R021J4295r503
831B212j3894R702J3529r815j3212R993J2734r932j2295R696J2115r547j2017
844a0731R497J1971r533j1975R781J1847j0134j1479J0316J1085j0399j0738J0444
857d8J0376j0363j0177J0275J0110j0291j0096J0368J0123j0508j0222J0842J0179
870A0568j1265r925J1599R551j1753r191J1785Q843j1671q639J1550Q578j1492
883a462q546J1504Q543j1655q384J1767Q182j1864p943J2011P572j2089p064J1912
897B484O650j1562o558J1417O474j1358o372J1282O407j1410o410J1748O101j1896
$$ plain form
911 -3003 -8845 3124 8780 -3373 -8692 3531 8457 -3583 -8356 3530 8353 -3595 -8374 3647
925 3647 8413 -3741 -8488 3945 8447 -4161 -8305 4323 8168 -4413 -7963 4493 7783 -4481
939 -4481 -7571 4419 7467 -4345 -7396 4314 7379 -4389 -7376 4517 7272 -4680 -7143 4784
953 4784 6936 -4897 -6753 4876 6565 -4904 -6498 4875 6412 -4913 -6407 4932 6430 -5026
967 -5026 -6473 5198 6436 -5400 -6343 5578 6186 -5696 -5955 5734 5826 -5686 -5734 5704 5668 -5663
983 -5663 -5614 5671 5617 -5755 -5565 5850 5441 -5938 -5326 6015 5147 -6115 -4898 6043 4676
998 4676 -5946 -4620 5852 4517 -5876 -4511 5854 4480 -5954 -4451 6070 4324 -6163
1011 -6163 -4203 6259 4076 -6348 -3878 6370 3722 -6306 -3614 6307 3580 -6261 -3557 6315
$$ packed form
911c003n842J1969N656j2153n319J2223M926j2040m773J1886M823j1948m779J2021
925C647M766j2154m747J2433M502j2608m144J2628L845j2581l550J2456L290j2264
939d481l090J1990L048j1812l051J1710L065j1768k987J1893K755j1952k463J1927
953D784K152j1833j856J1629J689j1469j594J1373J537j1325j494J1339J498j1456
967e026j447J1671J238j1836r43J1921O08j1882k59J1689R2j1512m8J1438l6j1331
983e663M9J1285n4j1372J90J1415m09j1379O12J1341q68j1262J217J0941j367
998D676j0622J326J0472j335j0393J365J0365j374j0434J503J0521j746j0487
1011f163J960J0462k183j0424K470J0248k648j0028K692R921k727r841K704R872
$$ plain form
1025 6315 3591 -6424 -3514 6544 3383 -6612 -3247 6670 3085 -6706 -2918 6646 2758 -6590
1039 -6590 -2695 6509 2598 -6484 -2586 6417 2579 -6508 -2558 6591 2402 -6666 -2244 6673 2087
1054 2087 -6642 -1934 6606 1819 -6531 -1730 6507 1716 -6457 -1662 6507 1659 -6546 -1578 6619
1069 6619 1515 -6689 -1390 6747 1179 -6704 -1025 6591 946 -6550 -909 6491 816 -6465 -836
1084 -836 6430 795 -6530 -714 6546 582 -6567 -530 6617 336 -6606 -147 6466 80 -6384
1099 -6384 -37 6364 16 -6315 29 6337 -31 -6377 147 6457 -258 -6419 382 6427 -507
1114 -507 -6409 647 6310 -746 -6211 766 6117 -788 -6079 770 6058 -832 -6103 870 6103
1129 6103 -1018 -6092 1119 6017 -1251 -5937 1333 5866 -1409 -5793 1489 5723 -1484 -5657 1482
$$ packed form
1025F315k724j0015K910J0058l161r995L365R917l585r791L788R564l888r348
1039f590L895R204l911r082L898R003l838r087L950R149m189r068M422Q917m586
1054B087q729M708Q540m787q350M801Q237m791q173M795Q169m848q205M968Q197
1069F619n104q204N299Q137n568p883N679P616n645p496N641P400n675p281N629
1084h36P266n635p325N816P260n964p149O037P147o281o942O459O613o386o464
1099f384O347O401o348o331O344O308o368o346O524O310o715o161O801O045o934
1114e07n902P056N663p056n465O977N351o905n291O849N288o890n271O973N233
1129F103p121n074P211M898p268m686P270M533p275m384P282M234p207m173P139
$$ plain form
1144 1482 5717 -1526 -5753 1631 5794 -1711 -5796 1885 5781 -2019 -5657 2107 5581 -2155 -5550
1159 -5550 2207 5482 -2266 -5418 2253 5410 -2289 -5442 2358 5388 -2456 -5395 2537 5305 -2681
1174 -2681 -5203 2728 5034 -2740 -4953 2738 4868 -2731 -4815 2746 4823 -2779 -4778 2874 4767
1189 4767 -2922 -4761 3062 4746 -3184 -4638 3272 4554 -3312 -4472 3343 4432 -3373 -4416 3374
1204 3374 4446 -3478 -4482 3571 4405 -3684 -4394 3730 4327 -3861 -4261 3883 4128 -3919 -4045 3889
1220 3889 3952 -3856 -3922 3832 3909 -3830 -3872 3886 3843 -3933 -3756 4000 3667 -4027 -3555 4036 3501 -4059
1238 -4059 -3412 4084 3335 -4042 -3330 4053 3335 -4135 -3348 4195 3304 -4318 -3308 4425 3196 -4524
1254 -4524 -3109 4509 3037 -4585 -3003 4591 2906 -4575 -2907 4571 2890 -4620 -2858 4631 2835
$$ packed form
1144A482M235p243m227P384M163p505m085P681L896p800l638P764L474p736l395
1159e550P757L275p748l152P671L157p699l153P800L030p844k939P932K768p986
1174b681k522P931K306p774k213P691K130p599k084P561K077p602j999P652J893
1189D767p689j839P823J684p930j454P910J282p866j160P815J089p805j043P790
1204C374J072p924j004Q053Q34q089p10Q124N97q188m00Q144K45q047j26P934
1220C889O3p808o6P754P7p739m2P758m3p776J77P756l33p694M72P591n35p560
1238d059O47P496p49p377P12P383p18p470P87P543q91p622J010P733j229p720
1254d524J415P618j472p622J582P594j685p481J668P478j681p510J762P489j796
$$ plain form
1269 2835 -4656 -2785 4718 2696 -4736 -2556 4678 2473 -4613 -2400 4588 2345 -4516 -2312 4497
1284 4497 2305 -4529 -2266 4543 2204 -4587 -2183 4608 2082 -4707 -2000 4698 1867 -4711 -1826
1299 -1826 4681 1780 -4725 -1785 4735 1735 -4803 -1705 4864 1658 -4932 -1576 4970 1478 -4962
1314 -4962 -1402 4994 1316 -4948 -1210 4884 1188 -4805 -1189 4805 1179 -4792 -1128 4764 1101
1329 1101 -4795 -1029 4780 902 -4737 -865 4665 783 -4680 -731 4599 644 -4574 -682 4563
1344 4563 629 -4621 -603 4635 535 -4701 -466 4749 337 -4736 -243 4716 194 -4714 -98
1359 -98 4718 67 -4665 -27 4688 5 -4681 46 4683 -95 -4697 142 4703 -261 -4685
1374 -4685 320 4588 -390 -4547 393 4445 -449 -4438 423 4362 -474 -4387 477 4357 -553
$$ packed form
1269B835p491J871P503k022p432K180P234k205p086K213O988k243o861K204O809
1284D497k192o834K263O809k339o791K404O791k526o789K707O698k831o578K885
1299a826O507k901o505K940O520l000o538L098O569l206o590L356O546l492o440
1314d962L560O396l678o264L738O094l696n993L616N994l626n971L664N892l663
1329A101n896L766N809l878n639L872N530l882n463L949N330l955n218L892N245
1344D563l934n250M018N238m100n236M235N215m412n073M493M959m522m908M616
1359i8M816m651m732M638M715m683m686M727M637m778m602M839M561m964m424
1374d685N005M268m978m157M940M052m894l989M861L939m836l913M864L880m910
$$ plain form
1389 -553 -4362 601 4328 -669 -4325 754 4305 -835 -4229 908 4178 -877 -4180 914 4203
1404 4203 -969 -4192 1019 4208 -1073 -4236 1168 4204 -1251 -4184 1292 4158 -1378 -4123 1420
1419 1420 4015 -1455 -3995 1423 3974 -1466 -3995 1469 3962 -1561 -3981 1598 3898 -1664 -3861
1434 -3861 1684 3806 -1732 -3751 1759 3680 -1769 -3623 1789 3631 -1780 -3597 1813 3621 -1845
1449 -1845 -3611 1946 3575 -2011 -3494 2047 3454 -2093 -3423 2111 3363 -2146 -3345 2140 3300
1464 3300 -2193 -3318 2200 3278 -2271 -3292 2324 3247 -2423 -3220 2459 3136 -2495 -3074 2480 3054
1480 3054 -2502 -3020 2544 2991 -2536 -2971 2567 2966 -2604 -2915 2663 2883 -2674 -2834 2721 2771 -2758
1497 -2758 -2691 2723 2643 -2716 -2654 2697 2604 -2749 -2610 2720 2553 -2786 -2563 2806 2486 -2871 -2457 2865
$$ packed form
1389e53l809M963L727m997l656N079L551n140l394N137L270n055l303N094L289
1404D203n172l223N211L189n281l163N404L036n455k933N476K866n536k745N543
1419A420K595n470k540N418K551n440k529N464K493n523k420N579K300n562k197
1434c861N545K122n538k019N510J921n449j854N412J842n411j817N410J808n466
1449a845j766N557J629n586j483N541J407n547j330N534J252n509j199N485J160
1464C300n493j125N518J078n549j021N616R23n670p97N679O77n631n79N554N74
1480C054n556n18N564M47n527m35N538L99n570l11N578K20n557j60N555N0n529
1497b758O7N414q0n359O2N351r3n353J39N330j67n339K23N369l20n357M14N322
$$ plain form
1515 2865 2398 -2933 -2337 2929 2267 -2931 -2260 2949 2237 -2959 -2220 3023 2220 -3072 -2170 3138 2122
1532 2122 -3159 -2044 3186 2012 -3205 -1956 3217 1901 -3198 -1866 3180 1840 -3199 -1848 3171
1547 3171 1801 -3226 -1778 3198 1712 -3256 -1671 3202 1590 -3191 -1599 3157 1536 -3160 -1508
1562 -1508 3142 1473 -3127 -1479 3156 1456 -3194 -1391 3226 1358 -3255 -1297 3329 1225 -3308
1577 -3308 -1161 3299 1139 -3320 -1119 3353 1071 -3385 -1052 3360 1016 -3415 -1001 3406 918
1592 918 -3441 -904 3401 809 -3392 -785 3325 744 -3301 -765 3257 752 -3249 -757 3221
1607 3221 718 -3199 -690 3197 680 -3162 -626 3191 585 -3135 -526 3132 504 -3108 -449
1622 -449 3125 437 -3142 -414 3175 362 -3250 -303 3243 197 -3277 -175 3266 78 -3298
$$ packed form
1515B865m67n331N96N266o62n198O71N209p12n196P39N243q03n292R02N308j016
1532B122n281J115N230j174n217J249N173j316n099J332N046j340n039J351N019
1547C171j370n027J448M976j486m968J585M873j612m781J592M756j621m696J652
1562a508M650j669m600J648M635j700m650J803M617j868m613J958M626k104m533
1577c308K147M460k160m459K201M472k282m456K333M412k344m431K414M407k488
1592I18m359K537M305k592m201K607M110k581m045K536M022k505m001K492L978
1607C221k503l917K509L887k517l842K536L817k606l720K609L658k628l612K659
1622d49L574k688l579K728L589k813l612K947L546l046l474L102L441l188l376
$$ plain form
1637 -3298 -57 3243 -18 -3250 3 3207 -41 -3210 40 3180 -57 -3180 81 3162 -107
1652 -107 -3111 160 3075 -136 -2998 160 2988 -136 -2915 182 2890 -161 -2856 173 2871
1667 2871 -204 -2869 243 2862 -290 -2889 359 2854 -455 -2845 473 2809 -536 -2864 566
1682 566 2831 -650 -2853 666 2862 -730 -2867 783 2844 -834 -2834 879 2820 -921 -2746
1697 -2746 942 2706 -893 -2657 914 2645 -885 -2588 878 2584 -868 -2563 900 2519 -903
1712 -903 -2480 893 2452 -936 -2431 945 2360 -988 -2372 955 2329 -1022 -2367 1053 2333
1727 2333 -1126 -2362 1169 2334 -1270 -2332 1315 2288 -1385 -2261 1407 2264 -1459 -2214 1499 2200
1743 2200 -1466 -2177 1502 2188 -1526 -2146 1532 2127 -1531 -2108 1547 2040 -1557 -2003 1490 1975 -1484
$$ packed form
1637c298L241L300l261l232L253L204l248l169L250L140l237l123L261L081l269
1652a07l004L271K915l211k862L158K828l124k779L097K708l051k695L029K698
1667B871l075k665L112K619l152k599L248K495l309k390L318K336l345k328L430
1682E66K265l481k203L519K196l592k137L650K061l678k000L713J941l741j825
1697b746L688J764l599j764L571J731l530j703L466J706l452j695L463J619l422
1712i03j577L373J559l388j495L376J415l348j384L327J374l351j345L420J280
1727B333l459j236L531J165l604j062L647R73l673q76L668Q57l723p55L713P01
1743B200l666p11L679O86l714o20L678N95l658n77L655M93l597m46L493M85l459
$$ plain form
1760 -1484 -1970 1463 1902 -1474 -1924 1418 1888 -1471 -1908 1468 1861 -1512 -1845 1544 1799 -1596 -1755
1777 -1755 1618 1735 -1644 -1707 1689 1703 -1711 -1662 1776 1660 -1805 -1631 1855 1611 -1877 -1576 1917 1545
1795 1545 -1929 -1500 1915 1454 -1918 -1442 1873 1397 -1893 -1426 1849 1383 -1873 -1394 1831 1354 -1848
1812 -1848 -1352 1829 1292 -1826 -1283 1813 1251 -1826 -1218 1801 1196 -1811 -1193 1854 1168 -1867 -1115
1829 -1115 1919 1118 -1952 -1056 1991 1001 -1999 -963 2015 933 -2062 -909 2038 854 -2051 -860
1845 -860 2035 822 -2091 -826 2060 765 -2087 -777 2060 706 -2051 -707 2019 683 -1999
1860 -1999 -677 1986 654 -1971 -651 1961 660 -1949 -617 1969 611 -1955 -551 1998 523
1875 523 -1959 -475 1976 446 -1973 -415 1974 389 -2009 -378 2007 311 -2036 -317 2019
$$ packed form
1760a484m86L433M39l376m50L342M70l359m37L376L93l373l33L389K55l395j59
1777a755L373J17l379o3L396J4l414M9L438j16l465J74L486k44l488L01L493l72
1795A545l474M29L415m61l372M76L315m76l290M67L275m66l256M79L225m77l202
1812a848M96L181n37l118N43L096n62l077O08L019o05l007O18L047o86l035P52
1829a115L034q01l070Q96L047r90l000J036K978j082k995J153K947j184k905J191
1845h60K895j213k913J265K886j295k852J310K837j354k757J344K726j336k682
1860a999J322K663j332k625J320K612j301k609J332K586j358k566J404K549j475
1875E23k482J484K451j530k419J558K389j585k398J631K385j696k347J719K336
$$ plain form
1890 2019 247 -2075 -244 2035 178 -2069 -161 2030 123 -2034 -115 1994 116 -2000 -100
1905 -100 1997 87 -1979 -50 1979 55 -1963 -25 1968 18 -1923 14 1934 -38 -1904
1920 -1904 52 1878 -52 -1891 62 1876 -106 -1902 101 1882 -160 -1916 183 1876 -241
1935 -241 -1887 239 1859 -292 -1869 298 1832 -341 -1847 349 1828 -362 -1832 387 1835
1950 1835 -402 -1811 450 1807 -457 -1768 489 1766 -468 -1730 499 1731 -496 -1718 493
1965 493 1703 -530 -1698 516 1680 -553 -1692 558 1640 -613 -1660 609 1607 -662 -1611 640
1981 640 1583 -672 -1592 680 1572 -706 -1559 723 1551 -742 -1543 788 1528 -788 -1494 821 1495
1998 1495 -824 -1453 848 1443 -845 -1431 855 1423 -877 -1417 898 1377 -926 -1398 921 1346 -960
$$ packed form
1890B019j772k322J831K279j857k247J908K191j907k157J919K109j878k116J900
1905a00K097j910k066J929K029j924k018J938J993j950j941J937J920j972j866
1920a904J956J826j930j839J953J814j982j796K003J781k042j756K099J693k117
1935b41j646K126J620k151j577K167J534k173j506K196J479k190j470K219J448
1950A835k237j409K261J357k264j311K257J277k234j262K229J232k227j222K211
1965D93J210k233j168K214J164k233j139K250J082k253j047K269R98k269r49K251
1981F40R43k255r20K272Q92k278q53K282Q28k293q01K331P40k316p06K315O74
1998A495k319o29K301N95k288n86K286N68k300n40K315M79k303m72K319M25k306
$$ plain form
2015 -960 -1357 940 1299 -995 -1304 961 1262 -992 -1274 973 1252 -994 -1253 1004 1214 -1047 -1201
2032 -1201 1055 1189 -1060 -1150 1075 1153 -1076 -1110 1097 1118 -1084 -1082 1115 1068 -1101 -1058 1114 1066 -1152
2051 -1152 -1044 1157 994 -1185 -983 1166 940 -1196 -950 1183 903 -1218 -914 1206 875 -1238 -873
2068 -873 1220 852 -1245 -837 1260 802 -1269 -770 1272 753 -1260 -727 1270 729 -1257 -703 1273
2085 1273 690 -1267 -668 1282 648 -1288 -639 1289 628 -1312 -606 1297 548 -1303 -561 1255 516
2102 516 -1300 -545 1280 485 -1316 -497 1290 449 -1331 -433 1305 413 -1323 -416 1335 373 -1333
2119 -1333 -333 1325 349 -1305 -312 1337 303 -1319 -278 1341 278 -1336 -240 1338 215
2134 215 -1337 -199 1312 184 -1336 -178 1303 124 -1329 -136 1292 101 -1326 -133 1301
$$ packed form
2015i60l97K297L59k294l09K265L01k254k82K247K79k246k59K257K10k261j54
2032a201K256J34k249r0K225P8k229l4K207K1k202KK197m7k169M3K172m8k218
2051a152J08K201j63k179K02K149k26k136K46K133k80k121L04K120l31k113L65
2068h73K093l68k097M08K097m58k071M99K042n19k013N33J997n41j986N54J976
2085A273n83j957N99J950o34j936O49J928o61j940P06J903p49j851P42J816p39
2102E16j816P55J825p95j801Q19J787q41j780Q98J738q92j736R07J751r62j706
2119a333J000J658r76j654R93J649j034j622J041J619j063j614J096J578j123
2134B15j552J138J511j128j520J158J481j179j453J193J428j191j427J193J434
$$ plain form
2149 1301 72 -1332 -81 1299 26 -1318 -20 1285 -14 -1285 17 1286 -33 -1302 75
2164 75 1282 -73 -1269 87 1289 -90 -1269 127 1283 -156 -1275 170 1262 -215 -1246
2179 -1246 205 1222 -231 -1252 224 1223 -286 -1251 265 1206 -316 -1240 304 1207 -341 -1233
2195 -1233 336 1199 -372 -1187 386 1164 -397 -1173 408 1167 -411 -1152 447 1158 -445 -1114 482
2212 482 1130 -490 -1114 492 1123 -506 -1098 536 1078 -557 -1066 534 1054 -562 -1078 542 1049
2229 1049 -627 -1069 595 1021 -650 -1056 625 1004 -685 -1023 673 986 -711 -979 720 963 -725
2246 -725 -947 742 961 -754 -940 794 934 -787 -904 811 897 -810 -879 802 874 -819 -868 823
2264 823 838 -834 -845 812 817 -847 -836 827 810 -884 -821 872 758 -891 -777 875 746 -908 -752
$$ packed form
2149A301j229j404J251J380j273j344J298J305j299j271J302J269j319j269J377
2164G5J207j355j196J356J202j379j179J396J156j439j119J445J092j477j031
2179a246J451J017j453j021J476R99j509r65J516R41j522r24J544R03j548q92
2195a233J569Q63j571q15J573P78j561p76J581P59j578p41J599P11j603o69J596
2212D82O48j620o24J606O31j629n92J634N42j635n09J600N20j616n16J620N07
2229A049j676m42J664M26j671m06J681L79j689l38J696L13j697k68J699K43j688
2246g25k22J689K19j715j86J734J40j721j17J715Q6j707o9J681P2j693m9J691
2264H23J5j672j1J657Nj664J1J663j7j694O3J693j14j649J14J652j29j654J56
$$ plain form
2283 -752 908 729 -939 -713 953 707 -954 -676 984 691 -991 -649 1036 645 -1026 -620 1029
2300 1029 605 -1030 -604 1037 589 -1043 -587 1035 555 -1046 -562 1028 525 -1063 -552 1022 511
2317 511 -1062 -542 1025 495 -1041 -502 1005 475 -1025 -487 1021 471 -1049 -450 1054 434 -1057
2334 -1057 -400 1080 396 -1081 -348 1104 347 -1112 -319 1117 301 -1131 -283 1131 264 -1140 -265
2351 -265 1140 215 -1172 -218 1136 177 -1164 -199 1120 161 -1157 -177 1113 165 -1117 -181 1105
2368 1105 158 -1101 -166 1103 164 -1096 -133 1105 121 -1081 -99 1089 110 -1070 -74 1108 64
2385 64 -1099 -34 1112 -3 -1121 11 1111 -49 -1143 55 1130 -116 -1153 104 1123
2400 1123 -152 -1139 146 1118 -179 -1149 162 1124 -191 -1117 184 1102 -184 -1104 184 1099 -193
$$ packed form
2283g52J660j79j668K26J666k46j661K78J660k93j682L42J685l91j671M06J649
2300A029m24j635M26J641m48j632M56J622m80j601M84J590n03j588N11J574n11
2317E11j573N20J567n30j536N39J507n30j500N38J508n50j520N99J504o20j491
2334a057O57J480o84j477P33J452p57j459P93J436q16j432Q48J414q67j404Q75
2351b65J405r25j387R54J354r59j341R65J319r59j318R80J290r48j282R36J286
2368A105r47j259R35J269r39j260R63J238r84j202R82J188r79j180R96J182j044
2385F4j163J065J146j115j118J132J100j160j094J198J075j246j037J257J019
2400A123j275r87J285R72j297r70J311R62j315r26J301R18j286r20J288R15j292
$$ plain form
2417 -193 -1076 201 1079 -184 -1045 191 1049 -189 -1041 207 1055 -209 -1046 231 1037 -255 -1028
2434 -1028 268 1020 -300 -1045 309 1017 -372 -1040 371 1000 -416 -1032 411 1016 -459 -1026 466
2451 466 1005 -505 -1006 510 992 -524 -978 528 998 -520 -965 544 970 -512 -937 522 947
2468 947 -511 -931 507 930 -505 -927 507 916 -522 -910 511 885 -527 -906 534 877 -575
2485 -575 -901 570 842 -614 -877 603 846 -665 -855 670 821 -712 -815 729 803 -747 -790 765
2503 765 798 -768 -766 782 787 -786 -757 795 769 -788 -736 779 739 -791 -745 778 708 -786 -718 751 706
2524 706 -768 -728 745 696 -788 -710 763 687 -807 -696 803 653 -822 -654 831 645 -871 -607
2542 -607 877 601 -883 -584 928 575 -935 -549 967 544 -964 -519 989 514 -988 -496 978
$$ packed form
2417a93q83J277Q78j263q61J236Q58j238q52J248Q48j264q37J277Q06j292p73
2434a028J296P52j320p45J354P08j389o68J411O29j416o16J443O05j475n67J492
2451D66N39j510n01J516M82j516m54J506M70j518m45J509M26j482m25J459M25
2468I47j458m20J438M23j435m22J434M09j438l88J421L74j412l79J440L43j452
2485e75l26J471K72j456k63J480K43j511j90J525J51j533j03J544P4j550m3J555
2503G65L3j566KJ548Nj573K9J552k6j557N2J515m0j530M6J523p0j494O8J469m5
2524G06j474M0J473m9j484P8J473p6j494J11J499j50j475J68J485j86j516K64
2542f07J484k76j484K99J512l53j510L86J516m23j508M45J508m75j502M92J474
$$ plain form
2559 978 488 -991 -500 979 459 -994 -481 963 455 -987 -485 952 444 -993 -478 951 438
2576 438 -976 -464 958 419 -975 -430 966 428 -987 -408 998 390 -993 -366 1010 376 -1017
2593 -1017 -333 1051 323 -1037 -298 1060 278 -1058 -253 1066 248 -1077 -254 1084 226 -1089 -228
2610 -228 1067 197 -1082 -215 1057 186 -1083 -206 1052 174 -1067 -193 1048 172 -1054 -177 1041
2627 1041 183 -1047 -171 1064 166 -1044 -122 1062 138 -1051 -100 1070 116 -1049 -65 1070 62
2644 62 -1069 -45 1073 23 -1065 -17 1074 -17 -1093 14 1073 -58 -1091 40 1063
2659 1063 -82 -1087 57 1055 -79 -1076 90 1057 -93 -1054 92 1057 -80 -1044 117 1056 -114
2676 -114 -1042 141 1050 -127 -1020 144 1041 -133 -1027 163 1027 -175 -1023 182 1018 -211 -1033
$$ packed form
2559I78m90j479M91J479n20j453N13J444n08j442N02J437n08j437N15J429n13
2576D38j414N12J422n39j394N45J396n38j415N79J406o08j383O27J376o34j393
2593a017O84J384p28j360P39J358p82j336Q05J319q18j325Q23J338q58j315Q61
2610b28J295q70j279Q67J272q71j269Q77J258q78j241Q74J241q76j226Q77J218
2627A041q58j230Q76J235q98j210R22J184r24j189R51J170r54j165R84J135j008
2644F2j131J024J118j050j088J048J091j091j076J107J059j131j033J131J023
2659A063j145j005J144R98j134r97J166R67j150r61J146R65j137r64J161R39j170
2676a14r28J183R09j177q93J164Q97j174q94J190Q64j202q48J205Q36j229q22
$$ plain form
2693 -1033 207 1013 -250 -1026 246 997 -286 -1015 258 989 -307 -1008 288 984 -316 -1002 317
2710 317 995 -327 -979 348 973 -328 -963 358 959 -355 -956 380 962 -379 -950 391 941
2727 941 -403 -941 397 930 -426 -937 419 904 -461 -919 439 886 -477 -905 456 876 -494
2744 -494 -880 475 859 -508 -877 506 847 -523 -844 528 846 -525 -834 550 834 -544 -820
2761 -820 555 826 -554 -803 585 809 -572 -785 600 792 -598 -790 600 763 -628 -766 626
2778 626 734 -655 -755 629 715 -664 -744 656 688 -696 -713 667 680 -689 -697 698 670 -703 -674 716
2798 716 663 -695 -646 713 654 -699 -630 723 651 -713 -617 729 617 -738 -601 731 600 -750 -606
2817 -606 756 559 -774 -580 756 537 -785 -549 772 515 -802 -536 789 491 -819 -503 801
$$ packed form
2693a033J240Q06j263p76J272P51j283p29J273P31j296p01J296O96j300o86J319
2710C17O78j322o52J327O25j301o35J321O01j314o01J336N82j341n71J341N50
2727I41j344n38J338N33j356n11J356M85j365m58J358M47j363m28J361M20j370
2744d94l86J355L84j367l69J383L41j370l21J372L18j371l09J384K84j378k76
2761h20J375K71j380k49J388K24j381k13J385J92j390j92J390J63j391j38J392
2778F26J08j389j00J384Q6j379q0J400L2j384j7J380J3j369qJ395k8j373K9J390
2798G16n3j358M9J359n9j353O9J353p2j364R6J346j12j355J37J332j31j350J44
2817f06J362j97j333J94J336k19j322K36J321k57j317K66J325k98j310L16J304
$$ plain form
2834 801 464 -831 -465 822 451 -811 -442 841 450 -815 -426 840 440 -828 -407 848 430
2851 430 -827 -397 845 410 -840 -385 843 388 -841 -393 835 378 -855 -378 835 346 -857
2868 -857 -366 829 331 -863 -338 847 291 -869 -293 862 259 -866 -256 877 256 -880 -224
2885 -224 881 238 -865 -192 897 204 -884 -185 886 188 -884 -167 887 160 -879 -150 864
2902 864 137 -875 -163 860 141 -875 -152 861 115 -897 -134 860 100 -874 -129 856 91 -871
2920 -871 -88 876 74 -861 -45 856 40 -858 -7 872 10 -850 23 874 -26 -849 49 857 -50 -845
2940 -845 71 857 -79 -849 79 839 -85 -849 73 826 -99 -853 77 818 -104 -841 82 807 -100 -833
2960 -833 95 819 -107 -826 107 817 -125 -811 129 832 -128 -796 162 816 -155 -783 190 793 -187 -780
$$ packed form
2834H01l37j295L66J287l71j262L69J283l91j265L89J266m00j268M21J255m18
2851D30j257M30J242m35j250M55J228m55j229M48J228m57j233M77J213m89j203
2868h57M91J195m98j194N25J185n56j160N76J155o03j125O10J133o21j136O56
2885b24J105o43j103O73J089o93j088O99J071o98j072P17J054p27j039P29J014
2902H64p27j012P12J023p19j016P23J013p46j012P63R94p60r74P45R85p65r62
2920h71P83R64q02r35Q16R01q16q98Q51Q79q62q60Q73Q51r00q23Q98Q08r07p95
2940h45R16P86r36p70R28P60r24p64R22P53r25p54R30P41r22p37R23P25r07p33
2960h33R28P24r26p19R33P10r42o86R40P03r60o68R58O54r71o28R73O03r80n93
$$ plain form
2980 -780 207 777 -204 -768 238 769 -252 -757 255 739 -286 -759 260 726 -297 -754 265 710
2998 710 -306 -736 288 707 -304 -727 286 714 -298 -721 317 710 -295 -694 312 702 -305
3015 -305 -679 329 707 -317 -683 347 687 -343 -657 348 677 -345 -650 364 646 -376 -649
3032 -649 378 623 -410 -627 410 590 -428 -613 412 585 -446 -597 431 573 -455 -568 438
3049 438 565 -448 -558 463 554 -449 -535 460 549 -456 -531 478 553 -455 -535 476 546 -468 -523 475
3069 475 526 -478 -516 475 515 -503 -508 481 472 -515 -494 490 454 -519 -475 503 443 -543 -457 530 423 -541 -421
3092 -421 541 414 -544 -400 555 389 -546 -372 570 371 -554 -350 570 376 -553 -338 585 356 -566 -345
3112 -345 564 331 -572 -347 563 324 -583 -343 565 304 -593 -330 556 306 -581 -325 557 288 -579 -294
$$ packed form
2980g80R87N70r81n64J006N31j021n05J012M84j025m73J019M66j023m57J019M45
2998G10j016m30J024M19j011m23J013M28j012m23J038L93j005l99J006L90j007
3015c05l74J008L78j024l66J030L40j030l14J005L29j022l05J014K82j022k73
3032f49J027K45j033k17J037J80j018j85J025J73j031j51J028J42j028j13J006
3049D38J27j013j10J021R1j003q6R95Q9j005p5J009P5j008q0J011P0j014n5R98
3069D75N1j004l8R91M0j018nR89rr87K1R84l6r73M4R78o0r86Q6R87j07r64J20
3092d21R62j27r58J44R55j66r35J74R42j99r25K04R20j94r29K15R23k29r22K21
3112c45R09k33r03K25R10k39r07K40R08k61q97K63Q86k50q87K56Q82k69q67K85
$$ plain form
3132 -294 571 273 -585 -276 578 258 -572 -239 593 252 -571 -204 603 232 -575 -198 605 208 -581 -194
3152 -194 593 177 -582 -163 590 162 -601 -163 582 141 -599 -159 581 135 -612 -152 584 119 -603 -145
3172 -145 582 123 -601 -118 598 130 -588 -107 584 107 -589 -90 608 104 -577 -61 596 77 -575 -47
3192 -47 601 60 -582 -35 588 27 -591 -7 573 -8 -586 2 574 -23 -591 5 559 -46 -584 30
3212 30 559 -52 -576 38 569 -47 -572 46 573 -49 -574 69 571 -53 -569 72 584 -49 -555 83
3232 83 577 -72 -554 84 565 -94 -556 93 561 -108 -553 108 540 -138 -552 126 524 -152 -554 128
3252 128 517 -171 -539 160 510 -183 -525 176 509 -192 -500 197 511 -188 -490 222 497 -199 -487 207
3272 207 503 -210 -476 235 508 -205 -487 214 489 -214 -489 218 495 -233 -488 224 456 -240 -476 223
$$ packed form
3132b94Q65k98q58L09Q54l20q30L33Q32l41q23L67Q07l71q07L77Q03l97p89L87
3152a94P87m16p59M19P53m28p63M38P45m41p40M40P40m46p47M60P36m65p22M58
3172a45P27m59p24M83P16m68p18M81O91m77o96M99O98n04o81N16O57n19o52N28
3192d7O48n41o42N47O23n61o18N84N80n81n78N88N72n97n68N96N54o05n38O14
3212C0N29o11n24O14N31o16n25O18N27o22n25O43N02o24n16O41N12o33n06O38
3232H3M94o49m82O38M81o59m62O49M68o69m45O61M32o78m14O78L98o76m02O82
3252A28L89o88l68O99L50o93l42P01L33p01l08O97L14o99l02P12K75o96k88O94
3272B07K96p13k66P11K73p13k82P01K75p03k75P07K77p28k55P12K32o96k36O99
$$ plain form
3292 223 464 -254 -465 243 443 -271 -473 256 432 -276 -437 273 416 -287 -414 290 407 -297 -393 312
3312 312 400 -299 -378 321 400 -301 -378 326 386 -309 -379 327 379 -328 -383 312 373 -324 -392 301 371 -334 -386 313
3336 313 359 -337 -382 323 345 -347 -361 334 343 -343 -325 355 332 -351 -312 360 318 -361 -282 377 289 -358 -268 383
3360 383 290 -362 -259 396 264 -377 -252 381 244 -393 -258 375 237 -395 -258 372 227 -403 -258 377
3380 377 225 -404 -241 377 219 -405 -241 384 224 -389 -217 404 209 -383 -189 409 204 -393 -172 402
3400 402 186 -391 -152 413 167 -396 -143 400 155 -405 -135 398 116 -408 -125 398 101 -418 -128 396
3420 396 91 -426 -112 397 89 -414 -110 410 85 -425 -98 410 77 -413 -79 420 99 -398 -59 417
3440 417 76 -401 -55 426 57 -404 -34 421 39 -404 -24 409 30 -403 -13 407 -3 -417 -7 395
$$ packed form
3292B23K41p18k11P08K00p14k02P29J76p08j61P10J43p03j27P04J17p04r6P05
3312C12Q8o99p9O99P9p01p7P04O0o95p0P06N2p07n5O95O1o97o8O93P0p05n2O99
3336C13M6o96m5P05K2o92j4O95Ro86J8O80k3o83L9O72m2o79P9O59q8o47R0O51
3360C83r3o52J03O55j32o41J25O33j37o37J35O33j38o32J37O30j45o30J45O35
3380C77j52o29J63O18j58o24J64O25j60o13J72O21j95n92J94N98k05n97K21N74
3400D02k16n77K39N65k46n63K53N43k45n60K70N33k82n24K83N23k97n19K90N24
3420C96l05n17L14N09l08n03L04N20l25n10L27N08l33m90L34M99l21m97L39M76
3440D17l41m77L46M81l69m61L70M55l82m43L80M33l79m33L90M20m10m14M10M02
$$ plain form
3460 395 -15 -409 4 388 -26 -415 5 397 -40 -410 20 400 -37 -395 46 392 -40 -399 54 415
3480 415 -35 -389 65 407 -47 -381 68 407 -59 -392 82 408 -61 -385 79 387 -98 -399 81 382
3500 382 -109 -399 84 365 -121 -394 104 370 -126 -382 116 373 -134 -373 128 363 -137 -371 141 374
3520 374 -141 -361 164 371 -138 -346 167 371 -141 -358 177 372 -145 -352 172 348 -173 -344 181 349
3540 349 -184 -343 176 327 -201 -345 186 327 -201 -336 188 324 -210 -334 206 319 -223 -317 213 311 -210
3561 -210 -310 219 322 -210 -291 234 318 -218 -292 237 316 -221 -285 250 299 -232 -288 244 301 -237 -281 238 271
3584 271 -253 -291 255 252 -278 -278 250 262 -268 -266 265 242 -282 -246 277 245 -285 -240 279 242 -272 -216 295 250 -284
3609 -284 -219 305 240 -275 -203 300 214 -297 -206 314 223 -298 -208 298 205 -303 -218 295 197 -310 -210 301 184
$$ packed form
3460C95m10l94M13L84m14l89M20L92m37l70M30L80m37l58M41L46m32l59M53L61
3480D15m50l54M54L42m54l34M49L39m66l33M74L26m69l24M64L08m85l01M80L01
3500C82m91k90M83K81m86k73M98K66m96k56M98K57n07k39N01K35n00k34N12K33
3520C74n15k20N25K07n09k08N13K04n12k17N35J95n17k07N24J76n21j71N25J68
3540C49n33j59N19J51n28j44N31J41n28j35N24J36n34j24N40J13n42r4N30R8n21
3561b10j00N29J03n32q1N25Q4n36p4N29P9n37o4N35M9n31n6N32N7n38m4N19L3
3584B71n24l8N46ln30%N28J2n30KN31k3n24L6N23l2n30M5N19l7n14N6N11m5n34
3609b84O5N24o5n15P2N03q6n11R1N20r1n21R0N06r3n08Q5N13r8n07J00N11j17
$$ plain form
3632 184 -334 -201 302 159 -326 -190 298 175 -312 -159 324 155 -310 -147 322 150 -315 -121 345 147
3652 147 -305 -119 341 142 -317 -111 335 130 -328 -121 342 119 -326 -117 326 115 -340 -117 327 91
3672 91 -345 -109 323 83 -361 -112 341 75 -351 -91 333 74 -341 -75 347 71 -344 -54 343 55
3692 55 -329 -35 359 47 -332 -20 355 32 -333 -17 330 26 -338 -6 342 3 -344 -9 333 -5
3712 -5 -352 -18 327 -10 -366 -9 335 -16 -360 -6 334 -20 -356 4 341 -16 -353 21 358 -28 -345
3733 -345 39 372 -35 -333 71 359 -45 -337 74 357 -59 -336 76 339 -77 -327 80 334 -87 -342
3753 -342 83 330 -101 -357 88 326 -117 -343 99 331 -115 -346 112 329 -122 -349 115 341 -119 -334
3773 -334 123 336 -119 -323 135 344 -128 -324 159 343 -124 -326 165 339 -147 -316 167 324 -167 -320
$$ packed form
3632A84n18J33N03j43m85J36M88j23m87J53M83j69m65J63M69j72m65J94M66j98
3652A47m52J86M60j99m59K06M46k05m58K07M63k23m45K09M43k11m55K23M44k36
3672I1m36K36M32k40m44K49M53k66m26K60M24k59m15K66M22k76m15K90L97k88
3692E5l84K94L94l12l79L12L75l23l65L16L47l04l64L32L48l39l47L35L42l38
3712el47L34L45l37l56L57L44l51l44L54L40l54l36L60L37l57l37L74L37l86l17
3733c45L84L33m07k98M04K88m04k92M11K83m16k77M12K63m16k50M07K54m21k55
3753c42M25K47m31k56M45K38m43k26M42K32m46k31M58K17m51k27M64K26m60k15
3773c34M57K13m55k04M58K09m72j96M83J84m67k02M91J74m86j69M83J57m91j53
$$ plain form
3793 -320 166 306 -182 -322 165 296 -194 -317 179 285 -200 -312 178 290 -201 -310 196 293 -210 -296 210
3814 210 303 -209 -292 206 297 -213 -278 213 300 -202 -277 231 291 -217 -282 244 291 -221 -276 237 289 -242 -283 229
3838 229 267 -244 -282 246 252 -270 -273 223 240 -265 -270 255 250 -277 -261 270 257 -270 -238 276 244 -267 -230 291 244 -272
3864 -272 -217 299 243 -281 -204 304 238 -266 -213 298 233 -294 -222 297 216 -306 -210 310 205 -313 -202 311 198
3887 198 -323 -214 306 185 -317 -195 310 177 -321 -191 323 178 -324 -169 333 174 -323 -170 347 180
3907 180 -324 -143 339 176 -328 -134 347 147 -338 -134 338 128 -338 -147 342 128 -347 -142 335 121
3927 121 -345 -136 343 109 -350 -141 342 114 -366 -121 349 105 -351 -109 357 112 -350 -102 364 106
3947 106 -353 -96 365 108 -349 -69 365 95 -354 -76 371 69 -356 -71 363 57 -364 -64 342 45
$$ packed form
3793c20M86J40m88j40M87J31m90j23M96J06m85j12M90J12m91j09N06R7n03q6N06
3814B10R3n12q3M98R1n10o5M91Q7n02p5N08O0n08o5N26M7n12n5N13N2n31m1N12
3838B29L8n11l8N28On22lM96J7n05nN25nn27J6N31j3n27L2N14l2n11L7N21m7n16
3864b72N5N16n6n24P7N08o6n04N3N11o5n27P2N19q1n22R6N20j05n18J11N13j13
3887A98n21J09N20j21n02J22N05j33m98J30N14j45n02J55N02j59m97J53N17j67
3907A80n04J81M82j63n04J94M81k00m85K04M72k10m66J91M89k14m75K05M77k14
3927A21m66K09M79k34m59K09M83k28m80K45M70k44m56K42M66k45m62K48M66k58
3947A06m59K57M61k57m57K80M34k70m49K78M47l02m25K85M34l06m21L00M06k97
$$ plain form
3967 45 -355 -56 345 28 -366 -52 347 14 -370 -35 333 22 -371 -28 358 21 -349 -16 359 22
3987 22 -349 1 375 12 -354 6 376 16 -353 17 387 4 -365 10 371 -1 -367 7 370 -21
4007 -21 -377 13 355 -40 -366 26 355 -58 -371 27 339 -59 -363 36 343 -68 -356 58 339 -62
4027 -62 -342 63 342 -65 -334 81 349 -80 -346 76 352 -66 -341 88 355 -83 -350 82 353 -89
4047 -89 -347 88 347 -105 -364 88 331 -119 -364 97 331 -124 -357 105 317 -137 -350 113 333 -130
4067 -130 -327 131 314 -118 -308 143 329 -125 -301 151 324 -128 -284 164 312 -155 -291 175 313 -155
4087 -155 -304 162 310 -171 -304 149 294 -174 -316 147 290 -187 -331 160 292 -189 -317 170 291 -191
4107 -191 -313 175 289 -190 -289 195 285 -191 -272 199 279 -186 -270 209 264 -194 -251 210 260 -207 -250 212 248
$$ packed form
3967D5m00K99M01l17l94L14L99l33l84L35L68l11l93L43L86l37l70L33L75l37
3987B2l71L50L74l63l66L60L70l60l69L70L70l83l69L75L61l72l66L74L63l91
4007b1l56L90L42l95l26L92L29m13l13L98L12l98l04L99L07m11k88M14K81m01
4027f2k80M05K79m07k69M15K68m29k66M22K76m18k75M29K67m38k67M32K71m42
4047h9k58M35K59m52k59M52K43m50k45M61K34m55k33M62K12m54k13M63K20m63
4067a30j97M58J83m32j90M51J86m54j76M52J73m52j56M48J48m67j36M66J38m68
4087a55j49M66J48m81j33M53J45m68j42M63J43m77j44M91J32m81j28M87J21m82
4107a91j22M88J14m79r9M84R0m76q1M71Q0m65q4M79N5m58n7M61N0m67m3M62L6
$$ plain form
4130 248 -217 -244 206 242 -224 -251 210 222 -234 -255 202 226 -237 -258 218 225 -242 -258 210 233 -241 -245 236 235 -240
4155 -240 -242 236 239 -237 -221 246 243 -230 -223 263 234 -232 -192 258 213 -238 -191 252 197 -248 -191 246 176 -254 -190 247
4181 247 163 -258 -181 241 164 -266 -179 234 160 -271 -177 242 163 -265 -175 251 170 -270 -163 279 175 -260 -159
4204 -159 288 176 -253 -154 275 171 -263 -148 276 149 -272 -147 275 142 -279 -147 257 125 -273 -141
4224 -141 260 96 -291 -131 258 109 -277 -130 252 96 -274 -117 266 101 -273 -94 275 107 -263 -88
4244 -88 278 110 -266 -81 294 99 -269 -88 285 98 -281 -73 282 77 -280 -81 276 72 -285 -86
4264 -86 266 55 -294 -83 272 49 -288 -62 258 40 -295 -58 251 34 -269 -55 266 47 -257 -33
4284 -33 265 47 -252 -16 278 43 -245 -3 272 44 -249 -21 278 31 -262 -33 266 19 -258 -25
$$ packed form
4130B48m65k7M50L6m66k7M61J2m56k1M57K4m63k1M76Pm67j6M68K3m74mM81jm75
4155b40kM78Lm76J6M67lm73PM86k9m66M0M50m5m51M7M43n5m45N7M37p0m30O4M37
4181B47q4m21P7M22p7m30Q7M13p4m31R4M19p9m28R0M26q1m40J07M42j04m35J01
4204a59M47j12m29R9M29j04m34J15M24j27m21J25M22j33m21J32M04j32l98J32
4224a41M01j64l87J60L89j49l86J47L82j56l70J57L83j65l74J79L69j68l70J75
4244h8L66j68l76J85L75j95l68J81L73j87l79K08L55k05l57J99L57k04l57J99
4264h6L52k11l49K11L55k23l37K26L20k18l35K37L09k17l03K14L21k19l04K24
4284c3K98k18k99K36K94k35k88K42K75k28k93K28K99k47k93K29K99k47k77K33
$$ plain form
4304 -25 258 10 -283 -27 254 4 -282 -26 254 -6 -274 -10 261 -14 -260 -11 257 -7 -261 4
4324 4 251 -1 -242 14 257 1 -234 23 254 1 -217 30 240 -8 -228 31 253 -19 -229 31 240
4345 240 -30 -234 32 235 -37 -239 14 220 -55 -245 26 227 -53 -246 39 223 -39 -229 46 227
4365 227 -49 -224 43 228 -43 -217 59 227 -36 -211 69 221 -50 -202 65 215 -57 -196 64 212
4385 212 -62 -203 64 202 -72 -205 69 185 -71 -210 61 168 -84 -199 69 174 -87 -186 72 176
4405 176 -69 -175 87 182 -87 -179 97 172 -81 -168 89 187 -62 -151 96 182 -81 -148 101 170 -94 -162 101
4428 101 173 -104 -163 106 162 -103 -160 93 141 -111 -157 87 138 -108 -167 95 140 -107 -140 92 138 -111 -133 93
4452 93 137 -102 -127 116 136 -98 -121 122 143 -93 -117 125 139 -111 -123 119 124 -119 -121 104 114 -106 -127 101 109 -129
$$ packed form
4304b5K83k48k93K56K81k50k86K56K80k60k68K64K71k75k46K49K68k64k54K65
4324DK47k52k41K56K43k56k35K57K31k53k18K47K10k48k20K59K22k72k10K60K09
4345B40k70k04K66K03k72k02K53K06k75j90K71K01k80j93K85J84k62j90K75J81
4365B27k76j75K67J85k71j74K76J68k63j75K80J52k71j52K67J50k72j39K60J48
4385B12k74j41K67J38k74j33K74J16k56j39K71J07k52j15K68J05k61r9K58J04
4405A76k45j06K62R5k69r2K76P5k53q7K57R8k49q9K47Q6k63o7K49O9k64o8K63
4428A01P2k77n9K69N6k65n7K53M8k52m6K44N1k46n9K62M5k47l3K32M6k49k2K26
4452I3M4k39k5K43K0k34k3K43K1k36k4K42J4k50j2K42Nk43kK25J0k20k1K28Qk38
$$ plain form
4478 -129 -117 107 94 -134 -111 105 82 -127 -109 116 85 -129 -104 114 100 -115 -95 120 99 -106 -83 135 98 -97
4502 -97 -64 139 95 -95 -62 127 95 -108 -56 129 74 -104 -62 115 66 -118 -64 118 62 -131 -71 108 36 -129
4526 -129 -75 112 39 -121 -53 112 55 -129 -43 126 42 -118 -36 125 44 -107 -28 124 48 -90 -18 126 52 -95
4550 -95 -8 132 47 -97 -21 104 26 -105 -17 105 19 -115 -21 107 12 -116 -20 94 4 -110 -20 91 4 -112
4574 -112 -10 102 2 -100 -4 106 11 -99 8 118 25 -95 10 115 6 -97 21 111 17 -69 15 109 -3
4597 -3 -81 20 90 -15 -94 13 87 -26 -96 11 77 -25 -93 7 59 -34 -85 5 73 -21 -75 24 77 -22 -78 27 81
4624 81 -11 -60 42 80 -6 -51 35 82 -7 -58 51 84 -25 -47 36 67 -21 -52 39 59 -37 -56 26 39 -43 -50 25 40 -36
4653 -36 -57 21 29 -49 -45 30 24 -46 -42 29 47 -38 -22 53 42 -21 -17 60 37 -30 -15 57 43 -31 -15 57 29 -40 -8 52 19 -52 -24
$$ packed form
4478a29J2K24j3k28K3K16k3k09J8K25l1k14K5K18j4k15K0K15k1k05K3K18l7j95
4502i7L3K03m4j90L3J89l2k03N2J85n5j78M2J77m9j84N4J82n6j93O0J79p2j65
4526a29N4J87p3j60O8J65n7j84Q6J69q4j60Q2J61q1j51P9J52p6j38P2J44p4j47
4550i5Q7J40q5j44P6J25p8j31Q8J22q6j34R4J28r5j28R6J14r0j14R0J11q7j16
4574a12J02J12j00j02R6J10r5j10J07J10r3j20J05J05j09j03J18R0r4q6Q4R4j12
4597cp8J01P0j05p9J07P4j13p0J07O6j02o8J00N2r3n1R0O8r4n4R9N3r9n6J05N4
4624H1r2m9J02L8q6m5Q6M7q9n1J09L3j09k2Q3L1q8l1R1K0r6j9Q2J3q2pP5J5p6
4653c6k1P8Qp8MP5op0MP1J8q5J6P5j1o3MP7k3o7J5P2j4p4J6P2k8o9L2O0l3p1K8
$$ plain form
4686 -24 39 1 -47 -23 45 7 -68 -18 35 -10 -60 -16 39 -8 -64 -7 42 -3 -55 -5 43 3 -46 15 55 5 -44 12 47 3
4716 3 -32 31 52 -11 -30 32 53 -15 -36 26 43 -16 -44 16 50 -38 -47 25 35 -47 -52 14 31 -44 -42 18 25 -47 -50 32 29 -44 -37 51
4750 51 45 -34 -27 54 53 -35 -31 58 54 -41 -22 58 46 -39 -22 65 45 -54 -29 59 35 -56 -40 60 21 -70 -32 58 16 -72 -14 65
4782 65 5 -67 -20 55 10 -72 -18 68 15 -66 -7 75 32 -62 -5 95 22 -69 -3 91 17 -67 -1 87 21 -78 -2 86 -4 -93
4812 -93 -10 79 -5 -92 -9 81 1 -92 -3 80 -14 -105 -7 83 -14 -94 -6 82 -12 -93 15 104 -11 -91 23 101 -8 -87
4840 -87 36 111 -3 -98 44 104 -9 -95 33 106 -15 -95 32 102 -26 -110 31 99 -39 -117 16 103 -42 -115
4864 -115 33 91 -41 -127 37 96 -50 -116 44 102 -51 -105 46 107 -47 -95 67 118 -41 -94 63 118 -56 -100
4888 -100 68 117 -57 -98 78 114 -63 -98 80 109 -65 -94 70 100 -93 -109 66 100 -88 -119 67 94 -90 -125
$$ packed form
4686b4O3l8m8K4O8l8p5N0N3m5n0M4N5m7n6N7M9m5n2N0M8m0m9O1M0n0m9N6L5m4
4716Cl5O3K1o3j9O2K1o8k1O2J7n9k8O0L4q8rP2J0q2nO6J7p5KO0Pp2lQ2lp3PQ8
4750E1op9PQ1jq8MQ9mr5J9Q0j2q5J7Q7k0r9K5Q8k4r1J6J00l9r1L8R0m2q8N8P9
4782F5o0p2M7P5m5q2N4Q6n3q1N9Q2m3r4N7J00p3r1O6R4p4q4O6Q8o6r9P6Q8r0q9
4812i3Q3Q9q4q7Q3R0q0r3Q9Q3r4r1R8R0r7q0Q8Q8r4q1J08Q9j15q0J14P8j09p9
4840h7J23P5j14r5J42O0j13q6J28P3j21q0J27P0j28q4J41O8j38p8J33Q7j45p3
4864a15J48N8j32q6J64N9j46o6J60N8j53n4J51O1j54m8J62N1j59n3J57N5j74m4
4888a00J68M9j74m1J76L6j77l5J78K9j74k9J64L0j93j6J75L4j88l1J86K7j84l5
$$ plain form
4912 -125 78 99 -88 -116 88 110 -85 -104 82 104 -82 -102 102 119 -89 -90 116 121 -88 -86 118 103 -100 -104 118
4937 118 107 -94 -90 115 92 -118 -111 92 81 -124 -112 103 75 -123 -105 106 88 -127 -113 121 81 -122 -109 119 103
4962 103 -122 -86 134 100 -117 -78 141 106 -121 -76 151 103 -122 -81 141 92 -122 -81 148 83 -148 -78 143 67
4986 67 -153 -80 148 67 -164 -86 134 70 -162 -84 141 60 -159 -74 146 73 -151 -65 161 70 -147 -56 174 73
5010 73 -160 -51 172 80 -146 -51 173 85 -166 -52 172 65 -157 -62 174 56 -185 -55 169 35 -186 -58
5032 -58 166 31 -192 -55 165 30 -189 -53 178 38 -198 -52 181 35 -181 -34 196 33 -182 -24
5052 -24 204 42 -179 -17 212 37 -179 -12 202 30 -179 -9 203 19 -199 -18 198 12 -197 -5
5072 -5 192 7 -215 -15 196 0 -224 -9 185 -6 -219 -10 202 3 -213 -8 208 0 -201 9 210
$$ packed form
4912a25K03K1j87k8K04K2j95j9J86K2j86k0K04J7k08jK06Nk09KK04j5k03mK22
4937A18j1k01MK05k3k10PK03j1k05J2K15k8j98J8K11j8k15J4K34m0k03J3K28j6
4962A03k25L6K20l4k17L9K19l5k27M5K27m8k25M1K22m9k14M1K29o5k31P0K21p6
4986F7k20P3K28q1k31P8K20o4k32P8K25q1k19Q5K20p3k24Q6K26r1k17R1K30j01
5010G3k33J09K23r2k26R5K24q8k51J14K24j07k22R5K36j18k41J30K24j34k21J28
5032e8K24j35k23J37K20j35k19J36K31j40k36J46K33j46k16J47K30j63k15J58
5052b4K28j62k21J62K29j75k16J67K14j72k09J70K12j84k18J81K16j86k09J92
5072eJ97j85k22K00K11j96k24K15J94j91k13K09K12j99k16K05K16k08k01K10K01
$$ plain form
5093 210 0 -197 16 221 -2 -202 28 218 -3 -203 23 211 -15 -199 31 204 -28 -217 21 211
5113 211 -43 -223 28 209 -55 -233 27 203 -68 -230 31 212 -57 -232 45 204 -57 -220 53 215
5133 215 -49 -205 57 219 -56 -203 81 230 -69 -204 84 222 -73 -216 76 219 -79 -209 74 201
5153 201 -95 -217 82 215 -89 -220 84 199 -103 -231 79 192 -116 -217 91 206 -118 -217 95 201
5173 201 -101 -204 105 208 -115 -202 114 211 -101 -192 124 215 -114 -200 127 212 -122 -215 133 205 -131 -211 117
5196 117 201 -148 -223 121 181 -151 -218 122 174 -147 -212 125 179 -162 -214 138 191 -157 -205 142 186 -164 -191 157
5220 157 182 -156 -183 160 191 -148 -176 175 198 -159 -175 177 192 -160 -172 170 172 -177 -184 156 171 -184 -193 160 164 -198
5246 -198 -192 172 155 -199 -185 172 151 -191 -171 175 170 -200 -166 189 158 -196 -161 203 163 -190 -144 204 161 -187 -139
$$ packed form
5093B10k10j97K13K05k23k00K30J90k21k00K26J88k26j84K30J73k32j89K38J90
5113B11k54j80K51J81k64j78K60J76k71j62K61J81k69j75K77J59k61j63K73J62
5133B15k64j56K62J62k75j47K84J49k99j35K88J38k95j43K92J43k98j30K83J27
5153B01k96j22K99J33l04j31L04J15l02j28L10J13l08j01L08J15l24r9L12J06
5173B01l02j03L09J03l23q7L16R7l12r1L16R1l29q6L27Q5l34r3L48P2l36q0L28
5196A17Q4l49p5L44O0l32o7L40N2l21o5L37N4l41n2L52N3l48m8L47M4l50k7L48
5220A57K5l38k7L43L1l39k8L51K3l57j6L52J5l52j2L42Kl49pL40J5l55rL53Ml62
5246a98OL64j7l54J4L57k1l42K0L46nl70L4L55l1l54L5L64m0l53M6L48m3l48M8
$$ plain form
5271 -139 200 152 -190 -140 213 139 -205 -143 204 130 -214 -145 199 111 -228 -145 209 119 -238 -137 192 110 -235
5294 -235 -137 205 118 -232 -134 215 118 -229 -126 228 118 -232 -96 246 123 -231 -96 250 115 -226 -94
5315 -94 243 100 -245 -98 243 97 -245 -83 243 82 -247 -95 233 74 -259 -89 238 66 -260 -88
5335 -88 226 64 -261 -84 245 60 -259 -70 253 79 -249 -61 265 60 -251 -55 257 64 -253 -51
5355 -51 267 62 -255 -39 270 45 -260 -32 257 35 -266 -38 251 20 -267 -44 252 8 -274 -47
5375 -47 245 10 -273 -27 249 0 -278 -24 246 3 -271 -17 274 5 -262 5 279 10 -260 19
5395 19 283 4 -264 13 280 2 -257 15 257 -5 -262 20 260 -23 -277 12 254 -42 -278 18
5415 18 246 -39 -277 28 245 -53 -281 28 256 -61 -269 38 264 -58 -253 58 261 -56 -245 66
$$ packed form
5271a39L39m8l42N0L53p4l44O2L47p4l44O9L44q8l39Q3L54r0l57J01L29q2l45
5294b35R8L42q7l50R8L49r7l47J03L54j10l50J36L42j23l54J35L46j35l41J32
5315i4L37j43l45J47L41j46l42J62L26j61l29J52L28j59l33J70L27j72l26J72
5335h8L14j62l25J77L29j85l19J89L23j74l28J88L26k05l11J96L12j93l17K02
5355e1L18k05l17K16L09k25l05K28K89k22l01K28K89k31k87K23K96k44k82K27
5375d7K92k35k83K46K76k49k78K54K70k43k74K54K91k69k67K67K74k69k70K79
5395A9K64k79k68K77K67k78k59K72K42k62k57K82K40k83k54K89K42k96k36K96
5415A8K28k85k38L05K17k98k28L09K28l17k08L07K26l22j95L11K03l17j89L11
$$ plain form
5435 66 265 -48 -242 70 269 -56 -250 78 268 -62 -262 74 262 -80 -259 72 250 -93 -269 60
5455 60 232 -96 -278 70 243 -96 -272 82 239 -118 -266 78 243 -105 -245 108 246 -109 -251 104
5475 104 248 -110 -231 114 250 -106 -237 122 242 -113 -232 127 245 -129 -230 127 247 -134 -237 112
5495 112 220 -144 -247 120 224 -156 -245 129 212 -156 -246 127 210 -162 -232 147 216 -158 -237 152 217 -161 -213
5518 -213 166 211 -163 -210 163 217 -153 -198 167 212 -178 -204 160 194 -181 -201 174 190 -174 -204 162 170 -198 -205 166
5543 166 169 -198 -213 167 163 -203 -203 184 163 -201 -190 181 164 -207 -172 201 173 -203 -174 220 174 -196 -162 218 177
5568 177 -197 -166 215 161 -205 -154 208 164 -207 -164 209 138 -212 -155 205 130 -225 -156 193 121 -225 -148 205 121
5592 121 -231 -149 220 119 -222 -130 228 123 -219 -121 243 125 -225 -108 242 127 -229 -101 235 117 -233
$$ packed form
5435F6J99l13j94L12J99l25j94L28J90l30k00L36J88l42j79L31J78l43j76L29
5455F0J72l28j82L48J73l39j76L54J57l57j48L44J65l48j40L53J38l55j42L55
5475A04J44l58j21L45J36l56j31L59J20l55j19L59J18l74j01L57J20l81j03L49
5495A12J08l64j03L67J04l80q9L74Q3l68r0L73Q3l72p0L79O9l74p9L89O5l78n2
5518b13L79M5l74m7L73N4l70m5L65M5l90k6L64L4l75k0L75J6l64l0L66Ql68pL71
5543A66Ll67j5L80ml66%L87k1l64J1L71j7l71L5L73k8l76K9L94m6l70L4L80m1
5568A77l74L1L81n4l66N1L62m4l71M3L73p1l50N7L60p5l55O9L49p2l46P7L53q4
5592A21l52Q2L69j01l41R2L58j05l42R8L64j18l50J17L50j15l56J28L36j18l50
$$ plain form
5613 -233 -95 241 104 -231 -100 239 96 -239 -97 235 87 -256 -104 217 74 -245 -95 221 68 -254
5633 -254 -89 230 69 -256 -89 232 59 -250 -76 245 66 -235 -56 255 73 -232 -55 258 66 -234
5653 -234 -40 252 57 -243 -41 250 36 -243 -35 242 44 -252 -55 234 26 -254 -45 241 12 -265
5673 -265 -34 243 11 -258 -24 242 3 -250 -21 250 -2 -257 -5 249 0 -241 16 249 4 -236
5693 -236 18 254 2 -240 19 244 -9 -242 19 247 -12 -248 19 242 -38 -258 11 235 -43 -246
5713 -246 20 240 -44 -257 28 236 -59 -240 42 236 -66 -249 45 246 -56 -233 68 247 -48 -226
5733 -226 61 253 -46 -234 81 239 -58 -225 73 235 -63 -224 70 219 -88 -238 70 225 -94 -235
5753 -235 81 216 -96 -231 80 201 -107 -234 86 215 -92 -226 98 208 -100 -227 101 220 -96 -204
$$ packed form
5613b33J38L36j37l35J31L39j43l35J42L32j48l43J52L21j43l19J50L16j53l22
5633b54J65L19j61l25J67L21j73l09J74L21j79l01J79L11j82l05J77L13j92l00
5653b34J94K92j95l00K02K91k14k79K08K77j98k96J97K89k08k80K09K86k29k77
5673b65K31K77k32k69K34K66k39k53K29K71k52k55K52K54k49k41K57K33k45k40
5693b36K54K36k52k42K59K25k53k33K61K28k59k36K67K23k80k20K69K24k78k03
5713b46K66K20k84k13K85K08k95j81K82J94l02j83K94K01l02j77L01J79k95j78
5733b26K87J92k99j88L15J58k97j67K98J62k98j61K94J49l07j50L08J55l19j41
5753b35L16J35l12j35L11J21l08j27L20J29l07j34L24J10l08j27L28J19l16j08
$$ plain form
5773 -204 120 226 -97 -197 128 229 -106 -198 131 216 -110 -201 128 213 -128 -195 129 208 -122 -203 122 181 -148
5796 -148 -201 127 175 -140 -201 130 174 -151 -187 142 178 -142 -176 161 178 -147 -168 159 184 -148 -166 168 191 -147
5820 -147 -161 171 189 -147 -165 174 176 -165 -158 167 165 -179 -159 156 149 -189 -158 152 144 -181 -164 153 127 -184 -160 161
5846 161 133 -190 -153 184 134 -182 -139 180 130 -185 -118 199 143 -184 -116 201 127 -173 -111 207 127 -189 -109 207
5870 207 106 -198 -115 202 107 -191 -112 198 96 -216 -108 197 77 -214 -119 196 76 -225 -99 189 73
5891 73 -227 -99 207 79 -217 -79 210 79 -209 -66 212 79 -207 -53 224 83 -202 -61 213 66
5911 66 -199 -56 211 51 -212 -48 202 46 -212 -58 209 35 -240 -62 205 24 -232 -64 191 13
5931 13 -235 -40 210 9 -227 -37 210 16 -225 -19 211 23 -224 -16 221 7 -212 -4 232 14
$$ packed form
5773b04L24J06l23j00L25J01l35r2L29Q5l26r1L29Q5l41o7L24P9l30q1L25N9l29
5796a48n3L28M8l15o1L31M4l25l6L29L6l20l4L37J7l25k1L27K5l32j8L34K3l38
5820a47j4L32J8l36j8L39Kl41PL25kl44K0L15pl38L1L10ql25J7L17k6l11K4L21
5846A61k8l23L7L37n0l16M3L19n0l15O7L17n6l27O8L17p4l00O2L18q0l16Q0L16
5870B07j01l04Q3L17r5k98P9L10j02l12J08L05j20k91R5L15j20l01J26K88j16
5891G3l00J28L06j28k96J38K89j31k88J43K78j33k86J54K77j41k85J41K74j47
5911F6k65J43K67j60k63J64K50j56k58J54K67j74k75J78K67j81k56J68K55j78
5931A3k48J95K50k01k36J90K47j94k41K06K30j88k47K08K37k14k19K08K36k18
$$ plain form
5951 14 -206 0 213 9 -224 4 218 3 -215 -6 208 -18 -225 -1 201 -37 -230 3 197 -28
5971 -28 -237 12 214 -44 -229 12 208 -42 -224 28 219 -32 -214 54 211 -47 -215 51 220 -33
5991 -33 -199 56 212 -52 -201 57 208 -51 -215 54 207 -74 -222 56 190 -77 -221 45 193 -86
6011 -86 -230 61 196 -97 -217 67 191 -86 -211 74 194 -87 -198 90 195 -100 -199 100 204 -91 -177
6032 -177 121 199 -92 -172 116 205 -99 -176 112 186 -109 -180 112 185 -127 -193 118 160 -128 -195 108 161 -143 -187
6056 -187 107 160 -140 -182 122 153 -135 -175 133 156 -139 -169 136 171 -142 -159 155 172 -139 -145 155 163 -144 -153 156
6081 156 141 -153 -143 155 143 -160 -145 147 138 -161 -147 159 128 -171 -158 149 115 -184 -149 152 110 -183 -143 159
6105 159 115 -184 -131 167 122 -175 -121 189 120 -180 -109 185 121 -177 -103 201 123 -172 -97 193 104 -178 -106 181
$$ packed form
5951A4k20K06K13k04k33K28K14k15k18K09K14k26k07K24K02k38j93K33J94k25
5971b8k09K49K02k58j85K41J96k50j82K52J91k51j82K68J57k58j68K66J69k53
5991c3j66K55J56k64j49K58J51k59j64K69J53k81j48K78J34k67j44K66J48k79
6011h6j44K91J35k93j20K84J24k77j25K85J20k81j11K88J05k95r9K99J04k95q6
6032a77K98P8k91q0K88Q9l04p7K88P4k95p1K92P3l12o6L11M2k88o7L03N3l04m4
6056a87K94N3l00m2L04L1k88m0L08K3k95l0L05L5l13j7L14J7l11oL00Ql07rL09
6081A56j5k94J0K98j2l03J5K92rk99J4L06l1k99J3L07l4k99L5L01m2k93M0L02
6105A59m4k99N3K98m5k97N4L10o9l00P1K94o4k98P4L04p8k95P5K90q9k82P2K87
$$ plain form
6129 181 106 -198 -100 183 77 -200 -106 179 74 -204 -99 186 84 -216 -100 194 72 -217 -90 204 69
6150 69 -199 -73 215 70 -207 -70 212 63 -204 -68 209 71 -202 -57 219 74 -199 -47 212 55
6170 55 -204 -53 207 44 -220 -59 194 37 -229 -55 198 23 -234 -32 201 16 -236 -42 199 16
6190 16 -226 -29 222 28 -210 -14 224 12 -209 -20 233 27 -215 8 220 6 -207 4 237 6
6210 6 -213 -2 223 3 -216 -2 212 -18 -235 4 201 -26 -237 9 200 -35 -234 11 207 -41 -231
6231 -231 11 208 -51 -227 34 207 -37 -218 50 226 -34 -215 56 220 -35 -208 50 216 -52 -206
6251 -206 65 224 -64 -218 53 218 -68 -214 56 202 -82 -224 58 192 -88 -222 69 191 -87 -218
6271 -218 65 194 -100 -211 76 196 -103 -203 84 205 -95 -197 102 203 -96 -198 109 202 -88 -195
$$ packed form
6129A81p5l04R8K83j06k77R4K85j05k78J05K85j02l00J16K94j22k89J27K94j35
6150F9k68J26K88j45k77J37K82j49k67J36K77j38k73J45K76j45k73J52K59j57
6170E5k59J51K60j63k64J61K53j57k66J74K53j75k57K02K33j85k52J94K41j83
6190A6k42J97K51j94k38J96K38k12k21J89K53k06k42K23K12k14k13K11K33k31
6210Fk19K11K25k20k19K14K14k30k17K39J97k27k11K46J91k35j99K45J96k48j90
6231b31K42J97k59j76K61J73k44j81K68J76k60j81K71J64k55j73K58J66k68j54
6251b06K71J59k88j54K71J65k86j46K70J46k84j42K82J34k80j34K91J22k78j31
6271b18K83J29k94j11K87J20k99j00K87J21l00j02K99J01k99j02L07R3k90j07
$$ plain form
6291 -195 105 201 -109 -191 108 184 -116 -193 102 187 -115 -195 100 165 -128 -200 108 170 -139 -202 106 174 -154 -202
6315 -202 109 171 -144 -183 131 167 -143 -174 143 179 -149 -160 147 187 -131 -159 148 177 -145 -157 150 177 -152 -152
6339 -152 163 163 -162 -168 146 153 -177 -164 151 133 -177 -163 150 126 -188 -161 154 131 -184 -151 164 126 -179 -147 181
6364 181 127 -170 -134 186 136 -170 -118 200 139 -172 -128 196 127 -186 -112 199 118 -198 -109 197 108 -189 -119 191
6388 191 99 -215 -118 192 100 -217 -119 188 93 -225 -102 189 84 -221 -103 201 92 -208 -95 212 89 -204
6410 -204 -80 217 83 -200 -76 233 91 -207 -74 214 75 -219 -71 212 69 -216 -64 216 68 -231
6430 -231 -83 208 45 -231 -80 202 41 -244 -64 208 34 -242 -67 223 46 -235 -51 224 37 -239
6450 -239 -35 236 30 -225 -15 250 44 -211 -13 243 33 -224 -26 231 28 -231 -18 220 6 -231
$$ packed form
6291a95L00R6l10q2K99P6l00p7K95Q5l02q0K95O5k93p2L08O2l09o3L08O8l28m8
6315b02L11O2l15l9L14L6l10l1L17L6l28j1L07M0l18k8L07K9l22j2L07K7l29%
6339a52L15%l25oL14Pl30J3L15j8l10J4L13k4l14K7L15k3l15L3L15l8l05L2L28
6364A81n4k97L6L20n0l06N2L18o1l11M4L24o9l13P4L11q1l16Q9L06q9k97P0L10
6388A91r2l14R7L10r2l17R8L07r5l18J23K91j05l05J18L04j09l00J13L07j23k93
6410b04J24K97j34k83J24L09j42k98J33K88j39k94J48K83j43k85J52K80j48k99
6430b31J48K91j63k76J51K82j61k85J80K72j74k76J75K90j77k81J84K75j87k76
6450b39K04K71k06k55K10K65k06k55J98K56k10k57J98K57k03k59K13K38k14k37
$$ plain form
6470 -231 -12 219 8 -248 -20 209 -9 -241 -23 213 -23 -243 -18 223 -14 -239 -6 227 -5 -226
6490 -226 14 229 -4 -233 16 237 -6 -216 37 239 -14 -213 32 237 -19 -220 34 225 -42 -218
6510 -218 39 226 -43 -238 36 214 -61 -241 32 211 -52 -239 36 214 -73 -237 33 221 -62 -221
6530 -221 57 211 -65 -224 74 220 -61 -218 67 223 -66 -212 96 230 -73 -212 89 223 -79 -221
6550 -221 88 218 -83 -217 92 207 -112 -222 77 200 -110 -219 75 191 -119 -221 85 191 -121 -221
6570 -221 89 181 -115 -218 92 201 -115 -207 110 192 -112 -195 126 200 -116 -184 126 198 -113 -184 131 189 -119
6593 -119 -189 121 178 -136 -194 126 176 -139 -186 124 156 -154 -196 132 162 -165 -200 121 165 -153 -173 144 160 -166
6617 -166 -175 153 167 -167 -160 157 163 -148 -152 169 170 -153 -148 168 168 -153 -151 163 155 -170 -150 170 140 -182 -156 166 139 -195
$$ packed form
6470b31K19K31k11k56K28K29k18k32K18K36k36k20K25K41k37k25K33K33k32k21
6490b26K40K15k33k29K49K21k43k10K53K02k53j99K45K05k56k01K54J91k67j76
6510b18K57J87k69j95K74J78k75j80K73J79k63j87K75J78k87j64K70J88k83j59
6530b21K78J54k76j59K98J46k81j57K85J56k89j46L08J34l03j39L01J34l02j42
6550b21L09J30l01j34L09J15l19j10K99J23l10j09K94J16l10j02L06J06l12j00
6570b21L10R2k96j03L10J09l16r2L17Q2l04q3L21P4l16o8L10P2l11p1L15N8l08
6593a19p0L10N7l14n8L20N0l15m7L10L2l10m2L28L0l27l5L21M4l18k0L17J6l26
6617a66rL28J4l34PL17Ol11mL21Jl23NL16%l21KL14ql25K0L20l0l22K6L22k7l34
$$ plain form
6645 -195 -154 173 131 -200 -158 161 118 -196 -152 176 123 -194 -136 176 120 -195 -132 181 130 -189 -116 195 130 -176
6669 -176 -109 199 124 -183 -112 189 109 -188 -112 206 108 -196 -112 190 87 -213 -113 185 78 -216 -113 195
6691 195 84 -218 -106 188 75 -215 -96 192 81 -211 -90 206 76 -210 -78 209 88 -206 -71 208
6711 208 75 -201 -63 225 70 -195 -55 204 68 -206 -66 207 60 -209 -54 199 43 -225 -72 200
6731 200 32 -231 -66 201 33 -234 -64 197 29 -220 -45 205 41 -212 -30 208 28 -213 -34 216
6751 216 24 -210 -11 214 26 -210 -15 217 15 -211 -4 213 14 -208 -11 216 -2 -224 -12 202
6771 202 -4 -230 -9 197 -14 -226 -10 200 -19 -238 -10 192 -16 -212 2 199 -20 -215 22 226
6791 226 -7 -202 23 210 -16 -207 33 224 -16 -198 42 218 -28 -195 35 209 -44 -210 29 190
$$ packed form
6645a95M1L27m2l31M2L19m3l14M4L28n3l17N8L12n6l15O3L13n1l19P3L11o5l06
6669a76O7L08p5l07P1L01q0k97P6L18r8l04Q4L02j03l00J00K98j07k94J03L08
6691A95j11l02J12K94j13k90J19K88j11k92J21K96j30k86J32K87j21k94J35K79
6711B08j33k76J38K88j55k65J40K59j36k74J40K73j47k69J55K53j56k68J53K72
6731B00j68k63J65K67j68k67J70K61j68k49J75K50j64k53J82K38j80k41J79K50
6751B16j92k34J99K25j88k36J95K32k02k26K07K17j99k22J97K27k18k22K12K14
6771B02k06k26K21K06k11k12K16K10k19k19K28K02k08j96K14J97k19j95K37K04
6791B26k33j95K25J87k26j91K40J91k40j82K40J76k46j67K30J74k53j66K39J61
$$ plain form
6811 190 -60 -216 37 187 -53 -220 39 175 -63 -206 41 180 -77 -216 40 182 -59 -207 59 192
6831 192 -52 -191 66 193 -73 -189 76 195 -58 -180 70 189 -71 -173 82 197 -75 -191 74 174
6851 174 -86 -184 72 168 -91 -192 80 158 -100 -195 77 156 -107 -188 73 146 -116 -185 81 151 -111 -175 107
6874 107 164 -108 -159 113 174 -101 -151 113 171 -108 -150 111 162 -106 -149 119 145 -106 -151 112 137 -127 -151 110
6898 110 133 -137 -158 109 125 -141 -160 107 111 -147 -145 108 116 -146 -147 122 125 -133 -125 139 139 -132 -122 136 129 -132 -117
6925 -117 151 120 -133 -116 144 119 -134 -105 149 123 -134 -112 143 97 -159 -123 142 104 -164 -121 132 98 -161 -122
6949 -122 133 83 -168 -109 132 85 -154 -104 149 74 -155 -79 167 91 -141 -75 155 105 -146 -78 155 89 -148 -82
6973 -82 158 73 -154 -69 151 68 -159 -70 144 40 -169 -75 147 33 -174 -81 146 44 -176 -63 140 45 -170
$$ packed form
6811A90k50j56K53J50k40j67K59J36k38j43K47J39k57j39K56J42k41j48K66J33
6831A92k44j39K57J27k66j16K65J19k53j22K50J19k60j02K55J15k72j16K65J00
6851A74k60r8K56R6k59j01K72P8k58r5K72P9k63q1K61P3k62o9K66P0k62o4K82
6874A07N7k72n1K72O1k75n0K64N8k79m2K61N1k68m3K68K6k51m5K63K5k64k4K61
6898A10K3k70k1K67J6k66j9K67Mk58KK53Qk62jK69Lk58QK64%k71J0K58pk61J5
6925a17K68l1k53J7K60k5k53K9K54k6k57K2K55m6k56L6K65l8k68M3K53l4k59L9
6949a22K55n0k51N9K41m7k39N0K53p5k29P6K46p6k32O6K30n0k51O8K33o6k37O6
6973h2K40q5k27Q5K20q3k27Q9K14j04k09R4K22j14k07R3K27j02k20J13K03r5k15
$$ plain form
6996 -170 -62 150 38 -160 -56 155 41 -161 -44 154 42 -154 -33 169 31 -149 -22 166 45 -138
7016 -138 -28 147 28 -152 -24 160 25 -158 -32 153 14 -163 -29 147 3 -171 -28 137 -7 -167
7036 -167 -10 149 -2 -164 -3 155 6 -146 -7 150 0 -144 3 159 7 -130 24 158 5 -141
7056 -141 15 161 -6 -152 29 160 -10 -148 15 142 -14 -151 9 134 -37 -154 5 134 -48 -160
7076 -160 2 130 -41 -157 13 140 -43 -146 34 136 -25 -144 38 143 -25 -128 57 140 -30 -127 54
7097 54 148 -38 -126 49 131 -44 -128 50 131 -53 -126 39 125 -68 -143 37 116 -77 -141 48 106 -79 -139 45
7121 45 110 -80 -128 56 115 -77 -130 68 112 -58 -106 76 117 -55 -104 83 118 -79 -89 83 118 -72 -103 87
7145 87 109 -78 -99 76 105 -75 -97 84 94 -98 -114 73 80 -103 -113 70 80 -100 -108 78 75 -99 -105 81 78 -100
$$ packed form
6996a70J08K12j12j98J04K11j14k02J17J98j12j96J21K02j38j80J27J88j21j83
7016a38J10J75j19j80J28J84j35j83J26J85j39j77J34J76j44j74J43J65j44j60
7036a67J57J59j51j62J61J58j49j52J39J57j50j44J47J56j52j37J54J34j53j46
7056a41J56J46j67j46J81J31j70j38J63J27j56j37J60J25j71j17J59J29j82j12
7076a60J62J28j71j16J70J27j83j03J80J02j61j19J82J05j68j03J85Q3j70r7J81
7097E4R4j86q8J75Q2j75q4J78Q1j84p3J65Q6j93p5J80P9j93o4J89N8j85o0J84
7121D5O5j90m8J84N9j92n3J98M4j70m8J82M1j72m9J87L5j97j0J72L5j90l1J90
7145H7K2j87k1J75K9j80k2J81J0j92j6J87Pj83j0J83J0j80qJ86lj74oJ86lj78
$$ plain form
7171 -100 -84 94 84 -86 -80 92 92 -79 -58 96 86 -79 -69 102 85 -99 -70 104 74 -100 -68 98 66 -97 -72
7196 -72 86 57 -113 -84 86 43 -108 -74 101 50 -114 -73 93 56 -113 -53 94 42 -107 -40 111 52 -101 -38
7220 -38 112 58 -100 -31 125 58 -100 -29 120 49 -110 -28 116 42 -111 -36 106 25 -113 -35 103 21 -123 -36
7244 -36 89 -2 -123 -38 103 6 -121 -20 108 15 -109 -23 99 16 -108 -17 112 2 -98 5 113 15 -107
7267 -107 4 123 19 -100 3 111 -1 -104 -7 104 -9 -112 -5 91 -21 -119 -2 102 -27 -127 -2
7288 -2 83 -32 -117 13 103 -25 -111 9 102 -28 -103 11 107 -20 -97 34 105 -29 -93 39 116 -18 -92 31 106
7313 106 -36 -95 27 96 -39 -98 32 94 -43 -116 24 91 -46 -105 32 89 -55 -103 35 75 -66 -97 41 86
7337 86 -53 -90 53 89 -43 -101 59 100 -48 -82 65 95 -50 -74 77 100 -57 -75 74 95 -58 -70 70 76 -69
$$ packed form
7171a00J6J78j0j70OJ72%j71K1J54j0j65J0J71j7j84K9J74l0j74L2J66l2j63K5
7196g2J58k9j70K9J70m3j51L4J75n1j64M1J66l7j69O0J47n2j49O7J51n9j53O3
7220c8J50n4j58O9J56o7j58P1J49p1j59Q2J44p4j53P5J42q1j38P8J38q2j44Q7
7244c6J25r1j21Q5J41r7j27J01J28r3j24Q6J22q3j24R1J29j10j00J03J08r8j22
7267a07J11J19j04j19J03J08j12j03R7J11j13j03J07R6j12r8J17J04j29j00J25
7288bQ5j15q5J30R0j28q6J20R3j30p5J14R6j27p7J31P1j34o4J32P7j34p4J23P5
7313A06j42n9J22O9j35n9J30O2j37p3J40O7j37n9J37N7j44m8J38M0j41l1J38M5
7337H6j39l7J43L6j32n8J60M1j48l4J47L0j45k4J51K3j57j8J49K1j53j2J40Oj45
$$ plain form
7362 -69 -87 65 83 -83 -82 58 79 -90 -87 62 71 -77 -86 63 62 -83 -91 65 70 -87 -75 81 68 -79 -70 81 65 -62
7390 -62 -56 105 71 -74 -47 95 78 -77 -56 98 67 -89 -55 93 53 -94 -55 90 38 -103 -63 77 26 -112 -61
7415 -61 80 41 -113 -50 85 34 -112 -45 92 38 -102 -37 104 49 -84 -30 116 45 -94 -27 115 43 -89 -12
7439 -12 121 40 -91 -10 110 25 -111 -22 105 16 -117 -30 109 11 -120 -28 101 -7 -123 -27 101 3 -114 -10
7463 -10 103 -1 -126 -6 116 -1 -103 -4 123 17 -102 3 119 6 -107 12 130 18 -100 20 118
7484 118 5 -108 10 105 -6 -112 -1 110 -23 -116 4 97 -28 -129 3 83 -38 -131 -9 101 -36 -128
7506 -128 9 109 -29 -106 26 110 -24 -111 40 106 -27 -100 40 115 -20 -101 52 122 -34 -96 45 112 -40
7529 -40 -102 38 96 -47 -111 31 106 -57 -113 29 86 -58 -116 32 90 -62 -123 32 103 -62 -116 53 96 -55
$$ packed form
7362f9j8J52J8j66JJ40K1j69LJ49Rj48rJ49jj45qJ56Nj57J2J56j3j47RJ51j6j27
7390f2OJ61l4j45K7J42j7j55K1J54l1j56L4J48m0j47L9J45n2j41M0J40n1j38N1
7415f1J41l9j54O3J35n1j46O7J37n4j40O5J41n5j33N4J46p1j39O7J42p2j32P7
7439a2J33q1j31Q1J20q5j36Q9J27q9j33Q7J39r8j31R2J29j08j16R6J28r8j17J04
7463a0J13j04j25J20J22j17j02R9J27j06j19J05J16j13j13J19J18j12j18J20R8
7484A18j13j13J18R5j11j06J11J11j33r3J20R3j25j01J32Q0j21r3J22J10j37r2
7506a28J37J00j38p7J32Q4j34q7J51O6j33p3J40P5j35q1J53P0j56o2J41O7j52
7529d0o2J40N8j43o4J42P5j63n6J42N7j44n8J48N8j52o1J55P1j65n4J69M3j51
$$ plain form
7553 -55 -100 61 100 -57 -92 77 99 -59 -90 61 96 -61 -94 71 94 -60 -101 87 95 -65 -96 69 84 -85 -106
7578 -106 56 79 -87 -99 58 79 -101 -101 76 72 -92 -97 76 71 -94 -90 83 90 -91 -92 102 101 -90 -81 104 99 -91 -72
7606 -72 96 97 -86 -73 105 85 -99 -80 100 72 -110 -83 92 70 -113 -86 92 64 -117 -72 81 56 -122 -84 98
7631 98 62 -117 -72 105 55 -114 -59 108 70 -103 -57 111 65 -100 -47 135 71 -108 -47 128 59 -118 -43 129
7655 129 57 -113 -41 123 55 -130 -55 111 36 -135 -58 114 36 -136 -53 109 26 -139 -46 115 19 -134 -42 128
7679 128 36 -129 -38 127 33 -128 -31 154 35 -111 -23 140 47 -132 -11 129 30 -138 -18 143 28 -135
7701 -135 -20 124 3 -150 -25 127 -4 -152 -22 126 -3 -145 -23 119 10 -141 -16 130 -7 -156
7721 -156 -18 133 4 -136 3 144 0 -135 4 146 7 -146 11 160 -6 -140 6 136 -7 -146
$$ packed form
7553e5m5J61L9j57l5J69K2j58l1J51L5j57l3J65K3j54m1J88Qj60l1J65J5j69k1
7578a06J62K3j66j2J57K1j80%J77mj64nJ73nj65MJ73Pj81jJ94jj91RJ85nj90J9
7606g2J68Jj83J3J78k0j84J9J80k8j82K7J75k2j83K7J78k8j81M5J53k5j78L8J82
7631I8l6j79M5J77n0j69N5J67l8j73M6J68m6j65N3J82o4j79O1J75o9j77P5J72
7655A29p2j70P2J64o8j85P5J66p5j71P7J72p8j72Q3J62q3j65R3J61r6j53R2J70
7679A28r2j65R1J65r4j61R7J85j19j46Q8J63r3j79J21J40r9j68J20J61j15j63
7701a35J15J44j21j53J25J52j31j48J30J48j29j42J22J42j09j51J25J46j37j49
7721a56J38J51j29j40J39J41j44j35J39J42j39j53J57J49j66j34J46J30j43j39
$$ plain form
7741 -146 2 132 -16 -137 1 138 -28 -155 6 127 -37 -166 -1 121 -39 -158 14 125 -31 -152
7761 -152 9 124 -29 -149 23 137 -22 -139 34 142 -28 -138 34 152 -22 -138 40 147 -30 -127
7781 -127 41 140 -47 -142 49 138 -63 -155 36 131 -50 -155 27 126 -69 -147 25 114 -74 -149 43 124 -64
7804 -64 -140 42 129 -70 -141 67 139 -56 -132 73 142 -47 -121 75 138 -58 -124 77 134 -66 -132 63 122 -83
7828 -83 -131 81 115 -82 -140 59 105 -94 -134 66 111 -107 -145 67 118 -101 -123 79 123 -102 -130 84 117 -87
7852 -87 -120 97 121 -88 -96 110 120 -86 -107 102 126 -87 -107 103 108 -92 -110 104 113 -98 -117 94 100 -114 -117 94
7878 94 88 -121 -126 74 81 -124 -114 89 90 -126 -103 103 93 -128 -100 112 96 -106 -96 128 103 -116 -97 123 101 -121
7904 -121 -87 122 91 -123 -86 125 83 -128 -88 119 70 -136 -90 116 73 -140 -89 114 56 -146 -91 106 58 -153
$$ packed form
7741a46J48J30j48j21J38J37j66j27J61J21j64j29J65J22j60j19J72J11j56j21
7761a52J61J15j53j20J72J14j59j17J73J08j70j10J72J18j74j16J78J07j77r7
7781a27J68R9j87r5J91Q9k01r2J91R5j81j05J82R9j95p8J72Q9j88p5J92Q1j88
7804f4p6J82Q7j99p1K08P2j95p6K05O9j89p4J96O3j96o6K01N7k00o6J95N9k05
7828h3m8K12L4j97n8J99M6j99m0K00M5k18l8K12N1k19k2K02M4k25k8K14L3k04
7852h7l3K17K4k09qK06J0k06k1K09K4k13k0K10Nk00j8K14Rk11j9K11Ok14lK11
7878I4ok09nK00Pk05J0K03Jk16K3K06j0k21K8K12j6k02J0K24k5k19J9K20k2k22
7904a21L4K09l1k14L7K11m2k11M0K07m9k06M6K06m3k13N1K03n8k02N5J97m8k11
$$ plain form
7928 -153 -91 113 63 -141 -86 126 73 -145 -80 129 56 -139 -66 148 71 -129 -62 148 71 -135 -50 153 77 -134
7952 -134 -64 134 61 -146 -65 135 47 -149 -60 120 41 -170 -69 123 34 -161 -68 135 37 -156 -59 136 28
7975 28 -137 -54 137 39 -153 -49 154 41 -151 -33 149 43 -148 -24 162 42 -142 -23 156 34 -150
7996 -150 -35 158 20 -155 -40 140 14 -160 -42 128 9 -165 -39 142 0 -171 -31 141 -3 -163
8016 -163 -35 142 5 -164 -8 153 15 -152 5 160 1 -151 0 164 11 -144 13 157 15 -148
8036 -148 4 144 -7 -149 8 153 -12 -160 -4 127 -15 -163 -10 140 -42 -170 -6 132 -27 -167
8056 -167 -9 129 -32 -158 0 137 -23 -146 20 141 -29 -146 33 155 -23 -132 30 146 -20 -137
8076 -137 40 148 -23 -140 36 134 -32 -145 30 142 -53 -154 35 126 -72 -163 29 132 -61 -154 33
$$ packed form
7928a53O2K04n0k04N5K12n3k18O5K09p3j95P3K14p7k00O7K10p7k06Q5K03p6k11
7952a34P0J98p3k07Q1K00q8j96Q9J80p9k11J01J92q9j95R3K03r8j93R7J95j08
7975B8j65Q3J91r8j92J04K03j13j92J18J82j06j91J24J86j20j84J19J79j22j84
7996a50J15J93j38j75J15J80j26j74J18J70j19j74J26J81j42j71J40J72j44j60
8016a63J28J77j37j69J56J61j38j67J57J55j59j52J51J64j53j55J57J44j42j63
8036a48J52J40j51j42J57J45j65j48J56J31j42j48J53J50j82j28J64J38j59j40
8056a67J58J38j61j26J58J37j60j23J66J21j70j17J79J22j78j09J62J16j66j17
8076a37J77J08j71j17J76R8j66j13J75J12j95j01J89R1j98r1J92J03j93r3J87
$$ plain form
8097 33 124 -58 -156 33 131 -58 -143 60 141 -52 -127 57 145 -43 -133 63 148 -48 -127 72 146 -51 -118 74
8121 74 136 -50 -134 70 129 -66 -143 54 123 -77 -128 59 118 -70 -143 49 119 -83 -137 56 117 -89 -133 69
8145 69 116 -83 -124 74 120 -74 -112 85 132 -64 -116 90 118 -68 -105 93 137 -87 -103 90 126 -82 -114 81
8169 81 114 -93 -120 78 107 -99 -121 87 105 -102 -129 76 92 -106 -118 94 97 -98 -110 89 96 -98
$$ packed form
8097C3R1j82r8J89R8j89q5K03Q1j93p5J84Q8j88r0J96Q5j96p9J99P4j97o7J92
8121G4O2j86q4K04N9j95p7J97O9k00n1J87N9j88p3J92P0k02n4J93O1k06m4K02
8145F9M7j99m1J98M6j94l8J97M7j96n2K06K8j86l7J98M4k24j6J93L6k08l2J95
8169H1L3k07k7J98K9k06k2K08J8k07k7K05J6j98j2K12Lj95j2J99Pj94
8191i8
$$ Imaginary data points
##PAGE= N=2
##DATA TABLE= (X++(I..I)), XYDATA
$$ plain form
0 0 0 0 0 0 0 0 0 0 0 0 0 -8 8 -8 8 -16 16 -16 24 -32 32 -40 48 -56 65 -80 89 -105 120 -137 160 -184 208
33 208 -233 265 -297 335 -373 417 -466 519 -576 641 -708 782 -864 955 -1053 1159 -1278 1408
51 1408 -1551 1710 -1887 2085 -2309 2561 -2853 3191 -3592 4071 -4659 5398 -6363 7677 -9580
66 -9580 12603 -18125 31447 -130015 -17194 317240 -29631 -282054 9029 292581 -22595
77 -22595 -276207 13378 278712 -19596 -268186 13014 270774 -18996 -263683 17351
87 17351 263685 -23255 -257218 24424 254117 -29980 -245515 29805 240708 -31628
97 -31628 -234224 30046 231286 -30605 -227759 29932 226608 -31728 -224833 33641
107 33641 223513 -37296 -220340 40299 216458 -43190 -211583 44899 206618 -45895
$$ packed form
0@%%%%%%%%%%%qJ6j6J6k4L2l2M0n6O4p2Q8j04J21j45J69j94K25k57K97l44L92
33B08m41M98n62O32p08P90q83R85j095J217j349J490j646J819k008K212k437K686
51A408k959L261l597L972m394M870n414O044o783P663q730J0057j1761J4040j7257
66i580K2183l0728M9572j61462J12821L34434l46871k52423K91083K83552l15176
77b2595k53612K89585K65334k98308k48590K81200K57760k89770k44687K81034
87A7351K46334k86940k33963K81642K29693k84097k15535K75320K10903k72336
97c1628k02596K64270K01240k61891j97154K57691J96676k58336j93105K58474
107C3641J89872k60809j83044K60639J76159k59648j68393K56482J61719k52513
$$ plain form
117 -45895 -201518 45101 197852 -44167 -195592 44133 193734 -45209 -191807 47183
127 47183 189205 -49894 -185396 52254 180594 -53930 -175522 54854 170332 -54893
137 -54893 -165570 53808 162199 -52890 -160062 52898 158187 -53474 -156792 55007
147 55007 155277 -57653 -152309 59874 148487 -61058 -144916 61891 141512 -62288 -138095
158 -138095 61615 135741 -60752 -134680 61041 133669 -61971 -132486 63349 131139 -65532
169 -65532 -128647 67692 124917 -68836 -120875 68995 117194 -68511 -114049 67654 111626
180 111626 -66826 -109918 66717 108478 -67238 -106922 68335 105070 -69866 -102316 71225
191 71225 98982 -71963 -95498 72125 92240 -71422 -89742 70454 88294 -69926 -87326
$$ packed form
117d5895j55623K46619J52751k42019j51425K39725J49601k38943j46598K38990
127D7183J42022k39099j35502K37650J28340k34524j21592K30376J15478k25225
137e4893j10677K19378J08391k15089j07172K12960J05289k11661j03318K11799
147E5007J00270k12930r4656K12183Q8613k09545q3858K06807P9621k03800p5807
158a38095J99710P4126j96493p3928J95721P2628j95640p0515J95835O7790j96671
169f5532o3115J96339N7225j93753n2039J89870M8199j85705m5538J81703M3972
180A11626j78452m3092J76635M1761j75716l9684J75257L6735j74936l2450J73541
191G1225K7757j70945k3535J67623K0115j63662j8320J60196J7840j58220j7400
$$ plain form
202 -87326 70126 86532 -70867 -85615 72146 84358 -73700 -82326 75005 79793 -75744
213 -75744 -77041 75933 74356 -75229 -72335 74268 71195 -73673 -70350 73536 69742 -73973
225 -73973 -68925 75058 67326 -76042 -64899 76397 62422 -76319 -59930 76005 57365
236 57365 -74835 -55458 73397 54609 -72618 -53886 72395 53229 -72517 -52642 73382
247 73382 51490 -74416 -49402 74851 47162 -74615 -45249 74254 43479 -73546 -42056
258 -42056 72568 41431 -72002 -41111 72044 40731 -72440 -40143 73233 39070 -74023
269 -74023 -37332 74458 35227 -74170 -33158 73348 31576 -72163 -30521 71077 29962
280 29962 -70362 -29499 70038 29067 -70082 -28415 70511 27247 -70815 -25633 70820 23822
$$ packed form
202h7326J57452J6406j57399j4748J57761J2212j58058q626J57331M788j55537
213g5744j297J52974j577j49585K894J46603l073j44868L323J43886l794j43715
225g3973N048J43983p732j43368J1143J41296j3975j38741J6389J35935j8640
236E7365j32200J9377J28855j8788j27227J8732J26281j9166j25746J9875J26024
247G3382k1892j25906K5014J24253k7689j21777K9366J19503l0775j17025L1490
258d2056J14624l1137j13433L0891J13155l1313j13171L2297J13376l4163j13093
269g4023L6691J11790l9231j09397M1012J06506m1772j03739M1642J01598m1115
280B9962j00324M0863R9537m0971r9149M1667R8926m3264r8062M5182R6453m6998
$$ plain form
292 23822 -70420 -21900 69417 20503 -68095 -19796 67081 19518 -66533 -19254 66385 18996
304 18996 -66602 -18464 67171 17354 -67449 -15925 67414 14489 -67111 -12869 66292 11658
316 11658 -65051 -11117 64109 10973 -63570 -10828 63386 10640 -63527 -10148 63950 9024
328 9024 -63993 -7592 63534 6345 -62942 -5057 62014 3969 -60685 -3512 59582 3467
340 3467 -58950 -3430 58705 3273 -58802 -2814 59101 1830 -59159 -483 58696 -720
352 -720 -57955 1756 57045 -2525 -55926 2861 55053 -2892 -54515 2892 54355 -3021
364 -3021 -54482 3522 54685 -4407 -54678 5599 54269 -6766 -53475 7730 52417 -8275
376 -8275 -51351 8426 50546 -8421 -50029 8380 49824 -8470 -49939 8976 49963 -9783
$$ packed form
292B3822r4242M8520R1317m8914q8598M8299Q6877m7563q6051M7279Q5639m7389
304A8996q5598M8138Q5635m9817q4803N1524Q3339n2925q1600N4242P9161n4634
316A1658p6709N3934P5226n3136p4543N2742P4214n2746p4167N3379P4098n4926
328I024p3017N6401P1126n7189o9287N7885O7071n8045o4654N7173O3094n6115
340C467o2417N5520O2135n5432o2075N5988O1915n7271o0989N8676N9179n9416
352g20n7235N9711N5289n9570n3401N8787N2192n7945n1623N7407N1463n7376
364c021n1461N8004N1163n9092n0271O0277M8670o1035m6709O1205M4687o0692
376h275m3076N9777M2120n8967m1608N8409M1444n8294m1469N8915M0987n9746
$$ plain form
388 -9783 -49766 10720 49369 -11778 -48579 12700 47411 -13072 -46276 13002 45592 -12903
400 -12903 -45172 12872 44951 -12883 -45057 13374 45054 -14173 -44680 14938 44157 -15737
412 -15737 -43399 16478 42275 -16758 -41171 16566 40512 -16393 -40150 16305 39936 -16282
424 -16282 -40028 16646 40068 -17445 -39693 18169 39066 -18779 -38307 19275 37348 -19486
436 -19486 -36436 19329 35780 -19103 -35436 18982 35285 -18983 -35323 19293 35368 -19997
448 -19997 -35022 20747 34331 -21293 -33428 21571 32468 -21565 -31666 21395 31004 -21100
460 -21100 -30622 20863 30495 -20931 -30408 21223 30222 -21718 -29881 22310 29250 -22916 -28268
473 -28268 23126 27236 -22943 -26591 22771 26090 -22593 -25685 22333 25642 -22394 -25692 22873
$$ packed form
388i783l9983O0486L8649o1147l6801O1279L4711o0483l3204N9278L2590n8495
400a2903l2269N8044L2079n7834l2174N8431L1680n9227l0507N9618K9219n9894
412a5737k7662N9877K5797n9033k4413N7737K3946n6905k3757N6455K3631n6218
424a6282k3746N6674K3422n7513k2248N7862K0897n7845j9528N7582J8073n6834
436a9486j6950N5765J6451n4883j6333N4418J6303n4268j6340N4616J6075n5365
448a9997j5025N5769J3584n5624j2135N4999J0897n4033j0101N3061R609n2104
460b1100r522N1485R632n1426r477N1631Q999n1940q163N2191O940n2166n352
473b8268N1394M110n0179l648M9362L319m8683l092M8018L309m8036l298M8565
$$ plain form
486 22873 25422 -23378 -24967 23807 24447 -24303 -23654 24648 22624 -24465 -21902 24130 21534 -23940
500 -23940 -21231 23769 21115 -23785 -21118 24177 20844 -24638 -20282 24948 19631 -25200 -18881
513 -18881 25335 17959 -25148 -17231 24730 16829 -24430 -16613 24242 16523 -24279 -16474 24571
526 24571 16234 -24996 -15770 25342 15109 -25514 -14374 25508 13671 -25327 -13108 25023
538 25023 12738 -24719 -12609 24541 12609 -24657 -12549 24940 12285 -25261 -11910 25603
550 25603 11247 -25787 -10459 25566 9853 -25247 -9470 24960 9102 -24644 -8944 24350
562 24350 8981 -24392 -8942 24661 8593 -24825 -8197 25004 7653 -25137 -6893 24916
574 24916 6245 -24484 -5933 24123 5747 -23872 -5632 23685 5607 -23703 -5557 23901
$$ packed form
486B2873K549m8800j589M8774O40m8750O49M8302k024m7089K563M6032k596m5474
500b3940K709M5000k654m4900K667M5295l333m5482M356M5230n317m4831O319
513a8881M4216p376m3107P917M1961p901m1259P817M0855p719m0802P805M1045
526B4571q337m1230R226M1112j0233m0623J1140L9882j1837l8998J2219L8131
538B5023j2285l7457J2110L7150j1932l7266J2108L7489j2655l7546J3351L7513
550B5603j4356l7034J5328L6025j5713l5100J5777L4430j5858l3746J5700L3294
562B4350j5369l3373J5450L3603j6068l3418J6628L3201j7351l2790J8244L1809
574B4916j8671l0729J8551L0056j8376k9619J8240K9317j8078k9310J8146K9458
$$ plain form
586 23901 5270 -24131 -4870 24264 4306 -24287 -3675 24057 3117 -23709 -2783 23290
598 23290 2583 -22936 -2612 22781 2651 -22899 -2519 23031 2205 -23115 -1864 23160
610 23160 1361 -23105 -756 22777 288 -22356 -62 21993 -102 -21634 119 21385
622 21385 -51 -21427 103 21582 -381 -21686 819 21618 -1307 -21425 1747 21107
634 21107 -2110 -20730 2355 20280 -2456 -19910 2370 19758 -2366 -19770 2490 19773
646 19773 -2671 -19872 3012 19897 -3583 -19630 4061 19192 -4288 -18841 4458 18506
658 18506 -4571 -18147 4509 18008 -4440 -18073 4633 18080 -4857 -18074 5158 18077
670 18077 -5634 -17844 6103 17386 -6337 -16956 6422 16590 -6412 -16292 6348 16151
$$ packed form
586B3901j8631k9401J9261K9134j9958k8593K0612K7732k0940k6826K0926K6073
598B3290k0707k5519K0324K5393k0130k5550K0380K5550k0826k5320K1251K5024
610B3160k1799k4466K2349K3533k2489k2644K2294K2055k2095k1532K1753K1266
622B1385k1436k1376K1530K1479k1963k1305K2505K0799k2925k0118K3172J9360
634B1107k3217j8620K3085J7925k2736j7454K2280J7388k2124j7404K2260J7283
646A9773k2444j7201K2884J6885k3480j6047K3691J5131k3480j4553K3299J4048
658A8506k3077j3576K2656J3499k2448j3633K2706J3447k2937j3217K3232J2919
670A8077k3711j2210K3947J1283k3723j0619K3378J0168k3002r880K2640R803
$$ plain form
682 16151 -6328 -16145 6472 16083 -6659 -16019 6906 15931 -7328 -15616 7676 15180 -7855
695 -7855 -14744 7927 14342 -7870 -14044 7773 13922 -7737 -13966 7884 13965 -8153 -13880 8460
709 8460 13744 -8800 -13479 9109 13165 -9326 -12786 9433 12410 -9362 -12200 9262 12139 -9297
723 -9297 -12124 9379 12107 -9591 -12074 9926 11850 -10227 -11451 10359 11104 -10390 -10789 10429
737 10429 10373 -10275 -10082 10071 10031 -10015 -9968 10066 9914 -10133 -9830 10379 9645 -10655 -9260 10792
753 10792 8892 -10783 -8590 10772 8342 -10694 -8188 10608 8150 -10633 -8131 10712 8114
766 8114 -10885 -8099 11183 7906 -11476 -7575 11619 7230 -11635 -6912 11573 6629 -11420
779 -11420 -6484 11293 6466 -11301 -6394 11326 6282 -11358 -6204 11482 5984 -11590 -5638
$$ packed form
682A6151k2479r817K2617R611k2742r360K2925R025k3259q288K3292P504k3035
695g855o889K2671O415k2212o174K1817O149k1659o229K1850O081k2118n727K2340
709H460N284k2544m679K2588M056k2491l460K2219K977k1772k838K1462K877k1436
723i297k827K1503K728k1698k483K2000J924k2077j224K1810P45k1494l99K1218
737A0429n6k0648J93K0153m0k0046M7K0034j52k0047L03K0209p34k0300J395K0052
753A0792j900j9675K193J9362k430j9036K506J8796k458j8783K502J8843k598
766H114j8999K786J9282l277j9382L901J9194m389j8865M723J8485m944j8049
779a1420M936J7777m827j7767M907J7720n044j7640N154J7686n498j7574N952
$$ plain form
792 -5638 11614 5263 -11509 -4919 11336 4672 -11109 -4537 10935 4513 -10891 -4482 10943
805 10943 4425 -11087 -4288 11285 4036 -11387 -3795 11461 3527 -11543 -3214 11453 2970
818 2970 -11271 -2897 11227 2891 -11275 -2853 11343 2812 -11478 -2702 11700 2396 -11713
831 -11713 -2069 11614 1860 -11517 -1623 11365 1375 -11112 -1293 10886 1286 -10779 -1268
844 -1268 10719 1221 -10750 -1117 10824 874 -10835 -578 10703 346 -10583 -138 10419
857 10419 -8 -10251 46 10189 -93 -10193 128 10238 -177 -10346 298 10529
869 10529 -538 -10617 844 10585 -1114 -10479 1315 10323 -1427 -10165 1448 10056 -1449
882 -1449 -10024 1465 10023 -1543 -10025 1684 9971 -1841 -9918 2020 9809 -2261 -9601 2443
$$ packed form
792e638J7252o351j6772O590J6255o664j5781O572J5472o422j5404O409J5425
805A0943o518j5512O799J5573p249j5423P592J5256p934j5070Q329J4667q483
818B970j4241Q374J4124q336j4166Q422J4196q531j4290Q776J4402r304j4109
831a1713R644J3683r754j3377R894J2988r990j2487R819J2179r600j2065R511
844a268J1987r498j1971R633J1941r950j1709J0257J1281j0357j0929J0445J0557
857A0419j0427j0243J0297J0143j0282j0100J0321J0110j0415j0169J0644J0231
869A0529j1067j0079J1461R741j1699r365J1794R008j1750q738J1613Q608j1505
882a449q575J1489Q558j1566q482J1709Q287j1812q077J1938P789j2070p340J2044
$$ plain form
896 2443 9258 -2466 -9054 2420 8948 -2446 -8853 2460 8824 -2478 -8908 2661 8937 -2894
910 -2894 -8866 3062 8812 -3229 -8755 3467 8584 -3560 -8386 3554 8353 -3555 -8375 3623
924 3623 8385 -3669 -8465 3832 8484 -4060 -8391 4248 8239 -4372 -8067 4460 7885 -4496
938 -4496 -7672 4452 7515 -4386 -7421 4325 7392 -4343 -7395 4440 7327 -4597 -7203 4732
952 4732 7041 -4840 -6843 4899 6649 -4891 -6521 4895 6456 -4896 -6400 4917 6398 -4968
966 -4968 -6450 5098 6457 -5301 -6401 5487 6268 -5655 -6075 5707 5876 -5690 -5777 5678 5702
981 5702 -5686 -5642 5665 5619 -5709 -5591 5809 5504 -5889 -5389 5987 5253 -6069 -5021 6100
996 6100 4778 -5986 -4632 5897 4581 -5866 -4508 5854 4485 -5889 -4481 6020 4395 -6138
$$ packed form
896B443O815j1724o588J1474O528j1394o407J1313O364j1302o430J1569O276j1831
910b894n972J1928N750j2041n526J2222N117j2144m826J1940M799j1908m820J1998
924C623M762j2054m796J2297M652j2544m331J2639L991j2611l695J2527L425j2381
938d496l176J2124L063j1901l035J1746L067j1735l052J1835K887j1924k606J1935
952D732K309j1881k003J1742J750j1540j630J1416J561j1352j504J1317J481j1366
966d968j482J1548J359j1758j100J1888P81j1923m20J1782J69j1566q7J1455K4
981E702j1388M4J1307m6j1328J18J1400l05j1393N00J1376p34j1322J048J1121
996F100j322j0764J354J0529j316j0447J358J0362j369j0374J408J0501j625j0533
$$ plain form
1010 -6138 -4255 6212 4140 -6299 -3985 6376 3792 -6340 -3663 6298 3599 -6276 -3566 6277
1024 6277 3585 -6354 -3570 6489 3458 -6588 -3316 6651 3172 -6694 -2999 6690 2825 -6605
1038 -6605 -2707 6542 2645 -6490 -2588 6444 2577 -6436 -2575 6545 2479 -6633 -2326 6677 2154
1053 2154 -6664 -2005 6633 1869 -6581 -1770 6518 1713 -6481 -1686 6485 1678 -6517 -1626 6582
1068 6582 1557 -6646 -1451 6731 1290 -6743 -1076 6646 985 -6560 -921 6526 853 -6470 -805
1083 -805 6437 828 -6471 -769 6547 648 -6546 -553 6587 433 -6628 -222 6547 104 -6412
1098 -6412 -64 6366 32 -6339 16 6326 -28 -6361 72 6429 -204 -6450 323 6423 -441
1113 -441 -6416 582 6367 -691 -6247 772 6168 -785 -6088 789 6070 -788 -6069 842 6110
$$ packed form
1010f138J883J0467k072j0439K314J0361k584j0132K677R961k699r875K710R843
1024F277k692r939K784J0059l031j0046L272R967l479r866L695R689l865r430
1038f605L898R249l897r135L902R032l867r013L861R120m066r112M307R003m523
1053B154q818M659Q638m764q450M811Q288m805q194M795Q171m807q195M891Q208
1068F582n025q203N195Q182n441q033N667P722n661p545N639P447n673p323N665
1083h05P242n609p299N702P316n899p194N993P140o154p061O406O769o443o516
1098f412O348O430o334o371O355O310o354o333O433O357o633o246O773O100o864
1113d41n975O998N785p058n556P019N396o953n303O877N281o858n281O911N268
$$ plain form
1128 6110 -943 -6097 1071 6057 -1186 -5990 1291 5905 -1375 -5844 1432 5763 -1491 -5682 1481
1143 1481 5686 -1503 -5738 1578 5770 -1665 -5791 1802 5800 -1961 -5731 2064 5611 -2139 -5559
1158 -5559 2183 5524 -2252 -5442 2257 5413 -2258 -5412 2328 5422 -2396 -5399 2495 5365 -2621
1173 -2621 -5258 2723 5122 -2740 -4996 2739 4911 -2739 -4842 2740 4807 -2757 -4805 2824 4782
1188 4782 -2900 -4754 2992 4763 -3124 -4686 3238 4594 -3296 -4506 3335 4451 -3353 -4418 3376
1203 3376 4433 -3411 -4475 3534 4454 -3632 -4407 3695 4375 -3791 -4293 3881 4198 -3910 -4095 3905
1219 3905 3988 -3867 -3924 3841 3912 -3815 -3908 3854 3864 -3918 -3803 3953 3707 -4025 -3616 4026 3524 -4057
1237 -4057 -3459 4075 3360 -4056 -3325 4048 3333 -4098 -3337 4167 3331 -4261 -3319 4361 3258 -4492 -3147
$$ packed form
1128F110p053n154P168M986p243m804P281M614p280m469P276M331p254m191P163
1143A481M205p189m235P316M192p435m126P593L998p761l770P795L547p750l420
1158e559P742L341p776l190P699L156p671l154P740L094p818l003P894K870p986
1173b621k637P981K399p862k256P735K172p650k103P582K067p564k048P629J958
1188D782p682j854P746J771p887j562P924J356p890j210P841J116p804j065P794
1203C376J057p844j064Q009R20q086p75Q102O80q166n02Q174L17q108j85Q000
1219C905Q3p855n7P765P1p727r3P762J0p782J15P756k46p732M09P642n02p581
1237d057N98P534p15p416P31P373p15p431P61P504q36p592R42P680j103p750J345
$$ plain form
1254 -3147 4528 3061 -4539 -3017 4592 2942 -4583 -2895 4569 2908 -4579 -2888 4624 2833 -4636
1269 -4636 -2812 4680 2748 -4742 -2608 4711 2484 -4636 -2437 4608 2367 -4566 -2315 4493 2317
1284 2317 -4500 -2288 4544 2232 -4548 -2192 4597 2139 -4668 -2039 4715 1922 -4689 -1849 4692
1299 4692 1812 -4703 -1772 4719 1759 -4776 -1727 4840 1697 -4893 -1626 4964 1522 -4973 -1447
1314 -1447 4970 1364 -4986 -1262 4917 1191 -4847 -1195 4800 1186 -4805 -1149 4771 1116 -4774
1329 -4774 -1070 4792 962 -4763 -882 4702 840 -4683 -760 4641 684 -4580 -651 4555 651
1344 651 -4591 -616 4626 559 -4675 -517 4737 394 -4755 -297 4710 209 -4731 -152 4709
1359 4709 81 -4691 -51 4674 25 -4687 18 4685 -72 -4695 103 4715 -208 -4711 296
$$ packed form
1254c147P675j467p600J522P609j650p525J688P464j661p487J691P512j791p469
1269d636J824P492j932p490K134P319k227p120K199P045k241o933K251O808k176
1284B317o817K212O832k312o780K356O789k458o807K629O754k793o611K840O541
1299D692k880o515K931O491k960o535L049O567l143o590L267O590l442o495L526
1314a447O417l606o350L724O179l726o038L652N995l614n991L656N920l655n890
1329d774L704N862l830n725L881N584l862n523L923N401l957n264L929N206l904
1344F51n242L975N242m067n234M158N254m343n149M458N007m501m940M579M861
1359D709m628m772M640M725m649m712M705M667m757m623M798M612m923m503N007
$$ plain form
1374 296 4634 -354 -4554 396 4481 -414 -4435 431 4395 -455 -4384 463 4359 -520 -4368
1389 -4368 562 4344 -638 -4338 705 4311 -798 -4286 883 4191 -899 -4181 890 4199 -956
1404 -956 -4194 989 4189 -1043 -4228 1118 4221 -1212 -4196 1262 4165 -1332 -4147 1403 4059
1419 4059 -1452 -4004 1418 3989 -1443 -3990 1477 3970 -1496 -3966 1564 3947 -1635 -3886 1666
1434 1666 3831 -1718 -3781 1745 3723 -1766 -3654 1762 3626 -1792 -3611 1797 3599 -1825 -3627
1449 -3627 1894 3595 -1993 -3538 2029 3470 -2058 -3435 2100 3385 -2139 -3355 2141 3315 -2172
1464 -2172 -3319 2193 3289 -2240 -3280 2300 3283 -2376 -3234 2456 3177 -2487 -3102 2493 3065 -2490
1480 -2490 -3041 2522 3004 -2532 -2967 2550 2968 -2584 -2951 2626 2903 -2674 -2856 2689 2810 -2750 -2721
$$ packed form
1374B96M338m988m200M950M085m895m021M866L964m850l929M847L896m879l848
1389d368M930L782m982l700N043L606n109l488N169L308n090l282N071L309n155
1404i56l238N183L200n232l185N346L103n433k984N458K903n497k815N550K656
1419D059n511k552N422K571n432k547N467K493n466k470N530K383n582k251N552
1434A666K165n549k063N526J978n489j888N416J864n418j819N408J802n424j802
1449c627N521J701n588j545N567J441n528j377N535J285n524j216N496J174n487
1464b172j147N512J096n529j040N580R83n659q58N690P21n664o15N595N72n555
1480b490n51N563M82n536m35N517M18n552l67N577K77n577j82N545J21n560K9
$$ plain form
1497 -2721 2749 2655 -2723 -2634 2704 2638 -2725 -2604 2734 2575 -2756 -2566 2806 2518 -2837 -2459 2861 2420
1515 2420 -2899 -2365 2939 2292 -2929 -2275 2932 2242 -2963 -2240 2986 2223 -3050 -2202 3113 2144 -3154
1532 -3154 -2087 3177 2032 -3191 -1990 3219 1928 -3216 -1873 3200 1865 -3185 -1843 3178 1819
1547 1819 -3189 -1788 3222 1758 -3232 -1705 3224 1622 -3200 -1575 3158 1563 -3163 -1529 3148
1562 3148 1490 -3124 -1466 3133 1472 -3177 -1427 3212 1377 -3237 -1342 3279 1269 -3310 -1187
1577 -1187 3306 1149 -3303 -1141 3343 1102 -3361 -1043 3370 1037 -3387 -1015 3434 951 -3421
1592 -3421 -891 3422 859 -3407 -803 3371 762 -3316 -756 3262 764 -3246 -759 3229 735
1607 735 -3233 -715 3204 676 -3183 -661 3180 611 -3170 -551 3132 507 -3131 -486 3111
$$ packed form
1497b721N470r4n378Q9N338o6n363J21N338j59n331J90N372k88n355L78N320m41
1515B420n319N34N304o47n221O54N207o90n205P23N226p63n273Q48N315r69n298
1532c154J067N264j145n223J201N209j291n144J343N073j335n050J342N021j359
1547A819n008J401N010j464m990J527M929j602m822J625M733j595m726J634M677
1562C148j658m614J658M599j661m649J750M639j835m614J895M621k010m579K123
1577a187M493k157m452K162M484k241m463K318M413k333m424K372M449k483m372
1592c421K530M313k563m266K604M174k609m078K560M018k498m010K487L988k494
1607G35l968K518L919k528l859K522L841k569l781K619L683k625l638K645L597
$$ plain form
1622 3111 448 -3132 -427 3156 390 -3219 -325 3252 257 -3262 -200 3265 132 -3290 -81
1637 -81 3261 18 -3241 3 3232 -30 -3194 39 3184 -48 -3193 63 3171 -92 -3149
1652 -3149 128 3106 -156 -3048 149 2984 -155 -2954 164 2909 -172 -2855 149 2870 -183
1667 -183 -2878 226 2865 -276 -2871 332 2886 -407 -2858 475 2836 -497 -2836 558 2850
1682 2850 -606 -2825 654 2856 -686 -2859 764 2845 -802 -2838 845 2838 -900 -2790 929
1697 929 2710 -928 -2673 897 2652 -897 -2615 887 2577 -865 -2567 890 2542 -888 -2493
1712 -2493 907 2476 -897 -2443 942 2403 -960 -2354 971 2356 -984 -2348 1033 2359 -1085
1727 -1085 -2345 1152 2352 -1216 -2333 1298 2307 -1348 -2274 1392 2261 -1448 -2242 1486 2183 -1485
$$ packed form
1622C111k663l580K705L583k766l609K894L577k995l519L062L465l133l422L209
1637h1L342l243l259L244L229l262l164L233L145l232l145L256L108l263l057
1652c149L277K978l262k892L197K835l139k799L118K745l081k683L004K721l053
1667a83k695L104K639l141k595L203K554l293k451L333K361l333k339L394K292
1682B850l456k219L479K202l542k173L623K081l647k036L683J993l738j890L719
1697I29J781l638j745L570J755l549j718L502J690l442j702L457J652l430j605
1712b493L400J569l373j546L385J461l363j394L325J385l340j364L381J326l444
1727a085j260L497J200l568j117L631J009l655r26L666Q69l709p94L728O97l668
$$ plain form
1743 -1485 -2186 1487 2189 -1512 -2173 1537 2131 -1532 -2117 1545 2071 -1556 -2008 1528 1994 -1475 -1975
1760 -1975 1479 1939 -1465 -1908 1429 1907 -1438 -1893 1468 1884 -1494 -1864 1531 1817 -1575 -1777 1612
1777 1612 1748 -1618 -1707 1670 1699 -1705 -1680 1748 1664 -1789 -1651 1831 1615 -1883 -1587 1909 1578 -1929
1795 -1929 -1515 1938 1475 -1904 -1440 1910 1439 -1881 -1424 1876 1422 -1856 -1388 1860 1373 -1854 -1343
1812 -1343 1851 1332 -1824 -1283 1828 1264 -1820 -1237 1811 1193 -1812 -1205 1819 1181 -1870 -1150 1892
1829 1892 1118 -1923 -1082 1974 1037 -1993 -976 2003 951 -2023 -909 2046 879 -2040 -858 2049
1845 2049 851 -2060 -825 2064 802 -2065 -761 2068 738 -2059 -710 2031 692 -2008 -676
1860 -676 1991 668 -1972 -662 1958 646 -1957 -641 1954 619 -1963 -588 1973 543 -1975
$$ packed form
1743a485p01L673P02l701o61L710N94l663n85L662N26l627m52L536M66l469n00
1760a975L454M60l404m43L337M78l345m55L361M16l378l70L395K86l392k02L389
1777A612J36l366q9L377K9l404K5L428q4l453J38L482k16l498K96L496l31l507
1795a929M14L453m63l379M64L350m71l320M57L300m54l278M68L248m87l227N11
1812a343L194n19l156N41L111n64l084N83L048o18l005O07L024o38l051P20L042
1829A892p74l041Q41L056r37l030J017K979j052k974J114K955j167k919J182K907
1845B049j198k911J235K889j262k867J304K829j330k797J349K741j339k700J332
1860f76K667j323k640J310K620j312k603J316K595j335k582J375K561j430k518
$$ plain form
1875 -1975 -499 1974 466 -1975 -427 1976 414 -1984 -378 2009 343 -2020 -309 2034 288
1890 288 -2039 -240 2060 206 -2052 -167 2058 143 -2036 -113 2008 103 -1989 -108 1999
1905 1999 84 -2000 -71 1979 65 -1974 -38 1966 15 -1945 -11 1932 -11 -1919 34
1920 34 1901 -60 -1877 57 1888 -77 -1890 104 1890 -133 -1894 183 1906 -219 -1891
1935 -1891 243 1873 -264 -1860 295 1850 -320 -1837 336 1838 -352 -1831 363 1831 -395
1950 -395 -1834 426 1806 -464 -1787 461 1753 -483 -1751 478 1725 -497 -1723 495 1711
1965 1711 -520 -1704 516 1686 -546 -1686 574 1670 -586 -1650 616 1635 -630 -1602 652
1980 652 1596 -645 -1587 683 1587 -700 -1562 715 1556 -725 -1555 775 1537 -791 -1519 801 1496
$$ packed form
1875a975J476K473j508k441J548K403j562k398J606K387j666k363J711K343j746
1890B88k327J799K300j854k258J885K225j915k179J923K121j905k092J881K107
1905A999j915k084J929K050j914k039J936K004j951j960J934J943j943j908J953
1920C4J867j961j817J934J831j965j813J994J786k023j761K077J723k125j672
1935a891K134J630k137j596K155J555k170j517K173J502k190j479K194J468k226
1950c95j439K260J380k270j323K248J292k236j268K229J247k222j226K218J216
1965A711k231j184K220J170k232j140K260J096k256j064K266J019k265r72K254
1980F52R44k241r42K270R04k287q62K277Q41k281q30K330P62k328p28K320O95
$$ plain form
1997 1496 -835 -1463 848 1442 -838 -1431 849 1428 -864 -1414 892 1397 -911 -1395 916 1371 -939
2014 -939 -1344 958 1339 -965 -1306 985 1287 -964 -1267 990 1253 -982 -1251 1001 1245 -1028 -1213
$$ packed form
1997A496k331o28K311N94k280n93K280N79k292n50K306N05k308m84K311M55k310
2014i39m05K302L81k304l41K291L02k251l03K257K63k235k69K252K44k273j85
$$ [...]
8191i2
##END NTUPLES=NMR FID
##END=
