##TITLE=1H_AM_NVSTER60
 CDCl3
 8 sc, 
 6.04.2022
##JCAMPDX= 6.0         $$ Bruker NMR JCAMP-DX V2.0
##DATA TYPE= NMR FID
##DATA CLASS= NTUPLES
##ORIGIN= UXNMR, Bruker Analytische Messtechnik GmbH
##OWNER= root
$$ XWIN-NMR		Version 3.5
$$ Wed Apr  6 14:35:56 2022 Russian Standard Time (UT+4h)  she@DPX200
##.OBSERVE FREQUENCY= 200.131346
##.OBSERVE NUCLEUS= ^1H
##.DELAY= (6, 6)
##.ACQUISITION MODE= SIMULTANEOUS
##.ACQUISITION SCHEME= undefined
##.AVERAGES= 8
##.DIGITISER RES= 18
##SPECTROMETER/DATA SYSTEM= spect
##.PULSE SEQUENCE= zg30
##.SOLVENT NAME= DMSO
##.SHIFT REFERENCE= (INTERNAL, DMSO, 0, 15.7039)
##AUDIT TRAIL= $$ (NUMBER, WHEN, WHO, WHERE, WHAT)
$$ ##TITLE= Audit trail, XWIN-NMR		Version 3.5
$$ ##JCAMPDX= 5.01
$$ ##ORIGIN= Bruker BioSpin GmbH
$$ ##OWNER= she
$$ F:/spectra/data/she/nmr/H-F/1/audita.txt
$$ ##AUDIT TRAIL=  $$ (NUMBER, WHEN, WHO, WHERE, WHAT)
(   1,<2022-04-06 14:34:51.35 +0400>,<she>,<DPX200>,
      <created by zg, POWCHK disabled, PULCHK disabled
       configuration hash MD5:
       00 E9 B6 7A A2 85 ED C7 34 08 36 98 17 FE 4E 26
       data hash MD5: 16K
       4D CB 4D F4 88 F0 AD 9A 52 79 63 50 8E E5 77 E2>)
$$ ##END=
$$ 
$$ hash MD5
$$ BE D0 75 47 DA BE 81 66 70 0F 73 ED AE BF 75 2D
##$RELAX= 
##$RELAX= 
##$RELAX= 
##$RELAX= 
##$RELAX= 
##$RELAX= 
$$ Bruker specific parameters
$$ --------------------------
##$DU= <F:/spectra>
##$EXPNO= 1
##$NAME= <H-F>
##$PROCNO= 1
##$TYPE= <nmr>
##$USER= <she>
##$AMP= (0..31)
100 100 100 100 100 100 100 100 100 100 100 100 100 100 100 100 100 100 
100 100 100 100 100 100 100 100 100 100 100 100 100 100 
##$AQSEQ= 0
##$AQ_mod= 1
##$AUNM= <au_zg>
##$AUTOPOS= <>
##$BF1= 200.13
##$BF2= 200.13
##$BF3= 200.13
##$BF4= 200.13
##$BF5= 200.13
##$BF6= 200.13
##$BF7= 200.13
##$BF8= 200.13
##$BYTORDA= 1
##$CFDGTYP= 0
##$CFRGTYP= 5
##$CHEMSTR= <none>
##$CNST= (0..31)
1 1 145 1 1 1 1 1 1 1 1 1 1 1 1 1 1 1 1 1 1 1 1 1 1 1 1 1 1 1 1 1 
##$CPDPRG= <>
##$CPDPRG1= <>
##$CPDPRG2= <>
##$CPDPRG3= <>
##$CPDPRG4= <mlev>
##$CPDPRG5= <mlev>
##$CPDPRG6= <mlev>
##$CPDPRG7= <mlev>
##$CPDPRG8= <mlev>
##$CPDPRGB= <>
##$CPDPRGT= <>
##$D= (0..31)
0 1.2 0 0 0 0 0 0 0 0.06 0 0.03 0 0 0 0 0.0002 0 0 0 0 0 0 0 0 0 0 0 0 
0 0 0 
##$DATE= 1649241290
##$DBL= (0..7)
120 120 120 120 120 120 120 120 
##$DBP= (0..7)
150 150 150 150 150 150 150 150 
##$DBP07= 0
##$DBPNAM0= <>
##$DBPNAM1= <>
##$DBPNAM2= <>
##$DBPNAM3= <>
##$DBPNAM4= <>
##$DBPNAM5= <>
##$DBPNAM6= <>
##$DBPNAM7= <>
##$DBPOAL= (0..7)
0.5 0.5 0.5 0.5 0.5 0.5 0.5 0.5 
##$DBPOFFS= (0..7)
0 0 0 0 0 0 0 0 
##$DE= 6
##$DECBNUC= <off>
##$DECIM= 32
##$DECNUC= <off>
##$DECSTAT= 4
##$DIGMOD= 1
##$DIGTYP= 9
##$DL= (0..7)
0 120 120 120 120 120 120 120 
##$DP= (0..7)
150 150 150 150 150 150 150 150 
##$DP07= 0
##$DPNAME0= <>
##$DPNAME1= <>
##$DPNAME2= <>
##$DPNAME3= <>
##$DPNAME4= <>
##$DPNAME5= <>
##$DPNAME6= <>
##$DPNAME7= <>
##$DPOAL= (0..7)
0.5 0.5 0.5 0.5 0.5 0.5 0.5 0.5 
##$DPOFFS= (0..7)
0 0 0 0 0 0 0 0 
##$DQDMODE= 0
##$DR= 18
##$DS= 0
##$DSLIST= <SSSSSSSSSSSSSSS>
$$ [...]
##$SUBNAM2= <"">
##$SUBNAM3= <"">
##$SUBNAM4= <"">
##$SUBNAM5= <"">
##$SUBNAM6= <"">
##$SUBNAM7= <"">
##$SUBNAM8= <"">
##$SUBNAM9= <"">
##$SW= 18.0517287032376
##$SWIBOX= (0..15)
0 0 2 0 0 0 0 0 0 0 0 0 0 0 0 0 
##$SW_h= 3612.71676300578
##$TD= 16384
##$TD0= 1
##$TE= 0
##$TE2= 300
##$TE3= 300
##$TEG= 300
##$TL= (0..7)
0 120 120 120 120 120 120 120 
##$TP= (0..7)
150 150 150 150 150 150 150 150 
##$TP07= 0
##$TPNAME0= <>
##$TPNAME1= <>
##$TPNAME2= <>
##$TPNAME3= <>
##$TPNAME4= <>
##$TPNAME5= <>
##$TPNAME6= <>
##$TPNAME7= <>
##$TPOAL= (0..7)
0.5 0.5 0.5 0.5 0.5 0.5 0.5 0.5 
##$TPOFFS= (0..7)
0 0 0 0 0 0 0 0 
##$TUNHIN= 0
##$TUNHOUT= 0
##$TUNXOUT= 0
##$USERA1= <user>
##$USERA2= <user>
##$USERA3= <user>
##$USERA4= <user>
##$USERA5= <user>
##$V9= 5
##$VALIST= <valist>
##$VCLIST= <CCCCCCCCCCCCCCC>
##$VD= 0
##$VDLIST= <DDDDDDDDDDDDDDD>
##$VPLIST= <PPPPPPPPPPPPPPP>
##$VTLIST= <TTTTTTTTTTTTTTT>
##$WBST= 1024
##$WBSW= 4
##$XGAIN= (0..3)
0 0 0 0 
##$XL= 0
##$YL= 0
##$YMAX_a= 42197
##$YMIN_a= -33625
##$ZGOPTNS= <>
##$ZL1= 120
##$ZL2= 120
##$ZL3= 120
##$ZL4= 120
##$ABSF1= 10
##$ABSF2= 0
##$ABSG= 5
##$ABSL= 3
##$ALPHA= 0
##$AQORDER= 0
##$ASSFAC= 0
##$ASSFACI= 0
##$ASSFACX= 0
##$ASSWID= 0
##$AUNMP= <proc_1d>
##$AZFE= 0.1
##$AZFW= 0.1
##$BCFW= 1
##$BC_mod= 2
##$BYTORDP= 1
##$COROFFS= 0
##$CY= 11.3945322036743
##$DATMOD= 1
##$DC= 2
##$DFILT= <>
##$DTYPP= 0
##$F1P= 2.36226072786647
##$F2P= -0.459571619588291
##$FCOR= 0.5
##$FTSIZE= 0
##$FT_mod= 4
##$GAMMA= 1
##$GB= 0.15
##$INTBC= 1
##$INTSCL= 1
##$ISEN= 128
##$LB= 0.24
##$LEV0= 0
##$LPBIN= 0
##$MAXI= 10000
##$MC2= 0
##$MEAN= 0
##$ME_mod= 0
##$MI= 1.114404
##$NCOEF= 0
##$NC_proc= 0
##$NLEV= 6
##$NOISF1= 3.799351
##$NOISF2= 2.8
##$NSP= 1
##$NTH_PI= 0
##$NZP= 0
##$OFFSET= 15.70392
##$PC= 1
##$PHC0= -17941.7
##$PHC1= 13.80078
##$PH_mod= 1
##$PKNL= yes
##$PPARMOD= 0
##$PSCAL= 0
##$PSIGN= 0
##$REVERSE= no
##$SF= 200.130013532006
##$SI= 16384
##$SIGF1= 3
##$SIGF2= 2
##$SINO= 400
##$SIOLD= 16384
##$SREGLST= <1H.CDCl3>
##$SSB= 0
##$STSI= 0
##$STSR= 0
##$SW_p= 3612.71676300578
##$SYMM= 0
##$S_DEV= 0
##$TDeff= 0
##$TDoff= 0
##$TI= <>
##$TILT= no
##$TM1= 0
##$TM2= 0
##$TOPLEV= 0
##$USERP1= <user>
##$USERP2= <user>
##$USERP3= <user>
##$USERP4= <user>
##$USERP5= <user>
##$WDW= 1
##$XDIM= 8192
##$YMAX_p= 0
##$YMIN_p= 0
$$ End of Bruker specific parameters
$$ ---------------------------------
##NTUPLES= NMR FID
##VAR_NAME=  TIME,          FID/REAL,        FID/IMAG
##SYMBOL=    X,             R,               I
##VAR_TYPE=  INDEPENDENT,   DEPENDENT,       DEPENDENT
##VAR_FORM=  AFFN,          ASDF,            ASDF
##VAR_DIM=   8192,          8192,            8192
##UNITS=     SECONDS,       ARBITRARY UNITS, ARBITRARY UNITS
##FACTOR=    0.0002768,     1,               1
##FIRST=     0,             0,               0
##LAST=      2.2672688,     0,               0
##MIN=       0,             -33625,          0
##MAX=       2.2672688,     42197,           0
$$ Real data points
##PAGE= N=1
##DATA TABLE= (X++(R..R)), XYDATA
0 0 0 0 0 0 0 0 0 0 0 0 0 0 0 0 0 0 0 0 0 0 0 0 0 4 -8 8 -8 8 -8 8 -8 13 -16 16 -16 18 -24 24 -26 32 -32 38 -40 46
44 46 -50 56 -61 66 -74 82 -90 98 -109 120 -134 149 -165 184 -208 236 -270 312 -369 445 -554
65 -554 723 -1007 1582 -3157 15567 42197 -24367 -17983 28763 -3687 -24443 13431 9103 -12885
79 -12885 1976 2674 -10041 6034 7559 -10689 -1780 7820 -4642 -455 8876 -1654 -6480 466
93 466 456 -673 1694 2365 -380 -3783 -308 5317 1089 -2693 1445 49 -3489 2093 2186 -4153 338
110 338 1124 -7467 1559 10421 -4983 -6457 9068 684 -8767 4737 5367 -7379 -2587 4642 -601
125 -601 -308 3342 -1997 -2674 3528 1546 -1202 2746 1227 -4307 -2970 2036 2055 -2887 -2290 3169 210
142 210 -2637 3599 2365 -4321 -827 1402 -1925 1940 2374 -5421 -1636 5108 -2378 -1748 8497 -733
158 -733 -8496 5459 4948 -7147 1725 5624 -7736 -3624 7216 -271 -3326 3262 -785 -3562 3215
173 3215 1312 -2411 2518 -1183 -6466 2982 5039 -4455 -1379 3926 -1938 -2079 3939 2596 -1220
188 -1220 -1577 -907 695 1547 -307 -659 463 -1113 -1118 1956 1519 -450 -710 -1705 212 2503 -1398 -1796
206 -1796 1967 -1860 -3568 3218 2778 -3291 -596 2654 -1172 -571 3283 -155 -2416 842 -218 -815
222 -815 2776 59 -3339 1240 2046 -1904 677 3393 -1610 -3740 1566 2358 -2328 -1268 1651 -1139
238 -1139 -2000 1506 1628 -603 -513 -250 -233 1672 1447 -2124 -1044 1965 -1828 -1971 4697 1654 -4725
255 -4725 507 3590 -1871 -576 3257 -1397 -3324 1338 524 -1496 1697 -203 -3350 1645 2400 -2188
271 -2188 756 2158 -3277 -1636 3322 560 -1822 491 -12 -1276 895 1541 541 525 -1120 -1467
287 -1467 1912 1230 -1674 46 203 -1730 25 1168 195 221 -1195 -1500 1775 1226 -1975 44 1234
304 1234 -2404 -924 3366 153 -2176 1090 -69 -1243 2541 1043 -2022 1085 398 -2524 1640
319 1640 2844 -2752 -1901 2530 -377 -2004 2299 1092 -2945 -477 1525 -255 139 -46 -1507 -155
335 -155 592 -378 711 1267 -1137 -1780 1296 2154 -632 -856 1187 -151 -1691 735 2141 -562 -1859
352 -1859 293 827 -201 640 208 -1236 -89 -60 -859 1400 887 -2713 -934 1952 -162 -703 1661
369 1661 202 -2122 57 1679 178 -230 -215 -625 358 379 -51 1243 -43 -2040 176 1643 -57
386 -57 -477 -254 -583 -250 -179 98 1267 -105 -2519 27 2460 -708 -1180 1718 -635 -2067 1618 1183
404 1183 -795 889 -501 -1690 2155 1447 -2355 506 1888 -2809 -935 3968 -265 -3227 1162
419 1162 654 -1995 1201 1379 -1625 -246 33 -1438 1202 1802 -1917 -1125 1839 0 -1117 1594
435 1594 914 -1909 -589 1325 653 182 -100 -517 -207 4 446 949 -39 -1004 -855 78 917 5 -919
454 -919 168 77 -1340 163 2179 -308 -2465 375 1740 -721 -363 1332 -283 -1264 90 946 1182
471 1182 122 -1320 -358 904 239 -145 394 84 -934 -761 653 1103 -291 -1249 -178 508 -425 169
489 169 1044 -1027 -1281 1139 503 -383 932 -392 -1456 746 688 -345 1305 164 -2464 608 2560
506 2560 -1394 -993 2359 -1051 -2597 2033 1338 -1824 72 72 -1358 1201 1283 -1561 30 978 -1868
523 -1868 -409 2720 -109 -2061 640 450 -703 1198 950 -796 -125 -116 -285 1093 389 -1183 -305
540 -305 213 -355 389 917 -457 -1100 -168 471 617 -34 -849 -94 -142 -1096 872 1938 -1085 -1481 1115
559 1115 586 -417 704 484 -736 -451 72 488 988 -210 -1551 112 1338 -305 -382 903 -381
576 -381 -1622 -122 1299 439 -1065 -715 356 -218 -170 1013 226 -861 -198 192 332 906 -125 -1175
594 -1175 318 763 -659 662 1487 -1676 -1454 1982 462 -1194 1066 79 -1925 189 1008 -339
610 -339 352 -155 -1734 352 1695 -955 -535 1573 -897 -1589 1775 1162 -1183 -228 -18 -338 941
627 941 478 -411 453 -250 -1223 859 1555 -723 -959 222 -362 -309 609 52 -219 -267 -913 603 1474 -875
647 -875 -909 916 -371 -761 1286 650 -1180 -325 417 120 843 527 -800 15 391 -872 418 1445
665 1445 -1151 -1500 959 462 -690 349 477 -826 -699 451 667 67 -553 -725 -25 578 89 62
683 62 496 -259 -832 334 1445 382 -1074 -221 671 -582 -140 1343 -108 -1277 77 475 76 479
701 479 -261 -1020 36 378 -460 575 798 -1586 -1036 1497 370 -673 801 44 -1130 235 844
718 844 169 161 -427 -699 583 736 -362 96 350 -973 -486 1242 499 -602 -355 -424 -50 306 -238 283
738 283 358 -1233 -486 1538 309 -1066 253 396 -671 247 958 -188 -293 -222 -644 835 1187 -1041
756 -1041 -380 1159 -751 -905 1487 403 -1628 -271 748 -304 -71 518 -481 -507 264 -70 403 734
774 734 -794 -844 792 435 -496 319 533 -569 -603 897 1038 -382 -666 36 92 -98 165 392 -114 -827
794 -827 -464 396 679 6 -724 -175 393 -410 -121 974 -213 -1229 176 878 114 -12 144 -233 -267
813 -267 261 499 512 -12 -921 -322 796 128 -255 423 -150 -757 -62 455 377 -194 -814 -101 587 -106 -274
834 -274 462 -145 -938 245 963 -69 -164 62 -511 192 744 -176 209 347 -1072 -239 1330 -149 -829
853 -829 653 22 -1133 570 1006 -832 -482 367 -491 176 797 -773 -437 726 -536 -331 1367 201
871 201 -1287 64 775 -196 66 494 -390 -398 263 38 398 433 -727 -442 540 74 -218 287 -144 -715
891 -715 -233 570 417 -431 -394 124 12 -123 478 580 -490 -805 332 665 60 137 -15 -272 24 94 253
912 253 603 -239 -921 34 626 16 -351 -10 -63 -507 -73 708 295 -651 -637 184 319 -111 278 320 -583
933 -583 -360 411 359 339 26 -600 120 540 -315 66 746 -561 -1001 840 780 -756 -118 339 -782 -153
953 -153 788 -149 -123 125 -908 -86 1180 -186 -765 556 123 -852 454 994 -474 -537 245 57 359
972 359 450 -435 -126 211 -538 167 975 -318 -928 84 314 -96 118 205 -302 -404 -77 315 474 -212
992 -212 -643 145 298 -252 429 481 -577 -433 366 358 265 2 -421 -123 157 -66 177 501 -298 -928 188
1013 188 689 -180 -267 90 -237 -335 111 423 226 -420 -410 204 378 243 -32 -142 -29 -166 45 664 341
1034 341 -599 -383 387 151 -164 405 104 -831 -189 500 -27 -33 -23 -580 -4 446 -223 17 363 -672 -678
1055 -678 864 674 -584 -82 326 -476 -28 729 147 -24 -158 -523 325 721 -401 -323 418 -262 -481
1074 -481 578 478 -617 -518 62 56 238 126 -273 -38 -213 -422 625 679 -585 -364 363 -43 -16 464
1094 464 72 -347 -183 46 356 503 -314 -622 299 185 -440 427 486 -803 -551 440 282 -8 -57 -267
1114 -267 -178 86 74 221 370 -317 -669 345 704 -162 -167 279 -170 -304 311 554 -60 -558 -145 278 121
1135 121 57 102 -225 -315 -228 130 485 9 -639 -200 387 -6 -189 439 134 -752 -39 775 133 -198 -22
1156 -22 -254 51 337 110 155 54 -590 -258 633 333 -393 -143 14 -375 -19 434 54 -230 -360 -256 432
1177 432 296 -392 2 154 -457 29 752 149 -478 -181 28 198 429 70 -182 104 -335 -330 838 410
1197 410 -824 -129 378 -390 -33 545 -221 -552 44 108 75 302 -237 -512 239 202 -196 451 307 -745
1217 -745 -272 615 209 -27 77 -85 -205 -56 156 328 53 -474 -313 387 277 -287 -32 106 -404 -184
1237 -184 447 336 -283 -450 11 266 -30 186 302 -296 -344 199 384 224 -66 -233 -72 124 70 73 228
1258 228 -119 -624 50 587 -72 -344 -55 -127 -144 20 206 254 -331 -572 210 559 -16 -162 150 -117 -283
1279 -283 315 461 17 -165 -271 -60 524 126 -293 239 -60 -630 281 685 -330 -508 95 -75 -106 283
1299 283 48 -247 -69 -317 -43 733 42 -755 187 338 -436 151 643 -240 -500 145 213 184 181 -236 -261 220
1321 220 -28 -146 454 60 -745 -112 484 21 -130 19 -125 -202 -84 246 351 -161 -441 51 346 63
1341 63 -32 220 -87 -323 141 373 171 -102 -337 -68 265 18 -21 160 -188 -457 46 417 136 -320 -238
1362 -238 55 13 -35 170 184 -242 -388 195 522 10 -184 -2 -29 39 117 243 290 -343 -475 335 353 -203 -31
1385 -31 99 -355 -248 335 187 -197 -151 -272 -80 389 17 -262 213 -112 -469 479 604 -392 -289 227 -38
1406 -38 -52 399 136 -199 -125 -142 130 514 -96 -489 204 82 -383 258 349 -428 -386 124 204 85 -52 -228
1428 -228 -117 43 -84 208 414 -261 -477 257 322 -32 186 76 -235 -107 80 244 252 -289 -398 143 221
1449 221 -112 16 172 -335 -387 282 366 -105 -231 -171 -26 148 49 143 194 -278 -358 271 454 35 -232 0
1471 0 50 -126 68 329 8 -397 -198 266 193 -93 -73 -85 -228 -2 157 169 54 -378 -263 357 181 -202
1493 -202 178 117 -411 -54 495 193 -211 -20 -37 3 256 91 -107 96 -240 -319 467 317 -503 -247 114
1514 114 -156 -61 279 28 -268 -206 -82 220 331 -191 -233 191 -27 -102 446 178 -411 -118 188 178 171 -7
1536 -7 -194 -51 -31 -11 343 194 -476 -305 266 22 -120 198 -110 -369 -30 106 146 175 -272 -324 250 234 -127
1559 -127 152 200 -391 -248 484 361 -171 -124 -60 -111 43 157 219 3 -347 -173 206 179 -78 -123 -15 -62 -126
1582 -126 158 291 -188 -415 6 338 99 -27 118 -74 -292 86 326 148 -26 -276 -152 254 46 -123
1602 -123 151 -8 -401 -27 443 16 -321 -85 -17 -46 128 124 -41 -95 -308 -52 517 140 -276 32 61 -118
1624 -118 130 312 28 -215 -178 46 319 128 -260 -81 98 -237 -20 474 -119 -537 13 151 11 132
1644 132 -37 -226 -67 -84 24 388 156 -474 -149 407 2 -49 332 -14 -355 62 247 141 63 -254 -162
1665 -162 161 85 -102 115 15 -443 -179 403 183 -188 -119 -76 -120 21 170 197 -80 -335 -26 288 128 -56
1687 -56 -17 -18 -78 9 239 175 -172 -277 30 210 37 -94 40 -130 -274 51 282 64 -150 -214 -34 196 24
1710 24 -49 112 -75 -228 90 352 43 -210 -86 68 91 110 99 40 -130 -283 101 387 -65 -264 38 -100
1732 -100 -141 187 170 -150 -171 -108 34 264 92 -240 -49 111 -194 123 455 -137 -381 161 146 -19 230 55
1754 55 -202 -69 1 73 254 -24 -389 -68 212 -103 -49 226 -209 -361 131 233 38 -27 -173 -104 105 42
1776 42 115 197 -114 -294 96 335 80 -71 -12 -99 -49 91 151 106 -152 -287 49 240 -56 -103 15 -143 -192
1799 -192 106 227 16 -223 -174 71 172 53 10 32 -87 -196 192 356 -19 -183 -58 75 77 11 105 37 -248
1822 -248 -186 220 198 -113 -157 -80 -55 29 118 78 -26 -173 -211 221 335 -145 -98 173 -110 -147 315 182 -170 -162
1846 -162 6 91 157 -8 -129 -3 -60 -185 210 357 -327 -342 154 33 -68 129 14 -203 -119 19 189 227
1868 227 -134 -254 92 159 -52 109 178 -210 -192 202 194 56 -47 -166 -22 54 7 116 102 -286 -271 177 195
1891 195 -76 -61 -11 -155 -86 156 138 68 -153 -198 170 217 -56 7 106 -115 -103 223 287 -35 -241 -41 112 118
1915 118 26 44 -15 -186 -151 174 202 -60 -175 -78 59 26 18 126 1 -261 -81 299 143 -117 -30 -20 -76 68
1939 68 209 89 -73 -214 -92 196 183 -138 -49 114 -215 -108 319 103 -241 -109 19 78 73 -3 -61 -41 -90
1962 -90 -47 288 208 -251 -166 181 41 10 179 6 -153 -95 16 195 84 -205 -134 105 1 -64 173 26 -301
1985 -301 -149 194 66 12 -55 -143 -19 66 20 206 116 -299 -126 280 167 -70 36 45 -151 -38 199 131 -46
2008 -46 -172 -126 136 111 -99 -7 -15 -211 -123 202 172 -149 -215 0 105 19 72 101 -55 -198 -16 250 130 -86
2032 -86 -89 12 24 78 63 100 -74 -268 -6 271 51 -141 -59 -56 -136 12 183 27 -168 -183 3 155 92 -105
2056 -105 15 27 -159 53 297 2 -199 -63 62 106 64 -20 -48 -63 -128 70 257 31 -259 -78 61 -55
2078 -55 54 117 -96 -154 -48 41 200 101 -176 -35 111 -25 47 214 -21 -270 30 247 54 17 -1 -155 -60
2101 -60 52 65 154 -34 -317 -78 173 29 -80 42 -31 -179 -14 200 95 -74 -140 -15 139 127 -3 76
2123 76 -29 -172 23 261 94 -113 -133 1 39 -38 81 72 -140 -198 25 183 -9 -164 -37 -55 -60 60 96 27
2147 27 -148 -165 104 233 -9 -58 13 -38 -83 98 241 24 -186 -67 130 108 3 -56 3 -92 -134 128 247 -105
2171 -105 -205 -32 26 65 16 -21 -16 -129 -123 141 241 -58 -216 31 45 -48 136 159 -149 -175 7 87 147 -3 -187
2196 -187 18 30 -67 76 158 -141 -287 69 185 -6 -31 22 -107 -76 82 124 156 -63 -185 33 191 41 17
2219 17 51 -54 -127 61 200 37 -152 -122 -8 64 -3 1 58 -157 -195 75 176 -26 -101 -98 -4 19 69 97 14 -137
2245 -137 -100 128 214 -8 -116 44 -26 -22 151 135 -53 -138 -78 113 133 -27 -33 -49 -125 -54 95 122 -76 -201 -65
2270 -65 128 96 2 15 -8 -119 -61 205 155 -131 -78 27 7 83 121 9 -43 -106 -36 169 130 -119 -142 30 -32 -38
2296 -38 148 75 -200 -136 60 92 55 -40 -109 -3 14 -11 160 95 -167 -149 108 131 33 9 18 -128 -54 57 114 44
2322 44 -144 -179 62 70 -32 13 10 -148 -80 116 145 -28 -128 -57 55 75 37 65 52 -142 -108 200 158 -70 -46 16
2348 16 -21 16 42 70 -79 -171 -74 105 94 -59 -92 -18 -74 -47 122 104 -106 -147 1 141 97 -24 15 -15 -71 43
2374 43 179 90 -76 -138 3 110 38 22 6 -36 -156 -10 193 53 -168 -92 32 -20 37 77 -34 -136 -103 11
2398 11 160 66 -126 -54 48 17 30 179 70 -172 -74 110 86 42 -44 -53 3 -11 -3 150 9 -217 -71 119 101
2423 101 6 19 -48 -115 -27 79 145 28 -132 -53 119 26 9 110 -18 -148 -17 156 70 -63 -75 -20 20 42 56
2448 56 -3 -41 -175 -83 170 75 -87 -51 -28 -40 14 116 80 -63 -91 45 168 91 -37 -30 26 -13 40 183 86 -112
2474 -112 -121 18 70 51 -17 -3 -86 -125 60 137 -20 -128 -91 15 54 41 26 -18 -106 -75 77 197 21 -137 -27
2499 -27 55 7 97 136 -18 -125 -49 72 123 12 -87 -19 -22 -74 63 133 -60 -207 -76 102 33 2 -49 -46 -36 -30 78
2526 78 142 -34 -162 12 94 22 24 50 -61 -115 27 108 80 -36 -129 -18 73 4 -17 73 -71 -185 31 150 43
2551 43 -80 -86 -8 12 49 78 56 -77 -151 30 176 36 -63 3 -5 -71 25 93 -1 -148 -106 44 103 5 -59 -33 -47 -68
2579 -68 63 146 6 -164 -47 39 69 34 41 44 -74 -71 129 168 -18 -107 -10 48 8 26 31 -39 -120 -51 128 106 -27 -154
2607 -154 -23 -37 -43 65 46 -67 -144 -26 92 99 -30 -40 6 -31 1 138 132 -84 -139 20 108 48 11 -11 -66 -53 20
2634 20 125 87 -110 -151 15 45 -22 46 49 -137 -76 47 141 27 -65 -89 1 87 22 45 54 -107 -106 92 146 30 -58
2661 -58 -55 -16 -14 25 105 -7 -98 -80 50 81 -18 -35 -16 -66 -32 109 96 -14 -100 -48 91 81 27 26 -13 -83 -31 129 152
2690 152 -35 -125 -6 33 25 12 11 -44 -137 -72 96 76 -81 -83 -7 6 14 41 13 -67 -126 -8 146 96 -25 -41 19 10 34
2719 34 131 49 -41 -85 23 101 25 -32 -56 -19 -85 6 119 32 -162 -126 48 48 -4 -1 -54 -74 -62 43 107 66 -95 -50
2747 -50 45 40 26 41 13 -108 -46 93 110 -3 -53 -53 0 17 45 40 -18 -130 -82 86 85 -46 -46 -61 -23 8 72 81 -23 -117
2777 -117 -46 92 71 -31 -10 -16 -74 -19 119 78 -90 -102 -4 96 56 -12 -13 -56 -98 -20 99 52 -66 -80 34 7 28
2804 28 80 18 -58 -80 49 101 45 -47 -32 6 -5 23 65 13 -98 -104 38 105 4 -85 -52 -48 -56 21 81 2 -124 -46 25
2833 25 55 47 14 -25 -24 -5 85 128 -2 -114 -14 74 55 48 57 -42 -71 -6 114 104 -8 -116 -47 35 -20 3 71 -48 -136
2862 -136 -23 94 100 -54 -57 -6 21 53 48 33 -60 -125 -15 126 53 -14 -16 -45 -28 14 63 52 -75 -117 3 72 1 -44
2890 -44 23 -57 -88 24 127 16 -94 -57 20 31 33 41 4 -57 -90 45 142 36 -84 -46 5 37 10 54 3 -102 -73
2917 -73 56 96 7 -61 -25 -6 3 80 73 7 -101 -20 60 113 36 3 -27 -27 -4 63 105 -11 -99 -23 80 30 40 -19 -36 -79
2947 -79 -31 51 85 -68 -104 -26 21 0 4 27 -47 -104 9 99 83 -5 -76 -1 38 31 75 50 -54 -51 31 107 60 -23 -62 -12
2977 -12 -4 3 18 30 -82 -105 23 70 -7 -23 -10 -85 -44 48 80 9 -82 -80 36 75 15 15 17 -52 -42 75 99 -22 -51 -34
3007 -34 17 27 52 16 -30 -97 -53 37 87 -7 -76 -52 14 -13 34 45 -9 -73 -33 78 89 -11 -40 -12 -36 -2 97 92 -29
3036 -29 -97 -44 67 45 -7 -20 -43 -79 -37 89 47 -60 -62 14 53 18 16 4 -21 -41 21 128 58 -43 -56 -10 37 48 48
3065 48 29 -36 -94 26 77 15 -31 -59 0 -26 -14 62 -5 -96 -50 62 67 7 -37 -61 -55 -24 64 82 16 -91 -71 61 80
3094 80 -9 5 16 -53 -18 74 93 1 -87 -49 39 58 20 -8 -27 -94 -49 63 68 -57 -82 -16 -10 -3 29 53 -18 -94 -30 88
3124 88 64 -7 -14 -1 15 12 48 73 -59 -79 -16 59 61 -20 -49 -26 -19 -7 99 51 -71 -76 -7 41 38 -25 -11 -25 -61 30 82 42
3156 42 -50 -57 25 34 -10 11 22 -82 -58 27 77 18 -74 -52 -24 -14 -8 39 -22 -92 -65 60 90 15 -28 -19 1 11 57 74 20
3187 20 -85 -15 71 45 -5 -9 -3 -24 -13 46 48 -52 -101 -75 49 14 -42 -5 -7 -90 -23 77 61 -51 -53 19 47 37 33 20 -43
3218 -43 -46 13 104 101 -44 -68 -18 2 17 36 32 -38 -92 -12 70 26 -45 -43 -22 -28 28 75 15 -77 -62 8 79 35 -30 -16 -43 -67
3250 -67 31 84 16 -84 -53 45 41 6 28 31 -64 -31 52 68 9 -78 -37 1 22 24 21 -35 -68 -44 50 51 -27 -54 4 27 20 35 55
3283 55 11 -65 -31 59 38 -8 -50 -4 -31 -21 46 41 -45 -108 -9 68 36 -20 -8 -26 -40 32 96 18 -45 -29 -7 38 11 29 20
3314 20 -26 -42 23 57 33 -35 -54 -5 15 1 38 -10 -76 -77 17 72 6 -83 -29 -13 -18 65 99 2 -60 -16 39 84 19 -18 -29
3345 -29 -33 13 41 77 9 -69 -10 50 69 26 1 -16 -65 -43 59 55 -27 -56 -55 19 30 35 17 -6 -47 -38 54 47 -2 -55 1 2 13
3378 13 48 41 -39 -64 4 80 45 -31 -29 1 -1 -7 57 43 -42 -50 3 61 26 -7 5 -21 -19 17 65 48 -74 -88 23 46 18 15 -13
3411 -13 -60 -53 22 93 14 -80 -71 -13 12 12 8 18 -50 -62 28 61 8 -63 -31 9 33 13 29 -15 -65 -31 62 85 35 -44 -11 -9 0
3444 0 20 53 -13 -82 -27 34 25 -27 -47 -12 -47 -18 41 43 -19 -83 -29 28 28 11 14 -37 -44 10 67 69 -30 -29 -18 3 5 52 37 -12 -72
3479 -72 -8 65 15 -32 -46 -22 -9 0 48 -8 -36 -59 13 58 35 -17 -33 -7 -2 20 60 11 -72 -46 27 62 18 -33 -12 -25 -2
3510 -2 30 55 3 -40 -43 -7 28 -6 0 -26 -49 -18 27 89 4 -37 -15 17 28 52 33 -8 -44 -50 30 64 -29 -57 -34 8 4 9 33
3543 33 -47 -68 -25 23 17 -25 -36 -1 -11 -25 55 39 -46 -29 10 48 43 26 -30 4 -35 21 75 56 -41 -64 28 25 19 8 5 -60 -45
3576 -45 -23 42 17 -50 -65 -4 -13 24 23 6 -40 -56 13 59 5 -13 -20 -9 5 17 47 42 -33 -54 56 47 -8 -14 -4 -29 -53 34 44
3609 44 -24 -36 -35 39 31 2 2 -10 -20 -27 28 44 17 -28 -18 28 17 8 6 -14 -73 5 60 43 0 -43 -14 -1 11 10 -1 -23 -50 -22
3643 -22 66 28 -22 -14 -6 -10 19 49 32 -24 -74 11 49 34 -3 -22 -23 -1 5 42 8 -48 -70 -11 13 -5 -19 -6 -43 -27 16 52 -2
3676 -2 -67 -32 0 19 36 28 9 -29 -23 44 69 45 -26 -14 43 -1 26 51 -18 -69 -22 21 56 19 -30 -10 -46 -25 53 28 8 -81
3708 -81 -37 28 52 0 -19 -19 -32 22 49 65 -24 -51 4 36 12 6 -2 -31 -31 10 44 30 -17 -49 2 3 35 56 -3 -18 -57 26 51
3741 51 21 -33 -57 -19 14 9 27 -21 -9 -31 22 81 27 -45 -27 -14 -19 -1 38 -11 -65 -37 4 27 0 -28 -22 -47 8 24 40 11
3773 11 -17 -24 21 14 20 17 -12 -22 -33 65 52 -6 -35 -11 7 -1 8 -7 -28 -91 -28 16 16 0 -18 -30 4 9 9 35 -44 -42 -17 26 55
3808 55 -2 -11 -37 5 -17 61 41 -9 -37 -8 16 34 16 -9 -34 -25 -21 25 50 -63 -46 -3 23 19 -1 -3 -70 -43 8 43 10 -50
3840 -50 -22 3 13 27 39 -5 -49 -32 24 42 2 -28 -13 0 21 22 30 -18 -48 -22 39 34 15 12 -10 -21 -10 41 41 -10 -39 -23 45
3873 45 31 8 -8 -1 -58 -24 48 38 -19 -54 -28 -9 -4 3 -16 -22 -33 -5 28 32 9 -49 -20 16 14 48 39 3 -45 16 60 44 4 -19
3907 -19 -2 -18 10 39 17 -50 -24 13 27 -1 -23 -39 -42 -25 -8 59 17 -68 -36 4 46 2 -15 0 1 -13 22 90 45 -34 -4
3938 -4 4 41 24 29 -1 -24 -16 26 87 -3 -30 -26 -16 -15 17 24 -2 -56 -28 -1 21 17 -34 -14 -20 0 16 20 -53 -46 -37 43 49 -12 -1 8 -13
3975 -13 -2 43 46 -32 -31 3 29 18 -5 -1 -28 -32 8 49 32 -22 -54 -6 28 -4 24 3 -9 -35 -14 58 0 -9 -32 11 -14 20 44
4008 44 -4 -56 -79 27 42 8 -29 -17 -8 -6 6 64 13 -38 -32 2 53 40 15 0 -21 -18 47 70 -4 -24 -10 25 10 7 6 -20 -44
4041 -44 -26 52 37 -25 -38 -12 25 13 10 12 -41 -59 4 53 46 -13 -5 20 1 20 52 40 -22 -28 -9 53 56 -13 -26 8 -10 15 41
4074 41 17 -46 -42 -3 12 12 -5 -20 -25 -27 -17 42 -10 -45 -42 3 40 25 8 -9 -15 -17 39 32 -1 -14 -24 12 -1 20 31 1 -26 -11
4108 -11 19 39 -21 -51 -24 -16 0 40 30 7 -30 -34 47 58 10 -6 16 -16 9 17 16 -17 -77 -35 6 8 24 -42 -24 -26 -28 36 15 -13
4142 -13 -47 -9 12 27 15 22 -9 -32 8 62 53 -14 2 0 15 26 20 19 -27 -54 22 38 10 12 -31 -15 -3 19 16 -21 -56 -22 14 42
4176 42 11 5 9 -8 -13 22 48 23 -31 -23 27 21 21 9 14 2 -23 36 51 13 -31 -20 15 7 7 18 12 -8 11 46 32 4 -36 -18 10
4211 10 9 2 39 -11 -40 -17 21 56 -2 -2 -18 -21 11 9 18 -43 -33 -14 37 21 23 5 -10 -15 -19 41 37 -18 -48 3 41 16 13 12 1 -12
4247 -12 11 44 30 -36 -5 23 11 33 2 -10 -11 -47 8 37 23 -38 -17 -10 -1 28 30 29 -20 -34 25 46 15 6 3 18 3 47 53 17
4281 17 -33 6 15 18 25 -19 19 -24 -4 42 35 -13 -57 -22 18 -1 9 20 -19 -40 -23 35 34 -23 -7 -18 8 26 1 31 -18 -24 -5
4314 -5 31 24 5 15 -2 -4 22 43 40 -16 -44 6 22 5 -3 -4 -19 -8 14 31 21 -6 -35 18 52 9 -9 3 -20 -16 -4 45 10 -22
4348 -22 -29 -1 23 -6 20 1 -42 -48 44 40 3 -24 -1 17 -21 29 35 30 -14 -1 40 47 17 -32 -22 -1 26 20 43 1 -11 -26 37 30
4382 30 -10 -18 -12 -5 -12 31 -8 -35 -48 -26 10 41 -8 11 -19 -21 4 43 35 -27 -28 -8 40 25 17 6 -11 -6 24 42 16 -25 -3 8 1
4417 1 26 4 -30 -19 -51 10 26 15 -20 -24 -41 -4 28 46 10 -16 -30 47 12 15 4 4 -37 18 26 45 1 -35 -39 15 13 10 24 7
4451 7 -10 -17 28 20 -15 -14 -22 -14 -7 22 20 -10 -37 -33 31 33 18 -17 -31 2 5 17 7 -32 -38 6 21 18 2 1 -24 -4 4 26 23 -24 -29 -2 48
4490 48 23 1 3 -15 2 14 44 0 -25 -15 14 25 35 -14 -2 -17 -33 5 14 26 -37 -29 -24 -10 -4 3 20 -21 -14 13 11 -12 -5 6 5
4525 5 -5 31 45 19 -27 -8 26 37 11 -4 8 7 -20 30 49 -12 -25 -31 6 16 11 13 -43 -64 -17 14 15 2 -38 -29 3 -8 9 -1
4559 -1 0 -35 -17 31 27 -3 -8 8 4 14 19 37 13 -46 -19 48 25 -20 5 -13 -5 9 52 10 -8 -5 -1 10 7 1 -23 -22 -20 2 29 6 -22
4596 -22 -39 7 20 -7 -14 -13 -16 -14 9 40 -14 -33 -20 -12 14 -11 -12 -13 -29 -2 24 57 14 -20 -25 8 -4 11 26 -14 -9 5 25 43 -6
4631 -6 -16 -49 -13 -15 -3 0 -24 -32 -15 15 24 -10 -2 -24 -12 -6 38 20 -5 -45 -11 38 11 29 -4 -4 1 11 45 27 -12 -12 8 3 15 41
4667 41 11 -5 -14 18 28 14 -21 -13 -25 12 -13 9 -17 -14 -14 29 53 0 13 0 6 -15 9 50 20 -14 -28 21 8 -2 -26 -22 -6
4700 -6 -3 18 42 -3 -19 20 28 9 25 4 16 -2 -14 15 51 -6 -28 7 28 29 13 17 -14 -37 -16 24 13 -17 -34 -25 -12 6 14 7
4734 7 -23 -16 -5 29 7 3 -8 -16 1 0 52 50 -12 -13 18 34 7 -8 17 -13 12 19 23 6 -17 -10 -3 0 18 -11 -21 9 -18 27 23 4 -23
4771 -23 -31 -54 -3 6 33 -25 -4 -13 6 43 15 -18 -11 -8 42 14 22 -17 -17 -11 22 19 27 -8 -26 -9 -19 43 0 8 -24 -20 -5 35 15 13 -29
4808 -29 -9 -11 9 16 -24 4 2 -4 -13 23 11 -16 -23 -9 29 7 -2 -17 -37 10 11 34 19 -25 -20 26 13 7 -6 -10 -23 3 15 42 36 -18
4844 -18 -28 23 33 -16 -13 -11 -4 -21 -21 32 9 -31 -24 -9 28 1 19 11 -20 -7 24 49 22 -33 5 46 36 32 17 6 -19 -6 37 2
4878 2 3 16 11 28 20 11 6 -27 -31 -7 29 -4 14 -8 -18 -13 -16 -4 0 -13 -20 -15 24 -4 9 -3 1 -26 -14 34 30 -5 -11 2 22 11 -9 -20
4916 -20 -16 -19 7 47 25 0 -28 0 3 23 12 7 -11 -25 -3 29 23 -7 1 -19 19 0 21 9 -22 -12 6 2 17 -18 -28 -6 -25 22
4950 22 -3 -15 7 -32 7 21 7 4 -21 8 18 33 15 17 -22 -15 18 30 5 -10 -13 -4 -15 24 11 -11 -24 -7 4 21 3 -1 -20
4983 -20 -25 -2 41 -8 -28 -23 3 4 1 17 31 7 -24 14 3 27 12 -1 -20 16 31 11 20 -3 -15 9 46 13 17 -18 -13 -5 -6 28 -5
5018 -5 -36 -67 -14 13 28 2 8 -42 12 18 34 31 -17 -7 4 -2 32 17 -1 -5 -7 7 37 -18 1 11 -14 -16 8 38 1 -3 -31 21 15
5053 15 -5 2 1 -28 3 13 24 -29 -4 -11 29 10 23 9 -17 0 0 12 32 3 -32 31 29 7 7 10 -5 -25 5 14 24 -17 -28 32
5087 32 23 20 -14 -15 -29 -33 -5 39 14 8 -17 -21 -4 0 17 -23 -13 -48 18 22 -25 -24 -12 -44 -11 6 39 -12 -16 0 24 11 13 -17 6 -3
5123 -3 1 39 25 16 -17 5 6 5 7 -1 1 -16 -12 3 -2 -5 -33 -11 -12 -3 21 -14 3 -15 -16 18 7 -14 -15 18 -9 2 -11 26 -21 -15 -1 17
5161 17 41 -1 2 -13 -3 -6 14 22 -4 -9 4 14 1 18 -20 -16 1 4 18 14 -12 -7 -7 33 -4 10 -15 -16 10 -12 2 1 -8 -25 -20 -13 10
5198 10 21 15 -5 -16 1 30 -2 1 -9 -11 -6 5 19 26 20 -14 1 12 25 -12 8 6 1 11 18 -9 -38 -18 -15 9 -8 12 -18 -24 -9 -10
5234 -10 18 -28 -27 -8 -4 -2 26 -6 -5 -21 10 30 21 17 -1 21 2 39 16 4 11 -33 21 35 30 -12 2 -12 -4 9 26 -23 -26 -18 6 3
5270 3 -5 -11 -40 -45 5 19 8 -21 -17 -30 -9 -5 -12 -2 -2 14 -27 16 22 -7 -20 -1 -8 49 5 38 21 -14 -19 0 37 31 -9 -12 -8 -12 6 23
5308 23 -28 -5 -11 -9 23 -8 -1 -1 -17 -16 4 6 -22 -9 -20 17 -14 9 -9 -7 -2 21 26 11 6 -16 11 2 27 16 -1 -2 -36 12 37 -4
5344 -4 -6 -15 -15 -22 21 26 8 -27 -10 3 2 -10 -14 -1 -44 -11 1 27 -5 -31 -40 9 -10 19 -4 9 5 -7 5 30 0 -17 22 11 -2
5379 -2 16 11 -24 -7 5 14 25 28 4 -13 17 14 -5 10 -26 -11 -9 -16 -12 -4 1 6 -1 8 2 18 -2 -11 28 28 5 0 -13 -5 9 -5 41 10 -20
5418 -20 -20 1 49 32 2 6 -10 -4 7 0 1 -4 -41 -24 12 -14 -7 0 2 -30 3 5 -1 -23 -11 -3 8 7 5 12 -48 3 -10 11 4 -25 16 14 24
5457 24 21 27 3 -5 9 24 15 9 -19 10 -5 7 -7 17 -4 -20 -31 5 18 -6 5 -30 -18 -5 -2 5 -11 -28 -7 -1 25 -4 -13 0 -21
5492 -21 14 12 14 -4 -11 10 31 35 0 -11 3 14 14 27 36 1 2 -17 25 26 17 6 -33 -8 1 15 14 8 -7 -9 0 10 10 -18 -29 -13 -6 10
5530 10 -1 -12 -24 -17 20 26 10 -6 -14 -27 10 -8 -2 7 -1 -33 -1 27 -6 31 -1 8 0 4 7 4 -12 -3 3 14 9 -8 -16 -27 -13 3 14 12
5568 12 -5 -45 -4 -19 15 -28 -5 -12 10 2 11 5 -10 -27 -18 27 19 29 24 3 1 -5 18 7 4 -26 11 2 24 6 13 -10 -22 -8 9 -16
5604 -16 -20 -25 -5 -16 8 32 7 -20 -7 -5 0 19 -5 -14 -17 -15 4 6 -2 -27 1 25 17 3 -26 21 10 -12 10 12 24 -18 -15 -17 11 -7 1
5641 1 -11 -19 -4 3 16 8 -27 -38 -25 18 7 4 -29 -14 15 8 2 1 2 7 -1 29 13 5 -1 -29 -20 26 17 -17 2 -14 -12 -2 5 -2 2 12 13 7 -16
5682 -16 5 -9 -7 -7 19 16 7 5 -31 -18 4 -19 -5 -5 -11 -4 6 22 -10 -24 -26 3 -7 -7 5 14 -4 -8 11 14 -7 -4 -9 -15 4 15 -14 6
5720 6 -18 2 -7 3 -4 -10 -19 -16 -15 -12 16 -24 -21 -25 10 12 7 0 -17 -27 -17 3 6 -28 -11 8 7 9 16 -6 15 -6 8 9 12 -5 -2 12 8 23 0
5761 0 -7 -3 -13 10 -1 12 -18 9 0 3 -2 3 12 -6 -32 -8 6 -5 -33 0 2 -5 -16 11 -9 -19 5 9 14 9 6 -24 10 -7 21 36 17
5798 17 8 2 8 21 12 23 12 -25 1 34 22 -13 0 0 -7 6 -13 13 -24 -33 6 1 9 -27 -26 -15 3 -4 -11 -11 -11 -33 19 -12 -3 -11 4 -26
5836 -26 10 26 48 44 4 -22 -4 28 22 49 -4 -3 9 7 -4 16 -11 -33 -6 -8 17 8 -2 -30 -26 -11 -8 -11 -34 -25 3 28 -2 24 23 -16
5872 -16 2 23 21 -10 -31 -17 10 9 31 24 25 4 -7 18 21 -11 3 10 4 18 -2 13 0 -13 -5 9 23 14 8 -14 28 -18 -5 22 -32
5907 -32 -24 -47 5 15 22 7 -22 -23 -3 -6 5 0 -4 11 11 34 16 52 0 9 19 19 24 -4 -24 -1 13 -2 7 -6 -12 -19 15 8 8 18 -14 -18
5945 -18 -5 -11 25 -2 -3 -2 1 7 -3 22 33 13 -16 14 -20 10 -20 21 -10 22 15 20 28 6 0 9 35 17 20 -3 14 -10 10 7 -1 2 -26
5982 -26 18 0 -4 -2 -23 -4 3 -22 -14 14 -22 -8 -10 12 19 14 -1 7 3 24 22 5 -6 -13 17 26 -9 5 1 2 1 19 14 -37 -16 -15 18 17 20 -4
6022 -4 -6 12 33 14 -5 -10 -9 -2 -19 24 4 6 -19 -28 13 -2 4 12 -17 2 27 28 7 12 -1 -4 -11 14 20 -26 12 5 -17 12 15 -5 -21 4
6060 4 -7 5 2 -1 18 1 -27 -17 14 -1 -3 -28 -5 7 14 4 -17 -32 -33 7 9 -2 5 11 -31 -5 -13 0 15 -7 -1 -18 16 -2 -6 14
6096 14 -1 7 7 10 15 -3 12 -5 3 -6 3 -29 -14 -23 -1 -10 -12 -30 -16 -14 -12 -6 -25 -1 -18 -1 22 -5 3 -19 21 16 16 -3 -20 8 0 13 38
6135 38 16 -10 0 -22 -9 14 24 9 -6 -1 19 18 18 -17 0 3 -31 -34 0 9 -8 -5 10 -26 27 -3 -19 -9 5 18 7 7 14 -7 -7
6170 -7 -13 11 27 -7 -5 -3 14 4 -4 6 -3 4 -2 2 11 1 -24 -4 -1 -2 7 0 21 12 1 -10 -4 -13 -28 1 0 -16 -16 -9 -45 -1 -8 -15 -7 -1 -18 -2
6212 -2 -7 22 26 3 -6 -4 16 28 -9 18 -9 4 -4 47 -6 -22 -6 14 20 -3 -7 -34 -18 -2 -5 -16 16 -24 -8 -22 17 29 0 -1 -14
6247 -14 1 18 12 16 -4 -12 18 30 12 9 -24 8 8 4 1 8 10 -5 10 6 -10 1 10 -19 5 -10 7 -16 -7 -30 -21 7 -7 5 16 -15 -45
6284 -45 -29 0 -15 -13 -66 -21 0 -7 -28 -30 -36 -1 5 17 3 2 3 -6 2 34 29 16 -16 -5 -8 0 13 32 0 4 -7 6 7 1 -21 -12 1 19
6322 19 10 -6 2 -24 -31 7 4 -11 -35 -13 -11 6 15 -10 -7 -27 -18 2 4 8 0 -3 -9 17 10 17 -5 -6 -22 3 25 2 10 21 2 7 19 -22 7
6361 7 -3 -5 13 17 -3 -23 -23 -5 0 3 -9 7 -27 -17 5 13 5 -2 17 -5 13 17 31 2 5 13 0 24 33 4 11 -7 -18 31 -4 -5 16 -5
6399 -5 14 -1 -2 18 -10 -30 1 -1 -35 -18 -36 -20 -26 21 18 6 -24 -7 -14 -23 -7 2 0 6 8 14 26 -17 -19 -10 23 -6 -5 24 6 -2 -8 7 6
6438 6 -30 -11 -31 0 20 8 3 15 -13 3 -2 -30 -15 -16 -20 -13 2 19 0 -2 -10 -29 -12 -16 -16 13 -7 6 25 23 -2 5 0 15 23 -2 -7 19
6476 19 7 1 25 -3 -1 8 -9 11 -26 16 -10 19 -17 -25 8 3 -16 -14 -26 -18 -3 -4 -3 -14 -10 -11 -18 1 0 -12 -2 -19 -2 -3 0 -19 11 7
6514 7 12 43 23 22 7 -14 -14 13 25 28 6 -14 -6 5 15 -4 -2 -10 1 -22 -18 -25 2 -41 9 -22 -11 2 -14 -22 28 -21 9 -5 -25 -2
6550 -2 -9 5 -13 19 -6 18 -13 11 36 30 -16 -9 6 18 5 -7 -32 14 15 -11 4 0 -33 -12 -8 16 -19 6 -32 -20 -12 -1 8 2 -10
6585 -10 -33 -28 4 22 -8 -15 -5 -4 -12 7 -5 7 -12 -16 22 24 -8 -13 22 25 2 24 2 -14 -11 12 2 -18 1 -23 2 -14 1 2 19
6620 19 -16 -29 -15 -2 -31 -8 -6 -19 18 15 -1 6 -8 -5 -26 23 2 33 23 -2 -16 -8 24 8 -11 31 35 -7 8 8 26 5 2 1 10
6655 10 -12 -7 1 -23 -14 -18 11 -33 -30 11 -10 -11 -2 -14 -24 -32 3 4 10 8 -13 -21 2 -2 -9 5 4 -14 1 -1 8 4 4 18 1 -1 19 18 0 -27 0
6696 0 8 3 -14 -18 -5 -24 14 27 23 -12 -3 4 -5 4 -7 -16 -4 -12 -27 1 19 -17 8 -5 -20 16 0 18 5 2 23 11 34 -12 -4 19 6
6733 6 18 -28 16 -15 -6 -31 -22 4 1 -11 -16 10 -2 -19 -9 -21 -21 -4 27 -11 -24 5 -1 -3 -6 -9 -24 -22 -6 43 -5 29 10 5 5 -17 -18
6770 -18 1 -15 -1 2 -11 5 5 -1 -7 -12 -12 7 35 -7 -1 -18 -27 -6 10 -10 -22 -3 -17 -2 9 -6 -30 1 -5 -6 -13 4 -4 24 16 11 -4
6807 -4 5 -9 -12 3 15 34 27 -20 -11 21 15 10 -6 -5 -14 -14 22 7 -11 -21 -21 -16 -28 24 -5 -29 -32 -7 10 -22 -2 -28 -4 -15 15 19 -11
6844 -11 14 6 14 17 17 10 -11 -14 -2 -2 0 -9 -30 -5 -3 18 15 4 -8 -15 -2 -7 16 -12 4 -12 -37 -3 -13 -3 -4 -44 -7 -16 -26 -38 -11 -12
6882 -12 -20 -9 20 3 13 -20 -10 8 -1 9 5 6 4 -11 -8 -9 3 -8 -6 3 -15 -18 4 5 10 -20 18 1 -3 -1 -12 -5 -21 15 -2 -29 -37 18
6920 18 -6 6 -13 -15 4 -11 -9 3 10 -9 -13 -22 27 21 4 -21 -5 18 8 -10 -20 -2 -3 12 7 28 5 -24 -12 7 -17 -18 4 -18 -24
6955 -24 -6 -6 -8 -6 -21 -24 11 14 -15 12 27 -13 -12 -11 -20 -21 -13 2 7 0 -19 31 2 5 -4 28 12 -4 -10 15 -12 11 5 16 -1 0 14 -9 23
6994 23 13 -6 -21 12 -31 -6 -19 -16 -46 -13 2 -7 -26 -14 -24 -36 12 -4 5 -12 3 2 0 1 1 12 -13 9 15 2 -4 11 4 -18 20
7029 20 0 11 3 9 -24 -24 -19 -16 -10 18 -24 -11 -8 6 -28 -1 -9 15 5 -38 -24 7 -23 -9 21 -7 -7 -18 12 2 29 30 -6 7 22
7064 22 1 31 22 -8 -2 11 1 1 -13 6 -15 14 -1 -3 -19 -18 -17 -32 -2 -10 -26 -5 1 -9 -14 -21 2 -2 -12 -14 -28 6 -11 -6 1 -10 11
7101 11 19 24 -16 -10 17 -16 6 32 -4 -4 15 14 16 -4 -1 -5 -19 -16 20 -10 1 -17 -32 17 -26 -17 -9 -17 -52 -31 1 -6 -6 -11 -7 -23 7 -19
7139 -19 -14 -4 -19 6 -14 -20 8 13 1 8 11 4 21 16 14 14 1 1 9 7 -1 -8 -22 -7 8 -6 -44 -7 -45 18 -22 -8 7 -21 -15 -3 -3 5 -10
7178 -10 -11 -1 -16 3 -8 -24 -14 -34 -9 -3 7 6 2 3 15 23 5 8 -6 10 -6 -3 12 -23 5 -15 -22 -12 -9 -11 -9 -12 -18 0 -10 -17 -36 -24
7216 -24 -11 -4 -19 -10 -20 -17 -12 -12 -11 7 14 -1 -16 -1 -2 -4 -21 2 21 -2 17 -9 -27 6 15 -5 -15 -15 -21 -25 -26 2 -5 -22 -6 -2 -16 -18 -10
7255 -10 -31 -21 -12 7 -28 -39 -17 -10 -14 -4 8 10 -6 -2 16 -17 2 5 -1 5 -4 1 12 11 1 1 5 8 9 0 -2 -20 -10 8 -9 -7 -17 -20 -21 -4
7295 -4 -18 -7 -25 -12 -33 -24 -41 -22 -35 -2 -19 2 -23 -14 -3 -22 -6 -3 3 12 -7 -14 10 1 3 -11 3 -12 0 0 23 0 -26 -20 -3 -14
7331 -14 -13 14 -21 -7 -34 -34 6 -11 6 -10 -31 -13 -31 -11 -14 -43 -2 -15 15 -8 -10 -10 -31 -13 10 -2 5 2 -17 25 10 12 -7 -7 -6
7366 -6 13 -1 4 -24 -9 -5 -10 22 12 -27 3 -43 -6 -6 -12 1 -19 -6 -33 -3 13 -8 -25 -2 -7 4 5 -7 -7 -9 -17 -25 33 -6 -8 11 -5
7403 -5 0 22 25 -29 5 9 22 3 -5 -23 -24 5 -14 13 -23 -30 -18 -17 -18 -17 -25 -16 -2 -3 -20 0 -5 -3 -14 -9 -18 -14 -13 -14 1 16 7 1 14 -31 -25 -3
7445 -3 4 -1 16 -5 0 12 0 2 -20 4 -25 -29 -18 -21 -9 -29 -11 -25 -47 -14 -31 -27 -17 -7 -25 -33 4 -1 -8 -18 -13 -22 29 -10 0 9 2 -3
7483 -3 -5 17 22 15 -12 12 -5 8 -14 -20 1 5 -13 -14 -17 15 -23 1 2 -39 -11 13 -25 -3 -12 -32 -11 -14 -23 13 -35 -39 -29 6 -8 -29 1
7520 1 8 -14 3 15 12 23 11 -6 -1 -9 20 13 -18 -1 17 9 0 -30 -23 -5 -30 -6 -26 3 -9 -34 -8 -38 -6 -14 -37 -3 -5 -4 5 -4 0 -24
7558 -24 -5 -24 -22 9 -17 3 -25 4 4 21 -18 -13 -4 2 -24 -14 -3 -19 -7 -19 11 20 -7 -23 -3 -10 -13 -23 -4 -14 -49 -9 0 5 -4 -5
7594 -5 -23 -18 2 0 -35 -15 -6 -8 3 -12 -8 34 -6 -13 -20 -19 9 20 -4 11 -4 7 5 13 -6 -13 9 -13 -11 7 9 -13 -1 -28 7 12 -22 -15
7632 -15 1 -18 -9 -17 -9 -23 -11 5 7 -15 -9 -37 -22 -7 -22 -5 -15 -20 -4 13 -11 15 -20 -1 -45 11 7 -9 -18 -14 -19 13 -9 -25 10
7667 10 -13 -22 0 -28 -9 14 2 -4 -7 -32 -10 -10 -2 -7 3 -16 -17 0 -9 10 -4 25 21 -22 -7 8 -6 -6 14 2 -1 12 -11 19 3 -8
7703 -8 -2 15 4 26 -17 -24 -25 -28 -3 -11 -3 -27 -37 -8 -14 -20 -25 2 -33 -8 -22 -10 -11 10 -22 -14 -7 1 -1 25 2 -4 0 -9 15 10 -16 -5 8 20
7743 20 18 34 -1 -4 -11 -8 -25 -5 -19 -12 -24 -19 -4 -43 3 -10 -5 7 -12 -16 3 -19 -19 -34 -30 -11 -32 -26 -8 -5 7 -4 1 10 -19 -17 3 -7
7781 -7 -28 -5 8 -5 14 -6 -6 -20 -15 -9 7 15 -4 -25 -12 -16 7 8 -10 -12 -13 -6 -3 2 -6 -9 -23 -38 -4 4 5 -10 4 5 -8 -2 -2 -11 -7 10 -1
7822 -1 18 -12 25 -10 -2 19 -9 -15 -9 3 31 -2 1 4 -4 -21 0 -8 -14 11 -14 -15 -5 -17 -9 -27 -22 4 -18 -31 -2 1 -1 -15 -9 13 6 -1 7
7861 7 0 10 -37 5 -8 -14 13 -11 14 19 0 -9 -11 -12 17 37 10 -27 -3 -5 -3 0 -31 -34 -28 -23 27 -13 -24 -15 5 -6 -35 8 -11 -12 -1 -16
7899 -16 7 9 6 -12 12 22 12 -2 0 11 24 9 19 32 -1 21 0 -2 14 -7 9 -19 -19 -6 7 -4 -19 -20 -2 0 -7 -32 -27 -25 -30 12
7935 12 -21 -5 -15 3 -9 -5 19 16 11 -1 23 7 19 2 8 6 -9 15 10 0 16 -42 1 -8 3 -3 -12 5 -8 3 -21 2 6 -30 -10
7970 -10 -13 -26 -9 -22 -6 -27 -19 -13 2 -19 6 -12 1 8 4 5 15 -13 -4 -1 6 25 6 5 -18 8 15 -30 13 4 -10 -11 -13 -10 -26 -25 -20 -2 -7
8009 -7 6 -26 -28 -31 -51 -29 -13 -17 -19 -10 -10 7 10 7 -15 -5 11 17 -8 -4 -6 9 -27 2 2 16 19 -18 -4 -30 18 10 -22 -7 -11 -20 39 -14 -1
8048 -1 -16 -22 -11 -13 -7 -14 -24 -27 -6 2 -25 -26 2 1 -10 -29 11 -3 14 14 3 17 5 -4 22 -13 2 7 -10 1 -10 -9 -2 6 12 10 7 -10 10
8087 10 7 -6 -13 -6 -27 -15 1 2 -27 -4 2 -31 -19 -23 0 -9 -39 -11 -4 -16 0 -6 -4 -2 7 -10 2 22 -25 12 14 6 -6 -4 37 10 5 -9
8125 -9 14 -1 -25 -2 3 11 -7 -15 -6 -7 -20 -2 -2 -20 -31 -27 -10 -11 -22 -2 -13 0 -18 -11 12 11 4 -7 6 -16 -2 -17 -3 -5 9 1 5 -7
8163 -7 7 3 24 5 14 14 13 14 -11 0 12 -21 -4 -37 -6 3 -5 19 -9 -24 -19 -31 -29 -8 -27 -7 13 16
8191A6
$$ Imaginary data points
##PAGE= N=2
##DATA TABLE= (X++(I..I)), XYDATA
0 0 0 0 0 0 0 0 0 0 0 0 0 0 0 0 0 0 0 0 -6 8 -8 8 -8 8 -8 16 -16 16 -24 24 -24 32 -32 40 -48 48 -56 64 -72 80
40 80 -88 96 -112 120 -136 150 -166 183 -200 221 -241 266 -295 325 -359 397 -440 490 -549 614
60 614 -696 797 -919 1080 -1294 1604 -2081 2932 -4883 19050 -12854 -33625 30536 4741
74 4741 -26459 9073 18035 -15450 -2437 7676 -6304 1846 10434 -9440 -4547 9666 -1653
87 -1653 -4953 6825 -2436 -9115 386 3275 -377 1649 1748 -601 -2693 447 4999 1069 -4377 -74
103 -74 1207 -2614 1195 3454 -3141 -937 3346 -3520 305 9703 -3456 -9527 6710 3024 -10045
118 -10045 1848 6936 -6797 -3931 6545 1085 -2386 2235 -1091 -3299 3165 2488 -2311 792
132 792 1152 -3736 -1800 3552 2963 -1968 -2044 3248 1617 -2985 1675 2414 -4645 -1982 2957 -857 -43
149 -43 2057 -4247 -2627 5518 -88 -3606 5740 699 -9062 3260 7345 -6636 -1678 6707 -5183
164 -5183 -4647 8392 2048 -5172 2346 1479 -3543 2480 2762 -3383 204 282 -5314 1843 5969 -4136
180 -4136 -3468 4392 -427 -2866 3377 2177 -3023 -2452 -217 937 1356 -388 -1081 645 212 -284 2269
197 2269 1917 -1118 -1040 -633 227 2139 -910 -2671 1460 -57 -2892 2842 3471 -3435 -1860 2877 -606
214 -606 -1960 2014 -214 -3427 424 1271 -760 1964 843 -2996 939 3181 -1352 -504 2717 -1327
230 -1327 -3701 1634 3270 -1825 -1771 2148 48 -1862 1465 1715 -1370 -1375 -141 -127 739 688 -2131 -1646
248 -1646 2049 -176 -1906 3562 2034 -4968 -526 4519 -1088 -1925 2875 -416 -3404 1678 2232 -1428
264 -1428 708 802 -2750 941 3166 -2106 -1035 2083 -2472 -2169 3384 872 -2974 -216 680 -1003
280 -1003 666 1694 -163 -454 -726 -1020 1681 1626 -1813 -603 1056 -907 156 1869 153 -338 -553
297 -553 -910 1541 1394 -2140 -1001 1346 -1499 -1298 2936 469 -3092 474 1146 -1288 1542 1291 -2629
314 -2629 -89 1338 -1901 736 3046 -2133 -2335 3043 1125 -2087 1617 1645 -2871 -836 2303 -89
330 -89 -787 27 -1083 -178 1149 -149 -17 656 -1198 -1733 1107 1983 -1042 -1662 874 378 -1338 699
348 699 2168 -517 -1907 593 1577 -82 71 322 -1020 -119 842 -335 763 888 -2336 -1129 2327
365 2327 302 -1487 773 230 -2121 -125 1976 6 -1044 -245 -357 338 686 -177 504 114 -1588
382 -1588 331 2222 61 -941 -77 -102 73 357 137 642 -170 -2031 3 2636 -317 -2080 1066
399 1066 86 -2219 1130 1618 -1534 -245 180 -1425 1487 1908 -2235 -429 2367 -1587 -1312 3689
415 3689 380 -3823 840 2137 -1598 539 1896 -1630 -906 851 -767 538 1591 -1868 -1779 1774
431 1774 495 -1561 801 974 -1910 -705 1779 620 -543 -395 -471 49 529 563 707 -112 -930 -278
449 -278 660 1025 47 -1026 -102 407 -832 23 1744 -308 -2498 255 2138 -637 -1212 870 -251
466 -251 -1471 260 1158 621 -302 -1252 -165 1336 534 -351 139 84 -672 -322 935 1065 -383 -1133 70
485 70 984 -42 -269 619 -825 -1453 1033 812 -958 97 -94 -1400 680 1289 -513 323 262 -1995
503 -1995 188 2724 -876 -1821 2047 107 -2445 1870 2253 -2000 -593 1036 -878 595 1376 -1638
519 -1638 -866 1241 -1070 -785 2356 47 -2687 305 1190 -784 460 868 -1198 -527 482 3 822
536 822 533 -1151 -291 826 91 242 707 -504 -1004 197 863 450 -220 -911 -257 319 -551 390 1462
555 1462 -1149 -1946 1093 1034 -763 142 408 -877 -467 479 523 526 -300 -1225 276 1722 28 -732 696
574 696 15 -1259 209 1496 233 -1307 -798 588 248 -251 621 122 -1142 -275 479 157 249 -384
592 -384 -1249 153 1090 -339 27 1269 -1097 -1457 2103 1198 -1563 372 685 -1647 143 1660 -261
609 -261 -314 173 -1118 236 1863 -725 -1389 1114 -372 -1841 1323 1378 -1690 -706 627 -72 628 565
627 565 -740 10 102 -836 705 1590 -744 -1269 602 451 -166 673 223 -487 -135 -398 336 1214 -871
646 -871 -1429 812 205 -911 897 656 -1423 -550 819 253 300 277 -883 -301 735 -335 132 1359
664 1359 -770 -1517 1230 1105 -779 17 569 -677 -603 658 691 -284 -734 -530 163 623 4 -358 99
683 99 -232 -707 381 1212 67 -1333 -383 907 -73 -303 1142 118 -1298 223 1060 119 122 -125 -840
702 -840 145 748 -313 -14 552 -1237 -1095 1592 749 -1177 177 246 -1161 90 1000 -144 -379 -339
720 -339 -453 641 922 -344 -276 465 -420 -276 1312 581 -985 -432 39 149 499 -58 -51 287 -848 -527
740 -527 1398 334 -1496 -159 653 -576 -102 840 -282 -704 65 -147 622 1122 -912 -834 1199 -121
758 -121 -979 1284 738 -1581 -288 1282 13 -409 430 -317 -649 359 198 -7 371 -697 -959 783
776 783 654 -680 -94 458 -470 -514 818 899 -603 -828 268 492 91 155 269 -148 -600 -124 722 626
796 626 -153 -732 -185 539 -146 -366 601 -180 -1262 120 1024 -92 -513 -40 -168 -182 394 493 128 -267
816 -267 -742 -138 1001 370 -433 264 109 -561 203 699 232 -336 -662 -46 653 -56 -543 183 -18 -808
836 -808 186 983 -237 -704 -11 -287 26 741 -158 -348 332 -590 -202 1411 183 -1062 478 509 -861
855 -861 339 1175 -741 -799 673 -6 -117 723 -585 -806 771 -79 -641 949 184 -1502 -103 1057
873 1057 -121 -295 371 -272 -467 421 308 103 270 -523 -424 770 363 -346 184 34 -499 0 687 310
893 310 -566 -516 205 170 -133 197 300 -567 -785 406 784 -150 -280 -45 -218 87 346 194 352 -187 -724
914 -724 230 889 60 -482 -2 139 -226 46 619 158 -743 -546 354 491 -201 -141 89 -593 -426 583
934 583 359 -32 -145 -503 64 708 -150 -247 597 -279 -835 824 1023 -747 -411 641 -309 -184 923
953 923 -57 -604 105 -483 -203 1067 -108 -1122 322 394 -761 212 938 -565 -840 391 304 74 262
972 262 -389 -271 450 -66 116 905 -208 -964 261 639 -42 -77 109 -306 -310 129 360 300 -281 -710 111
993 111 459 -250 0 322 -609 -468 510 418 27 -158 -364 -8 369 125 60 305 -214 -726 314 905 -149
1014 -149 -465 97 -44 -199 195 341 -22 -511 -420 288 394 -8 -224 -247 -80 -3 70 459 169 -635 -351
1035 -351 581 414 -172 214 240 -622 -118 773 132 -283 -12 -358 -43 536 -164 -300 243 -399 -614 756
1055 756 662 -858 -512 418 -251 -161 682 84 -374 -82 -207 327 772 -335 -544 465 108 -366 545 531
1075 531 -614 -485 383 303 113 36 -375 -210 -24 -250 391 542 -726 -609 466 139 -151 247 17 -473
1095 -473 -100 290 329 313 -264 -565 360 524 -301 199 522 -668 -530 692 400 -224 -173 -202 -146 161 131
1116 131 46 59 -363 -610 275 710 -262 -444 208 -38 -246 312 486 -160 -532 -20 524 223 -52 32 -162
1137 -162 -187 47 274 391 -70 -620 -173 465 123 -346 142 98 -681 -126 803 66 -517 -93 -40 50 378
1158 378 55 -59 23 -346 -120 756 431 -475 -231 230 -112 8 458 13 -380 -239 -54 387 282 -524
1178 -524 -238 247 -301 -102 604 1 -659 -167 264 204 262 0 -330 44 6 -165 678 494 -844 -245 683
1199 683 -122 -151 543 -118 -591 148 304 0 85 -209 -520 200 377 -252 119 189 -721 -333 756 252 -293
1220 -293 -37 -24 -111 93 272 234 -23 -345 -166 483 372 -298 -125 215 -214 -122 421 239 -414 -464 96 323
1242 323 -52 -72 119 -312 -374 259 403 28 -207 -229 13 227 166 14 86 -79 -391 164 685 -22 -466 5
1264 5 74 -44 118 122 40 -333 -487 230 569 -129 -414 36 -39 -256 263 403 -173 -323 -135 80 456 210
1286 210 -358 73 182 -406 273 748 -322 -607 218 211 -109 181 50 -374 -118 -34 -39 495 27 -893 -8
1307 -8 578 -336 -90 572 -260 -595 235 393 66 35 -175 -207 294 181 -127 307 153 -607 -37 696 92
1328 92 -309 22 -75 -164 2 192 213 -263 -472 46 380 3 -217 29 -42 -288 128 405 53 -231 -236 57
1350 57 377 103 -91 110 -77 -299 151 451 63 -380 -255 147 117 -29 44 55 -267 -332 221 437 -114 -391
1372 -391 -77 48 73 137 138 96 -293 -352 405 512 -234 -166 171 -172 -149 395 246 -296 -170 -63 -50 321 68
1395 68 -419 55 27 -413 248 537 -514 -513 322 126 -111 259 114 -332 -107 91 191 449 -35 -526 190
1416 190 371 -254 110 395 -392 -395 259 270 -43 -138 -223 -88 98 -11 51 167 -322 -547 255 436 -120 -33
1438 -33 74 -236 -42 215 244 144 -203 -296 280 372 -85 -59 184 -173 -288 365 413 -207 -326 -113 24 177
1460 177 9 -54 8 -293 -297 297 429 -115 -342 -39 152 -28 94 270 -24 -330 -67 397 274 -115 -109 1
1482 1 -74 65 228 84 -85 -320 -201 378 252 -286 -17 118 -335 -89 499 134 -378 -105 103 56 233
1503 233 89 -177 65 -28 -172 436 383 -493 -284 317 65 -68 233 13 -340 -142 73 191 188 -274 -374
1524 -374 172 100 -176 226 136 -481 -151 354 178 35 -37 -172 14 127 115 272 131 -395 -259 439 228
1545 228 -180 101 -26 -344 27 248 69 -10 -279 -327 260 288 -205 -104 111 -268 -209 483 346 -321 -217
1566 -217 50 65 137 206 97 -54 -255 -68 360 204 -134 -156 30 55 -52 118 178 -221 -407 42 395 25
1588 25 -226 -46 -71 -224 132 365 34 -137 -193 -59 299 165 -175 96 82 -285 54 440 12 -379 -53
1609 -53 150 21 104 67 -148 -141 -182 19 410 74 -419 -73 176 -77 41 267 -74 -264 -95 209 301 104
1631 104 -263 -94 216 -53 -27 386 -84 -514 75 328 4 -4 -77 -269 -20 85 36 219 40 -501 -194 433
1653 433 79 -246 188 31 -352 67 343 99 -60 -136 -95 270 198 -79 49 48 -282 -106 463 184 -336 -215
1675 -215 25 -29 44 117 33 -169 -319 -21 311 57 -162 -96 12 -5 80 200 117 -205 -197 146 328 72 -106
1698 -106 -3 -5 -124 136 319 -24 -251 -151 19 172 41 -123 7 -56 -190 90 293 -37 -321 -87 133
1719 133 115 60 23 -41 -105 -137 162 394 -56 -322 54 67 -100 173 155 -219 -207 38 96 159 10 -281 -110 165
1743 165 -70 27 328 -160 -431 180 297 -54 83 44 -220 -55 163 112 180 -13 -347 -4 357 35 -149
1764 -149 159 -111 -354 177 292 -96 -171 -169 -78 122 73 0 35 -158 -281 109 358 20 -184 -16 16 14 150
1787 150 162 28 -122 -195 140 352 -35 -157 32 -41 -88 142 177 -73 -266 -154 98 155 -11 -130 -43 -88 -139
1810 -139 173 307 -92 -257 -19 154 137 17 36 50 -169 -78 326 218 -158 -169 8 52 73 85 25 -104 -149
1833 -149 -118 210 266 -196 -273 166 9 -141 235 160 -250 -182 130 162 121 -2 -161 -11 106 -61 146 288
1855 288 -258 -339 267 217 -147 55 3 -232 -69 103 129 82 -178 -246 87 216 -28 4 152 -163 -183 233 225
1878 225 -41 -79 -68 44 189 34 71 93 -212 -202 235 271 -122 -141 10 -80 -62 146 73 -112 -194 -176 144 220
1902 220 -130 -137 72 -45 -77 232 221 -121 -239 34 212 144 -10 -9 -45 -96 -16 228 210 -138 -223 -14 118 37
1926 37 4 10 -58 -223 -62 306 73 -256 -103 24 -13 93 148 20 -143 -129 19 215 210 -174 -123 121 -65 -41
1950 -41 301 109 -295 -124 119 102 28 -48 -93 -32 -19 -14 182 90 -319 -210 257 122 -55 103 6 -171 -31 136
1974 136 188 62 -202 -108 190 80 -58 80 51 -270 -67 245 109 -113 -110 -123 5 99 -10 74 44 -274 -122
1997 -122 314 170 -152 -27 56 -86 28 270 124 -101 -128 -18 215 185 -89 -67 47 -113 -42 214 115 -214
2019 -214 -232 34 133 7 -11 -14 -96 -168 -4 236 106 -147 -120 28 85 86 49 59 -64 -161 58 331 63 -222 -27
2044 -27 18 -4 103 181 -12 -191 -152 59 164 44 -185 -83 18 -117 8 239 -20 -264 -25 144 85 20
2066 20 -67 -38 -16 -15 110 263 -34 -255 -46 203 32 15 102 -128 -181 19 99 116 -7 -214 -69 130 28 -46
2090 -46 129 -43 -280 47 286 53 -88 -22 -92 -6 144 74 62 -21 -230 -23 281 65 -163 -12 3 -142 3
2113 3 181 50 -197 -119 -2 129 69 -87 -40 -30 -113 78 244 86 -161 -94 81 107 51 37 50 -108 -131 133
2137 133 222 -6 -186 -67 60 -18 45 67 -69 -164 -137 105 202 -90 -144 -30 -12 -40 119 171 -51 -217 -49 180
2161 180 154 9 -55 19 17 -30 139 233 -153 -210 44 122 50 25 -38 -86 -87 -55 118 185 -141 -262 74 144 -90 6
2187 6 129 -141 -152 137 154 72 -41 -180 9 136 39 42 125 -112 -195 96 284 3 -113 8 -92 -52 136 87
2211 87 38 -110 -209 59 205 9 -88 15 -56 -79 106 198 -20 -160 -81 93 118 16 -33 10 -88 -120 117 169 -112
2236 -112 -182 -66 9 16 35 7 -20 -127 -68 126 169 -46 -164 -4 79 11 80 124 -47 -154 29 196 127 -36 -82
2261 -82 0 -32 9 131 100 -91 -204 -30 132 61 -74 -51 -33 -83 -44 165 88 -165 -145 82 92 68 74 -30 -76 -43
2287 -43 64 203 154 -128 -117 99 84 -21 103 118 -210 -106 161 116 -13 -69 -102 0 44 5 67 37 -176 -147
2311 -147 147 189 -56 -54 25 -57 -25 132 124 3 -85 -75 137 140 -42 -22 24 -104 -13 142 116 -60 -149 -19 80 94
2337 94 1 -16 -2 -92 -74 181 154 -108 -89 45 51 28 62 60 -72 -99 -5 156 87 -92 -116 19 37 -27 116 58 -169
2364 -169 -134 14 126 42 -85 -55 -8 -57 41 166 32 -122 -90 48 146 61 -19 0 10 -42 34 194 57 -196 -71
2389 -71 111 32 17 38 -65 -115 -53 72 140 -8 -175 -137 59 38 11 84 0 -185 -45 135 124 -6 -67 -48 79
2414 79 47 34 128 23 -177 -49 200 120 -48 -38 -29 -92 15 87 62 -40 -160 -71 133 44 -61 33 19 -114 21
2439 21 169 54 -103 -104 14 71 85 28 -16 -32 -88 -4 211 63 -139 -79 15 -27 22 95 12 -89 -101 59 147 40
2465 40 -89 -65 10 0 40 148 26 -169 -96 82 135 28 -33 -19 -40 -58 63 147 -33 -161 -64 45 34 4 -26
2490 -26 -59 -82 -38 60 132 -40 -172 -7 109 10 38 108 -55 -117 5 153 174 10 -90 -10 62 19 40 94 -33
2515 -33 -169 5 133 22 -58 -56 -64 -22 -2 44 67 -114 -193 -2 139 38 -28 15 -52 -52 65 155 52 -52 -85 12
2541 12 146 52 -52 64 -27 -120 64 166 10 -131 -72 6 30 42 39 -38 -82 -114 43 173 29 -118 -45 21 -21
2566 -21 39 88 -13 -107 -57 115 141 -16 -84 -33 4 -13 84 99 -57 -169 -35 94 64 4 -31 -13 -56 -59 128 139 -50
2593 -50 -119 19 85 54 16 22 -50 -62 41 134 99 -59 -95 3 51 1 78 34 -115 -123 -5 123 59 -61 -110 -22 -5 -4
2621 -4 105 43 -89 -95 102 171 51 -3 -21 -8 40 86 124 82 -95 -112 96 113 0 7 -16 -59 -73 91 103 -32 -114
2648 -114 -70 8 51 -4 18 27 -55 -86 119 141 -30 -84 -17 32 49 78 66 -8 -100 -36 133 128 -21 -53 1 -24 -22 63 74
2677 74 -91 -103 -37 111 91 -45 -37 -19 -31 -12 103 76 -98 -102 0 66 41 19 15 -20 -65 -2 114 57 -113 -78 37
2704 37 63 16 4 -6 -68 -79 33 139 29 -107 -77 7 38 26 106 28 -76 -57 73 146 56 -76 -42 32 10 29 85
2731 85 23 -131 -68 82 56 -40 -29 -59 -75 -29 75 68 -11 -127 -76 103 64 7 27 -5 -82 -12 148 105 -44 -59 6
2758 6 81 57 69 35 -47 -104 -37 131 68 -64 -65 -4 -19 19 64 32 -54 -114 -29 97 66 -48 -43 -12 -36 15 124 50 -85
2787 -85 -67 29 92 72 -11 -19 -30 -40 48 117 56 -98 -89 51 50 -19 22 -19 -69 -53 34 82 26 -96 -32 26 49 48 34 9 -64
2818 -64 -38 76 119 16 -69 -28 14 5 66 83 -16 -127 -9 80 54 6 -51 -46 9 0 55 78 -26 -111 -8 101 71 -17
2846 -17 4 25 -47 39 121 97 -49 -95 -8 56 30 8 13 -39 -119 5 89 57 -104 -84 20 -2 4 31 34 -58 -99 27 126
2875 126 34 -42 -34 6 -13 53 81 58 -29 -61 57 107 56 -25 -25 -12 -32 52 106 -26 -123 -39 51 47 13 -60 -12 -71 -55 63
2905 63 115 -15 -118 -55 36 41 37 51 3 -83 -12 70 113 -16 -101 10 57 12 36 36 -27 -61 -40 83 76 -20 -47 -47 -14 8
2935 8 63 87 -48 -88 -2 99 34 -16 -24 -11 -20 26 65 64 -81 -100 5 63 20 -40 -20 -51 -77 5 80 39 -67 -51 26 63
2965 63 19 39 31 -31 -36 66 104 67 -65 -30 27 13 53 39 12 -68 -76 66 99 -17 -59 -27 -42 -45 43 51 -29 -97 -69 22 70
2996 70 21 -60 -40 -33 -27 91 95 -35 -88 11 85 77 31 19 -2 -45 2 99 100 -5 -91 -30 26 57 26 26 -52 -122 -6 71 48
3027 48 -39 -42 -24 -2 -5 78 53 -82 -88 13 88 63 -30 -22 -2 -14 37 96 71 -47 -67 33 78 9 -8 1 -42 -8 46 111 6
3058 6 -74 -58 73 76 36 24 10 -58 -60 59 109 -1 -90 -25 -3 41 12 21 15 -82 -34 92 60 -33 -58 -31 5 30 68 32 -29
3089 -29 -81 -42 64 108 -33 -18 40 -13 14 108 71 -37 -91 6 69 41 -4 -23 -22 -39 -15 82 55 -75 -106 3 39 2
3117 2 20 -13 -56 -62 9 96 43 -88 -56 -4 17 41 74 44 -30 -53 62 131 55 -29 -29 16 9 9 81 8 -75 -83 44 30 8 -39
3149 -39 -58 -38 -44 38 72 -3 -96 -33 65 70 -2 28 -17 -42 -15 75 76 -35 -69 -21 44 28 23 27 2 -55 -31 94 60 -59 -57 0
3181 0 36 27 43 64 -17 -65 21 112 56 -35 -34 2 1 14 55 34 -31 -84 -26 79 48 -23 -39 -6 -54 -22 69 18 -74 -102 9
3212 9 68 19 -49 7 -47 -47 15 99 16 -77 -8 42 63 43 46 33 -29 -41 43 75 3 -47 -36 -10 8 32 57 -39 -94 -82 53
3243 53 39 -5 -51 -44 -7 -9 40 78 12 -89 -22 66 88 31 -4 8 -26 21 45 52 -5 -77 -19 46 43 1 5 -33 -54 -8 70 55
3275 55 -26 -81 1 49 22 31 15 -29 -86 -21 85 46 -52 -35 -11 15 14 49 24 -52 -93 21 98 33 -21 -41 14 -28 45 53 43
3306 43 -46 -35 49 73 30 3 -7 -5 -13 25 50 4 -52 -46 11 56 25 45 -1 -60 -34 56 79 -20 -81 -49 22 16 27 35 9 -69 -36
3339 -36 45 71 22 -32 -25 17 9 86 70 13 -34 13 91 81 6 -2 -17 -1 -2 61 42 -36 -65 -30 42 28 2 -18 -37 -45 -13 91
3371 91 56 -53 -63 -14 28 50 13 10 -24 -39 62 91 56 -18 -39 9 46 32 66 28 -47 -68 19 84 26 -31 -20 -2 -10 11
3401 11 52 4 -60 -77 35 57 10 -8 -34 -38 -10 58 49 20 -76 -17 48 46 -2 26 -11 -29 -44 68 71 -30 -49 -28 27 14 9
3432 9 30 8 -43 -30 67 37 -13 -30 -11 21 9 40 68 -21 -71 -6 53 30 -2 -45 -25 -8 16 26 4 -59 -85 16 54 19
3462 19 -6 -24 -45 -22 25 101 49 -16 -68 31 61 55 67 -8 14 -19 50 82 30 -51 -44 10 26 10 11 22 -83 -32 13 57 -1
3493 -1 -59 -51 12 5 41 28 -10 -47 -21 55 67 5 -16 6 4 -3 63 81 -7 -57 -16 73 43 17 -3 -4 -52 14 51 38 8 -85 2
3526 2 24 17 2 13 -9 -33 9 61 76 -38 -69 -9 11 45 54 10 -36 -57 18 76 2 -30 -55 -25 12 11 48 41 -40 -44 45 58 52
3559 52 -10 -6 0 10 53 76 22 -40 -4 9 97 26 -15 -1 -41 -22 31 67 12 -87 -48 15 19 4 5 -18 -33 -19 26 52 -21 -61
3591 -61 -20 16 51 44 26 18 -55 -24 68 79 -21 -23 -13 -6 14 13 43 -5 -65 -21 46 25 -13 -35 -17 -16 -12 34 35 -40 -79 2 24 12
3625 12 1 -20 -26 -28 -8 84 48 -9 -30 11 38 45 34 20 -21 -25 37 71 36 -59 -38 7 16 35 16 18 -50 -71 24 81 10 -35 -33 6
3659 6 16 19 53 10 -51 -24 13 53 34 -24 -44 -39 -29 14 43 -19 -66 -18 28 62 37 17 -4 -39 -9 33 53 9 -14 17 56 31
3691 31 20 41 1 -19 17 42 39 -25 -33 -22 20 1 28 7 -38 -70 -32 55 39 -15 -38 -24 -2 -2 46 49 -27 -38 22 68 58 16
3723 16 0 0 12 37 53 47 -40 -13 27 48 28 15 -27 -45 -20 54 51 -1 -43 -28 11 38 13 42 -17 -34 -24 48 73 9 -45 -40
3755 -40 -13 14 30 28 3 -24 -35 64 58 23 -33 -11 -14 -6 40 62 -13 -52 -13 29 5 3 -10 -18 -21 -18 46 61 -20 -44 -21 61 36 13
3789 13 3 -47 -64 -6 66 9 -47 -70 -33 50 18 1 17 -37 -33 9 71 46 -7 -3 5 16 28 66 40 -10 -13 42 42 10 -2 -12 -2
3822 -2 -14 43 53 -3 -65 -55 46 48 -13 -12 -21 -27 -17 37 36 -9 -48 -16 12 24 25 23 16 -22 -1 51 81 4 -36 -7 32 41 45 47 -7 -31
3858 -31 11 49 64 14 -49 -19 12 15 25 25 -57 -71 -23 30 25 -1 -23 -4 -19 22 32 20 -28 -32 5 56 -5 -9 2 -11 -28 21 48
3891 48 23 -37 -20 11 19 -3 37 7 -11 -34 16 63 10 -13 -26 18 20 -9 38 11 -36 -3 16 26 -19 -40 -16 6 -24 6 27
3922 27 -16 -41 1 21 42 27 -21 -9 -10 2 59 41 -3 -36 5 47 53 13 9 11 -31 2 49 33 -23 -21 2 14 29 19 8 -20 -38
3955 -38 -40 46 41 -39 -55 -40 -20 -2 19 21 -21 -51 10 52 38 -8 -11 6 22 42 52 51 -18 -46 37 45 45 -4 3 7 -37 24 48 32 -31
3990 -31 -29 21 39 27 4 23 -28 -28 11 19 15 -43 -19 -6 31 1 5 -10 -35 -19 24 29 24 -27 -12 -7 12 11 9 24 -32 -29 40 56 19 22
4026 22 -9 2 -15 18 44 -27 -18 -10 57 39 7 -9 -49 -27 -16 61 27 -13 -35 -11 19 -4 11 7 -18 -40 -20 17 38 -31 -13 6
4058 6 2 10 30 13 -24 -20 32 61 11 -9 -12 30 -4 64 72 0 -41 -38 34 67 25 -17 -46 -25 -49 29 28 17 -28 -41 38 8 2 -2 -3 -14
4094 -14 -1 61 62 10 7 -2 45 40 17 46 11 -28 25 68 54 11 -16 -28 0 15 9 14 3 -36 4 36 22 -1 0 -48 12 42 30 27
4128 27 -29 -65 -7 65 12 -2 4 -16 -9 14 38 26 -48 -5 18 30 19 -18 15 -8 -15 16 45 37 -16 -28 -3 45 16 10 24 -30 -4
4161 -4 7 25 12 -49 -19 15 4 9 43 4 -29 -19 28 34 -9 -44 -17 -21 1 14 34 -1 -28 -13 17 61 6 15 -21 -2 20 47 36
4194 36 14 -20 15 41 12 35 21 -18 -13 -9 38 2 -52 -34 -25 -1 -1 12 10 -49 -43 -15 31 -1 -26 -28 6 15 34 48 28 -25 -38 26
4228 26 78 44 -20 17 14 17 37 51 26 -28 -22 26 37 10 17 13 -6 -4 1 50 11 -20 -26 14 36 11 14 -6 -5 11 25 22 1 -23 -10 15
4264 15 31 4 28 16 -18 -11 25 33 26 -15 14 2 -1 33 46 -9 -40 7 21 21 -15 1 -1 1 14 39 42 -18 -26 5 20 28 -18 -17 -62 -17
4300 -17 6 27 2 -26 -34 -8 38 -10 30 38 -15 -13 18 36 22 -8 -15 15 35 33 62 23 -12 -6 8 40 19 -10 -5 -12 -2 12 7 17 -48
4335 -48 -36 7 35 13 -25 -24 -18 -28 24 36 2 -62 -18 17 28 28 7 23 -10 9 34 44 -7 -28 8 14 21 35 18 -4 -4 11 32
4368 32 33 -2 -17 1 10 1 36 8 -14 -31 -8 1 18 2 -21 -17 21 14 18 17 -10 -3 14 26 23 1 11 -6 0 28 23 49 -39 -15 11 29
4404 29 15 12 24 -6 -5 25 31 18 -34 -16 2 19 25 27 -29 -41 -36 15 10 5 -59 -2 10 1 21 13 -15 -12 -12 19 34 -4 -1 22 4 6 36
4441 36 35 -18 -31 -32 24 54 16 10 -7 -5 -7 24 23 0 -39 -16 -13 38 13 -6 -6 0 4 16 13 -29 -39 -34 1 -5 13 5 7 4 3 32 13 8 -37
4480 -37 4 -8 17 21 34 -10 -32 26 33 18 -25 -6 6 -11 7 35 -6 -26 -19 6 -11 1 16 4 -28 -12 11 -5 -15 -34 -51 16
4512 16 14 -3 19 6 -19 19 31 30 23 -12 -10 27 14 16 33 -10 -16 17 35 38 12 -27 23 5 20 24 33 24 -50 -10 15 13 -7 -24 -46 -28
4548 -28 12 11 0 -36 -14 -20 7 21 30 11 -4 -8 -4 49 23 2 -12 0 26 33 45 -1 2 -15 -4 55 28 -25 -13 -4 -2 3 32 0 -28
4583 -28 -27 25 26 -19 -36 -20 -6 8 -15 1 -17 -21 -13 43 -1 9 -14 6 -2 3 26 43 23 -23 1 15 30 15 6 -2 10 10 16 45 5
4618 5 -11 -7 1 40 4 12 -4 -13 2 32 55 -2 -11 -9 29 0 6 11 -24 -50 8 22 18 -19 4 -18 -11 20 23 48 -4 -2 8 34 27 -5 -6 18
4656 18 -8 35 35 14 -9 -31 23 32 10 -5 3 -18 -3 11 22 2 -66 -10 1 -4 5 7 -33 -31 -17 5 17 -17 -42 3 16 6 32 19
4690 19 5 -31 0 18 22 8 6 30 12 37 24 25 18 -30 -13 38 19 -7 1 2 -25 -23 11 14 -5 -22 -24 9 2 -5 10 -35 -3 -4 20 37
4726 37 -11 4 0 -13 6 17 5 -9 -14 5 38 -2 -7 -13 -10 15 22 33 17 3 3 21 31 25 2 -14 -2 -15 7 14 1 -26 -19 12 22
4761 22 -7 -29 -19 -34 -28 21 4 1 -28 15 15 18 27 -7 1 4 -22 11 27 22 2 3 22 34 25 25 6 -23 -9 12 23 6 -34 -15 -7 -4 24
4798 24 34 -28 -41 -17 33 21 -15 -12 -42 4 -14 26 25 -21 -19 3 27 0 16 16 9 -10 35 53 25 13 -3 30 41 16 18 18 6 9
4832 9 -2 32 9 -32 -10 1 -7 -9 -3 8 -28 -18 -14 33 -8 -10 -3 4 4 4 14 -17 -28 -2 33 11 25 6 23 3 11 54 42 13 -15 6
4868 6 20 -5 3 9 -5 -24 2 55 46 8 -6 -17 0 -7 -3 12 0 -30 27 29 19 -26 -26 -19 -14 11 20 -15 -18 -29 -18 10 44 15 -7 1 -16
4905 -16 16 3 22 21 -8 7 44 37 2 7 13 -6 24 31 0 -6 -9 1 11 13 -28 -5 -40 -15 4 -7 12 -30 -25 18 16 44 -1 7 3 7 5
4942 5 37 24 -8 14 13 4 18 24 -1 10 -24 5 41 8 -11 -16 -14 -6 -3 6 -5 -18 11 15 -17 7 -8 -27 -9 -1 24 22 -28 -19 7 31 9
4979 9 21 15 -17 -7 25 22 14 -3 -4 1 14 18 35 3 25 -2 20 6 4 4 -8 -11 15 15 -4 3 -24 -20 12 48 29 -21 -14 3 -4 5 14 -2 -21
5018 -21 -2 -4 -3 -4 8 -15 5 8 28 25 23 -3 -3 10 30 19 33 16 4 5 44 53 5 -17 -2 26 -9 6 10 -11 14 -12 12 3 -23 -20
5054 -20 -6 -7 6 6 -3 -15 -15 3 21 4 6 -10 12 7 36 30 24 11 -11 -10 31 -2 18 18 -14 8 15 37 -9 -6 -13 11 17 -16 10 8 -21 -4
5092 -4 13 28 -18 6 -11 -15 -18 16 31 22 -8 -2 18 12 14 0 -7 7 -4 11 44 19 -6 -8 7 27 7 -17 3 -19 21 41 40 -19 11
5127 11 -6 35 16 9 17 3 1 10 25 18 -20 -20 -17 10 -2 2 7 -20 -55 9 23 13 -14 -14 -2 0 3 16 15 -4 -34 23 31 34 13 2 -5 18
5165 18 -8 25 22 -30 -22 -5 30 13 17 -19 -25 -13 -22 13 -10 -46 -54 1 3 9 10 -16 9 -3 22 25 3 -19 -38 22 39 15 14 27 -6 19
5201 19 56 29 12 20 4 -7 22 9 4 38 -18 -16 -4 0 -2 -28 -14 -29 -22 -7 -4 -9 -33 -9 0 29 16 11 -16 -14 15 32 21 -8 -2 7 20
5238 20 24 20 5 -5 -21 12 32 -1 13 -8 19 30 17 28 13 -24 21 19 30 42 -17 -28 9 -23 3 -16 -3 -29 4 -10 5 -23
5270 -23 -29 -11 -6 -6 -2 25 1 -26 24 33 21 43 13 29 10 5 14 39 22 8 -3 20 1 4 10 21 15 -8 41 1 -4 -13 14 9 -12 16 -19
5307 -19 -14 -22 -2 13 24 -17 -7 -18 13 16 11 33 -7 8 13 37 45 31 8 21 23 9 30 19 4 12 17 20 13 4 19 -14 -3 18 25 10 1
5344 1 -12 -2 7 -10 15 -11 -14 -2 51 19 4 -13 -9 -10 6 20 7 -12 -4 -10 11 25 22 9 34 10 27 12 40 10 -3 -2 18 41 5
5379 5 6 1 -24 4 19 -5 9 -31 0 -2 -18 8 -19 -13 -15 -11 21 1 -12 -9 15 3 16 25 -1 0 -2 32 26 -14 23 5 44 25 16 30 28
5416 28 -4 0 25 24 9 18 11 -25 24 28 25 -4 -27 -31 12 12 -16 -15 -29 -22 -23 -22 0 -2 -5 -13 2 26 23 13 2 9 20 13 16 -4 14 8 -18 13
5456 13 5 12 4 -25 -2 -7 9 -14 -23 0 10 25 -8 10 -7 -7 -1 -1 8 -8 -18 -28 -24 18 25 11 2 -1 16 -1 14 11 -7 -3 -4 15 21 27 8
5495 8 20 14 39 24 22 -10 -38 1 18 13 -6 -7 -15 -18 7 10 -21 -11 -5 -7 -13 -2 12 -12 -36 -7 9 13 10 16 -27 -4 12 2 6 13 -9 4
5533 4 -1 14 20 34 -10 -6 28 33 12 27 28 15 7 26 41 -12 -18 -25 11 -9 -8 17 -9 -5 -23 12 25 -18 -16 -2 44 -18 11 9 -16 -7 17
5570 17 23 14 4 4 1 6 0 10 22 -10 -5 4 12 5 23 0 -3 -2 6 33 4 -4 -18 23 12 6 1 -10 -4 11 7 9 6 -29 -4 0 -19 -6 10 13 7 -13
5612 -13 26 32 7 1 3 6 25 22 20 7 -19 -16 17 15 13 18 12 1 11 -11 21 5 -5 -4 21 14 -10 6 -23 -14 -3 4 -8 -10 -15 -12 -25 15 1
5651 1 -9 -14 13 15 31 9 12 -7 23 15 19 21 16 7 4 23 37 29 31 -9 9 -6 19 1 1 -16 -13 -1 -7 -22 9 -3 -27 -7 -20 23 6 -21
5689 -21 -4 -16 -7 10 -19 3 2 9 18 26 -5 -22 14 -9 12 22 -16 9 -19 1 11 36 13 -5 3 9 9 48 7 1 -25 -16 10 -9 -10 -10
5725 -10 -28 5 0 7 -12 -29 -9 1 6 -6 5 4 -11 -6 26 1 6 -25 -20 27 31 9 24 13 8 10 2 14 4 1 7 9 10 47 -4 -20 -25 -16 -16
5764 -16 -5 5 -5 2 -5 -3 0 -12 -15 -50 -23 -26 17 12 -3 -30 -8 -5 23 31 11 -16 8 34 24 -9 21 27 16 29 38 25 -11 -6 -13 9 8
5801 8 9 -11 5 -14 -18 3 -2 -16 -11 -15 21 14 -8 0 5 -5 -4 25 -1 9 -15 5 -10 30 3 13 -13 15 21 24 -16 13 17 1 15 16 12 9
5839 9 13 -10 26 -1 5 -8 -9 -5 -13 9 -7 9 16 -8 1 33 0 17 10 2 1 12 -9 3 -5 -13 -4 1 12 18 14 -3 -11 21 28 -16 16 3 -3 5 33
5880 33 6 4 16 18 25 33 4 -17 -17 -8 6 9 1 -28 -12 -11 2 -4 5 0 2 -7 15 36 11 2 8 -18 27 7 13 28 -19 -14 33 22 19 17 2 13
5920 13 24 12 7 -1 -7 5 16 12 -1 -8 -14 14 15 3 0 -12 -21 -13 -12 16 25 9 -15 15 16 8 16 0 -13 -4 14 19 -1 12 14 -19 12 13 18 1
5960 1 -9 -8 23 27 -11 1 11 15 -2 40 26 -12 -14 24 7 24 32 10 5 4 -17 14 23 4 -20 -9 8 7 1 12 -13 -27 1 10 14 17 6
5997 6 -11 12 17 30 37 28 5 24 32 3 11 9 -18 17 12 32 -4 -12 -17 1 27 -10 0 -15 14 -20 17 38 9 -37 -21 -1 6 8 21 23 14
6034 14 -10 27 22 -6 7 10 11 13 27 16 32 -2 12 26 14 27 -10 -3 -17 -25 25 -10 -17 -18 -4 13 -8 0 -11 -18 -20 0 19 30 -5 -11
6070 -11 46 -7 20 4 0 -27 -10 29 43 28 -4 3 -3 17 9 12 7 2 8 14 22 36 10 -9 8 -1 -1 2 19 0 -14 2 8 25 -1 -25 -7
6107 -7 -5 7 -14 -13 -35 -13 -2 0 18 -9 6 4 -9 28 -7 -23 10 9 -1 53 32 29 19 21 -3 37 22 26 13 -2 11 0 12 19 -13
6142 -13 -9 1 -12 4 -10 -10 -13 -20 0 27 8 -6 -16 -7 16 21 15 9 15 -9 5 9 -11 0 18 6 17 15 7 20 8 -25 14 22 2 -27 -24
6179 -24 14 14 8 -6 -15 -6 -20 5 9 -2 5 -8 10 10 3 10 -8 -16 1 29 18 -17 -14 -3 21 -4 5 -2 6 -5 -22 20 30 -2 11 28 -8
6216 -8 32 32 15 6 -9 3 23 -1 -4 6 8 -12 9 38 22 -18 -4 -23 -27 27 -8 31 -20 -8 9 13 14 30 35 -7 22 -17 8 13 14 -5
6252 -5 7 -17 3 -22 -15 -12 -4 29 7 46 12 -22 26 12 -17 0 4 -6 -8 -3 -2 11 -13 -28 -16 -7 -20 0 -1 -26 -19 -11 18 2 8 -3 -21
6289 -21 1 3 23 15 8 -21 25 1 13 -3 6 10 -3 32 -11 -18 0 18 -22 13 4 -10 -12 34 -16 9 -14 -9 -24 -5 -2 -5 9 -27 -11 -23
6325 -23 2 8 -15 13 17 3 1 -11 -6 -3 29 -8 27 4 23 -7 -4 3 17 7 14 27 -8 4 4 17 12 18 -2 4 10 27 4 -16 -13 -4 26 33
6363 33 -10 -2 -3 -20 -1 3 11 9 -8 -7 2 2 33 17 1 8 9 40 29 13 -2 -1 14 34 32 6 -23 -7 -23 18 3 -6 -28 -26 -20 3 0 -19
6401 -19 -25 -12 -2 37 -3 10 1 1 8 -13 13 17 -12 -16 0 0 8 32 0 32 16 17 25 5 -7 4 18 6 -1 28 15 5 -5 -11 4 -14
6437 -14 -11 -32 5 3 -2 -1 -12 6 13 -1 18 -35 -17 -7 1 2 -1 34 -8 -1 -6 41 9 14 34 3 11 14 13 25 -22 2 -6 -1 19 -19 -7 -12 -2
6476 -2 27 10 2 13 -15 13 25 -9 12 -11 -10 -9 -14 -10 -7 7 10 -6 -19 5 8 9 -7 4 2 16 22 3 -7 9 15 18 52 16 19 12 3 36 38
6515 38 -18 -25 11 6 -5 6 9 -14 2 -12 -2 -10 9 -9 5 -18 -10 -2 -17 -22 -10 15 0 -5 -2 1 -24 -14 2 32 2 -6 -12 35 30 15 1
6552 1 9 6 -19 25 13 10 -7 6 -4 -21 -31 15 -11 -7 -5 -18 0 -24 15 -13 -29 26 9 4 2 -37 -25 17 11 36 5 0 19 0 8 1
6588 1 -2 -2 7 10 9 7 14 -14 17 1 0 14 -16 -15 12 4 3 -7 -16 -4 -20 -4 11 -14 -18 -2 0 -12 -21 -4 9 15 -20 -4 22 26 6 -3 3 16
6628 16 18 28 7 -9 -25 3 26 31 -8 1 -5 -5 14 50 -8 6 -19 -5 12 30 2 -9 -5 -3 5 -1 -18 -15 -17 6 -10 -8 3 -2 -5 9 24
6665 24 24 0 -3 8 12 11 31 -8 0 0 -12 -1 30 10 -2 7 -6 20 5 27 -16 -15 28 24 11 13 7 -15 14 -1 1 -6 -18 -7 -12 -8 4 6
6703 6 -9 -2 -10 32 2 -9 -31 12 17 17 16 18 -15 -2 -3 10 39 24 22 3 0 -15 10 28 19 0 -21 38 -10 14 -10 -1 -18 7 -3 -17
6739 -17 -13 -10 -18 24 -7 2 5 -17 -9 16 19 24 30 -7 20 1 28 16 8 21 9 11 19 -5 19 -12 12 9 -3 44 0 2 -19 7 14 2 -17 -20
6777 -20 -5 24 4 -3 4 5 -16 -10 -20 -23 6 13 -11 -1 28 21 -2 -22 24 1 1 24 19 1 13 9 31 9 -4 12 12 23 9 20 -3 29
6813 29 1 -18 -2 14 11 -3 -6 -6 -11 5 -2 -36 -18 -15 -1 -2 -17 13 -27 -1 -23 6 16 -26 -3 -18 36 15 27 9 16 23 5 23 18
6848 18 4 -28 11 19 -17 14 57 -4 -12 13 -26 20 -3 -33 14 -18 3 -38 12 -8 -16 6 -10 18 -24 -13 -16 13 23 33 13 13 29
6881 29 -6 -7 4 13 18 20 13 27 2 -4 -13 8 39 9 11 -25 3 -6 -13 1 1 -8 -5 -1 -3 7 11 -1 -6 12 -4 -13 29 -23 -20 20 11 -6 5 29
6921 29 -3 -14 10 12 6 28 6 -25 12 8 11 37 -33 -11 27 6 25 13 -12 8 15 -1 -6 4 -8 -43 -6 -21 -19 -13 -17 -12 -32 -13 18
6956 18 -34 -9 -1 -14 -7 10 23 23 -13 11 20 19 2 22 -16 22 18 -1 16 -10 -8 -6 8 14 -34 5 -27 -7 21 -3 -7 -3 -21 -7 -9 8
6992 8 12 -13 -22 -14 -3 6 -4 16 -3 -3 16 21 17 17 1 1 -2 44 14 8 4 -11 12 15 23 12 -13 -4 2 -25 9 -6 -3 4 -9 -17 -6 -9 5 -6 14
7033 14 -22 5 4 -12 6 -26 -9 23 17 4 7 7 2 0 15 2 13 -3 20 -3 -5 -3 11 8 3 -9 -6 -5 -9 -2 6 20 2 22 13 -11 2 12
7071 12 -31 -14 -25 -4 -13 -4 -34 -23 11 -14 -5 6 -7 -12 -18 -11 -9 4 11 9 1 12 33 4 25 15 14 15 8 9 11 20 -4 -4 -2 23 -5 -2 -6 2 -1
7112 -1 -22 -1 -3 0 -13 20 4 -17 7 -18 10 -12 9 18 3 -1 10 25 16 34 10 7 -12 14 25 31 29 4 -18 -6 32 3 11 12 3 -11
7148 -11 12 5 3 3 7 -2 11 17 18 -11 -1 -10 20 24 -17 -7 14 -19 -8 16 -7 7 6 27 18 -5 -5 2 -2 15 27 -6 11 14 15 10 18 22 19 30
7188 30 21 -7 18 21 27 17 -24 12 -4 17 -10 8 -13 21 22 -12 -4 -19 -23 23 8 -19 -31 15 9 -28 6 -3 15 3 -6 -3 6 1 -21 23
7224 23 -15 -6 -8 24 21 3 12 10 4 15 -5 3 -3 -9 -14 -14 15 -15 -6 -21 1 -18 -40 -12 10 -16 -7 -21 -11 1 -21 -14 -2 13 36 4 13 -12
7262 -12 3 0 1 28 9 -6 10 3 -1 -16 -10 7 13 3 14 17 -18 -5 -2 -10 -13 -10 -25 26 -20 -13 -1 -9 -14 -20 1 6 2 -15 -5 -5 -13 19 20 1
7302 1 12 22 9 12 10 39 -14 -7 10 16 -2 -10 4 2 -15 -2 -5 36 28 -12 6 11 14 -15 -9 13 -10 6 12 11 -11 -19 -31 0 -16 0 7 -25
7340 -25 8 -11 -21 3 5 -4 27 28 1 20 12 7 -2 5 -19 -5 6 -17 15 -28 5 -7 -23 -7 -6 -3 3 5 -15 -17 -26 -16 -3 -12 -3 -17 0 0
7378 0 -1 16 -16 11 0 12 23 13 7 4 2 13 -5 12 23 2 -4 6 14 -11 -27 5 34 6 -5 20 -6 -12 -5 -2 12 5 -9 -7 -19 -11 18
7415 18 -22 -2 15 -18 -11 -4 3 4 36 18 -18 -3 -13 1 22 -1 11 4 9 -2 4 -28 -2 21 11 11 0 -7 0 -14 3 -16 -8 -15 -1 22
7451 22 -13 10 -11 -11 0 -18 0 6 9 -18 5 -11 -8 18 5 -7 22 23 15 29 4 3 0 -2 6 30 1 19 7 4 8 11 -9 -23 -11 4 33
7488 33 6 -6 -4 -8 3 11 2 1 3 -14 -17 -27 1 -18 -19 0 3 -9 -25 9 -5 -14 -2 15 25 5 11 -22 2 38 -9 18 -16 -9 11 4 13
7525 13 -1 -9 21 -9 -17 -9 -14 0 -8 -29 -3 -22 -14 -14 -3 -17 2 0 -20 -13 20 -1 -24 4 7 -9 -7 18 12 -7 16 -5 -10 12 17 15 22 -4
7563 -4 -12 0 26 13 17 19 5 3 6 24 -2 -16 0 -18 -5 -22 -4 -12 -14 -14 6 -25 -10 11 9 20 -16 15 5 15 8 4 30 11 23 -5
7599 -5 -17 8 -17 22 8 10 -10 -8 19 9 27 2 1 -6 7 -1 1 12 -1 2 9 -7 -11 0 5 -3 -15 -18 -6 -10 -19 4 -6 4 15 -6 -7 -7 11
7638 11 -8 21 1 22 3 20 11 14 -8 -7 12 -3 10 32 6 -1 8 7 -7 10 4 -9 -11 -9 13 3 5 2 7 5 -24 -15 -12 -5 6 -2 -1 -12 28
7677 28 -17 17 10 22 3 30 5 25 19 42 11 11 52 17 19 0 -1 11 5 27 -17 -10 -1 -12 12 -36 -3 10 5 8 6 10 16 -12 -3 -7 11 13
7715 13 5 17 9 31 -7 6 1 2 1 28 16 0 40 5 -1 10 10 -15 13 8 23 7 -2 1 -6 -3 5 0 2 -16 -14 12 -4 -12 -1 12 -6 -25 1
7754 1 0 20 -28 6 32 5 20 2 9 8 -3 30 -7 10 21 -15 -2 -6 -10 -9 5 9 -14 8 7 33 -32 1 2 -12 -2 4 8 -19 2 3 -3
7791 -3 -3 -35 -13 3 -18 2 -16 21 -10 17 -4 24 8 -4 20 5 -8 -1 25 -11 34 1 19 -11 3 8 -6 0 7 -9 12 13 -2 5
7825 5 4 14 -4 -10 -6 7 5 -30 -31 -19 -17 6 -1 3 1 -11 -6 2 19 10 0 -4 -3 14 -2 13 15 8 7 -4 -6 20 -9 -25 15 16 10 24 6 3 10 -5
7867 -5 23 4 31 16 -13 -22 1 9 -6 -16 0 13 17 5 21 5 -6 0 4 -10 -5 12 8 7 12 20 1 13 10 -11 12 17 18 19 25 13 -15 14
7905 14 15 0 9 -24 6 23 -2 -11 -16 -26 -9 -5 -4 -6 -21 4 -18 -8 -16 10 -1 3 -11 14 -7 -22 16 -12 16 4 4 22 0 -3 9 9
7941 9 1 8 -12 -2 37 21 9 10 -15 -12 -20 -4 -1 10 -7 -3 19 -2 -15 -15 -18 -1 -23 -10 9 8 35 4 14 -1 41 24 -4 15 1 22
7977 22 19 -5 18 -4 23 3 11 5 -11 0 7 -6 17 -2 -19 -10 -27 -7 10 13 -1 13 -4 -1 16 -6 2 1 -22 17 7 4 6 3 -9 -21
8013 -21 6 -18 -10 0 13 29 24 10 8 -10 17 2 13 8 22 20 11 3 -21 17 7 -15 -21 -10 16 -10 15 -8 10 16 28 24 24 -21 -13 26
8049 26 16 -24 -4 1 -7 16 15 -12 -7 25 14 -3 25 -17 1 32 10 -4 -25 23 27 7 11 -1 11 -4 16 -16 0 12 14 12 -8 -5 -2
8084 -2 7 -10 -11 -17 -8 -19 -28 -3 7 -20 2 -19 -10 33 15 26 5 10 -13 -1 8 27 6 -19 12 28 5 11 -5 3 14 14 -6 1 -12 -7 23
8121 23 8 11 -12 0 -5 2 -9 -9 0 -1 -4 -19 -8 20 -26 -24 4 -2 10 5 -9 7 3 25 1 26 9 18 36 9 2 22 36 0 3 -19 13
8158 13 15 -2 6 -30 -3 5 -20 0 12 0 -5 27 2 19 5 16 -2 -26 -16 -2 20 6 18 3 0 10 8 14 21 -15 8 27 7
8191G
##END NTUPLES=NMR FID
##END=
