##TITLE=1H_AM_NVPIOXANE
 
 8 sc, 
 24.3.2023
##JCAMPDX= 6.0         $$ Bruker NMR JCAMP-DX V2.0
##DATA TYPE= NMR FID
##DATA CLASS= NTUPLES
##ORIGIN= UXNMR, Bruker Analytische Messtechnik GmbH
##OWNER= root
$$ XWIN-NMR		Version 3.5
$$ Fri Mar 24 14:19:08 2023 Russian Standard Time (UT+4h)  she@DPX200
##.OBSERVE FREQUENCY= 200.13135
##.OBSERVE NUCLEUS= ^1H
##.DELAY= (6, 6)
##.ACQUISITION MODE= SIMULTANEOUS
##.ACQUISITION SCHEME= undefined
##.AVERAGES= 8
##.DIGITISER RES= 18
##SPECTROMETER/DATA SYSTEM= spect
##.PULSE SEQUENCE= zg30
##.SOLVENT NAME= DMSO
##.SHIFT REFERENCE= (INTERNAL, DMSO, 0, 15.7039)
##AUDIT TRAIL= $$ (NUMBER, WHEN, WHO, WHERE, WHAT)
$$ ##TITLE= Audit trail, XWIN-NMR		Version 3.5
$$ ##JCAMPDX= 5.01
$$ ##ORIGIN= Bruker BioSpin GmbH
$$ ##OWNER= she
$$ F:/spectra/data/she/nmr/H-F/1/audita.txt
$$ ##AUDIT TRAIL=  $$ (NUMBER, WHEN, WHO, WHERE, WHAT)
(   1,<2023-03-24 14:17:56.82 +0400>,<she>,<DPX200>,
      <created by zg, POWCHK disabled, PULCHK disabled
       configuration hash MD5:
       00 E9 B6 7A A2 85 ED C7 34 08 36 98 17 FE 4E 26
       data hash MD5: 16K
       E6 BC 5D B5 ED 44 CA 01 53 09 61 19 36 9D 0C 94>)
$$ ##END=
$$ 
$$ hash MD5
$$ 2F 20 93 A5 2D FE FE 56 8B 2B 4B 20 B7 E5 BA 9F
##$RELAX= 
##$RELAX= 
##$RELAX= 
##$RELAX= 
##$RELAX= 
##$RELAX= 
$$ Bruker specific parameters
$$ --------------------------
##$DU= <F:/spectra>
##$EXPNO= 1
##$NAME= <H-F>
##$PROCNO= 1
##$TYPE= <nmr>
##$USER= <she>
##$AMP= (0..31)
100 100 100 100 100 100 100 100 100 100 100 100 100 100 100 100 100 100 
100 100 100 100 100 100 100 100 100 100 100 100 100 100 
##$AQSEQ= 0
##$AQ_mod= 1
##$AUNM= <au_zg>
##$AUTOPOS= <>
##$BF1= 200.13
##$BF2= 200.13
##$BF3= 200.13
##$BF4= 200.13
##$BF5= 200.13
##$BF6= 200.13
##$BF7= 200.13
##$BF8= 200.13
##$BYTORDA= 1
##$CFDGTYP= 0
##$CFRGTYP= 5
##$CHEMSTR= <none>
##$CNST= (0..31)
1 1 145 1 1 1 1 1 1 1 1 1 1 1 1 1 1 1 1 1 1 1 1 1 1 1 1 1 1 1 1 1 
##$CPDPRG= <>
##$CPDPRG1= <>
##$CPDPRG2= <>
##$CPDPRG3= <>
##$CPDPRG4= <mlev>
##$CPDPRG5= <mlev>
##$CPDPRG6= <mlev>
##$CPDPRG7= <mlev>
##$CPDPRG8= <mlev>
##$CPDPRGB= <>
##$CPDPRGT= <>
##$D= (0..31)
0 1.2 0 0 0 0 0 0 0 0.06 0 0.03 0 0 0 0 0.0002 0 0 0 0 0 0 0 0 0 0 0 0 
0 0 0 
##$DATE= 1679653076
##$DBL= (0..7)
120 120 120 120 120 120 120 120 
##$DBP= (0..7)
150 150 150 150 150 150 150 150 
##$DBP07= 0
##$DBPNAM0= <>
##$DBPNAM1= <>
##$DBPNAM2= <>
##$DBPNAM3= <>
##$DBPNAM4= <>
##$DBPNAM5= <>
##$DBPNAM6= <>
##$DBPNAM7= <>
##$DBPOAL= (0..7)
0.5 0.5 0.5 0.5 0.5 0.5 0.5 0.5 
##$DBPOFFS= (0..7)
0 0 0 0 0 0 0 0 
##$DE= 6
##$DECBNUC= <off>
##$DECIM= 32
##$DECNUC= <off>
##$DECSTAT= 4
##$DIGMOD= 1
##$DIGTYP= 9
##$DL= (0..7)
0 120 120 120 120 120 120 120 
##$DP= (0..7)
150 150 150 150 150 150 150 150 
##$DP07= 0
##$DPNAME0= <>
##$DPNAME1= <>
##$DPNAME2= <>
##$DPNAME3= <>
##$DPNAME4= <>
##$DPNAME5= <>
##$DPNAME6= <>
##$DPNAME7= <>
##$DPOAL= (0..7)
0.5 0.5 0.5 0.5 0.5 0.5 0.5 0.5 
##$DPOFFS= (0..7)
0 0 0 0 0 0 0 0 
##$DQDMODE= 0
##$DR= 18
##$DS= 0
##$DSLIST= <SSSSSSSSSSSSSSS>
$$ [...]
##$SUBNAM2= <"">
##$SUBNAM3= <"">
##$SUBNAM4= <"">
##$SUBNAM5= <"">
##$SUBNAM6= <"">
##$SUBNAM7= <"">
##$SUBNAM8= <"">
##$SUBNAM9= <"">
##$SW= 18.05172834244
##$SWIBOX= (0..15)
0 0 2 0 0 0 0 0 0 0 0 0 0 0 0 0 
##$SW_h= 3612.71676300578
##$TD= 16384
##$TD0= 1
##$TE= 0
##$TE2= 300
##$TE3= 300
##$TEG= 300
##$TL= (0..7)
0 120 120 120 120 120 120 120 
##$TP= (0..7)
150 150 150 150 150 150 150 150 
##$TP07= 0
##$TPNAME0= <>
##$TPNAME1= <>
##$TPNAME2= <>
##$TPNAME3= <>
##$TPNAME4= <>
##$TPNAME5= <>
##$TPNAME6= <>
##$TPNAME7= <>
##$TPOAL= (0..7)
0.5 0.5 0.5 0.5 0.5 0.5 0.5 0.5 
##$TPOFFS= (0..7)
0 0 0 0 0 0 0 0 
##$TUNHIN= 0
##$TUNHOUT= 0
##$TUNXOUT= 0
##$USERA1= <user>
##$USERA2= <user>
##$USERA3= <user>
##$USERA4= <user>
##$USERA5= <user>
##$V9= 5
##$VALIST= <valist>
##$VCLIST= <CCCCCCCCCCCCCCC>
##$VD= 0
##$VDLIST= <DDDDDDDDDDDDDDD>
##$VPLIST= <PPPPPPPPPPPPPPP>
##$VTLIST= <TTTTTTTTTTTTTTT>
##$WBST= 1024
##$WBSW= 4
##$XGAIN= (0..3)
0 0 0 0 
##$XL= 0
##$YL= 0
##$YMAX_a= 297249
##$YMIN_a= -302597
##$ZGOPTNS= <>
##$ZL1= 120
##$ZL2= 120
##$ZL3= 120
##$ZL4= 120
##$ABSF1= 10
##$ABSF2= 0
##$ABSG= 5
##$ABSL= 3
##$ALPHA= 0
##$AQORDER= 0
##$ASSFAC= 0
##$ASSFACI= 0
##$ASSFACX= 0
##$ASSWID= 0
##$AUNMP= <proc_1d>
##$AZFE= 0.1
##$AZFW= 0.1
##$BCFW= 1
##$BC_mod= 2
##$BYTORDP= 1
##$COROFFS= 0
##$CY= 11.3945322036743
##$DATMOD= 1
##$DC= 2
##$DFILT= <>
##$DTYPP= 0
##$F1P= 2.36226072786647
##$F2P= -0.459571619588291
##$FCOR= 0.5
##$FTSIZE= 0
##$FT_mod= 4
##$GAMMA= 1
##$GB= 0.15
##$INTBC= 1
##$INTSCL= 1
##$ISEN= 128
##$LB= 0.24
##$LEV0= 0
##$LPBIN= 0
##$MAXI= 10000
##$MC2= 0
##$MEAN= 0
##$ME_mod= 0
##$MI= 1.114404
##$NCOEF= 0
##$NC_proc= 0
##$NLEV= 6
##$NOISF1= 3.799351
##$NOISF2= 2.8
##$NSP= 1
##$NTH_PI= 0
##$NZP= 0
##$OFFSET= 15.70392
##$PC= 1
##$PHC0= -19186.8
##$PHC1= 14.80078
##$PH_mod= 1
##$PKNL= yes
##$PPARMOD= 0
##$PSCAL= 0
##$PSIGN= 0
##$REVERSE= no
##$SF= 200.130013532006
##$SI= 16384
##$SIGF1= 3
##$SIGF2= 2
##$SINO= 400
##$SIOLD= 16384
##$SREGLST= <1H.CDCl3>
##$SSB= 0
##$STSI= 0
##$STSR= 0
##$SW_p= 3612.71676300578
##$SYMM= 0
##$S_DEV= 0
##$TDeff= 0
##$TDoff= 0
##$TI= <>
##$TILT= no
##$TM1= 0
##$TM2= 0
##$TOPLEV= 0
##$USERP1= <user>
##$USERP2= <user>
##$USERP3= <user>
##$USERP4= <user>
##$USERP5= <user>
##$WDW= 1
##$XDIM= 8192
##$YMAX_p= 0
##$YMIN_p= 0
$$ End of Bruker specific parameters
$$ ---------------------------------
##NTUPLES= NMR FID
##VAR_NAME=  TIME,          FID/REAL,        FID/IMAG
##SYMBOL=    X,             R,               I
##VAR_TYPE=  INDEPENDENT,   DEPENDENT,       DEPENDENT
##VAR_FORM=  AFFN,          ASDF,            ASDF
##VAR_DIM=   8192,          8192,            8192
##UNITS=     SECONDS,       ARBITRARY UNITS, ARBITRARY UNITS
##FACTOR=    0.0002768,     1,               1
##FIRST=     0,             0,               0
##LAST=      2.2672688,     0,               0
##MIN=       0,             -302597,         0
##MAX=       2.2672688,     297249,          0
$$ Real data points
##PAGE= N=1
##DATA TABLE= (X++(R..R)), XYDATA
$$ [...]
1627a56O89j8p00m74M21P50N0o84n32L13P63K17o43o40K03P53L36n11o85K6O91
1648A69M62l50o80j63N30N73j16o49l28L60N87R6n06m86J62N91K50l72n33j5N22
1669A04L96k64n85j12M85M53j94n81j96M63N07j39n95k62M33N52p0o17l23L92
1689a53N89J5n80m26L02O26J42n29m79J46N71K84l57n45l0N02L71j71n14k16L48
1710a04M82j0m58l29J76M79J69l66m16Q4M40K59k83m53k7M57L09k51m57p2M36
1731F5L52k15n04j07M57L76j81n13j72M19M64j44n22k21L41M77Om91l46K50M90
1752B81J19l63l96N9M35K62k44m04r5L40L45r4l93j94K28L75M1l33l06J57L80
1773B00J08l05l05R2L87J55k91l53Q1M00J77k93l67N2M14K30k93m04J0M11K74
$$ plain form
1627 -156 533 515 -185 -659 -238 512 562 -122 -654 -341 422 639 -4 -644 -441 312 648 137 -548 -522 169
1648 169 631 281 -399 -562 -32 541 425 -224 -552 -192 395 491 -15 -501 -339 252 502 130 -403 -418 104
1669 104 500 236 -349 -461 24 477 283 -298 -494 -31 476 337 -258 -520 -87 465 395 -222 -545 -153
1689 -153 436 451 -129 -555 -253 373 515 -14 -493 -347 224 508 151 -394 -424 78 449 278 -236 -452 -104
1710 -104 378 368 -90 -419 -243 236 405 39 -377 -293 147 406 123 -330 -357 100 409 158 -299 -371 65
1731 65 417 202 -302 -409 48 424 243 -270 -442 -23 441 297 -225 -446 -105 372 378 -113 -459 -209 281
1752 281 400 37 -359 -300 135 397 153 -251 -346 -6 339 245 -148 -342 -114 261 302 -31 -337 -180 200
1773 200 308 3 -302 -210 177 332 41 -312 -231 169 346 53 -314 -262 152 382 89 -315 -305 106 380
1794C80k13m56n6L84L26j57m15j58L04L64k4l78k32J73L58J00k83k95N6L33J78
1815B89j89l10o3L05K35j04l13j20K34K77k8l21j75K12L04j2l03k16K02L29K4
1836B57l30k32J65L50P1l20k90J39L84J27k93l23N9L63J93k19l38k4L00K38j10
1857A67l17j18K29K68j6k74j94J24K88P3k11k36N8K50J42j62k50nK32J84j23k55
1879a46o8K29K19r0k85r6K16K38n1k83j42K01K71j1k88j78J53K95M1k52k19Q8
1901a58K90J01k00k28J3K40J71j34k33o6K00J94m4k24j19J24K21K1j76j62O0K08
1923I9O8j39j80J8J97J16j19j94k3J69J48p0k12m7J61J59m1k02q0J27J80j9j69
1946e3j13J09J76K7j63j31O7J64O7j37j30OJ61Q6p7j43l7J16J22k8j39o4P3J32
$$ plain form
1794 380 167 -289 -345 39 365 208 -207 -365 -61 303 279 -99 -331 -158 200 300 17 -278 -222 111 289
1815 289 100 -210 -273 32 267 163 -150 -270 -36 241 213 -108 -283 -71 233 221 -82 -298 -96 233 257
1836 257 -73 -305 -140 210 281 -39 -329 -190 194 321 28 -295 -236 127 320 101 -237 -261 39 277 167
1857 167 -150 -268 -39 229 213 -61 -255 -131 157 230 19 -217 -159 91 233 71 -179 -184 48 232 109 -146
1879 -146 -214 15 234 144 -141 -237 -21 217 166 -117 -259 -58 213 202 -86 -264 -111 184 225 -27 -246 -158
1901 -158 132 233 33 -195 -182 58 229 95 -138 -204 -4 190 146 -78 -197 -73 148 169 -7 -169 -109 99
1923 99 167 28 -152 -134 63 179 60 -134 -157 12 160 90 -122 -169 -8 151 110 -92 -172 -45 135 116 -53
1946 -53 -166 -57 119 146 -17 -148 -81 83 150 13 -117 -111 50 136 59 -84 -121 -5 117 89 -50 -114 -41 91
1970I1J2j15r2M3J17M5r6r2J3J20M4p1r0oR5O5l7j01k4Q4P6l8q9k3O2Q2j0q6n6
1999g7N3Q7Mo4p0L8P5K4o6n9J4N8M5l5p0pN3M6j7o2qL5M4nm9k7K9M3%m1l2K1M2
2032B2J5m1j1JK8Rj4j9nK3J5j2j6mJ6J6Ll3%POlOk4J2PKl%Pk5J0JK1k4MoJ1Rm
2072Gj9PMJ1J2m1nJ6K7J7l4l0J0M3K1m1m9J9N9J8m1n3NN7M1l2q3LO0O0l7p4k4
2105f6N4O3Mr9m5N4R8mp2o2L1J01J2o1r7K2J00O1p5j02KJ04O2l4j10l0R0J05m1
2134F5j22m5P0J35j3j19q3O5J31K6j17j19N4J51M2j15j36K6J53Q3r3j53rJ45J04
2159A26m7j67n5J39J46m0j53r1R0J71J4j59j29P4J84M8j44j53L3J86R8j21j87
2182a37mJ72J43r2j91m8J72J51n5j89j00J38J95nj95j31R8K01M2j74j71O6K05
$$ plain form
1970 91 103 -12 -104 -61 56 101 5 -87 -74 46 90 19 -71 -77 18 83 46 -55 -79 5 81 43 -46 -69 -7 75 65 -21 -77
1999 -77 -24 63 67 3 -67 -29 46 70 4 -55 -41 17 62 27 -43 -50 3 49 32 -30 -38 -3 41 36 -13 -40 -11 32 32 -9 -41 -20 22
2032 22 37 -4 -15 -14 14 23 9 -10 -15 8 23 11 -5 -9 7 23 26 -7 -7 0 6 3 9 -15 -3 4 6 3 3 10 -15 -5 -4 17 -7 -3 -9 2 11 7
2072 7 -12 -5 -1 10 22 -19 -24 -8 19 36 2 -28 -18 25 46 5 -44 -25 34 52 11 -42 -37 20 61 29 -54 -51 9 69 32 -42 -66
2105 -66 -12 51 55 -44 -89 -35 63 59 -13 -75 -44 57 69 8 -89 -67 33 94 19 -83 -81 23 85 51 -59 -89 1 106 65
2134 65 -57 -102 -32 103 90 -29 -112 -47 84 110 -7 -126 -72 79 121 6 -130 -104 49 132 39 -114 -123 22 126
2159 126 79 -88 -143 -4 142 102 -51 -142 -52 119 133 -26 -155 -81 103 151 7 -146 -113 73 171 50 -137
2182 -137 -141 31 174 82 -109 -157 15 166 111 -78 -178 -40 155 150 -45 -176 -78 123 165 -9 -180 -114 91
2205I1R0j39j95J3K05J36j21k11m2J94J70p4k24q2J73K01l8k08j32J22K32Rj97
2228b7j63Q0K23P6j65j97L4K16J03j11k10k7J93J66r6k12o2J58J85k5k08j23J32
2251f0K06J8j87j54P1K28O1j65j91L8K12J19j30k24QK02J37j03k16n0J81J88p6
2274A13k19r0J57K19k7k20j21J04K22K1j73j53M6K16P7j48j77RJ92J32r6k12l5
2297a63J64J66n8j84r7J27J91nj84j34J02J94L8j78j48P3K09O2j71j75M2K09J08
2320A88j55j96KK09J40j11k21l0J84J66o9k10p3J39J94j4j98j26R8K00M9j60j67
2343a61N2J92R2j24j83k1J87J30o9j85n9J29J69k5j92j02J21J87nj78j21R2K05
2366A31K7j95j39Q8K01O4j75j76M3K21J02j58j90J0K07J32j20k00k8J81J46o1
$$ plain form
2205 91 181 42 -153 -140 65 201 80 -131 -173 21 191 117 -107 -189 -16 185 147 -61 -193 -71 161 170 -27
2228 -27 -190 -110 113 189 24 -173 -139 77 180 69 -141 -168 25 191 95 -117 -179 -21 164 139 -69 -192 -60
2251 -60 146 164 -23 -177 -106 122 183 18 -173 -135 77 196 66 -158 -150 52 189 86 -130 -180 1 189 113
2274 113 -106 -196 -39 180 153 -67 -188 -84 138 159 -14 -167 -121 95 172 24 -153 -144 48 180 84 -128 -163
2297 -163 1 167 109 -75 -172 -45 146 141 -43 -177 -75 119 157 -21 -169 -96 113 175 4 -171 -129 80 188
2320 188 33 -163 -161 48 188 77 -144 -174 10 176 107 -103 -176 -37 157 143 -55 -181 -83 117 166 6 -161
2343 -161 -109 83 175 51 -132 -153 34 164 95 -90 -149 -20 149 124 -68 -170 -49 138 133 -45 -166 -74 131
2366 131 158 -37 -176 -88 113 177 2 -174 -131 90 192 34 -156 -146 61 193 73 -127 -155 26 172 111
2388A11j92r2J35J73Nj66j35P7J82O4j45j62K5J66J15j04j70k9J70J25p0j78o7
2411a62J48J57l5j84q7J34J66nj90j13J14J94oj64j36Q9J99M9j73j69O5J96P2
2434A59j29j78K0J72J07q1j73m9J40J44k1j61r6R2J47L2j28j37M0J66O3r9j44
2457a14%J52R7p8j56j8J33J24n7j76l8J41J27n5j77m6J28J52m2j59p5J10J55M
2481A32j64j05P3J74K5j36j37M2J49P4r2j47j7J37J21m2j63n7J05J35jj42j01
2504a37O3J61L6j18j27L8J40O5r9j36J6J57Q1j11j45OJ43J10r7j62j6J55J15o8
2528G0j66l9J35J38m2j71q6J13J64jj39j15O0J52P1j36j32J1J62R4q1j57l1J20
2552fJ40k8j65q1J03J56Pj63j13Q5J69K2j45j19N2J80O6j42j62L2J77P5r8j76
$$ plain form
2388 111 -81 -173 -38 135 140 -26 -161 -84 98 162 17 -145 -120 46 161 57 -113 -142 28 153 83 -95 -162
2411 -162 -14 143 108 -76 -163 -29 137 132 -58 -171 -57 137 131 -33 -169 -80 119 168 -5 -174 -109 87 159
2434 159 30 -148 -128 44 151 70 -103 -152 -12 132 111 -50 -146 -54 93 125 -3 -140 -100 66 129 30 -114
2457 -114 -114 38 135 57 -99 -117 16 140 83 -93 -131 10 137 82 -95 -141 -13 139 97 -62 -137 -27 128 132
2481 132 -32 -137 -64 110 135 -1 -138 -96 53 127 35 -112 -129 8 129 87 -76 -133 -28 107 106 -36 -137
2504 -137 -74 87 123 5 -122 -84 56 121 22 -114 -98 59 140 29 -116 -110 33 143 46 -116 -132 23 138 70
2528 70 -96 -135 0 138 96 -75 -161 -48 116 115 -24 -139 -79 73 144 8 -124 -113 49 143 62 -95 -126 -6
2552 -6 134 106 -59 -140 -37 119 126 -37 -150 -65 104 126 -19 -138 -86 94 160 18 -144 -112 65 140 42 -134
2576a34J2J70J15j02j94j2J57J35o8j78n8J24J67j1j66j10Q7J84K8j40j60N2J79
2599G7R1j26j62nJ64J19q2j73n0J38J52l0j86q9J29J62oj69j20J05J79L5j68j42
2623a57P0J80O2j46j62L3J86J00j27j71PJ75J01p8j78m5J63J42m6j76o8J00J65
2646A30Nj67j20Q3J74M2j34j47L4J58R2j15j49nJ53J06p0j74k9J39J31n3j74m2
2670a32J11J44k2j50r3R8J48Nj35j03N6J61M4j40j24M8J50N7j05j18lJ40R9q3
2694E3j31l0J24J02m0j39n5R6J22%j54n6P4J10K4j18j03O6J29M1j00j12L1J20
2718E4N6q4j11jJ16P7o3j22j6R5J00m6j11l2P5J12k3j06n9O3J00Pr8p2M1J09K6
2745H7q1q1NJ02N7p4q6NQ3O7m8r7j8Q6P5l1j04k0P1Q5k6q6n2P1P6op8n3M3Q3J0
$$ plain form
2576 -134 -122 48 163 61 -133 -145 12 147 79 -99 -157 -33 134 123 -43 -153 -66 118 146 6 -154 -102 77
2599 77 168 42 -120 -125 39 158 76 -97 -147 -9 143 113 -73 -162 -33 129 123 -46 -166 -61 118 153 -15 -157
2623 -157 -87 93 155 9 -153 -120 66 166 39 -132 -125 50 151 73 -105 -150 13 155 109 -67 -135 -35 130
2646 130 135 -32 -152 -69 105 147 13 -134 -100 58 150 35 -114 -119 34 140 70 -104 -133 6 137 84 -90 -132
2670 -132 -21 123 101 -49 -142 -44 104 109 -26 -129 -73 88 132 -8 -132 -84 66 123 18 -100 -103 37 136 53
2694 53 -78 -108 16 118 78 -61 -116 -20 102 102 -52 -108 -34 76 100 -18 -121 -55 74 115 15 -97 -66 54
2718 54 110 26 -85 -86 30 107 44 -78 -94 1 101 55 -56 -88 -13 99 76 -30 -89 -26 74 81 -17 -89 -48 61 87
2745 87 6 -75 -70 32 89 15 -71 -66 17 84 36 -61 -79 7 82 51 -53 -73 -2 83 57 -29 -81 -10 66 60 -18 -71 -28 55 65
2776F5n9q3L0P8M8o4p0oP8N2m6o2pM3O6k4p8j9N0N5pp4k3L1N8J3p0l0L5N9J6n6
2808an4L1N5J8m9m3RN1M0n0m5%M5M4m2l6oL6L2k5m2lL2K3nl5qK5L3j2k5k5K4K7
2842A9nk5j3J8K1Nk9k0K4M0j1l7j9L2L8ll8l9K7N8Mn5l9L5M6J8n0n0K7M1K7m7
2874@n0K5M8J9l8n2PN6L2l5n0%M5N5m1o8RN2M2j9p7rM8N9j7p1l4M9P8J2q5o6M0
2907c6Q9L7q8q2K4R8N9p0r4k5J03Q5n6j22k1J01R3l2j09o2Q9J08qj32o5R0J08
2934H2J3j28o4O8J11K3j00j04L0J35M7r3j26K8J22Q6p4j51qJ17J12m9j49n8J04
2959b6J39pj43j09Q3J64L3j52j30N7J76O3j32j54K9J65J02j13j76MJ69J10p1j91
2983a10k8J55J39m7j85p7J29J66j3j83j05J00J79K8j77j34O8K03N7j59j63K1J96
$$ plain form
2776 65 6 -77 -47 31 79 15 -55 -61 17 69 23 -39 -46 -3 63 39 -39 -58 -8 47 40 -34 -57 -26 32 45 -25 -55 -20 39 55 -1
2808 -1 -55 -24 31 49 0 -43 -34 17 57 7 -38 -38 7 51 9 -27 -33 3 35 10 -32 -35 -3 20 15 -20 -28 -3 30 18 -7 -32 -8 19
2842 19 14 -11 -24 -6 15 20 -9 -29 -5 35 24 -13 -32 0 38 35 -3 -42 -15 43 47 -8 -47 -12 34 52 2 -48 -21 20 47 0
2874 0 -50 -25 23 42 4 -48 -41 15 47 12 -38 -38 7 62 21 -47 -38 14 56 37 -40 -49 -1 58 41 -30 -64 -15 63 75 -10 -76 -36
2907 -36 53 90 2 -80 -56 42 101 31 -63 -88 15 100 44 -78 -99 2 95 63 -46 -108 -19 89 81 -51 -116 -26 82
2934 82 95 -33 -97 -29 82 105 5 -99 -69 66 113 20 -106 -78 44 130 56 -95 -103 14 126 77 -72 -130 -26
2959 -26 113 106 -37 -146 -63 101 134 -18 -148 -91 85 148 16 -138 -109 56 158 45 -131 -127 42 152 81 -110
2983 -110 -138 17 156 109 -76 -153 -24 142 129 -54 -159 -59 120 148 -29 -163 -95 108 165 6 -157 -136 60
3006F0J12j25j89j4J86J45p9k02p4J58J83k6k22j06J29K20Nk08j47J07K25M7j89
3029dj79O7K16R7j54k04J1K17J30j26k24l4K08J63p7k26q7J83K07m9k23j24J51
3052f1K29Kk02j77R0K45P1j87k19O2K38J29j56k33k0K20J87j04k59p0K03K24m9
3075A63k68j15J57K54Lk51j75J32K37P1k21k16Q2K52J20j82k55J7K74J44j37k51
3097a65n1K27K09q2k71r7J99K44l7k59j52J52K62L2k35k11Q8K92R3k06k52M3K81
3120A04J52j65k84l4K72K13j20k94q2K10K61n7k82j57J76K91Nk57k14J30L00P8
3142B46k44k49P1K98J43k06k67oK84K00j47l02n5K41K50q2k93j42K10K71j9k81
3164g9j83J49L09M3k47k58R7L15J25k20k90K6K99J94j64l26n0K82K55j04l33j20
$$ plain form
3006 60 172 47 -142 -156 30 175 96 -106 -180 -22 161 135 -87 -193 -64 156 161 -47 -194 -87 138 185 -4
3029 -4 -183 -116 100 197 43 -161 -150 67 197 71 -153 -187 21 184 107 -119 -206 -23 184 135 -88 -212 -61
3052 -61 168 170 -32 -209 -119 126 197 10 -209 -147 91 220 64 -169 -189 31 218 114 -145 -215 -12 212 163
3075 163 -105 -220 -63 191 194 -57 -232 -100 137 208 -13 -229 -147 105 225 43 -212 -195 79 223 86 -165
3097 -165 -216 11 220 138 -133 -230 -31 213 176 -83 -235 -83 179 211 -24 -235 -147 145 238 32 -220 -177 104
3120 104 256 91 -193 -227 45 258 138 -156 -238 -28 233 176 -106 -263 -87 204 209 -48 -262 -132 168 246
3142 246 2 -247 -176 122 265 59 -208 -214 70 270 123 -179 -234 7 257 175 -118 -260 -50 221 202 -79
3164 -79 -262 -113 196 239 -8 -266 -169 146 271 51 -239 -213 86 280 116 -210 -260 22 277 173 -160 -280
3186b80K43K93o2k91j87J84L14L4k92k33J37L19R8k49k85O3L22J58k06l06k0L07
3208F1K25j43l32p3K58K70q1l26j52K32L04ol06k32J64L36P1k75k74Q3L48J44
3230B96k35l09NL33K12j70l43o5K99K75j11l44j39K62L16m2l45j97J99L43L2l09
3252c7k62J38L48J05k69k99O4L29J81k12l30k4L24K45j57l38j06K94K98q2l49
3273a39j78K29L42J2l39k45J70L65R2l04l10J00L60J78k60l37RL42K51j87l70
3294b19p5L15K95j04l79j61K68L47l9l56k21J95L61O5l33k72J19L78J35k87l18
3315b86L0L70K24k24l63m3L39K86j56l72j33L07L33o2l86k19K53L76L1l65k83
3336c43J63M02J24l16l49Q2L91J97k49l92j5L81K72j84m01r2L22L35j00l96j87
$$ plain form
3186 -280 -37 256 194 -97 -284 -100 214 248 -44 -277 -140 179 277 28 -257 -194 128 286 80 -226 -246 61
3208 61 286 143 -189 -262 -4 266 185 -141 -293 -61 243 237 -69 -301 -137 199 270 -5 -279 -196 152 296
3230 296 61 -248 -243 90 302 132 -211 -276 23 298 187 -157 -296 -34 282 240 -105 -302 -103 240 272 -37
3252 -37 -299 -161 187 292 23 -276 -212 117 298 86 -244 -268 56 301 144 -194 -300 -6 292 210 -139
3273 -139 -317 -88 254 266 -73 -318 -148 217 309 5 -305 -205 155 333 73 -264 -255 87 338 151 -219
3294 -219 -294 21 316 212 -167 -328 -60 287 248 -108 -329 -134 227 292 -41 -313 -194 184 319 32 -286
3315 -286 -256 114 338 114 -249 -292 47 333 177 -195 -328 -21 312 250 -136 -355 -102 274 305 -60 -343
3336 -343 -180 222 346 30 -319 -237 154 351 102 -290 -305 76 348 164 -237 -329 -7 328 228 -168 -355
3357c55K66L83j8l79k49K07L93P7l35l16J11L98J74k91l63K1L98K50k29m05p2
3378c34L65L20j29m26j55L04L82l9m18k52K48M22M9l92l11J57M24J45l14m02P6
3399b80M26K25k61m16j9L90L10j84m31j11L46L54r6m15k21L00M00j0m14k65K13
3420a59M20J01l73l54J26M24J90l10l93J0M30K82k46m38p0L93L59j64m48j71L35
3441e6M12o9m41k50K59M53L6m12l22J71M52J49l55l88P5M50K36k87m27k7M22L19
3463D00k08m52j17L71L81j00m65k05L10M21rm44k84K12M60R3l91l70J44M70J86
3484D03l35m42M5M68K85k67m59p3M19L65j72m77j64L61M25p2m74k55K84M65M3
3505C73m44l37J93M85J29l84m06R6M82K30l04m61j4M55L31k27m83j14M05M10j53
$$ plain form
3357 -355 -89 294 276 -103 -352 -145 248 325 -10 -326 -215 183 357 66 -297 -276 122 372 143 -262 -334
3378 -334 31 351 222 -204 -359 -55 327 288 -130 -382 -134 288 337 -55 -366 -209 215 360 46 -356 -280
3399 -280 146 371 110 -306 -325 65 375 191 -240 -351 -5 349 253 -162 -383 -83 317 307 -107 -372 -159
3420 -159 261 362 -11 -365 -239 185 375 65 -328 -318 112 394 148 -290 -360 33 392 228 -220 -391 -56
3441 -56 356 287 -154 -404 -145 308 344 -68 -390 -219 233 382 27 -361 -286 164 400 113 -314 -341 81 400
3463 400 192 -260 -377 -6 375 275 -190 -395 -85 336 327 -117 -401 -189 271 364 -27 -397 -253 217 403
3484 403 68 -374 -329 139 424 157 -302 -375 44 409 237 -240 -404 -43 382 310 -164 -419 -135 330 373
3505 373 -71 -408 -215 270 399 15 -391 -295 187 417 113 -348 -362 93 424 197 -286 -400 5 415 262
3526B62m66k21L39M54l1m62l10K46N01P6m11l94J56N01J86l54m43M1M74K83k71
3547A56m80o2M32L70j67n05j76L92M20p2m82k61L00M65L4m46l55K01N08J33l94
3568A1m23J12M94K36l24m81jM74L27k24m97j15M28M06j41n05k11L40M58j5m77
3589a28l16K54N03Q9m33m07J72M96J95l69m39N4M74K96k91m80n6M49L51j74m99
3610b59j74L99M30r1m82k66L15M67L9m70l44K18M98J39m05m30J08N06K43l32m78
3631c69%M74L42k54n06q8M15M00j36n06k07L52M53l7m70l08K61M94P4m33l75J58
3653b66N15J66l78m38O4N03K69k94m85l8M47L63j91n10j44L86M37q8n12k54L24
3674a24M72L4m72l56K28N03J31m15m15J18N04K33l48m73J4M76L25k68m90r1M25
$$ plain form
3526 262 -204 -425 -86 368 337 -125 -435 -189 312 388 -23 -417 -261 240 426 72 -371 -330 144 427 156
3547 156 -324 -386 46 416 249 -256 -432 -40 380 308 -174 -435 -135 330 364 -82 -437 -236 272 405 11
3568 11 -412 -300 194 430 106 -375 -376 98 425 201 -296 -411 17 423 282 -223 -434 -94 364 349 -128
3589 -128 -444 -190 313 402 -31 -438 -266 230 425 56 -383 -329 145 441 150 -330 -386 63 414 240 -259
3610 -259 -433 -34 396 305 -177 -443 -128 339 378 -92 -436 -218 280 419 14 -416 -308 198 441 109 -369
3631 -369 -369 105 447 193 -313 -401 14 414 278 -228 -435 -83 370 333 -137 -445 -184 310 384 -49 -424 -266
3653 -266 249 415 37 -401 -337 166 435 141 -344 -382 65 428 237 -273 -417 -31 406 318 -194 -448 -124
3674 -124 348 382 -90 -446 -218 285 416 1 -414 -296 208 441 93 -380 -366 110 435 167 -323 -414 11
3695A1M05j46n01k10L67M51m7m78k86K71M87O3m40l77J87N00J65l72m39O8M89
3716A68K66k83m95m0M51L65k04n09j43M04M16q9m99k47L24M79Mm81l32K29M99
3737B83J17m24l96J30M95K20l35m54J3M72L06k42m83r2M25L88j57m92j79L42M39
3758C76m5m72k86K71M80N7m33l64J78M82J66l68m31O8M86K59k92m68m1M43L52
3779D18k00m79j54L83M16j00m73k31L11M54Rm59l18K23M75J13l79m04J27M75K07
3800D14l31m40K7M49K95k45m71p7M10L64j50m66j96L52M29m5m62k90K74M58O3
3821C62m24l51J78M75J51l64m04P1M67K57k94m53k4M24L33k03m70j30L83M01j01
3842B84m68k39L15M54Lm48l13K26M69J05m04l77J22M71J99l11m44K3M48K90k38
$$ plain form
3695 11 416 270 -231 -441 -74 377 330 -148 -434 -163 324 387 -53 -430 -243 257 422 50 -389 -321 168
3716 168 434 151 -344 -384 67 432 228 -281 -424 -20 396 307 -192 -439 -115 364 368 -113 -445 -216 283
3737 283 400 -24 -420 -290 205 425 90 -364 -351 121 427 185 -298 -390 35 423 266 -226 -405 -63 376
3758 376 331 -141 -427 -156 324 381 -52 -416 -238 244 410 42 -389 -321 165 424 132 -336 -377 66 418
3779 418 218 -261 -415 -32 384 284 -189 -420 -109 345 354 -105 -423 -200 275 388 9 -395 -268 207 414
3800 414 83 -357 -330 119 414 169 -302 -379 31 395 245 -221 -417 -65 364 319 -143 -433 -159 299 362
3821 362 -62 -413 -235 240 391 27 -377 -306 161 418 124 -329 -353 71 404 201 -269 -399 -16 385 284
3842 284 -184 -423 -108 346 349 -99 -412 -186 283 388 -16 -393 -271 200 399 88 -356 -333 115 405 167
3863A67m60r1M06L66j33m78j75L34M18m7m42k89K65M65O1m21l45J69M76J51l65
3884C2m08Q0M59K61k94m51l6M37L28j92m79j38L78M07r1m95k08L02M53jm57k97
3906d10K08M80J10m07l76J24M73J95l06m46K6M46K86k29m71p8M05L66j55m67j86
3927d12L45M29m8m57k66K69M56M5m21l51J79M79J53l70m08Q1M67K50l05m46k5
3948c56M35L30k12m79j22L93L98j19m73k18L23M37J3m64l02K32M71R5l94l87J46
3969b53M64J90l36m22N2M32K80k56m52o4M01L51j62m66j55L47M16p6m59k53K93
3990a28M40L4m18l41J85M75J54l79m14J05M63K41l19m50QM44L16k29m59j06L93
4011A5L78j30m79j84L21M34l6m42k82K55M54N3l82l68J70M42J65l39m04N2M43
$$ plain form
3863 167 -293 -384 22 388 255 -223 -398 -64 354 307 -135 -424 -159 306 367 -54 -399 -230 246 397 32
3884 32 -376 -296 163 424 130 -321 -357 80 408 216 -263 -401 -23 384 293 -202 -410 -108 345 344 -113 -410
3906 -410 -202 278 388 -19 -395 -271 202 397 91 -355 -329 117 403 174 -297 -375 30 396 241 -226 -412
3927 -412 -67 362 314 -143 -409 -140 316 361 -60 -411 -232 247 400 30 -378 -297 170 420 115 -331 -356
3948 -356 79 409 197 -282 -404 -11 387 268 -205 -423 -100 337 350 -114 -416 -184 287 382 -12 -399 -253
3969 -253 211 401 65 -357 -305 127 407 151 -301 -365 36 387 225 -241 -396 -49 367 291 -168 -421 -128
3990 -128 312 346 -72 -413 -228 247 401 22 -392 -287 176 417 98 -352 -344 100 416 187 -272 -378 15
4011 15 393 263 -216 -400 -79 355 319 -123 -405 -150 304 357 -25 -393 -223 219 384 45 -359 -307 136
4032A36K58k68m42l0M10L29j87m51j41L64L87q4m59k22K89M35K2m35l21K16M66
4053B72J21l91l88J02M73K23l24m29J2M31L17k43m64q2L96L71j52m58j76L32M00
4074C43l1m60k63K69M48M0m05l32J55M65J51l46l98Q2M41K49k87m34l8M31L19
4095C99j98m60j28L81L92j07m75k06L02M42j6m37k93K21M66J00m03l79J43M58
4115B02K03l35m22L7M41K71k46m50o9L96L58j63m63j44L39M02p0m34k58K85M24
4136C04N8m17l36J84M55J20l53l78Q7M62K17k95m29j5M35L11k24m59j07L88L76
4157C84j21m66k10L28M33k8m45k74K28M60Q3m01l63J63M45J71l45l94O3M30K50
4178C91k58m30l3L92L20j73m35j47L57L87q8m37k42K97M16J6m14l00J94M46J03
$$ plain form
4032 136 394 126 -316 -346 64 393 206 -245 -386 -22 365 281 -178 -400 -111 324 346 -89 -410 -194 272
4053 272 393 2 -386 -284 189 412 88 -341 -329 102 419 176 -288 -370 26 397 245 -213 -389 -57 343
4074 343 312 -148 -411 -142 306 346 -59 -391 -236 229 380 34 -364 -282 159 408 121 -313 -351 80 399
4095 399 201 -259 -387 -6 386 279 -196 -402 -100 342 326 -111 -404 -183 283 383 -20 -399 -256 202
4115 202 405 70 -352 -315 126 397 151 -299 -368 28 386 223 -240 -384 -45 357 287 -147 -405 -120 304
4136 304 362 -55 -391 -207 248 368 15 -363 -276 186 403 108 -321 -336 99 410 186 -273 -380 8 384
4157 384 263 -203 -413 -85 348 320 -125 -399 -171 289 372 -29 -392 -229 216 387 42 -352 -289 141 391
4178 391 133 -297 -330 62 382 209 -226 -373 -16 371 283 -154 -396 -99 317 333 -81 -381 -187 259 362
4199C62l77l61J15M51K00l11m10J8M21K85k35m45p9L96L53j42m63j52L11M19n3
4220C03m42k48K46M54L2l96l21J66M36J39l30l84P3M23K32k67m07m0M08L01j93
4241A85m24j27L63L59j15m30k11L11L97nm10k85K25M30Q6l80l39J34M38J78l09
4262G1m00L1M29K54k38m34m8L74L34j52m35j49L41L71o9m23k30K57M08L1l85l11
4284c73J77M26J13l32l52R0M11K06k80l89%L81K83k11m12q2L41L54j17m25j79
4305c70K98L94k4l98k67K21M04P7l64l19J29M27J59l13l70M7L96K28k25m01n2
4326c23L66L09j59m06j37L19L47o0l98k13K49L78L0l70k80J73M03J00l13l44R2
4347b37L97J91k68l72LL71K71j96l85q7L34L17j10m02j73K76L67l7l72k33K00
$$ plain form
4199 362 -15 -376 -261 190 390 79 -331 -313 108 393 158 -287 -366 30 383 241 -222 -374 -63 356 303
4220 303 -139 -387 -141 313 345 -51 -372 -206 230 369 39 -345 -272 151 383 116 -291 -331 77 378 185
4241 185 -239 -366 -3 356 241 -189 -400 -89 308 303 -107 -392 -167 263 349 -31 -370 -236 202 380 71
4262 71 -329 -298 131 385 147 -287 -335 39 373 221 -214 -363 -22 349 280 -143 -373 -116 292 323 -62 -373
4284 -373 -196 230 343 11 -341 -251 160 366 86 -303 -303 78 361 150 -262 -344 -3 351 234 -191 -370
4305 -370 -72 322 298 -100 -367 -146 258 335 -29 -348 -219 208 367 54 -316 -269 127 355 130 -271 -323
4326 -323 43 352 193 -213 -350 -31 316 256 -142 -355 -106 272 302 -68 -348 -175 228 328 15 -329 -237
4347 -237 160 351 83 -289 -286 85 356 160 -225 -312 22 339 229 -173 -346 -70 297 260 -112 -345 -145
4368a45M03N3l50k96J32M07J29k92l45M6L78K18k30l66m3L44K83j42l74j34L08
4389a6L18o6l71j99K50L53J9l63k61J82L84Q0l04l22J03L77J70k54l59PL62K50
4411C40j98l69p3L24K86j24l71j44K68L42l0l73k11K13L63N0l37k78J42L72J23
4432C15k89l25P1L65J93k30l55k0L39K54j56l63r9K97L03q4l66j72K46L33Nl43
4454h1k35J73L54P3k95l04J09L56J52k56l29K8L50K17j89l63m8L12K77j23l58
4475a80j34K76L25m7l50k04K18L44J9l21k50J36L54J15k84l02N9L66J66k25l37
4496b56kL33K24j51l59p1K85K85p5l57j74K55L14j0l34k18J79L49M8k86k66Q7
4518b00L60J46k57l19L9L39J95j77l55l6L11K63j37l51j12K65L02m9l44j98K12
$$ plain form
4368 -145 258 311 -39 -335 -203 204 333 41 -304 -258 120 338 108 -258 -301 43 326 184 -190 -324 -16
4389 -16 302 236 -135 -334 -84 269 288 -75 -336 -154 230 310 6 -316 -213 164 334 80 -279 -272 90 340
4411 340 142 -227 -300 24 310 186 -185 -329 -61 281 251 -122 -333 -120 243 293 -44 -322 -180 192 315
4432 315 26 -299 -228 137 330 100 -255 -275 64 318 162 -201 -300 -3 300 216 -150 -322 -76 257 262 -81
4454 -81 -316 -143 211 284 -11 -315 -206 150 302 46 -283 -255 95 312 123 -240 -288 24 301 178 -180
4475 -180 -314 -38 287 240 -110 -314 -96 248 267 -54 -304 -168 186 301 17 -285 -226 140 306 81 -256
4496 -256 -258 75 299 148 -211 -282 3 288 213 -144 -318 -63 251 241 -93 -311 -132 217 265 -21 -287 -200
4518 -200 160 306 49 -270 -231 108 303 126 -229 -265 46 309 172 -179 -291 -26 276 227 -117 -315 -103
4539a03L41J6l21k37J43L46Q8k61l01Q2L32J69k24l13oL18K13j52l35p9K86K78
4561B80r0l28j55K22L36k5l21k14J84L26N6k89k63J10L36J33k56l09M2L31J98
4582C04k04l28m1L10K50j28l45j09K62L00n3l41j84K15L29J2l23k31J57L46P2
4603B70k59k85O6L50J40k16l17J0L09K27j61l40p2K87K82j05l40j37K45L07l3
4624B28l33j92J88L30M8l03k53J09L41J23k55l13M9L53J74k12l21k8L33K38j55
4645A49l51r0K81K99q5l39j76K39L25ql24k36J74L52P5k91k77Q7L47J33k29l11
4667b56OL48K02j80l45o2L20K60j14l47j43K63L15m8l43j99K11L41L9l29k43J32
4689a72L64J05k77l06Q0L38J83k35l31j1L40K33j62l55r0K95K89q3l55j55K44
$$ plain form
4539 -103 238 254 -67 -304 -161 185 273 12 -289 -207 125 294 70 -243 -249 69 282 130 -205 -284 2 280
4561 280 190 -138 -293 -71 265 240 -81 -295 -111 215 271 -18 -281 -171 165 298 42 -267 -225 106 304
4582 304 100 -228 -269 41 291 163 -182 -291 -29 271 218 -123 -307 -92 237 249 -74 -305 -148 198 270
4603 270 11 -274 -208 142 282 66 -251 -241 68 295 134 -206 -278 9 291 186 -154 -291 -46 261 228
4624 228 -105 -297 -109 221 269 -34 -287 -178 163 286 31 -282 -233 120 294 82 -239 -267 66 304 149
4645 149 -202 -292 -11 288 203 -136 -312 -73 252 244 -80 -316 -142 210 285 -6 -283 -196 151 284 55 -256
4667 -256 -250 98 300 120 -225 -287 33 293 179 -168 -311 -48 267 219 -124 -323 -112 229 268 -61 -304 -172
4689 -172 192 297 20 -286 -206 132 315 80 -251 -262 78 311 149 -206 -296 -1 288 205 -150 -305 -61
4710f1L26k6l30k30J83L57O8l18k67R6L64J40k59l14K4L48K15j94l55m4L22K56
4732C01j24l57j07K67L05n9l42j99K25L31K7l26k54J60L52R3k92k96Q3L53J56
4753B97k26l35J3L26K25j70l42q2L04K90j14l42j47K47L23m2l22k15J92L46M6
4774B72l04k67J20L53J22k54l23M8L51J95k24l29j7L15K49j45l49j02K83K90p2
4795B12l45j70K15L40Ml28k35J75L49O9l00k84J06L45J38k23l27J8L39K06j84
4816A20l44n6L11K70j26l46j16K57K90l6l30j88J94L29L6l10k33J15L49J06k69
4837B3k93O4L36J54k03l18j6L19K15j48l36p8K85K69p8l32j52K20L13jl27k08
4859b92J66L40O2k84k67J08L30J19k34k96M2L04J92j77l22m5K94K45j21l34j06
$$ plain form
4710 -61 265 239 -91 -321 -138 219 287 -31 -298 -202 162 302 43 -271 -247 101 316 122 -233 -277 45 301
4732 301 177 -180 -287 -20 285 226 -116 -315 -90 241 268 -58 -312 -152 200 293 1 -295 -212 141 297
4753 297 71 -264 -251 75 300 130 -212 -294 10 300 186 -156 -303 -56 267 225 -97 -312 -120 226 272
4774 272 -32 -299 -179 174 296 42 -281 -233 118 313 89 -240 -257 58 307 162 -187 -289 -6 284 212
4795 212 -133 -303 -88 252 256 -72 -307 -132 217 286 -14 -298 -192 153 291 68 -259 -241 98 304 120
4816 120 -224 -280 31 301 175 -171 -287 -30 260 224 -106 -294 -100 229 265 -45 -278 -163 186 292 23
4837 23 -270 -206 130 284 81 -237 -253 66 281 133 -203 -281 4 273 195 -137 -289 -69 244 243 -84 -292
4859 -292 -126 214 276 -8 -275 -167 163 282 48 -248 -206 98 290 113 -209 -254 40 285 164 -170 -276
4880b76K43K91n9l09j74J97L09K4k92k38J40L15R0k58k69P4L21J47k11l00NL09
4902G9K08j57l12p5K73K62r7l14j35K14L04l5k91j90J63L11M6k75k49J09L16J13
4924B68k40k73M4K96J70j80k96l1K85K20j23l04q7K34K51m5l03j55J93K80K3k94
4946f7k04J32L11O7k42k52Q4L05J35k13k72LK84J91j52k87o3K64K28r5l04j10
4968b57K11K65l4k92j56J61K86K9k48k25J11K95P9k11k51M0K95J50j75k78j1K60
4990D4J94j10k81q5K26K40n2k87j32J75K83nk67j75J25K69O1k36k19P7K66J20
5012B31j93k55J4K76J51j35k72l9K40K08r2k80q6K02K42l5k59j52J54K75Pk31
5034b9j94J02K63Q8k07k22M0K55J26j59k52lK44J71j10k66p1K16K27q0k57j14
$$ plain form
4880 -276 -33 258 199 -110 -284 -87 222 246 -46 -284 -144 171 261 3 -266 -192 129 276 65 -235 -230 79
4902 79 287 130 -182 -257 16 278 181 -133 -268 -54 250 215 -76 -266 -103 208 254 -21 -270 -161 155 268
4924 268 28 -245 -201 95 265 85 -211 -242 43 263 140 -164 -251 -17 234 189 -114 -269 -76 204 227 -67
4946 -67 -271 -139 172 239 -3 -255 -171 134 269 56 -216 -213 71 262 110 -177 -240 24 252 157 -147 -257
4968 -257 -46 219 185 -107 -263 -102 184 213 -35 -260 -149 146 225 14 -237 -197 98 248 73 -205 -216 44
4990 44 238 128 -153 -238 -12 228 176 -111 -243 -68 215 210 -57 -232 -107 162 223 -13 -232 -155 111 231
5012 231 38 -217 -203 73 224 89 -183 -222 18 226 134 -146 -232 -30 212 177 -82 -234 -80 195 202 -29
5034 -29 -223 -121 142 230 23 -199 -159 96 222 63 -189 -192 52 223 113 -153 -224 -8 219 139 -118 -232
5056b32J83K43j3k54j62J28K60N3k24k15P9K57J17j85k34J0K54J61j45k58k7K32
5078B8J90q8k60r1J94K18l0k38j41J51K35J4k26j79R9K50Q1k08k03L5K46J32j53
5101E6k39lK27J65j15k52n6K17J85n3k40j18J65K37mk32j57J22K48M4k02k15R0
5124a30K53R1j73k20J2K50J37j34k42m2K17J85q4k39r7J91K16l3k47j29J36K42
5146A60J9k24j73R3K53P3j95k09N5K32J17j47k34KK26J62j06k48n5K05J92o5k25
5169i2j17J59K26ok36j45J25K22M5k05j82O8K45R5j82k10J9K31J45j39k26m2K21
5192A9J71p5k39q1J86K09m8k24j28J44K22K9k31j60J07K28P3j94k00M4K49R7j49
5215D9k26LK15J62j13k19o2J96J81o7k27r0J61J99j5k20j40J27K29L7k02j83Q4
$$ plain form
5056 -232 -49 194 181 -73 -235 -107 153 206 -18 -233 -154 103 220 35 -199 -189 65 226 81 -177 -204 28
5078 28 218 130 -130 -221 -27 191 161 -77 -218 -67 168 182 -44 -223 -124 126 207 -1 -204 -169 77 209 56
5101 56 -183 -186 41 206 91 -161 -217 0 185 132 -108 -226 -61 176 172 -60 -217 -95 153 197 -5 -220 -130
5124 -130 123 214 41 -179 -167 83 220 86 -156 -198 19 204 120 -119 -216 -25 191 158 -89 -218 -82 160
5146 160 179 -45 -218 -125 128 201 6 -203 -148 84 201 54 -180 -178 48 210 104 -144 -199 6 198 133 -92
5169 -92 -209 -50 176 170 -66 -211 -86 136 181 -24 -206 -138 107 202 20 -190 -171 60 205 66 -160 -202 19
5192 19 190 115 -124 -205 -19 190 142 -82 -210 -66 156 185 -46 -206 -99 129 202 8 -192 -148 101 198 49
5215 49 -177 -174 41 203 90 -129 -191 5 186 119 -108 -198 -37 162 147 -73 -213 -86 143 180 -22 -205 -121
5238a21K20Q8j63k15M3K25J16j20k37rK08J69j03k28o8J83J91k5k43j18J52K19
5260A64Kk10j48J00K22O6k01j82M8K18J14j54k12J0K09J44j15k11n2J82J98q3
5282A09k15r8J71J92ok18j36J28K16L7j99j71Q6K25P1j63k03L4K19J21j44k09
5304a53j5K03J61j00k24o2J78J93n6k18j02J47K13j4k02j47J04K14N2j74j84O2
5326a24K18J02j65k03K4K01J26j10k09l5J99J64p4k12q4J58J92l2k05j25J36J98
5348A40K7j98j64Q6K17O5j75j84M2K15J13j50j96rK02J61j10k09m8J75J70n6k05
5371i1r7J47J92j4j96j20J07K00L3j90j46O1K05P9j63j68L4J90J09j16k03rJ88
5394C2J37q0k06m8J50J74n3k00q4J19K00qj89j20R0J98M2j62j64N8J96R3j47j83
$$ plain form
5238 -121 99 187 24 -191 -148 77 193 73 -164 -173 35 204 101 -127 -195 -12 179 154 -89 -207 -55 164
5260 164 166 -44 -192 -92 130 196 -5 -187 -139 79 193 39 -173 -163 46 190 75 -136 -188 -6 192 109
5282 109 -106 -204 -33 159 153 -65 -201 -73 143 180 -19 -190 -104 121 192 29 -174 -140 79 200 56 -153
5304 -153 -168 35 196 96 -128 -190 -12 181 125 -93 -195 -48 165 151 -51 -198 -94 120 172 -2 -186 -124
5326 -124 94 196 31 -172 -148 53 179 69 -140 -175 24 188 114 -98 -182 -24 168 136 -69 -194 -58 140
5348 140 167 -31 -195 -109 108 173 -2 -186 -144 71 184 34 -162 -171 31 192 82 -127 -175 0 170 114 -91
5371 -91 -188 -41 151 137 -59 -179 -72 128 161 -29 -175 -114 91 170 7 -161 -127 63 172 56 -147 -156 32
5394 32 169 89 -117 -165 -15 159 106 -94 -178 -59 141 133 -56 -176 -86 112 154 -8 -172 -114 82 175 28 -155
5418a55K3J89J27j23j87k5J65J53p3j94p5J58J70k9j92j07J16J77K5j69j51R9
5440g8J78M9j44j71M9J83R4j29j73j2K00J23j03j97k2J60J41n2j80p0J28J75j8
5463A31j91j00J06J78J9j75j17O3J91M7j34j72L3J77J08j21j75lJ74J22q8j75
5485a02n6J52J40m5j69r2J31J59J1j75j10Q5J76L5j52j45N7J83O6j29j64K8J66
5508E0J04r1j87oJ60J27o7j84n2J30J53l5j71q8J21J49J2j67j09O2J83M9j45j42
5532a44M2J71P2j12j48rJ58J13r2j54l0J40J31n4j56p4J19J45j0j55r1Q8J60J3
5556A23j46j21O8J61M8j29j33L0J42R6j05j55pJ43J19p6j54m8J38J21m2j44o5
5579a36J10J24J7j46r2O6J48K4j18j21M1J58M9j11j17LJ40R5p8j53k1J44R0m7
$$ plain form
5418 -155 -132 57 184 61 -126 -151 14 167 94 -100 -175 -17 153 124 -68 -175 -59 118 143 -26 -177 -78
5440 -78 100 149 5 -166 -117 66 160 31 -142 -154 46 169 66 -131 -153 7 148 96 -84 -154 -26 149 131
5463 131 -60 -160 -54 124 143 -32 -149 -86 105 152 18 -154 -121 56 164 43 -132 -135 39 161 73 -102
5485 -102 -158 -6 134 89 -80 -172 -41 118 129 -46 -156 -71 105 140 -12 -157 -100 83 149 20 -144 -116 50
5508 50 154 63 -124 -130 30 157 90 -94 -146 -16 137 102 -69 -157 -36 113 125 -42 -151 -89 94 143 -2 -144
5532 -144 -102 69 141 29 -119 -128 30 143 51 -103 -133 7 138 84 -72 -146 -27 118 108 -47 -138 -50 110 123
5556 123 -23 -144 -76 85 133 4 -129 -99 43 139 34 -121 -128 15 134 58 -96 -144 -6 115 73 -71 -136
5579 -136 -26 98 115 -31 -123 -57 91 115 -3 -124 -83 75 124 13 -104 -101 39 134 56 -97 -118 26 116 69
5603F9j46m7J11J33l6j39q4R9J35Nj27j05O4J43L1j24j06K8J46P2j02j36K6J25
5627C5Q4p3j32k8J32R7m1j37n2J00J21j8j29p4P7J28J1j16j02M9J26N5j10j20
5651a17L0J34N8p6j28qJ25R5o6j30l2J09J08k8j33o2P6J33Jj30p9P4J28K3j14
5676ij05M9J36M7j02j26K8J21P2p1j25j6J15Q1l0j27m9R5J19l0j24o3P1J18Pj13
5702c1p6N3J20K8r7r7L1J28M8p8j20PJ09P7n5j35qR6J03l3j28l8P0J22jj34o9
5729a08O7J27J3j12r1L7J33L7r6j08J9J34M8p6j13pJ02R6l9j29k5Q0J07k8j24
5754e6m6P3J13Kj02q2N7J07L2j00r1K5J14N0p6j04QJ03P8o7j18rR3R2m5j08m6
5781a03P6J03j3j04o9O6J18kr3p7M4J08M0q5j05L0J04O7p9j21J7R1P9n0r5l9R2
$$ plain form
5603 69 -77 -124 -13 120 84 -55 -139 -40 95 100 -27 -132 -68 75 106 -18 -124 -96 50 122 20 -116 -90 35
5627 35 119 46 -86 -114 18 115 74 -63 -115 -15 106 88 -41 -115 -38 90 101 -15 -117 -68 58 113 3 -117
5651 -117 -87 47 105 29 -99 -107 18 113 47 -83 -115 -6 102 74 -59 -121 -45 88 89 -41 -120 -46 82 105 -9
5676 -9 -114 -65 71 118 16 -110 -82 39 111 40 -85 -101 14 95 65 -62 -111 -16 103 73 -51 -114 -43 75 82 -31
5702 -31 -107 -54 66 94 -3 -100 -69 59 107 29 -91 -84 25 102 47 -88 -96 0 103 70 -58 -96 -26 96 95 -39 -108
5729 -108 -41 86 99 -13 -104 -67 66 103 7 -101 -82 52 100 24 -89 -96 6 102 63 -66 -91 -11 96 68 -56
5754 -56 -102 -29 84 86 -16 -98 -41 66 98 -2 -93 -68 46 96 20 -84 -76 27 105 38 -80 -89 4 96 51 -57 -103
5781 -103 -27 76 63 -41 -110 -44 74 72 -21 -98 -54 54 94 9 -96 -66 38 105 26 -95 -78 13 92 42 -53 -92 0
5808@R6j6j20n0P2J01%j09o9O0J08Kp5r5L0J13N0q7j04KJ20N7n8j04k0J08P3n3
5836C2r9l8R7R7j5j19m8O3J13Jj04o9L8J14K2q0q5J6J08M1o6r8NR9P0m8j19k1
5864i3R4Q0l2j10m6Q2J08%j12p3O1J11J7r9q6L4J22L2p9r9J2J16O7p8j07qR6Q8
5892I8m7j01m7R1R3j3j14o3P7R7J3j06q7N7J11L6j03r3L6J00N2p9j01NJ11O7m7
5919D3j19j4R0J00l7j20m9J00J06k1j15o5P0J09Rj03p8M2J09M5r8q8J5J21O0q1
5945C1j13PJ03Q5n9j32j8R4R8l5j20l9P7R7Pj20o1N8J18%r6q3M2J15L4q5r3K0
5973f8J08O7o9j18qJ00Q8m3j22k7R2J03l7j02o5P8J05Qj21p2N6J11K5r5q9K7J02
6000C4N8p6j13J4J12O0o1j08k2J09R0m6j17k8Q7J03k1j12o2P3J08J1j13p7N6J09
$$ plain form
5808 0 96 80 -40 -90 -18 83 83 -26 -95 -35 73 75 0 -95 -65 48 98 11 -93 -91 29 86 28 -76 -96 12 85 32
5836 32 -67 -105 -8 89 74 -45 -93 -30 83 84 -20 -89 -51 63 85 5 -80 -64 44 85 19 -79 -74 25 95 47 -72 -93
5864 -93 1 81 49 -61 -107 -25 83 83 -29 -102 -41 70 87 -12 -98 -64 58 90 11 -88 -76 40 107 29 -78 -86 10 98
5892 98 51 -50 -97 -6 87 74 -40 -103 -26 71 84 -22 -109 -52 59 95 -8 -101 -65 35 87 8 -93 -88 23 90 43
5919 43 -76 -90 0 100 63 -57 -106 -6 100 79 -36 -101 -31 78 87 -16 -94 -52 57 102 4 -84 -69 52 112 31
5945 31 -82 -75 28 113 54 -78 -96 -2 96 61 -59 -98 -21 76 83 -37 -98 -40 78 78 -18 -101 -59 56 90 5 -88 -68
5973 -68 40 107 38 -80 -88 12 100 57 -65 -92 0 103 66 -36 -101 -23 82 90 -31 -103 -47 64 89 -6 -95 -68 34
6000 34 92 16 -97 -83 29 89 28 -80 -102 7 97 51 -66 -94 -7 96 75 -37 -99 -26 82 93 -20 -97 -41 68
6026F8K5r7r6L0J19L9p5j03J0R3P4n2j24nR8Q8l4j21m5Q5R4pj02o8P2R7J7j03
6054b3q4N5J04M3q7r0J3J21L7o4r3j1J04P5n7j08j9P8R2l3j06m4P3J03kj09o3
6081i5M8J11J5r3q1L3J02M1q1r4J1J12N8o0r3j4R2P3l8j09k2P3R5j2j06o1P8R9
6109H2jj01o5M3R9J9p0q8K4J02L8o8r4J1R2O1n9r3j8Q7P8l5r8k5O7Q6k1q5n2M9
6139c5R6Qp1p6L3Q6L7p9p2K1Q8M1n4q3KQ0N6m8r1j7Q2P5l5q5l1N8Q7or2m8N0P5
6171E2J4p8p0L5Q7L2p8o6K2P1M5m6p4JP7N1m5o6l5P7O2l1n7n1O0P8j6o3n6M3P7
6202E2J4p0o1K7O5L4o5o4QP2N1n4n6j3P7L8l3o7j8M9P0k2o8l8N6O8qn8m2L1P7
6233E2Mn9n3K5O9K7o0o4J7O9K8m4n9NO1L0k9o8j4N4O0j9o1l1M5N5jo4m3K9O8O
$$ plain form
6026 68 93 -4 -100 -70 49 88 13 -90 -80 13 87 35 -89 -94 4 92 58 -63 -108 -23 71 64 -38 -106 -34 63 80 -23
6054 -23 -107 -52 52 95 8 -82 -69 52 89 25 -68 -79 25 100 43 -65 -84 -6 86 53 -53 -97 -24 79 77 -32 -95
6081 -95 -47 64 79 -14 -95 -62 40 81 0 -94 -83 29 87 27 -66 -80 12 85 47 -62 -84 -11 84 72 -34 -95 -17 82
6109 82 81 -20 -85 -42 57 76 6 -82 -58 44 82 14 -80 -69 23 84 25 -68 -86 1 79 44 -54 -79 -12 74 53 -32 -84 -35
6139 -35 61 69 -2 -78 -45 41 78 -1 -73 -52 36 77 23 -60 -58 22 78 30 -61 -78 4 79 44 -41 -72 -14 73 67 -25 -73 -23 52
6171 52 66 -12 -82 -47 40 72 -6 -72 -50 21 66 20 -54 -53 24 75 30 -36 -71 6 68 37 -20 -71 -11 67 51 -12 -68 -25 52
6202 52 66 -4 -65 -38 27 61 -4 -68 -60 12 63 9 -47 -60 17 55 22 -45 -63 -14 56 34 -34 -72 -16 52 44 -14 -56 -25 52
6233 52 56 -3 -56 -31 38 65 5 -59 -42 27 55 11 -48 -43 18 48 19 -49 -63 -9 51 32 -29 -60 -15 40 39 -25 -68 -39 29 35
6265C5l9n4J9P0K2m9n7K5M8L1l3o1lN9M1l3m4k5N3M7k0m8l1L3N7rm9m3L6N9%m6
6297im7L6M0K1l3n1RN8K0k7n9NM4L2j4m3l0O0K3pm7k6L6M5Lm6l6L5M6Ll6m1K3
6330a3L9Rk8m5PM3L0k1o3%M0L0k4l4j5L5L7nm6j8L7M2j5l1k0K2M6km1k2OM1J2
6363C3k6l7J3K6L1k7k7j0K9K7j5l6j3K8L0ll2k9L0K5Ql4l8L7K8Rm6qRK5J3qm2
6396c0J2L2K1k4l8J0L5K1k0l5kK2L3j5l0j7J2M4j1l4j3MM6Ml1k5J6K7J5k7l1J1
6428a8L6Ppl9lK3L1k9k6pL2K2Ll9j2K3L0lk4j2OM2Ll3l3J4L4J8l4k7K1J9J8j5
6462B1l5k0M4K3j8k7j8L9K2km9qK9K7j2k3j9J9L6Pl2k7KL5J5k1l2J6L9Mk2l4R
6495a2L2J0j7l0jL1K6j9l9qL4K9j2k7k7K1L0jk9j6PM4Lk8l0J4L5Qk7k2OL1K3k6
$$ plain form
6265 35 -4 -58 -39 31 53 4 -53 -28 20 51 18 -43 -46 13 54 21 -23 -48 5 52 32 -16 -47 -14 43 34 -15 -58 -22 37 37 -9
6297 -9 -56 -20 20 41 8 -43 -34 24 44 17 -42 -37 7 39 25 -18 -48 12 35 28 -19 -45 -9 36 39 -7 -43 -8 38 41 5 -36 -13
6330 -13 26 35 7 -38 -31 12 42 21 -42 -42 -2 28 4 -30 -45 -10 27 22 -24 -42 -5 37 22 -9 -29 -7 39 37 -4 -26 -20 21 33
6363 33 7 -30 -17 9 40 13 -14 -24 5 32 17 -19 -32 -4 26 23 -9 -38 -8 17 25 -9 -47 -10 18 27 -19 -27 -18 7 20 12 -30
6396 -30 -18 14 35 11 -27 -17 18 39 19 -16 -18 4 37 22 -8 -25 -13 31 20 -14 -27 -23 23 27 -4 -29 -13 14 29 2 -29 -18
6428 -18 18 25 18 -21 -24 -1 30 1 -25 -32 0 22 25 -14 -26 -3 27 24 0 -12 -6 36 39 6 -27 -13 21 39 5 -22 -1 18 36 21
6462 21 -14 -34 10 33 15 -12 -30 9 31 29 -20 -28 1 28 16 -7 -26 -7 29 36 4 -23 -21 14 29 8 -24 -8 31 35 13 -21 -12
6495 -12 20 30 13 -17 -18 13 39 20 -19 -27 7 36 24 -3 -30 -9 21 20 -9 -25 -18 26 29 1 -29 -15 20 28 1 -21 -15 16 39 13
6529A3l0JL0K2k2k7j2L1K6j3l4j1J6M6ql9k4K1M0Jl0k8J0L6J5k8m0NM1K2k5m2
6561c7J0K4M4k7m4lK8L9on6mM2K6nm0k0K8L1Kl8l5K6M5Rm4l5%N4J5k7m5J0M7K8
6595D2k6m6j5M1M1k3m2j6L5M2on0k2L3M2Rn2k4J3N7J4m4l1MN1J3k7m2%M8K9j7
6627C1o2jL6M2k2n7j3L4N6j1m8l1L5M3J7n9m8K3P3Pm3m8PN5K2j6n6ML9N0k4o5
6659c0j4M8N6j8o1k5M0M7No1m8M5O0Pn9n2K2O3K6m4o3J0P3L0m0o6oO6M6l1o7k5
6691f6O7N9j6p2l0N0O2lp3l8L5O6K0n5o4K0P4L2n5o4mQ3M1m4o3j8O3N6l0q0k1
6722f8M5R2k5q0l7M6Q3%o8n7K9Q2K2p5o0K3Q5L4o3p5J6O4O2m6r6j0Q1O9j6r6k6
6753f5N9Q2k3q1n6N8R2Rp9p9K7R5K8p1p7J0J04M7o8r0kJ00O3m5j06k4R5P4j8j03
$$ plain form
6529 13 -17 -16 14 36 14 -13 -25 6 32 19 -15 -26 -10 36 28 -11 -35 -14 26 27 -3 -31 -21 15 30 2 -38 -33 8 30 5 -37
6561 -37 -27 -3 41 14 -30 -33 -5 34 28 -28 -32 10 36 31 -9 -29 -1 30 32 -6 -41 -15 30 39 -5 -40 -40 14 29 2 -43 -33 14 42
6595 42 16 -30 -45 -4 37 14 -28 -44 -9 33 27 -23 -45 -12 30 39 -13 -37 -24 33 47 3 -28 -24 27 40 13 -29 -29 19 48 31
6627 31 -31 -32 4 46 24 -33 -46 -12 44 33 -15 -46 -11 32 49 -10 -58 -35 38 45 2 -46 -39 16 38 22 -34 -30 9 59 35 -30
6659 -30 -44 4 60 42 -19 -44 -4 43 48 -13 -61 -16 44 51 -8 -60 -38 25 51 7 -56 -46 27 57 17 -49 -55 11 57 26 -41 -66
6691 -66 1 60 44 -28 -58 -8 54 51 -22 -60 -25 41 61 6 -58 -38 36 68 13 -51 -55 28 69 25 -38 -56 7 63 33 -47 -68
6722 -68 -23 69 44 -36 -73 -27 56 56 -12 -69 -40 42 64 -11 -71 -48 37 71 8 -67 -51 13 75 29 -67 -77 4 73 57 -39 -65
6753 -65 -6 76 53 -28 -84 -26 66 75 -4 -83 -56 39 67 -4 -81 -71 33 80 12 -78 -80 20 83 38 -68 -92 3 77 59 -44
6783d4m9O9J04pr6o6N9R9J9q7q4L0J05L5p2j02K5J02N9p4r7j2R1Q4m7r8l8P9J01
6812H8k2j10n4P9J05j8r8p3M9J23K1r9r3L5J17M7q3j03jJ32N1n6j03j9J03Q1l4
6839F5j33k0Q3J02k5j13o3O4J18Nj13q3N9J20K3q4j08K9J27N0r2j01KJ02R5o5
6865D4j27j9J03Q9k6j24n5R6J02%j17p2N7J28K3j26q2M4J33L4j05j01K5J16P1
6890A11q5j32OJ23Q1o6j22k8R6J11l5j22n4R0J04Lj13q4O5J27J9j07r6M2J20O1
6916A15r1j21J0J25Q5q4j24qJ14Q7l9j37m1J06J01j1j42n6P3J26J2j28q6O0J22
6941F8L1j06r7K2J39N2r1j24J3J24Q6p6j20k0J10J03m6j27n3J00J17j1j26r0R0
6966c2J20J8j19r8M7J42M3j18j16L1J29P3q5j28rJ17J01n6j44k4J01J21l8j31
$$ plain form
6783 -44 -93 -24 80 73 -23 -89 -30 69 88 1 -83 -53 52 87 15 -87 -62 40 99 25 -72 -84 7 91 44 -54 -92 -13 88
6812 88 66 -44 -98 -19 86 68 -30 -103 -54 69 90 -9 -102 -67 50 97 14 -89 -90 42 93 37 -66 -85 18 99 65
6839 65 -68 -88 -5 97 72 -41 -104 -40 78 83 -30 -113 -54 66 89 5 -103 -74 53 103 11 -90 -88 14 109 44
6865 44 -83 -102 1 90 64 -60 -115 -19 83 83 -34 -106 -49 79 102 -24 -106 -62 71 105 0 -101 -76 40 111
6890 111 26 -106 -100 23 104 38 -84 -112 -16 95 60 -62 -116 -26 78 81 -32 -116 -51 76 95 -12 -108 -66 54 115
6916 115 24 -97 -87 38 123 39 -85 -93 21 108 69 -68 -109 -3 98 87 -55 -111 -38 88 100 -28 -114 -54 68
6941 68 99 -7 -104 -82 57 109 18 -106 -93 31 117 41 -79 -99 11 114 68 -59 -112 -12 105 94 -32 -122 -32
6966 -32 88 106 -13 -111 -64 78 121 3 -113 -82 47 120 35 -93 -102 15 116 60 -84 -108 -7 114 76 -55
6990e5p1J01J23Oj34q3O5J36K4j13j15M3J36N3q8j30K1J30P8q4j32j6J24J08o0
7015F7j27o1J21R9j5j30q5Q7J38Rj33r2O1J40K8j05j12K4J32O7r1j21NJ21R2o8
7041E1j30k1J02J16m1j31o7R9J37j2j37q4P5J37J0j18j11N3J30N9j17j15L1J32
7065D8O5p6j37j1J32Q7m5j59k3J04J15j6j49o5R7J28Kj34q4O1J40K9j11j15L8
7090g9J35O7q9j44K0J39P2o1j46j7J14J07n2j32n2J03J13jj50o6P2J39Rj17j01
7115a17M1J36N7r5j31K3J33Q0r0j30j0J31R5o0j33l8J01J13k9j29o3Q7J25Mj23
7140b2r7N7J39M0j15j22M5J34N4r3j20J4J19Q9p2j45k8J27J16n8j38m8J04J21
7164A01j5j28p9P5J33J1j19r6M8J38O4j13j31J5J44P4q2j36j5J37R3o5j36m7J23
$$ plain form
6990 -55 -126 -25 98 104 -30 -113 -48 88 112 -1 -116 -73 63 116 28 -102 -81 49 127 43 -89 -105 19 127 67
7015 67 -60 -121 0 99 84 -46 -131 -44 94 103 -30 -122 -61 79 107 2 -110 -86 46 113 22 -99 -94 27 119 51
7041 51 -79 -100 2 118 77 -54 -121 -22 115 103 -34 -118 -43 94 104 -14 -125 -72 58 117 0 -115 -84 48
7065 48 113 37 -100 -111 21 108 63 -96 -119 -15 100 84 -65 -130 -33 95 97 -37 -121 -60 80 109 -2 -117 -79
7090 -79 56 123 34 -110 -90 49 121 60 -86 -103 11 118 66 -66 -118 -15 98 97 -53 -119 -47 92 101 -16 -117
7115 -117 -76 60 117 22 -109 -86 47 127 37 -93 -103 28 123 63 -70 -108 -7 106 77 -52 -115 -28 97 101 -22
7140 -22 -119 -62 77 117 2 -120 -75 59 113 20 -100 -86 33 122 50 -95 -123 4 120 62 -76 -124 -20 101
7164 101 86 -42 -121 -46 87 98 -21 -117 -69 69 133 20 -111 -96 48 122 40 -96 -111 26 119 54 -82 -129 -6
7189fJ20l7j30p5Q8J30Kj20j03O1J46M5j16j32L8J42O9j07j28OJ34R1o6j44k3
7214a15J28J04m2j41n3J06J28k1j38p1P5J35J8j26j07L7J51N1j12j07J6J21P9
7237A16q2j44mJ25J13n3j50m2J20J10j7j52n7Q8J28Oj29r9O6J46K9j25j02J7J45
7262E3P8j02j26lJ32R1o6j36m5J32J20m6j53o7J19J32k2j44r2R2J33K9j30j15
7286a36N4J40N1r8j37K3J50Q0r9j24j7J35J01o0j33m3J06J32m0j35q7Q7J57lj43
7311c9q9O8J41L4j09j22L2J44O0j01j37J6J39R1q0j52j8J22J19n0j46n7R6J51
7335A13rj61p1Q7J35J9j25j13O4J44M3j08j24J6J44Q3j04j29j0J22J10n5j48l8
7359a15J07J41m1j60o4J06J30Rj48r6Q2J39L1j29j22N5J41O4j07j37J2J47Q1p5
$$ plain form
7189 -6 114 77 -53 -128 -40 90 92 -28 -131 -70 76 121 5 -127 -89 53 122 15 -113 -107 27 118 52 -92 -115
7214 -115 13 117 75 -66 -119 -13 115 94 -44 -115 -40 95 113 -13 -120 -83 68 119 7 -100 -84 37 116
7237 116 34 -110 -114 11 124 71 -79 -121 -1 109 92 -60 -117 -29 99 105 -24 -123 -57 89 118 -7 -109 -92 53
7262 53 131 29 -97 -100 32 123 57 -79 -124 8 128 82 -71 -138 -19 113 91 -53 -145 -53 80 109 -21 -136
7286 -136 -82 58 109 11 -126 -103 47 127 28 -96 -113 22 123 63 -70 -113 -7 125 85 -50 -137 -50 107 104 -39
7311 -39 -128 -60 81 115 6 -116 -84 60 120 19 -118 -102 37 128 48 -104 -122 0 119 69 -77 -134 -38 113
7335 113 104 -57 -128 -41 94 113 -12 -125 -61 83 126 18 -106 -90 54 137 33 -96 -106 16 126 71 -77 -115
7359 -115 -8 133 92 -68 -132 -26 104 113 -35 -131 -49 90 121 -8 -130 -75 66 130 23 -114 -102 45 126 51
7383E1j50j4J18J34n9j43n3J11J32j5j48r3J01J40Qj41j10O3J50M7j26j27L5J51
7407F2P1j03j40pJ55R3p0j48l8J25J27m0j55p1J07J49j5j39r2P5J53K1j34j06
7431a20N3J39P6j16j41J1J55P4p8j54j4J39J06o3j52n4J27J27k5j41q2R4J48K
7455A11j46j06Q2J45L4j17j22L8J40P6j07j45LJ54R9q1j44k4J24J26n2j53o0J14
7479a1J26j3j41q4Q5J45J7j44j04M9J56M8j26j18J5J45P8j00j33pJ43J05p6j57
7503a02k0J30J12l7j53n7J01J51j9j37r5P7J38L6j33j21N8J37O1j09j31K7J34
7526D8Q1p9j53j3J36J16n7j53m9J15J29k7j48p9J10J22J6j48r6N7J56K7j14j23
7550a26M1J52O1j03j45L2J35R1q5j56lJ20J12m5j50m7J04J22j1j48p2P1J41K3
$$ plain form
7383 51 -99 -113 5 139 80 -63 -116 -5 127 112 -36 -129 -28 112 120 -21 -131 -68 82 129 3 -124 -89 62
7407 62 133 30 -110 -117 38 131 61 -87 -125 0 127 87 -68 -139 -32 117 102 -37 -129 -54 99 120 -14 -120
7431 -120 -67 72 148 32 -109 -98 57 131 53 -101 -115 24 130 67 -85 -139 -12 115 90 -51 -133 -39 109 111
7455 111 -35 -141 -59 86 120 3 -119 -81 59 135 28 -117 -114 40 139 58 -86 -110 14 140 88 -65 -125 -11
7479 -11 115 102 -39 -123 -38 107 124 -20 -124 -75 81 129 3 -115 -100 45 123 23 -110 -117 26 131 55 -102
7503 -102 -122 8 120 83 -70 -127 -26 125 106 -31 -126 -49 89 125 -8 -129 -71 66 127 18 -113 -86 48
7526 48 129 50 -103 -116 20 136 79 -74 -123 -8 121 94 -54 -133 -23 99 115 -33 -129 -72 84 111 -3 -126
7550 -126 -85 67 128 25 -120 -88 47 138 53 -103 -106 14 126 81 -69 -116 -12 110 99 -49 -121 -50 91 114
7574A14j41j12P2J41N0j09j36J9J56O3r6j37QJ43R1p3j41j7J05J30o2j37n4J01
7598b2J36rj48q9R1J35K5j16j20N3J43M0j02j17K1J26P9q6j38mJ26R3n2j38m5
7623a18J12J29m5j37o3R2J30%j34q9O8J43K5j19r8L2J46N0j03j28J7J27P6o4j39
7648i0j5J17J13n3j35m6R4J20k6j39o1P9J33Rj31r3N8J37L1r2j19J3J46P3r8j28
7674a03%J31Q9o9j30l1J10J09k3j38o0J06J06Jj20r1Q2J18K4j19r8N3J15N3j01
7699A4j16J8J25P0o7j33j5J24J02n8j40k5R9J06k7j33m0O7J10Nj09r4O5J24M8
7724A20j15j01L1J19N7q4j15J3J09Q7p1j23k0J04J01n3j25l8Q7J12j1j36o9P5
7748d6J31J0j23q6N4J23L5r2j02J0J39N2p4j19nJ13R0n1j20m7J09R9l0j21n2Q7
$$ plain form
7574 114 -27 -139 -67 74 124 15 -121 -102 54 117 21 -116 -108 35 126 53 -88 -105 0 130 68 -69 -123 -22
7598 -22 114 105 -43 -132 -41 94 119 3 -117 -64 79 119 17 -100 -79 47 126 40 -98 -102 24 117 65 -73 -118
7623 -118 -6 123 78 -59 -122 -30 100 100 -34 -123 -55 88 113 -6 -104 -72 74 124 21 -107 -90 37 113 49 -90
7648 -90 -105 12 125 72 -63 -109 -15 105 79 -60 -121 -42 91 100 -31 -124 -66 71 102 10 -109 -96 50 123 25 -103
7674 -103 -103 28 117 48 -82 -113 -3 106 83 -55 -115 -9 97 98 -22 -113 -31 87 111 -8 -106 -53 62 115 14
7699 14 -102 -84 41 111 44 -89 -104 20 122 64 -76 -101 -2 104 77 -56 -96 -29 81 86 -23 -117 -52 72 120
7724 120 5 -96 -65 54 111 27 -88 -75 34 121 50 -73 -93 11 112 59 -66 -104 -17 95 84 -52 -121 -46
7748 -46 85 95 -28 -114 -60 63 98 6 -96 -86 53 105 31 -88 -93 20 110 59 -61 -108 1 100 70 -51 -103 -16
7774a6J17nj16q0P0J14Rj00j01M7J15N3q8j15J3J17P3p6j08j2J02R4n6j21m7R8
7800a9J22k4j28n1O7J16nj12p2N6J13L7j03r7K0J23O5q5j12NJ24O2m3j32k4J17
7826B0Q3k8j28m0P0J14j4j12q4P0J26Pj02q5M2J14M6q2j09J7J14P2p7j17pJ15
7852B5Q6n1j22l9J06Q6k8j04n2P3J13lj14o6L9J17L5j06r0L0J15M8q1j06%J15
7878B6P1n2j23j6J11R1n1j20l8Q4J09j6j18o0O6J19Pj07p7M6J24K8r2r6PJ23O4
7905A10q1j05nJ08O9m9j13k6R1J08l4j24n4Q9J04qj09p5N8J19K1j01r6L7J18M6
7931I8q1j08OJ30O3o5j13k1J03R0l1j30m2R3J05j5j07q3P8J15Jr5r0M7J16M4j02
7958Fj03K2J17O6q0j11kJ08Q1n3j25k3J17P1k8j33l8Q3J09kj15p4O3J25J6j18
$$ plain form
7774 -16 101 96 -20 -100 -30 84 93 -7 -108 -61 54 107 19 -96 -83 34 107 31 -77 -89 13 107 51 -70 -117 -19
7800 -19 103 79 -49 -100 -33 83 78 -34 -106 -50 63 100 -3 -100 -80 43 108 23 -89 -84 40 102 59 -73 -97 20
7826 20 103 75 -53 -93 -23 91 77 -35 -119 -49 77 84 -18 -103 -61 53 99 17 -92 -75 39 111 34 -83 -90 25
7852 25 111 60 -62 -101 5 91 63 -41 -93 -20 93 90 -24 -90 -51 66 101 -5 -95 -65 50 98 17 -89 -89 26
7878 26 97 45 -78 -94 17 108 57 -63 -101 -17 92 76 -42 -102 -36 83 90 -17 -94 -48 76 104 12 -84 -77 46 110
7905 110 29 -76 -81 27 96 47 -66 -92 -1 107 73 -51 -105 -16 88 80 -29 -104 -46 73 94 -7 -103 -66 52 98
7931 98 17 -91 -85 45 108 43 -70 -91 12 102 71 -59 -101 -8 97 82 -25 -108 -30 85 86 -9 -99 -52 64 108 6
7958 6 -97 -75 42 108 28 -83 -85 23 104 51 -74 -97 20 91 63 -70 -108 -25 84 82 -33 -107 -44 81 97 -21
7984b1p4M0J19M2r0j16L0J14O4o5j24mJ13P2m9j15k9R4Q9j8j14o1P3J13Qj31n6
8011i6N7J07K3q8r1K1J17N7q6j00mJ06Q0o2j14j6R8Q0k8j17l4Q2J01lj19o7O8
8038b8J08K0j07r8M8J19L6q9j05J0J17P2q0j09k5J15Q8n3j20l0J07R4k4j15n9
8063a08Q2J15kj15q1O9J13K6j02q6L3J14M6q1j08J0J11O9p0j11j1J04P9m6j13
8088f3l0Q9R1k2j02o1O2J13%j07q4O6J12K5j00q8K6J10O0q2j07J2J10P5o2j16
8114g3k4J11P9l4j16m1P9J03nj21n4N7J10Oj03q1N1J21K3q5r7J6J28N7q1j05j5
8141i4J15O7m2j16k6Q7R9k3j17n4Q6J08j6j04o3O3J07J7r8p5L1J18L3q4r7J3J06
8168D1N6o1r7k5J05P9n9j01l0Q5Q9j7j13m7P1R1Or3p3M4J15K2r5
$$ plain form
7984 -21 -95 -55 64 106 16 -100 -70 44 108 43 -81 -85 28 100 51 -64 -93 1 90 72 -42 -103 -30 83 91 -40 -96
8011 -96 -39 68 91 3 -88 -67 50 107 21 -79 -83 23 103 41 -73 -89 9 89 61 -56 -90 -8 93 90 -29 -96 -28
8038 -28 80 100 -7 -105 -57 62 98 9 -96 -86 31 103 23 -86 -111 4 92 39 -81 -111 -4 90 66 -49 -108
8063 -108 -26 89 87 -28 -109 -40 73 99 -3 -89 -56 58 104 23 -85 -75 36 105 35 -76 -87 17 96 50 -63
8088 -63 -93 -4 87 65 -37 -98 -36 77 77 -30 -114 -48 64 89 -11 -99 -73 37 97 15 -92 -80 30 105 43 -73
8114 -73 -97 14 93 59 -57 -98 -19 84 79 -42 -96 -39 71 77 -26 -107 -56 65 88 3 -94 -78 50 107 26 -79 -94
8141 -94 21 88 46 -70 -96 -9 90 67 -50 -104 -18 90 74 -30 -93 -30 77 94 -4 -79 -48 70 103 19 -78 -65 41
8168 41 97 36 -61 -86 19 98 39 -62 -92 -7 82 65 -48 -95 -24 67 73 -20 -93 -49 66 88 -7
8191g
$$ Imaginary data points
##PAGE= N=2
##DATA TABLE= (X++(I..I)), XYDATA
0@%%%%%%%%%%JjQj6J6j6K4l2L9m7N6o5P4r0J06j29J52j76K02k32K70l05L46l94
34b09M42m98N62o29P02p85Q78r74J080j201J329j466J619j788J972k172K391k633
52a380K903l203L535l912M339m824N386o047O835p790Q983j0518J2578j5508K0038
67A1415k8028M6237j62346P263L81007n867k94748k57530J55203L28148J03743
78B84497k76239k72866O3542L29265J52555k05295l05261P83K91454K10118j48022
89A24531l02508p1773K53860K42343p6706k96359j26870J99739K67775j2898k70955
100f9821j78599J45513K75536M9832k38428k14210Q4757K72064J04933j94966
110C6611k40091K5660K54333J52919j45075k52231l2471K26786J89363r1519k50385
$$ plain form
0 0 0 0 0 0 0 0 0 0 0 0 1 0 8 -8 8 -8 16 -16 23 -24 32 -33 41 -49 57 -72 80 -96 106 -126 144 -161 185 -209
34 -209 233 -265 297 -332 370 -415 463 -511 569 -632 697 -769 850 -938 1034 -1138 1253 -1380
52 -1380 1523 -1680 1855 -2057 2282 -2542 2844 -3203 3632 -4158 4825 -5693 6885 -8623 11415
67 11415 -16613 29624 -132722 -125459 255548 249681 -45067 -302597 -147394 180754 284497
78 284497 8258 -264608 -201066 128199 280754 75459 -229802 -229019 62435 272553 124531
89 124531 -177977 -249750 4110 246453 169747 -126612 -253482 -53743 214032 201134 -69821
100 -69821 -248420 -102907 172629 222461 -15967 -230177 -145420 126644 231577 36611
110 36611 -203480 -177820 76513 229432 84357 -167874 -200345 26441 215804 124285 -126100
121a26100q4300J88008K14222l6384k36024j28362J42607K25589J7079k10363
131c4028j63223R3678K25538O4572j76639j86393M3870K14027J05734j37064j99301
142a49229l921J93348J38760r3784k02507m8512J66333J63618n0321j96543q7404
153a70162J33309J79507o756j82330j20261R6356J86091L4695j60087j46216N6774
164i9080J84377P2049j32052j63156J6740J72989J03980r8664j71176k1658J53532
175A7881J28336o1891j69917n7272J27949J45331k5093j60422q6980R7427J53657
186A09006J0815j43936j10595O4756J53896M3627j21396j27978L0831J48023P2489
197A29538r5653j38260k018J35465R6608o6949j42254l2757J17804J14708l6444
$$ plain form
121 -126100 -210400 -22392 191830 155446 -80578 -208940 -66333 159256 176335 -34028
131 -34028 -197251 -103573 121965 186537 9898 -176495 -132625 81402 187136 50072 -149229
142 -149229 -153150 40198 178958 85174 -117333 -165845 488 164106 113785 -82758 -170162
153 -170162 -36853 142654 135898 -46432 -166693 -70337 115754 150449 -9638 -155854 -99080
164 -99080 85297 157346 25294 -137862 -121122 51867 155847 57183 -113993 -135651 17881
175 17881 146217 84326 -85591 -142863 -14914 130417 105324 -55098 -142078 -44651 109006
186 109006 119821 -24115 -134710 -69954 83942 127569 6173 -121805 -90974 57049 129538
197 129538 33885 -104375 -106393 29072 125680 58731 -83523 -116280 1524 116232 79788
208G9788j39335o1298R5650J27478o032j30431q5105O9852J33266K3605j15709
219h271j03816M2166J31938N0510r5259j16650J3015J24512P3773p1613j22699
230h2394j4913J10911R2078m5588j22662m0210R2855J04413j8682j16288o2759
241a03239P1317J11785P319j05325q0804M7801J13526L1861r0389r4517K3605
252f7060J10005N3539p1582j03307j154J01874P2217n0658j07054k4598Q9168
263A390Q6858k8032j05823m5900P2842R6303m839r8902o4386N3204J00983J7694
275H1392q7635p8718L1777J00238L8497p2515q8588J0038R4482N5988n4261r3358
287f2663j1499Q4446P0260l4525r3564l1256P0815Q0531j3993q9612m8581N4837
$$ plain form
208 79788 -59547 -120845 -25195 102283 96251 -34180 -119285 -49433 83833 107438 -8271
219 -8271 -112087 -69921 62017 112527 17268 -99382 -86367 38145 111918 40305 -82394
230 -82394 -97307 13604 105682 60094 -62568 -102778 -9923 94490 75808 -40480 -103239
241 -103239 -31922 79863 87182 -18143 -98947 -51146 62380 94241 3852 -90665 -67060
252 -67060 42945 96484 24902 -78405 -79559 22315 94532 43874 -63180 -87778 1390
263 1390 88248 60216 -45607 -91507 -18665 77638 72799 -26103 -90489 -37285 63698 81392
275 81392 -6243 -84961 -53184 47054 85551 13036 -75552 -65514 28968 84956 30695 -62663
287 -62663 -74162 10284 80544 46019 -47545 -78801 -7986 72545 58552 -31060 -79641 -24804
299b4804Q6324O049q1319o2932L6734Q8114K5090o9840p3710J7715Q5637M2311
311G5369n5570q0797j145P9278N6439l9107q3378j9479O9170O7589k1415q1916
323c4962l6027N6009P4929l245p6612n0133M0909P8116J4033o7517o1044K4244
335d1300P7391K9947n5670o8487P222P2906M3816m1729p2534r196O5395N4698
347F2459k6527p2731k4521N5001O2688j0750o9586l7989M2404O7377N011o3406
359a0570m9229K8579O8691J9637n4367n7471J3787O6648L2827m3134o2645j041
371d8288O1388M3969l0204o4754j5204N3604N2448j6499o3511k7992M3435N8049
383D6441k551n9257l8864L1543O0625J1068n2456m7574J8856O0314K3388m3469
$$ plain form
299 -24804 61520 67569 -13750 -76682 -39948 48166 73256 3416 -70294 -52579 33058 75369
311 75369 19799 -60998 -62143 17135 73574 34467 -48911 -68390 780 68369 46954 -34962
323 -34962 -70989 -14980 59949 56704 -19908 -70041 -29132 48984 63017 -4500 -65544 -41300
335 -41300 36091 66038 10368 -58119 -50897 22009 65825 24096 -48438 -57634 7761 62459
347 62459 35932 -36799 -61320 -6319 56369 45619 -23967 -61956 -19552 47825 52836 -10570
359 -10570 -59799 -31220 37471 57108 2741 -54730 -40943 25705 58532 15398 -47247 -48288
371 -48288 13100 57069 26865 -37889 -53093 511 52959 36460 -27051 -55043 -11608 46441
383 46441 43890 -15367 -54231 -22688 37937 49005 -3451 -51025 -32169 28145 51533 8064
395H064n3535N746N7106L4137l2773n6700p139N1227M2899k0858n7161j9195M3301
408d881M9254q586n4802k9752L3606N2921L608m9905l8436K2625N3932J5253m2881
421A956m5110J1076N2498K5667l4191m9351m99M8607L4440k4169n1068j1698M2533
434F91M1349j3342n0384k1989L4720M6109k287m7418l0833K5567M8454Q469m2182
447c076l7911J5408M8398J8542l5081m2950M788M6021K7405k6557m5740n563M1448
460E132L4463j7013m6080j5328L4999L9650p009m4190k3997K7103M2799K978m0421
473f914l1174J8347M3749J2394l4791l6644Q968M2660K0900k7730m0182n94L9581
486H570K8298j9637m1837r707L4789L3983j0836m1383j8123K8467L7883j797l8859
$$ plain form
395 8064 -45471 -39725 17381 51518 18745 -37955 -45094 6133 49032 28174 -28987 -48182 -4881
408 -4881 44373 35787 -19015 -48767 -15161 37760 41368 -8537 -46973 -24348 29584 44837 1956
421 1956 -43154 -32078 20420 46087 11896 -37455 -37954 10653 45093 20924 -30144 -41842 691
434 691 42040 28698 -21686 -43675 -8955 37154 34867 -12551 -43384 -17817 30637 39106 -3076
447 -3076 -40987 -25579 22819 41361 6280 -36670 -31882 14139 41544 14987 -30753 -36316 5132
460 5132 39595 22582 -23498 -38826 -3827 35823 28814 -15376 -39373 -12270 30529 33507 -6914
473 -6914 -38088 -19741 24008 36402 1611 -35033 -26065 16595 37495 9765 -30417 -31011 8570
486 8570 36868 17231 -24606 -34313 476 34459 23623 -17760 -35883 -7416 30467 28670 -10189
499a0189k5448K0827L9892P172l4650l1313J2527L9815J5417k8758l5399L838
511b6269L7779K2561k1642l7549m771L3906K8475j3783l7893j2794K8680L2744
523B9444n593l6409j9901K2259L5312K560l3239k5805J4955L6126J0439k8687
535A461l0397P269L5283J7445k2875l3365n65L2796K3453j6211l4587q121K8683
548B69K8167q816l4196j5118K3425L1352j325l2059k1110J7106L2916N967k8459
561a881k5753J0161L2665J2834k3540k9170L043L1026J8616j7719l0903m015K7949
574C313K3455j1410l1156j0471K3540K6964m566l0047j6379J8415K9064K067k7425
587d636k1304J2449K9882Q395k3784k4886O131K9049J4278j8983k7436k18K7043
$$ plain form
499 -10189 -35637 -14810 25082 32254 -2396 -33709 -21182 18633 34050 5292 -30107 -26269
511 -26269 11510 34071 12429 -25120 -29891 4015 32490 18707 -19186 -31980 -3300 29444
523 29444 23851 -12558 -32459 -10200 25112 27672 -5567 -31372 -16417 19709 30148 1461
535 1461 -28936 -21667 13616 31061 8186 -25179 -25744 7052 30505 14294 -20293 -28414 269
548 269 28436 19620 -14576 -29694 -6269 25083 23758 -8301 -29411 -12305 20611 26578 -1881
561 -1881 -27634 -17473 15192 28026 4486 -24684 -21641 9385 28001 10282 -20621 -24636 3313
574 3313 26768 15358 -15798 -26269 -2729 24235 19669 -10378 -26757 -8342 20722 22789 -4636
587 -4636 -25940 -13491 16391 24786 1002 -23884 -17753 11296 25574 6591 -20845 -21063 5980
600E980J9092j3437k8452o528K3824K3026p603k8095j2092J9372K5643j345k6482
613g097j7063J4357K6905M612k3494k1081Q687K7044J0143j9723k3757K860K5614
626H007J5135j4969k5479k856K3224J9075r661k5768q440J9797K2142m237k4820
639h850j3190J5379K3918J430k2813j7294J0559K4494O710j9626k0483N253K4053
652I540J1508j5834k2429k0K2294J5668j1254k3478n145J9662J8869o289k3208
665a0116j0004J6167K1228j334k1942j4012J1945K2337L753j9631j7410P351K2358
678A0690Q341j6306j9752K391K1341J2488j2475k1029k364J9165J5815p960k1269
691a0924o933J6216J8145l297k0318j0993J2508J9699J278j8612j4233Q429K0048
$$ plain form
600 5980 25072 11635 -16817 -23345 479 23505 15902 -12193 -24285 -4913 20730 19385 -7097
613 -7097 -24160 -9803 17102 21714 -1780 -22861 -14174 12870 23013 3290 -20467 -17607 8007
626 8007 23142 8173 -17306 -20162 3062 22137 12476 -13292 -21732 -1935 20207 15970 -8850
639 -8850 -22040 -6661 17257 18687 -4126 -21420 -10861 13633 20343 717 -19766 -14513 9540
652 9540 21048 5214 -17215 -17235 5059 20727 9473 -14005 -19150 512 19381 13092 -10116
665 -10116 -20120 -3953 17275 15941 -6001 -20013 -8068 14269 18022 -1609 -19019 -11668 10690
678 10690 19031 2725 -17027 -14636 6705 19193 6718 -14311 -16675 2490 18305 10345 -10924
691 -10924 -17857 -1641 16504 13207 -7111 -18104 -5596 14103 15381 -3231 -17464 -9035 11013
704A1013N710j5990j6847M172J9610R534j2739j8479k73J8299J3025r175j9298
717a1438m360J6068J5643n045j9180q285J3296J7412r56j7957j1666R703J8453
730A1688L143j6079j4261N887J8227O971j3224j6175J909J7245J0146r864j6990
743a1377k168J5381J2871o289j7052n681J2826J4648k455j6334q913J0023J5747
756A1227J106j4825j1570O688J6283M611j2976j3597L383J5889P804j0457j5099
769a1533k7J4989J0425p546j5690l486J3243J2714m386j5628o494J0892J4092
782A1565r44j4697r290Q127J4777K283j2912j1357M815J4653N392j0705j2736
795a1029J640J3702Q017p973j3557j480J2348J0013n150j3544m413J0436J1687
$$ plain form
704 11013 16723 733 -16114 -11942 7668 17202 4463 -14016 -14289 4010 17035 7860 -11438
717 -11438 -15798 270 15913 10868 -8312 -16597 -3301 14111 13155 -4802 -16468 -6765 11688
730 11688 14831 -1248 -15509 -9622 8605 15576 2352 -13823 -11914 5331 15477 5613 -11377
743 -11377 -13545 1836 14707 8418 -8634 -14315 -1489 13159 10704 -5630 -14543 -4520 11227
756 11227 12333 -2492 -14062 -7374 8909 13520 544 -13053 -9670 6219 14023 3566 -11533
769 -11533 -11560 3429 13854 6308 -9382 -12868 375 13089 8703 -6925 -13419 -2527 11565
782 11565 10621 -4076 -13366 -5239 9538 11821 -1091 -12448 -7633 7020 12412 1707 -11029
795 -11029 -9389 4313 12330 4357 -9200 -10680 1668 11681 6531 -7013 -11426 -990 10697
808A0697k309j3207o864Q278J2687O39j2294r184N911J3238L299j0836j0885L190
822g640J3176N950r046j2150N13J2402Q225o636j2837k285J1148R939m064j2620
836e925m876R132J1233j272j1962p021O808J1681J506j0531q855M304J1697L857
850I776q785r975J667J1141O118o844j0789p37J0153P871m578j1136l153Q972
864b99R313k434j0949n295P272J0452o1j0469p182N389J0934K276r341q833L222
879f005J1009M426p792r830P91J0364O449n820j0390j461R147P882l482j0300
893e012l718P599Q920j245r618n554N610R452J043q651p015L644R458L085p284
908G14q224J584R292M836n795q883m91Q590O515m114r347k374P616P728k182r323
$$ plain form
808 10697 8388 -4819 -11683 -3405 9282 9921 -2373 -11557 -5646 7592 10891 55 -10830 -7640
822 -7640 5536 11486 2440 -9710 -9197 3205 11430 4794 -8043 -10328 820 10759 6695 -5925
836 -5925 -10801 -1669 9564 8292 -3670 -10691 -3883 7798 9304 -1227 -10082 -5778 5919 9776
850 9776 991 -8984 -7317 3824 9942 3098 -7691 -8428 1725 9596 5018 -6118 -9271 -299
864 -299 9014 6580 -4369 -9664 -2392 8060 7999 -2470 -9652 -4263 6671 8947 -394 -9227 -6005
879 -6005 5004 9430 1638 -8192 -7401 2963 9412 3592 -6798 -8259 888 8770 5288 -5012
893 -5012 -8730 -1131 7789 6544 -3074 -8628 -3018 6434 7477 -1174 -8189 -4545 4913 7998 714
908 714 -7510 -5926 3366 8202 2407 -6476 -6967 1623 8138 4024 -5323 -7697 -81 7647 5465 -3858
924c858m304O353Q668k97q785n867M612R122J740p878p144K784Q982L583o389
939A322q075P42Q472N163m726q373j230P413O436k866q336k981O125P229r50p876
955b511m574M672P769P71p143n787L039P968K501o230o823J450P784M035m965
970A956p556k52P366N363l599p853j910O501O467j981p840l454N349P154k52p333
986a874m864L896P541J380o461n894K248P427K991n306o632O22O950M282l879
1001B427o968j041O225N350k452o993k486N201O150r11o764l809M093O625N74
1016E221o206m939K759O889K010n457n797J367O745L384m412o444m8O334M472
1031E878l142o673j562N612N436j797o601k856M525O061k90o246m028L376O327
$$ plain form
924 -3858 -8162 -1809 6859 6562 -2223 -8090 -3478 5644 7384 -494 -7638 -4854 4128 7711 1322
939 1322 -6753 -6011 2461 7624 2898 -5475 -6705 708 7144 4278 -4058 -7039 -914 6315 5365 -2511
955 -2511 -7085 -2413 5356 6127 -1016 -6803 -3764 4204 6705 475 -6348 -4898 2886 6921 1956
970 1956 -5600 -5852 1514 6877 3278 -4575 -6485 16 6483 4502 -3338 -6792 -1443 5711 5459 -1874
986 -1874 -6738 -2842 4699 6079 -382 -6276 -4028 3399 6390 1084 -5548 -4926 2024 6306 2427
1001 2427 -4541 -5582 643 5993 3541 -3452 -5938 -737 5413 4502 -2262 -6071 -1978 4647 5221
1016 5221 -985 -5924 -3165 3724 5734 277 -5520 -4153 2592 5976 1564 -4880 -4928 1406 5878
1031 5878 2736 -3937 -5499 113 5549 3752 -2849 -5705 -1180 4881 4591 -1655 -5683 -2307 4020
1046D020J109n494m986J980O349K435m586n605N94O007L636l493o036p19N473
1061F84M528k214o123k059M685N307r73n931l191L643N783L87n506m189K539N911
1077C281J641m725m958J243N823K795l807n433m9N384L835k702n696j267M745
1092A10M583j490n637k461L906N155k89n302l449K860N487R38m787m287J786N483
1108B606K081m024m876O00N281L090l089n232o00M808L930k008n313j711M055
1123d02M547q39n107k736L161M902L21m633l572K108N009J419m004m181J020M895
1139A908K391l191m620n3M559L251k283m836j101M056L928j295m846k074L388
1154h18M432k74m624k951K561M716P61m180l659J601M744J739l495m195N46M562
$$ plain form
1046 4020 5129 -365 -5351 -3371 2978 5413 827 -4778 -4184 1823 5459 1966 -4070 -4789 684
1061 684 5212 2998 -3125 -5184 -499 4808 3835 -2096 -5287 -1644 4139 4526 -980 -5169 -2630 3281
1077 3281 4922 197 -4761 -3518 2305 5100 1293 -4140 -4189 1195 5030 2328 -3368 -4635 110
1092 110 4693 3203 -2434 -4895 -989 4166 3877 -1425 -4874 -2014 3473 4411 -376 -4663 -2877 2606
1108 2606 4687 663 -4213 -3613 1668 4758 1669 -3563 -4163 645 4575 2567 -2746 -4457 -402
1123 -402 4145 3306 -1801 -4537 -1376 3526 3847 -786 -4358 -2250 2759 4178 174 -4007 -2987 1908
1139 1908 4299 1108 -3512 -3565 994 4245 1962 -2874 -3975 81 4009 2714 -2132 -4206 -818
1154 -818 3614 3340 -1284 -4235 -1674 3042 3803 -377 -4036 -2435 2309 4048 553 -3642 -3096 1466
1170A466K613k662m449m90M050L343j680m481j483L389L844o69m257k337K587
1185a216M134L06l868l018J728M229J241l378l569Q68M162K051k737l990k5L978
1201H96K809k040m208r14L598L411j217m263j747L033L865l25m066k533K289M120
1217B708N80l650l143J408M097J479l017l570M64L851K237k221l777m59L416K849
1233C252j365l806j287K853L268n29l637k012K223L565K66l370k626J537L725
1248B057J049l002l147Q44L712J761k491l525N7L577K413j874l734p24L216K968
1264C157j134l748j492K675L347l04l521k187J972L526N16l076k694J138L463
1279A638J314k501l045L27L219J949j811l202m58K867K461j122l238j135K422
$$ plain form
1170 1466 4079 1417 -3032 -3522 528 3871 2191 -2290 -3773 -384 3460 2791 -1466 -3803 -1216
1185 -1216 2918 3224 -644 -3662 -1934 2295 3536 158 -3411 -2543 1619 3670 933 -3057 -3082 896
1201 896 3705 1665 -2543 -3457 141 3552 2335 -1928 -3675 -642 3223 2898 -1168 -3701 -1412 2708
1217 2708 3288 -362 -3505 -2097 2000 3479 462 -3108 -2644 1207 3444 1223 -2554 -3013 403 3252
1233 3252 1887 -1919 -3206 -353 2915 2386 -1251 -3263 -1040 2525 2791 -579 -3205 -1668 2057
1248 2057 3106 104 -3043 -2199 1513 3274 783 -2742 -2685 892 3305 1431 -2303 -3027 189 3157
1264 3157 2023 -1725 -3217 -542 2805 2501 -1020 -3207 -1235 2291 2807 -269 -2963 -1825 1638
1279 1638 2952 451 -2594 -2267 952 2901 1090 -2112 -2570 297 2758 1636 -1602 -2737 -315
1294c15K845m43l161j738J928L100K18k950k293J391L251Q59k648k693P42L240
1310A333J509k207l025R1L057K037j591l157o28K712K485r27l073j271K153K763
1326B261j77k854j816J531K850N09k436k239Q51K809J107j978k459J97K574J637
1342B367j439k641l67K328K007r19k645r37K000K324m03k593j386J602K525J55
1358A978k455j826J178K612O69k135k174O35K593J157j742k355O4K373J622j246
1374I48k445m85K069J917o68k346j017J636K112j17k145j395J102K185M35j877
1390i1j722O65K117Q80j521j922J54K032J253j184k024k65J842J560p61k095o82
1407a764J604J783l33k018j073J277J960O6j882j363Q87K012N12j642j653M85
$$ plain form
1294 -315 2530 2087 -1074 -2812 -884 2216 2434 -516 -2809 -1418 1833 2692 44 -2649 -1907 1333
1310 1333 2842 635 -2390 -2299 758 2795 1204 -1953 -2581 131 2616 1689 -1384 -2655 -502 2261
1326 2261 2084 -770 -2586 -1055 1795 2304 -132 -2371 -1520 1289 2396 418 -2041 -1844 730 2367
1342 2367 928 -1713 -2080 248 2255 1336 -1309 -2246 -246 2078 1675 -918 -2304 -702 1823 1978
1358 1978 -477 -2303 -1125 1487 2156 21 -2153 -1518 1075 2232 490 -1865 -1801 572 2194 948
1374 948 -1497 -1982 87 2004 1336 -1010 -2027 -391 1721 1604 -541 -1936 -834 1351 1786 -91
1390 -91 -1813 -1148 969 1849 328 -1594 -1440 592 1845 661 -1363 -1628 214 1774 1013 -1082 -1764
1407 -1764 -160 1623 1290 -728 -1801 -524 1436 1502 -380 -1743 -856 1156 1668 26 -1627 -1142
1423a142J959Q97j310j810K6J828J235r48j847l95J551J495m89j837p82J248J630
1440A309o3j672j124Q79J731L14j469j330N00J674P05j203j539J53J596R71q71
1457E61j615k48J443J252n85j596n60J186J422k11j573q70R65J505J28j430j135
1474a361O33J588M53j258j297L09J511P80j000j463j9J414J012o79j479l88J227
1491a7J225l65j447o49R27J348Mj314r59O86J365L20j099j130L17J344O20q84
1509B92j222jJ212Q70o07j304k87J072J032l36j264n58Q95J172r3j224p56O83
1527d24J232J95j129r71M72J260M21r67j078J88J234O56p65j176o3J088Q67m82
1545E58j199l44R33R71k08j088n92O58J070Q9r83p51L74J027L74p66r12J38R66
$$ plain form
1423 -1142 817 1714 404 -1406 -1380 448 1683 735 -1112 -1507 44 1539 1050 -787 -1569 -321 1309
1440 1309 1246 -426 -1550 -671 1060 1374 -95 -1425 -925 749 1454 251 -1288 -1135 461 1432 561
1457 561 -1054 -1302 141 1393 808 -788 -1348 -162 1260 1049 -524 -1394 -429 1076 1204 -226 -1361
1474 -1361 -728 860 1313 55 -1242 -933 578 1358 358 -1105 -1124 290 1302 623 -856 -1244 -17
1491 -17 1208 843 -604 -1253 -326 1022 1026 -288 -1247 -561 804 1124 25 -1105 -788 556 1176 292
1509 292 -930 -931 281 1151 544 -760 -1047 25 1057 721 -543 -1101 -206 966 873 -351 -1107 -424
1527 -424 808 1003 -126 -1097 -625 635 1056 89 -989 -801 433 1089 324 -852 -915 173 1040 558
1545 558 -641 -985 -52 919 711 -377 -969 -311 759 848 -135 -886 -512 515 889 123 -789 -651 315
1564C15N55n51r56j23Q75P24l94r67k93P52Q29j77r79m63O70Q96m2r21o07N02
1584c55R85J35q76p10L55R55L34p33q43J70R27M74n41q78r1P92O70l33q45k93
1604g01N81P23k7p71n02M09P41J64n97o25J47P55L44n02o73NO78M82l69p30j10
1625e78O42N54k61p40k48O04O49j95p60l18N46O99n4p76m38M64P34O8o73n56K72
1646c65P42K50n56o26R1O59M02l45o57j21N27M93j30n88l20L60N63N8n17m13J93
1667c00N70K12m15n13R0N42K99l50n36j2N56L77l17n88n3N37M31k64o19j49N39
1688C7M96k19o15k33M71N59q5o16l49L62N80P5n14m43J79N59K14l67m79j2M69
1709F9L67j83m96j64L28M35rm56l11K39M70Q5l90l60J37M68J84l72m20J00M80
$$ plain form
1564 315 870 319 -637 -760 115 839 445 -522 -815 -63 766 589 -390 -853 -183 713 671 -250 -857 -355
1584 -355 630 765 -111 -821 -466 489 823 90 -753 -583 344 818 277 -601 -692 100 770 437 -408 -701
1604 -701 -120 603 576 -195 -697 -288 453 617 20 -605 -458 297 641 139 -534 -529 149 631 262 -468 -578
1625 -578 64 618 357 -383 -631 -27 622 427 -333 -651 -105 594 540 -236 -674 -210 524 592 -81 -637 -365
1646 -365 377 627 71 -555 -464 195 597 252 -405 -526 1 494 364 -224 -544 -184 379 437 -80 -493 -300
1667 -300 270 482 67 -446 -356 186 485 135 -401 -413 143 520 203 -385 -438 99 530 266 -353 -502 37
1688 37 533 314 -301 -534 -63 496 411 -205 -554 -192 388 463 -51 -494 -315 244 458 91 -388 -400 69
1709 69 436 253 -243 -407 -79 356 347 -109 -420 -181 289 374 -16 -376 -239 229 413 41 -379 -279 201
1730B01K22l41m63P3M98K57l41m78NM97L42k99n22n7M48L84j75n18j85L93M35
1751C76n0m65k70K24M66R0l70l43Q0L95K37k29l92o8L50L03j02l83j76K57L58
1772B88j5l84k12K17L52L9l50k74K01L93M5l59k87J82M15Q1l75l33J52M35J46
1793C57l35l87R1M42K05k82l92j3L89K86j76l84j16K89L20m3l44k04J69L49N2
1814B73k72k58O9L07J69k15k96pK91K18j46l16p2K71K57j26l22j04K68K81q7l57
1836a74j34K80L08o1l57j85K38L67k2l42k46J93L64O8l19k77J23L30J47k26l08
1857b33QK94K06j29l04q6K12K65m4k69j56J32K66L8k14k10O9K63J05j98k41L2
1879a94K77J44j67k62JK70J71j39k85l2K57K19j17k91q7K24K54o1k91j40K01K60
$$ plain form
1730 201 423 82 -381 -308 190 447 106 -372 -367 130 472 173 -349 -406 42 426 251 -267 -452 -59 376
1751 376 326 -139 -409 -185 281 371 1 -342 -262 133 370 141 -251 -319 31 334 232 -151 -327 -70 288
1772 288 273 -111 -323 -106 246 285 -65 -339 -138 255 300 -59 -346 -164 251 332 -43 -376 -224 211 357
1793 357 22 -365 -274 168 373 91 -301 -314 75 361 185 -199 -315 -26 294 251 -93 -297 -128 221 273
1814 273 1 -257 -188 119 288 73 -223 -230 61 279 133 -183 -255 16 273 147 -175 -279 -11 270 183 -174
1836 -174 -308 -28 280 219 -138 -323 -85 282 260 -82 -328 -135 229 297 -22 -299 -176 154 301 75 -233
1857 -233 -225 69 275 146 -158 -244 -32 233 189 -80 -236 -104 162 200 -14 -224 -155 108 213 15 -226 -194
1879 -194 83 227 60 -202 -201 69 240 101 -184 -216 41 260 143 -148 -235 -11 243 182 -109 -249 -48 212
1901B12Lk61j80J18K54P1j99k13L5K25J40j27k36k8J82J71m6k26p6J18J93J4j81
1924c7j52R0K02O1j54j67L6K08Q6j41j79J7J90J16j18j74l1J89J36r4j71o4J47
1947dJ61m4j90p9J16J66Lj59j21P1J63M7j15j36J7J41P8p7j40k4J32J04m0j16
1971d6p0R6J05Mj11p1N0J09L0q9r3L8J10L3o7j06K6R4M4n1j08nR7O0m7r1j5P2
1999bO9k1q9l8N9P4k4o0m1M2O4J6n7m9K9O5J7m3m4%N5K5k1m4j2M0K9j6k6j8K6
2030EL6Pn2j7PL9Nl3j4rK4K9k8j3LJ5Jpj7nK3Mj0JlMNJ0kMj5jJ3NmkrlJ8J1oj6
2072CLJ0J5j6k8j3K7L1j6j9l0J8M4pl9k2J4M8jm0m0K2O4J9n1m8J0O6N0m9q8J5
2104d8P9M4l9q6j5O4Q1l6o3m9O5Q4nr5o3M5R4K2r7p5L3J13L2p3r6%J15O7p5j15
$$ plain form
1901 212 215 -46 -226 -108 146 217 18 -195 -160 65 205 78 -158 -186 -4 167 121 -105 -181 -63 130 144 -37
1924 -37 -189 -99 103 164 10 -157 -121 87 173 32 -147 -130 60 176 58 -116 -147 42 178 84 -87 -151 -4
1947 -4 157 113 -77 -156 -40 126 129 -30 -151 -80 83 130 15 -121 -104 37 115 38 -102 -126 6 110 70 -46
1971 -46 -116 -20 85 89 -22 -93 -43 66 96 7 -86 -48 62 95 28 -78 -52 42 86 35 -73 -78 19 79 32 -59 -74 -2
1999 -2 67 46 -43 -81 -22 52 28 -32 -73 -31 33 49 -8 -57 -28 37 54 11 -33 -33 22 47 26 -18 -30 10 39 23 -3 -21 5
2030 5 41 48 -4 -21 -14 25 30 -3 -17 -26 -2 27 -1 -14 -11 4 5 -2 -19 -24 -1 3 -7 -6 -9 -5 0 10 8 12 -3 -4 9 14 10 8 -1 -4 14 25 19 3
2072 3 6 16 31 15 -13 -26 1 32 16 -3 -33 -15 29 22 -17 -39 -25 23 22 -18 -58 -36 28 47 -4 -52 -42 24 74 25 -63 -48
2104 -48 31 75 36 -50 -65 -1 80 44 -19 -68 -3 81 76 -19 -82 -37 57 79 -18 -93 -60 53 85 12 -84 -84 31 98 23 -92
2134i2rJ10Q7m8j29l2J13J03k4j32o8Q6J61j8j33j05Q1J56L7j33j34L4J74O2j15
2159C2j43PJ54R8q2j81k0J32J54n6j85q1J40J58j4j61j27J11J83L3j89j41P4J80
2183G6Q7j45j67L9J79J15j15j84k5J67J55p8k07o0J49J86k9j98j22J30K02Jj87
2206c1j59Q0K23O8j76j87M5K08J12j28k12qK13J30r2k18n3J81J85n8k19j00J56
2229d0K00j2j97j38J14K20L7j73j87N6K12J08j52j93MK03J17q7k03p0J73J80n1
2252A21k08j00J41J96j3j96j34J19K02L8j86j76P8K16P6j54j97L0K19J28j27k33
2274a60lK15J49r6k29n8J84J78m5k07r8J14K11Oj81j51P9K02P0j60j86L2J90J18
2298A74j21j81l4J71J41o8j95o1J59J59k0k07r9J31J98j1j96j18J18K04L7k00
$$ plain form
2134 -92 -101 9 96 48 -81 -113 0 103 79 -53 -121 -35 126 108 -25 -130 -49 107 144 11 -123 -89 85 147 32
2159 32 -111 -104 50 148 66 -115 -135 -3 151 95 -90 -171 -31 127 113 -48 -175 -64 119 152 -37 -178 -104 76
2183 76 163 18 -149 -110 69 184 69 -115 -140 27 182 104 -103 -163 -14 172 143 -55 -177 -47 155 156 -31
2206 -31 -190 -110 113 181 5 -182 -137 71 183 55 -157 -165 48 178 86 -132 -185 -4 181 123 -96 -196 -40
2229 -40 160 148 -49 -187 -73 147 184 11 -176 -120 92 200 48 -145 -141 62 179 92 -111 -181 -8 172 121
2252 121 -87 -187 -46 150 137 -59 -193 -74 128 166 -20 -196 -118 98 174 20 -177 -147 72 200 73 -160
2274 -160 -163 52 201 105 -124 -182 2 180 135 -72 -170 -56 155 161 -20 -171 -92 110 180 20 -166 -134 56 174
2298 174 53 -128 -162 9 150 82 -113 -174 -15 144 124 -83 -182 -51 147 136 -60 -178 -60 144 181 -19
2320a9j54Q1K13O5j63j86L1K28J10j39k13j2J92J51q1k12n9J58J63k3k04j18J17
2343g4K07J9j79j44N5J86R2j33j78PJ77J28r1j91m5J83J43n2j97o6J54J69l4k10
2367g4q9J44J73mk06j23J35J95J6j95j56Q6K12O2j67j88M7J90J16j29j87k8J85
2390A5J56q1j84q1J30J86j3j74j24R2J87M8j42j58L8J82Q5j16j67JJ74J19r3j88
2414a08k3J61J32o2k01m7J47J65o0j94p7J40J68k6j90j04J29J75Qj64j39P4J96
2437A00N3j42j53K1J62J16q6j79k5J37J41l4j57r0Q8J67J0j26j27N3J58O9j31
2460B5j41L9J42P0j07j47RJ57Q8j06j53KJ44J18q0j76k5J60J17o6j53p1J44J43
2484A33k3j68q8R2J68K6j43j25N2J48P2r7j46j3J31J28p3j44n2J08J31j9j35r1
$$ plain form
2320 -19 -173 -92 121 186 23 -163 -132 96 206 67 -146 -158 34 185 104 -108 -167 -9 154 131 -73 -191 -74
2343 -74 133 152 -27 -171 -116 70 162 29 -149 -142 35 163 72 -119 -164 19 162 110 -87 -153 1 170 136 -74
2367 -74 -163 -19 154 150 -56 -179 -44 151 167 -28 -184 -98 114 176 9 -179 -132 58 174 45 -142 -170 15
2390 15 171 90 -94 -175 -45 141 128 -46 -170 -78 109 157 15 -143 -105 77 162 46 -121 -120 54 173 80 -108
2414 -108 -131 30 162 100 -101 -148 -1 164 104 -90 -167 -27 141 115 -75 -179 -50 125 133 -31 -170 -96 100
2437 100 153 11 -142 -121 41 157 71 -108 -133 4 145 111 -46 -136 -48 119 129 3 -124 -71 87 156 25
2460 25 -116 -77 65 135 28 -119 -110 47 135 29 -124 -122 22 140 60 -116 -141 19 136 70 -83 -154 -10 133
2484 133 110 -58 -146 -54 114 140 -3 -128 -76 72 144 47 -99 -112 19 147 74 -70 -122 -14 117 98 -37 -128
2508a28Q7J31J3j37j06O1J67K0j17j37O8J52N0j13j41L1J58Q5j14j54MJ76J02
2531A58r3j78lJ39J25n5j65o4J10J61k3j48j04P2J65M7j32j46K4J58Q9q3j68l1
2555a45J57J19n6j56o6J10J54k1j66p9J03J62Pj68j17J02J70L2j64j16M7J93N9
2578A61j40j46K2J89Q4j29j67jJ76J21q8j75n9J58J44m0j69j02R7J67M0j68j46
2601a71O8J79O8j20j63J6J61J21j00j78j6J52J38o4j79n7J39J50j9j88q5J12J82
2624A46j0j69j17R0J91K6j76j26O0J80O6j48j49K2J75R9j11j77j6J51J33n3j73
2647h6n6J12J64j8j66r8Q8J61L3j43j43O6J72O0j19j43K0J57R7j06j50j6J51J03
2671A40p3j67l1J41J23n7j43o6J11J44k3j54p3P2J40K0j41j03P4J44L5j05j28
$$ plain form
2508 -128 -41 90 103 -34 -140 -79 88 108 -9 -146 -78 74 124 11 -130 -99 59 144 30 -124 -120 56 158
2531 158 65 -113 -116 23 148 93 -72 -136 -26 135 112 -36 -140 -68 97 144 12 -134 -110 48 137 54 -114 -145
2555 -145 12 131 75 -81 -147 -37 117 96 -70 -149 -46 116 123 -45 -162 -60 110 142 -22 -138 -91 102 161
2578 161 21 -125 -103 86 170 41 -126 -127 49 170 82 -93 -152 6 150 110 -59 -161 -64 103 143 -25 -171
2601 -171 -103 76 144 24 -139 -123 38 159 59 -119 -135 17 155 91 -88 -145 -6 144 125 -63 -148 -36 146
2624 146 136 -33 -150 -60 131 157 -19 -145 -85 95 161 13 -136 -114 61 160 49 -128 -144 7 140 87 -86
2647 -86 -142 -30 134 116 -50 -148 -60 101 134 -9 -152 -86 86 146 27 -116 -96 61 158 52 -98 -114 37 140
2671 140 67 -100 -131 10 133 76 -67 -133 -22 122 99 -55 -128 -56 84 104 -37 -140 -66 78 113 8 -120
2694a20J8J51P9r7j31MJ23Q9m9j30m1J04J08k6j31m8Q3J18nj24q0O3J29J1j14
2719a6r2N5J18M2r9j04K4J03O1p5j09KJ03P1m3j19k1J07P3k8j10l4P8R3j1r2o1
2746h4N1R3K5j00n9L9R5K6o5r1K6Q0N6n5r8nQ0P2m4r5j4P2O2k3r2k7O1P0j1q6
2776d1m1M7P3K6p6n3L3Q2J3o5o6J9Q7K0m2n6qO5N9l6o3j8M7M9j1p7j2M1O2k3n8
2807b3k4L7N5j9m2l2K7N2Jm6m5L2N0Rl5l1PM3K4k8m6J0M4J8k4l3NK8J9nm5OL0
2840A9K9k8k9nK2K7j7l5lL3K6k1l3j2K0L3j5l7j4K5M3nn9j7M8N2j9n0k4L3N3Q
2872D8o3l0M3M9Lo1l8L4N4J2m3n0K5N9J4n7m2J8N4L3n4p0J3P5L9l6q3mO0N9l4
2903B7q6j9N3R8j1r1n3M1J09J4r2p9M4J11M6r1j14K2J12O9p2j08rJ17Q1p0j21
$$ plain form
2694 -120 -102 49 128 31 -100 -96 27 116 67 -63 -104 0 108 82 -49 -97 -14 104 99 -25 -105 -42 87 98 -16
2719 -16 -108 -53 65 107 8 -96 -72 31 92 17 -92 -90 13 84 41 -78 -99 8 81 53 -57 -91 -13 80 69 -23 -84
2746 -84 -33 60 85 -15 -74 -35 60 86 21 -70 -44 36 92 37 -61 -66 14 86 42 -53 -67 5 67 44 -48 -75 -14 56 45 -41
2776 -41 -82 -35 38 64 -12 -65 -32 50 63 -2 -68 -49 38 58 16 -40 -48 17 76 40 -23 -41 6 55 44 -33 -45 -4 58 35 -23
2807 -23 -47 -10 45 26 -16 -48 -21 31 32 -14 -59 -27 23 32 -3 -34 -27 16 40 12 -34 -24 20 38 14 -19 -14 14 33 28 -17 -11 19
2840 19 48 20 -9 -14 8 35 18 -17 -20 13 39 18 -15 -27 -7 26 11 -26 -40 -15 28 23 -36 -53 -5 47 28 -22 -46 -13 40 48
2872 48 -15 -45 -2 47 50 -11 -49 -15 39 51 8 -42 -17 42 56 -1 -43 -25 29 62 8 -62 -49 26 65 29 -54 -58 2 61 27
2903 27 -59 -78 -25 73 62 -29 -82 -41 68 82 -10 -89 -45 66 112 21 -93 -71 41 110 38 -70 -79 38 119 49 -72
2930g2j8J05R1l3j34m8R3J26l1j34o1P5J17Rj26q1N2J36M7j17j24M0J44O5q5j42
2956a06kJ29J23p3j50n2J34J38k7j66p2J04J58%j68j08O7J83L6j52j45N8J78O7
2980A54j36j53J2J71J03j05j80oJ64J28q3j78n0J46J64m9j79q6J33J77lj84j28
3003a68J10J83M2j70j46M7K06Q1j34j96J3J92J38j09k20l3J70J73o9k12q5J56
3025c1J97j8k30j23J37K12J6j94j58Q9K19O8j76j82M7K16J13j41k26J7K07J44
3047B03r9k36n0K01J86o3k33j01J71K11k4k21j51J18K40N8k24k02P7K62Q6j85
3069B4k26K5K55J47j50k56k2K17K04j03k44r2J89K39m1k52j51J61K59J3k26j96
3091b26J10K66P9k11k25N7K73J24j71k64rK58J71j06k73o9K18K25p2k65j30J80
$$ plain form
2930 -72 -90 15 106 73 -61 -109 -16 110 79 -55 -116 -41 76 85 -41 -122 -70 66 113 -4 -128 -88 56 121 36 -106
2956 -106 -108 21 144 71 -79 -131 3 141 114 -52 -124 -20 138 138 -30 -138 -71 112 148 -4 -149 -91 87 154
2980 154 18 -135 -123 48 151 46 -134 -140 24 152 69 -109 -159 -13 151 102 -77 -163 -30 147 144 -40 -168
3003 -168 -58 125 167 -3 -149 -102 104 185 51 -145 -132 60 198 89 -131 -164 6 179 110 -102 -187 -31
3025 -31 166 148 -82 -205 -68 144 160 -34 -192 -103 116 184 8 -174 -127 89 202 61 -165 -148 59 203
3047 203 104 -132 -182 19 205 142 -91 -192 -21 190 166 -55 -206 -88 152 210 -14 -216 -139 123 209 24
3069 24 -202 -177 78 225 75 -181 -203 14 218 115 -129 -221 -32 207 166 -86 -237 -76 183 196 -30 -226
3091 -226 -116 150 229 18 -207 -150 123 247 76 -188 -197 61 232 126 -147 -216 2 227 155 -110 -240 -60
3113f0K65Lk79j83J29K82P1k41k37Q7K91J22j84k71JK72K00j46k89o7K52K45r5
3136A68k96j34K23K75k9k77j87J68K85L4k60k26J07L01R6k28k59M3K95J67j82
3157H4k99k9K81K15j18l05q9K38K64n5l04j59K07K92J0k89k06J26L22Q5k52k73
3179b54O4L17J68k11l00j7L14K05j42l23q0K61K71r7l19j52K45K85rl01k12J67
3201a20L23M0k80k41R7L31J18k28k97N5L07J78j75l04n2K94K39j16l40j00K47
3222b4K99n8l28j78K07L23K5l02k49J38L41R9k75k97N8L47J79k15l39rL22K26
3244B90j53l39r0K84K99r7l46j59K43L23j5l25k20J83L42O4k97k69Q9L68J28k39
3266F4l15K5L37K10j85l57l6L00K67j21l48j47K61L23m0l57k14K18L49N9l37k87
$$ plain form
3113 -60 205 208 -71 -254 -125 157 228 -13 -250 -163 128 250 66 -205 -204 68 268 122 -167 -234 18 263 168
3136 168 -128 -262 -39 236 207 -70 -257 -89 196 230 -30 -256 -149 152 248 20 -239 -196 99 266 84
3157 84 -215 -244 37 252 134 -171 -260 -22 242 187 -117 -276 -69 223 233 -56 -262 -136 186 271 19 -254
3179 -254 -190 127 295 84 -216 -233 81 286 144 -179 -259 2 273 176 -143 -295 -50 235 226 -75 -287 -120
3201 -120 203 243 -37 -278 -181 150 268 40 -257 -202 105 283 108 -196 -248 46 285 169 -171 -271 -24
3222 -24 275 217 -111 -289 -82 241 266 -36 -285 -147 194 293 18 -279 -221 126 305 90 -249 -258 64 290
3244 290 137 -202 -292 -8 291 194 -152 -311 -68 255 240 -85 -305 -122 220 284 -13 -282 -193 175 303 64
3266 64 -251 -226 111 321 136 -221 -257 43 310 189 -159 -306 -45 278 238 -119 -333 -115 234 293 -44 -331
3288c31J46L81J14k84l32O6L69K00k25l50l1L45K68j69l73q3K87L16p8l66k00
3309c30K56L52kl48k46J85L61Q4l16l07Q7L94J67k62l66OL67K62j95l91o4L18
3331A2L12j03m04j67K87L45ml87k44K08M07P1l57l13J30M06J62k97l74M3L88K39
3353C60k30l92m0L52L05j62l96j31L04L46o7l90k21K59L71L1l71k83J69L98J25
3374C37l30l38P0M21J93k54m01kL96K74j81m21j01L34L55j04m14j95K87L97Lm12
3396h6k79K09M22R7l68l45J21M39J62k98m03K6M12K52k22m21n6L81L25j56m37
3417b25j49L26L79o0m07k57K66M16M5l89l18J87M32J36l56l73Q6M35K16k88m22
3438c20JM15L03j92m65j04L68L76j20m49k07L12M16j9m38k78K26M56Q1l95l52
$$ plain form
3288 -331 -185 196 310 26 -306 -240 129 329 104 -246 -277 68 336 167 -206 -289 -2 314 236 -130 -330
3309 -330 -74 278 276 -72 -318 -133 228 312 -4 -311 -224 170 337 75 -291 -285 82 344 149 -242 -306 12
3331 12 324 221 -183 -350 -63 282 278 -109 -353 -145 262 333 -24 -337 -207 199 361 64 -310 -267 121 360
3353 360 130 -262 -302 50 355 193 -203 -334 -30 316 249 -141 -362 -103 268 299 -72 -355 -186 212 337
3374 337 7 -331 -261 160 353 99 -302 -304 92 366 185 -236 -337 -3 352 248 -166 -361 -74 323 326 -86
3396 -86 -365 -156 266 363 -5 -350 -229 210 372 74 -329 -303 109 361 139 -282 -338 43 368 212 -225
3417 -225 -374 -48 331 271 -136 -393 -127 289 334 -55 -373 -186 246 382 26 -347 -261 174 390 102 -320
3438 -320 -319 96 399 207 -258 -362 6 382 262 -187 -394 -82 334 315 -123 -401 -175 281 362 -33 -385
3459c85J39M58J68l18m15M1M53K48k47m47n7M21L47j75m67j48L53M11q3m60k46
3480d09K93M49K1m23l32K08M62J27l72m09J04M78K18l04m64JM50L11k12m92r9
3501c94M06L82j33m83j99L43M37l9m60k83K62M68P1m09l85J80M74J78l48m37N2
3522c17M80K76k84m73n8M55L53j90m99j54L78M28q4m96k41L04M62K8m69l45K25
3543b21N03J24m04m14J08M98K31l29m57OM58L27k36m96r4M16L97j40m97j93L51
3564f2M49m2m81k95K68M86Q1m36l83J74M94J81l79m40M9M89K81k99m86l8M54L48
3586D13j92m99j51L87M43j00m95k47L15M67K1m60l37K30M97J24m07m04J19M91
3606B15K24l33m68J7M68L22k52m97j00M22M01j41n03k10L66M58n8m81l06K81M92
$$ plain form
3459 -385 -246 212 380 62 -353 -312 141 389 142 -305 -362 59 406 231 -236 -384 -31 380 297 -163 -409
3480 -409 -116 333 354 -69 -401 -193 269 396 24 -385 -281 197 415 111 -353 -352 98 409 197 -295 -394
3501 -394 12 394 261 -222 -421 -78 359 320 -140 -423 -161 307 378 -31 -416 -236 238 416 68 -369 -317
3522 -317 163 439 155 -318 -376 79 432 242 -257 -411 -33 395 311 -185 -426 -122 340 368 -101 -446 -221
3543 -221 282 406 2 -412 -304 194 425 96 -361 -355 103 430 194 -302 -396 20 417 277 -220 -413 -62
3564 -62 387 345 -136 -431 -163 323 404 -32 -415 -241 253 434 55 -385 -336 153 434 135 -351 -389 65 413
3586 413 221 -278 -429 -42 401 301 -194 -441 -126 341 362 -98 -435 -205 292 416 9 -395 -276 215
3606 215 439 106 -362 -345 123 445 193 -304 -404 18 419 278 -225 -435 -69 389 331 -150 -456 -175 317
3627C17O3m43l83J77N23J73l88m36P0M89K69k87m89l6M57L58k06m95j46M03M16
3648D06r5m87k54L30M60Nm61l41K41M98J12m30l91J25N01K11l44m60K8M71L04
3669D29k54n03r1M40L87j51n10j91L68M59m5m90k95K84M95O8m55l84J93N20J61
3690D35l93m24O7N02K66l15m88k9M74L43k23m80j50M09M15j10n01k38L31M67o
3711C52m80l15K35N07J06m22m07J46N05K14l60m65L7M79L02k62m81q1M26M04j78
3732B62m91j86L65M50o1m81k84K84M76O4m57l56J89M85J57l77m30P5M97K44l09
3753A16m62k4M51L32k07m97j24M01M15j19m85k27L26M58pm58l16K42M80J08m07
3774dl87J37M83K09l50m24OM74K97k55m88p6M30L63j62m87j75L53M37o9m61k77
$$ plain form
3627 317 380 -63 -446 -269 254 427 39 -397 -327 162 431 144 -345 -381 76 434 228 -267 -413 -10 406
3648 406 311 -176 -430 -100 360 365 -96 -437 -196 302 414 -16 -407 -282 219 430 86 -374 -346 125 429
3669 429 175 -328 -419 21 408 257 -253 -444 -76 383 338 -152 -447 -163 332 400 -55 -439 -246 274 435
3690 435 42 -382 -315 187 453 138 -350 -379 95 438 215 -265 -415 -6 409 299 -202 -440 -109 358 352
3711 352 -128 -443 -208 299 405 -17 -424 -278 227 441 81 -384 -347 132 434 172 -309 -390 36 440 262
3732 262 -229 -415 -50 400 339 -142 -426 -142 334 398 -59 -415 -226 259 416 39 -391 -316 181 425 116
3753 116 -346 -370 81 413 206 -291 -415 -14 401 282 -203 -430 -104 354 347 -111 -427 -185 295 403 -4
3774 -4 -391 -254 229 438 88 -336 -330 144 441 186 -302 -378 52 415 253 -234 -409 -56 381 312 -149 -426
3796d26K80M63N4m39l57J87M83J55l70m13P9M78K39k99m45k5M38L39k14m67j20
3817c80L80M02j07m85k26L35M39j1m37l09K22M72R5l99l82J39M71J95l32m34K4
3838c28M56K78k58m55p9M22L54j47m87j65L57M23p1m52k55K80M39L8m12l36J83
3859b15M73J46l73m06R6M72K35k96m54j2M21L29k07m71j28L83L97j12m71k19L19
3880i3M41k2m41l06K40M59R6l99l75J32M79J95l36m37L1M75K75k52m67q2M31L68
3902D12j60m82j63L61M13o9m67k63K87M61L3m22l50J96M71J34l65m04P9M69K43
3923D14l09m50LM18L25k18m67j02L81L96j26m79j95L16M39j7m48l03K54M62Q4
3944C78m04l77J56M79J92l51m34M1M69K68k65m58o2M19L65j89m77j49L59M07o9
$$ plain form
3796 -426 -146 317 371 -68 -425 -238 245 400 30 -383 -304 174 413 114 -331 -356 82 421 207 -260 -380
3817 -380 0 402 295 -190 -416 -81 358 347 -90 -399 -177 295 390 -9 -391 -252 219 414 82 -352 -328
3838 -328 128 406 148 -307 -386 36 390 243 -244 -409 -52 371 300 -152 -407 -127 312 350 -62 -398 -215
3859 -215 258 404 31 -375 -279 193 428 132 -322 -334 87 416 209 -262 -390 -7 390 278 -193 -412 -93
3880 -93 348 326 -115 -421 -181 278 374 -25 -400 -268 211 406 70 -367 -336 139 414 162 -305 -387 44 412
3902 412 252 -230 -393 -32 381 312 -155 -418 -131 330 363 -59 -409 -213 258 392 27 -377 -298 171 414
3923 414 105 -345 -342 76 401 183 -284 -386 -5 391 265 -214 -409 -93 346 329 -119 -422 -168 294 378
3944 378 -26 -403 -247 232 424 73 -361 -320 149 417 152 -306 -368 51 416 227 -250 -399 -40 367 298
3965B98m65k52K82M41L9m32l33K13M56J24l63l98J07M61K17l06m19pM30L26k25
3986A94m83q4L94L65j24m61j94L27M34l1m56k94K56M51P5m13l62J71M75J65l50
4007E5m39P3M50K62k70m64m3M18L42j77m76j28L68L97r3m49k14K81M22J8m31l14
4029d12K17M66J13l92l65J19M68J86l18m20NM47K99k43m51j01M16L60j51m62j89
4050d08L50M29p0m53k72K61M66N4m25l44J83M74J46l62l97P3M55K48k93m36j2
4071c33M21L11j93m53j17L72L81j10m46k11K97M19km31k95K25M41R2l97l59J35
4092b53M60J83l32m14M1M39K74k56m69n3M22L50j78m60j61L66M09o9m60k56K97
4113a20M44K6m18l34J89M71J34l69l88R6M61K16l06m19MM14K84k07m46j03L70
$$ plain form
3965 298 -167 -419 -137 304 343 -89 -422 -209 247 371 8 -390 -283 178 395 89 -330 -337 93 419 194
3986 194 -289 -373 21 386 262 -199 -393 -66 368 337 -119 -413 -157 294 369 -44 -406 -235 240 405 55
4007 55 -384 -311 139 401 131 -333 -376 42 384 207 -269 -397 -29 368 275 -174 -388 -107 315 333 -98 -412
4029 -412 -195 271 384 -8 -373 -254 214 400 82 -338 -333 114 413 170 -281 -382 34 394 243 -219 -408
4050 -408 -58 371 301 -152 -424 -163 303 357 -68 -412 -229 245 391 29 -368 -295 160 408 115 -321 -333
4071 -333 88 399 206 -247 -364 8 389 279 -167 -378 -81 338 336 -95 -390 -165 276 368 -29 -388 -253
4092 -253 207 390 58 -356 -315 124 398 142 -327 -380 42 392 214 -246 -407 -41 368 299 -161 -417 -120
4113 -120 324 350 -68 -402 -213 258 392 23 -365 -269 192 408 102 -317 -313 101 385 178 -268 -371 -1
4134aL80j40m47j93L19M18l7m35k77K45M43P9l98l44J48M60J79l48m11O2M44K64
4156D10k64m63l4M25L22j78m57j47L61M01q3m56k34K90M33J1m22l07K08M42J01
4177C59l64l72J12M55J84l02m11J4M28K73k32m40p1L83L50j41m52j60L32L95n5
4198B85m26k46K50M43M9m07l28J67M51J63l71l87R0M45K19k79m40j5M11L15k00
4219A89m57j03L67L63j03m37k06K98M18l2m12k77K25M25P8l54l65J53M31J66l05
4240F2l89M3M18K44k31m21o2L88L23j65m25j42L39L87q3m27k31K66M20K1m08l12
4262c85J93M38J22l59l67J08M20K04k89m02qM11K93k17m18r3L61L39j17m14j80
4283c60L07L84l9m01k54K28M21M3l59l22J38M38J44l13l70M8M11K22k46l95n0
$$ plain form
4134 -1 379 239 -208 -401 -82 336 299 -136 -413 -168 275 354 -44 -388 -240 220 399 51 -360 -298 146 410
4156 410 146 -317 -351 74 396 218 -239 -386 -25 376 293 -163 -397 -107 326 337 -85 -392 -184 258 359
4177 359 -5 -377 -265 190 374 72 -339 -325 103 376 144 -296 -367 16 366 225 -227 -387 -55 340 285
4198 285 -141 -387 -137 306 355 -52 -380 -213 238 401 30 -357 -267 178 397 118 -322 -337 74 389 189
4219 189 -268 -371 -4 359 256 -181 -387 -89 329 297 -115 -392 -167 258 336 -18 -383 -230 201 367 62
4240 62 -327 -284 134 378 147 -274 -336 52 375 210 -215 -357 -18 369 286 -141 -372 -106 314 335 -73 -385
4262 -385 -192 246 368 9 -358 -250 170 374 85 -317 -325 86 379 162 -256 -349 12 351 234 -180 -360
4283 -360 -53 331 292 -109 -363 -135 286 329 -30 -352 -214 224 368 55 -315 -267 144 366 120 -275 -325
4304c25L89K93j62m30j22L33L62q7m15k07K63M02J4m07k69J88M34Q4l44l35J07
4325b34M13J80k83l72J4L87K63k22l95o8L55L10j23m03j63K81L71m0l91k34K29
4346a25L84M9l50l03J42L95J44l12l39L5M08K18k48l81k8L72K79j68m00j08L29
4367gL31q8l82j88K49L76ml71k49J83L71J04l30l07R4L88J68k67l53RL72K26j87
4390A38l75o9L24L03j28l82j42K76L44m8l63k22K21L62M6l41k75J47L85J13k90
4411B4l30P4L72J90k28l62j3L38K73j73l77r0L02L14r1l72j75K46L61l2l37k48
4433c34J75L76P5l06k94J07L67J42k69l26L2L60K06k06l42n8L27K72j27l64j25
4454c12K83L28m6l69j91K15L43L0l30k53J43L63J05k82l13P4L53J83k37l41rL30
$$ plain form
4304 -325 64 357 195 -235 -357 -24 338 251 -164 -371 -108 294 308 -99 -368 -180 254 338 -6 -341 -234
4325 -234 179 359 76 -296 -282 105 368 146 -249 -317 38 348 225 -178 -341 -60 311 271 -120 -354 -125
4346 -125 259 308 -42 -345 -203 192 336 24 -315 -280 128 346 98 -283 -311 61 340 172 -228 -336 -7
4367 -7 324 236 -146 -334 -85 291 287 -84 -333 -150 221 325 -5 -312 -218 170 338 71 -282 -273 99 325 138
4390 138 -237 -306 18 321 193 -189 -331 -55 289 241 -122 -344 -123 239 285 -56 -331 -184 201 314 24
4411 24 -306 -232 140 330 102 -260 -273 65 338 165 -212 -302 0 314 223 -149 -324 -78 283 251 -86 -334
4433 -334 -159 217 292 -14 -308 -201 166 308 39 -287 -255 105 311 105 -237 -295 32 304 177 -187 -312
4454 -312 -29 299 253 -116 -307 -92 251 281 -49 -302 -159 204 309 27 -286 -212 141 324 87 -254 -263 67
4476F7K46j78l54q2K97K94q7l68j49K47L39l4l48j95J69L56O4l15k71J12L60J39
4498C09k59l16L8L48J99k01l44m3L23K46j28l52r9K55L06m6l66j72K09L32J6l18
4520f3k53J55L50Q5k71k91P1L44J70k43l23J3L24K25j55l60n1K89K66j06l28j28
4542b80K29L15k3l27k05J89L39L4k89k71J08L64J06k40l09M6L25J90k01l25l4
4563b59K99K37j23l54r8K78K82o4l38j62K24L16Ml14k35J58L48Q1k69k87R3L32
4585A49J52k37l05lL33K18j69l52o5L02K76j21l39j27K51K95j7l41j92J84L31
4606B23M4l17k42J17L49J10k64k88N6L27J83k10l25j8L14K29j42l33r8K70K93
4627B78o6l47j57K22L23jl12k31J59L43Q5l00k82J13L36J53k56l22L7L20K08j87
$$ plain form
4476 67 313 135 -219 -301 -4 290 203 -165 -314 -67 272 238 -110 -305 -136 220 284 -31 -302 -190 170 309
4498 309 50 -266 -228 120 319 118 -226 -269 54 300 172 -180 -279 -24 282 236 -130 -302 -93 239 255 -63
4520 -63 -316 -161 189 274 3 -288 -217 127 297 54 -269 -256 68 293 138 -222 -273 16 282 176 -152 -280
4542 -280 -51 264 241 -86 -291 -102 237 271 -18 -289 -181 183 289 49 -260 -214 111 301 100 -225 -259
4563 -259 40 277 154 -200 -298 -20 262 198 -140 -302 -78 238 242 -72 -307 -149 199 280 11 -276 -183 149
4585 149 301 64 -241 -244 89 307 138 -214 -279 23 299 178 -161 -288 -37 258 241 -100 -292 -108 223
4606 223 267 -50 -292 -175 174 284 20 -268 -212 115 298 88 -237 -255 59 288 146 -187 -285 -15 278
4627 278 212 -135 -292 -70 253 252 -60 -291 -132 211 296 -4 -286 -173 163 316 60 -262 -225 95 303 116
4649A16l47m7K99K70j25l39j32K63L05n6l27j80K04L25J6k95k40J24L51J10k77
4670A8k95P9L39J70k19l36oL26K31j71l29q7K96K83r2l38j71K52L15j0l41k20
4692c06J82L47N4l14k67J20L53J40k59l34M8L45K11k07l59l1L26K50j36l55r3
4713b85K75K86m2l47j92K26L38J3l30k52J67L51R3k93k92Q6L40J65k45l19lL44
4735H4K21j78l55o1L04K61j04l44j34K48L35m0l42k20K05L56L7l17k56J32L66
4756A98J20k85l11P0L40J85k03l43k8L19K54j51l60j00K91K99q4l44j68K35L20
4777B54rl23k42J64L50P5k92k70Q4L52J54k41l23L1L30K03j81l38m6K88K71j17
4799A74l42j14K52L08m2l27j98J97L40J3l02k52J45L33J15k83k97O8L52J52k05
$$ plain form
4649 116 -231 -278 21 291 166 -173 -305 -42 263 207 -120 -300 -96 229 245 -50 -290 -166 185 295 18
4670 18 -277 -198 141 311 92 -244 -250 76 307 136 -193 -280 16 299 207 -131 -302 -50 265 255 -86 -306
4692 -306 -124 223 277 -37 -304 -184 169 309 50 -284 -236 109 320 113 -246 -277 49 299 163 -192 -285
4713 -285 -10 276 234 -113 -305 -79 259 272 -58 -310 -143 208 301 8 -284 -198 142 307 62 -257 -260 84
4735 84 305 127 -228 -289 15 276 172 -172 -306 -58 277 237 -105 -325 -120 236 273 -44 -300 -168 198
4756 198 318 33 -278 -208 132 317 114 -229 -257 62 316 165 -195 -295 -4 295 211 -133 -301 -66 254
4777 254 245 -78 -320 -156 194 269 -23 -293 -209 143 297 56 -267 -236 94 297 116 -222 -268 20 291 174
4799 174 -168 -282 -30 278 236 -91 -289 -92 248 261 -41 -293 -148 185 300 17 -280 -212 140 292 87
4820H7l26j7L23K21j48l39q9K78K77p9l47j45K43L09k0l24k03J74L43N5k91k64
4842b82J13L34J39k51l02M3L18J96j81l31m6K98K44j27l33r8K51K81n3l34j79
4863c00K08L27Kl03k29J49L29Q2k68k71Q0L20J48k17l00J1K96K13j57l22n5K67
4885A0K59q4l18j41K33K86j3l10j93J81L07L4k77k39J11L14J22k55k79M7L07J70
4907B72j93l03l0K96K24j31l21q2K43K75p1l01j54K07K92Lk91k12J45L13P6k56
4929Ak48O5L29J22k06k87K3K90J84j56k95o3K59K34r5l01j14K28K60l1k89j77
4951b67J75K90L1k73k30J27K95R5k21k66M7L03J59j85k94j2K81K01j27k94o5K41
4973A1K40p9k78j41K04K72Jk87j77J36K78O5k51k24P3K90J09j90k71K4K76J72
$$ plain form
4820 87 -239 -256 67 288 140 -199 -288 -10 267 188 -159 -304 -61 248 228 -96 -299 -125 218 273 -18 -282
4842 -282 -169 165 304 53 -249 -206 112 308 127 -204 -250 48 292 165 -168 -266 -15 266 213 -121 -300
4863 -300 -92 235 237 -66 -295 -146 183 265 -3 -274 -194 126 274 57 -243 -232 64 277 120 -202 -257 10
4885 10 269 185 -133 -274 -41 245 232 -78 -271 -90 217 251 -26 -265 -154 160 282 27 -252 -205 102 272
4907 272 79 -224 -254 42 266 135 -186 -268 -25 250 179 -122 -276 -69 223 226 -65 -277 -132 181 257 1
4929 1 -247 -182 147 269 63 -224 -201 89 273 117 -178 -241 18 252 157 -144 -258 -30 230 199 -90 -267
4951 -267 -92 198 229 -44 -274 -147 148 243 22 -244 -197 106 265 80 -214 -226 55 256 129 -165 -230 11
4973 11 251 172 -106 -247 -43 229 230 -57 -234 -98 180 245 -6 -230 -157 133 242 52 -219 -195 81 253
4995B53j62k79m2K49K13j01k65j05K02K48m1k75j29J61K64J2k51j86J18K81O6
5016B31k11k42O5K73J33j75k53rK50J87j28k79n4K19K20p7k61j19J90K40j7k63
5038h0j71J40K60M7k18k20R4K70J00j93k29J9K65J57j59k56k5K37J86q3k76p6
5060b11J92K46l9k59j43J60K44J5k34j80Q2K72O6k00k17N1K58J22j78k41MK35
5082D5J65j18k57n2K02K25o4k66j05J82K32k1k37j54J35K48L7k12j87P6K51J03
5104B28j80k35L4K37J46j50k46j6K13J89r8k47q8J95K08l3k50j26J50K38Rk33
5126e5j68J18K43M6j78k07M6K49J22j50k47kK32J73j19k40n1K01J97p4k27r7J57
5149c1K28j3k35j57J30K40L2k11j87P8K33J06j75k25K5K27J41j29k48j7K11J69
$$ plain form
4995 253 91 -188 -230 19 232 131 -134 -239 -37 211 170 -105 -234 -73 191 203 -48 -234 -116 165 231
5016 231 20 -222 -157 116 249 74 -179 -188 62 249 121 -158 -212 7 227 150 -111 -230 -40 200 183 -80
5038 -80 -251 -111 149 196 -22 -242 -148 122 222 29 -200 -181 84 241 82 -174 -199 38 224 141 -135 -211
5060 -211 -19 227 188 -71 -214 -54 190 205 -29 -209 -127 145 211 11 -206 -155 103 225 47 -194 -190 45
5082 45 210 92 -165 -217 -15 210 146 -120 -225 -43 189 168 -69 -223 -88 160 197 -15 -202 -126 125 228
5104 228 48 -187 -153 84 230 80 -166 -182 31 220 122 -125 -213 -18 190 157 -93 -219 -69 169 178 -55
5126 -55 -223 -105 138 184 6 -201 -155 94 216 66 -181 -183 49 222 103 -137 -188 13 210 136 -91 -188 -31
5149 -31 197 184 -51 -208 -78 162 194 -17 -204 -126 107 213 38 -187 -162 65 206 77 -171 -188 23 192
5171A92p9k51o6J82K07m5k29j18J44K29J2k09j72R8K41O3j89j95N0K41J13j58
5193F1k13LK10J57j26k27n5J89K02o7k51r0J68K16k3k20j47J23K28L8k11j77R9
5216a13K21Q2j75j98L1K29J22j26k27j6K13J62r7k34n4J70K12n5k19j12J50K10
5238A76Jk17j57J11K24M6j93j85O1K25J13j78k06J1K36J39j44k15l6K03J77p3
5260A19k30p7J56K09k3k24j21J21K22K7k07j56Q1K23O9j65k00M3K15J28j48k00
5282a38j4J96J58r7k18o7J80J83n2k24j00J39K17kk22j40J05K32L7j80j90P9K21
5305A03Q8j61j92J2K26J28j27k10l8K00J69q4k27n9J58K04l7k11j22J29K01K2
5327A72k01j44O6K28N2j67j65L2J93J22j30k20nK01J50j08k07n2J74J94p2k18
$$ plain form
5171 192 113 -138 -204 -22 185 140 -89 -207 -63 166 178 -31 -203 -105 136 199 10 -185 -135 106 219 61
5193 61 -152 -149 61 218 92 -135 -190 -1 201 134 -117 -207 -39 177 154 -66 -213 -90 138 176 -35 -212 -113
5216 -113 108 190 15 -183 -152 77 199 73 -154 -170 43 205 108 -126 -180 -10 202 147 -72 -184 -34 176
5238 176 177 -40 -197 -86 138 184 -9 -194 -133 92 205 27 -179 -168 68 207 63 -152 -188 15 192 119
5260 119 -111 -188 -32 177 154 -70 -191 -70 152 179 -28 -184 -103 120 189 24 -176 -133 82 210 62 -138
5282 -138 -152 44 202 105 -113 -180 0 183 131 -93 -193 -54 163 161 -61 -201 -96 136 173 -7 -197 -118 103
5305 103 191 30 -162 -150 76 204 77 -133 -171 29 198 114 -113 -172 -14 190 153 -58 -180 -51 150 172
5327 172 -29 -173 -107 121 173 6 -159 -127 66 188 58 -162 -167 34 184 76 -131 -183 -9 185 113 -105
5349a05q7J53K07j6k12j22J15K17K3j84j68P9K10P9j55j85J1K26J02j16j98k7
5371a53J83J47p5k10o9J54J81l6k04r3J26J90qj83j37Q8K14L7j55j74O0J95R6
5394A74j31j79qK09J22j14j95k2J71J52p6k01p3J57J77l1j97j17J22J92K3j91
5416c6j46Q5J92O6j54j80M6K04R0j29j84nJ83J33r4j97l9J64J50l6k01p1J34J76
5440A51j4j80j23J08J83K6j57j56O9J97P3j59j70K5K00J01j27j72l3J87J32r0
5462G1j78o4J62J58m8j83r2J34J66oj70j26J01J81M1j54j48N8J79Q9j45j55kJ97
$$ plain form
5349 -105 -192 -39 168 152 -60 -182 -67 150 173 -11 -179 -100 110 189 34 -151 -140 86 188 72 -126 -153
5371 -153 30 177 102 -108 -177 -23 158 122 -82 -175 -49 141 133 -50 -187 -99 115 152 -3 -177 -117 78 174
5394 174 43 -136 -144 65 187 73 -122 -144 27 179 103 -98 -171 -14 163 132 -65 -182 -60 132 155 -36
5416 -36 -182 -97 95 161 7 -173 -127 77 167 38 -146 -151 32 165 71 -126 -165 -1 149 113 -88 -159 -25 151
5440 151 137 -43 -166 -58 125 151 -6 -162 -93 104 177 18 -152 -127 73 174 47 -125 -158 29 161 71
5462 71 -107 -171 -9 149 101 -82 -174 -40 126 120 -50 -176 -75 106 147 -7 -155 -97 82 171 26 -129 -131 66
$$ [...]
8191h6
##END NTUPLES=NMR FID
##END=
