##TITLE=1H_AM_NVPHENETOLE
 
 8 sc, 
 24.3.2023
##JCAMPDX= 6.0         $$ Bruker NMR JCAMP-DX V2.0
##DATA TYPE= NMR FID
##DATA CLASS= NTUPLES
##ORIGIN= UXNMR, Bruker Analytische Messtechnik GmbH
##OWNER= root
$$ XWIN-NMR		Version 3.5
$$ Fri Mar 24 13:51:34 2023 Russian Standard Time (UT+4h)  she@DPX200
##.OBSERVE FREQUENCY= 200.13135
##.OBSERVE NUCLEUS= ^1H
##.DELAY= (6, 6)
##.ACQUISITION MODE= SIMULTANEOUS
##.ACQUISITION SCHEME= undefined
##.AVERAGES= 8
##.DIGITISER RES= 18
##SPECTROMETER/DATA SYSTEM= spect
##.PULSE SEQUENCE= zg30
##.SOLVENT NAME= DMSO
##.SHIFT REFERENCE= (INTERNAL, DMSO, 0, 15.7039)
##AUDIT TRAIL= $$ (NUMBER, WHEN, WHO, WHERE, WHAT)
$$ ##TITLE= Audit trail, XWIN-NMR		Version 3.5
$$ ##JCAMPDX= 5.01
$$ ##ORIGIN= Bruker BioSpin GmbH
$$ ##OWNER= she
$$ F:/spectra/data/she/nmr/H-F/1/audita.txt
$$ ##AUDIT TRAIL=  $$ (NUMBER, WHEN, WHO, WHERE, WHAT)
(   1,<2023-03-24 13:49:39.81 +0400>,<she>,<DPX200>,
      <created by zg, POWCHK disabled, PULCHK disabled
       configuration hash MD5:
       00 E9 B6 7A A2 85 ED C7 34 08 36 98 17 FE 4E 26
       data hash MD5: 16K
       B3 51 7D 20 CD 8E F0 72 5A A5 BE 12 4C CF 40 03>)
$$ ##END=
$$ 
$$ hash MD5
$$ ED 57 8D 35 49 4C 9D E2 DD 72 FB BC 92 58 AE 92
##$RELAX= 
##$RELAX= 
##$RELAX= 
##$RELAX= 
##$RELAX= 
##$RELAX= 
$$ Bruker specific parameters
$$ --------------------------
##$DU= <F:/spectra>
##$EXPNO= 1
##$NAME= <H-F>
##$PROCNO= 1
##$TYPE= <nmr>
##$USER= <she>
##$AMP= (0..31)
100 100 100 100 100 100 100 100 100 100 100 100 100 100 100 100 100 100 
100 100 100 100 100 100 100 100 100 100 100 100 100 100 
##$AQSEQ= 0
##$AQ_mod= 1
##$AUNM= <au_zg>
##$AUTOPOS= <>
##$BF1= 200.13
##$BF2= 200.13
##$BF3= 200.13
##$BF4= 200.13
##$BF5= 200.13
##$BF6= 200.13
##$BF7= 200.13
##$BF8= 200.13
##$BYTORDA= 1
##$CFDGTYP= 0
##$CFRGTYP= 5
##$CHEMSTR= <none>
##$CNST= (0..31)
1 1 145 1 1 1 1 1 1 1 1 1 1 1 1 1 1 1 1 1 1 1 1 1 1 1 1 1 1 1 1 1 
##$CPDPRG= <>
##$CPDPRG1= <>
##$CPDPRG2= <>
##$CPDPRG3= <>
##$CPDPRG4= <mlev>
##$CPDPRG5= <mlev>
##$CPDPRG6= <mlev>
##$CPDPRG7= <mlev>
##$CPDPRG8= <mlev>
##$CPDPRGB= <>
##$CPDPRGT= <>
##$D= (0..31)
0 1.2 0 0 0 0 0 0 0 0.06 0 0.03 0 0 0 0 0.0002 0 0 0 0 0 0 0 0 0 0 0 0 
0 0 0 
##$DATE= 1679651379
##$DBL= (0..7)
120 120 120 120 120 120 120 120 
##$DBP= (0..7)
150 150 150 150 150 150 150 150 
##$DBP07= 0
##$DBPNAM0= <>
##$DBPNAM1= <>
##$DBPNAM2= <>
##$DBPNAM3= <>
##$DBPNAM4= <>
##$DBPNAM5= <>
##$DBPNAM6= <>
##$DBPNAM7= <>
##$DBPOAL= (0..7)
0.5 0.5 0.5 0.5 0.5 0.5 0.5 0.5 
##$DBPOFFS= (0..7)
0 0 0 0 0 0 0 0 
##$DE= 6
##$DECBNUC= <off>
##$DECIM= 32
##$DECNUC= <off>
##$DECSTAT= 4
##$DIGMOD= 1
##$DIGTYP= 9
##$DL= (0..7)
0 120 120 120 120 120 120 120 
##$DP= (0..7)
150 150 150 150 150 150 150 150 
##$DP07= 0
##$DPNAME0= <>
##$DPNAME1= <>
##$DPNAME2= <>
##$DPNAME3= <>
##$DPNAME4= <>
##$DPNAME5= <>
##$DPNAME6= <>
##$DPNAME7= <>
##$DPOAL= (0..7)
0.5 0.5 0.5 0.5 0.5 0.5 0.5 0.5 
##$DPOFFS= (0..7)
0 0 0 0 0 0 0 0 
##$DQDMODE= 0
##$DR= 18
##$DS= 0
##$DSLIST= <SSSSSSSSSSSSSSS>
$$ [...]
##$SUBNAM2= <"">
##$SUBNAM3= <"">
##$SUBNAM4= <"">
##$SUBNAM5= <"">
##$SUBNAM6= <"">
##$SUBNAM7= <"">
##$SUBNAM8= <"">
##$SUBNAM9= <"">
##$SW= 18.05172834244
##$SWIBOX= (0..15)
0 0 2 0 0 0 0 0 0 0 0 0 0 0 0 0 
##$SW_h= 3612.71676300578
##$TD= 16384
##$TD0= 1
##$TE= 0
##$TE2= 300
##$TE3= 300
##$TEG= 300
##$TL= (0..7)
0 120 120 120 120 120 120 120 
##$TP= (0..7)
150 150 150 150 150 150 150 150 
##$TP07= 0
##$TPNAME0= <>
##$TPNAME1= <>
##$TPNAME2= <>
##$TPNAME3= <>
##$TPNAME4= <>
##$TPNAME5= <>
##$TPNAME6= <>
##$TPNAME7= <>
##$TPOAL= (0..7)
0.5 0.5 0.5 0.5 0.5 0.5 0.5 0.5 
##$TPOFFS= (0..7)
0 0 0 0 0 0 0 0 
##$TUNHIN= 0
##$TUNHOUT= 0
##$TUNXOUT= 0
##$USERA1= <user>
##$USERA2= <user>
##$USERA3= <user>
##$USERA4= <user>
##$USERA5= <user>
##$V9= 5
##$VALIST= <valist>
##$VCLIST= <CCCCCCCCCCCCCCC>
##$VD= 0
##$VDLIST= <DDDDDDDDDDDDDDD>
##$VPLIST= <PPPPPPPPPPPPPPP>
##$VTLIST= <TTTTTTTTTTTTTTT>
##$WBST= 1024
##$WBSW= 4
##$XGAIN= (0..3)
0 0 0 0 
##$XL= 0
##$YL= 0
##$YMAX_a= 157856
##$YMIN_a= -162760
##$ZGOPTNS= <>
##$ZL1= 120
##$ZL2= 120
##$ZL3= 120
##$ZL4= 120
##$ABSF1= 10
##$ABSF2= 0
##$ABSG= 5
##$ABSL= 3
##$ALPHA= 0
##$AQORDER= 0
##$ASSFAC= 0
##$ASSFACI= 0
##$ASSFACX= 0
##$ASSWID= 0
##$AUNMP= <proc_1d>
##$AZFE= 0.1
##$AZFW= 0.1
##$BCFW= 1
##$BC_mod= 2
##$BYTORDP= 1
##$COROFFS= 0
##$CY= 11.3945322036743
##$DATMOD= 1
##$DC= 2
##$DFILT= <>
##$DTYPP= 0
##$F1P= 2.36226072786647
##$F2P= -0.459571619588291
##$FCOR= 0.5
##$FTSIZE= 0
##$FT_mod= 4
##$GAMMA= 1
##$GB= 0.15
##$INTBC= 1
##$INTSCL= 1
##$ISEN= 128
##$LB= 0.24
##$LEV0= 0
##$LPBIN= 0
##$MAXI= 10000
##$MC2= 0
##$MEAN= 0
##$ME_mod= 0
##$MI= 1.114404
##$NCOEF= 0
##$NC_proc= 0
##$NLEV= 6
##$NOISF1= 3.799351
##$NOISF2= 2.8
##$NSP= 1
##$NTH_PI= 0
##$NZP= 0
##$OFFSET= 15.70392
##$PC= 1
##$PHC0= -19184.5
##$PHC1= 8.800754
##$PH_mod= 1
##$PKNL= yes
##$PPARMOD= 0
##$PSCAL= 0
##$PSIGN= 0
##$REVERSE= no
##$SF= 200.130013532006
##$SI= 16384
##$SIGF1= 3
##$SIGF2= 2
##$SINO= 400
##$SIOLD= 16384
##$SREGLST= <1H.CDCl3>
##$SSB= 0
##$STSI= 0
##$STSR= 0
##$SW_p= 3612.71676300578
##$SYMM= 0
##$S_DEV= 0
##$TDeff= 0
##$TDoff= 0
##$TI= <>
##$TILT= no
##$TM1= 0
##$TM2= 0
##$TOPLEV= 0
##$USERP1= <user>
##$USERP2= <user>
##$USERP3= <user>
##$USERP4= <user>
##$USERP5= <user>
##$WDW= 1
##$XDIM= 8192
##$YMAX_p= 0
##$YMIN_p= 0
$$ End of Bruker specific parameters
$$ ---------------------------------
##NTUPLES= NMR FID
##VAR_NAME=  TIME,          FID/REAL,        FID/IMAG
##SYMBOL=    X,             R,               I
##VAR_TYPE=  INDEPENDENT,   DEPENDENT,       DEPENDENT
##VAR_FORM=  AFFN,          ASDF,            ASDF
##VAR_DIM=   8192,          8192,            8192
##UNITS=     SECONDS,       ARBITRARY UNITS, ARBITRARY UNITS
##FACTOR=    0.0002768,     1,               1
##FIRST=     0,             0,               0
##LAST=      2.2672688,     0,               0
##MIN=       0,             -162760,         0
##MAX=       2.2672688,     157856,          0
$$ Real data points
##PAGE= N=1
##DATA TABLE= (X++(R..R)), XYDATA
0@%%%%%%%%%%%%%%%%%%%mJ2j6J6j6J6j6J6k4L2l2L2l8M6n1N6o1O9p7Q4r6J05j13
42f0J28j44J57j70J86k06K29k52K76l01L33l70M10m57N12n77O56p54Q74j027J233
63F76j515J926k571L666n839J1488m8725j00143J37737p4483o052K6762j01529
76a58602J80179K9007j46016J25452l271j3207N5867j64702O9105J10097j50028
87f6119N0698K9574r956J35580j12399k6441J56919r9974k7052n953r8285J08779
99C5371o4187j33944J29526j2872q609N6467r1101J11694O5408j44876O0457J1117
111A4451l7108O4798j15652J9465J35220r2697K1898M6985l0940J04243p1463
122E9200q2469J12090o6081n0281J3009q4528Q2865Q829j10886R6525K2387k1201
$$ plain form
0 0 0 0 0 0 0 0 0 0 0 0 0 0 0 0 0 0 0 0 0 -4 8 -8 8 -8 8 -8 8 -16 16 -16 16 -22 24 -27 29 -32 37 -40 44 -52 53 -60
42 -60 68 -76 81 -89 97 -109 120 -132 144 -157 176 -194 216 -241 271 -306 350 -404 470 -557 676
63 676 -839 1087 -1484 2182 -3657 7831 -40894 -141037 -3300 -77783 -83835 -57073 -158602
76 -158602 21577 50584 -95432 30020 26749 13542 69409 -95293 -26188 83909 -66119
87 -66119 -15421 14153 4197 139777 27378 937 157856 57882 30830 24877 -73408 35371
99 35371 -28816 -162760 -33234 -46106 -54715 1752 -89349 22345 87753 -57123 3334 14451
111 14451 -22657 42141 -73511 -54046 81174 -11523 10375 57360 26420 130663 59200
122 59200 -23269 88821 22740 -27541 -14532 -99060 -16195 -7366 -118252 -21727 660 -20541
134b0541N5211p8344M0684P2556j14815J7654K7664l5232O6878n5249j1580J18712
146H3598m6924q221L8152m5607N5851l4128r3029O7210k4484m4176K8749n1070
158g4079N0736M3991p8433M9905K9473l1235L6584n4177k700O5479o7904p35L8696
171E601k2702N3417j5433k9392P9151k3406k8879K3287m4301K2083m270p1680
183e6524M0390N688k9387L2742k5831J9678M4253n2382J3833K2992l0848K2282
195F886k5076j6032N1203k6644n394L4915j4273K8739J334l3428L6813j0023l0601
208a581J2710k7154N127J2495l8753K0168J6675j7279K1128j0596j223K7917k8552
221h918l492J6502j8847J2653l264j3054L1607n064p679K1028j0266P459M257
$$ plain form
134 -20541 34670 -43674 -2990 69566 -45249 -27595 69 -35163 31715 -23534 -35114 83598
146 83598 36674 28453 66605 20998 76849 42721 -50308 16902 -7582 -51758 -23009 -74079
158 -74079 -23343 20648 -57785 -7880 21593 -9642 26942 -27235 -29935 35544 -32360 -33095 5601
171 5601 -17101 36316 20883 -8509 70642 47236 18357 41644 -2657 19426 15156 -56524
183 -56524 -16134 -10446 -39833 -7091 -32922 -13244 31009 -21373 -7540 15452 -15396 6886
195 6886 -18190 -34222 16981 -9663 -15057 19858 5585 34324 35658 2230 39043 29020 -1581
208 -1581 11129 -16025 -10898 1597 -37156 -16988 -313 -17592 3536 -7060 -8283 19634 -8918
221 -8918 -12410 4092 -14755 -2102 -5366 -18420 13187 8123 444 21472 11206 18665 22922
234B2922k5102J1890j439j9606Q897r987m44J4347j5689O788J2313j0482Q928
247C336l107p237J3244j0395m839J0460p507N553M022p439J2202M60o650P702
261I805n331j355L319j0354K213K193p248M224j056j624O428l829N35N001l732
276h11K333Q06l240L931j675k308L028k702k15J345l041J559M87j895K274j87
292c11n02J732j053q6L80j530J93J33l81J002J129J491J637J079R77L43n16j798
310C919k300k148k837k330j568q48R66J061J439K746J852J546Q80o96q5r79j936
327a318j65l2R25K443J749K881L118Q32K32j149l056l450m717m846l106k129j107
344a2895R75K579L157L666K837J617J705l53k121j067j837r02J093K50L383M650
$$ plain form
234 22922 -2180 9710 8271 -11335 -2438 -12425 -12869 1478 -14211 -7423 4890 -5592 3336
247 3336 229 -7008 6236 -4159 -8998 1462 -6045 -492 3530 -3909 8293 8753 2103 9805
261 9805 4474 3119 6438 -3916 -1703 490 -6758 -2534 -3590 -5214 1214 -2615 -2080 2921 -811
276 -811 1522 2328 -912 3019 1344 -964 2064 -638 -853 492 -2549 -990 -503 -2398 -124 -311
292 -311 -813 919 -134 -220 160 -1370 -1177 -1044 -1425 -423 706 2197 3834 4913 5890 6233 5717 3919
310 3919 1619 -529 -3366 -5696 -7264 -8112 -7146 -6085 -4646 -1900 -48 1498 2378 1682 1597 618 -1318
327 -1318 -1483 -1515 -590 1853 3602 6483 9601 10433 10665 9516 6460 3010 -1707 -6553 -9659 -11788 -12895
344 -12895 -11920 -9341 -6184 -2518 319 1936 3641 3288 1167 100 -1737 -2639 -1546 -1296 2087 6737
360F737K108L808J690r71p4n611n877l276p411l802j742k956M651K541J026P735
376a424J884J563L262n024P17L72p018K621Q68oQ585j66L865R512m060P45q37
393A5459r697K36r227j1236L840o331j299O506l772J0594O570o732R513l69n319
408a264N248j1212N71R173j0317O966Q048j826J4813l518m292J3531j2250p468
422F203j83j6583M477m781j6184J4821M69k387J3396p935R798J0919j9176O635
436e11K442j1324J0391j1429j99K3282j1154M628J4457p933J4731p302j9039J6916
450A7956j3657j5753N939j7308J0522P131k2295K0742Q969r539J4994j4342K817
463c824J8700k8666J925J2624j2868J7528p321n747L5871j1547p189J6863j6020
$$ plain form
360 6737 8845 12653 14343 13372 13298 7687 1810 -1466 -8877 -12679 -14421 -17377 -12726 -10185 -9159 -1424
376 -1424 460 2023 5285 261 978 1350 -5668 -3047 -2179 -2185 6400 6234 10099 19611 15551 16296 15459
393 15459 5762 5998 -3229 -14465 -10625 -16956 -18255 -11749 -15521 -4927 1643 -5089 4424 4055 -1264
408 -1264 3984 -7228 -6657 2516 -7801 -835 7213 5387 20200 16682 12390 25921 13671 6203
422 6203 6020 -10563 -6086 -10867 -27051 -12230 -11761 -14148 -752 -8687 1111 12030 -7146 -511
436 -511 1931 -9393 998 -10431 -10630 12652 1498 6126 20583 12650 27381 20079 1040 17956
450 17956 4299 -11454 -5515 -22823 -12301 -5170 -27465 -6723 2246 -7293 7701 -6641 -3824
463 -3824 14876 -13790 -11865 759 -12109 5419 -1902 -7649 28222 16675 9486 26349 10329
476A0329J0852o490l3524K1368m223k1223J4058j3580J2576K0222l0327J5574
488d388J6976j8498J2187j6503o136L0179k7306n232K5013j0540J9696j800j8100
501d452L8738q117k3584J5594j8991O509L093m1193K2514J2871k3975J7569r990
514a3414O505L0131l6854J616K4921k2867R843j1883j3853M2343j7935j5238L2718
527A6033q865J5269K358l3361L4102K30l6109J4318j5035L872J7348m1829J6902
540a4767K8356k5218J3540p624n030L5064l4427j3943L1360j8177Q054j783j9843
553b4438M5222l845k6671K9741p087N620O863m1962K3330J3832l8495J2004o136
566a2022N66K8452l7131L696L6500k4475N127m563j5329L7065k3545k4924L5361
$$ plain form
476 10329 21181 14691 -18833 2535 -1688 -22911 -8853 -22433 -9857 10365 -19962 -4388
488 -4388 12588 -5910 6277 -10226 -16362 13817 -13489 -18721 6292 -4248 15448 13648 -4452
501 -4452 34286 26169 2585 18179 -812 5697 8790 -32403 -9889 2982 -20993 -3424 -13414
514 -13414 -6909 23222 -13632 -12016 12905 -9962 -119 -12002 -25855 16488 -1447 -16685 16033
527 16033 7168 22437 24795 -8566 25536 25766 -10343 3975 -11060 -7188 10160 -31669 -14767
540 -14767 13589 -11629 1911 -5713 -10743 24321 -10106 -24049 7311 -10866 -2812 -4595 -24438
553 -24438 20784 16939 -9732 20009 12922 18542 25405 -16557 6773 20605 -17890 -5886 -12022
566 -12022 -11456 16996 -20135 -16439 20061 -4414 713 -3850 -19179 17886 -5659 -30583 4778
579D778r428N497P309k5659L8684P744l6003K1330m862k914J3265m1076J2063
592i272K6895l2966Q329J534n329L1857k8459j1891L5994j9060k260J114k0093
605b3607L3811o572k9590L1354m44O0J1920k7764K3444J6512l6908J0630P38p538
619c954J8009l1078Q58L3212k3766J491O090j1009K7723j7600k2286L1275j0470
632a505o233P303j9683K6563O822k9839K2501M126n834J3094k5517Q940K1329
645B2067l0227L631N863r240J9279j8782q375L0388j4682m554P598j3502J9858
658I322n515k4106K3092j343p644J0076j5599J5011J3338k5285J0881O739q789
671A78J1102j7280j050K1394j9125j730Q741q650J4727q248j3174K2371o668p692
$$ plain form
579 4778 -4650 847 8156 -17503 21181 28925 -7078 14252 9390 6476 19741 -21335 -9272
592 -9272 17623 -15343 -7014 -5480 -10809 21048 -7411 -19302 16692 -2368 -4628 -3514 -23607
605 -23607 10204 3632 -25958 5396 4952 5012 16932 -10832 12612 29124 -7784 2846 3584 -3954
619 -3954 14055 -17023 -16165 17047 -6719 -5228 862 -10147 17576 -24 -22310 8965 -1505
632 -1505 -7738 -435 -20118 6445 13267 -16572 5929 10055 4221 17315 -8202 738 22067
645 22067 -8160 -4529 1334 -7906 11373 -7409 -15784 14604 -78 -4632 2966 -10536 9322
658 9322 3807 -20299 2793 1450 -6194 3882 -11717 3294 16632 -8653 2228 8967 178
671 178 11280 -6000 -7050 14344 -4781 -6511 2230 -6420 8307 59 -13115 9256 2588 -5104
685e104P979j1422J1911L309k0157J4284L617q084R243j1153M610J3869j7943
698e041L053P362q308Q944q397n890J6909r556m432P997p236Q555r12j2281J3488
713D255m77p138O842p022M694O203j3697N610M688p114N661n597j042J0698r124
728b560q72O652n450M874k236o446R720l278m737N729m005L829K873p578O658
743C173K104n125L996l920m00M415p908O23L451m507L273j114j933O615l066j739
759b062M016l297J327Q7m392M135J48k386L914m73J594L023l045J674J079l607
775A735K49k288k261J378k856l93K295r45J712J016q41K210p52j670P89j470l40
792b432P02p47J904J857O60K287J033L91N41j487j354j386k538j586j280r11K75
$$ plain form
685 -5104 2875 -8547 3364 6673 -13484 800 4417 -3667 5576 -5577 -967 12902 -5041
698 -5041 -1988 5374 -2934 6010 -2387 -8277 8632 -924 -5356 2641 -4595 3960 3048 -9233 4255
713 4255 3778 -3360 3482 -3540 1154 7357 -6340 -730 3958 -3156 2505 -3092 -4134 6564 -2560
728 -2560 -3432 3220 -2230 2644 408 -6038 3682 404 -4333 1396 -2609 1220 4093 -3485 3173
743 3173 5277 152 4148 228 -172 4243 -3665 -3042 409 -4098 -825 -1939 -3872 2743 -323 -2062
759 -2062 1954 -1343 -16 71 -4321 -186 -38 -2424 1490 1017 2611 5634 2589 4263 5342 1735
775 1735 1984 -304 -2565 -1187 -4043 -4436 -2141 -3086 -1374 -358 -1199 1011 259 -1411 -622 -2092 -2432
792 -2432 -1730 -2477 -573 1284 1944 4231 5264 5655 6196 4709 3355 1969 -569 -2155 -3435 -4346 -4071
809d071L82Q41J329P98O10K06m11p54q80p89m34K69P40J338K179J851J693J624
827F521L40j41r82k213j776k169k366r55p58kJ124N61J241J294OJ38n78j209n67
846b491j091m42Q03Q04J855K294J894K306J270J31j44j486k022k126k611j689
862b745j017p02L32Q96J051J145O34J70j69p06j337j093m46k51O04J319J705K805
880B195K135J384J725J69p44j142k724j790j689k622n31k11Q5J711Q1Q34J770
897F36j140k98o51k086M32j249j134K619O08J824L246L90L229J595k304J058j585
914E190k828k54m161q82J622k960J368J549p93L353j623j711L086l269j413O58
930c068l032L169P40k293N792J442L93L899k826J940K020o574O29n76l939K474
$$ plain form
809 -4071 -3689 -2848 -1519 -721 -111 95 -316 -1070 -1950 -2739 -3173 -2904 -2164 -826 1353 3204 4897 6521
827 6521 6861 6720 5738 3525 1749 -420 -2786 -3741 -4499 -4501 -3377 -2816 -1575 -281 -275 -137 -715 -1924 -2491
846 -2491 -3582 -4024 -3221 -2417 -562 1732 3626 5932 7202 7333 7189 5703 3681 1555 -1056 -2745
862 -2745 -3762 -4464 -4132 -3236 -2185 -1040 -406 -236 -405 -1111 -2448 -3541 -3987 -4238 -3634 -2315 -610 2195
880 2195 4330 5714 7439 7608 6864 5722 2998 1208 -481 -3103 -3634 -3845 -3760 -2049 -1968 -1134 636
897 636 -504 -802 -1453 -3539 -3107 -4356 -5490 -2871 -2263 -439 2807 3197 6426 8021 5717 6775 5190
914 5190 2362 2108 -2053 -2935 -1313 -4273 -2905 -1356 -2149 1204 -419 -2130 956 -2313 -3726 -3068
930 -3068 -6100 -2931 -2191 -4484 1308 2750 3143 7042 4216 6156 8176 1602 2231 1655 -2284 190
946A90l925p13O010l746N10K915l192L858k417n376N474k615k486L443l302N150
962b22L649n604O327K291k975L821n604o3N030r012O0K909m312N116l331l095
978e015R660m425k827M122n260M394p91q960Q177N45m172N688m003M612O650r855
994a460M100M195n870L971o092k337R658q659k150O389m574N712k101p480J1344
1009D646k639o743N315n271M375L083j1761Q191M842o529N707m539J717R665j2200
1024b141K48P391o797M294m537n147J3465o650n938Q421m762M943O3j1631J1718
1039B940J253r545O163m461L280P112j3890N223Q422q309M569m170j840J2667
1053I414j1032m059J0115n921L697j986q602J4159k621r850Q509l486L329L549
$$ plain form
946 190 -3735 -4448 1562 -2184 -1674 1241 -1951 1907 -510 -5886 -412 -3027 -5513 -2070 -5372 -222
962 -222 3427 -2177 4150 6441 3466 7287 1683 1620 6650 -2362 -2302 607 -3705 1411 -1920 -5015
978 -5015 4645 220 -2607 1515 -3745 649 -142 -9102 -925 -380 -4552 1136 -2867 1745 8395 -1460
994 -1460 2640 6835 965 4936 -1156 -3493 6165 -2494 -4644 1745 -2829 2883 782 -6698 4646
1009 4646 2007 -4736 579 -4692 -317 2766 -8995 -804 4038 -2491 3216 -1323 394 10059 -2141
1024 -2141 -1893 5498 -1299 2995 -1542 -6689 6776 126 -5812 2609 -2153 2790 2853 -8778 2940
1039 2940 4193 -5352 811 -3650 -370 6742 -7148 -1925 6497 -1812 2757 -1413 -3253 9414
1053 9414 -1618 -5677 4438 -1483 2214 228 -8374 5785 3164 -6686 1823 -1663 1666 5215
1067E215j3553R368O323j1024M940l008L55R778j3758J42J1314p995K831k070
1081a142m829J4180p377q301J0980m413J966P13j1217J2604K295j1812P795j569
1095a27J567O843j3800M997R616j1203K619j838k895J1309j0818m387J2650n734
1109a201J310M03p263J2802k742j1351R316k145M1L555j1062R165P145j1262N429
1124B140O66j012P689j2016o25J0606r479j13K84m485J1053n813p235J1891l016
1139E35q01J996q558R220J310j1862P056M29q03N999q917N147R559r590K312J160
1155D192l682O879r039m736J0047o139j248K424m692R250j225q552Q697j059k847
1170a730K609p776N214M724r428M793L207j157O333n824O51Q666p485j311J281
$$ plain form
1067 5215 -8338 1030 7353 -3671 1269 -1739 -1384 8394 -5364 -5222 6092 -1903 928 -1142
1081 -1142 -5971 8209 832 -7469 3511 -902 1064 1777 -9440 3164 5459 -6353 1442 -127
1095 -127 1440 8283 -5517 -520 9096 -2107 512 -1326 -4221 7088 -3730 -8117 4533 -1201
1109 -1201 109 512 -6751 6051 3309 -8042 1274 -871 -830 2725 -8337 828 7973 -3289 2140
1124 2140 2806 1794 9483 -2533 -3158 7448 -2031 -2144 -1860 -6345 4708 -1105 -8340 3551 535
1139 535 -266 1730 -6828 2392 3702 -8160 -1104 -675 -1478 4521 -4396 751 10310 720 3032 4192
1155 4192 510 7389 -1650 -6386 3661 -2478 -3726 -1302 -5994 3256 2031 -6521 2176 1117 -1730
1170 -1730 879 -6897 -1683 3041 -6387 -1594 1613 456 6789 965 1616 10282 2797 1486 2767
1185B767m869M943m649n921Q524k146j759L531m169N623J296q405M651K19l449
1200c813L069n021K621O663n597K911L990j685M686l874k890N749n318k977J439
1215d7m027L603o32m756O190K86k147K779l578J768J858o543J805J585k255L320
1231g91j436J294O181k467O62K842k360J586k398m135K932k551k616J868j846
1246c235K274J521l184L056P10k522J087k590m53J875l293R77K585m21L083O81
1262B151K73L697j318j142Q41k487l34j218k957J492k63j145J785l25Q55J186
1278A091k099L85L3k113P3r43l45J802k40J148K559O45J594P16n49P35j098j734
1296A660m35j490o81r4q02Q29P06j23P34j10l57j61j297p23k85p58K25N44P11
$$ plain form
1185 2767 -2102 2841 -1808 -7729 795 -1351 -3110 421 -3748 1875 3171 -5234 -583 -364 -3813
1200 -3813 -744 -5765 -3144 3519 -2078 833 4823 3138 7824 3950 1060 6809 1491 -1486 -47
1215 -47 -4074 -471 -1103 -5859 331 617 -1530 1249 -2329 -561 1297 -5246 -3441 -1856 -4111 -791
1231 -791 -2227 -933 5248 2781 3443 6285 3925 5511 3113 -1022 1910 -641 -3257 -1389 -3235
1246 -3235 -961 560 -2624 432 1142 -1380 -293 -2883 -3336 -1461 -4754 -3777 -1192 -1613 1470 2151
1262 2151 2424 6121 4803 3661 4502 2015 1681 463 -2494 -1002 -1265 -2410 -625 -950 -95 1091
1278 1091 -1008 -623 -590 -2703 -2630 -3573 -3918 -2116 -2356 -1208 1351 1996 3590 4306 3757 4492 3394 1660
1296 1660 1225 -265 -946 -1040 -1842 -1013 -307 -430 304 194 -163 -324 -1621 -2344 -2629 -3387 -3162 -2618 -1907
1315a907J590J157J056J283M15N4k66q68q26r26r92m98j88k3K85M31L28K19n4
1334B70m07n03o73p87m45k57N8N96P23J072J207Q11Q06M38j29j99o70q03n14p74
1354a80l85M6q4L64L25L4L21j90m95k87o86n07k41l56K79N12M59R07P90O57O09
1375A892J00k6j52n38m72n21l91r9j63N6K57J93J41m5j50j73l69m31l86j59M2
1396a394j6L41M92M97O37K27K71L86k61j77j99n02N2l45m46M40r8j5L05l42L51
1417B04J07p56K39j75l79L75o07K20Q10n62M59M29k64Q79n06m60J023p67k21L34
1437C82r19Q42o1j192J148j65m29Q04j107O13R31j549P01L56p12J140j106l22
1455f45J716j373m8P18j056J448m84j456K048o21p25R49j591J134O85k462J516
$$ plain form
1315 -1907 -317 840 1896 3179 3594 3648 3382 2514 1688 762 -230 -728 -916 -939 -654 -223 105 324 270
1334 270 -137 -640 -1313 -2100 -2545 -2802 -2744 -2148 -1425 -353 854 1665 2471 2909 2780 2581 1911 1108 594 -180
1354 -180 -565 -519 -603 -239 86 120 441 251 -244 -531 -1217 -1724 -1965 -2321 -2042 -1530 -1071 -164 626 1283 1892
1375 1892 1992 1966 1814 1276 804 283 -108 -207 -370 -314 -57 136 277 232 82 -91 -460 -891 -1277 -1436 -1394
1396 -1394 -1410 -1069 -577 -80 557 784 1055 1441 1180 1003 804 302 354 9 -437 3 -95 -110 195 -147 204
1417 204 311 -445 -206 -381 -760 -385 -992 -772 38 -524 -65 364 100 979 473 13 1036 269 48 382
1437 382 -537 305 244 -948 200 35 -394 410 -697 -84 847 -702 -1 355 -357 783 -323 -645
1455 -645 1071 -302 -350 368 -688 760 276 -1180 868 247 -478 471 -1120 14 699 -1763 -247
1472b47M84r39J599j430M66K378k369L40J011j523J539j478j555K887j560q04
1488a201J510j561J984J93k921K644p6j719J428k179J041K150l422J538J780j343
1504a54K280j605n84L655k900j037J613k214J755r72k964L952n22j851K158j812
1520a202J719J228m522K205J142k595J809j934O05M100l542O18L145j812K111
1535C075j589k404M374k612k698K301k157J886L57m160M271R14l027K168k160
1550a461Q49K480n440J262K788k639K277j189k29N606l117j167L605k255J341
1565B711j165m174M560j059l802K834j442J593J876n042L094K334m041J439j820
1580b104l02L844m797K5M554k003K074j72j629N679k245l355L327k202M60m2m946
$$ plain form
1472 -247 237 -702 897 -533 -67 2311 -58 282 1293 -230 1309 -169 -1724 1163 -397 -1201
1488 -1201 309 -1252 732 925 -1996 648 572 -1147 281 -1898 -857 1293 -2129 -591 1189 -154
1504 -154 2126 521 -63 3592 692 -345 1268 -946 809 -163 -3127 825 303 -1548 610 -1202
1520 -1202 517 1745 -2777 -572 570 -2025 -216 -2150 -1545 2555 -987 -369 2776 964 3075
1535 3075 1486 -918 3456 844 -1854 447 -1710 176 533 -3627 644 1558 -1469 699 -1461
1550 -1461 -612 1868 -3572 -2310 478 -2161 116 -1073 -1302 4304 1187 20 3625 1370 2711
1565 2711 1546 -2628 1932 873 -2929 -95 -1537 56 1932 -3110 -16 2318 -1723 -284 -2104
1580 -2104 -2406 1438 -3359 -3334 1220 -783 1291 1119 -510 5169 2924 -431 2896 694 1154 1112 -3834
1597c834M227J149m172K760p76O41K818n505J080L290m146Q76r37r90N100l135
1613a554j189N319j318J277K92l169M607j048m813K726j365m5J449m625L113L007
1629B664m180J709k75q02K972m824q96M021l028M64N54j247N268j129k478M615
1645C408q39j36N43m038L033N60m874K151j13k92K464l825J342L601l860L19j41
1662f97j755K918l212j833M379j387M07J568j452M219J11l430L038n51j174Q00
1678A949l642J686J987l822J474Q93p11K364k889n89L156l081p95M14j753K625
1694g34j004j945M029R3p8J704j627K279P46l609J396Lj396J166k364O78K673
1711B010k484N15J015j224J546j993j778K351j814r36J024j071K257O03j597K845
$$ plain form
1597 -3834 393 1542 -2630 130 -646 -5 2813 -2692 -1612 1678 -2468 -1592 -2529 -3519 1581 -1554
1613 -1554 -2743 2576 1258 2535 2827 -342 4265 3217 -1596 1130 -235 -280 1169 -3456 -343 2664
1629 2664 -1516 193 -82 -884 2088 -2736 -3632 389 -2639 -2175 -1621 -2868 2400 1271 -1207 3408
1645 3408 2569 2433 2976 -1062 1971 2531 -2343 -192 -305 -597 1867 -1958 -616 2985 -875 -556 -697
1662 -697 -2452 466 -2746 -4579 -200 -1587 -1180 388 -1064 3155 3266 -164 2874 2323 1149 1949
1678 1949 -1693 -7 1980 -1842 -368 525 -186 2178 -711 -1300 1856 -1225 -2020 -1606 -3359 -734
1694 -734 -1738 -3683 346 439 361 2065 438 2717 3463 -146 1250 1253 -143 1023 -1341 -663 2010
1711 2010 -474 41 1056 -168 1378 -615 -2393 -42 -1856 -2792 -1768 -2839 -582 21 -1576 1269
1727A269O01o66J145j617O01R23k798M90O26r91J243j019o9K197j522m74O28j397
1745h30N61r58j735J646l39n44J341k70J427J138j239J261N13j018M50j099k06
1762I9R59j439J23R16n09Q30l26o18J100r78r31K15j003J56o6r01J183M95j25
1781h20J111O9N05P39r11J80K34q21J32l54k41P69l45l8O58k65J10k02p54J53
1801i1m97p60J12k60J32M19p8O74O33PM29O8p9J55m55k18J30k77N1J36j2L58L6
1824F13j37J01k39l02k49m38j91j18j75J31K18K39L49K44K44K48jn5k9j50j13
1845A90n5j05Q3J08J7J50Q2p0j2j74k39j24l05j79kj13Q8J85Q0K76J81N3K12k3
1869C04m4L4j56k1qj04J07M3k5J34m3j4L9j92n5n9j84%q4m5J48k0N6J77j0J10
$$ plain form
1727 1269 1870 1204 2349 732 1333 2256 -542 -52 574 -417 826 -193 -262 1935 413 -61 567 -830
1745 -830 -269 -1227 -2962 -1316 -1655 -2199 -858 -1128 299 1437 198 1459 1972 954 1404 305 99
1762 99 1058 -381 -258 658 149 979 653 35 1135 157 -774 -559 -1562 -1406 -1472 -2373 -1190 -695 -820
1781 -820 291 360 865 1604 693 873 1107 286 418 64 -177 592 247 209 867 602 712 510 -244 -91
1801 -91 -588 -1348 -1236 -1496 -1364 -945 -1023 -349 284 291 720 788 709 864 409 191 321 44 95 231 219 577 613
1824 613 476 577 338 36 -213 -651 -842 -960 -1135 -1004 -786 -547 -198 46 290 538 537 482 453 303 190
1845 190 135 30 113 221 238 388 470 400 388 214 -25 -149 -454 -633 -635 -748 -660 -475 -395 -119 62 115 327 304
1869 304 260 294 138 117 109 5 112 155 130 264 221 207 246 54 -1 -60 -244 -244 -328 -373 -225 -245 -189 -12 -22 88
1895H8L0n2R0k5p2J8m5J0Oq1L8Pk8J8o6N8K8o7N1LK1J9r6O4K4p1L5m4M5Q9j02
1926gO2O2o6O1j55p4J12k14p6P3j02K14oo4M00Kk1J88k06J50Lm28J62l1j82J97
1952E4k29J45L68l81J07J00l06K04m24k81M46l68k9L51j59N90J58l45O99l9k70
1973C91K48n73J42K13q24L06K12l02N01l74k4P30p45j56J88o17L69l79n78J001
1993b71j59q8P31k70P52L53r45O89M0o83L63p98J10P99j053K94O15m82O63n78
2013H2n43J032r40o14M51p19O65N1q74J473K93l87Q90n20N03O28j602M13M27r45
2033b36N53o58o7J481j077j42R14p63M89n94j224J297o26r69Q65m99Q76O73j235
2052i42J459P37r11P43p65O5J010j832M9J022q74P33m23m83J843r83r00R55r59
$$ plain form
1895 88 118 66 156 131 59 77 32 42 48 -33 5 12 -16 2 -64 -6 22 -45 6 9 30 49 -47 17 41 -30 5 -39 6 95 -7
1926 -7 55 117 51 112 -43 -117 -5 -219 -295 -222 -324 -110 -116 -180 220 222 201 389 183 333 336 -92 70 39 -143 54
1952 54 -175 -30 338 -43 64 164 -142 62 -362 -643 -197 -565 -594 -243 -402 188 346 1 700 661 391
1973 391 639 66 208 421 -403 -97 115 -187 314 -60 -84 646 -99 -255 -67 -684 -315 -694 -1272 -271
1993 -271 -430 -518 213 -57 695 1048 103 792 832 149 512 -286 -176 623 -430 -136 479 -3 660 82
2013 82 -461 571 -369 -983 -532 -1251 -586 -535 -1409 64 357 -30 860 340 843 1471 -131 282 709 -236
2033 -236 317 -341 -408 1073 -4 -146 768 5 494 -100 -1324 -27 -653 -1622 -757 -1256 -380 293 -942
2052 -942 517 1254 343 1086 321 386 1396 -436 -387 635 -239 494 71 -412 1431 448 -452 503 -456
2071d56K87k94j673J527J49j116J161j98P29J168j632Q50J083j306M28o50l95
2088c38J552j487m04J560o98N49j41j141J721o37j640Q83p66J46L76j721J436
2105g50J070j186J039n1K28J377j800OJ360j276K52l10o33J917q89r18J610n59
2123D87J55lj664J332o5j892Q47k72J18R86j485R69J577j222N73K1l55J351j498
2142d0o67J590q52O6K09q05J743k74j448J236l84l24K06j702Q54O92j672O99K67
2161f06j9J263j192J98J653j112M0J13o82J289q18j017J565l34r2M26r75J206
2179I06J52j669P46j51m99M66j331M50J201j209M18N23k42J099q36m81J411p48
2197B06l15K99o48J040j09j105J195M8l58M28r42N15M88j455K84K33m76O02p50
$$ plain form
2071 -456 -169 -463 -2136 -609 -460 -1576 -415 -613 116 1284 -348 502 1585 279 707 57 -338
2088 -338 1214 -273 -677 883 185 734 593 -548 1173 536 -1104 -221 -987 -841 -465 -2186 -750
2105 -750 320 -866 173 122 350 1727 -73 -67 1293 17 269 -41 -674 1243 354 -564 1046 487
2123 487 642 639 -1025 307 242 -1650 -803 -1075 -957 29 -1456 -487 1090 -132 441 462 107 1458 -40
2142 -40 -707 883 31 97 306 -499 1244 970 -478 758 374 50 256 -1446 -592 100 -1572 -873 -606
2161 -606 -625 638 -554 -356 1297 185 225 338 -344 945 127 -890 675 341 249 675 -300 906
2179 906 1058 -611 135 -16 -515 -49 -1380 -930 271 -938 -520 3 -239 860 24 -457 954 206
2197 206 -109 190 -458 582 473 -632 563 611 253 681 -261 254 742 -713 -429 -196 -672 -70 -820
2216h20M0J284p50PN23m11P45m18p67J060l06l83M14m83O56K64r81O59J88m74
2236D7L15o98Q7O16r47O2M06l30N09l11k58R75l96k54M12l74M06l6o93O63O0l79
2258a18L65l13K21L96p30K02K74m15K13l03j43N76m62r7L93k27K73n9l43N46j04
2279A45k96K84k03J35J60m67K89J65l03J71j33rL11l61%K60k09J09n3j52L31j49
2301B5j82K27j10O8O8k34K31P2k18J30o5l6J09k35K0J45j67N5L8m5J82n4o1K03
2325A66o3j5J7j21P6Kj41R0K5j5P2m8J8O7j23m1j6r8J2o6m3J03J0K9J35L0O6P2
2353B00o2K3mr9jl5n1O6pNJ01l3J1lq8m3o8j38Nn7l4R8QJ01J39J6J14N9m9M2n6
2384A60r2J8p6j7P4l8P8N9m5N9n5r6l5j43r2k8r0L6M8K9J69Q8N9J29j0J7%r9j8
$$ plain form
2216 -820 -780 504 -246 -239 284 -127 618 200 -567 493 187 -196 218 -265 391 655 -326 333 521 47
2236 47 362 -336 -249 367 -580 -518 -112 -442 67 -244 -502 473 77 -177 235 -139 267 231 -462 201 261 -118
2258 -118 247 -66 155 551 -179 23 297 -118 95 -208 -351 225 -237 -334 59 -168 105 46 -297 249 145
2279 145 -151 133 -70 65 225 -242 47 212 -91 80 -53 -62 249 -112 -112 148 -61 48 -5 -157 174 25
2301 25 -157 70 -40 28 96 -138 93 165 -53 77 12 -24 85 -150 -130 15 -152 -97 -59 -104 78 24 -37 166
2325 166 103 88 105 -16 60 62 -79 11 36 21 93 45 63 130 7 -34 -50 -148 -136 -202 -245 -142 -132 -103 32 62 128 200
2353 200 138 161 157 58 57 22 -29 37 30 35 136 103 114 111 23 -20 -88 -226 -221 -278 -312 -214 -206 -105 34 50 164 223 174 216 160
2384 160 68 86 10 -7 67 29 107 166 121 180 125 29 -6 -149 -241 -269 -359 -323 -275 -246 -77 11 70 199 189 206 206 107 89
2413H9l1o2M4oL8J05l3L7J5q4m2j26j21l7j18m5M1K1J27P5Q3J41N1L5J0o9J5n8
2441I5r5L9j0K8Q7k3P2N5r0k9j02j01m2j82m5K6m4Q9N4O5K18OK7J00p6M7n9j43
2469c3J28k9q1J30l2J02J02j79P8nj95Nj89p9J07k18M6J62m9K06Jl9L06j24q3
2494C8J13j63J05pk35K59M8j20K10j50J04J33l77M9M4k55Q9j97o9L58k37MK92
2517C6j09K32o0k30L96j31k28K05j95J65J31l84L24J52k57K03k12j5K83n11k4
2538b29K41k94J87j32j55N55k23j64L76j95J88J2m53M50K4l62K89j87J39L24n62
2559a71K35L12l95J83k28j19M94n11j66M42k75K10m7l38O47j23l91L77k01J43
2579G8J57o27M43K59m85K92j58K9M79o31K0M87m20J40j26k74O55l64l60N47k19
$$ plain form
2413 89 58 -4 40 34 72 177 144 181 196 112 70 -56 -177 -214 -332 -377 -336 -315 -188 -113 -30 111 162 197 207 138 153 95
2441 95 0 39 29 57 144 121 193 248 158 129 27 -74 -116 -298 -343 -317 -361 -272 -218 -153 65 71 98 198 122 169 110 -33
2469 -33 95 66 -15 115 83 185 287 108 186 181 -14 -9 -198 -277 -170 -388 -342 -180 -229 -23 -22 -61 245 121 38
2494 38 151 -12 93 86 -149 110 158 38 248 98 202 335 -42 7 51 -204 -115 -312 -381 -23 -260 -256 36
2517 36 -73 159 99 -131 265 134 -94 111 -84 81 212 -172 152 304 47 250 38 23 306 -205 -229
2538 -229 12 -282 -95 -227 -382 173 -50 -214 162 -33 155 167 -286 164 188 -174 115 -72 67 391 -171
2559 -171 64 376 -19 164 -64 -183 311 -200 -366 76 -199 11 -36 -374 273 150 -241 136 -65 78
2579 78 235 -392 51 310 -175 117 -41 -12 467 -164 -144 343 -77 63 -63 -337 318 -46 -406 141 -78
2600g8J35P0n30N97J03n79L76j30M3L35o85K61M76n38J93p4j39O17n55k34O38
2621C02l61R0km27O91j35n73N30j38L3K27o38M73L28o61K92l3q1M62o62J4O25
2643C56m85Q8M2k66O69l50m41O51k11m3J34n19N79J12p01M23K0q4L35o03K24N41
2665D71o43J09O7k03M89m82k62P31l33m4J61l19N98r7n98N61p1j63K09n14L79
2686D6L37o54K79J36j61L62m89m7N84n21n7J39k63M62k39l78O62j28j38K40l47
2707a75M05J14o37L54P8k14K56l99J56M93n24P8K02k32K97l37k79N42l12j82K28
2728h8k09L64J3m02M88M4k13K05k85J66K27n26J70J92j92K37k08j8M54l71r9J95
2750A44k60J64j57l28M03r5j70K55j26K35J60l78K64J27k41J27j90J8K77l17L6
$$ plain form
2600 -78 57 127 -403 194 297 -282 94 -36 7 342 -343 -82 394 -144 49 -25 -164 453 -102 -336 302
2621 302 -59 31 29 -398 293 158 -415 115 -23 10 237 -401 72 400 -261 31 -2 -83 379 -283 -269 356
2643 356 -129 -41 1 -265 404 54 -387 264 53 10 144 -375 204 316 -385 38 58 -26 309 -294 -70 471
2665 471 -172 -63 4 -199 290 -192 -454 277 -56 -100 61 -258 340 243 -355 206 135 -28 181 -333 46
2686 46 383 -271 8 144 -17 345 -144 -191 393 -128 -185 -46 -309 153 -86 -464 198 70 -68 172 -175
2707 -175 230 344 -293 61 139 -75 181 -218 -62 431 -93 -15 187 -45 252 -85 -364 178 -134 -316 -88
2728 -88 -297 67 80 -322 166 210 -3 202 -83 83 310 -216 -46 146 -46 191 -17 -35 419 48 -51 144
2750 144 -116 48 -109 -437 -34 -129 -299 -44 -170 65 225 -153 111 238 -3 124 -66 -48 229 -88 -52
2771e2K45j35J64q3j60L01k24k04J22j91O2J1k59K93R0j27J96n5P7J67k73O7J19
2794A51k00Q3n3l1K49j12l7K08j15M8n7j97J07j07k06R5p0K3J19j14J62J44q6
2817DQ1km1Q9j44m1J20o7M5N7l1J69k4r2Q3q7r8l3j66KJ1j25Q6N7NJ30j9M0R9
2846A08o8lKo6M5k2k1J13J0L9P6k1L0k2j19l8n9j22k6n8pO6j0O0R3J0N2J7n7L6
2876C8k9o0N6k9J4R2RO7N7l5L6n2p3m1j08p6j6o1J4L0J6P9M6PO6j0j5Oo2J7Jk1
2908c7O9M0K4Q7jMK3q6l5n4j00k1o3m0K6pM8P2lN0K7k3K2m0k4K0k1L0L4K8R1J5
2940A55lN2l6m0k0j15j5m1q5J8%K4M9j4N0L6l4L6l3j4L3n8J1N3nO0L7j5R0k0o6
2971I0L4p9k4k3j12N3j2m9O2k1M5O9q7N3L6p4M2n5NR3p4L0R3n1Q3j3q1J22o7j07
$$ plain form
2771 -52 193 58 222 139 -21 280 56 -148 -26 -217 -155 -144 -403 -110 -20 -147 49 -6 71 238 -35 32 151
2794 151 -49 34 -19 -50 199 87 50 258 143 191 134 -63 44 -63 -269 -174 -244 -221 -102 -216 -54 90 4
2817 4 85 83 42 131 -13 -54 66 -1 44 101 70 239 215 123 206 119 21 -12 -178 -176 -165 -290 -204 -147 -142 -12 -31 9 108
2846 108 40 37 39 -27 18 -4 -25 88 98 137 213 192 222 200 81 43 -16 -138 -164 -222 -229 -163 -173 -113 -20 -10 42 59 2 38
2876 38 9 -51 5 -24 -10 82 91 158 215 180 216 164 91 50 -58 -134 -150 -211 -197 -167 -151 -72 -26 -19 47 37 22 28 -34 -17 -16 -37
2908 -37 32 72 96 183 182 186 209 123 88 34 -66 -87 -150 -190 -164 -171 -123 -51 -54 -4 23 0 22 -18 -42 -22 -43 -13 21 49 140 155
2940 155 152 204 168 128 108 -7 -22 -63 -148 -130 -130 -106 -57 -71 -21 15 -19 17 -16 -30 3 -55 -44 9 4 64 101 86 176 156 90
2971 90 124 45 21 -2 -114 -61 -73 -122 -60 -81 -36 33 -54 -1 35 -39 3 -52 -47 46 -28 2 95 44 127 114 33 155 88 -19
3001a9N1q9L1J7j49J10M0q9R5n8L1J15j57L3Q3j05R1n9m7J98j14l9J32r8R7l0
3027G1j56J75l6j29J05j06P0R2k32J29Q0j41J30j02MK12k38J1J51j26R6n7j47
3050a44K75j20j31J80j23J06M1k54K34M8j99J43j16L6J85l04Q6J92j92J50p8q6
3072g1L15k15j20K08j74Q1l2k51L31m6k31K47j22J06J44l55K19J59k95J53j21
3093g0k0L22l11qK98j98J39n9k14L76j99k69K48j72N6N9l32L45J16k93K57q0K3
3116A4K59m27Q7K85l17J45n1j11M36k64j51L93j90L7j9l57L51r6l99K71r8M1K08
3139D7l79K97K77l54J82m1q9L39m17m8M05k57R7N5j68M63j65l26L62j95o3K6m38
3162c90K89J08m40K74K9qL04l57J33L84l97Q2J4j75L78k74j76N05j60K5J42k90
$$ plain form
3001 -19 32 -57 -26 -9 -158 -48 -8 -97 -2 -60 -29 86 -71 -38 45 -60 31 -28 -75 123 9 -30 102 4 101 71
3027 71 -85 90 54 -75 30 -76 -6 86 -146 -17 63 -78 52 -50 -46 166 -72 -61 90 -36 60 3 -144
3050 -144 131 11 -120 60 -63 43 84 -170 64 112 -87 56 -60 -24 161 -143 -57 135 -57 93 15 -71
3072 -71 244 29 -91 117 -57 24 -8 -259 72 26 -205 42 -80 26 170 -185 34 193 -102 51 -70
3093 -70 -90 232 -79 -87 211 13 152 93 -121 255 56 -213 35 -137 -81 -22 -354 -9 107 -186 71 -9 14
3116 14 273 -154 -67 218 -99 46 -5 -116 320 56 -95 298 108 145 126 -231 120 24 -375 -104 -202 -161 47
3139 47 -332 -35 242 -112 70 29 -60 279 -138 -186 219 -38 59 114 -54 409 244 -82 280 85 22 48 -390
3162 -390 -101 7 -433 -159 -130 -138 166 -191 -58 326 -71 11 25 -150 228 -46 -222 283 123 148 290 0
3184@L63n4m83K67j38j56J39m00K20K97l79K11J06p8L25l27o6M02l19j7J13j86
3206a60L96q2k54M70o6j01J34l63K03L5n24J61nj58K18k64J02M14l11Q9J55j74
3228h5K47k12k17M08j67n2K01j57L39Q0l48L19k0k18Q6l44M0J53m37J15J31j34
3250b72K57j44k2L89k39p0J46j88J89p7k21L72Kp1K24j23J76J06l70J16lk56P8
3273ak44k8K43k61M6K16j07J82o5j51K84j49j37J56j17J34Q1j71K86R4j19J65
3295C37j27NQ6l20j4M1k23Q2q8m4K59j15k6J77j02Q4k8j62J53k7j04J50j2R0J40
3320B12j14J45Q3j43L3j00r4N8k04m3R2j03O2K1m8J71l2r2R4o5j3L2j20R9P3n5
3346e1J28M7K0J08j00J6M4j41k6m7j09O0n5n2R3j6K2M5n5N9Mr9M7k2mN7l9O6R9
$$ plain form
3184 0 363 309 -174 93 -45 -201 -62 -462 -242 55 -324 -113 -7 -85 240 -87 -153 249 -70 -87 26 -160
3206 -160 236 154 -100 370 304 203 337 -26 177 212 -312 -151 -156 -314 -96 -360 -258 156 -155 -66 89 -85
3228 -85 162 -50 -267 141 -26 -78 123 -34 305 385 37 356 336 118 204 -140 -100 53 -384 -269 -138 -272
3250 -272 -15 -159 -181 208 -31 -101 45 -143 46 -31 -252 120 122 51 275 152 328 434 64 180 177 -79 -1
3273 -1 -245 -273 -30 -291 -245 -29 -136 46 -19 -170 114 -35 -172 -16 -133 1 82 -89 197 291 172 337
3295 337 210 215 301 -19 -33 8 -215 -133 -221 -265 -6 -121 -147 30 -72 12 -16 -178 -25 -52 -156 -6 -18 72 212
3320 212 98 243 326 183 216 116 22 80 -124 -167 -75 -178 -116 -95 -143 28 -4 -96 -2 -67 -80 -48 -168 -69 4 -51
3346 -51 77 124 144 252 152 168 212 71 45 -2 -111 -51 -106 -158 -65 -81 -59 -14 -69 -10 -6 -105 -58 -80 -84 -27 -66 0 99
3375I9k6N7M4l2K5n0p5J7p7l7J1m6K9J9l6O7jl3L2l6rJ8m2J9L6nM8J9J3O6j7k0
3407G7L6n8Kl4n5K9l1k3M0j4JL4m2K8Ll2K4j0j4L6l0J8L8j9L5Nk0L4j7k2K1m2
3439bmK5m2J6pk7L9qj8L4j1J6J2m1L6J0l5L4l1MK3n3K9J8l3K9rk8O7o1ML1m2K6
3473Ajm6P2k5j6N6k4K9J8o6N1j0o7K6n7OL6p0M0M1l7O7k3j3O9p2j7N1m5L6Qm4
3505b6J17j1l6O4n5L3%j28M4j1j02N2o9J9J09j05N2Q2o4P7l8o1J18r5m0R5n2R4
3533F3K6r1J66j1p7O8j27RL5k04M8M3j10J02o2K0J88j35PJ15j19Q8n6j18K05p3
3559@p2J73o8J02P4j88J48J3j80P3j41l1J14k36M0J49j19J38m5m7K42j55q5J41
3583D0j33R0J3j82K65L0j35J98q0O8J19l07R5N6k38P3j23n0K34k18LK27j34J21
$$ plain form
3375 99 73 130 174 142 167 117 42 59 -18 -55 -44 -90 -61 -42 -78 -11 -12 -45 -13 -49 -58 -40 -82 -63 -27 -32 16 35 48 114 97 77
3407 77 113 55 57 23 -32 -3 -34 -57 -17 -31 -30 4 -38 -10 -7 -39 -15 -25 -39 -3 -33 -15 23 4 39 44 24 58 41 19 40 -2
3439 -2 -6 19 -23 -7 -14 -41 -2 -10 -28 6 -5 11 23 -18 18 28 -7 27 -4 0 23 -30 -1 17 -16 13 4 -24 43 -18 -14 17 -25 1
3473 1 0 -46 26 1 -15 41 17 46 64 -2 49 39 -28 -2 -59 -53 -17 -87 -47 -6 -43 24 1 -12 57 -15 -32 19 -26 10 18 -26
3505 -26 91 80 44 108 53 86 86 -42 2 -9 -111 -59 -128 -109 0 -105 -53 29 -35 42 4 -57 61 -34 -74 21 -31 63
3533 63 89 -2 164 153 76 144 17 26 61 -143 -95 -52 -162 -60 -122 -102 86 -49 -42 73 -46 42 -14 -132 73 0
3559 0 -72 101 33 135 209 21 169 182 2 75 -66 -97 17 -219 -179 -30 -149 -11 -56 -103 139 -16 -101 40
3583 40 -93 -3 10 -172 93 123 -12 186 106 174 293 -14 81 137 -101 -28 -151 -201 33 -185 -182 45 -89 32
3607C2k9j65K87j41j66K05j11R0J05k27K80J11k16J83j05l2J59l65K1J63k63R7
3629h7m2r5L21j73r1K65j52O6Kk60K95j6k43K55o4O9J99k84J93J88k94R7q9j23
3653f3K32l25p3K82k09Q6K9j64L31j11k17K56j12rR6k97K63J39k71K46KpK40l10
3677C4L8K42l29M6l4j69K78k07j61L27j43K5Q5k33K80rl19K34n1l0J77k66J79
3700fK61k79J63L9r9K29k92r2K72k58oL7j64K74q4k32L10p7n6J08k46J85R6l15
3724b32J93L7o2K16k20Q3K86k58N7M5j61J94j82j87K96j55n6J19j80K22K3k74
3746a96K33k5j03J23k22J06J99k72J26J13r5J96j46m1K56j97n1Q0j55J55o1k04
3768a81K53n3r3J25j58J15Q6k65J32M3j25J40j28J3K30j84L8J32j19J45q1j18
$$ plain form
3607 32 3 -162 125 -16 -182 23 -88 2 107 -120 160 271 55 238 133 101 260 -105 -84 79 -184 -87
3629 -87 -129 -224 97 -76 -167 98 -54 12 14 -246 49 33 -210 45 -19 50 249 -35 158 346 52 149 60 -63
3653 -63 169 -156 -229 53 -156 -70 -41 -205 126 15 -202 54 -58 -67 29 -268 -5 134 -137 109 111 104 344 34
3677 34 72 314 -15 31 -3 -172 106 -101 -262 65 -78 -53 32 -201 79 70 -249 -15 -66 -96 81 -185 -6
3700 -6 255 -24 139 178 79 308 16 -76 196 -62 -68 -31 -195 79 -5 -237 73 -4 -60 48 -198 -13 83 -232
3724 -232 -39 -2 -64 152 -68 15 301 43 100 145 -16 178 -4 -191 105 -50 -106 13 -167 55 78 -196
3746 -196 37 12 -91 32 -190 -84 115 -157 -31 82 -13 183 37 -4 252 55 4 84 -71 84 23 -181
3768 -181 72 19 -74 51 -107 8 94 -171 -39 4 -121 19 -109 -96 134 -50 -12 120 1 146 65 -53
3790e3K01j13r1J03j22J03K6j90J72J3j13R7j06L2J23k12O4J03j15J11m7m8K02
3813A40j38k5J19j03P1oj49J60l1j04Q4o1L7P7j64Q0O4j10P4m7j3J08j15J0R7
3838E5q4O5rp0J24m5q7J03n2J0L4j01Q6K7j03O0j6j5N5q1K3O5o5L0J6m5O9m3n3
3867d7Q1n0J9J3p0O7qn1O6j5j8N4o0J3L5o1L8%k3N1j6k0P1n2QJ6m4L0l4m6M5k0
3899b8k2L8l2K8L9m6L1Om1M1l3j0M5l0J6L7j3L8jk8L0k3l7K2n9RJl8K0%qM7oj3
3933b0L5m1PRk6L3pkN1PjM6k3J7j0l6ol1m2J3l9j5L7j3K9K0l7L6Mk7K4l5kL1k7
3968d1M5M5j4N8MjK3m1k5j0m4j6k2m2L9k3jM7j5K7jl7K5j3l9L5k1K9N2k8O4N3
4000A12k1K5j1l7K7p6m1J3n7K4j4k1O8rj4L1l4%Ro7L4J9k5N4jL3R7n0L7M0n9K5
$$ plain form
3790 -53 148 35 -56 47 -75 28 54 -136 36 49 -64 33 -73 -41 82 -130 -66 37 -78 33 -14 -62 140
3813 140 2 -23 96 -7 64 58 -91 69 38 -66 18 -43 -6 71 -93 -13 51 -59 15 -32 -45 63 -52 -42 55
3838 55 -29 36 27 -43 81 36 -51 52 0 10 44 -57 29 56 -47 13 -3 -18 37 -44 -21 44 -21 9 25 -20 49 6 -47
3867 -47 34 -16 3 16 -54 13 5 -46 20 5 -13 41 -19 -6 29 -32 6 6 -17 34 18 -2 69 17 25 41 -3 27 -7 -53 -8 -28
3899 -28 -50 -12 -44 -16 23 -23 8 14 -27 14 -19 -29 16 -14 2 39 26 64 63 35 65 42 5 27 -32 -23 -22 -60 -40 -40 -48 -1 -7 -20
3933 -20 15 -26 -19 -10 -36 -3 -10 -12 39 46 45 91 68 85 75 39 33 2 -40 -27 -66 -81 -44 -57 -28 -8 -45 -9 -5 -32 -8 -43 -45 -14 -41
3968 -41 4 49 35 93 97 96 119 78 53 43 -1 -17 -39 -81 -42 -65 -66 -19 -34 -7 -8 -45 -20 -33 -72 -37 -58 -29 23 -5 59 112
4000 112 91 116 105 68 95 19 -22 -9 -66 -42 -56 -77 -9 -18 -32 -1 -35 -35 -26 -93 -59 -40 -65 -11 -12 21 118 68 105 145 86 111
4032A11o4o1N0o9n6O5n3M3J6o3J00k3n7M8o2J8L3j00Q6M7k7R2k0J1J23r2rL4j00
4061B1M7o5r5J12n7n3Q2n0O3K2j25Q3Lr8P0o6K0J08j06O4J12n6R5m3l7J32j17
4088F6o6O5j03M7j6j12J50k0q3R4p4L3O0j83Q0N6j11R1n3J8J79j23K6J34j03Q0
4114A32n1j12J67j07j14J20q6N5L4j76J54L4j39J02q2OJ16j98N5J26j14R5k3m6
4138e2K22j21n1J40j24N6lj70J81l9j38J28o8L1Q6j94J01R5j81J02o5k5J66j78
4162a01rJ95j08O8mj03K14q9j22J48r5K6M0j93J63N7j97J35m7jJ25j99N0J41j75
4187h1P3j9o0J99j34p3J94j12L6L5j49J96j8j83J39m5j1R4k00J10J02j84R8j2
4211em7J65j71j2J78j40L2J7j00J78p8j31J82p7QO1j61J60K9j86J14mm8J08j64
$$ plain form
4032 111 47 -14 36 -33 -89 -24 -77 -34 -18 -81 19 -4 -61 -13 -75 -57 -24 -124 -38 9 -18 74 54 65 188 96 87 121 21
4061 21 68 3 -92 20 -37 -90 -8 -58 5 27 -98 -15 -12 -110 -40 -106 -86 22 -84 -20 92 36 131 88 51 183 66
4088 66 0 65 -38 9 -7 -119 31 11 -72 22 -52 -19 41 -142 -62 -6 -117 -26 -79 -61 118 -5 21 155 52 132
4114 132 81 -31 136 29 -85 35 -51 4 38 -138 16 50 -89 13 -69 -63 53 -145 -90 36 -78 17 -6 -52
4138 -52 170 49 -2 138 14 70 67 -103 78 39 -99 29 -39 -8 78 -116 -15 80 -101 1 -64 -89 77 -101
4162 -101 -110 85 -23 45 41 -62 152 63 -59 89 -6 20 60 -133 30 87 -110 25 -22 -23 102 -97 -47 94 -81
4187 -81 -8 -27 -87 112 -22 -95 99 -13 23 58 -91 105 87 -96 43 -2 -13 81 -119 -9 93 -91 7 -5
4211 -5 -52 113 -58 -70 108 -32 0 17 -83 95 17 -114 68 -9 -1 60 -101 59 88 -98 16 12 -36 72 -92
4236i2L9J66j74O0M1o4J61j19p1J73j13j1K5j22J34Lj71J58k1l8R6j48Q5R2j82
4261i3P4K8q5J41j14mJ73j13K6P1r7J19n5j31J47p1o9N9j23J02M8j51J18J8o3
4286d5P7r1oJ16j40K4O3n6J14k7m1J68o0l7N9j07O9k5j47J03j9q2Q3p3M3Q4j15
4313f8N3L0o9O2o3l9J23p8RJ00m1R4J2q3J22m0q0K7q8OK1j30P6K9p5P8l5PP6j02
4343f6lN6p5L2Rj8J02j2NQ6nL6J6q7K9l7p9Rn1qN3p4L4N6n6M3k1m1N1p2k6P1l8
4376h1L7M6oQ8K6j6M4j8k7Qq6kpo3J4Lk1N1l0OL4l9pom7L2j0lN2J8M0O0qM6J5
4411A43m8J6l0n9J0n4j6K7l5J0K1j7J6j1m6K7k8k4J8j4L3L4RO5K4J6M1j5pjm6
4442E9l0ll1Jj2rK6k6J0Pk7Jpl5jnlL9J0K9M7OM0K1j2Kk6k4kl2k4Mj4J4Mj3J7
$$ plain form
4236 -92 -53 113 -61 -1 40 -24 137 18 -53 120 7 -4 21 -101 33 36 -135 23 2 -36 60 -88 -3 89 -93
4261 -93 -19 9 -76 65 -49 -53 120 7 33 104 7 126 71 -60 87 16 -53 6 -117 -15 33 -118 0 18 -45
4286 -45 32 -59 -65 51 -89 -65 -2 -58 56 29 -12 156 96 59 118 11 80 55 -92 11 -8 -90 -7 -80 -37 47 -68
4313 -68 -15 15 -54 8 -55 -94 29 -49 -40 60 19 113 125 42 164 124 44 71 -17 -11 10 -120 -44 -15 -90 -12 -47 -40 36 -66
4343 -66 -69 -13 -88 -56 -47 -65 37 25 30 116 111 147 163 76 105 68 -11 -2 -53 -61 -8 -82 -48 8 -48 -5 -26 -67 -16 -88 -114 -43 -81
4376 -81 -44 2 -4 84 110 94 138 120 93 101 15 13 6 -57 -43 -40 -61 -10 -40 -34 0 -39 -46 -52 -99 -67 -77 -80 -28 -10 30 90 82 128 143
4411 143 95 111 81 22 32 -22 -38 -11 -46 -36 -15 -32 -16 -27 -73 -46 -74 -98 -80 -94 -61 -27 -18 47 71 87 128 113 106 105 59
4442 59 29 26 -5 -4 -16 -25 1 -25 -15 -8 -35 -34 -41 -76 -77 -82 -85 -46 -36 -7 40 46 86 107 95 97 71 47 45 13 -11 -7 -21 -7 -3 -16 1
4479Aj6j8Pm7jMk3L0K3J6L9J5RM8j3J0nm0J1k1k5Rk8PL0l0NRl8J3k1k3K9m8LM3
4515c6%L6J3pN7j4mL3k6Qj3n4RRl1K4j3J2J7m6J3J3l9K3m0pN5k8jN2k1L9J0l6
4549GN1j2l8K2l6J8J0n2L2J6k5K4l4rN6n7KL1n0K9k0%O5k5j5L6l0L5J0p2N1Mm5
4582b1N2n1PN1p8L1L1n6O4m6j2P3n4j5M3l9M2j5m4P6l6l3N3m3L1L5r9O3J3m6M2
4613A9m7KO7q4J2O0n8N7k4l3J03n0l0O1o1K9lp0O5rn4O3m7OP5j16M3N0p4N4m3
4644c7k2J04o5k3J06o8O1Lq3J17k5q6O4o8K0L1j03O7M3q6O4m3rR5j26J3P8q4M7
4673a5mn7J44n4k5J12n4L7J5j19Q3j6j05P2n2OO7j14N6O3q4M6k8m6J04r8k6J04
4701A2n5M7L5p1J48j9q4J06p1J8K9j49N9L0j05N9k2j3Q6q9KR0j01K5j5o3J03m0
$$ plain form
4479 1 -15 -33 -26 -73 -74 -70 -93 -63 -40 -24 15 30 39 87 74 84 79 39 50 29 4 13 -15 -8 22 -8 -3 6 -32 -19 -40 -63 -34 -82 -79 -36
4515 -36 -36 0 13 6 63 49 45 78 52 60 47 -7 2 11 -20 4 -9 3 20 -26 -13 0 -39 -16 -56 -63 -8 -36 -37 15 -6 33 43 7
4549 7 58 46 8 30 -6 12 22 -30 2 18 -7 17 -17 -26 30 -27 -25 6 -44 -15 -35 -35 30 5 -10 26 -4 31 41 -31 20 24 -21
4582 -21 31 -20 -13 38 -40 -9 22 -34 30 -16 -28 45 -9 -24 19 -20 22 7 -37 39 3 -30 23 -20 11 46 -53 10 23 -23 19
4613 19 -28 -26 41 -43 -31 29 -29 28 4 -29 74 24 -6 55 -6 23 20 -50 15 6 -48 15 -32 -26 49 -67 -24 26 -48 6 -37
4644 -37 -59 45 -20 -43 63 -5 56 59 -24 93 68 -18 46 -22 -2 29 -74 -7 36 -50 14 -29 -38 57 -69 -56 22 -62 -15
4673 -15 -19 -76 68 14 -11 101 47 84 99 -20 63 47 -58 14 -38 -32 35 -79 -23 40 -44 2 -26 -72 32 -66 -92 12
4701 12 -43 4 39 -32 116 97 13 119 48 66 95 -54 5 35 -70 -11 -33 -46 40 -49 -47 43 -58 -33 -48 -111 -8 -48
4729d8m6J28k5L4N3q3J19kj03O8n8l5N7j37M3P0r7M6Ol5Q6q5n2R3p6PK4o0J06
4758bJ5n7J33j3%N5r9N5K8j26L5j2m4O1p6LR2p9J5K1o9O7n6p6R7m3kO5n2J11M3
4789I0o5Q7j2k6L8r1PK8r9M1J0m5O4l8k8P5o4k1J5p1O6k0o8J03j0MP4j8M4N8p6
4820E2K7Rn4K6p0j2N7n4OM7l2K7l0n9O0m7l8K7m2M1K4l4O6L3pN5j9NM2o4j0Qm7
4853gL5l2k0O1l5j3L3m3J7j2o1J8pk7L4j2L8N1k0M1L8k5M1l9j6L9n2j9K2k8J5
4884A5kj4K7k8k3K1m6oMl1K2J7j4M2J5J2L8j4%M2l3Qj9k1J7k2j1J7jMRl1J9k2
4918ik5%k0mK2j2MK7KJ9K3nJ8k6pK7j7j0J4k0PJ0rOqj3Rk0lmk4NPmJ2J4OL4j6
4957A0PJ7j9lJ2k1J1lj2J7j7J7Lk3Jjj7J3k6NNpRJ4oJ1NkJ9j8%Rj4J2J7k2J4j
$$ plain form
4729 -48 -94 34 9 43 96 13 132 130 27 95 37 2 59 -78 -35 35 -62 -16 -10 -45 41 -44 -96 -3 -79 -72 -48 -108 -2
4758 -2 13 -44 89 76 76 131 32 87 115 -11 24 12 -32 29 -47 -44 48 -31 -16 5 -64 3 -53 -129 -32 -75 -77 -12 -64 47 90
4789 90 25 112 100 74 112 21 28 56 -43 -2 8 -37 27 -11 -39 36 -28 -49 -34 -105 -39 -59 -127 -24 -34 -30 44 26 70 128 52
4820 52 79 88 34 60 -10 -22 35 -19 -13 34 2 29 -1 -60 0 -47 -85 -58 -100 -59 -35 -69 -3 30 23 78 59 64 106 42 32 40 -7
4853 -7 28 -4 -24 37 2 -11 22 -21 -4 -16 -77 -59 -66 -93 -59 -71 -33 18 -2 39 77 52 93 54 38 77 25 6 28 0 15
4884 15 13 -1 26 -2 -25 -4 -50 -56 -52 -83 -61 -44 -58 -16 -1 11 49 35 35 77 44 52 33 12 29 7 -4 13 12 16 25 -6 13 -9
4918 -9 -34 -34 -54 -58 -36 -48 -44 -17 -15 4 27 22 40 14 7 34 17 7 21 1 8 18 9 15 7 -6 3 -17 -20 -24 -48 -43 -36 -40 -28 -14 -8 26 10
4957 10 17 34 15 12 24 3 14 11 -1 16 -1 16 19 -4 -3 -4 -21 -8 -34 -29 -24 -31 -22 -8 -14 -3 2 0 19 1 1 10 -4 8 25 3 17 16
4995A6j3K5j5j1knro%J1onJ1koJ1KJJ1j0Jj2KJ8j4OOj3K1j7j3K6j6lQj4J1jj2
5034a8J7Oj3J1rJJ8j8JNpkkKK2k3KOk5K4qj7K9jrJ8oJ0J1k7NRj2Qj7MOk0QK1k1
5075a1Qjj7K6k3rK1j1J0Rk5M1J1j2J4j7NJ4l9J3Mj5J9l2RK1k0j1K1l2K0j8j7L9
5109epj2J6jL4J3l1L7Qk6J2k3mK3m7NK1k5L0k6j1L5l8j6K1k7K6pk9N8%j3L2rK1
5144C5K7n1K2J4l8J0j9j1L5l5KK2l0J7mm2M4l7j6K8k5K0L0l4N1L3k5K5j7MK8o1
5176BJ3K7n4K7j6j9O1l7l3N1m5J4j8m5M6rl3M8k0K1O1n7M4L7m7L9l2j6M0m7nM1
5208C9n0L1Ll9N2k7l9J6k2KQn5M4K2k6L6OQM5l7%M4m3J0ol2M7k5k2M3l5K0rl5
5242b6K9j7m2J5j4oM1m1M1K3j1L4KpM4m7mL3l9J4jk1L8j3k7L5l0kJ3o9L5on4K7
$$ plain form
4995 16 3 28 13 2 0 -5 -14 -20 -20 -9 -15 -20 -9 -11 -17 -6 -4 -3 8 -2 -1 -13 -11 7 -7 -1 5 -8 13 -4 -17 9 -7 -10 -2 -16 -5 -6 -18
5034 -18 -1 5 -8 3 -6 -5 13 -5 -4 1 -6 -8 -10 -8 14 -9 -7 -1 -26 -2 -10 -27 2 1 -8 10 4 14 25 -2 3 12 0 8 -9 -5 1 -19 -11 10 -11
5075 -11 -3 -4 -21 5 -18 -27 -6 -17 -7 2 -23 18 29 17 31 14 19 33 -6 7 11 -4 15 -17 -8 13 -7 -18 3 -29 -9 -27 -44 -5
5109 -5 -12 -24 -8 -9 25 38 7 44 52 26 38 15 11 34 -13 -8 13 -12 18 -8 -19 16 -22 -38 -17 -44 -18 -25 -54 4 4 -9 23 14 35
5144 35 62 11 33 47 9 19 0 -11 24 -11 -9 13 -17 0 -4 -46 -2 -39 -55 -27 -52 -32 -2 -36 15 48 23 48 31 35 63 2
5176 2 15 42 -12 15 -1 -20 41 4 -29 22 -23 -9 -27 -72 -26 -35 -68 -20 -40 -19 42 -15 29 66 19 58 26 10 50 3 -2 39
5208 39 -11 20 23 -16 36 9 -30 -14 -36 -34 -26 -81 -37 -15 -41 -5 1 9 54 17 17 61 18 28 22 -10 37 12 -10 33 -2 18 9 -26
5242 -26 3 -14 -56 -41 -55 -61 -20 -61 -20 3 -8 26 28 21 65 18 14 47 8 22 21 0 38 25 -2 33 3 1 14 -55 -20 -26 -80 -53
5276e3J6kM1k2J5M7n1L3Qk3L9l6k0L6k2%K6l5L7Nn9K8j5j4J3n1K2J9l6J7K6OK5
5309B0pkL6k8kOk4L0k1l0M3mjNk6MJ1m1J0%j2Nk0J2L4k0RK5pK8j3k8M5l4J0%j7
5346dK1Mk3K4Jk4J7k2oJ7m3NJ8j8J8pQL2k2LJ2j3J1Kk3K2j7LK0j4PPk3J4Jj4R
5383Cj8%J2j1LJ1j7J4j2JK9j4%kmRJ1k6K3pj4K3j3oJ5njJk0J3mqRj0KJ6qlJ5r
5423bJ2Kj8K4j5j0QpnJ3qNqj0J6j5OJ3J1rjoMkl%kKpJ6j5N%Q%j1loJ0qMjJ2nJ1
5468ELkOjj2NKjloOpjJ0jj5J2j6NkpPk%JL%K4j0J3lQooJkj4LjkLnlJ4nj8Nj2L
5517b4j%J1J4JjJ1QlMlMj3Qj6l%jMj0Rloj5Kmj1OjJ0KJ4J0J2lJ1llJ5j3mj0kO
5561Ipj4K5j1j2Nj2jpKMklJ2j6K1J6pQmJ1Jnj0J7rnMK%j5pJ4mkqpoKj3J6PoJ9
$$ plain form
5276 -53 -37 -39 2 -20 -5 42 -9 24 32 9 48 12 -8 28 6 6 32 -3 34 39 -20 8 -7 -21 -8 -59 -37 -18 -54 -37 -11 -5 20
5309 20 13 11 47 19 17 23 -1 29 8 -22 21 17 16 21 -5 -1 10 -31 -21 -21 -33 -28 -48 -36 -2 -22 -13 12 5 33 20 -8 37 3 13 13 -4
5346 -4 17 21 -2 22 23 -1 16 -6 -12 5 -38 -33 -15 -33 -15 -22 -14 18 -4 -1 11 -2 9 11 -12 10 -7 -4 16 2 9 16 -7 7 8 -6 3
5383 3 -15 -15 -3 -14 -11 0 -17 -3 -15 -14 15 1 1 -1 -5 4 15 -11 12 5 -9 14 1 -5 10 5 4 5 -15 -2 -6 -14 -5 -15 -13 3 -5 -8 7 -2
5423 -2 10 12 -6 18 3 -7 1 -6 -11 2 -6 -1 -9 -19 -3 -18 -12 1 12 3 2 -4 0 -2 -5 -5 -7 -5 -12 4 -11 -6 -6 2 2 -9 -12 -18 -8 -16 -12 -13 -1 -6 5
5468 5 8 6 12 11 -1 4 6 5 2 -4 2 -5 -6 4 3 -12 0 -16 -11 -13 -20 -13 -15 -15 -14 -11 -11 13 3 16 13 21 15 9 10 8 -6 -3 -4 -6 -3 -8 -11 3 -2 -20 -15 -27 -24
5517 -24 -25 -25 -14 0 1 0 11 19 16 20 17 21 8 16 0 -3 -3 -4 0 -10 -1 -4 -10 -25 -23 -27 -38 -32 -33 -23 -21 -7 3 15 12 23 20 17 32 19 15 5 3 9
5561 9 2 -12 13 2 -10 -5 -17 -18 -25 -23 -19 -21 -24 -12 -28 -7 9 2 10 6 17 18 13 3 20 11 6 10 12 12 -3 -10 4 0 -2 -10 -17 -23 -21 -34 -18 -11 -17 2
5605BNlJ5j2J0nmJ2k2LJ0lj3J9j0jJj8Ljj2Mj2JJ9k6K7J4mJ5nkJ7j3nJ2j4J9p
5644A6k1K6k0Nkj1Oll0QpKK0j8PK4j8J3LKJ4j0oK5j4j1K1rR%k4J7ok5J0j3mJ6
5682hk0J1J2k0J8JjL1j5j1J8j2OJj4J5loRj2J0Nk8K3j7rNj4KJ1k1J2K1j1J0jj
5719cK3k2LJ3j6J4nk1K6Mj8K2k0LNk4QJ1l5K5okJ9j6nL3k2J8oj3K4j9mJ6j2jJ4
5756A1k2PJ2j9J2ojJ0j7jJ4rJ4j2j3K6rJK1k1mJ3k1K0nj4J5j0J2Nk5K0Qk8J3j
5792dj0J7j2LJ1lPj1pJ1KoMp%Oj7J8J3k5NRpJ1j9NJ9j9J4j0nK1k2kK4j1JJj4K0
5832A1kk3K6moOk3OJ8k7J8j0ML0k2j1J5pOPlnmkJ2j5OJ4k5QJ6k0Rj2JPj9KJ2q
5872a4J2Qj2K3j4nJ8j7QJ6j9Nj4pK6oKNj5Qqlj0MjOj7LJ2rJ8LkPrJ0Pj1oJ5k0
$$ plain form
5605 2 7 4 19 7 17 12 8 20 -2 1 11 8 -5 14 4 3 4 -14 -11 -12 -24 -20 -32 -31 -12 -38 -11 3 -1 14 9 7 24 11 6 18 4 23 16
5644 16 -5 21 1 6 4 -7 -1 -4 -34 -26 -33 -31 -11 -29 -22 2 -16 -3 0 2 16 6 0 25 11 0 21 12 21 21 -3 14 8 -17 -7 -20 -24 -8
5682 -8 -28 -17 -5 -25 -7 -6 -7 24 9 -2 16 4 10 11 -3 12 9 3 12 0 10 15 -13 10 -7 -16 -11 -25 -23 -12 -33 -21 0 -11 -1 -2 -3
5719 -3 20 -2 1 14 -2 12 7 -14 12 16 -2 20 0 3 8 -16 -8 3 -32 -7 -13 -15 4 -12 -17 16 -6 12 6 -7 17 -2 -6 10 -2 -3 11
5756 11 -11 -4 8 -11 1 -5 -6 4 -13 -14 0 -9 5 -7 -20 6 -3 -2 19 -2 -6 7 -14 6 1 -13 2 -8 4 9 -16 4 12 -16 -3 -4
5792 -4 -14 3 -9 -6 5 2 9 -2 -9 2 4 -2 2 -5 -5 1 -16 2 15 -10 -5 4 -3 8 -11 -6 13 -6 8 -2 -7 14 -8 -10 14 3 4 5 -9 11
5832 11 9 -14 12 8 2 8 -15 -9 9 -18 0 -10 -6 24 2 -9 6 -1 5 12 9 4 0 -2 10 -5 1 15 -10 -2 14 -6 3 -9 -8 -1 -20 -18 -6 -14
5872 -14 -2 6 -6 17 3 -2 16 -1 7 23 4 9 -5 -12 14 8 10 15 0 8 0 -3 -13 -9 -10 -4 -21 -18 -6 -15 3 6 4 11 2 12 19 8 2 17 -3
5913cJ1Mj6J5Nj2roNmj3OqRoQOK1jKMqQJj3OJj0KjlRj0%Jqlnj3Rjj6K4oJ4J0L
5960IPnkJ0nqNnLMj2J3j0rJ7j3j4LKolqJ1pJ0OMLJ9qpJ5j7J3j2kLMJj1Pklj0Q
6005brj8J5llLJPJ4j0K2rmJ7j3pPjmM%kJ1pPj3njljqpMNkJ5j4OJ1LJ0j5jPoJ1
6051A2llJ5j2mKLmj7M%qPj7MmJ2MmJ7lLQpJ3plLj2LJ5j0jMj5J1rlmj3nJ3m%RL
6097gPJj0K0jj1PlJ7kj1J3%n%j2lMj4Jj1jJ4j8LJ3oLQJlPj0J9rkQj1QJ7k7J8J
6140A3oJj2oj%oJ5j3J2q%J3ojM%jQj3J9KrJ1j9%KrJ1%j7J6qlkN%Kl%NrK6mk3K4
6186A0j0mMpMJ0%J0j8lJ4okOj9J6j0KJ7qjlj6J3Kj3J4ppJ3j3J1J2k4J2Oj5Pj4
6225a7MK2j7NOlJjmJ4lpJ1rjMj5J3Mk0J8j5mJ4j5lJ7j1J5Jj6K5j4L%p%Oj0PJ1
$$ plain form
5913 -3 8 12 -4 11 16 4 -5 -11 -6 -10 -23 -17 -25 -16 -22 -14 -8 13 12 14 18 10 18 19 6 12 13 3 5 4 1 10 0 0 1 -7 -10 -15 -28 -19 -20 -36 -12 -18 -4 6 9
5960 9 16 11 9 19 14 6 11 6 9 13 1 14 4 -5 12 -1 -15 -12 -10 -16 -19 -27 -16 -23 -13 -7 -3 0 19 11 4 19 2 15 3 1 4 8 9 -2 5 3 0 -10 -2
6005 -2 -11 -29 -14 -17 -20 -17 -16 -9 5 -5 17 8 4 21 8 1 8 7 3 7 7 5 16 9 16 3 -2 -3 -6 -7 -15 -22 -18 -13 -15 0 -14 -8 3 6 16 1 0 7 1 12
6051 12 9 6 21 9 5 7 10 6 -11 -7 -7 -15 -8 -25 -21 -25 -13 -9 -13 4 1 4 12 5 18 11 8 11 -1 2 17 7 6 10 -5 6 -3 -6 -10 -23 -28 -15 -19 -19 -10 -7
6097 -7 0 1 -9 11 10 -1 6 3 20 18 7 20 20 15 15 3 0 4 -10 -9 -20 -21 -7 -25 -22 -9 -15 -12 -4 -3 -6 1 -9 10 1 -1 7 -4 4 21 -6 12 13
6140 13 7 8 -4 -10 -11 -11 -17 -2 -15 -3 -11 -11 2 -4 -5 -1 -1 -2 6 -7 12 14 5 16 -3 -3 -1 -10 1 1 -16 0 -8 -11 -13 -8 -8 -6 -9 -9 -4 -13 13 9 -14 10
6186 10 0 -4 0 -7 -3 7 7 17 -1 -4 10 4 2 8 -11 5 -5 -3 14 6 5 2 -14 -1 1 -12 2 -5 -12 1 -12 -1 11 -13 -1 5 -10 -3 -17
6225 -17 -13 9 -8 -3 3 0 1 0 -4 10 7 0 11 2 1 5 -10 3 7 -13 5 -10 -14 0 -15 -18 -1 -12 3 4 -12 13 -1 2 2 -5 -5 1 -9 -2 9
6266Ij9K2j0%J0j9jJ6j7Rmk3K7Jj6J4M%OrJ1jj6NPJPj8PNpJ1j3j0K3j6pNrJ1j0
6307a4oK3nj8K6j0NJ9k3K3kj1Mj0QJ1rnPlqMoJkpkj2NNj2OK1rRmLmj3J5J4kj0
6350BjJ3Rrj2Ljj9Oj4R%j4J3oJJ1oJ5OmLnqQPJJ6j5J1Mj1Lj1j2%pj1J1j6K0no
6393b1J2OlK1j9RRj7MJ1qQJlJ7mj4JRj9Nk3J0j5KRmOPn%QK%JmJ9pnJlJ3Qr%oj
6440Ir%j0Mj5%Oj1OMJ1J2j2kJ0jj0NjJ2knK9j1lJ8k0KLk6Jmj9J2j0PRj2nK9j4
6481a3PqRJ1oQjlPPj3J0J4j0nnj0lk2J6j1LlkJ2lJ2j2QjJ1j0ML%RjMoRJj1KnP
6526A0k2Oqj4PNp%J1LJ0nJ0lnRjNM%j2J4j2OLj2OKj6LknJLqPkmQoPrNKJ0KLqQ
6575I%KplPPj4oKjjpML%kJ1j1PPj5LQj0MLoJ5lk%j2J2rOmqJ4Kp%Lkj0PMNrOJq
$$ plain form
6266 9 -10 12 2 2 12 -7 -8 8 -9 0 -4 -27 0 1 -15 -1 3 3 9 0 11 10 -6 -1 6 7 14 -4 3 8 1 12 -1 -11 12 -4 -11 -6 -15 -4 -14
6307 -14 -20 3 -2 -20 6 -4 1 20 -3 20 18 7 11 1 9 20 11 6 13 10 2 6 0 1 -1 -8 -10 -22 -17 -12 -24 -18 3 -6 3 -1 2 -2 -15 0 14 12 2
6350 2 1 14 23 14 2 5 4 -15 -9 -23 -14 -14 -28 -15 -21 -20 -9 -15 0 6 2 5 0 -8 0 7 8 24 9 20 24 13 16 5 -7 -7 -14 -25 -14 -30 -10 -15 -21
6393 -21 -9 -3 -6 15 -4 5 14 -3 1 12 4 12 13 10 27 23 9 10 19 0 5 -18 -8 -23 -21 -12 -16 -10 -3 -8 -8 0 2 2 3 -1 18 11 6 7 4 17 25 16 16 10 9
6440 9 0 0 -10 -6 -21 -21 -15 -26 -20 -16 -5 7 -5 -7 3 2 -8 -3 -4 8 6 1 30 19 16 34 14 16 19 -7 -6 -10 -29 -17 -27 -20 -11 -23 -28 1 -13
6481 -13 -6 -14 -5 6 0 8 7 4 11 18 5 15 29 19 14 9 -1 -4 -26 -10 -21 -18 -21 -23 -11 -14 -2 -14 -6 -7 4 -6 -2 1 1 10 9 13 7 16 17 6 8 3 10
6526 10 -12 -6 -14 -28 -21 -16 -23 -23 -12 -9 1 -4 6 3 -2 7 6 11 15 15 3 17 5 11 14 2 8 10 -6 -3 -5 -10 -9 -6 -14 -7 -9 -13 -5 -11 -4 -13 -8 -6 4 6 9 1 9
6575 9 9 11 4 1 8 15 1 -5 -3 -4 -5 -12 -8 -5 -5 -7 4 -7 0 7 -8 -5 3 -7 -3 0 -6 9 6 4 4 -8 4 -5 1 -3 -11 3 5 -2 -2 1 -1 -11 -4 0 5 -4 2 3 -5
6626eKOrJ0qnJ7l0K8lqJ0mj3J2kJOj0OkNjmkJ7j0%KKj4J0j4J4lj3K2j7JNj0RM
6669BKo%j1PkPJ2rQMj7LJJkj0Rmk0J7Rj6K2j4J0J0k5J5NrPmoJ7j2KJ3j9K0mj4
6711aJ3rj1Mk7J3J6k2J4Mj5K1J%JpP%KLJ2j6K1j4j4J9j0kJj6J0jj8Pj1KK7j8M
6750a0K0j4POj1J4poJ2oRMj9J2jj5K2k7kOk2J0Oj1J3nrK0%JQlOLj8K3pj4K5om
6791A0Kj9J3Lj4nklNj7J3OqJ2olJ4kj4K5k0OJ8j3J9kj2K1j2j2J1j9njj5J2lk1
6829c8K4nrJ6pMNJOKjJ4rQOj4K0pj0J7j0qjk1J2%k2K%J1J6rjLj0nJ5KkJ2j6K2
6871A3%%RmlQj7KKk1Qj6lJ7j0kOj0Rlj2K6j3JPMnJ9j0J3Rk3J6lqjpnLoqJ1rJ1
6915ekpJ6rlMmJ3j6PJ4P%%jJjlLk0Pj4Nj7K0j8J8j4pJ8Oj7J4j1mK0j3POJlQKJ7
$$ plain form
6626 -5 -3 3 -6 4 -4 -9 8 -22 6 3 -5 5 1 -12 0 -2 -1 5 -5 1 -1 4 3 -1 -3 14 4 4 6 8 -6 4 -10 4 1 -12 10 -7 -6 -1 -11 -2 2
6669 2 4 -2 -2 -13 -6 -8 -1 11 2 10 14 -3 0 1 2 0 -10 -1 -5 -25 -8 1 -15 7 -7 3 13 -12 3 8 -1 6 2 -4 13 1 3 16 -3 17 13 -1
6711 -1 12 3 -8 -4 -31 -18 -2 -24 -10 -6 -21 0 1 1 2 -5 2 2 4 7 19 3 24 10 -4 15 5 3 4 -12 -2 -3 -21 -14 -25 -23 4 -14 -10
6750 -10 10 -4 3 9 -2 12 5 -1 11 5 14 18 -1 11 10 -5 17 -10 -12 -6 -28 -18 -12 -23 -10 -15 -24 -4 -4 -3 5 2 8 11 -7 16 9 -5 20 14 10
6791 10 12 -7 6 9 -5 -10 -12 -15 -10 -27 -14 -8 -16 -4 -10 -13 1 -1 -15 10 -10 -4 14 1 20 18 6 27 15 3 14 -5 -10 -11 -26 -14 -17 -38
6829 -38 -14 -19 -28 -12 -19 -15 -10 -9 -3 -1 -2 12 3 11 17 3 23 16 6 23 13 5 4 -17 -5 -5 -27 -25 -25 -14 2 -7 -8 -5 -15 -20 -5 -3 -5 7 -9 13
6871 13 13 13 22 18 15 23 6 8 10 -11 -3 -19 -22 -5 -15 -17 -11 -21 -12 -15 -27 -1 -14 -13 -6 -2 -7 12 2 15 24 1 17 14 6 5 -2 -7 -4 -10 -18 -7 -16 -5
6915 -5 -7 -14 2 -7 -10 -6 -10 3 -13 -6 8 15 15 15 14 15 14 11 14 -6 1 -13 -8 -25 -5 -23 -5 -19 -26 -8 -2 -19 -5 -16 -20 0 -13 -6 0 1 -2 6 8 25
6959B5j9Knj4J0j1jMjLLJkNoKKl%kpJ5rJ4oJ5Lj3mJ0nj3MmnJ1j1J5j1JPkpJ1j0
7004hJ1oOpJnJ2JmKkQoj1PNj6POlpnKJ0j6J1J0j2PokNmNKj3K1Kj6J5j3J2q%Qr
7050cJKJkJ0j6oJ9j2PJMmLnjMjj8NJ6rQmmjJ3j0j3PLKoK%MMNJlJpQlnPj9P%jM
7101dRpkOrJ0oOKNoooJ9kpPKrMj1pjPj3LOJ2pkRrnP%kNnKOlNK2j3rNoNk3K0j8
7152a4jQj9J2NpQmQNj6RNqJ8LmQrMPoJ3j3j0oj2NLj9J2Qj4J5oj4K2Lj7J5JrK1
7195A0j7J6okJ0jj4J4qj1Rk0J1lj3K1rlMLkkLPkrOMMJ0j0QJ4j5Rj8MQj0oJ0k3
7237a9K%nJ2poJ2qJ6Mk0J0J6j1MM%J3pkJ2jJj0j2Oj4j0J3j7J0jk5L5j2mJ0rPJ4
7277Aj5J6J4j0J2j2mK5j8oJ3j7N%k2K3j6qJ0j3PJ0j4%J2j1J1J0j9J4%J5%kMJj2
$$ plain form
6959 25 6 8 3 -11 -1 -12 -13 -9 -10 -7 -4 -3 -5 0 -6 -4 -2 -5 -5 -7 -14 1 -8 6 0 15 18 5 1 11 6 -7 -3 -7 -12 -1 -12 3 -8 -7 0 -2 -9 2 -8
7004 -8 3 -3 3 -4 -3 -8 4 5 1 3 1 9 3 -8 -1 4 -12 -5 1 -2 -9 -14 -12 -2 -18 -7 3 -9 -2 -8 -10 -5 -9 -4 -2 -15 6 8 -8 7 -6 6 -2 -2 6 -3
7050 -3 -2 0 1 -1 9 -7 -13 6 -6 1 2 6 2 5 0 -1 3 2 -16 -11 5 -4 4 0 -4 -5 8 -2 -15 -8 -5 -3 -9 -7 -7 -3 1 6 7 4 5 -2 6 3 -2 5 -14 -7 -7 -8 -4
7101 -4 5 -2 -4 2 -7 3 -3 3 5 10 4 -2 -8 11 9 2 9 11 2 6 -5 -12 -13 -6 -19 -16 -10 2 -5 -7 2 -7 -12 -5 -5 -7 -2 -7 -5 1 -2 3 25 12 3 8 2 7 -16 4 -14
7152 -14 -15 -7 -26 -14 -9 -16 -8 -12 -4 1 -15 -6 -1 -9 9 12 8 16 7 11 18 12 25 12 2 -4 -16 -11 -8 -27 -15 -7 -21 -6 -12 -26 -4 -1 -18 -3 -2 -11 10
7195 10 -7 9 3 1 11 10 -4 10 2 -9 0 -20 -9 -12 -25 -4 -13 -16 -12 -9 -11 -13 -10 -3 -5 -14 -8 -4 0 10 0 8 22 7 16 -2 2 10 0 -6 4 -19
7237 -19 -17 -17 -22 -10 -17 -23 -11 -19 -3 1 -19 -9 7 -4 0 4 4 17 10 8 20 19 20 10 -2 4 -10 -20 -7 -24 -14 -15 -40 -5 -17 -21 -11 -20 -13 1
7277 1 -14 2 16 6 18 6 2 27 9 3 16 -1 4 4 -18 5 -11 -19 -9 -22 -15 -5 -19 -19 -7 -18 -7 3 -16 -2 -2 13 13 11 15 16 4
7314DJ6j5pJ7l2J3Lj2Okk0J4PqQj1J0NkNKlJ4j5jK7j5Llj0J1Lk2J1j1nRj4RQj0
7355a3RljNrlK0k4J8QrJ0Lj1J1j1lOoKKoNmj0J4j0kJ4j7JNkPj2NL2k2nOj3K2q
7398ApjJoOjPKnL%rNplJ8qnOpJ5Jj5K8j4j7J8mMQk2NJ6j2%jJMj4nJ3k1K4okRm
7445apJjJ2mj0J9j0j1jJQMj1jJLNJ1j0LKLmpPPkMoj0MjlNj1J1nmJ1mkLj%Nj2Q
7493aNJJ2olKrRMj7NMrLj5LJ2j5J4%o%Pj1J1j4J6J2pKPjQlomjomMrPrJ1j8LQp
7541a1oJ2qN%qJ7M%J1lRLj5lPq%rqOj3PLj5J4Jj2Pj3RQj0RJ1rQJ1jJ3lj2Q%j9
7586cMoqrJJ5lj0PjM%nJ0j3MRlMJ4mROKJlk2Pnj2lKMk%Jkj0OllQoPmLJ8MKLqJ0
7638A7kmKkj9Pkj4J4j0JJ0qQLj4Nj0%LLNJ3kJ2nRNj0nRj6Llj1oPjooJ1J0k9K0
$$ plain form
7314 4 20 5 -2 15 -17 -4 -1 -13 -7 -9 -29 -15 -8 -16 -8 -19 -9 -4 -6 -1 1 -2 12 -3 -4 23 8 11 8 -2 9 12 -10 1 -10 -15 -6 -20 -11 -3 -13
7355 -13 -4 -7 -8 -3 -12 -15 5 -19 -1 7 -2 8 11 0 11 0 -3 3 -3 -1 1 -5 0 -4 -14 0 -10 -12 2 -15 -14 -9 -11 -4 -16 -11 21 -1 -6 0 -13 9 1
7398 1 -6 -7 -6 -12 -6 -7 0 2 -3 0 0 -9 -4 -11 -14 4 -4 -9 -3 -10 5 6 -9 19 5 -12 6 2 6 14 -8 -3 13 1 1 0 1 5 -9 -14 -1 -22 2 -4 -6 3 -1
7445 -1 -8 -7 -8 4 0 -10 9 -1 -12 -13 -12 -4 0 -11 -12 -11 -8 -3 8 -2 1 3 6 2 -5 2 9 7 11 5 -5 -1 -2 -5 0 -11 0 -5 -9 2 -2 -4 -1 -2 -2 3 -9 -1
7493 -1 4 5 17 11 8 10 1 10 14 -3 2 6 -3 0 -15 -12 0 -15 -1 -1 -7 -7 0 -11 0 -14 2 14 7 9 16 15 23 20 14 10 9 3 -1 3 -6 1 -8 3 -15 -12 -4 -11
7541 -11 -17 -5 -13 -8 -8 -16 1 5 5 16 13 22 25 10 7 14 6 6 -3 -11 -5 -18 -11 -8 -23 -9 -8 -20 -13 -26 -17 -9 -19 -10 1 -8 0 11 10 23 20 8 16 16 -3
7586 -3 1 -5 -13 -22 -21 -6 -9 -19 -12 -13 -9 -9 -14 -4 -17 -13 -4 -7 -3 11 7 16 22 24 25 22 0 7 2 -10 -13 -11 -7 -9 -9 -8 -10 -20 -14 -17 -20 -12 -18 -11 -15 -12 6 10 12 15 7 17
7638 17 15 11 13 11 -8 -1 -3 -17 -3 -13 -12 -2 -10 -2 1 -13 -8 -18 -18 -15 -12 -7 6 4 16 11 20 25 15 10 19 3 6 3 -8 -14 -7 -8 -14 -20 -9 1 -28 -8
7682hNj8J3jnJ7oJJ2kJ4Lj7Q%j0jj0MnrJ5mqoOoJ2j5J0pjK0mrJ2NLJ6qP%k0Qk
7727Ij5Qj2%J0rLKrRllPoKJ2j4J6Rj0J0j2%J3k0J5Mj6J0pj4JnPJ7k2%J5j8J5j3
7768a4QQkKPj8J6J7q%nj1PjlJ1k6%J5mpkkK2j9JJ9j6MJ1k2K2k1J4LnoJ2j0Okp
7810fJ7pj6J1%mQk5L0j3rK3j5jJ0j9PJ0qJ4npOmoK1k2QNj4J2nj2K4j4j2K0j3J6
7849EooJ5jj0J1j0OPk0J1j2j3K1j4J1J7k0NRpnNqJ2Kj9K7j4P%j6J0Nj4Pj1LJ0
7888@j1Rjj0NLqOoJJ5j1kOoJ4qnK4llPj3mK1k9MLj0J6j0mK6l0OpoJ4NqJ3pNJ6
7932A7oJQnOj1MNk1NlKmlj6J2j2J0J1k4LJ0lOPkPQl%LKJ2j2Nlj5Noj6J2kqOj7
7977b5J3MqJ1moJ7KlPkJ2kpK1j6oQj5qPqRlj3J%J3k0kJ7olRjLJ1mJ3OmLoj2J3
$$ plain form
7682 -8 -3 -21 -8 -9 -14 3 -3 -2 10 8 22 25 8 16 16 6 5 -5 -1 -6 -15 0 -4 -12 -18 -12 -18 -6 -21 -11 -18 -19 1 -3 -12 0 5 8 24 16 23 23 3 11 9
7727 9 -6 2 -10 -10 0 -9 -6 -4 -13 -4 -7 -10 -3 -9 -7 5 -9 7 16 6 16 4 4 17 -3 12 16 0 10 3 -11 -10 -15 -8 9 -13 -13 2 -16 -1 -14
7768 -14 -6 2 0 2 9 -9 7 24 16 16 11 0 7 6 3 14 -12 -12 3 -1 -8 -10 -12 10 -9 -8 11 -5 -1 10 -12 10 -11 3 6 1 -5 7 -3 3 1 -6
7810 -6 11 4 -12 -1 -1 -5 3 -22 8 -5 -14 9 -6 -7 3 -16 -9 1 -7 7 2 -5 1 -3 -9 12 -10 -2 3 -11 1 -4 -16 8 -6 -18 2 -11 5
7849 5 -1 -7 8 7 -3 8 -2 4 11 -9 2 -10 -23 -2 -16 -5 12 -8 -3 6 -1 -6 -1 -9 3 5 -14 13 -1 6 6 -10 0 5 -9 -2 -13 -10 0
7888 0 -11 -2 -3 -13 -8 -5 -13 -7 -13 -12 3 -8 -10 -4 -10 4 -4 -9 15 12 9 16 3 -1 20 -9 -5 -2 -12 4 -6 -10 16 -14 -8 -15 -21 -7 -2 -10 3 -4 1 17
7932 17 11 12 20 15 21 10 14 19 -2 3 0 2 -2 -5 -21 -9 -21 -11 0 -24 -21 -11 -14 -8 -1 -3 4 12 9 9 12 14 26 14 19 16 1 6 0 -16 -4 -6 -14 -8 -25
7977 -25 -12 -8 -16 -5 -9 -15 2 4 1 8 6 18 16 9 30 14 8 16 1 -7 0 -8 1 -2 -15 -14 -14 -1 -21 -23 -6 -12 -15 -6 -7 -4 7 3 16 22 18 21 15 3 16
8022A6j6jJ6j9LJrnQnlKlOk1J8klJ1J8rMJ2oOmpOrmRj6Qj2QKMj3J0j2j0mqJ2Q
8067a3j2J7KJ3LmJ2nLrlmJ8rj1OoQKrNj7nNlj2K3j5OQj0J5PKOLoljKMnjj0M%k
8114aomlQqj0J4j1J1JQqJ3KOmRKJonqnLmNJj1JklJ3j5Pj1kN%NJ4kjMJOjjkplO
8165BlKPj2kQj0Mj1JLJnK1k1KJ5pJ5qOKKqKq
$$ plain form
8022 16 0 -1 15 -4 -1 0 -9 -14 -6 -11 -14 -12 -15 -9 -30 -12 -14 -17 -6 12 3 7 19 13 19 15 8 14 5 1 10 -6 2 -10 -2 0 4 -9 1 -11 -21 -25 -33 -21 -13
8067 -13 -25 -8 -6 7 10 6 18 13 16 7 4 0 18 9 -2 4 -2 6 8 -1 4 -13 -18 -13 -16 -28 -5 -20 -14 -6 -16 -1 6 8 14 17 11 8 7 9 13 8 7 -3 1 1 -1
8114 -1 -7 -11 -14 -6 -14 -24 -10 -21 -10 -9 -1 -9 4 6 12 8 17 19 20 14 9 1 -4 -1 -5 0 1 -10 -9 -11 -14 -1 -16 -9 -20 -22 -17 -17 -12 2 0 -1 3 4 10 9 8 6 -1 -4 2
8165 2 -1 1 8 -4 -6 2 -8 -4 -15 -14 -11 -10 -15 6 -15 -13 2 -5 10 2 8 10 12 4 6 -2
8191b
$$ Imaginary data points
##PAGE= N=2
##DATA TABLE= (X++(I..I)), XYDATA
0@%%%%%%%%%%%%Qj6J6j6K4l2L2m0M8n6P2q8J01j17J36j52J76k06K36k70L04l44
34a84L92m40M93n53O18o90P70q57R50j052J165j288J422j568J727j903K096k308
52a210K546k809L100l426L797m221M708n279N958o778P793r092J0817j3232J6884
67I556k3119L6648j17268L1982O4445r7132J19356p0425J05530Q7786j84675O0463
79B3147P7847j08386N8431r7533k486J66926j27985k0981J16675o0415P4116n8601
91D0755j15008J47135o6416j18446O2720o8851O5744L7549j37653J31820P6771
102E6120p5935P2947n0313K3822J00060j57296Q17Q6971p6054M8587l8221l4382
114d2877J56730o7413n9772Q8223n6712K7938k4223j30513R9499n202j00824O2828
$$ plain form
0 0 0 0 0 0 0 0 0 0 0 0 0 0 8 -8 8 -8 16 -16 16 -24 24 -32 40 -48 53 -64 72 -80 96 -110 126 -144 160 -184
34 -184 208 -232 261 -292 326 -364 406 -451 499 -553 612 -676 746 -822 905 -998 1098 -1210
52 -1210 1336 -1473 1627 -1799 1998 -2223 2485 -2794 3164 -3614 4179 -4913 5904 -7328 9556
67 9556 -13563 23085 -94183 -62201 2244 -94888 24468 -45957 59573 147359 -37316 23147
79 23147 100994 -7392 51039 -46494 -48980 117946 -10039 -31020 85655 25240 99356 40755
91 40755 -74253 72882 6466 -111980 -49260 -118111 -52367 -14818 -152471 -20651 56120
102 56120 -19815 53132 2819 26641 126701 -30595 -29778 57193 -18861 29726 -8495 -42877
114 -42877 113853 46440 -13332 74891 18179 46117 21894 -108619 -9120 -14322 -115146 -52318
126e2318k7556M2743P6220j06920O5383Q1940p4401L6323l5917k2008R2598r5768
138a9681k7917Q8175m1874L5650n81n2800J05370k6692p8781N0841m4012p43P646
151e399r9055N8221L7976o5444M9683j316J3574P0456p2825Q339O4012n7350J1371
164A2243j2656l2557P4747l7378l4267P0674j9394J3286J1188n7353N2149m293
176C6389p2166K7519k1889q410K8822n7407K9945M9750l9869K8677N619j0586
188c606M7439m3128j8163M4840l3343L548P610k6190M9431l747l1321M1320j0815
201B3875n862J0486m4681J5857Q514m5774J5193j423o937K9723k3826Q085L6745
214A9975k2394P951N549j7093K4348j6871j9305K8350j1588K08J3545j6357K2605
$$ plain form
126 -52318 -79874 -37131 39089 -67831 -2448 79492 5091 41414 5497 -16511 76087 -19681
138 -19681 -47598 40577 -1297 34353 33772 -19028 86342 59650 -19131 31710 -12302 -13045 -5399
151 -5399 -104454 -46233 -8257 -73701 -24018 -25334 -11760 58696 -14129 -5790 58222 872 12243
164 12243 -413 -32970 41777 4399 -29868 40806 21412 34698 45886 -11467 40682 36389
176 36389 -35777 -8258 -30147 -38557 -9735 -67142 -37197 12553 -27316 1361 6980 -3606
188 -3606 43833 705 -17458 27382 -5961 -2413 5197 -20993 28438 24691 -6630 34690 23875
201 23875 18013 28499 -16182 -325 8189 -37585 -22392 -23815 -30752 -1029 -24855 -16770 19975
214 19975 -2419 5532 11081 -6012 18336 1465 -17840 10510 -1078 -870 12675 -3682 18923
227A8923N619k4413J6433n982j1983Q201k3662K002J2915k0632Q803O616n688
240a2848J8350p486l246J8362j1488q50M982j1801J0315j746j0842J4005k113
253C594k109Q716q670M804M330j2833M084j097p234N314o428r18Q053n741K638
268c497M609l501N784q89l417N748l108j549K807m179J794P29m247K959o26k074
284b657K795j863M00K459k029J488J109j695J368n50j158R44r50J32J276n4J049
301B064J110L67K47p58j182j586k143k399k117q84m49K10J712K075K901K694J500
318C362J926O81p63p90j870j170n09j245P22J573J132K014P26j6n3k669l546l264
336c759m053l047j974r64J691L122L401M267M475L199J981N05j309j380j947l085
$$ plain form
227 18923 24542 129 16562 10580 -1403 6798 -16864 -14862 -1947 -22579 -13776 -7160 -12848
240 -12848 5502 -1984 -5230 13132 1644 794 5776 -6025 4290 2544 -8298 5707 3594
253 3594 1485 10201 1531 6335 10665 -2168 1916 819 -6415 -1101 -7529 -8447 -394 -6135 -3497
268 -3497 1112 -2389 3395 2506 -911 4837 1729 180 2987 -1192 602 1331 -2916 43 -583 -2657
284 -2657 138 -1725 -1325 1134 -895 593 1702 7 1375 825 -333 611 -339 -207 1069 1015 2064
301 2064 3174 3541 3788 3030 1848 262 -1881 -4280 -6397 -7281 -7730 -7520 -5808 -3733 -832 1862 3362
318 3362 5288 5969 5206 4416 2546 1376 867 -378 344 1917 3049 5063 5789 5773 5720 3051 -495 -3759
336 -3759 -7812 -10859 -12833 -13797 -12106 -8984 -5583 -1316 3159 6358 8339 8844 7535 6155 4208 1123
352A123r60Q2K73K553J533J882K952j272j760k062n663l785n185n765L70j040
368a6724O58N825K980O625O405j27M729J136m259N90m969k775L141m753K082N924
384F488j201N804L87m145M423p484q406p28j0086j656k05p305R488N228m48J1964
400B118R66M100Q467j0293J691L166j0884L765l488l510J3787n512O3J2544o788
415A0192L541j997j5505O994q646j6001O386p962K488J0271j0434J5136J3072
428G535q387J1834k481l538J2235j8443l176J2855j2605O980K325o845K2785n860
442A5214j1255J5567j2186l030j032k5336J1363Q66k1158J4728p07L568K0149
455F751j6992J0692K0537j9111O431k910j1007K0664j8751r490K6679j0360N976
$$ plain form
352 1123 163 245 518 3071 4604 6486 9438 8166 6406 4344 -1319 -5104 -10289 -16054 -15684 -16724
368 -16724 -16066 -10241 -7261 -636 5769 5642 10371 11507 7248 7838 2869 94 3235 -1518 564 6488
384 6488 5287 11091 11478 7333 11756 4272 -4134 -4862 -14948 -16604 -16809 -24114 -14626 -9398 -9846 2118
400 2118 3084 7184 15651 5358 7049 10215 -669 3096 -392 -3902 9885 4373 4436 16980 10192
415 10192 13733 11736 -3769 3225 -5421 -21422 -15036 -22998 -20510 -10239 -20673 -5537 7535
428 7535 -852 10982 8501 4963 17198 -1245 -4421 8434 -4171 2809 5134 -1711 21074 15214
442 15214 3959 19526 7340 4310 3278 -22058 -10695 -9829 -30987 -16259 -16966 -13398 6751
455 6751 -10241 451 20988 1877 8308 5398 -5609 15055 -3696 -13186 13493 3133 9109
468I109P256j6071K5713m728k8372J5982j1924q253O286k9840J5455J8114k4942
481b6215J6932O420j488K5270k3949k544K8437k3730n83K668j4846K9629j0393
494E608j9478L4555n557k199Q886k6921K0880L214m1201J4026k624r871J7129
507c553k8333J2043L4706k7192Q951J0423j0396K6858k4811j8203L7067j8375
519h15o297J1247j7143L4029Q01l3343L2998n94j3168R587l4186J3915J7743m5106
533c0332J0881J0591r935K5223k4553J17M3952k6388m575J2585j6924K6490j5646
546A486k9850M0965n208j1391J6504j9024K7668J1615m3845K1222O276j9973J1055
559G500l1617N349L2931l8256L317K0494j0658K5689j9062j5760M4709j9714j6471
$$ plain form
468 9109 16365 294 26007 21279 -7093 8889 -3035 -11288 -5002 -34842 -19387 -1273 -26215
481 -26215 -9283 -2863 -4351 20919 -3030 -5574 22863 -867 -1450 1218 -13628 16001 5608
494 5608 -13870 20685 15128 12929 21815 -5106 15774 18988 -22213 -8187 -10811 -20682 -3553
507 -3553 -31886 -19843 14863 -12329 -3378 7045 -3351 23507 -1304 -19507 17560 -815
519 -815 -7112 4135 -13008 21021 21822 -11521 21477 20883 7715 17302 -16884 -2969 14774 -30332
533 -30332 -19451 -8860 -18795 6428 -18125 -18008 25944 -444 -5019 7566 -9358 17132 1486
546 1486 -28364 12601 7393 -3998 12506 -6518 21150 32765 -11080 10142 16418 -3555 7500
559 7500 -24117 -18768 14163 -24093 -20776 -282 -10940 14749 -4313 -20073 24636 4922 -11549
572a1549J5108j7775K5060j351l6449L8037P301j7153J6547k1225J5570K0341
584C2462m7010Q640J4388k0527J4286k2839l551M1753k7329o780K3160j2742K0549
597A4460j0824k7856L8661p195k1695J6767j4089J9218J2102l7008K5163J5541
609B3245k0695J1937j8826K242K6035l8239k592K1038j5817J3832j1621j2086
621b1547L9628j5279j6463K0578j2146J3077j078l1253K9702N364k1956J5889
633D516r653J0249J8963l3630J0636J8477k0605Q235j2757o609K8013k4557r167
646a7889K2362j1332J0409k809j8060K9969m788k0145J5955q771O476P505k6743
659a7861J7963J2975j8772J0961n396Q10J8897k4546j162J8112j5184M449m513
$$ plain form
572 -11549 3559 -14216 10844 9493 -26956 11081 18382 1229 17776 -3449 12121 32462
584 32462 -14548 -5908 8480 -12047 2239 -20600 -24151 17602 -9727 -16507 6653 -6089 14460
597 14460 3636 -24220 14441 7246 -14449 2318 -11771 7447 19549 -17459 7704 23245
609 23245 2550 14487 -4339 -2097 23938 -14301 -16893 4145 -11672 2160 -9461 -21547
621 -21547 18081 2802 -13661 6917 -5229 7848 6770 -24483 5219 10583 -11373 4516
633 4516 -5137 5112 24075 -9555 1081 19558 -1047 7188 -5569 -12178 15835 -8722 -17889
646 -17889 4473 -6859 3550 741 -17319 12650 7862 -12283 3672 -5099 1377 8882 -17861
659 -17861 102 13077 -5695 5266 -130 680 19577 -4969 -6131 11981 -3203 1246 -3267
672c267r983K3523j1027j2767J8240o795M357K660j7947J8370L183j8153J1154
685A548m002J184J1002j9315P070J4004j4604N810j941m898J5796j3841o319J5248
699F742r073K038J159j0426J5516k262j2425J1937l321K17N511j3149Q628O789
713G881j2859N925p79k596Q987j1248l67J0966q679J863J399n197J0361m679o774
728e796R946l972p45K909p668P293K007q621O500j02j445N171p214K008N477q013
744b265J488J48l845N306m612k208P270l332Q01K871l504N096n19n075M508j554
760E74j692K638l647K726L149l717K955R76j772K150l526j661J739m264q28M39
776c761j911K590N8m82L944R0K24J692j655P19n2k533J025R4m44J927J67J219
$$ plain form
672 -3267 -13250 10273 -754 -13521 4719 -2076 2281 4941 -13006 5364 8547 -9606 1548
685 1548 -2454 -1270 9732 -9583 -2513 11491 -3113 2697 756 -4142 11654 -2187 -8506 6742
699 6742 -2331 -293 866 -9560 5956 3694 -8731 3206 -115 102 5613 -7536 1092 7881
713 7881 -4978 947 168 -2428 6559 -4689 -5056 5910 -2769 -906 493 -4704 5657 978 -5796
728 -5796 4150 178 -567 2342 -5326 1967 3974 -4647 1853 1751 306 5477 -1737 271 5748 -2265
744 -2265 -777 -629 -4474 832 -3780 -5988 1282 -2050 -1249 1622 -1882 3214 2695 -2380 2128 574
760 574 -1118 1520 -2127 599 3748 31 2986 3962 2190 4340 814 -847 892 -3372 -4200 -3761
776 -3761 -5672 -3082 -3024 -3506 438 528 752 2444 789 1508 1456 -1077 -52 42 -402 1525 1692 2911
794B911J909p16J70l53k072j260k306k203o80j235j08J032R26J749J622J109J167
811A662K46l47m37q11o99k93K18P15J226J429J208J206M05o00q57j874k373k075
829b051k401j381m02l97J136J637J354K093J127N74P21p68p98m86r67J37M61O15
847B04J944J519J270J319Rm09j250k523k227k398k323j229p64L15J387J308J693
864b155J818J126O04q7o26o75o82o65k3R82J208J516J848J286J187K74j361j232
882D343j973k961k095k307j302L45l76J164K188J004J989O72l35J144j308j431
898a239L21j174R33J253k50L291J864N2K130j069p35k7m641j630q08l642L90r57
916e938n30M042p13N72L557j271J360j78l451K764j062k627L151p16K154L565
$$ plain form
794 2911 4820 4104 4274 3921 1849 589 -1717 -3920 -4600 -5835 -5943 -4911 -3985 -2236 -614 495 1662
811 1662 1908 1561 1124 313 -386 -679 -461 254 1480 2909 4117 5323 5728 5128 4271 2397 24 -2051
829 -2051 -4452 -5833 -6235 -6632 -5496 -3859 -2505 -412 715 1289 2010 1242 444 -42 -1009 -872 -411 204
847 204 2148 3667 4937 6256 6265 5856 4606 2083 -144 -2542 -4865 -6094 -6858 -6543 -5156 -3848 -2155
864 -2155 -337 789 1393 1306 680 5 -677 -1342 -1365 -383 825 2341 4189 5475 6662 6936 5575 4343
882 4343 2370 -591 -2686 -4993 -6295 -5950 -6326 -5162 -2974 -1970 19 691 356 1500 192 -1239
898 -1239 -918 -2092 -1159 94 -156 3135 4999 5051 7181 6112 5377 5350 709 -921 -1729 -5371 -4981 -5938
916 -5938 -6468 -2426 -3139 -2567 990 -281 1079 901 -2550 214 -848 -3475 -324 -1040 1114 4679
932D679k689L663K410l718J467k900k771K052o287j583L165l418K354P09j895
947d762O679j445l028M563k966M18R81n880M932J992m424N169j17J092N283o401
963B086J437M178o966P65k374m028O121n734k988P626l252K085J759n360P972
978C327p91p597N805k416k01L936p962N790O191p235M682J91j598O952r018k153
994b097P801p661J39P8n220R622l483o782R892k425j94K881q683P787K853j1018
1010f510N948K39j269O706r360L159J0212r357J799J236m197Q798q396o120J1618
1025D506n744j316K577o913J0831l95j1473J0006n26k516M606j0539O482P816
1039G402j3017M465K684l086Q406r898j464J3383r187j231L070n792J0314n052
$$ plain form
932 4679 1990 5653 8063 4345 5812 2912 141 2193 -4094 -5677 -2512 -5930 -3576 -2867 -4762
947 -4762 1917 472 -2556 2007 -959 -541 440 -5440 -508 1484 -2940 2229 2112 3204 8487 2086
963 2086 3523 7701 735 1500 -874 -4902 1219 -4515 -7503 123 -3129 -1044 715 -4645 3327
978 3327 2536 -5061 744 -1672 -1873 2063 -5899 -109 6082 -1153 3529 3720 2122 9074 56 -2097
994 -2097 5704 -1957 -1818 -1740 -6960 2662 -821 -7603 2289 -136 -330 2551 -6132 1655 4508 -6510
1010 -6510 -562 -323 -1592 5114 -4246 -1087 9125 -232 1567 2803 -1394 7404 -992 -7112 4506
1025 4506 -1238 -2554 23 -6890 3941 3546 -7927 2079 1553 -963 3643 -6896 -414 7402
1039 7402 -5615 -1150 1534 -1552 6854 -3044 -4508 8875 -312 -1543 1527 -4265 6049 997
1053I97j0182J3041k528l584M146q478R293M090j4354P820K805m091O038j0271
1067e258K709J1906j2803M32M729m714Q644p774o204J5174n923m150M916o326
1081d642R646p37j3583J1564J038n673N154q590O467Q696j4623M531N528n329
1095e53O455r172k268J3749j0664l260O047n220Q550l632r515J4523j687o288
1109b935N394o542O863L458j4569P938M680o139N535o644K613J1377j2476k08
1123a655O645o030M807o453o258J3290o107n639P065l976O906O37j0956J1054
1137C330J724p747M587n608L513O714j2511M399P260n410N104m541j531J1031
1151A0314r635m278O026n915L447k738p772J1649j117n998O782k867M113L215
$$ plain form
1053 997 -9185 3856 1328 -2256 1890 -6588 2705 6795 -7559 261 3066 -1025 5013 -5258
1067 -5258 -2549 9357 -3446 -3014 1715 -2999 5645 -2129 -8333 6841 918 -3232 1684 -4642
1081 -4642 5004 4267 -9316 2248 3286 -2387 2767 -5823 644 9340 -5283 -752 4776 -553
1095 -553 5902 -3270 -5538 8211 -2453 -5713 334 -4886 3664 32 -9483 5040 3353 -2935
1109 -2935 2459 -4083 2780 6238 -8331 -393 4287 -1852 3683 -2961 -348 11029 -1447 -1655
1123 -1655 4990 -1040 3767 -2686 -8944 4346 -1761 -7400 -335 -4311 2595 3232 -7724 3330
1137 3330 5054 -2693 1894 -3714 -201 6513 -5998 -1599 5661 251 5355 814 -717 10314
1151 10314 679 -3599 2427 -3488 -41 -2779 -10551 1098 -19 -6017 765 -2102 2011 5226
1165E226j0809O136L815p436L573l159J028Q465q310R96P810m476K693k743m876
1180b067Q007n975o426N095l682K175J094o531Q420K458n737M753j957P51L865
1195D243q608K121N042n214L101l93m22P905m585j804N666m116J61j722o081M991
1211B85k274n521M504j182J573L178m744M568L140n103K174j255j204L688m886
1226c059M09N369k287K217J260j358M803k485l741K636l319j601m61m377K834
1241c160Q32l095L407N92M89K794l188R54K219l695N38n1j091L341j165J69M307
1258D197o02Q29Q98k221J334j714l853N77j872j302P65j695J809J941j235J841
1274c03O31o07J105j932o40J230j563M30J164J51K471P34P6K001m24p95l45k144
$$ plain form
1165 5226 -5583 553 4368 -3068 505 -2654 -1626 6839 -1471 -475 7335 2859 5552 2809 -2067
1180 -2067 5940 -35 -6461 -1366 -5048 -2873 -1779 -8310 110 2568 -3169 1584 -373 378 4243
1195 4243 -4365 -2244 2798 -2416 685 292 -130 7775 3190 1386 7052 2936 3097 1375 -4706 285
1211 285 -1989 -7510 -3006 -4188 -2615 563 -4181 387 3527 -1576 598 -657 -1861 1827 -3059
1226 -3059 -2650 2719 432 2649 3909 2551 7354 4869 1128 3764 445 -1156 -1617 -5994 -3160
1241 -3160 -2328 -5423 -2016 -1424 -935 1859 -1329 -375 1844 -1851 -1313 -1364 -2455 886 -279 -110 4197
1258 4197 3595 4424 5322 3101 4435 2721 -1132 -555 -2427 -3729 -2964 -4659 -2850 -909 -2144 -303
1274 -303 328 -279 826 -1106 -1746 -516 -2079 -1649 -485 -334 2137 2871 2947 4948 4524 3729 3384 1240
1292A240q15j132k191L8j49j73J150J84Q72J188m61J35p4q74p4o07k65Q99L91
1311g18R31J424Q16J110M55l33j79q97j341j098j260q60l84k65L00O29N18N63
1329e89M34R1j23l47m91l82j59o2M21P25Q19J049Q83O07M73j77m89o36j104r38
1349Eq36p71j44p2J01O38L29L54L70j97m2k29o16j06j18l2N31M38P10R44M54N07
1371B218K76j99k63o73p60n42o86m53j43k4K74K53K11L37Q9m4j83k70j38j93j08
1392a021R8L14N10L82M49N30K14J42j71l81j07n53o07j24l81L9J07l04N33K55
1412g6k30L36k27n1K99p29Q3L97l91M82J9m3J015l81j43O67n71K32j55r94Q30
1433C69k99q32P23n34K52O68j238P71O44j018P78l90k46J326j313j11J201j048
$$ plain form
1292 1240 425 -707 -2898 -2860 -3009 -3182 -2032 -1848 -976 212 -249 -114 -188 -1062 -1136 -1743 -2008 -1109 -718
1311 -718 213 1637 2453 3563 4018 3685 3506 2609 1268 170 -1090 -1950 -2334 -2599 -2299 -1670 -1152 -589
1329 -589 -155 -64 -187 -534 -1025 -1407 -1566 -1628 -1207 -482 337 1386 2269 2876 3349 3172 2683 2047 943 5
1349 5 -831 -1602 -1746 -1818 -1717 -1079 -750 -396 -26 -223 -265 -494 -1110 -1216 -1334 -1366 -835 -397 313 1257 1711 2218
1371 2218 2494 2295 2032 1359 599 57 -629 -1082 -1225 -1249 -975 -722 -511 -174 -85 -129 -312 -582 -720 -913 -1021
1392 -1021 -923 -609 -99 283 732 1262 1476 1618 1447 1066 959 406 -201 -325 -706 -667 -560 -864 -331 -76
1412 -76 -306 30 -197 -248 51 -678 -595 -198 -589 -107 -88 -131 884 503 360 1027 456 688 533 -461 369
1433 369 70 -762 -39 -573 -321 347 -891 -120 524 -494 284 -106 -352 974 -339 -450 751 -297
1451b97N60j37j048J732o61j066J426q08M19N44j854J512M42j762J185o32o6J608
1469A097k106O12J850j610R87k10r72K333j807j342K005j553L03K41k109K658
1485C77P7k178K204o31J79J381l063J458J646k819J332k52m77L002k513k05L271
1502B789k054M97n8k296K979j629l014K771j196L2J230k914L031J588l464K104
1518C96k21o35K215l807N37L464l062J033P29j019M019k266k073M039k135p25
1534D89K59l491L238k61m345L289m3l09K285l629K317L113m549J231L59j378L229
1551A804l581o27N254k479L68J433j981M131j687m337L913j583j751R67l902L142
1567i16J948m932K942J247j027K720l955N11M368m591l7J480j582L949k153k061
$$ plain form
1451 -297 263 126 -922 810 149 -917 509 -299 120 664 -1190 322 764 -998 187 -445 -511 1097
1469 1097 -1009 -397 1453 -157 830 620 -352 1981 174 -1168 837 -716 -413 -172 -2281 377
1485 377 454 -1724 480 -151 28 1409 -1654 -196 1450 -1369 -37 -289 -766 2236 -277 -482 2789
1502 2789 735 1232 1174 -1122 1857 228 -2786 -15 -1211 -1179 51 -2863 168 1756 -1708 396
1518 396 175 -460 1755 -2052 -1515 1949 -1113 -80 649 -370 3649 1383 -690 3349 1214 489
1534 489 748 -2743 495 234 -4111 -822 -865 -1174 1111 -2518 -201 2912 -1637 -406 -47 -1425 1804
1551 1804 -1777 -2404 2850 371 739 2172 191 4322 2635 -1702 2211 628 -1123 -156 -4058 -916
1567 -916 1032 -3900 -958 289 -738 1982 -1973 -1462 2906 -1685 -1722 -242 -1824 2125 -28 -2089
1583b089O023j422j071J593k979L122n45n926L210j05k154J901l417K377L911
1598B429m955J564J949j884K658l613j337N295l374q25K520j478M168n97l579
1613a059N262n75k506J279l592J909J106o039K349J628j998K463k614Q07M761
1628C181m474l87K271k271K279k121k426N588j241j500L045j270L000N10m706
1643e22L337K64l404J032l012Q53K763m839J289K804j823K186j945j028M465l393
1659i73j768K372j830K180k63k702N081M29j939K498j459J347R98m982J477J077
1675A543l176J089j727J62L589l255KK894j766J152j182k190L543j669k143K540
1691e94p50J733J222k452L385J257k404J309j399k33J294l964J73J846k110J054
$$ plain form
1583 -2089 3934 2512 1441 3034 55 3177 2632 -3294 -84 -189 -2343 -442 -3859 -1482 2429
1598 2429 -2526 -962 987 -897 1761 -1852 -3189 2106 -1268 -2093 427 -1051 3117 2520 -1059
1613 -1059 4203 3628 1122 2401 -1191 718 1824 -4215 -1866 -238 -2236 227 -2387 -1580 3181
1628 3181 -1293 -1680 591 -1680 599 -1522 -3948 1640 399 -1101 1944 674 3674 4184 -522
1643 -522 2815 3079 -325 707 -2305 -1452 1311 -3528 -2239 565 -1258 928 -1017 -2045 2420 -973
1659 -973 -2741 -369 -2199 -19 -282 -2984 2097 2526 587 3085 1626 2973 3971 -1011 466 1543
1675 1543 -1633 -544 -2271 -2109 1480 -1775 -1773 1121 -645 507 -675 -2865 678 -991 -3134 -594
1691 -594 -1344 389 1611 -841 2544 3801 1397 2706 1307 1074 2368 -1596 -1423 423 -1687 -633
1707f33m74m94L186j905j208K108j564L27l41k204K700P1j622K353M0J049J575
1724B964k192J429J124k429L37r81q75J422k243l05K045j091O29J50j012J911
1740H83j003j713J260q81l6N34j295J859J146r51J574L05P0J049j703j19P63j766
1758b4j22k33p32J266p11m65J489n15k5J30j131P16l38j302P99q5J20R73l73J069
1778E06J142n98N94P6n08L23j066n70M97q18r6K69k99P34l9m99N82l21m42k2o92
1799a247J32J46m29N64M64K50P46J07K94N07l95j36j08n21p1l58l36L02q1kK69
1820I7n8R8k0l95m8j97l39m5q9J22L17J68L57M42K25K20O7p2o0k45k71j31j54
1843a1j08J8lR7J20l3nj5k04j42j35k11KrmK67J77J72L21R5J33R4j50Lr8k29k5
$$ plain form
1707 -633 -1107 -1601 1585 -320 -1528 580 -984 -657 -998 -3202 -502 -431 -2053 300 340 1389 2964
1724 2964 772 2201 3325 896 1233 252 -623 799 -1444 -1749 296 -795 -166 -16 -1028 883
1740 883 -120 -1833 -573 -1454 -1490 -956 -2251 -392 754 -197 1377 1682 1752 2801 1098 979 1742 -24
1758 -24 -146 -379 -1111 155 -556 -1021 468 -47 -72 58 -1073 -357 -695 -1997 -1198 -1283 -1163 -190 -563 506
1778 506 1648 1050 1644 1720 1212 1535 469 -101 396 -422 -518 -249 -548 186 147 -352 230 -91 -533 -555 -1247
1799 -1247 -1115 -969 -1398 -834 -370 -120 626 733 1027 1534 1139 1003 895 374 303 -55 -391 -89 -170 -172 97
1820 97 39 137 117 -278 -326 -523 -862 -907 -996 -874 -557 -389 -32 410 635 855 922 850 790 545 274 143 -11
1843 -11 -119 -101 -104 -7 113 80 75 60 -144 -286 -421 -632 -630 -639 -643 -376 -199 -27 294 389 522 616 466 469 371 142 117
1870A17j09p2O6n5O4J05j02N1m9j28Pj58q3P5q1N5J39kK09Q1k4J60j6m7K7j26
1896A04rpj22J6j4j3L2n5L6L4n5L4k0L1M7p3K7M6l3K4o7kQ1q0J7K0j1J09j00l9
1926d2J07j09k0n0j25J70p6p5K47j4J35J39j58K56L5k64Q4j96j04J12m07R0K37
1949b8k44K06j2n9L78l29j66K77l41P7j6l12N87L5j91N77n3J89K86o10K73Q9p17
1972a04J30k80j91M80n80N3O76m05K31J0m31O54m81n64N92l44J64L26n10R77L86
1993G89n48P04j50q6M00j164Q2M49j013K25q3k83J034o56k76J047o09L4j0q88
2013a002R16k51r42R88n7K63P66p99R67P81j144M69k26n00O38j393k55J139r67
2032f09K01K65n01J328n68j013J211o12l24K31j164J144M83j236J234L69P2J036
$$ plain form
1870 117 8 -64 2 -53 11 116 14 65 16 -112 -105 -263 -346 -271 -352 -297 -158 -160 49 130 106 266 250 203 230 104
1896 104 95 88 -34 -18 -32 -45 -13 -68 -32 2 -53 -19 -39 -8 39 -34 -7 39 6 30 -37 -39 42 -38 -21 -1 -12 97 -3 -42
1926 -42 65 -44 -64 -114 -239 -69 -145 -220 27 13 148 287 129 385 420 156 240 44 -60 52 -355 -265 -28
1949 -28 -272 -66 -78 -137 241 -88 -254 23 -318 -241 -257 -569 18 53 -138 439 386 575 861 251 524 613 -104
1972 -104 26 -254 -445 35 -545 -492 184 -221 10 20 -411 243 -238 -802 -210 -554 -390 -64 -574 403 789
1993 789 241 945 795 709 1109 -55 27 476 -537 -312 -395 -678 356 -300 -576 471 -138 -104 -114 -1002
2013 -1002 -86 -337 -1279 -291 -348 -85 681 -118 849 1630 486 955 729 229 867 -526 -781 358 -609
2032 -609 -408 -143 -644 684 116 -897 314 -298 -622 -391 -1555 -411 72 -1164 70 439 511 1547
2050A547j199M41J116j604K4n8p69J079j161o37J750o95n8M52r48J293l23j737
2068a487J169k58m56O71j140J165J322j410R73O15l64J010j429l60J490j562l63
2085d14L93p97J366n78j162J902l59o10M85j284R44K80k103J062M37m53J084r42
2103g49P32J880j495K32O87p78Q88j259j016J808r98o06P68p62J334m5j745J529
2121D05m1j019M92j295O51J017j895Q06J048m20J153p60j3J922j388n19P26r14
2139d4P68o37j333J827k32q47Q47p23Q15L98k029Q71M15j116N49q70L27J613j400
2158h01K90J311n06Q49n65p50J669r15r82P76p04O86K4j417J461L04j021O29p10
2177c72K76O97j836L56Q25q79N98l54l6J696q97k83J154n72M41k74j095J288k66
$$ plain form
2050 1547 348 789 1905 301 325 267 -502 577 -584 -1221 529 -166 -224 228 -720 573 250 -1487
2068 -1487 -318 -576 -1032 -361 -1501 -336 986 -424 549 1164 800 1810 381 21 1511 -51 -414
2085 -414 -21 -818 548 -30 -1192 710 351 -259 226 -1058 -114 166 -1937 -875 -438 -891 193 -749
2103 -749 -17 1863 368 600 1287 509 1397 138 -878 930 -68 -674 94 -668 666 621 -1124 405
2121 405 364 -655 -163 -1458 -807 210 -1685 -879 169 -251 902 142 129 2051 663 144 870 -44
2139 -44 724 87 -1246 581 349 -498 349 -374 441 839 -1190 -319 96 -1020 -471 -1341 -1014 599 -801
2158 -801 -511 800 294 1143 578 -172 1497 582 -400 376 -328 358 382 -1035 426 730 -291 338 -372
2177 -372 -96 601 -1235 -879 -54 -933 -335 -689 -725 971 74 -209 945 373 814 540 -555 733 467
2196D67j034P49l69L81M74j294P76N79j036L28m75j50Q97j212n3J041n17M40j5
2215b3l62J312m36o89Q20m17J13O7j000Q70K26q80N58j34N2N58j036K02O24q10
2235c85J65j60k66Q45n94k36Q85k93J84J29n13P92r3p40N32j94k0K62o86M09M49
2256D72o61K54J6j66M42n92j34N83m46J3R5k61N79j72l62N61j06o1J86m14L51
2277A77J42n33K66J7j18K60l80N7L83l72M5J03j66K89k01k06L94j53p4J34k00
2298a36K25J2k97K58J5j10J42j88Q0J82k94O5P4j55J27j09p4K61r8k7J51o7J13
2321A50J7j61J35j7j50N3r0J5P2j27O9Q5o7M4k7o9P1j16o5O6n2L3O1%J43P5k1
2348A27J01Mm5Pj12n9J5r9j5L4k8O2K7k2M8m3p6Jj00l9%m4P6Q8L0J45P9N9J08
$$ plain form
2196 467 -567 182 -187 194 668 -626 150 729 -307 21 -454 -604 293 -919 -972 69 -448 -8 -23
2215 -23 -385 927 491 -198 622 205 318 385 -615 255 481 -399 159 25 77 635 -401 -199 425 -385
2235 -385 -220 -380 -646 199 -395 -631 254 -39 145 274 -239 553 460 -280 252 58 38 300 -386 23 472
2256 472 -189 65 81 -85 357 -235 -369 214 -232 -219 -124 -385 194 22 -340 221 115 54 240 -174 177
2277 177 319 -214 52 69 -49 211 -169 -112 271 -101 -56 47 -119 170 -31 -237 157 4 -70 64 -136
2298 -136 89 101 -196 62 77 -33 109 -79 1 183 -111 -46 28 -127 0 -109 -183 78 -20 -47 104 37 150
2321 150 167 6 141 124 -26 27 -63 -48 24 -103 -34 51 -16 28 1 -68 3 -113 -178 -112 -164 -131 -70 -70 73 148 127
2348 127 228 232 187 194 82 23 38 -61 -76 -42 -70 -8 19 -3 45 2 -74 -73 -173 -212 -212 -256 -180 -92 -62 83 162 221 329
2377C29n7k6lj44n4k6j09K8Ol3J03%k0N4q6l4m1j30Rm1k5J04M8J06J48M4J25O5
2405C40n3J2p6r6k5j26l4J9m2O8J6LO5n6o0j0j20n4n1o7O8N3O8J44J05J11R6j0
2433B88M7l5j06l3j23m3Op9M9N5j3O0m9rJ3j50p1l9q7M4l7L3J89N6J19J11J8J29
2461C43l8j36N2j02p4nj28Q8O6j16J22Qn0Q2k14l7O6k15lOm8K25l1J5L02l4O6
2488B10O6j57J61o4k57J41r4l6J24k09J68J74k61J08l4j26J47l20q2K51k27P0
2510b47R4q1L86o0j54L53r9k9Q2l23K50L7l90K27j0m6K43l48J06L12m09O3j7k05
2534b65K92l00j93M82j80K5J78k11M37Jm26L87o5j31J80m31K39L04n24K15J04
2555A18j59L48m26p2M98m40m7J09k74M68j97l89O11r8j07K23l61M21J48o37L46
$$ plain form
2377 329 272 246 243 99 45 19 -90 -62 -56 -89 14 14 -6 48 -38 -72 -113 -243 -234 -275 -300 -196 -148 -42 106 150 275 340
2405 340 287 299 223 127 102 -24 -58 -39 -81 -13 3 6 71 15 -45 -55 -175 -229 -280 -347 -279 -226 -158 -14 91 202 298 288
2433 288 335 300 194 161 38 -5 1 -78 -29 26 13 73 24 15 28 -122 -193 -232 -319 -275 -312 -279 -90 -34 85 196 214 343
2461 343 305 169 221 119 45 40 -88 0 66 -50 72 80 30 112 -102 -139 -73 -288 -291 -285 -333 -108 -139 -124 178 144 210
2488 210 276 119 280 216 -41 100 6 -30 94 -115 53 227 -34 74 40 -86 61 -259 -341 -90 -317 -247
2510 -247 -153 -234 152 92 -62 291 192 163 245 -78 172 209 -181 46 36 -10 233 -115 -9 303 -106 -43 -60 -265
2534 -265 27 -273 -466 16 -164 -139 39 -172 265 266 -160 227 162 31 211 -220 19 323 -201 14 118
2555 118 -41 307 -119 -191 307 -133 -180 -71 -345 123 -74 -463 148 50 -57 166 -195 226 374 -263 83
2576H3N0j89K84m66J49N31n97R9J94k58M18l87l02O60l31j70K54l42M81Nn99N79
2598A46K7k51K84m45K91L96p38K26K33k64L64m44q6P12n08j41L14k96M35k00n33
2619d78P23j27l26L06l67L99K00p61M48K18l44L00m04R3O03o98K0L76l10L40l02
2640i1l16P92l30k92L82k93L79Qo78O17Q1m47K99l30J93M36p57K16M05l78K79
2661A75l06j39P07n51k22M47k73K92j08m69P42p3m20L83k47K36J77p32L86K70
2681B75m75K79k43L8N52o21%M67l46J89j85l15O44l08l47M41j81K16J01n00N58
2702B39J39m79K73j81L8L04o40J58L98l93J89r0j29N49m13k34M37k73M7j8l80
2723d59N29j4l91L88l8R9K18m69K87K53m66J46q4q5L43m20m1M34k58O5K0k26L98
$$ plain form
2576 83 133 -56 228 -238 -89 442 -155 -56 138 -120 298 -89 -391 269 -62 -232 22 -320 161 166 -433 146
2598 146 173 -78 206 -239 52 448 -290 -64 169 -95 269 -175 -261 451 -57 -198 116 -180 255 55 -478
2619 -478 245 118 -208 98 -269 130 330 -431 17 235 -109 191 -213 -120 483 -215 -195 181 -129 211 -91
2640 -91 -407 385 55 -237 145 -148 231 239 -439 178 259 -188 111 -219 -26 410 -347 -131 274 -104 175
2661 175 -131 -270 437 -114 -336 111 -162 130 22 -447 295 222 -198 185 -62 174 351 -381 5 275
2681 275 -200 79 -164 -126 426 -195 -195 272 -74 115 -70 -385 259 -49 -396 45 -136 80 181 -319 239
2702 239 378 -101 172 -9 29 333 -307 -149 249 -144 45 -45 -174 375 -38 -272 165 -108 -61 -79 -459
2723 -459 70 56 -335 53 15 114 332 -137 150 403 -63 83 -1 -86 257 -163 -204 230 -28 37 57 -169 229
2746B29k21l46L33j74qJ09l08L86J64l14K81J7k2K28l71M1K59l47M4K4j20L19
2768B03k07j32L51j69l7L7k59K07o5l20K22jk5K11j75K01K37k27J20M6j24J45
2790B39k36q8K34j89RQ5r2J95m6j91J93r4j31K4k06R1O5j86J65J08oJ70m5M7J85
2815C00j73j5L5j27P2q2q9J86m3l3P8n0L9j4j78J9m7j25M0o1M1J30m3J04J44j9
2841H9R2j4n7N2r1o5L7m9K8K6l1J05K0o0K4p5m8m2j16m6J0m8L9P3M9J25L6K8P9
2870A70l3j6Nq7kln0M6K3J0O7j3k2J4r4n3l4j14j8k5k5P5K8O7Q6M3O1L0l9K4m4
2901G7m8K7m2KM5rM6M5l6J7l1q1l7p7o9po0K5N7QQ4N3L7P3qrJ2n9lpk3N3jNO2
2936A21k0L9j4o9j6n5q4k6n6rN7l1O1O1K2O4JJ1L3n0j4J5m6M7j1oO7MJK0n3J4
$$ plain form
2746 229 8 -338 -5 -179 -187 -78 -386 0 164 -150 131 148 126 354 -17 24 283 -64 -20 4 -116 203
2768 203 -4 -136 215 46 9 46 -213 -6 -71 -391 -169 -170 -195 16 -159 42 279 52 172 218 94 239
2790 239 3 -85 149 -40 -31 54 -38 157 111 -80 113 19 -112 -88 -294 -203 -138 -324 -159 -51 -57 113 68 115 300
2815 300 127 112 147 20 92 10 -79 107 64 31 109 59 98 84 -94 -75 -122 -247 -207 -268 -227 -97 -140 -36 108 89
2841 89 181 167 110 162 71 6 43 -6 22 48 17 122 142 82 106 31 -17 -59 -175 -221 -211 -259 -220 -147 -98 27 63 91 170
2870 170 137 121 126 39 37 34 -16 30 53 63 130 117 95 109 15 -38 -72 -186 -204 -229 -254 -179 -151 -84 2 45 106 136 97 121 77
2901 77 29 56 14 16 61 52 98 143 107 124 93 12 -25 -102 -171 -178 -238 -213 -156 -148 -64 -11 26 99 91 82 94 35 32 25 2 55 54 59 121
2936 121 101 140 126 57 41 -14 -98 -124 -180 -189 -132 -163 -102 -41 -19 45 46 57 90 40 26 41 -5 42 31 25 92 96 97 117 64 78
2968G8l6j16J2m6m0L1m4N8P9m8P5K2lO6n8k4O5o9J0K0m7R9k2l9R4l9k6J8j13M0
2998cjj44P0rj5Q2r0O5J21j18N9J8n4J11r5n5J43r8J7M4r8J64l8j31J43o7k2O1
3026F0j79J14P1k03J19Lm6J51j74L0J89j70M5K7j00J89j22j23K19j11j6P1j78
3049a34K07Rk30J96k8m0J37k26J03J82k70P3M6j05K21j99p3L21j97j7R1j74K28
3072A21o9k73K64o0r1J48k49K35J51l30K06O1j17K06k87J4K98l16L4R5j41K89
3094A89j59k02L86j71r0J04k58K36Pl99K96M3j18K12k37J72L23m03J21J20j86
3115a4K34k70j32M34k68o6K05j97K98p9l69L84r1k47J55k98J96J78m49K70J91
3136F5j49K74k28L2M20m04j2J66k36K50j66k55N06j59j55K37k25K16om99K98J3
$$ plain form
2968 78 42 -74 -62 -108 -148 -117 -161 -103 -24 -72 3 25 22 88 30 6 71 2 12 32 -15 84 62 23 117 78 52 70 -43 -3
2998 -3 -4 -148 -78 -87 -102 -20 -110 -45 76 -42 17 35 -19 92 -3 -58 85 -13 4 48 -50 114 76 -55 88 21 -1 60
3026 60 -119 -5 66 -137 -18 -15 -61 90 -84 -54 135 -35 10 37 -63 126 4 -119 100 -11 -27 44 -134
3049 -134 73 82 -148 48 20 -20 117 -109 -6 176 -94 -21 25 -80 141 -58 -131 190 -7 -24 67 -107 121
3072 121 52 -221 43 -17 -108 40 -209 26 177 -153 53 114 -3 203 -84 -70 228 -88 -54 41 -100 189
3094 189 30 -172 214 43 -47 57 -201 35 42 -357 -61 -18 -136 76 -161 11 334 -69 52 172 -14
3115 -14 220 -50 -182 252 -16 -82 123 -74 224 145 -224 160 69 -178 -23 -321 -125 53 -396 -126 65
3136 65 -84 190 -38 -6 414 10 -2 164 -72 178 12 -243 263 104 -51 186 -39 177 171 -328 -30 -17
3158a7k99K02k54J34L76m02J76K93j89K45j86j54M52l27j69K47k03K39k2l47M74
3179B69j7l06K14k75Q1J31n62J88J86k75K36j02N1M83l34LL29k27J49j16k74M32
3201B64j72k29L00j41J78J05m24L23N6l83J24k27m7K45m50R6L35j87K16pn8M54
3223C71k55j71L04k21P5Ol09L69M2k60K85q6K8J42m36J06J11l83P7j17p8L32k58
3246c26L6L82j27J33L6j78L26j43k53K41j11K8J13k46K94J32k80J65p1j02J05
3267A54l77l5J88k96Q1L4n8L36r8o7L16j13J6N7k12J88%k45K22JLJ62j77J05J52
3292C37k70Qn5j69R8k37q2K20j21N5J34o5K39pj38J86o1p2P3j47J25Q9j57J49
3316A32O5l6J17j41m2Q3k29m9k2j21Q7o4n9K00pJ2J10n4R6K3j62R9Lp0Q7l6M9
$$ plain form
3158 -17 -316 -114 -368 -234 142 -260 -84 209 20 265 79 -75 377 50 -119 128 -75 164 142 -205 269
3179 269 252 -54 160 -115 -34 97 -465 -277 -91 -366 -130 -232 -181 302 -32 -29 300 73 222 106 -168 264
3201 264 92 -137 163 22 200 305 -119 204 260 -123 1 -226 -273 -28 -478 -382 -47 -234 -18 -25 -83 371
3223 371 116 -55 249 28 103 109 -200 169 211 -49 236 150 178 320 -116 -10 101 -282 -205 -322 -400 -68 -326
3246 -326 -290 92 -35 98 134 -44 282 139 -114 127 16 44 157 -89 205 337 57 222 151 49 154
3267 154 -223 -258 -70 -366 -285 -251 -309 27 -71 -138 178 65 81 138 -74 114 114 -131 91 92 95 257 80 185 337
3292 337 67 75 20 -149 -51 -288 -370 -150 -271 -216 -82 -147 92 85 -53 133 72 0 73 -74 51 140 -17 132
3316 132 197 161 278 137 95 178 -51 -100 -122 -243 -156 -220 -279 -79 -86 -74 36 -18 78 101 -61 38 41 -29 58 22 71
3343G1J34j15P3N6r5L0j05j12N2j31o3N1n9P9M9n0J37K1m1O6m5lM1q4M8M6l6Q2
3371I7JJ0Q3o5l3K7r8k7l7p6K9k4k9N7MK6N3k1K8L6n3K5j2j9M3k5K3O1j7K8J5
3402A10l1Ql0o0J8n9j3%k6J6K7k7M6K6k4M0j7j5L5l9J6J7k5L3KjL4j3j2J1l5M
3434A6rl0J3j9k0M0k6J2K5l3M3Rk8L5j8j8M3m1J5J9m4J6Kj8L2l2mN8m7J5J4k7
3466gM0k6l0N8m3JK6l1L7J4n2N4rl9L0o6J5K5q0L3Mj3P5l7J5P6l9KJ3m4O3n2m9
3499c6P6l3J7L1n4P6K1j06M8j9n5K1j01KO6p5N2L9k0J24n3k8J16p4JJ5r5J06k1
3528D1r7J32j5lP2j22O5M2j86L8m0p1R6j29J8J67r5P1O9p0J67p4j08J50r7j4O4
3555G1j35J45M6j60J57j0n2Q9k09K3R5k27K4Qq5J84j00l9K66r5L0P5j30J80o1
$$ plain form
3343 71 205 90 163 219 124 154 49 -63 -11 -142 -205 -154 -213 -134 -85 -135 2 23 -18 48 3 0 41 -43 5 51 15 97
3371 97 98 108 191 126 93 120 22 -5 -42 -118 -89 -113 -142 -85 -81 -55 -2 -23 5 41 -12 13 1 -18 25 0 23 84 67 95 110
3402 110 79 87 57 -3 15 -44 -57 -57 -83 -67 -40 -67 -21 5 -19 21 4 -11 24 -15 1 18 -7 26 28 27 61 48 36 47 12 16
3434 16 7 -23 -10 -29 -49 -9 -35 -23 2 -31 12 21 -7 28 10 -8 35 -6 9 28 -16 0 2 -16 16 -16 -20 38 -9 6 20 -7
3466 -7 33 7 -23 35 -8 -7 19 -12 25 39 -13 41 32 -7 23 -43 -28 -3 -83 -50 -46 -59 16 -21 -6 70 31 33 46 2 65 13 -36
3499 -36 40 7 24 55 1 77 98 -8 40 21 -34 -13 -114 -112 -46 -121 -69 -30 -50 74 21 -7 109 35 36 51 -44 62 41
3528 41 -56 76 61 58 130 8 73 115 -71 -33 -73 -144 -48 -177 -159 8 -87 -16 53 -17 150 76 -32 118 21 7 71
3555 71 -64 81 127 -33 124 114 62 151 -58 -35 60 -167 -143 -135 -220 -36 -136 -175 91 -4 26 101 -29 151 90
3580I0k04J98m6l7J29j80J66J33k42J14Kj43J16k48n7K08k34M6Q8j06K62o6j22
3603a33K95r6n1Q9j95J79L9k84K37L2p5J74k00Q5K06l22K4L6j97J69k16j25L40
3626A1j83lJ75j20K59l4k60K90m4j31J42k18J55J80l30K07J01j22J83k29m3K48
3648B34l37n1J00j93J98j12j70L97q3r3J90j52J83M8l48K39M6j71J84j79J06K84
3670C20l21R3J39j93J59k12j78L26k51j34J83j59K19lk55L59Oj95J81j77J01J56
3692A64l66J77J54j69K03j25j5L26k99n2J74k17J05j15k35L27j19j54K13j28J57
3713FR6l13K61Q3k37J49j38M4K34l00P7K33j56J32p5j18L01k37j56J85j84O8J4
3736c1k69L04J4k03K01q9N8J52l02J32J48k19J27n0l6K80k07l4K46j64O4m0j76
$$ plain form
3580 90 -114 84 38 1 130 -50 116 249 7 121 123 -20 96 -152 -209 -1 -235 -189 -101 -207 55 -11 -133
3603 -133 162 66 15 104 -91 88 127 -157 80 112 37 211 11 96 302 -20 4 40 -157 12 -204 -329 11
3626 11 -172 -175 0 -120 139 105 -155 135 91 -40 102 -116 39 219 -111 96 197 75 258 29 -14 234
3648 234 -103 -154 -54 -247 -49 -161 -331 66 -17 -110 80 -72 111 159 -189 50 96 -75 109 -70 36 320
3670 320 -1 92 231 38 197 -15 -193 133 -118 -252 -69 -228 -9 -12 -267 92 98 -97 84 -93 8 164
3692 164 -202 -25 129 -40 163 38 23 349 50 -2 172 -45 60 -55 -290 37 -82 -236 -23 -151 6
3713 6 102 -211 50 133 -104 45 -93 -49 185 -115 -38 195 39 171 96 -22 279 42 -114 71 -113 -45 -31
3736 -31 -300 4 18 -185 16 -73 -15 137 -165 -33 115 -104 23 -27 -63 217 10 -24 222 58 122 82 -94
3759i4K35j19j99J83j12L9P5k15K03Q7j98J36n5k2J73k32L4J90j64R4Rq0K16j22
3783F2j03J94j25LK3j84J62kj94J58l7j0J16j78R0J20j74O4jn0J48j25l8J89j10
3808bJ6O1j16J65m1j59J48n5m4N8j24Q1N9j44Q5K3n5J12j22lJ35j14J3M9p9J08
3834E5m7q2J43n3k3O5r4P4J3j13P9Po0P5q2K8P0r7K4L7n4O6m6l2J06o7k9N9n2
3863c0M5Jq8R6k0n3O3m4K8M8q9N0K5m3L6k5k7O7m0pM8l5K8jm4N6k7l5J8m3MK2
3895a6n5M4K5l6N2j1oM2m2NL1n1K6Pk9L6Mj4M5k2j2J2n4J3j1n5K0Lk1M5k5K8L6
3928A4j8L3nk5L3k8j6K8j9J0M1k0K8J4k9J3k8m1Om7k5Rk5K8PnM3J3J3M0l2QOl3
3962iK3j2nM8j3K1M9l0kKn3lm4n2J3k6j3L7j3L9K9j6N0mmJ6l7J2K0l4L6L0qP0
$$ plain form
3759 -94 141 22 -177 6 -106 -67 8 -207 -4 83 -115 21 -34 -56 117 -115 -81 109 -55 39 48 -32 184 62
3783 62 -41 153 28 31 54 -130 32 30 -164 -6 -43 -53 63 -115 -25 95 -79 -15 -16 -66 82 -43 -81 108 -2
3808 -2 14 75 -41 124 83 -76 72 17 -27 31 -93 -12 47 -97 -12 11 -44 68 -54 -57 78 -36 -23 26 -53 55
3834 55 8 -74 69 16 -7 58 -36 38 51 -62 17 24 -36 39 -43 -15 55 -42 -18 19 -35 31 -15 -47 59 -8 -37 22 -30
3863 -30 15 16 -72 24 4 -49 14 -30 -2 46 -43 7 32 -11 25 0 -27 40 0 -7 41 6 34 33 -11 45 18 -17 1 -42 -38 -16
3895 -16 -71 -27 -2 -38 14 3 -3 39 -3 2 33 -18 8 15 -14 22 26 12 57 35 23 35 -19 -6 -17 -72 -52 -49 -70 -25 -50 -22 14
3928 14 -4 29 24 -1 32 4 -12 16 -3 7 48 28 56 70 41 54 26 -15 -9 -56 -81 -72 -97 -69 -62 -67 -24 -11 2 42 10 18 24 -9
3962 -9 14 2 -3 45 32 53 102 72 70 72 19 16 -28 -80 -67 -93 -106 -69 -82 -43 -14 -30 20 16 12 28 -9 3 23 -11 25 55 47 117
3996A17k9JJ1m6l0j4o4Nm8m1N7j0K8K8k0N6K8n8N7j9j9L7n6K8O8m8N6K5j7O2o4
4027H1m7K3p7l6j2o7N4j2l9Q5NK0L9o9N4L8r1M5j1pP5n0K4J01n7M7jo6O8p5j09
4058f7O3q0j9L4p9R6L0q3J07rk7P8j18L7P7j13N5M0l5J36o9k3J34r6LMj19Q6o5
4087b2j36J24m3k2Q3j05R6Q0j40Q8%o2J06j22PJ60j24M7N6m7J43q2r0J51j01m0
4113EJ8j46J17%j60J37ll3J04j33O3J19j74M3L3p3J40j04k8K14j06MP6j05J38
4138A46m9j80J63p3p3P4j48J18R5k12J26L0p3J14j34jJ75j71K4P7j00J58o6j04
4162h4K20q1n8R7j40J16J2k23J65J1j07J00j37O3J65k22O7Q9j10J21j12n4K15
4185A13j37l5J14j12J34j6j78K08l4j07J06j35R6P9k16J07O6j24J10j12OK05j85
$$ plain form
3996 117 88 89 100 54 24 10 -54 -49 -97 -138 -81 -91 -63 -35 -55 1 29 -29 28 9 -10 27 -29 -1 67 19 75 100 83 145 81
4027 81 34 57 -20 -56 -68 -135 -81 -93 -132 -47 -42 -22 17 -52 2 40 -51 -6 -17 -24 51 1 25 126 69 116 115 49 117 42 -67
4058 -67 -4 -84 -103 -69 -148 -52 -22 -105 2 -7 -34 44 -74 -37 40 -73 -18 22 -13 123 54 31 165 69 72 76 -43 43 -22
4087 -22 -158 -34 -77 -99 -16 -121 -25 55 -85 3 3 -59 47 -75 -68 92 -32 15 71 24 167 85 -5 146 45 5
4113 5 23 -123 -6 -6 -166 -29 -32 -65 39 -94 -31 88 -86 -43 -10 -83 57 -47 -75 139 33 37 113 8 146
4138 146 97 -83 80 7 -66 8 -140 -22 73 -139 -13 17 -56 58 -76 -77 98 -73 -49 28 -72 86 20 -84
4162 -84 136 55 -3 94 -46 70 82 -141 24 35 -72 28 -109 -46 119 -103 -36 53 -57 64 -48 -102 113
4185 113 -24 -59 55 -57 77 61 -117 91 57 -50 56 -79 17 96 -120 -13 53 -71 39 -73 -67 138 -47
4208d7%J11j15J13n5j26K29j00p7J15j10Q7L7j99J71K5j19J11j08L7J43k15N5
4231c7J01j05Q8o3o4K12j25n0J30j07P5j5j61J76m1j32J22q4N1R1j87J19Q0j33
4255e9J12p2j8J67j76j0J41j18Q5jr7J88o9j01J08j09L2K7j76J17K6j23J07l3
4279e2J8J09j40L7J12j14N3l0n2J49j00k2J20n9N2J5r7J04l2j19O5p5j8N1j32
4304a57O7R0r9P7J8k0J21j16k1J08q6K1J5o5J30po8J14m4J5J9j21M8rj34N5m4
4331i3k3O8o3L7Q7o6N0K1n1P7o0l9R1m1J6N6m2Q4J6o2O6l8n0Rj10LK4j02K5L4
4361g6j9P0k4MQ2n8jK4n2M9mm1R8MJ0N5k4K9J5q3Kl9o1lo3oM7m3K5M7j2M0mk7
4395c9M7l1j6L5j8L5L8j8O1L7k2K1k6l2j2p3l4lm6L%j5N6%QK6j4J1Jk6J8Oj6N2
$$ plain form
4208 -47 -47 64 -51 62 7 -119 110 10 -67 48 -62 25 62 -137 34 59 -60 51 -57 -20 123 -92 -37
4231 -37 64 -41 47 -16 -80 132 7 -43 87 -20 55 40 -121 55 14 -118 4 -80 -29 62 -125 -6 74 -59
4255 -59 53 -19 -37 130 -46 -56 85 -33 52 51 -46 142 73 -28 80 -29 3 30 -146 -29 -3 -126 -19 -52
4279 -52 -34 75 -65 -28 84 -30 23 -7 -59 90 -10 -32 88 29 81 96 -1 103 71 -48 17 -58 -76 -25 -157
4304 -157 -90 0 -99 -22 -4 -24 97 -19 -40 68 -18 3 18 -47 83 76 8 122 78 93 112 -9 39 30 -104 -49 -93
4331 -93 -116 -48 -111 -74 13 -53 -3 18 -33 44 -16 -55 36 -5 11 67 25 109 125 63 129 91 41 50 -60 -57 -33 -135 -110 -76
4361 -76 -95 -25 -49 -45 37 -21 -22 2 -50 -1 -5 -46 52 56 66 121 97 126 141 58 60 21 -40 -43 -106 -112 -65 -108 -83 -36 -48 -8 -12 -39
4395 -39 8 -23 -39 -4 -22 13 51 33 94 131 109 130 104 72 60 -13 -47 -50 -96 -93 -93 -108 -52 -52 -44 -18 -32 -21 -20 -46 -28 -22 -38 14
4429A4J6L0N1k6K3K2l9j6k2o2j2m1k0J9l1J8L6oK5jk1K8k2o%mK9K6J3M2J1PL4
4462A15k1k1mm9l5j1l6J3l1KL6j0J1K6k1J0Pl4K0jj9M7NK8L8oL6J0l4jj3l7kn0
4496c2j4J2l4K0J6nL1k4oK2k5M%j4M0lLN9MJ0J8m1L5j4m7J5k9k4J7m7J9K1k0J7
4530a6Nj1K4l4k6M4j8POj0N0Qk7M8j3J1Lm9K3jm5J2j9kL4l7OM3n7K8J1l2M9l7
4564b2k1M9k1J6K7l8N1J1n8M7k2j1K2o8L6L1n9K4Lk9O2m9k0P2n7K5Pn2O7j8m7
4595d2P5m2OK8o8N0K1p9N9j9j0N4p8J9N6q1N0ll7Q4m7l0Q7m5%L8p1P5k5r1P6k1
4627a1k3L4o8L9N5q0N7%k5O4p4j1Q9o6J3K5m2R7l3o7J12l9k1K8r5O5Rj21Q1j2
$$ plain form
4429 14 30 60 111 85 108 130 91 75 53 -9 -21 -62 -82 -63 -94 -76 -40 -46 -21 -22 -43 -15 -37 -43 -43 -47 -18 8 21 63 74 81 115
4462 115 94 73 69 20 -15 -26 -62 -49 -80 -78 -42 -52 -41 -15 -36 -26 -19 -53 -33 -34 -53 -6 -1 27 65 59 95 105 71 70 57 20 18 -32
4496 -32 -46 -34 -68 -48 -32 -37 -6 -30 -36 -14 -39 -35 -35 -49 -9 -12 -9 50 54 64 82 41 76 62 15 30 1 -23 -6 -53 -34 -13 -33 -16
4530 -16 -11 -22 2 -32 -58 -14 -32 -25 -19 -29 21 29 2 50 37 48 51 2 25 24 -21 -9 -28 -30 4 -33 -27 16 -41 -13 -2 -34 15 -22
4564 -22 -43 6 -15 1 28 -10 41 52 -6 41 19 8 30 -38 -2 29 -30 -6 -3 -32 30 -19 -39 33 -24 1 8 -44 23 5 -42
4595 -42 33 -9 -3 25 -43 7 28 -51 8 -11 -21 33 -45 -26 30 -51 -1 -4 -41 43 -4 -34 53 8 8 46 -25 50 25 -66 10 -11
4627 -11 -34 0 -68 -29 26 -54 3 3 -22 42 -32 -43 46 -20 -7 18 -24 73 40 -27 85 46 25 53 -42 23 32 -89 -8 -20
$$ [...]
8191G
##END NTUPLES=NMR FID
##END=
