##TITLE=1H_AM_NVP319
 DMSO-d6
 8 sc, 
 5.9.2023
##JCAMPDX= 6.0         $$ Bruker NMR JCAMP-DX V2.0
##DATA TYPE= NMR FID
##DATA CLASS= NTUPLES
##ORIGIN= UXNMR, Bruker Analytische Messtechnik GmbH
##OWNER= root
$$ XWIN-NMR		Version 3.5
$$ Tue Sep  5 13:57:01 2023 Russian Standard Time (UT+4h)  she@DPX200
##.OBSERVE FREQUENCY= 200.13135
##.OBSERVE NUCLEUS= ^1H
##.DELAY= (6, 6)
##.ACQUISITION MODE= SIMULTANEOUS
##.ACQUISITION SCHEME= undefined
##.AVERAGES= 8
##.DIGITISER RES= 18
##SPECTROMETER/DATA SYSTEM= spect
##.PULSE SEQUENCE= zg30
##.SOLVENT NAME= DMSO
##.SHIFT REFERENCE= (INTERNAL, DMSO, 0, 15.7039)
##AUDIT TRAIL= $$ (NUMBER, WHEN, WHO, WHERE, WHAT)
$$ ##TITLE= Audit trail, XWIN-NMR		Version 3.5
$$ ##JCAMPDX= 5.01
$$ ##ORIGIN= Bruker BioSpin GmbH
$$ ##OWNER= she
$$ F:/spectra/data/she/nmr/H-F/1/audita.txt
$$ ##AUDIT TRAIL=  $$ (NUMBER, WHEN, WHO, WHERE, WHAT)
(   1,<2023-09-05 13:55:54.46 +0400>,<she>,<DPX200>,
      <created by zg, POWCHK disabled, PULCHK disabled
       configuration hash MD5:
       00 E9 B6 7A A2 85 ED C7 34 08 36 98 17 FE 4E 26
       data hash MD5: 16K
       C8 B8 E2 9D 8E 03 14 A3 0E B9 9B 23 AC C7 BD 06>)
$$ ##END=
$$ 
$$ hash MD5
$$ A0 57 6B 11 21 09 BF 86 D3 EB 60 DD 92 20 D4 15
##$RELAX= 
##$RELAX= 
##$RELAX= 
##$RELAX= 
##$RELAX= 
##$RELAX= 
$$ Bruker specific parameters
$$ --------------------------
##$DU= <F:/spectra>
##$EXPNO= 1
##$NAME= <H-F>
##$PROCNO= 1
##$TYPE= <nmr>
##$USER= <she>
##$AMP= (0..31)
100 100 100 100 100 100 100 100 100 100 100 100 100 100 100 100 100 100 
100 100 100 100 100 100 100 100 100 100 100 100 100 100 
##$AQSEQ= 0
##$AQ_mod= 1
##$AUNM= <au_zg>
##$AUTOPOS= <>
##$BF1= 200.13
##$BF2= 200.13
##$BF3= 200.13
##$BF4= 200.13
##$BF5= 200.13
##$BF6= 200.13
##$BF7= 200.13
##$BF8= 200.13
##$BYTORDA= 1
##$CFDGTYP= 0
##$CFRGTYP= 5
##$CHEMSTR= <none>
##$CNST= (0..31)
1 1 145 1 1 1 1 1 1 1 1 1 1 1 1 1 1 1 1 1 1 1 1 1 1 1 1 1 1 1 1 1 
##$CPDPRG= <>
##$CPDPRG1= <>
##$CPDPRG2= <>
##$CPDPRG3= <>
##$CPDPRG4= <mlev>
##$CPDPRG5= <mlev>
##$CPDPRG6= <mlev>
##$CPDPRG7= <mlev>
##$CPDPRG8= <mlev>
##$CPDPRGB= <>
##$CPDPRGT= <>
##$D= (0..31)
0 1.2 0 0 0 0 0 0 0 0.06 0 0.03 0 0 0 0 0.0002 0 0 0 0 0 0 0 0 0 0 0 0 
0 0 0 
##$DATE= 1693907754
##$DBL= (0..7)
120 120 120 120 120 120 120 120 
##$DBP= (0..7)
150 150 150 150 150 150 150 150 
##$DBP07= 0
##$DBPNAM0= <>
##$DBPNAM1= <>
##$DBPNAM2= <>
##$DBPNAM3= <>
##$DBPNAM4= <>
##$DBPNAM5= <>
##$DBPNAM6= <>
##$DBPNAM7= <>
##$DBPOAL= (0..7)
0.5 0.5 0.5 0.5 0.5 0.5 0.5 0.5 
##$DBPOFFS= (0..7)
0 0 0 0 0 0 0 0 
##$DE= 6
##$DECBNUC= <off>
##$DECIM= 32
##$DECNUC= <off>
##$DECSTAT= 4
##$DIGMOD= 1
##$DIGTYP= 9
##$DL= (0..7)
0 120 120 120 120 120 120 120 
##$DP= (0..7)
150 150 150 150 150 150 150 150 
##$DP07= 0
##$DPNAME0= <>
##$DPNAME1= <>
##$DPNAME2= <>
##$DPNAME3= <>
##$DPNAME4= <>
##$DPNAME5= <>
##$DPNAME6= <>
##$DPNAME7= <>
##$DPOAL= (0..7)
0.5 0.5 0.5 0.5 0.5 0.5 0.5 0.5 
##$DPOFFS= (0..7)
0 0 0 0 0 0 0 0 
##$DQDMODE= 0
##$DR= 18
##$DS= 0
##$DSLIST= <SSSSSSSSSSSSSSS>
$$ [...]
##$SUBNAM2= <"">
##$SUBNAM3= <"">
##$SUBNAM4= <"">
##$SUBNAM5= <"">
##$SUBNAM6= <"">
##$SUBNAM7= <"">
##$SUBNAM8= <"">
##$SUBNAM9= <"">
##$SW= 18.05172834244
##$SWIBOX= (0..15)
0 0 2 0 0 0 0 0 0 0 0 0 0 0 0 0 
##$SW_h= 3612.71676300578
##$TD= 16384
##$TD0= 1
##$TE= 0
##$TE2= 300
##$TE3= 300
##$TEG= 300
##$TL= (0..7)
0 120 120 120 120 120 120 120 
##$TP= (0..7)
150 150 150 150 150 150 150 150 
##$TP07= 0
##$TPNAME0= <>
##$TPNAME1= <>
##$TPNAME2= <>
##$TPNAME3= <>
##$TPNAME4= <>
##$TPNAME5= <>
##$TPNAME6= <>
##$TPNAME7= <>
##$TPOAL= (0..7)
0.5 0.5 0.5 0.5 0.5 0.5 0.5 0.5 
##$TPOFFS= (0..7)
0 0 0 0 0 0 0 0 
##$TUNHIN= 0
##$TUNHOUT= 0
##$TUNXOUT= 0
##$USERA1= <user>
##$USERA2= <user>
##$USERA3= <user>
##$USERA4= <user>
##$USERA5= <user>
##$V9= 5
##$VALIST= <valist>
##$VCLIST= <CCCCCCCCCCCCCCC>
##$VD= 0
##$VDLIST= <DDDDDDDDDDDDDDD>
##$VPLIST= <PPPPPPPPPPPPPPP>
##$VTLIST= <TTTTTTTTTTTTTTT>
##$WBST= 1024
##$WBSW= 4
##$XGAIN= (0..3)
0 0 0 0 
##$XL= 0
##$YL= 0
##$YMAX_a= 79408
##$YMIN_a= -68093
##$ZGOPTNS= <>
##$ZL1= 120
##$ZL2= 120
##$ZL3= 120
##$ZL4= 120
##$ABSF1= 10
##$ABSF2= 0
##$ABSG= 5
##$ABSL= 3
##$ALPHA= 0
##$AQORDER= 0
##$ASSFAC= 0
##$ASSFACI= 0
##$ASSFACX= 0
##$ASSWID= 0
##$AUNMP= <proc_1d>
##$AZFE= 0.1
##$AZFW= 0.1
##$BCFW= 1
##$BC_mod= 2
##$BYTORDP= 1
##$COROFFS= 0
##$CY= 11.3945322036743
##$DATMOD= 1
##$DC= 2
##$DFILT= <>
##$DTYPP= 0
##$F1P= 15.7292609196834
##$F2P= 12.9074282941183
##$FCOR= 0.5
##$FTSIZE= 0
##$FT_mod= 4
##$GAMMA= 1
##$GB= 0.15
##$INTBC= 1
##$INTSCL= 1
##$ISEN= 128
##$LB= 0.24
##$LEV0= 0
##$LPBIN= 0
##$MAXI= 10000
##$MC2= 0
##$MEAN= 0
##$ME_mod= 0
##$MI= 1.114404
##$NCOEF= 0
##$NC_proc= 0
##$NLEV= 6
##$NOISF1= 3.799351
##$NOISF2= 2.8
##$NSP= 1
##$NTH_PI= 0
##$NZP= 0
##$OFFSET= 15.70392
##$PC= 1
##$PHC0= -21207.96
##$PHC1= 11.65272
##$PH_mod= 1
##$PKNL= yes
##$PPARMOD= 0
##$PSCAL= 0
##$PSIGN= 0
##$REVERSE= no
##$SF= 200.130013532006
##$SI= 16384
##$SIGF1= 3
##$SIGF2= 2
##$SINO= 400
##$SIOLD= 16384
##$SREGLST= <1H.CDCl3>
##$SSB= 0
##$STSI= 0
##$STSR= 0
##$SW_p= 3612.71676300578
##$SYMM= 0
##$S_DEV= 0
##$TDeff= 0
##$TDoff= 0
##$TI= <>
##$TILT= no
##$TM1= 0
##$TM2= 0
##$TOPLEV= 0
##$USERP1= <user>
##$USERP2= <user>
##$USERP3= <user>
##$USERP4= <user>
##$USERP5= <user>
##$WDW= 1
##$XDIM= 8192
##$YMAX_p= 0
##$YMIN_p= 0
$$ End of Bruker specific parameters
$$ ---------------------------------
##NTUPLES= NMR FID
##VAR_NAME=  TIME,          FID/REAL,        FID/IMAG
##SYMBOL=    X,             R,               I
##VAR_TYPE=  INDEPENDENT,   DEPENDENT,       DEPENDENT
##VAR_FORM=  AFFN,          ASDF,            ASDF
##VAR_DIM=   8192,          8192,            8192
##UNITS=     SECONDS,       ARBITRARY UNITS, ARBITRARY UNITS
##FACTOR=    0.0002768,     1,               1
##FIRST=     0,             0,               0
##LAST=      2.2672688,     0,               0
##MIN=       0,             -68093,          0
##MAX=       2.2672688,     79408,           0
$$ Real data points
##PAGE= N=1
##DATA TABLE= (X++(R..R)), XYDATA
$$ [...]
$$ plain form
1483 -4657 -2163 3114 4558 358 -4269 -3695 1454 4624 1989 -3265 -4573 -311 4125 3325 -1671
1498 -1671 -4731 -1900 3230 4423 169 -4146 -3244 1744 4710 1919 -3198 -4217 -83 4256 3207
1513 3207 -1777 -4643 -1787 3293 4148 -138 -4359 -3215 1748 4412 1534 -3374 -4163 175 4190
1528 4190 3054 -1810 -4287 -1367 3498 4253 -71 -4102 -2882 2086 4485 1389 -3468 -4034 273
1543 273 4087 2660 -2202 -4500 -1393 3288 3735 -567 -4283 -2789 2086 4321 1203 -3397 -3721 620
1559 620 4349 2810 -1991 -4055 -761 3723 3851 -524 -4050 -2412 2264 4056 797 -3631 -3786 504
1575 504 3938 2241 -2547 -4292 -984 3402 3371 -886 -4211 -2297 2438 4155 723 -3436 -3235 1208
1591 1208 4318 2348 -2204 -3728 -404 3705 3397 -982 -4090 -2164 2398 3835 299 -3852 -3401
$$ packed form
1483d657K494N277J444m200m627N74N149L170k635n254j308M262M436q00m996
1498a671l060K831N130J193m254m315R02M988K966k791n117j019M134M339j049
1513C207m984k866K856N080Q55m286m221J144M963K664k878m908p89M338M015
1528D190j136m864k477K920M865P55m324m031J220M968K399l096m857n66M307
1543B73L814j427m862k298L107M681M47m302l716J494M875K235l118m600l24M341
1559F20L729j539m801k064L294M484J28m375l526J638M676J792l259m428j55M290
1575E04L434j697m788j745L308M386l1m257l325J914M735J717l432m159K01M443
1591A208L110j970m552j524L324M109l08m379l108J926M562J437l536m151M51
$$ plain form
1606 -3401 1025 3896 1744 -2755 -3956 -496 3504 3054 -1204 -3937 -1788 2673 3946 487 -3443
1621 -3443 -2854 1427 4233 1929 -2525 -3687 -102 3681 2910 -1490 -4100 -1750 2535 3465 -148 -3753
1637 -3753 -2991 1272 3744 1427 -2766 -3619 -34 3618 2803 -1481 -3803 -1317 2953 3671 13 -3407
1653 -3407 -2411 1805 3866 1345 -2751 -3378 147 3421 2414 -1754 -3922 -1429 2673 3235 -378 -3795
1669 -3795 -2578 1624 3720 1046 -2947 -3282 494 3697 2379 -1685 -3495 -912 3017 3289 -267
1684 -267 -3383 -2164 1864 3706 1015 -2989 -3300 448 3534 2070 -2112 -3798 -906 2813 2879 -787
1700 -787 -3568 -2159 1863 3500 784 -2869 -2935 715 3575 2157 -1777 -3411 -553 3181 3063 -692
1716 -692 -3420 -1774 2095 3417 540 -3016 -2820 723 3294 1654 -2176 -3502 -648 2795 2655 -985
$$ packed form
1606c401M426K871k152m499j201L460M000m50m258k733K149M461J273l459l930
1621c443N89M281K806k304m454j162L585L783p71m400k610K350M285R30l613l605
1637c753P62M263K472k317m193q53L585L652q15m284k322K486M270P18l658l420
1653c407R96M216K061k521m096o27L525L274j007m168k168K493M102N62l613l417
1669c795J217M202K096k674l993l35L776L203j318m064j810K583L929K72l556
1684b67l116J219M028J842k691m004l11L748L086j464m182j686K892L719O6l666
1700g87k781J409M022J637k716l653o6L650K860j418l934j634K858L734j18l755
1716f92k728J646L869J322k877l556J96L543K571j640l830j326K854L443j40l640
$$ plain form
1732 -985 -3533 -1890 2119 3414 330 -3006 -2566 1177 3482 1659 -2065 -3044 -150 3085 2676 -917
1748 -917 -3246 -1560 2183 3224 285 -3058 -2622 1057 3343 1401 -2411 -3276 -209 2941 2235 -1328
1764 -1328 -3362 -1355 2203 2963 45 -2889 -2265 1217 3284 1444 -2204 -2996 51 3122 2425 -1277
1780 -1277 -3277 -1106 2510 2957 -134 -3061 -2087 1292 3110 1026 -2384 -2924 -54 2903 2047 -1359
1796 -1359 -3272 -1136 2352 2898 -236 -3058 -2017 1483 3226 923 -2376 -2644 440 2964 1932
1811 1932 -1420 -2964 -801 2328 2726 -296 -2961 -2025 1502 3099 769 -2560 -2747 414 3038 1770
1827 1770 -1708 -3042 -636 2444 2509 -547 -2870 -1716 1592 2893 728 -2364 -2563 509 3034 1785
1843 1785 -1608 -2980 -494 2579 2532 -742 -2963 -1497 1723 2798 379 -2465 -2309 623 2787 1431
$$ packed form
1732i85k548J643M009J295l084l336M40L743K305j823l724r79K894L235m09l593
1748i17k329J686L743J041k939l343M36L679K286j942l812q65L067L150p06l563
1764a328k034K007L558P60k918k934O24L482K067j840l648p92L047L071o97l702
1780a277k000K171L616M47l091k927R74L379J818k084l410n40K870K957q56l406
1796a359j913K136L488N46l134k822J041L500J743k303l299k68L084K524j032
1811A932l352j544K163L129L98l022k665R36L527J597k330l329j87L161K624j268
1827A770l478j334K406L080O5l056k323J154L308J301k165l092j99L072K525j249
1843A785l393j372K486L073m7l274k221J466L220J075k419k844J56K932K164j356
$$ plain form
1859 1431 -1667 -2825 -504 2449 2368 -702 -2963 -1486 1902 2857 334 -2537 -2146 979 2853 1302
1875 1302 -1823 -2650 -225 2498 2192 -791 -2798 -1402 1728 2762 266 -2649 -2245 899 2855 1142
1891 1142 -2025 -2699 -105 2571 1947 -1023 -2722 -1061 1889 2536 158 -2329 -2006 961 2773 1181
1907 1181 -1927 -2643 -63 2595 2016 -1185 -2806 -972 1956 2458 -127 -2483 -1790 1014 2601 890
1923 890 -1928 -2415 38 2495 1884 -1058 -2696 -885 2083 2552 -199 -2576 -1750 1248 2591 651
1939 651 -2103 -2283 255 2382 1599 -1113 -2574 -784 1953 2363 -169 -2474 -1635 1304 2613 713
1955 713 -2146 -2247 441 2566 1481 -1360 -2476 -504 2018 2032 -478 -2428 -1517 1149 2377 525
1971 525 -2128 -2269 407 2532 1517 -1404 -2440 -311 2333 2118 -513 -2350 -1182 1451 2299 345
$$ packed form
1859A431l098j158K321K953q1l070k261J477L388R55k523k871L91L125J874j551
1875A302l125q27K425K723l06k983k007J396L130J034k496k915M04L144J956j713
1891A142l167o74K594K676o24k970j699J661K950O47k378k487L23K967J812j592
1907A181l108p16K580K658n79l201j621J834K928N02k585k356O93K804J587j711
1923H90k818m87K453K457o11k942j638J811K968M69k751k377Q26K998J343j940
1939F51k754j80K538K127p83k712j461J790K737M10k532k305Q39K939J309j900
1955G13k859j01K688K125j085k841j116J972K522J4k510j950R11K666J228j852
1971E25k653j41K676K125j015k921j036K129K644k15k631j837J168K633Q48j954
$$ plain form
1987 345 -2016 -1904 478 2358 1263 -1359 -2429 -451 2072 1890 -756 -2610 -1334 1463 2252 10
2003 10 -2284 -1818 810 2414 1207 -1326 -2044 -23 2222 1947 -559 -2329 -1100 1593 2332 196
2019 196 -2177 -1816 836 2359 896 -1737 -2273 -94 1974 1479 -995 -2399 -1055 1446 1954 71
2035 71 -2072 -1596 969 2507 1127 -1509 -2014 181 2323 1697 -961 -2281 -682 1690 1936 -238
2051 -238 -2095 -1507 829 2065 708 -1741 -2121 -33 1920 1354 -1185 -2360 -800 1692 2041 -183
2067 -183 -2055 -1190 1279 2374 730 -1542 -1674 343 2077 1392 -922 -2130 -641 1638 1892 -317
2083 -317 -2235 -1439 1029 2060 378 -1938 -1979 288 1984 1048 -1250 -2073 -386 1759 1828 -201 -1857
2100 -1857 -1044 1320 2310 604 -1553 -1704 505 2138 1158 -1318 -2146 -406 1709 1550 -696 -2140
$$ packed form
1987C45k361J12K382J880j095k622j070J978K523j82k646j854J276K797P89k242
2003A0k294M66K628J604j207k533p18K021K245k75k506j770J229K693P39k136
2019A96k373L61K652J523j463k633n36K179K068m95k474j404J344K501N08j883
2035G1k143M76K565J538j380k636n05K195K142o26k658j320J599K372K46k174
2051b38j857N88K336J236j357k449l80K088J953n66k539j175J560K492L49k224
2067a83j872Q65K469J095j644k272j32K017J734o85k314j208J489K279K54k209
2083c17j918P96K468J031j682k316m1K267J696r36k298q23J687K145O9k029j656
2100a857Q13K364R90j706k157j51K209J633r80k476q28J740K115j59k246j444
$$ plain form
2116 -2140 -1119 1039 1781 95 -1869 -1778 331 1911 1013 -1248 -2013 -202 2001 1853 -379 -1882
2132 -1882 -764 1552 2140 280 -1756 -1488 568 1901 814 -1376 -2050 -347 1543 1333 -792 -2175
2148 -2175 -1120 1146 1771 -60 -1918 -1534 695 2033 817 -1247 -1621 193 2032 1580 -438 -1682
2164 -1682 -597 1436 1875 60 -1785 -1499 570 1855 632 -1592 -1993 -88 1690 1196 -963 -2019
2180 -2019 -739 1310 1661 -150 -1825 -1257 826 1990 818 -1159 -1494 273 1954 1483 -737 -1899
2196 -1899 -563 1445 1655 -293 -1948 -1218 762 1628 367 -1546 -1692 67 1642 1104 -869 -1836
2212 -1836 -581 1465 1720 -123 -1718 -992 1093 1961 609 -1354 -1415 381 1772 1049 -939 -1767 -389
2229 -389 1344 1398 -423 -1894 -1157 819 1683 318 -1559 -1562 334 1859 1045 -1031 -1766 -196 1586
$$ packed form
2116b140J021K158P42j686j964R1K109J580q98k261p65J811K203j48k232j503
2132a882J118K316N88j860k036K68K056J333j087k190o74J703J890k10k125j383
2148b175J055K266O25j831j858L84K229J338j216k064l74J814J839m52k018j244
2164a682J085K033M39j815j845K86K069J285j223k224m01J905J778m94k159j056
2180b019J280K049L51j811j675N68K083J164j172j977l35J767J681m71k220j162
2196a899J336K008K10j948j655P30J980Q66j261j913j46J759J575n38j973r67
2212a836J255K046K55j843j595P26K085Q68j352j963o1J796J391p23j988q28J378
2229c89J733N4j821j471P37J976Q64j365j877lJ896J525q14k076p35J570J782
$$ plain form
2246 1586 1513 -309 -1560 -822 1120 1717 388 -1403 -1366 384 1725 859 -1107 -1787 -318 1487 1247
2263 1247 -601 -1864 -891 1023 1673 36 -1457 -1290 532 1771 857 -981 -1491 -42 1576 1435
2279 1435 -437 -1607 -733 1155 1646 97 -1555 -1327 536 1595 640 -1198 -1580 -82 1430 1145
2295 1145 -652 -1649 -748 1119 1537 116 -1474 -1103 683 1780 729 -1097 -1449 107 1617 1150
2311 1150 -671 -1585 -618 1102 1346 -115 -1559 -1188 568 1509 467 -1291 -1554 32 1493 1076 -738
2328 -738 -1585 -527 1303 1449 -63 -1367 -791 885 1770 620 -1082 -1264 221 1511 977 -801 -1689
2345 -1689 -519 1109 1219 -423 -1634 -1096 664 1436 224 -1325 -1347 226 1508 922 -757 -1409 -264
2362 -264 1387 1430 -160 -1370 -705 979 1630 449 -1223 -1295 237 1429 671 -1008 -1637 -453 1132
$$ packed form
2246A586p3j822j251P38J942N97j329j791L7J750J341q66j966o80J469J805k40
2263A247j848j263R73J914O50j637j493J67J822J239r14j838n10J449J618j41
2279A435j872j170Q74J888M91j549j652K28J863J059r55j838l82J498J512k85
2295A145j797r97R01J867M18j421j590L71J786J097j051j826l52J556J510m67
2311A150j821r14R67J720K44j461j444L71J756R41j042j758k63J586J461m17j814
2328g38q47J058J830J46j512j304N76J676Q85j150j702j82J485J290n34j778q88
2345a689J170J628J10j642j211N38J760P72j212j549k2J573J282n86j679o52J145
2362b64J651M3j590j210O65J684O51j181j672p2J532J192p58j679o29J184J585
$$ plain form
2379 1132 1062 -477 -1577 -810 822 1444 176 -1210 -1181 383 1573 876 -710 -1360 -1 1460 1312
2396 1312 -242 -1265 -609 992 1433 155 -1283 -1175 301 1300 510 -1117 -1548 -310 1119 1054 -515
2413 -515 -1472 -627 995 1433 170 -1210 -1005 553 1524 703 -854 -1176 88 1423 1094 -413 -1304
2430 -1304 -476 997 1266 -2 -1424 -1158 413 1223 391 -1130 -1380 -20 1270 910 -582 -1341 -453
2447 -453 1013 1270 2 -1220 -796 709 1403 554 -946 -1167 214 1346 931 -627 -1328 -391 1004
2464 1004 1137 -216 -1346 -916 512 1218 287 -1159 -1182 139 1329 840 -595 -1216 -281 1082 1204
2481 1204 -138 -1285 -777 785 1331 337 -981 -1006 226 1245 782 -728 -1280 -296 993 1002 -336 -1391
2499 -1391 -814 618 1226 244 -1089 -1031 308 1312 726 -674 -1150 -101 1178 1133 -245 -1212 -601 754
$$ packed form
2379A132p0j539j100P67J632O22j268j386K9J564J190o97j586o50J359J461j48
2396A312j554j023O56J601M41j278j438J08J476R99p90j627m31J238J429o5j569
2413e15r57Q45J622M38j263j380K05J558R71q21j557l22J264J335l29j507q91
2430a304Q28J473K69j268j422K66J571Q10q32j521k50J360J290l60j492p59Q88
2447d53J466K57j268j222M24J505O94q49j500k21J381J132m15j558p01R37J395
2464A004J33j353j130M30J428P06r31j446k3J321J190m89j435o21R35J363J22
2481A204j342j147N08J562N46r94j318k5J232J019m63j510n52R84J289Rj338j055
2499a391N77J432O08r82j333N8J339J004n86j400m76J049J279m5j378r67O11J355
$$ plain form
2517 754 1244 244 -1063 -963 358 1266 577 -801 -1265 -217 1020 888 -450 -1356 -635 784 1214
2534 1214 70 -1094 -899 439 1309 568 -704 -1132 -55 1139 857 -332 -1130 -512 893 1217 85
2551 85 -1044 -883 445 1166 476 -828 -1151 -92 1063 790 -495 -1255 -505 820 1113 17 -1029
2568 -1029 -844 462 1185 460 -758 -1062 38 1091 841 -462 -1125 -433 843 1062 -149 -1128 -783
2585 -783 471 1132 314 -878 -1013 110 1069 731 -533 -1161 -326 955 1065 -119 -1060 -655 556 1106
2603 1106 325 -906 -1049 117 1074 701 -582 -1156 -282 885 947 -205 -1060 -655 632 1114 272 -870
2621 -870 -886 245 1122 642 -589 -1068 -196 965 909 -218 -1052 -615 610 1097 136 -965 -946 172 1069
2640 1069 559 -619 -1090 -164 858 880 -205 -1107 -521 684 1073 195 -883 -785 307 1066 491 -634
$$ packed form
2517G54M90j000j307J00J321R08o89j378m64J048J237j32j338r06P21J419M30
2534A214j144j164J95J338Q70p41j272m28J077J194k82j189p98O18J405L24j132
2551H5j129J61J328P21o90j304l23J059J155k73j285p60P50J325K93j096j046
2568a029J85J306P23p25j218l04J100J053k50j303o63O92J276K19j211r79L45
2585g83J254O61q18j192j35J123R59l38j264o28Q35J281J10j184r41M05J211N50
2603A106p81j231j43J166R57l73j283n74Q74J167O2j152q55M05J287M82q42j142
2621h70j6J131Q77m80j231m79Q72J161n6j127q34M37J225M87r61j101J9J118Q97
2640A069n10j178m71R26J022K2j085r02N86J205L89q78j078R8J092P59n75j125
$$ plain form
2658 -634 -1009 -105 879 768 -341 -1062 -503 637 974 31 -920 -785 310 1039 459 -680 -1015 -83 947
2677 947 780 -313 -1017 -414 751 1008 70 -910 -718 400 1031 421 -722 -869 -23 960 730 -413
2695 -413 -1004 -462 716 907 -69 -926 -677 386 963 364 -729 -912 81 941 667 -421 -984 -289 706
2714 706 879 -69 -896 -636 488 974 347 -758 -861 98 1004 605 -457 -921 -330 732 833 -103 -948
2733 -948 -591 427 933 239 -753 -796 174 971 639 -458 -918 -233 754 828 -117 -925 -550 554 952 228
2753 228 -737 -822 218 944 505 -529 -876 -210 751 750 -207 -907 -548 535 846 92 -760 -782 169 929
2773 929 469 -529 -891 -136 797 788 -165 -892 -361 611 949 187 -830 -693 251 917 428 -558 -892 -138
2793 -138 754 651 -330 -997 -455 542 831 51 -753 -713 225 940 359 -526 -805 -23 878 668 -208 -851
$$ packed form
2658f34l75R04R84j11j109p21N59J140L37r43r51J35J095P29n80j139l35R32J030
2677I47j67j093p04O03J165K57r38r80J92J118O31o10j143j47Q46R83k30j143
2695d13n91N42J178J91r76q57K49J063N77n99j093j83R93Q60k74j088n63O95R95
2714G06J73r48q27K60J124M86o27j105j03R59R06l99j062m64N91J062J01r36q45
2733i48L57J018N06o94r92m3R70P97l32j097m60O85R87P4r45q08L75J104L98p24
2753B28r65q5J040P26m39j034l47O66R61jr57p00L59J083L11p54q52k2R51P60
2773I29m60r98l62P55R33rr53p27N31R72L38p62j017J37R44O66m89r86l34P54
2793a38Q92j03r81o67N42R97K89p80q04M0R38P15n81q85k79P82R01k10q76o43
$$ plain form
2813 -851 -290 688 874 37 -786 -591 326 905 376 -636 -911 -95 779 616 -373 -937 -372 530 753 -75
2833 -75 -832 -587 303 854 360 -607 -771 62 831 613 -270 -737 -231 728 858 -60 -830 -604 349 905
2853 905 284 -690 -787 78 727 462 -421 -850 -313 572 694 -94 -777 -504 384 817 282 -596 -717 88
2873 88 828 447 -401 -756 -183 703 659 -105 -743 -477 419 807 123 -702 -664 88 715 439 -431 -760 -161
2894 -161 680 608 -72 -792 -461 404 795 158 -603 -539 257 876 406 -449 -732 -47 722 649 -194 -803 -475
2915 -475 383 719 91 -718 -652 201 704 338 -492 -736 -104 644 620 -214 -754 -292 588 814 118 -637 -498
2936 -498 252 804 382 -514 -707 -67 629 545 -280 -762 -340 471 648 -54 -697 -547 236 731 252 -498
2956 -498 -641 -19 714 547 -213 -654 -225 533 732 28 -632 -513 309 765 251 -503 -663 31 643 438
$$ packed form
2813h51N61R78J86q37q23J95R17N79n29j012k75Q16Q74j63r89n64N65R02K23q28
2833g5p57K45Q90N51m94r67j64Q33P69k18q83m67N06R59J30r18p70K26R53N56
2853I05o21r74r7Q65O49k65q83m29N37Q85J22p88o83K73Q88M33n35q78j21Q05
2873H8P40l81q48l55N73Q86m4p64o38K66Q96L88o84q25L8P52O27k76q70l29N99
2894a61Q41p2o80p20L31Q65L91o37p61O4P96O19m70q55k83O85P69p3q43o09L28
2915d75Q58L36o28q09O6Q53N03l66q30k44O32P48k4q34n40M62Q80K26o96p55J39
2936d98P50N52m22q96j93O40O96q4q25m82M22Q11J77p02o43J50P83M95m79p50
2956d98j43O22P33j67p60m41M29P58J99p04o60J19Q22M56n14p54j60O94O12k05
$$ plain form
2976 438 -315 -768 -283 520 668 -1 -666 -463 320 734 254 -526 -613 78 678 489 -266 -670 -184 581
2996 581 653 -43 -714 -426 296 704 130 -583 -673 15 637 393 -370 -719 -215 561 608 -97 -664 -425 394
3017 394 713 227 -525 -520 122 636 386 -346 -696 -174 545 537 -175 -672 -391 324 631 128 -642 -558 152 625
3039 625 347 -351 -663 -78 615 537 -98 -611 -287 393 621 63 -558 -493 213 633 278 -451 -661 -90 572
3060 572 473 -170 -646 -366 408 575 100 -581 -523 207 695 327 -375 -588 10 591 517 -195 -659 -312 453
3081 453 593 43 -585 -518 176 627 201 -490 -635 -53 549 457 -292 -629 -228 400 593 57 -576 -456 290
3102 290 645 262 -407 -568 23 574 457 -220 -594 -215 455 546 0 -587 -436 187 576 183 -510 -584 -27
3123 -27 555 312 -261 -607 -151 457 485 -9 -570 -342 319 614 192 -395 -458 92 566 350 -293 -551 -123
$$ packed form
2976D38p53m53M85Q03J48o69o65K03P83M14m80p80q7O91O00j89p55m04M86P65
2996E81P2o96o71K88P22M08n74p13r0O88O22k44p63l49N04P76M7p05n67K39Q19
3017C94L19m86p52NO42N14k50p32l50N22P19qp12m97K81P15L07n03p70Q4P10M73
3039F25k78o98l12N85O93p8o35n13L24O80K28n58o21O5P06M20l55p29k10N71O62
3060E72r9o43m76K80P74J67m75o81N8P30M88l68p02k13N98N81p4p12m64L47P65
3081D53J40n50o28O7O94M51m26o91j45N82O02r2p49l37M01O28J93n36o33J20P46
3102B90L55l83o69j61N91N51j17o77l74L79O70R1n46n87J51O23L89l93o93p4N57
3123b7N82k43n73l46M56O08K8m94n61K28O61K95m22n87o3N50M74k16o43k58M28
$$ plain form
3144 -123 456 507 -114 -566 -371 269 548 152 -517 -514 9 494 308 -314 -516 -173 461 524 -32 -508 -278
3165 -278 355 627 132 -462 -426 86 560 335 -254 -556 -66 439 408 -189 -595 -362 262 508 82 -473 -536
3186 -536 182 585 312 -304 -504 -15 585 509 -79 -465 -228 428 572 94 -516 -395 162 480 200 -430
3206 -430 -578 -68 414 328 -227 -605 -250 305 566 20 -475 -397 219 566 315 -292 -425 60 509 406 -152
3227 -152 -503 -155 427 512 14 -510 -369 177 481 182 -377 -496 -50 444 313 -209 -525 -178 414 474 12
3248 12 -426 -350 248 542 188 -355 -476 10 443 369 -146 -484 -165 398 438 -74 -490 -326 254 495 152
3269 152 -393 -455 61 548 371 -200 -504 -191 463 462 -40 -450 -282 275 527 116 -382 -459 35 429 290
3290 290 -217 -518 -143 362 408 -71 -511 -281 256 469 112 -378 -392 133 516 282 -248 -481 -46 449 410
$$ packed form
3144a23N79N1o21m52J95O40K79l96o69LN23M85j86o22k02L43O34O3n56m76K30
3165b78O33K72m95n94L6N12M74k25n89l02M90N05l1n97m06K33O24K46m26n55o3
3186e36P18M03k73o16k00M89O00p6n88l86K37O56J44m78o10J21N57L18k80o30
3206d30j48N10M82q6n55l78L55N55K61n46m95P8O16L47k51o07j33M85M49j03n58
3227a52l51L48N82Q5m98n24J41N46L04k99n59j19M46M94j31n22l16L47N92O0m62
3248A2m38P6N98K94l54n43j21M86M33p4n15l38L19N63M0n12m16J64N80K41l43
3269A52n45o2N16M87j77n71l04L13O54jn02m10J68N57K52m11m98p7M94L94j39
3290B90n07l01L75N05M6m79m40K30N37K13l57m90j4N25L83k34n30k33M35M95l9
$$ plain form
3311 410 -146 -436 -193 221 486 32 -381 -431 74 440 263 -245 -464 -31 425 397 -83 -500 -209 254 477
3332 477 78 -399 -359 129 463 181 -281 -416 -71 422 292 -135 -438 -208 277 440 53 -418 -343 145 412
3353 412 191 -288 -418 28 428 368 -157 -443 -163 327 434 28 -425 -348 185 489 251 -278 -395 -39 293
3374 293 325 -205 -506 -166 332 366 -11 -415 -330 186 438 147 -277 -359 33 430 274 -102 -359 -142 308
3395 308 442 -32 -402 -260 224 484 149 -323 -388 6 370 262 -259 -476 -176 274 338 -86 -388 -306 206
3416 206 494 159 -287 -341 52 453 238 -114 -349 -47 393 316 -43 -369 -202 211 416 103 -358 -394 51
3437 51 369 183 -239 -433 -107 313 335 7 -372 -202 277 414 132 -325 -300 156 474 270 -213 -287 -67
3458 -67 328 333 -63 -368 -257 168 301 8 -375 -378 51 355 169 -270 -402 -107 341 358 -58 -385 -208 306
$$ packed form
3311D10n56k90K43M14K65m54m13n0N05L66j77n08k19M33M56k8m80m17K91M63K23
3332D77l99m77M0M88L34k82m62j35L45M93j30m27l03K30M85J63l87m71P5M88K67
3353D12k21m79j30M46M00o0n25k86K80M90J07m06m53P7N33L04k38n29j17L56L32
3374B93L2n30l01L40M98L4l77m04Q5N16K52k91m24q2L92L97j56l76k57K17M50
3395C08J34m74l70J42M84K60l35m72o5L94L64j08n21k17L00M50O4m24l02Q2N12
3416B06K88l35m46n4L93M01k15l52k35L02M40p7l59l26J67M13K05l13m61l6M45
3437E1L18j86m22j94L26M20K2l28l79J70M79J37k82m57K5M56L18k04m83p4K20
3458f7L95Nl96l05J11M25J33k93l83lM29L04j86m39j32K95M48J7m16l27J77N14
$$ plain form
3480 306 386 41 -231 -267 157 406 205 -232 -394 -41 286 240 -101 -424 -167 231 330 -19 -342 -237 114
3501 114 404 124 -286 -360 -3 291 322 -146 -375 -148 302 312 35 -240 -289 142 371 149 -281 -338 -14 331
3523 331 248 -140 -398 -146 239 312 -3 -365 -244 176 322 149 -262 -270 22 345 250 -141 -320 -117 231 290
3545 290 -16 -327 -223 109 333 82 -311 -370 42 343 249 -136 -355 -78 313 326 -63 -349 -192 232 391
3566 391 128 -258 -269 36 311 180 -157 -319 -110 316 257 -23 -314 -228 230 387 34 -309 -270 96 336
3587 336 230 -201 -333 11 184 281 -69 -342 -213 179 324 9 -259 -232 90 309 181 -210 -364 -54 260
3608 260 215 -136 -310 -175 208 281 63 -268 -212 76 362 236 -146 -305 6 324 256 -59 -283 -185 231 300
3630 300 -30 -314 -238 63 222 125 -196 -366 -61 273 179 -121 -273 -82 187 303 0 -312 -206 180 387
$$ packed form
3480C06Q0l45k72l6M24K49k01m37j62L53L27m6l41l23K57L98R9l49l23J05L51
3501A14K90k80m10p4L57K94L1m68k29K27M50J0k77k75m9M31K29k22m30n7L24L45
3523C31q3l88k58K52L85P3l15l62J21M20J46j73m11qK92L23r5l91j79K03L48N9
3545B90l06l11J04L32K24k51l93n9M12L01r4l85k19K77L91J3l89k86J57M24J59
3566C91k63l86j1L05K75j31l37j62K09M26n9k80k91Q6M58J57l53l43L9L66K40
3587C36j06m31j32L44J73R7l50k73J29L92J45l15k68K7L22K19j28l91j54L10L14
3608B60m5l51j74J35L83P3k18l31N6K88K86j26l82j59L11L18o8l15k24R8M16O9
3630C00l30k84P6L01J59r7l21j70L05L34r4l00j52J91K69J16l03l12J06L86K07
$$ plain form
3651 387 171 -185 -267 27 306 237 -82 -336 -154 184 284 -4 -292 -243 126 296 85 -292 -315 -8 282
3672 282 192 -102 -273 -66 262 285 8 -203 -154 148 353 139 -174 -233 58 299 197 -139 -287 -111 219
3693 219 245 -63 -324 -217 115 259 65 -244 -275 20 311 241 -152 -264 -80 265 265 -6 -184 -164 176 312
3715 312 71 -167 -214 36 216 214 -221 -296 -118 189 179 -104 -386 -151 191 255 86 -297 -224 24 328 129
3737 129 -154 -273 -27 177 232 -43 -248 -157 192 277 74 -218 -301 73 215 164 -142 -284 -28 237 223 -112
3759 -112 -287 -187 162 202 31 -217 -171 113 290 137 -151 -219 -64 247 172 -97 -214 -99 242 261 36 -204
3781 -204 -178 27 264 135 -217 -242 -52 262 255 -41 -193 -104 231 256 74 -241 -190 118 278 93 -187 -212 2
3804 2 222 199 -101 -281 -76 174 236 -14 -202 -158 67 255 87 -210 -251 13 264 164 -84 -218 -127 158
$$ packed form
3651C87k16l56q2K94K79o9l19k54J82L38J00k88k88M9L69J70k11l77k3L07K90
3672B82r0k94j71K07L28K3k77k11M9L02K05k14l13n9K91K41j02l36j48J76L30
3693B19K6l08k61J07L32J44j94l09l1K95K91p0l93j12J84L45%k71j78K0L40J36
3715C12k41k38m7K50J80km35p5J78L07j0k83k82K35L42O4j69l83P3K48L04j99
3737A29k83j19K46K04N5k75k05R1L49Q5k03k92q3L74J42n1l06j42K56K65j4l35
3759a12j75J00L49M0j71k48M6K84J77j53k88o8J55L11p5k69j17J15L41J9k25k40
3781b04K6K05K37j29l52k5J90L14pk96j52Q9L35K5j82l15N1L08J60j85k80k5K14
3804BK20k3l00j80K05K50O2k50j88M4K25J88j68k97m1K64K51j00k48j34R1K85
$$ plain form
3826 158 231 4 -210 -134 96 236 69 -177 -261 41 191 167 -147 -309 -85 254 184 -87 -207 -141 122 195
3848 195 55 -196 -214 48 220 126 -135 -250 -29 186 219 -84 -269 -118 139 224 54 -220 -197 96 242 92
3870 92 -91 -254 -91 174 151 -57 -218 -157 138 274 9 -263 -172 52 208 218 -137 -174 -66 233 158 -52
3892 -52 -176 -86 120 166 45 -226 -175 52 240 80 -127 -177 -63 214 179 -40 -210 -28 209 259 21 -156
3914 -156 -126 17 243 91 -134 -190 -24 172 153 -94 -221 -77 118 219 61 -152 -178 61 193 92 -148
3935 -148 -181 -13 189 202 -39 -217 -78 170 241 -1 -193 -153 79 237 65 -152 -231 4 233 155 -78 -199
3957 -199 -73 179 214 -9 -187 -118 60 236 81 -119 -240 -11 145 180 -55 -202 -43 184 248 56 -236
3978 -236 -89 73 210 70 -137 -203 -5 199 160 -68 -197 -80 151 192 -19 -160 -123 91 235 78 -175
$$ packed form
3826A58P3k27k14P6K30J40j67k46q4L02J50k4l14j62K24L39p0k71j20O6K63P3
3848A95j40k51j8K62J72r4k61j15K21K15L3l03j85J51K57Q5j70k74K3K93J46j50
3870I2j83j63J63K65k3k08j61O1K95J36k65k72R1K24J56J0l55l7J08K99p5k10
3892e2j24R0K06M6j21k71N1K27J88j60k07n0J14K77l5k19j70J82K37N0k38j77
3914a56L0J43K26j52k25n6J66J96j9k47j27J44J95J01j58k13k6K39J32j01k40
3935a48l3J68K02J3k41j78J39K48P1k42j92M0K32J58j72k17p9K35K29p8k33j21
3957a99J26K52L5k23j78O9J78J76j55k00j21K29J56L5k35j47J59K27O4j92k92
3978b36J47J62J37j40k07o6J98K04l9k28j29J17K31M1k11j41L7K14J44j57k53
$$ plain form
3999 -175 -184 42 200 72 -118 -115 -38 190 166 4 -230 -155 96 202 46 -178 -176 43 211 145 -123 -206 -17 143
4023 143 120 -41 -209 -90 95 191 13 -138 -182 24 214 148 -53 -206 -65 174 167 -25 -161 -146 116 160 82
4046 82 -113 -163 86 192 74 -59 -168 -17 127 175 -16 -195 -97 110 204 15 -186 -150 112 175 144 -80 -175
4069 -175 -37 198 138 -52 -152 -106 105 226 3 -133 -128 36 152 106 -157 -182 -34 187 120 -94 -191 -106 96
4092 96 134 28 -151 -160 86 201 60 -125 -158 -17 154 131 -104 -210 -60 190 181 11 -144 -95 43 113 87 -194
4116 -194 -161 -11 105 122 -78 -177 -70 120 186 -1 -112 -86 86 226 104 -84 -101 45 187 67 -31 -146
4138 -146 -89 148 149 -51 -176 -108 71 146 -6 -107 -178 -38 148 146 -55 -176 -126 81 156 -32 -96 -70 87 130
4162 130 58 -94 -113 13 206 108 -99 -118 0 118 140 -35 -163 -68 76 150 63 -146 -133 7 161 100 -57
$$ packed form
3999a75rK26J58j28j90LP7K28k4j62k34P5K51J06j56k24KK19J68o6k68q3J89J60
4023A43k3j61j68J19J85R6j78j51m4K06J90o6k01j53J41K39pj92j36J5K62M4p8
4046H2j95n0K49J06j18j33j09J51J44M8j91j79R8K07R4j89k01L6K62O3l1k24r5
4069a75J38K35o0j90j00M6K11J21k23j36NJ64J16m6k63k5J48K21o7k14r7Q5K02
4092I6L8j06j79rK46J15j41j85l3J41J71k3k35j06J50K50rj70j55M9J38P0k6k81
4116a94L3J50J16J7k00r9J07J90O6j87j11K6J72J40j22j88j7J46J42j20r8j15
4138a46N7K37Jk00j25O8J79P5j52j01p1J40J86kk01j21N0K07P5j88o4K6J57M3
4162A30p2j52j9J26J93r8k07j9J18J18K2j75j28R5J44P4q7k09J3J40J54o1j57
$$ plain form
4185 -57 -182 -105 164 158 -44 -128 -122 81 189 49 -92 -91 79 174 89 -156 -186 14 155 120 -25 -161 -71 90 124
4210 124 19 -116 -116 91 160 76 -74 -130 59 190 185 7 -103 -69 124 98 36 -124 -107 36 155 47 -74 -127
4234 -127 -36 40 158 -37 -198 -53 86 104 -57 -114 -116 127 160 43 -40 -134 21 162 133 -14 -109 -17 173 138
4258 138 31 -195 -105 17 133 33 -97 -140 4 125 166 -70 -129 -53 91 141 26 -103 -78 96 222 52
4280 52 -119 -115 7 148 82 -35 -154 -88 124 97 -23 -110 -118 69 93 -3 -68 -118 31 131 95 -19 -131 -65 179
4305 179 105 -17 -95 -49 114 156 59 -93 -139 55 114 65 -104 -132 -119 91 146 -66 -148 -120 89 174 -4 -85 -56
4330 -56 85 157 41 -43 -129 -18 185 129 -4 -84 -10 94 140 95 -130 -94 -9 111 68 -103 -102 -49 64 71 -49 -129
4356 -129 -51 73 155 14 -100 -63 -43 116 77 -55 -79 -3 112 82 8 -141 -44 118 74 -22 -149 -65 18 119 73
$$ packed form
4185e7j25P7K69ok02q4OK03J08j40j41JJ70R5q5k45l0K00J41l5j45j36R0J61L4
4210A24j05j35%K07O9q4j50n6J89J31nj78j10L4J93k6o2j60J7J43J19j08j21n3
4234a27R1P6J18j95j61J45J39J8j61n7kK43L3j17q3r4J55J41k9j47r5R2J90l5
4258A38j07k26R0J22J16j00j30m3J44J21M1k36n9P6J44N0j15j29K5J74J26j70
4280E2j71MJ22J41o6j17j19O6K12k7j20q7qJ87K4r6o5n0J49J00l6j14j12O6K44
4305A79p4j22p8M6J63M2r7j52m6J94N9m9j69k8J3K10N5k12q2K8K09Q5j78q1K9
4330e6J41P2j16q4q6J11K03n6j33q0P4J04M6m5k25L6Q5J20m3j71JN3J13Pj20q0
4356a29P8J24Q2j41j14L7K0J59l9j32k4P6J15l0p4j49R7J62m4r6j27Q4Q3J01m6
$$ plain form
4381 73 -118 -124 -26 96 174 -43 -119 -39 84 141 56 -90 -72 59 147 50 -87 -103 24 154 75 -63 -142 -74 72
4406 72 148 23 -154 -103 29 130 13 -103 -130 -82 121 96 -71 -152 -79 112 115 4 -62 -81 56 82 59 -45 -105
4431 -105 1 134 62 -56 -128 -45 49 107 -50 -136 -136 22 117 -1 -122 -159 75 132 91 27 -109 1 113 119 12
4456 12 -79 -55 76 106 58 -98 -79 -19 50 52 -61 -163 -31 68 85 -76 -136 -94 33 145 21 -96 -115 -42 109
4481 109 73 -49 -87 0 59 140 25 -93 -43 89 102 -28 -77 -108 77 51 90 -102 -114 -66 41 127 -3 -126 -20
4506 -20 54 120 40 -120 -84 26 110 90 -89 -79 -11 109 73 -27 -91 -53 60 29 -6 -90 -72 15 72 28 -73 -130 0
4533 0 96 91 -52 -118 -57 92 163 12 -137 -62 43 133 99 -55 -114 -16 126 67 -4 -121 -37 86 126 -13 -122 -118
4559 -118 14 71 38 -61 -113 -17 95 100 -21 -78 0 101 81 16 -74 -59 -3 109 31 -44 -60 -12 99 88 -64 -102 -41
$$ packed form
4381G3j91oR8J22P8k17p6Q0J23N7q5j46J8J31Q8r7j37j6J27J30p9j38p9O8J46
4406G2P6j25j77N1J32J01j17j16k7M8K03k5j67q1P3J91Lj11o6j9J37K6k3j04o0
4431a05J06J33p2j18p2Q3R4N8j57q6%J58R5j18j21l7K34N7m1o4j36J10J12Oj07
4456A2r1K4J31L0m8j56J9O0O9Kj13j02J32R9J7j61o0M2J27J12j24j17j9P3J51
4481A09l6j22l8Q7N9Q1j15j18N0J32J3j30m9l1J85k6L9j92j2M8J07Q6j30j23J06
4506b0P4O6q0j60L6J10Q4k0j79J0O8J20l6j00o4L8J13l1l5q4J8Q7N7m4j01n7J30
4533@R6nj43o6O1J49P1j51j49P5J05R0l4j54n9R8J42n9p1j17Q4J23M0j39j09M
4559a18J32N7l3r9n2R6J12Nj21n7P8J01k0o5r0J5N6J12p8p5j6M8J11j1j52l8O1
$$ plain form
4586 -41 46 103 20 -134 -90 61 97 5 -37 -80 89 141 80 -27 -49 -10 74 107 -22 -23 -77 39 81 23 -81 -93 2
4613 2 106 57 -74 -86 -19 90 63 -30 -140 -83 29 122 70 -96 -122 55 104 21 -61 -107 -25 69 100 -6 -131 -37
4639 -37 32 108 58 -94 -81 -16 74 57 -74 -94 -33 52 113 -17 -105 -44 20 58 69 -78 -37 80 93 35 -51 -54 -1 82
4667 82 42 -38 -99 -89 5 73 70 -136 -58 10 57 71 -32 -58 11 139 144 16 -76 12 105 65 50 -71 -91 44 87 77
4695 77 -72 -90 -38 52 55 -42 -102 -53 79 53 41 -87 -71 35 101 48 -30 -61 29 125 21 -31 -41 -13 41 66 24 -80
4723 -80 -76 -27 79 -1 -70 -58 -20 30 64 -14 -97 -25 78 97 -3 -63 -47 41 132 42 33 -56 -1 49 71 -16 -103 26 67
4752 67 68 -32 -100 -54 45 60 -7 -35 -66 -23 24 62 -31 -40 -37 128 69 6 -78 -67 53 113 50 -97 -52 13 53 61 -28 -103
4782 -103 -30 57 81 -23 -87 -12 40 102 -1 -21 -105 0 71 12 -32 -79 -30 15 29 14 -77 -51 58 134 7 -59 -104
$$ packed form
4586d1Q7N7q3j54M4J51L6r2m2m3J69N2o1j07k2L9Q4L3j29jn4J16M2n8j04j2R5
4613BJ04m9j31j2O7J09k7r3j10N7J12R3n2j66k6J77M9q3q2m6Q2R4L1j06j25R4
4639c7O9P6n0j52J3O5R0j7j31k0O1Q5O1j30q8O1O4L8J1j47M1J17J3n8q6lN3Q3
4667H2m0q0o1J0R4O8lk06P8O8M7J4j03k6O9J28Nj28r2Q8R3m0j5j21k0J35M3j0
4695G7j49j8N2R0Lr7o0M9J32k6j2j28J6J06O6n3p8l1R0R6j04n2j0K8N4K5m2j04
4723h0MM9J06q0o9J2L8N0L4p8q3P2J03J9j00o0J6Q8R1r0rq9N5N0K2q7q7J29M1
4752F7Jj00o8M6R9J5o7k8l1M3M7L8r3rLJ65n9o3q4J1J20O0o3j47M5O5M0Qq9p5
4782a03P3Q7K4j04o4P5N2O2j03k0q4J05P1n9m4m7M9M5J4j5r1K6J09P6j27o6m5
$$ plain form
4809 -104 17 62 44 1 -46 -7 69 53 -44 -138 -51 28 47 7 -59 -24 -3 44 -12 -17 -88 2 51 49 -64 -30 -25 44 67 -2
4839 -2 -79 -95 14 101 65 -26 -73 -15 15 51 -22 -103 -52 42 90 48 -86 -67 1 62 36 -29 -92 0 121 107 6 -43 -11
4868 -11 81 32 24 -61 -106 79 87 -19 -73 -91 23 74 63 -24 -54 -67 64 70 2 -69 -33 34 77 -30 -41 -57 1 81 84 -59
4898 -59 -68 -5 47 107 -39 -14 -93 28 70 29 -82 -57 -36 19 53 -90 -62 -1 61 97 -55 -49 -50 38 79 -15 -29 -72 78
4927 78 49 75 -39 -64 -14 61 56 9 -66 -6 13 98 27 -46 -38 18 121 58 -11 -60 -16 74 44 -40 -64 -31 13 68 17 -54
4957 -54 -66 -11 119 57 -70 -73 15 122 115 4 -24 -68 46 21 29 -67 -39 -34 81 48 -78 -51 -42 61 27 -34 -123 -3
4985 -3 43 99 41 -37 -41 -19 81 43 -63 -61 -18 47 76 -15 -65 -22 51 68 11 -68 -96 15 70 28 -74 -86 -63 60 51 -15
5015 -15 -54 -47 48 74 -3 -81 -34 10 61 49 -75 -36 -1 70 9 -1 -39 -1 104 78 -24 -23 -64 -36 103 90 -52 -147 15
$$ packed form
4809a04J21M5j8m3m7L9P6j6r7r4Q7P9J9m0o6L5K1M7n6np1R0M9kj13L4NO9K3o9
4839bp7j6J09Q7l6r1m7N8L0L6p3q1N1R4M8m2j34J9O8O1k6o5o3R2J21j4j01m9L2
4868a1R2m9qq5m5J85Qj06n4j8J14N1j1q7l0j3J31Oo8p1L6O7M3j07j1j6N8Q0Lj43
4898e9rO3N2O0j46K5p9J21M2m1j11K5K1N5L4j43K8O1O2L6j52OjQ8M1r4j4m3J50
4927G8k9K6j14k5N0P5nm7p5O0J9Q5p1p3QN6J03o3o9m9M4R0l0q4k4L3M4N5n1p1
4957e4j2N5J30o2j27lQ8J07pj11k8m4J14k5Qr6K8NJ15l3j26K7RJ03l4o1q9J20
4985cM6N6n8p8mK2J00l8j06KM3O5K9r1n0M3P3J7n7p9k8J11N5m2j02j2K3J23ro6
5015a5l9PR5K6p7p8M7M4N1j2j24L9L5P1o1j0l8L8J05k6j02Jm1K8J39j3j42r5J62
$$ plain form
5044 15 91 85 -10 -69 -131 57 44 0 -111 6 32 41 80 -96 -46 5 71 13 -27 -58 -39 79 17 11 -48 -66 -16 67 66 -71
5074 -71 -69 -11 46 48 13 -68 1 34 30 -37 -92 -22 -3 68 49 -73 -27 0 83 83 -88 -111 -26 21 41 6 -92 -78 76 90 32
5105 32 -88 -38 -8 91 62 -53 -60 -13 57 57 -7 -76 -3 16 64 51 -21 -68 37 64 36 -31 -81 -12 29 94 -8 -69 -30
5134 -30 45 30 12 -45 -58 16 93 32 -17 -35 -28 86 68 -34 -56 -61 71 76 -13 -63 -86 18 -2 64 -39 -68 -43 37 36 17
5164 17 -68 -14 26 15 27 -39 -70 -24 30 32 -58 -107 2 49 -2 -9 -112 -32 41 87 7 -98 -29 30 83 32 -62 -36 -32 136
5194 136 50 -46 -45 -16 21 80 -3 -37 -73 8 118 35 -68 -44 0 114 42 -83 -120 -41 105 33 31 -58 -57 36 53 -27 -52
5223 -52 -34 26 57 1 -3 -48 20 76 20 12 -76 -28 41 67 35 -66 -78 13 81 61 -40 -60 -56 -9 67 -33 -101 -10 39 39 -7
5254 -7 -56 -96 8 74 18 -30 -71 -13 76 57 8 -79 -46 -7 68 3 -65 -7 -36 61 -24 -49 -33 -29 78 43 -18 -43 -52 21 53
$$ packed form
5044A5P6or5n9o2J88j3m4j11J17K6RL9j76N0N1O6n8m0l1J9J18o2on9j8N0Q3jj37
5074g1KN8N7Kl5q1O9L3mo7n5P0J9P1j9j22M6K7Q3%j71k3Q5M7K0l5r8J4J54J4n8
5105C2j20N0L0R9k9j15pM7P0%o4o9P3J9M8j3p2m7J05K7k8o7n0O9M1O5j02o1L9
5134c0P5j5j8n7j3P4P7o1m9j8PJ14j8j02k2nJ32Nq9n0k3J04k0O6j03k9K5Q0jj9
5164A7q5N4M0j1J2o6l1M6N4Kr0m9J09M7n1pj03Q0P3M6q0j05O9N9N3n1r4K6MJ68
5194A36q6r6JK9L7N9q3l4l6Q1J10q3j03K4M4J14p2j25l7P9J46p2kq9JR3J7q0k5
5223e2J8O0L1n6mm5O8N6n6qq8M8O9K6l2j01j2R1O8k0j01k0MM7P6j00o8R1M9%m6
5254gm9m0J04O6n6m8m1N8Q9j9m9q7L3L9P5o5o8N8k9R7q5k5J6MJ07l5o1k5rP3L2
$$ plain form
5285 53 63 -1 -77 7 61 83 -41 -44 5 36 53 -21 -91 -65 52 55 -9 -86 -46 34 71 -31 -10 -80 -46 22 40 -23 -44 -55
5315 -55 18 37 28 -51 -34 0 38 71 -33 -133 -16 81 87 -33 -63 -65 58 73 36 -42 -15 28 20 67 -31 -21 -17 51 31 -7
5345 -7 -69 -16 31 28 24 6 -48 14 65 -11 -71 -47 -34 81 1 -23 -56 -55 25 73 -47 -22 -13 -17 96 52 -84 -59 -20 6 12 -7
5377 -7 -71 -25 85 22 0 -80 -99 46 59 -36 -93 -95 -39 54 32 -16 -47 -43 101 -13 -29 -19 -75 56 57 0 0 -54 8 69
5407 69 38 -34 -72 34 45 64 -62 -23 -58 26 89 5 -15 -96 -45 31 57 -32 -92 24 50 45 -7 -27 -36 89 40 -30 -15
5436 -15 -68 27 71 58 -75 -58 20 -16 116 -17 -58 -23 17 79 33 -34 -8 -2 17 31 -40 -36 -6 75 19 -23 -58 -3 88 79
5466 79 -36 -12 -38 -14 99 40 -13 -40 -35 43 -6 -17 -64 7 25 86 15 -64 -15 15 37 -7 -5 -16 27 63 33 54 -98 -67
5496 -67 72 2 24 31 -66 36 39 2 -66 -94 -45 -22 11 -48 -96 -12 -3 20 -10 -2 -54 26 53 -27 -12 -107 36 31 27 34 -57 -35
$$ packed form
5285E3J0o4p6Q4N4K2j24lM9L1J7p4p0K6J17Lo4p7M0Q0L7j02K1p0L4O8J8o3k1j1
5315e5P3J9rp9J7L4L8L3j04j00J17R7Oj20l0kJ23J5l7p8K7M3qM7r8J0MO8k0l8
5345go2N3M7lmj8n4O2N1p6o0K4J3J15q0k4l3JQ0M8j20K5RmJ13m4j36K5L9K6Oj9
5377go4M6J10o3k2q0j9J45J3r5n7kN6R3k2m8l1MJ44j14j6J0n6J31Jn7%n4O2O1
5407F9l1p2l8J06J1J9j26L9l5Q4O3q4k0q1N1P6K6q9o0J16K6nn2k0rJ25m9p0J5
5436a5n3R5M4j3j33J7P8l6J32j33m1L5M0O2m6o7K6OJ9J4p1ML0Q1n6m2l5N5R1r
5466G9j15K4k6K4J13n9n3k7NP8m9j1m7P1J8O1p1p9M9L0K2m4Kj1M3L6l0K1j52L1
5496f7J39p0K2Pr7J02Ll7o8k8M9K3L3n9m8Q4RK3l0Qn2Q0K7q0J5r5J43nmPr1K2
$$ plain form
5528 -35 39 64 4 -19 -49 20 81 49 -24 -38 38 36 79 -8 -36 -64 30 30 -47 -36 -15 15 33 61 -37 -33 -27 42 22 -35 -63 -59 64
5561 64 -5 13 -28 -32 61 30 23 -7 -25 44 3 31 -18 -100 8 53 76 -13 -40 -36 34 11 69 -41 -83 -26 129 13 16 -36
5591 -36 -10 7 11 58 -64 -30 9 59 46 -25 -42 3 69 63 -60 -33 43 42 31 -55 -24 -14 6 42 -54 -76 6 -24 59 23 -16
5622 -16 -85 16 89 73 37 -17 -11 75 30 19 -39 -15 50 101 46 -43 -67 -30 21 24 -15 -57 -32 21 60 9 -52 -10 -29 35 19
5653 19 -14 -28 -27 39 59 -1 -48 -39 81 54 6 -17 4 35 107 13 -58 -21 -37 62 24 -54 -68 -17 67 68 -1 -53 -41 -44 65
5684 65 32 -36 -36 -5 35 47 -35 -60 0 73 83 32 -72 -3 11 29 38 -15 -25 -3 17 10 -11 -79 -32 96 55 -19 -22 -58 33
5715 33 52 54 4 -9 30 110 27 -18 -46 -57 1 81 -46 -56 -15 52 17 28 -64 -50 -41 80 -3 -3 -60 -6 36 75 30 -47 -3
5746 -3 46 69 -16 -52 -52 54 35 6 -26 -24 12 103 62 -24 -59 -10 7 -9 52 -46 -34 43 37 17 -34 15 45 72 40 -31 6 17
$$ packed form
5528c5P4K5o0k3l0O9O1l2p3j4P6kM3q7k8k8R4%p7J1K1L0J8K8r8MOO9k0n7k8MJ23
5561F4o9J8m1mR3l1pl0j8O9m1K8m9q2J08M5K3q9k7MP0k3N8j10m2N7J55j16Ln2
5591c6K6J7MM7j22L4L9N0j3p1j7M5O6oj23K7P6jj1q6L1J0K0L6r6k2Q2l0Q3l6l9
5622a6o9J01P3j6l6n4OQ6m5j1n8K4O5N1n5q9k4L7N1Ll9m2K5N3L9n1o1M2j9O4j6
5653A9l3j4JO6K0o0m7RJ20k7m8k3K1L1P2r4p1L7j6R9l8p8j4N1Q4Jo9n2J2lJ09
5684F5l3o8%L1M0J2q2k5O0P3J0n1j04O9J4J8Rn3j0K2K0pk1o8M7J28m1p4ll6R1
5715C3J9Kn0j3L9Q0q3m5k8j1N8Q0j27j0M1O7l5J1r2J4RJ21q3%n7N4M2L9m5p7M4
5746cM9K3q5l6%J06j9k9l2KL6R1m1q6l5M9J7j6O1r8J2P7ok0n1M9L0K7l2p1L7J1
$$ plain form
5778 17 -10 31 -36 -79 -30 -46 13 5 -32 -61 -38 30 -4 -25 -48 -36 31 37 23 -67 -25 1 45 7 -58 -10 -18 84 45 33 -29
5809 -29 -33 15 48 -45 -80 -69 16 37 9 -46 -35 -2 -12 -39 -3 -33 -30 33 27 -28 -57 -20 -42 51 39 -26 -61 -46 3 30 -26 -72
5841 -72 6 -3 71 15 -48 -54 33 40 31 -45 -50 -19 70 -11 -20 -59 -36 46 7 6 -86 -33 48 45 34 -17 -37 -7 51 12 -9 -39 26 29 76
5876 76 11 -25 47 9 47 -36 -25 -38 -36 71 43 -36 -54 3 51 42 -32 -44 -39 19 -17 -11 -47 -30 -20 -3 20 -41 -24 -2 83 56
5908 56 -38 -22 -34 35 9 -35 -26 -6 11 88 33 -35 -12 -8 84 74 -9 -58 -11 77 54 45 -60 -34 32 20 0 -53 -26 -19 16 -11
5940 -11 -49 -64 1 20 4 -58 -22 -8 33 28 18 -11 -62 8 15 30 2 -45 -33 39 46 47 23 -20 -35 45 -3 -15 21 -26 25 40
5972 40 -34 1 -31 18 23 -13 -40 -22 5 32 25 -47 -33 -76 -49 27 -8 -14 32 27 26 3 -69 -55 14 63 3 -18 -38 -33 119 47 -2
6005 -2 -11 20 -10 52 -38 -69 6 38 50 19 32 -13 25 16 33 -54 -15 -52 68 12 -47 -15 -47 23 4 32 -47 -42 22 16 78 12
$$ packed form
5778A7k7M1o7m3M9j6N9ql7k9K3O8l4k1k3J2O7Oj4r0M2K6M4l8o5M8qJ02l9j2o2
5809b9mM8L3r3l5J1Q5K1k8n5J1L3j0k7L6l0LO3on5k9L7k2R3j2o5l5J5M9K7n6m6
5841g2P8rP4n6o3oQ7Prp6nL1Q9q1rl9K3Q2l9jr2N3Q1lj1n1k0L0N8l9k1l0O5LM7
5876G6o5l6P2l8L8q3J1j3KJ07k8p9j8N7M8rp4j2NN8l6Ol6J7J0J7K3o1J7K2Q5k7
5908E6r4J6j2O9k6m4RK0J7P7n5o8K3MR2j0q3m9M7Q8k3rj05K6O6j2k0n3K7PL5k7
5940a1l8j5O5J9j6o2L6J4M1nj0k9n1P0PJ5k8m7J2P2PJk4m3j5Q0m8j2L6m7N1J5
5972D0p4L5l2M9Nl6k7J8K7K7pp2J4m3K7P6l5oM6njk3p2J4O9M9o0k1k0NJ52p2m9
6005brL1l0O2r0l1P5L2J2l1J3m5L8rJ7q7L9l7J20n6n9L2l2P0j9K8p9NO4oO2o6
$$ plain form
6037 12 6 -1 52 46 10 -17 -9 42 45 -32 -19 -9 19 88 55 -43 -49 -3 36 16 -44 -34 10 -2 57 31 -94 -10 -23 42 24 4 -39
6070 -39 18 46 45 -8 -53 -9 53 -32 18 -8 -6 -30 14 19 -45 -42 -19 65 -1 -69 -100 15 36 68 49 -31 -5 6 21 61 -58
6101 -58 -61 -60 59 49 -6 -38 -17 25 56 28 -54 -32 5 67 -19 -18 -35 -23 68 30 -29 -60 21 11 15 14 -3 -35 18 24 32 1 -53
6134 -53 -19 73 79 -42 -51 -66 31 10 18 -78 -33 55 22 7 -32 -25 17 21 13 14 -31 20 52 34 -25 -37 -38 -47 74 -3 -44 -55 -5 -8
6168 -8 -5 -27 -26 -33 36 60 -49 36 -48 49 34 58 -5 -59 -10 38 34 -41 -2 -21 58 53 1 -36 -13 2 35 -1 -19 -41 -3 75 22
6201 22 8 -30 -11 2 3 -34 5 32 -43 74 14 3 7 -15 67 55 -24 -53 -21 28 75 12 12 -3 75 49 -17 -31 -69 63 13
6232 13 10 -43 -45 2 53 72 11 -59 -37 -41 54 -19 -54 -26 12 7 42 -4 -7 8 82 46 -15 -79 -2 41 2 14 26 -58 -5 67 -24
6265 -24 -42 -45 8 2 14 -25 -60 -40 26 52 -37 -19 -20 9 59 7 -4 -41 25 -32 26 -6 -98 -13 6 60 23 -54 -37 15 63 7
$$ packed form
6037A2opN3ol6k7QN1Lp7J3J0K8O9l3r8oM6L9k0o0J0M4j2N9k6j25Q4j3O5j8k0m3
6070c9N7K8jn3m5M4O2q5N0k6Kk4M4No4LK3Q4o6o8l1J15K1L2j9q0K6J1J5M0j19
6101e8lJJ19j0n5l2K1M2L1k8q2K2L7O2q6Jj7J2R1l8n9l1Q1j0Mjj7l2N3OQl1n4
6134e3L4R2Oj21rj5R7k1Qr6M5Q8l3j5l9PM2MqJm5N1L2j8n9j2jrJ21p7m1j1N0l
6168hLk2JpO9K4j09Q5q4R7j5K4o3n4M9M8mp5L9j9P9nn2l7K3J5L3l6j8k2L8P8n3
6201B2j4l8J9J3Jl7L9K7p5J17o0j1Mk2Q2j2p9k9L2M9M7o3%j5P8k6o6j4l8J32n0
6232A3ln3kM7N1J9o1p0K2mR5p3l5K8L8nL5m6lJ5P4l6o1o4P7M3l9J2J2q4N3P2r1
6265b4j8lN3oJ2l9l5K0O6K6q9J8jK9N0n2j1l7O6n7N8l2r2Q5J9N4l7p7J7N2M8n6
$$ plain form
6297 7 6 28 -38 25 23 -62 16 16 34 98 48 -41 -46 43 28 3 -77 -36 86 25 46 31 -65 18 21 -1 18 -30 -44 -10 -8 18 -34
6330 -34 -63 25 27 36 -28 -57 -17 23 -29 -3 -18 -12 -5 77 21 6 28 67 18 82 -19 -46 -16 46 -18 -5 -95 -1 27 66 -5 -42
6362 -42 -30 52 64 10 -9 -62 10 33 -14 17 -43 -34 -4 -14 -28 -58 -44 -24 63 8 0 -38 39 26 52 -16 -43 -28 14 6 -30 28
6394 28 -30 20 81 28 -14 -50 38 55 7 -21 -12 3 -49 28 12 -29 -19 20 -9 -27 -104 -76 -47 -13 -45 -45 -36 28 27 26 -17 -25 -17 26
6428 26 12 -15 -5 -25 39 72 56 -20 -21 -33 40 -15 25 -62 58 -14 -22 28 -31 -28 23 -22 -15 -75 -82 26 38 21 -12 12 -10 88
6460 88 37 -7 39 10 22 35 -4 2 -12 0 47 52 -35 -26 -23 78 54 -6 -36 -23 35 5 -19 -32 -26 21 6 -7 2 -21 -5 -3 68
6493 68 -20 -14 -43 -34 51 -13 -13 -4 -15 0 22 -43 -42 23 32 -19 54 -50 -19 67 34 59 -7 -9 47 104 38 12 -30 17 12 29 -30 -45
6527 -45 -13 25 -6 8 -43 16 -18 18 48 53 -11 -31 6 1 -46 -16 -3 6 110 -19 40 -28 18 56 -6 -26 -57 16 -26 67 -52
$$ packed form
6297GjK2o6O3kq5P8%J8O4n0q9nQ9j5k5q0M1J22o1K1j5r6Q3Lk2J9m8j4L4KK6n2
6330c4k9Q8KRo4k9M0M0n2K6j5OPQ2n6j5K2L9m9O4j01k7L0O2o4J3r0R4K8L9p1l7
6362d2J2Q2J2n4j9n3P2K3m7L1o0RL0j0j4l0J4K0Q7n5ql8P7j3K6o8k7J5M2ql6N8
6394B8n8N0O1n3m2l6Q8J7m8k8RJ5n2P7j6m1J0L9k9j8p7K8K9L4l2%RO4jjm3qQM3
6428B6j4k7J0k0O4L3j6p6jj2P3n5M0q7J20p2qN0n9LN1m5Po0pJ08J2j7l3K4k2R8
6460H8n1m4M6k9J2J3l9Oj4J2M7Nq7RLJ01k4o0l0J3N8l0k4j3OM7j5j3Rk3J6KP1
6493F8q8Ok9RQ5o4%Rj1J5K2o5JO5Rn1P3j04L1Q6l3K5o6kN6N7o6k6m2M7nJ7n9j5
6527d5L2L8l1J4n1N9l4L6L0No4k0L7nm7L0J3RJ04j29N9o8M6L8o2k0l1P3m2R3j19
$$ plain form
6558 -52 -62 -18 3 21 -6 -42 -34 23 28 14 7 10 -12 44 5 7 -55 -19 -22 57 1 -31 -22 10 14 15 -5 -11 -28 59 47 -41 -30 -22 78
6593 78 -5 22 -23 9 36 40 14 -2 -13 24 47 43 3 -29 -24 7 14 38 -63 -42 -15 34 3 -45 -54 10 82 46 -37 0 19 48
6625 48 -11 -11 -6 -35 0 66 24 -55 -46 -1 77 -4 -38 -34 -13 17 19 24 6 -35 -8 31 -48 -6 -37 31 17 48 -1 -4 -34 -42 50 -34
6659 -34 -60 -37 -8 47 -29 -12 -38 6 38 -32 -11 -34 14 31 13 14 -1 -33 -41 -11 -4 -19 -80 37 9 32 12 7 26 -1 4 6 -12
6692 -12 12 53 -15 -23 -48 -15 -18 -13 24 2 -32 -48 -35 13 -34 -27 54 41 56 27 -28 -18 11 10 10 -52 -44 -57 -7 34 39 10 -36 17
6726 17 19 -7 -83 5 26 75 5 45 -98 -46 1 14 -13 -1 7 48 -1 61 -3 -53 42 44 26 -22 -13 -42 16 12 -42 -13 13 -24
6758 -24 3 10 -61 12 41 7 -19 -12 -23 7 73 9 -5 -47 17 8 -14 -21 -1 -12 58 25 19 -10 0 29 3 -11 -41 1 -15 14 77
6791 77 -41 -50 -7 16 -32 -32 -12 -52 -4 64 35 38 -21 -31 -42 32 -24 -69 20 33 28 33 28 -25 -14 7 -2 -54 26 -2 -7 59 -10 -42
$$ packed form
6558e2j0M4K1J8k7l6QN7Nj4pLk2N6l9Ko2L6lP9n6l2RL2MJk0oj7Q7j2q8J1QJ00
6593G8q3K7m5L2K7Mk6j6j1L7K3mm0l2NL1PK4j01K1K7M9l1m8rO4P2l6q3L7J9K9
6625D8n9%Nk9L5O6m2p9RM5P8q1l4MK1L0KNj8m1K7L9p9M2l1O8j4L1m9ll0qR2q4
6659c4k6K3K9N5p6J7k6M4L2p0K1k3M8J7j8Jj5l2qL0Pj5o1J17k8K3k0nJ9k7NKj8
6692a2K4M1o8qk5L3lNL7k2l4j6J3M8m7PQ1j3J5k9n5J0K9j%o2Qj3N0M1Nk9m6N3
6726A7Kk6p6Q8K1M9p0M0j43N2M7J3k7J2QM1m9O2o4n0R5Kj8m8Rk9N8mn4K9K6l7
6758b4K7Pp1P3K9l4k6Pj1L0O6o4j4m2O4rk2pK0j1P0l3ok9J0K9k6j4l0M2j6K9O3
6791G7j18rM3K3m8%K0m0M8O8k9Ln9j0j1P4n6m5Q9J3nNnn3J1K1rn2Q0k8nO6o9l2
$$ plain form
6825 -42 6 17 23 -17 -17 -26 -6 12 15 -8 -25 -33 5 -28 -23 -22 18 67 -31 -78 17 -32 53 -15 -3 -36 -54 5 31 43 -39 8 16 15 3
6860 3 35 -32 -9 26 55 -12 27 0 -7 15 16 14 -48 4 58 -15 6 -26 -63 21 4 -15 -56 9 13 -14 51 -39 -1 -23 6 -11 -21
6893 -21 -4 -1 0 86 28 4 -8 12 30 -1 10 -14 -47 -14 74 -15 -53 -53 -23 9 40 -54 -20 -11 -30 20 15 -42 26 28 69 7 -46
6926 -46 -39 39 7 18 -31 -12 -22 18 59 6 -63 0 27 26 -23 -6 -34 30 32 -2 -6 -26 1 27 44 -3 -38 16 6 32 12 2
6958 2 28 2 8 -23 -49 -4 62 -14 31 -34 -54 -77 57 -22 -39 -17 27 -2 14 38 2 -3 23 24 -18 -9 -29 -3 6 17 8 26 -3
6991 -3 5 32 -30 52 -8 -13 27 4 -34 -44 14 10 10 -68 -37 -31 3 -51 -2 8 -11 27 9 8 -11 -36 -17 -37 -33 21 -56 -11 44 15
7025 15 14 -57 -68 10 -1 29 -4 63 19 34 43 55 -19 -16 15 20 2 36 -15 15 27 13 3 25 -9 -58 30 -19 -52 13 18 9 -15
7058 -15 -50 16 69 54 -5 -43 -31 -19 2 46 -7 -8 24 16 -19 12 17 -34 -26 28 -52 2 40 21 -1 6 5 10 19 -31 -36 -70 -15 3 -55
$$ packed form
6825d2M8J1Om0%rK0J8Lk3j7qL8l3NJM0M9r8m7R5m9Q5o8J2l3j8N9K6J2q2M7Qjj2
6860CL2o7K3L5K9o7L9k7pK2Jko2N2N4p3K1l2l7Q4j7j9m1O5Mk7O5r0L8k2K9j7j0
6893b1J7LJQ6n8k4j2K0J8l1J1k4l3L3Q8q9l8%L0L2L1r4L4Rj9N0nn7O8KM1o2n3
6926d6PP8l2J1m9J9j0M0M1n3o9O3K7jm9J7k8O4Kl4mk0K7K6J7m7l5N4j0K6k0j0
6958BK6k6Ol1k6M5O6p6M5o5k0k3J34p9j7K2M4k9J6K4l6nK6Jm2Rk0K6RJ1rJ8k9
6991cQK7o2Q2o0nM0k3l8j0N8m%p8L1OL4n4M9J0j9L8j8jj9k5J9k0MN4p7M5N5k9
7025A5jp1j1P8j1L0l3O7m4J5RJ2p4LL1Nj8L4n1L0J2j4j0K2l4m9Q8m9l3O5Nrk4
7058a5l5O6N3j5n9l8J2J2K1M4n3jL2ql5L1Nn1QN4q0N4L8j9k2PjNRn0nl4N5J8n8
$$ plain form
7093 -55 4 -6 2 -30 47 67 -8 2 -52 -14 35 -4 -44 16 -13 -18 17 -11 -5 30 8 83 -2 -26 -64 2 66 -37 54 -35 14
7124 14 45 54 25 19 -30 -29 36 25 -12 -1 -44 26 18 -28 -20 -40 3 20 18 -37 -29 7 36 -8 20 -45 0 -4 33 3 -10 -21 5 77
7158 77 -8 -5 43 9 14 -22 -27 3 5 -29 48 -19 -74 -2 -2 11 -13 -27 -28 -10 21 34 -16 -56 46 30 -6 -54 -10 -5 57 -8 -3 -42
7192 -42 -2 49 10 26 -16 3 2 -6 -74 16 4 -45 -26 56 -38 -73 7 -36 8 38 -85 -50 31 32 7 -25 -44 34 -59 31 29 -1
7224 -1 -22 5 61 -1 -30 4 41 5 19 -14 -38 -23 57 90 -19 24 -9 6 33 21 -11 -17 -7 9 -6 -5 -32 -19 0 4 11 8 -16
7257 -16 55 -16 4 -26 -10 7 67 -4 -99 -11 -49 8 53 92 4 -51 -1 18 37 39 -11 -65 6 -17 3 -23 27 38 6 -32 -16
7288 -16 29 63 34 12 23 -22 -1 15 39 -40 -40 -25 8 -10 -9 -26 -28 23 25 0 -30 -64 19 57 -12 -31 -41 -66 46 8 12 0
7320 0 25 12 -4 53 4 -52 -17 -16 14 -38 0 -61 5 -25 -2 -70 -41 6 14 -37 -28 -29 26 39 -42 -48 -13 16 30 22 -22 -40 -30 62
$$ packed form
7093e5N9j0Ql2P7K0p5J0n4L8M9l9m0O0k9nL5k8OL5k2P5q5k4l8O6O4j03R1q9M9
7124A4L1Rk9om9JO5j1l7J1m3P0qm6Qk0M3J7kn5QL6K9m4K8o5M5mL7l0j3j1K6P2
7158G7q5LM8l4Nl6nL0Kl4P7o7n5P2%J3k4j4jJ8L1J3n0m0J02j6l6m8M4NO2o5Nl9
7192d2M0N1l9J6m2J9jqo8R0j2m9J9Q2r4l5Q0m3M4L0j23L5Q1Jk5l2j9P8r3R0kl0
7224ak1K7N6o2k9L4L7l6J4l3k4J5Q0L3j09M3l3J5K7j2l2oJ0J6j5Jk7J3J9MPlk4
7257a6P1p1K0l0J6J7O0p1r5Q8l8N7M5L9q8n5N0J9J9Kn0n4P1k3K0k6N0J1l2l8J6
7288a6M5L4k9k2J1m5K1J6K4p9%J5L3j8Jj7kN1Kk5l0l4Q3L8o9j9j0k5J12l8Mj2
7320@K5j3j6N7m9n6L5JL0n2L8o1O6l0K3o8K9M7Qn1RjN5J3q1oL5K9J4qm4j8J0R2
$$ plain form
7354 62 39 -21 -28 41 -5 -5 -31 -13 -49 56 35 40 20 -16 15 47 40 48 -50 27 54 19 15 -14 -10 -15 -2 47 -8 -59 -28 -22 33 -17
7388 -17 -44 16 32 2 18 11 -44 52 -1 28 52 62 60 24 -1 24 33 22 65 -27 19 -48 -10 -47 27 -24 -22 -32 22 29 -13 -5 8
7421 8 15 32 -4 51 0 -3 31 36 45 11 -65 -13 25 1 59 -5 11 -12 -16 19 -51 -35 45 46 -8 30 -10 -14 38 -9 -45 -46 -5 -65 8
7456 8 15 1 -14 30 77 -5 -56 -61 -45 65 -2 41 -3 19 -59 34 -24 44 -17 18 -23 9 -14 -49 9 5 16 -19 -14 -31 -14 -1
7488 -1 2 10 0 -20 1 43 -19 33 -3 10 -26 -24 -51 -14 16 -45 21 -13 25 -11 4 16 -2 -29 28 11 5 6 -87 -13 0 28 20 -37
7522 -37 -57 23 -24 29 -18 -7 -24 9 -2 -11 -17 -16 66 -9 -2 -6 6 18 47 38 0 -2 42 38 27 -43 -94 1 47 48 -57 -38 -42 -60 21
7557 21 -39 -26 -15 -17 39 -22 10 -61 -67 -26 -37 10 19 -34 80 6 -30 16 -25 -23 75 19 4 -70 -10 21 23 -48 -30 74 -2 -5
7589 -5 -22 18 11 -28 23 -29 -37 -46 -8 -5 18 -26 -8 24 -76 34 13 -35 -29 83 53 -35 -43 14 33 25 33 -6 -12 28 64 19 10 17 -27
$$ packed form
7354F2k3o0pO9m6%k6J8l6J05k1Nk0l6L1L2pQr8P7K7l5mk9MnJ3M9n5n1L1ON5n0
7388a7k7O0J6l0J6pn5R6n3K9K4J0kl6k5K5Rj1M3r2M6o7L8l7P4n1Kj0N4Pm2QJ3
7421HPJ7l6N5n1lL4NRl4p6N2L8k4N8o4J6k3mL5p0J6Q0Jn4L8m0mN2m7l6jM1o0P3
7456HPj4j5M4M7q2n1nJ6J10o7M3m4K2p8R3n8O8o1L5m1L2k3l5N8mJ1l5Nj7J7J3
7488aLQj0k0K1M2o2N2l6J3l6Kk7L7L0o1O6l4L8l6J5J2j8k7N7j7oJr3P4J3K8qn7
7522c7k0Q0m7N3m7J1j7L3j1roJQ2p5PmJ2J2K9rl8kM4mj1p0n1R5M6Jj05J9mj8Q1
7557B1o0J3J1kN6o1L2p1oM1j1M7Rn3J14p4l6M6m1KR8n6j5p4O0L1Kp1J8J04p6l
7589ej7M0pl9N1n2qrL8LK3m4J8L2j00J10k1m8OJ12l0q8qN7J9qQl9oM0L6m5rPm4
$$ plain form
7624 -27 38 26 -36 -13 8 57 9 -6 -31 3 19 -6 -21 60 34 28 20 17 -33 -18 -28 21 40 -11 0 -48 -6 -8 20 12 -21 -11 53
7657 53 75 26 12 25 -51 -60 16 -32 16 85 57 22 -24 4 26 26 36 12 9 -4 47 -15 -10 41 25 31 23 -10 -27 22 -12 -9 0 -38
7691 -38 -29 6 18 64 -7 35 -31 -14 60 45 -1 -26 28 29 11 27 32 -10 -1 4 -1 -53 7 -35 23 71 -17 51 19 25 12 -45 27 -25
7725 -25 7 -9 0 -36 20 4 5 -4 -18 -15 -36 5 72 39 1 -9 24 46 20 -36 -11 3 15 -27 -36 -36 -7 -47 -31 -44 -31 25 31 -18
7759 -18 -16 -9 -35 6 41 9 -26 8 11 -2 -16 -9 -7 -39 -20 -21 -47 -66 -39 -28 60 -6 1 -39 15 37 13 2 -40 -4 16 7 45 -25
7793 -25 28 39 8 -16 25 -5 2 -11 81 -25 -31 -19 1 50 -4 -72 -26 29 -27 -26 -1 -23 17 -3 -40 -13 30 -24 18 30 -4
7824 -4 -32 -15 7 70 -24 -30 35 23 -1 3 6 -41 -42 -12 -42 5 -17 -22 36 23 13 20 32 -9 20 6 -11 8 57 4 36 -2 -3 16
7858 16 22 -29 -13 0 13 27 0 2 -33 -15 0 37 62 33 18 -52 -6 32 28 13 -78 38 -43 9 6 49 -4 9 18 -27 3 34
$$ packed form
7624b7O5j2o2K3K1M9m8j5k5L4J6k5j5Q1k6oqln0J5j0M9J9n1J1m8M2kK8ql3J0O4
7657E3K2m9j4J3p6rP6m8M8O9k8l5m6K8K2%J0k4lj3N1o2NN1j6Oql3j7M9l4LRl8
7691c8RL5J2M6p1M2o6J7P4j5m6k5N4Jj8J6Nm2RNnn2O0m2N8M8q8O8l2Oj3n7P2n2
7725b5L2j6Rl6N6j6Jrj4Lk1M1O7l3l8j0L3K2k6n6K5J4J2m2r%K9m0J6j3J3N6Om9
7759a8KPk6M1L5l2l5L4Lj3j4PKl2J9jk6j9K7J1Q8o6Pm0N4K2k4j1m2L6K0rL8p0
7793b5N3J1l1k4M1l0Pj3R2j06oJ2K0M9n4o8M6N5n6JK5k2M0k0l7K7M3n4M2J2l4
7824dk8J7K2O3r4oO5j2k4MLm7jL0l0M7k2nN8j3j0PJ2m1K9j4j7J9M9n3L2l8jJ9
7858A6On1J6J3J3J4k7Kl5J8J5L7K5k9j5p0M6L8mj5r1J16q1N2lM3n3J3Rm5L0L1
$$ plain form
7890 34 19 38 6 -77 36 8 28 12 -28 -33 7 19 19 -30 -49 -47 -33 -36 20 -6 -39 18 -6 -8 -16 -15 -49 6 31 1 -32 23 -5
7923 -5 50 -5 -54 36 20 47 43 12 21 -22 35 31 24 -1 -49 -1 19 15 -47 -14 -25 11 -6 -15 -27 8 41 -8 -6 -34 1 20 49 -28
7957 -28 10 -41 -28 18 13 -7 32 -1 43 0 18 -35 -1 32 -5 -12 6 -28 47 1 8 23 10 7 13 28 20 11 23 50 -18 -35 -42 -30
7991 -30 -8 34 -17 -1 -37 4 1 -10 20 -8 -10 -66 43 -25 37 -10 72 36 -28 5 31 15 57 3 -21 6 -4 -58 6 -6 -69
8022 -69 -34 10 34 6 -51 -44 -1 -2 54 22 -49 20 47 3 13 -14 8 -30 -30 -35 -47 32 -5 9 34 47 13 -6 -43 15 -21 -25 15
8055 15 -34 10 -13 33 12 -43 22 25 -24 42 22 94 -3 0 25 -16 42 -6 -14 -9 15 -38 -8 -7 -37 -32 -12 25 19 -5 -43 7 62 53
8089 53 61 -18 22 -7 15 -24 8 12 27 -14 -47 24 -2 -11 -16 31 -15 -71 -29 13 -20 15 11 1 -35 10 -18 7 -11 -12 -13 36 -17 34
8123 34 -11 26 -77 12 45 -4 47 14 25 -5 11 -30 -22 59 -24 -33 -68 8 54 23 47 -27 31 70 25 4 14 4 -35 -15 -6
$$ packed form
7890C4j5J9l2q3J13k8K0j6m0nM0J2%m9j9KJ4lN6k6l3N7k4kqJl4N5K5l0l3N5k8
7923eN5n5m9R0j6K7ml1Rm3N7mpk5m8M8K0mo2L3j1L6j7rj2L5L3m9Kk8L5J9K9p7
7957b8L8n1J3M6nk0L9l3M4m3J8n3L4L3l7pJ8l4P5m6PJ5j3lOJ5qrJ2K7o8j7pJ2
7991c0K2M2n1J6l6M1lj1L0k8kn6J09o8O2m7Q2l6o4L3K6j6M2n4k4K7j0n4O4j2o3
8022f9L5M4K4k8n7PM3jN6l2p1O9K7m4J0k7K2l8%nj2P9l7J4K5J3l4j9l7N8l6mM0
8055A5m9M4k3M6k1n5O5Lm9O6k0P2r7LK5m1N8m8qNK4n3L0Jl0NK0L7ok4l8N0N5r
8089E3Qp9M0k9K2l9L2MJ5m1l3P1k6rnM7m6n6M2M2l3L5mj0l6M5k8K5j8jjM9n3N1
8123C4m5L7j03Q9L3m9N1l3J1l0J6m1QQ1q3rl5P6M6l1K4p4N8L9m5k1J0j0l9K0R
$$ plain form
8154 -6 25 41 12 -21 36 25 -11 0 6 -19 -27 31 32 -9 5 -35 49 -34 11 19 17 -8 53 24 -17 -30 36 57 -26 7 38 43 -35 6
8188 6 14 58 -10
$$ packed form
8154fL1J6k9l3N7j1l6J1Ok5qN8Jm1J4m0Q4q3M5Qkk5O1k9m1j3O6K1q3L3L1Np8M1
8188FQM4o8
8191a0
$$ Imaginary data points
##PAGE= N=2
##DATA TABLE= (X++(I..I)), XYDATA
$$ plain form
0 0 0 0 0 0 0 0 0 0 0 0 0 0 0 0 0 0 0 0 0 8 -8 8 -8 8 -8 16 -16 16 -16 24 -24 32 -32 40 -40 48 -56 62 -67 75
40 75 -84 96 -104 115 -128 142 -155 171 -189 208 -229 252 -279 307 -339 377 -418 465 -518 583 -659
61 -659 753 -871 1023 -1227 1523 -1982 2812 -4757 19624 -15165 -68093 -17552 50958 62347
75 62347 -5823 -62443 -45997 25728 60429 21040 -46961 -58305 -1480 57600 43752 -25454
87 -25454 -65963 -24439 46680 59934 -1461 -57333 -37100 35032 68650 25251 -39086 -44657
99 -44657 11706 59328 39346 -24572 -57442 -21531 37536 46237 -8221 -59596 -43724 21188
111 21188 54510 14606 -47412 -52070 5997 53467 32077 -29205 -53819 -12704 42275 45020
123 45020 -5517 -46841 -28876 27109 53559 17538 -37839 -44570 5725 49374 29627 -30212
$$ packed form
0@%%%%%%%%%%%%%%%%%%%Qj6J6j6J6j6K4l2L2l2M0m8N6o4P2q0Q8j04J18j29J42
40G5j59J80k00K19k43K70k97L26l60L97m37M81n31N86o46P16p95Q83r83J101j242
61f59J412j624J894k250K750l505M794p569K4381l4789n2928N0541O8510J1389
75F2347o8170n6620J6446P1725L4701l9389o8001j1344N6825N9080j3848o9206
87b5454m0509M1524P1119J3254o1395n5872K0233P2132L3618m3399o4337n571
99d4657N6363M7622j9982o3918l2870L5911N9067Q701n4458n1375J5872O4912
111B1188L3322l9904o2018m658N8067M7470k1390o1282k4614M1115N4979K745
123D5020n0537m1324J7965N5985K6450l6021n5377o731N0295M3649j9747n9839
$$ plain form
135 -30212 -55834 -15889 38084 38220 -13760 -51339 -28013 26416 46197 9426 -37535 -37531 9030
148 9030 45824 27803 -23737 -45643 -10115 39695 41437 -7514 -45141 -23545 29793 47420
160 47420 7914 -38656 -35320 11438 42447 19923 -27687 -42808 -7925 34522 33570 -9533 -41734
173 -41734 -22179 26332 43713 7872 -36572 -33563 12956 43930 20273 -27436 -39370 -1978
185 -1978 37468 31055 -11668 -37947 -16491 26062 37893 4233 -34487 -31346 10250 38423 17184
198 17184 -27867 -40165 -3690 35507 28458 -15065 -39536 -14809 27623 35263 50 -33857
210 -33857 -25733 13734 36408 14856 -24675 -33931 -848 34350 27785 -13131 -37336 -14130 27206
223 27206 34113 -2288 -36220 -25648 14862 34346 9513 -27941 -32061 1558 31871 22637 -14314
$$ packed form
135c0212k5622L9945N3973J36n1980l7579K3326N4429J9781l6771m6961MM6561
148I030L6794j8021n1540k1906L5528M9810J742m8951l7627K1596N3338J7627
160D7420l9506m6570L336M6758L1009k2524m7610j5121L4883M2447r52m3103l2201
173d1734J9555M8511J7381l5841m4444L009M6519L0974k3657m7709j1934L7392
185a978L9446o413m2723k6279K1456M2553J1831l3660l8720L141M1596K8173k1239
198A7184m5051j2298L6475L9197p049m3523k4471K4727M2432P640l5213l3907
210c3857Q124L9467K2674k1552l9531r256L3083L5198o565m0916k4205K3206M1336
223B7206O907l6401l3932J0572M0510J9484k4833l7454m120L3619L0313r234l6951
$$ plain form
236 -14314 -33764 -11323 26118 32628 -623 -32423 -22642 16799 36257 11032 -26989 -30045 4883
249 4883 33390 20278 -17358 -33111 -8800 25150 27319 -4648 -31906 -21117 14879 32156
261 32156 9009 -26066 -29053 4784 33286 20813 -16659 -31692 -5540 28531 28103 -5496 -30299
274 -30299 -16530 17854 30349 5953 -25701 -26586 4262 29105 16851 -17952 -32286 -7617
286 -7617 25540 25782 -7274 -31566 -16434 18980 30476 4581 -25695 -22951 8764 30292 15807
299 15807 -16632 -27391 -3464 25888 24403 -6640 -29417 -15649 17657 28366 2365 -27942
311 -27942 -24796 7600 28232 11846 -20520 -28157 -1944 25487 21225 -8685 -27180 -11638 19071
324 19071 27424 2980 -24494 -20812 9936 29387 13056 -18936 -26357 103 26803 20220 -11053
$$ packed form
236a4314j9450K2441L7441O510l3251l1800R781L9441J9458k5225l8021l056L4928
249D883K8507j3112l7636j5753K4311L3950K169l1967k7258J0789L5996J7277
261C2156k3147l5075k987L3837K8502j2473l7472j5033K6152L4071m28l3599k4803
274c0299J3769L4384J2495k4396l1654q85L0848K4843j2254l4803j4334K4669
286g617L3157K42l3056k4292J5132L5414J1496k5895l0276K744L1715K1528j4485
299A5807l2439j0759K3927K9352j485l1043k2777J3768L3306J0709k6001l0307
311b7942L146L2396K0632j6386l2366p637K6213K7431m262k9910j8495J5542L0709
324A9071Q353k4444k7474L682L0748J9451j6331l1992p421K6460K6700o583l1273
$$ plain form
337 -11053 -28179 -10675 18860 23716 -1807 -26264 -19973 9241 25863 9679 -19251 -24966 494
350 494 25991 19863 -10420 -26724 -8579 21055 25018 -1552 -25171 -16796 12682 26582 8168
363 8168 -19423 -22417 2447 24577 16714 -11835 -26320 -8808 18874 22201 -3602 -26345 -17441
376 -17441 12246 25610 6451 -20647 -21594 4683 25480 15484 -12479 -23999 -5328 20207 21272
389 21272 -3537 -23892 -14608 13189 25150 6219 -20159 -21007 4790 24680 13627 -14716 -25230
402 -25230 -5330 19668 18720 -6549 -24651 -13318 13554 23312 4438 -19575 -18978 5904 24416
415 24416 13607 -13484 -23284 -3401 21129 19612 -6115 -23618 -11396 15215 23099 2809 -20307
428 -20307 -18016 6318 22547 10347 -15357 -23196 -3687 19139 17094 -7445 -23782 -11148 15155
$$ packed form
337a1053j7126J7504K9535M856k5523k4457O291K9214J6622j6184k8930n715K5460
350D94K5497o128l0283j6304J8145K9634L963k6570k3619Q375K9478J3900j8414
363H168k7591k994K4864K2130p863k8549j4485J7512K7682L327k5803k2743Q904
376a7441K9687J3364j9159k7098r47K6277K0797r996k7963j1520J8671K5535J065
389B1272k4809k0355R284K7797J1961j8931k6378q48K5797J9890j1053k8343j0514
402b5230J9900K4998r48k5269j8102J1333K6872R758j8874k4013N97K4882J8512
415B4416j0809k7091r800J9883K4530j517k5727j7503J2222K6611P884k0290k3116
428b0307K291K4334J6229j2200k5704p839J9509K2826k045k4539j6337J2634K6303
$$ plain form
441 15155 22631 2251 -20226 -16554 8509 23667 10208 -14927 -20778 -541 20661 16706 -7302
454 -7302 -21789 -8968 15495 21343 1106 -20434 -16628 7584 21926 8006 -16815 -21791 -900
467 -900 19756 14664 -9235 -22113 -7813 15882 20144 19 -19488 -14396 9037 21867 8100
480 8100 -15351 -19394 1080 20730 15036 -8887 -21082 -6461 16607 19356 -1581 -20267 -13826
493 -13826 9231 20217 5595 -16672 -19066 1148 19167 12846 -9925 -20910 -6072 16185
505 16185 18478 -2103 -19883 -12637 10461 20665 5371 -16225 -17253 3295 19953 12394 -9812
518 -9812 -19335 -4344 16492 17403 -2909 -19442 -11964 10208 19402 3962 -16878 -17340 3199 19123
532 19123 10784 -11244 -19485 -3753 16294 16021 -4070 -19090 -10505 11017 18959 3570 -15971
$$ packed form
441A5155P476k0380k2477L672K5063J5158j3459k5135n851K0237K1202l955k4008
454g302j4487J2821K4463N848k0237k1540L806K4212J4342j3920k4821m976K0891
467i00K0656n092k3899j2878J4300K3695M262k0125j9507N092K3433J2830j3767
480H100k3451m043K0474J9650n694k3923j2195J4621K3068K749k0937j8686O441
493a3826K3057J0986j4622k2267k394K0214J8019o321k2771j0985J4838K2257
505A6185K293k0581j7780P246K3098J0204j5294k1596j028K0548J6658p559k2206
518i812r523J4991K0836R11k0312j6533P478K2172R194j5440k0840m62K0539J5924
532A9123q339k2028q241J5732K0047k73k0091j5020Q585K1522P942j5389j9541
$$ plain form
545 -15971 -15478 4679 19504 10669 -10913 -18367 -2495 16806 15499 -4806 -18949 -9594 11415
558 11415 17850 1858 -16760 -15029 4805 18241 8754 -11851 -18037 -2114 16301 14346 -5441
571 -5441 -18461 -8457 12149 17833 1696 -16225 -13559 6241 18581 8200 -11860 -16859 -708
584 -708 16351 13295 -6243 -18167 -7802 11907 16442 226 -16750 -13280 6338 17755 6883
597 6883 -12621 -16506 87 16437 12472 -6699 -17369 -6165 12866 16257 -56 -15969 -11686
610 -11686 7271 17507 6211 -12649 -15762 685 16156 11416 -7696 -17387 -5791 12671 15020
623 15020 -1471 -16357 -11157 7605 16723 5083 -12851 -14791 1762 16261 10831 -7674 -16411
636 -16411 -4457 13265 14737 -1916 -15998 -10136 8219 16239 4131 -13228 -14305 2213 15651
$$ packed form
545a5971M93K0157J4825q835k1582p454J5872J9301j307k0305j4143R355K1009
558A1415O435j5992j8618J731J9834J3436r487k0605o186J5923J8415j955j9787
571e441j3020J0004K0606N684j6137j7921K666J9800J2340j0381k0060m999J6151
584g08J7059l056j9538j1924J0365J9709M535j6216j6976L470J9618J1417j0872
597F883j9504l885J6593J6350l965j9171j0670J1204J9031L391j6313j5913M283
610a1686J8957J0236j1296j8860l113J6447J5471m740j9112r691J1596J8462K349
623A5020j6491j4886N200J8762R118j1640j7934j940J6553J4499n430j8505q737
636a6411J1954J7722J472j6653j4082N862J8355Q020j2108j7359j077J6518J3438
$$ plain form
649 15651 9456 -8614 -16207 -3921 13006 13688 -2668 -15720 -9256 8789 15959 3506 -13055
662 -13055 -13185 3207 15848 8909 -8782 -15459 -2804 13251 12890 -3517 -15577 -8525 8872
675 8872 15043 2295 -13390 -12708 3574 15287 7970 -9225 -14826 -1999 13509 12405 -3758
688 -3758 -14941 -7401 9559 14811 1874 -13173 -11811 4228 14930 7073 -9705 -14548 -1661
701 -1661 13017 11163 -4818 -15060 -7029 9472 13918 936 -13285 -11029 4851 14820 6536
714 6536 -9496 -13341 -283 13607 11098 -4666 -14083 -5640 10079 13488 271 -13299 -10608
727 -10608 4984 13975 5202 -10452 -13515 -289 12780 9580 -5831 -14361 -5441 9953 12710
740 12710 -413 -12986 -9426 6020 14296 5225 -9674 -11929 1311 13535 9666 -5567 -13485
$$ packed form
649A5651o195j8070p593J2286J6927O82j6356j3052O464J8045P170j2453j6561
662a3055j30J6392J2641o939j7691o677J2655J6055l61j6407j2060P052J7397
675H872O171j2748j5685O82J6282J1713p317j7195n601J2827J5508j104j6163
688c758j1183P540J6960N252j2937j5047J362J6039J0702p857j6778m843J2887
701a661J4678j854j5981j0242Q031J6501M446j2982j4221K256J5880R969q284
714F536j6032l845J3058J3890k509j5764r417Q443J5719L409j3217j3570K691
727a0608J5592Q991q773j5654l063J3226J3069l200j5411q530Q920J5394K757
740A2710j3123j2573L560J5446Q276r071j4899k255J3240J2224l869j5233p918
$$ plain form
753 -13485 -4282 10191 12083 -1172 -13254 -9231 5864 13095 3692 -10750 -12268 966 12536
766 12536 8171 -6695 -13544 -3958 10329 11556 -1570 -12585 -7792 7027 13600 3955 -9843
779 -9843 -10716 2452 13205 8072 -6577 -12821 -3124 10295 10574 -2626 -13058 -7845 6510 12272
793 12272 2353 -10848 -10890 2285 12311 6846 -7305 -12555 -2399 10664 10483 -2528 -12014 -6093
807 -6093 7948 12943 2660 -10001 -9492 3375 12491 6311 -7692 -12350 -2131 10109 9114 -3895
821 -3895 -12768 -6427 7242 11441 1095 -10832 -9563 3350 11994 5571 -7785 -11425 -812 11030
835 11030 9556 -3207 -11267 -4530 8684 12022 1327 -10216 -8526 3990 11595 4598 -8631
848 -8631 -11811 -1222 9866 7774 -4797 -12120 -5044 7822 10714 148 -10663 -8223 4425
$$ packed form
753a3485R203J4473J892j3255j2082M023J5095P231r403j4442j518J3234J1570
766A2536m365j4866o849R586J4287J227j3126j1015M793J4819O573r645j3798
779i843q73J3168J0753n133j4649o244R697J3419K79j3200j0432N213J4355N762
793A2272r919j3201m2J3175J0026n465j4151n250J0156J3063j81j3011r486N921
807f093J4041M995j0283j2661N09J2867R116o180j4003m658J0219J2240r95j3009
821c895q873O341J3669M199j0346j1927J269J2913Q644o423j3356l640J0613J1842
835A1030j474j2763q060O737J3214L338j0695j1543J690J2516P605o997j3229
848h631l180J0589J1088k092j2571p323P076J2866K892j0566j0811K440J2648
$$ plain form
861 4425 11621 4497 -8001 -10309 443 11105 8587 -3835 -10560 -3262 8948 10874 -32 -10525
875 -10525 -7794 4367 10648 3067 -9173 -10936 -169 9869 6850 -5305 -11290 -3491 8491
888 8491 9885 -873 -10389 -6926 5257 11033 3291 -8241 -9242 1642 11005 7372 -4716 -10203
902 -10203 -2288 8980 9479 -1554 -10703 -6861 4934 9897 1792 -9309 -9617 1370 10114 6014
916 6014 -5626 -10299 -2118 8901 9062 -1846 -10276 -5787 5826 10267 2039 -8598 -8305 2491
930 2491 10599 5912 -5608 -9798 -1502 8806 8255 -2653 -10467 -5771 5622 9479 1132 -8980
944 -8980 -8194 2612 10232 5260 -5984 -9471 -976 8916 7893 -2823 -10096 -4901 6169 9431
958 9431 934 -8718 -7526 3174 10088 4719 -6318 -9323 -706 8764 7241 -3441 -10094 -4468
$$ packed form
861D425P196p124j2498k308J0752J0662k518j2422o725P298J2210J926j0906j0493
875a0525K731J2161O281p581j2240j763J0767J0038l019j2155n985P799J1982
888H491J394j0758r516L463J2183N776p742j1532j001J0884R363l633j2088n487
902a0203P915J1268M99j1033r149L842J1795M963q105j1101l08J0987Q744m100
916F014j1640m673Q181J1019J61j0908q430M489J1613M441q228j0637K93J0796
930B491Q108m687j1520m190Q296J0308n51j0908p814M696J1393L857q347j0112
944h980P86J0806P620m972j1244l487Q495R892j023j0716p273N195J1070L262
958I431q497r652J192J0700O914n369j1037l005Q617R470j523j0682o653N626
$$ plain form
972 -4468 6381 9051 409 -8753 -6888 3648 9972 4226 -6369 -8830 -114 8839 6856 -3732
986 -3732 -9813 -3954 6596 8693 -124 -8874 -6594 3844 9593 3429 -6882 -8612 205 8616
1000 8616 6233 -4034 -9511 -3250 6906 8591 -256 -8512 -5951 4349 9618 3249 -6780 -8186
1014 -8186 714 8664 5808 -4469 -9320 -2874 6867 7855 -1025 -8801 -5747 4275 8945 2408 -7152
1029 -7152 -7973 1003 8628 5452 -4468 -8833 -2114 7396 7895 -1033 -8382 -4943 4836 8883 2146
1044 2146 -7100 -7451 1403 8410 4817 -4899 -8875 -2087 6944 7017 -1911 -8731 -5005 4716 8391 1524
1060 1524 -7233 -6963 2005 8628 4745 -4744 -8016 -1052 7577 7116 -1784 -8142 -4148 5222 8260
1075 8260 1117 -7408 -6801 1994 8076 3754 -5578 -8375 -1281 6983 6072 -2718 -8399 -3936 5338
$$ packed form
972d468J0849K670q642r162J865J0536O324n746j0595k461Q716Q953j983j0588
986c732o081N859J0550K097q817q750K280J0438N749o164j0311j730Q817Q411
1000H616k383j0267n477O261J0156J685q847q256K561J0300N269o369j0029j406
1014h186Q900P950k856j0277m851O446R741R88q880p776L054J0022M670o537r560
1029g152q21Q976P625l176r920m365O719R510M99q928p349L439R779M047o737
1044B146r246l51Q854P007l593r716l976O788R031P3q928o820L726R721L675o867
1060A524q757K70Q968O623l883r489l272O964Q629m61q900o358L994R370L038
1075H260p143q525O07Q795O082m322r332k797P094Q264r11q790n681M463R274
$$ plain form
1090 5338 7950 923 -6988 -5851 3010 8589 3991 -5060 -7422 -187 7610 6183 -2736 -8098 -3302
1105 -3302 5477 7419 5 -7577 -6040 2622 7621 2760 -6037 -7786 -409 7027 5410 -3190 -7904
1120 -7904 -2835 5933 7671 282 -6891 -4908 3666 8154 2951 -5573 -6961 403 7247 5096 -3480
1135 -3480 -7853 -2626 5669 6794 -620 -7449 -5224 3255 7398 2021 -6164 -7091 467 7123 4773
1150 4773 -3526 -7285 -1782 6237 6941 -542 -6868 -4361 3892 7435 1842 -6084 -6586 799 7065
1165 7065 4250 -3916 -7294 -1590 6121 6338 -1164 -7151 -4187 3898 7017 1271 -6236 -6237 1302 7077
1181 7077 4118 -3913 -6845 -966 6340 6136 -1409 -6985 -3832 4063 6650 839 -6419 -5967 1572
1196 1572 6956 3637 -4158 -6615 -678 6389 5732 -1813 -6934 -3489 4269 6549 544 -6278 -5508
$$ packed form
1090E338K612p027p911J137Q861N579m598r051k362P235P797j427q919n362M796
1105c302Q779J942p414p582J537Q662M999m861q797j749P377P436j617q600m714
1120g904N069Q768J738p389p173J983Q574M488n203q524j388P364O844k151q576
1135c480m373N227Q295J125p414o829K225Q479M143n377q185r27P558O656k350
1150D773q299l759N503Q019P04p483o326K507Q253L543n593p926n02P385O266
1165G065k815q166l378N704P711K17p502n987K964Q085L119n746p507jP539N775
1181G077k959q031k932N879P306k04p545n576L153P895K587n811p258M52P539
1196A572N384l319p795k457N937P067o57p545n121L445P758K280o005o822P70
$$ plain form
1211 -5508 2028 6984 3408 -4211 -6292 -295 6352 5292 -2108 -6945 -3236 4267 6139 109 -6370
1226 -6370 -5240 2251 6907 3083 -4371 -6046 -3 6357 5044 -2384 -6876 -2907 4394 5944 -105
1241 -105 -6291 -4823 2584 6785 2788 -4490 -5874 191 6245 4560 -2744 -6789 -2610 4454 5769
1256 5769 -346 -6212 -4327 2906 6688 2470 -4502 -5644 572 6174 4190 -2920 -6594 -2287 4606
1271 4606 5518 -690 -6132 -4058 3042 6437 2041 -4810 -5527 615 5921 3746 -3314 -6534 -1886
1286 -1886 4772 5390 -779 -5871 -3539 3512 6590 1872 -4646 -4964 1084 6101 3528 -3361 -6255
1301 -6255 -1604 4825 4968 -1191 -6038 -3460 3292 5935 1106 -5129 -5167 1020 5729 3002 -3658 -6049
1317 -6049 -1151 5106 5079 -1051 -5490 -2655 3996 6270 1250 -4786 -4589 1549 5801 2861 -3742 -5934
$$ packed form
1211e508P536M956l576p619k081N997O647j060p400m837L709P503J872o030o479
1226f370J130P491M656l824p454j675O043O360j313p428m492L969P301J550o049
1241a05o186J468P407M201l997p278j384O065O054j685p304m045M179P064J315
1256E769o115n866J885P233L782m218o972j142O216N602j984p110l674M307O893
1271D606R12o208n442K074P100L395m396o851p17O142N306k175p060l220M648
1286a886O658O18o169n092K332P051L078m718o518l18O048N017k573o889k894
1301f255M651O429J43o159m847K578O752K643m829o235l8O187M709k727o660k391
1317f049M898O257k7o130m439K835O651K274n020o036J97O138M252k940o603k192
$$ plain form
1333 -5934 -1041 4826 4394 -1802 -5950 -3055 3427 5386 466 -5339 -4667 1462 5578 2593 -3698
1348 -3698 -5412 -233 5424 4822 -1324 -5197 -2000 4227 5730 577 -4974 -4177 1811 5462 2153
1363 2153 -4048 -5602 -519 4826 3777 -2255 -5809 -2399 3656 4992 -84 -5231 -4072 2138 5516
1378 5516 2204 -3735 -4782 389 5490 4187 -1780 -5128 -1655 4199 5021 -159 -5189 -3831 2027
1393 2027 5136 1516 -4305 -5149 57 4847 3385 -2575 -5462 -1828 3967 4662 -497 -5089 -3334
1408 -3334 2540 5413 1726 -3905 -4429 780 5282 3544 -2393 -5054 -1319 4120 4446 -721 -5205
1423 -5205 -3360 2406 4923 1016 -4365 -4577 653 4884 2909 -2775 -5038 -1121 4173 4382 -831
1438 -831 -4864 -2732 2932 5055 1166 -4054 -4031 1097 5033 2826 -2699 -4899 -929 4169 4004 -1257
$$ packed form
1333e934M893N867m32o196m148K895O482J959m920n805O72O129M116k985o291
1348c698j714N179N657o02o146l873L197O227J503n153n551P97N988L651l309
1363B153o201j554N083N345j049o032l554L410O055J336n076n147J159O210L378
1378E516l312n939j047N171N101j303n967l348L473N854Q22n180n030J358N858
1393B027L109l620n821q44N206M790j462n960k887L634N795O95n159m592J755
1408c334N874K873l687n631n24N209M502j738n937k661L735N439L26n167m484
1423e205J845N766K517l907n381k12N230M231j975n684k263L917N294K09n213
1438h31m033K132N664K123l889n220K3N128L936k207n525k200L970N098j65n261
$$ plain form
1454 -1257 -5048 -2793 2746 4625 619 -4299 -4110 1074 4824 2525 -2899 -4663 -596 4347 3945
1469 3945 -1185 -4681 -2294 3110 4760 622 -4214 -3693 1404 4787 2243 -3073 -4597 -458 4162
1484 4162 3553 -1567 -4868 -2283 3029 4362 239 -4298 -3598 1536 4689 2104 -3058 -4372 -68
1499 -68 4421 3458 -1602 -4583 -1824 3247 4275 44 -4240 -3374 1653 4531 1698 -3293 -4352 -110
1515 -110 4213 3224 -1789 -4589 -1640 3311 4153 -114 -4194 -3000 1981 4622 1689 -3161 -3939 320
1531 320 4296 3047 -1910 -4563 -1544 3287 3829 -519 -4402 -3074 1921 4293 1227 -3450 -3891 455
1547 455 4241 2814 -2065 -4237 -1109 3476 3914 -333 -4036 -2530 2387 4497 1236 -3337 -3702 690
1563 690 4110 2402 -2389 -4429 -1185 3242 3277 -947 -4391 -2562 2115 4100 845 -3475 -3508 940
$$ packed form
1454a257l791K255N539J879m006m918J89N184L750k299n424j764M067M943m02
1469C945n130l496K387N404J650m138m836N21N097L383k544n316j524M139M620
1484D162o09n120l301K585N312J333m123m537P00N134L153k585n162j314M304
1499f8M489r63n060k981K759N071J028m231m284Q66N027K878k833m991j059M242
1515a10M323r89n013k800K949M951Q42m267m080J194M981K641k933m850p78M259
1531C20L976j249m957k653L019M831N42m348l883J328M995K372l066m677m41M346
1547D55L786j427m879k172L128M585M38m247l703J506M917K110l261m573l65M392
1563F90L420j708m791k040L244M427L5m224l444J829M677J985l255m320l3M448
$$ plain form
1579 940 4295 2475 -2170 -4007 -602 3672 3587 -757 -3957 -2017 2599 4128 703 -3503 -3339 885
1595 885 3890 1849 -2679 -4239 -829 3292 3036 -1265 -4186 -2086 2558 3940 501 -3562 -2986 1360
1611 1360 4180 2016 -2382 -3639 -142 3635 3159 -1093 -3877 -1728 2609 3770 186 -3752 -3164
1626 -3164 1173 3819 1406 -2995 -3914 -294 3453 2683 -1488 -3918 -1542 2771 3694 281 -3396 -2629
1642 -2629 1664 4053 1673 -2600 -3485 214 3726 2715 -1570 -3875 -1353 2773 3344 -320 -3685
1657 -3685 -2699 1410 3544 1112 -2975 -3581 37 3503 2522 -1641 -3726 -1076 3049 3511 -199 -3418
1673 -3418 -2186 1893 3823 1124 -2737 -3135 467 3499 2273 -1804 -3691 -1088 2780 3086 -616
1688 -616 -3711 -2455 1740 3589 778 -3071 -3168 617 3520 2096 -1888 -3442 -571 3032 3128 -528
$$ packed form
1579I40L355j820m645j837L405M274q5m344l200J940M616J529l425m206J64M224
1595H85L005k041m528j560L410M121k56m301k921K100M644J382l439m063N76M346
1611A360K820k164m398j257L497L777m76m252k784K149M337J161l584l938N88
1626c164M337K646k413m401r19L620L747p70m171k430K376M313R23l413l677P67
1642b629M293K389k380m273q85L699L512j011m285k305K522M126N71l664l365
1657c685R86M109K134k432m087o06L618L466r81m163k085K650M125M62l710l219
1673c418J232M079J930k699l861l98L602L032j226m077j887K603L868L06l702
1688f16l095J256M195J849k811l849r7L785K903j424l984j554K871L603R6l656
$$ plain form
1704 -528 -3322 -1878 2027 3640 851 -2879 -2972 660 3516 1954 -2093 -3553 -678 2868 2700 -988
1720 -988 -3613 -1909 1937 3218 385 -3033 -2871 763 3401 1815 -1965 -3330 -415 3163 2911 -850
1736 -850 -3367 -1499 2302 3374 343 -3028 -2497 1049 3310 1460 -2207 -3221 -417 2840 2469 -1099
1752 -1099 -3498 -1631 2099 3164 52 -3203 -2548 1201 3346 1355 -2268 -3049 41 3072 2439 -1046
1768 -1046 -3070 -1201 2322 3088 211 -2982 -2397 1226 3285 1261 -2383 -3078 1 2985 2141 -1464
1784 -1464 -3344 -1204 2287 2731 -222 -2988 -2193 1262 3114 1136 -2268 -2877 240 3106 2237 -1374
1800 -1374 -3195 -907 2502 2864 -338 -2955 -1963 1520 3065 848 -2339 -2665 295 2868 1914 -1456
1816 -1456 -3083 -979 2360 2688 -311 -3111 -1910 1586 3116 726 -2595 -2568 522 2968 1699 -1615
$$ packed form
1704e28k794J444L905J613k789l730r3L632K856j562m047j460K875L546j68l688
1720i88k625J704L846J281k833l418J62L634K638j586l780j365K915L578k52l761
1736h50k517J868L801J072l031l371N31L546K261j850l667j014K804L257l71l568
1752a099k399J867L730J065l112l255O55L749K145j991l623p81L090L031o33l485
1768a046k024J869L523P66k877l193N85L623K059k024l644o95L079K984q44l605
1784a464j880K140L491M44k953k766P95L455J852j978l404o09L117K866q69l611
1800a374j821K288L409L62l202k617R92L483J545k217l187l26K960K573r54l370
1816a456j627K104L339L28k999k800J201L496J530k390l321K7L090K446j269l314
$$ plain form
1832 -1615 -2902 -573 2415 2494 -450 -2856 -1792 1557 2948 705 -2481 -2587 567 3016 1625 -1827
1848 -1827 -2973 -480 2501 2318 -759 -2919 -1501 1638 2711 502 -2407 -2346 668 2937 1602 -1671
1864 -1671 -2825 -396 2638 2374 -781 -2912 -1321 1929 2709 151 -2547 -2167 825 2701 1258 -1795
1880 -1795 -2706 -367 2450 2136 -832 -2933 -1278 1828 2829 190 -2620 -2065 1070 2880 1177 -1841
1896 -1841 -2474 -2 2497 2058 -928 -2676 -1162 1820 2513 99 -2558 -2128 967 2774 1044 -2059
1912 -2059 -2635 111 2568 1809 -1196 -2647 -910 1950 2333 -108 -2404 -1753 1073 2695 994 -1879
1928 -1879 -2463 107 2589 1874 -1250 -2784 -919 2068 2300 -344 -2541 -1590 1250 2598 731 -1943
1944 -1943 -2193 281 2423 1720 -1143 -2589 -827 2002 2300 -358 -2531 -1578 1406 2573 493 -2144
$$ packed form
1832a615j287K329K988P9k944k406J064L349J391k243l186j06L154K449j391l452
1848a827j146K493K981j83l077k160J418L139J073k209k909O1L014K269j335l273
1864a671j154K429L034k64l155k131J591L250P80k558k698L80K992J876j443l053
1880a795r11K339K817l14k968k101J655L106J001k639k810N55L135J810j703l018
1896a841o33K472K499m39k986j748J514K982O93k414k657M30L095J807j730l103
1912b059n76K746K457p59l005j451J737K860L83k441k296O51K826J622j701k873
1928a879n84K570K482p15l124j534J865K987K32k644k197R51K840J348j867k674
1944a943k50K474K142p03k863j446J762K829K98k658k173R53K984J167k080k637
$$ plain form
1960 -2144 -2170 387 2397 1329 -1381 -2469 -646 1887 2130 -365 -2386 -1396 1468 2654 741 -2019
1976 -2019 -2060 663 2596 1339 -1459 -2440 -367 2078 1858 -673 -2403 -1311 1315 2217 301 -2122
1992 -2122 -2127 447 2373 1225 -1535 -2486 -286 2227 2003 -606 -2279 -891 1720 2388 320 -1922
2008 -1922 -1703 753 2298 979 -1560 -2411 -403 1967 1764 -841 -2564 -1149 1549 2207 -14 -2299
2024 -2299 -1779 797 2271 826 -1599 -2064 69 2189 1778 -561 -2114 -757 1783 2322 165 -2054
2040 -2054 -1662 895 2272 724 -1914 -2262 3 1977 1378 -1095 -2262 -783 1485 1901 -165 -2124
2056 -2124 -1557 855 2215 822 -1605 -1954 284 2333 1668 -853 -2064 -426 1912 2029 -317 -2124
2072 -2124 -1364 957 1996 418 -1791 -1974 58 1954 1294 -1095 -2255 -666 1727 1848 -381 -2227
$$ packed form
1960b144k6K557K010j068k710j088J823K533K43k495k021R90K864J186j913k760
1976b019m1K723J933j257k798r81K073K445k20k531j730J092K626R02j916k423
1992b122nK574J926j148k760r51K200K513k24k609j673J388K611O68k068k242
2008a922K19K456J545j319k539q51K008K370k03k605j723J415K698O58k221k285
2024b299N20K576J474j445k425m65K133K120m11k339j553J357K540N39k157k219
2040b054L92K557J377j548k638l48K265J974n99k473j167J479K268M16k066j959
2056b124N67K412J360j393k427l49K238K049o65k521j211J638K338J17k346j807
2072b124P60K321J039j578k209j83K032J896o60k389j160J589K393J21k229j846
$$ plain form
2088 -2227 -1321 1177 2147 478 -1654 -1532 591 2220 1365 -951 -1830 -323 1752 1758 -368 -2184 -1349
2105 -1349 1014 1952 243 -1963 -1863 343 2045 1002 -1301 -1996 -280 1732 1586 -451 -1889 -943
2121 -943 1337 2144 537 -1517 -1473 715 2299 1261 -1202 -1993 -212 1752 1423 -790 -2190 -1133
2137 -1133 1091 1670 -57 -1881 -1623 455 1842 857 -1308 -1943 -214 1868 1597 -537 -1900 -684
2153 -684 1577 2089 212 -1588 -1224 873 2031 838 -1336 -1856 -134 1535 1190 -895 -2142 -1063
2169 -1063 1144 1663 -99 -1946 -1514 772 1928 667 -1432 -1698 148 1924 1392 -650 -1716 -426
2185 -426 1511 1848 119 -1642 -1232 840 1879 532 -1510 -1888 -3 1636 1015 -1031 -2056 -607
2201 -607 1398 1532 -262 -1685 -1138 942 1932 611 -1314 -1474 279 1891 1305 -827 -1818 -429 1612
$$ packed form
2088b227R06K498R70j669k132J22K123J629q55k316q79J507K075Ok126j816Q35
2105a349K363R38j709k206J00K206J702j043k303o95J716K012j46k037j438R46
2121i43K280Q07j607k054M4K188J584j038k463p91J781J964l29k213j400J057
2137a133K224N79j727j824K58K078J387r85k165o35J729K082k71k134j363J216
2153f84K261N12j877j800L64K097J158j193k174n20J722J669l45k085j247J079
2169a063K207N19j762j847M32K286J156j261k099k66J846J776n32k042j066J290
2185d26J937L37j729j761M10K072J039j347k042l78J885J639o21k046j025J449
2201f07K005J34j794j423N47K080R90j321j925j60J753J612n86k132r91J389K041
$$ plain form
2218 1612 1605 -245 -1829 -1077 881 1673 270 -1559 -1617 142 1567 894 -1047 -1819 -431 1452 1560
2235 1560 -257 -1677 -975 1080 1907 462 -1425 -1409 493 1841 967 -975 -1658 -247 1426 1353 -437
2252 -437 -1804 -981 906 1620 178 -1603 -1466 325 1697 848 -1106 -1665 -154 1585 1398 -467 -1610
2269 -1610 -659 1193 1710 226 -1427 -1276 452 1677 785 -1084 -1714 -202 1505 1200 -620 -1769
2285 -1769 -780 1115 1556 31 -1607 -1226 611 1629 720 -1094 -1471 4 1607 1302 -476 -1545
2301 -1545 -608 1220 1613 64 -1556 -1203 652 1620 549 -1314 -1567 -55 1377 1015 -786 -1647 -584
2318 -584 1142 1493 -7 -1471 -1060 804 1751 604 -1129 -1327 246 1659 1173 -660 -1511 -377 1295
2335 1295 1360 -172 -1521 -1085 634 1388 253 -1387 -1549 34 1366 878 -822 -1562 -413 1337 1416
$$ packed form
2218A612pj850j584P52J958P92j403j829n8J759J425o73j941p72J388J883J08
2235A560j817j420P02K055Q27j445j887J6J902J348q74j942o83J411J673p3j790
2252d37j367Q23J887P14j442j781J37J791J372q49j954n59J511J739j87j865j143
2269a610R51J852N17j484j653J51J728J225q92j869o30J512J707l05j820j149
2285a769R89J895M41j525j638L81J837J018r09j814l77J475J603l05j778j069
2301a545R37J828L93j549j620L53J855R68j071j863k53J512J432l62j801q61J063
2318e84J726L51j500j464M11J864R47j147j733j98J573J413m86j833q51J134J672
2335A295O5j532j349M36J719P54j135j640j62J583J332m88j700p40J149J750P9
$$ plain form
2352 1416 -222 -1430 -810 917 1613 492 -1067 -1159 370 1577 964 -769 -1466 -337 1153 1192 -411
2369 -411 -1666 -1073 706 1273 66 -1445 -1368 252 1427 825 -781 -1328 -100 1407 1337 -225 -1321
2386 -1321 -660 1058 1605 261 -1227 -1152 416 1528 745 -946 -1469 -238 1147 947 -598 -1617 -922
2403 -922 779 1213 66 -1305 -1113 470 1524 697 -843 -1228 31 1433 1220 -333 -1347 -483 1011
2420 1011 1409 100 -1250 -997 485 1338 514 -1050 -1417 -198 1178 849 -667 -1557 -719 877 1267
2437 1267 -15 -1328 -933 591 1519 608 -933 -1144 174 1433 1044 -469 -1298 -457 1046 1308 -110
2454 -110 -1288 -874 605 1299 393 -1103 -1279 54 1230 745 -720 -1375 -426 1034 1158 -174 -1280
2471 -1280 -708 702 1391 469 -904 -1054 233 1332 778 -695 -1354 -321 1095 1073 -220 -1319 -825
$$ packed form
2352A416j638j208O20J727O96j121j559r2J529J207o13j733o97J129J490L9j603
2369d11j255N93J779N67j207j511P7J620J175o02j606n47J228J507p0j562j096
2386a321O61J718N47j344j488P5J568J112p83j691n23J231J385k00j545j019O95
2403i22J701M34j147j371J92J583J054q27j540l85J259J402k13j553j014Q64J494
2420A011L98j309j350K53J482Q53q24j564l67J219J376l29j516q90Q38J596L90
2437A267j282j313L95J524R28r11j541k11J318J259l89j513q29Q41J503K62j418
2454a10j178M14J479O94r06j496j76J333J176m85j465o55R49J460J24j332j106
2471a280N72J410O89r22j373j50J287J099n54j473o59J033J416k2j293j099M94
$$ plain form
2488 -825 607 1181 203 -1149 -1215 101 1186 670 -755 -1266 -194 1110 1113 -178 -1160 -619 811 1347
2506 1347 313 -1079 -1016 329 1226 662 -742 -1242 -253 1054 938 -318 -1326 -697 719 1176 23
2523 23 -1147 -1076 281 1138 537 -816 -1203 -11 1159 1011 -234 -1096 -493 896 1236 126 -1109 -939
2541 -939 405 1213 523 -833 -1158 -93 1054 802 -458 -1243 -545 728 1086 -59 -1164 -894 391
2558 391 1205 471 -787 -1075 -14 1221 845 -464 -1164 -409 891 1094 11 -1032 -807 477 1177
2575 1177 365 -873 -1121 29 1097 810 -507 -1166 -388 887 1075 -73 -1032 -828 549 1214 387
2592 387 -904 -960 172 1077 752 -546 -1139 -346 859 965 -178 -1098 -694 558 1099 213 -923 -982
2610 -982 161 1142 723 -576 -1041 -213 924 972 -158 -1066 -622 650 1107 273 -852 -912 179 1062
$$ packed form
2488h25J432N74r78j352o6J316J085n16j425n11J072J304Lj291r82N41J430N36
2506A347j034j392O3J345Q97n64j404n00R89J307j16j256j008O29J416M57j153
2523B3j170P1J357Q57o01j353l87J192J170j48j245q62O03J389L40j110j235J70
2541i39J344Q08o90j356l25J065J147k52j260p85O98J273L58j145j105K70J285
2558C91Q14p34j258k88J061J235l76j309p00P55J300K03j083j043K25J284P00
2575A177q12j238k48J150J068k87j317o59P78J275J88j148r59K04J377O65q27
2592C87j291n6J132R05l25j298n93P93J205J06j143r20M04J252N41q86j136n9
2610i82J143R81m19j299m65Q28J137M8j130r08M44J272M57q34j125o0J091Q83
$$ plain form
2628 1062 604 -633 -1104 -194 939 868 -275 -1109 -598 625 1034 162 -901 -890 262 1043 570 -568
2646 -568 -1037 -170 984 858 -258 -1047 -525 679 968 63 -895 -820 267 1050 497 -692 -1075 -107 909
2665 909 767 -320 -1011 -482 715 1043 96 -901 -742 392 1043 503 -632 -906 -4 953 773 -332
2683 -332 -1032 -523 716 953 -26 -989 -742 352 1017 351 -750 -966 14 906 696 -413 -1005 -337 787
2702 787 868 -11 -920 -616 475 1072 331 -742 -893 97 940 682 -433 -1025 -305 764 911 -112 -935
2721 -935 -661 423 935 284 -775 -894 77 872 555 -488 -977 -287 763 873 -131 -951 -592 479
2739 479 950 352 -733 -843 191 964 526 -456 -944 -152 794 773 -133 -957 -557 544 950 215 -793
2758 -793 -734 148 892 531 -552 -930 -163 843 740 -170 -919 -503 538 905 228 -753 -751 281 960 474
$$ packed form
2628A062m58j237m71R10J133p1j143q34N11J223M09q72j063J1J152P81m73j138
2646e68m69Q67J154j26j116p89N22J204K89r05r58P5J087P83n53j189l83R68J016
2665I09j42j087o91N29J197L28r47r97J59J134O51n40j135k74R02R57j80j105
2683c32p00N09J239K37r79r63K47J094O65o66j101k16R80Q92k10j109n92O68J124
2702G87Q1q79r09L04J091N97p41j073j51R90Q43k58j115n92P20J069J47j023q23
2721i35K74J084N12o51j059j19R71P95l17j043m89O90J050J10j004q20L59J071
2739D79M71n98j085j10J034P73m38r82m88P92R46k1r06q24M00J101M06p35j008
2758g93N9Q82P44l61j083l78P67J006j03r10p49M16J041L67o77r81KJ032O79m86
$$ plain form
2778 474 -491 -900 -87 760 731 -265 -940 -474 516 837 38 -803 -760 264 893 352 -532 -942 -69 817
2798 817 708 -243 -820 -308 564 889 112 -740 -657 305 882 440 -576 -817 -101 770 620 -348 -910 -385
2818 -385 513 759 -3 -835 -680 293 802 333 -637 -827 8 809 658 -308 -802 -317 648 848 79 -745
2838 -745 -467 414 901 319 -637 -725 31 791 479 -387 -932 -320 613 708 -106 -857 -581 329 779 273 -675
2859 -675 -741 70 769 594 -335 -776 -203 691 783 -10 -768 -448 400 829 173 -621 -725 47 761 472 -423
2880 -423 -842 -260 659 690 -186 -840 -476 408 763 169 -677 -698 152 855 474 -358 -754 -164 739 754 -127
2901 -127 -756 -410 418 696 109 -676 -685 136 707 341 -529 -793 -79 692 582 -194 -728 -394 497 776 51
2922 51 -648 -597 279 853 458 -418 -677 -5 732 618 -217 -767 -357 429 668 47 -696 -590 200 712 266
$$ packed form
2778D74r65m09Q13Q47k9r96o75M66R90L21p99q41M3J024O29n41q84m10Q73Q86
2798H17j09r51n77N12Q72L25p77q52Q3R62N77m42j016k41P16Q71j50r68n62N25
2818c85Q98K46p62q32J55R73N09m69r70j90Q35Q01j51r66m94M85R65K00p69q24
2838g45K78Q81M87n82r56q8P56P60l12q66n45O12R33R5q14p51K76R10M50n06r48
2859f75o6Q11O99j75r29m41N73Q94R2p93p58L20Q48M29o56p94j04P72P14k89q95
2880d23m19N82R19L1q76o54L64Q84L55n94q46k1Q50P03l81q32l96N90R03J5q81
2901a27o29L46Q28K78n87p85rQ21N71l66q70k64P14P71j10p76n34L34Q91K79p25
2922E1o99N1Q76N74l95q76k59O72P37j14q35n50M10P86K39o21p43J06P90N12m46
$$ plain form
2943 266 -536 -767 -74 643 507 -299 -700 -288 532 718 108 -633 -513 279 850 296 -471 -629 28 727
2963 727 576 -282 -760 -287 498 652 -60 -726 -519 285 673 227 -556 -669 10 740 475 -295 -686 -181
2983 -181 547 661 -6 -643 -474 333 728 222 -585 -601 19 671 393 -353 -738 -260 542 635 -91 -772 -386
3004 -386 340 709 229 -524 -622 127 673 417 -324 -632 -187 590 596 -66 -691 -443 342 690 124 -557 -636
3025 -636 61 632 374 -409 -718 -178 568 570 -107 -635 -341 429 685 163 -530 -503 173 690 397 -336 -649
3046 -649 -115 562 472 -175 -727 -298 393 588 10 -578 -556 136 633 289 -381 -602 -46 588 557 -162 -651
3067 -651 -286 438 627 93 -586 -432 204 620 302 -418 -628 -81 546 461 -202 -695 -287 363 577 -11
3087 -11 -576 -486 207 635 352 -395 -504 47 637 467 -170 -569 -263 476 573 -41 -589 -380 237 642 219
$$ packed form
2943B66q02k31O93P17j36q06m01M12Q20J86o10p41J20P92N71n54p67j58O57O99
2963G27j51q58m78M73P85J54p12o66K07Q04L88m46p83j13O79P30k65p70l91N05
2983a81P28J14o67o37J69Q07L95n06q07j6O20O52k78p46l85M78Q02R3p26o81L86
3004c86P26L69m80p53r8P49N46k56p41l08M45P77Oo62o25K48P85L48n66o81p9
3025f36O97N71k58p83l09N40P46Ko77n28K94P70K56n22o93K7O76N17k93p33l13
3046f49N34O77r0o47n52M29O91J95n78n88K2O92M97l44o70k21N56O34l1p19m89
3067f51L65P24J89n34o79J54O36M16l18p20k10N47O27q5o63m93M08O50K14n88
3087a1n65R0O93M28k83p47j09N51N90j70o37l99L06P39R7o14n48K09O17M05m23
$$ plain form
3108 219 -458 -514 -7 465 334 -320 -744 -264 437 528 -17 -612 -410 291 577 253 -404 -454 60 621 423
3129 423 -216 -573 -179 444 529 -41 -614 -365 286 545 157 -496 -573 53 473 346 -345 -602 -199 466 473
3150 473 -91 -598 -323 355 575 177 -398 -429 131 605 397 -295 -539 -135 459 481 -117 -536 -287 295 532
3171 532 76 -523 -551 101 446 298 -370 -589 -105 477 497 -40 -529 -228 409 585 175 -385 -412 151 605
3192 605 284 -398 -542 -80 437 397 -174 -552 -286 277 473 67 -549 -460 129 471 282 -321 -484 39 483
3213 483 419 -57 -468 -184 367 554 86 -441 -353 188 565 235 -388 -477 -16 404 341 -259 -584 -219 340
3234 340 474 -26 -466 -403 184 548 153 -311 -451 14 525 378 -159 -489 -172 377 468 -25 -459 -304 226
3255 226 486 165 -366 -469 34 455 278 -198 -535 -85 385 439 -25 -501 -304 199 517 119 -336 -424 47
$$ packed form
3108B19o77n6N07M72j31o54m24M80P01R1n45n95K02P01K86l24o57n0N14N61j98
3129D23o39l57L94O23Q5n70n73K49O51K59l88o53p7O26M20j27o91k57M03O65P
3150D73n64n07K75O78K20l98n75l1N60M74k08o92k44M04N94K2n98m19K49N82K37
3171E32m56n99k8O52L45j48o68k19M84N82K0n37m89L01O37J76m10n60k7N63M54
3192F05l21o82j44M62N17m0n71l78K66N63J96m06o16Q9N89L42j89o03j63N23M44
3213D83o4m76m11K84N51J87m68n27Q8N41L77l30o23q9M61M20o3o00l25L65N59
3234C40J34n00m40O3N87L64l95m64j40M65N11j47n37l30L17N49R1m93m34J55N30
3255B26K60l21n31j03N03M21j77m76l37M50M70N4m64m76J97N03L18l98m55q8M71
$$ plain form
3276 47 485 285 -209 -530 -132 362 422 -85 -432 -294 213 453 143 -412 -414 58 465 316 -212 -424 -108
3297 -108 437 469 -70 -493 -284 280 535 64 -419 -416 68 449 293 -283 -455 -102 386 369 -149 -514 -252
3318 -252 303 471 50 -407 -370 136 446 192 -255 -433 -14 384 375 -138 -439 -235 272 405 106 -444 -389
3339 -389 140 427 221 -273 -411 -73 410 360 -89 -419 -214 291 442 44 -398 -292 145 467 166 -268
3359 -268 -331 22 362 316 -166 -445 -195 244 397 -3 -422 -282 148 455 139 -337 -454 -41 450 350 -184
3380 -184 -427 -164 322 448 69 -332 -287 231 405 188 -347 -380 58 471 308 -176 -449 -128 301 384 -44
3401 -44 -436 -311 185 399 80 -353 -394 22 400 268 -220 -401 -73 320 386 -40 -368 -284 302 456 146
3422 146 -289 -317 24 347 240 -241 -455 -140 271 319 -119 -432 -269 178 395 103 -313 -281 98 439 268
$$ packed form
3276D7M38k00m94l21L98M94O0n07l47J38N07K40l10n55kM72M07j49n28k12L16
3297a08N45L2n39m23K09N64K55m71m83LM84L81j56n76j72L53M88j7n18l65K62
3318b52N55J68m21m57L7N06L10k54m47j78M19L98rn13l01K04N07J33k99n50N5
3339c89N29K87k06m94j38L38M83n0m49l30K05N05J51l98m42J06M37L22l01m34
3359b68o3L53L40m6m82k79K50M39J53m00m19J40M30L07l16m76j17M13M91j00n34
3380a84k43K63M86J26l79m01M5N18J74k17n35l3M38M13j63m84k73L21M29Q3m28
3401d4l92J25M96K14l19m33m1M16L78j32m88j81L28L93O6m26l28Q4N86J54l10
3422A46m35k8L41L23j07m81k14L15M11M8m38l13J63M47K17k92m16L2L79L41j71
$$ plain form
3443 268 -215 -352 -1 342 377 -82 -376 -201 198 334 64 -405 -377 71 414 208 -278 -390 -60 312 282
3464 282 -115 -354 -223 207 404 78 -400 -264 122 406 254 -254 -383 -18 347 276 -100 -403 -195 238
3484 238 340 33 -366 -314 86 414 134 -240 -386 11 336 310 -113 -389 -132 251 340 24 -314 -245 138
3505 138 345 185 -252 -358 -35 362 255 -155 -374 -165 215 336 -16 -298 -293 184 395 136 -268 -325 51
3526 51 392 319 -181 -393 -121 352 362 -9 -350 -203 116 356 129 -327 -335 -41 339 225 -155 -392 -110 250
3548 250 315 -41 -382 -226 115 416 126 -254 -302 56 292 203 -170 -299 -23 287 343 15 -337 -187 211
3569 211 300 119 -299 -299 23 320 183 -192 -299 -112 271 275 -98 -324 -225 204 324 36 -259 -249 53 354
3591 354 174 -177 -335 -60 314 268 -142 -355 -208 151 364 49 -274 -298 64 283 146 -136 -301 -13 271
$$ packed form
3443B68m83j37L51L43L5m59k94J75L99J36k70m69K8M48L43k06m86j12L30L72l0
3464B82l97k39J31M30J97l26m78J36L86K84j52n08j29L65L65p1l76l03K08M33
3484B38J02l07l99N2M00L28k80l74j46L97L25k6m23k76K57L83Q9l16l38O9L83
3505A38K07j60m37j06L23L97j07m10k19K09L80J21l52k82NM77K11k59m04n7L76
3526E1L41p3n00k12K72M73J0l71l41J47L19K40k27m56qK94L80j14l80k37K82L60
3548B50O5l56l41J56L41L01k90l80m8L58K36q9l73j29K76L10N6l28l52J50L98
3569B11Q9j81m18%L22K97j37l75j07J87L83Ml73k26R9M29J20k88k95J0L02L01
3591C54j80l51j58K75L74m6m10k13J47L59K13l15l23k4L62K19j37k82j65K88K84
$$ plain form
3612 271 284 -34 -266 -148 237 329 24 -267 -184 75 356 187 -222 -281 -21 220 156 -103 -325 -228 149 283
3634 283 -6 -236 -287 108 350 161 -231 -289 16 358 252 -72 -279 -75 249 272 68 -320 -219 74 262
3655 262 101 -229 -311 -80 232 234 -189 -328 -116 222 280 -2 -292 -225 109 349 132 -152 -254 21 348 212
3677 212 -115 -264 -75 244 334 -68 -311 -189 107 326 109 -234 -303 57 303 151 -137 -277 -54 192 279
3698 279 -44 -277 -127 125 321 99 -199 -295 61 324 168 -179 -275 -90 160 228 -43 -324 -185 113 234
3719 234 89 -271 -292 -1 299 144 -123 -279 -93 287 285 23 -234 -93 153 313 73 -220 -203 88 300
3740 300 140 -165 -323 -75 194 240 -78 -261 -161 122 255 -5 -295 -279 43 254 180 -202 -281 -75 252
3761 252 238 -75 -244 -169 226 265 65 -229 -209 51 226 129 -151 -246 -18 223 199 -98 -291 -126 181 248 6
$$ packed form
3612B71J3l18k32J18L85R2l05k91Q3K59K81j69m09n9K60K41o4k59k22R7L77J34
3634B83k89k30n1L95K42j89l92n8L05L42j06l24k07K04L24K3k04l88J01K93J88
3655B62j61l30q2K31L12Km23j39K12L38N8k82k90O7L34K40k17k84j02K75L27j36
3677B12l27j49J89L19R0m02k43J22K96K19k17l43o9L60K46j52k88j40K23K46Q7
3698B79l23k33J50K52J96k22k98r6L56K63j56l47r6J85K50O8k71k81J39K98J21
3719B34j45l60k1K91L00j55k67j56J86L80kk62k57J41K46J60k40k93J7K91K12
3740C00j60l05j58K48K69M6l18j83J00K83J33k60k90J6L22K11p4l82p9K06L27
3761B52j4l13j69P5L95L9k00k94K0K60J75r7k80r5K28K41k4k97j93J65L07O7k42
$$ plain form
3784 6 -259 -183 73 205 135 -158 -232 12 213 244 -120 -248 -66 140 304 46 -257 -165 99 274 111 -187
3806 -187 -283 10 218 116 -127 -286 -62 165 224 -10 -277 -176 172 299 102 -155 -160 12 233 177 -67 -247
3828 -247 -50 138 231 -7 -257 -190 91 215 101 -234 -222 14 215 142 -194 -233 -32 198 228 -11 -229 -166
3850 -166 105 262 70 -198 -209 36 285 149 -128 -198 -71 157 232 -52 -184 -157 168 221 103 -197 -189 93
3872 93 180 109 -113 -194 -63 148 213 -48 -227 -132 149 262 28 -224 -207 48 292 107 -129 -217 -79 207 125
3895 125 -67 -238 -119 168 214 111 -252 -140 37 233 173 -142 -170 2 182 250 7 -164 -71 120 154 -12
3917 -12 -235 -182 51 222 93 -178 -197 -65 180 156 -120 -270 -92 154 218 14 -223 -176 69 267 65 -126
3939 -126 -195 -89 237 127 -38 -206 -128 159 161 -17 -195 -235 96 147 113 -205 -206 -13 245 139 -125 -129 -65 203
$$ packed form
3784Fk65P6K56J32p0k93p4K44K01L1l64j28J82K06J64k58l03R2K64J75j63k98
3806a87r6K93K08j02k43j59K24K27N9k34k67J01L48J27j97k57nJ72K21n6k44j80
3828b47J97J88R3k38k50O7K81J24j14l35J2K36K01p3l36l9K01K30L0k39k18O3
3850a66K71J57j92k68j1K45K49j36k77p0J27K28P5k84j32K7L25N3j18l00QK82
3872I3Q7p1k22q1J31K11O5k61j79R5K81J13k34k52J7K55K44j85k36q8J38K86q2
3895A25j92j71J19K87M6j03l63J12J77J96o0l15k8J72J80O8k43j71R3J91L4j66
3917a2k23N3K33J71j29k71j9J32K45k4k76j50J78K46O4k04k37M7K45J98k02j91
3939a26o9J06L26j10j65j68P8K87Kj78j78m0L31N1l4l18jJ93K58j06k64mO4K68
$$ plain form
3963 203 143 13 -206 -72 104 244 91 -152 -159 31 268 177 -136 -230 -62 159 160 -11 -159 -126 150 217 58
3986 58 -105 -154 32 192 116 -46 -184 -54 148 226 -29 -181 -99 105 195 27 -95 -163 6 186 96 -61 -242
4009 -242 -69 160 149 -66 -230 -142 67 229 48 -155 -129 59 124 153 -96 -179 -1 142 102 -59 -243 -98
4031 -98 167 269 71 -144 -163 77 222 148 -95 -207 -87 120 188 -65 -217 -92 124 177 -1 -246 -124 -2
4053 -2 225 84 -132 -182 4 178 151 -37 -222 -8 126 209 2 -163 -113 121 198 119 -85 -157 -38 161 183
4076 183 -77 -196 -99 96 194 28 -116 -187 41 200 80 -97 -178 23 196 143 -104 -171 4 164 202 -34
4098 -34 -190 -135 139 242 100 -172 -175 19 135 146 -72 -167 -81 116 161 -64 -196 -96 80 174 89 -138 -104 112
4122 112 213 137 -109 -180 -95 149 152 1 -162 -150 52 196 14 -135 -186 -38 153 123 -101 -226 -106 92 89
$$ packed form
3963B03o0j30k19J34J76J40j53k43pJ90K37r1l13r4J68K21Jj71j48L3K76O7j59
3986E8j63m9J86J60p6j62j38J30K02P8k55j52Q2K04R0j68j22o8J69J80r0j57j81
4009b42J73K29j1k15j64Q8K09J62j81k03K6J88O5K9k49q3J78J43m0j61j84J45
4031i8K65J02j98k15j9K40J45p4k43j12J20K07O8k53j52J25K16N3j78k45J22J22
4053bK27j41k16n0J86J74k7j88j85K14J34Q3k07j65N0K34P7p9k04p2J19J99K2
4076A83k60j19R7J95R8j66j44p1K28J59j20j77q1K01J73n3k47o7J75J60L8k36
4098c4j56N5K74J03j42k72lJ94J16J1k18r5Q6J97M5k25j32J00J76R4q5k27L4K16
4122A12J01p6k46p1Q5K44Lj51j63J2K02J44j82j49n1J48J91l0k24j25J20J98l
$$ plain form
4145 89 -65 -217 -81 74 199 83 -88 -152 79 286 110 -54 -90 -30 142 171 -41 -159 -84 107 164 36
4167 36 -152 -162 31 150 52 -153 -167 -58 160 89 -38 -169 -94 76 207 78 -120 -73 54 151 33 -75 -104
4190 -104 -27 168 169 1 -136 -85 107 162 32 -117 -167 26 175 74 -89 -107 16 110 89 -31 -135 -69 99
4213 99 192 52 -162 -85 31 141 50 -90 -149 10 123 100 -75 -201 -87 60 145 -42 -208 -148 16 84 98
4236 98 -71 -158 -3 146 124 4 -128 -48 102 120 50 -133 -63 82 143 103 -90 -118 -1 120 101 -93 -146 -39
4260 -39 123 122 -26 -184 -129 90 129 42 -130 -141 19 130 137 -75 -177 -10 162 90 2 -119 -101 13 94 73 -89
4285 -89 -133 -20 139 113 -96 -113 -42 101 123 -4 -137 -120 71 150 105 -48 -146 15 96 41 -89 -104 -60 123 125
4310 125 -43 -129 -85 117 69 74 -111 -133 38 81 92 -81 -190 12 153 102 -13 -111 -59 37 154 30 -135 -57
$$ packed form
4145H9j54j52J36J55J25j16j71o4K31K07j76j64l6O0J72K9k12j18P5J91N7j28
4167C6j88j0J93J19r8k05j4J09K18p1j27j31P5J70J31j29j98M7J27R7j18j08k9
4190a04P7J95Jj68j37N1J92N5j30j49n0J93J49j01j63j8J23R4k1j20j04O6J68
4213I9R3j40k14P7J16J10r1j40n9J59J13k3j75j26J14J47Q5j87j66O0J64O8J4
4236I8j69q7J55J49k2j20j32Q0J50J8p0j83P0J45O1m0j93k8J17J21j9j94n3J07
4260c9J62jj48j58N5K19L9q7j72j1J60J11Pk12j02J67J72p2q8j21J8J14Q1k1j62
4285h9m4J13J59k6k09j7P1J43K2j27j33J7J91P9m5j53r8J61Q1n5j30j5M4J83K
4310A25j68q6M4K02m8Nj85k2J71M3J1j73j09K02J41n1j15r8N2R6J17j24j65P8
$$ plain form
4334 -57 45 143 59 -62 -162 -47 91 64 -45 -142 -96 75 169 33 -90 -108 35 160 84 -104 -73 -7 101 69
4358 69 -21 -103 -54 118 92 19 -92 -113 13 124 79 -103 -96 -30 142 103 -37 -113 -45 96 105 28 -126 -101 77 108
4384 108 20 -76 -122 20 99 122 -62 -87 -39 75 93 -10 -176 -94 0 73 75 -137 -126 37 66 75 -75 -160 -95 71
4410 71 145 29 -102 -64 49 109 69 -40 -60 45 147 84 -43 -125 -37 75 127 -12 -129 -113 8 123 -12 -94
4434 -94 -122 -44 78 84 -86 -163 -54 78 133 -19 -84 -68 56 114 86 -98 -128 25 94 90 -17 -101 -15 74 85 -3 -123
4461 -123 -52 69 125 -4 -143 -96 -2 85 84 -26 -124 -2 85 152 36 -100 -60 101 125 6 -80 -86 1 98 23 -94
4487 -94 -138 -51 83 59 -31 -180 -75 63 130 62 -131 -69 -2 108 122 -61 -78 -2 152 152 21 -94 2 103 110 19
4513 19 -76 -75 11 95 79 -132 -87 -84 45 60 -47 -185 -79 62 125 26 -55 -48 20 127 96 -72 -137 83 183 152 20
$$ packed form
4334e7J02R8q4j21j00J15J38k7j09r7M6J71R4j36j23j8J43J25p6j88L1O6J08l2
4358F9r0q2M9J72k6p3j11k1J26J11m5j82PO6J72l9j40p6O8J41Rp7j54K5J78L1
4384A08q8r6m6J42P9K3j84k5M8J14J8j03j66Q2R4P3Kk12J1J63K9Rj50q5O5J66
4410G1P4j16j31L8J13O0m0j09k0J05J02o3j27q2Q8J12N2j39j17J6J21J15j35q2
4434i4k8P8J22Oj70p7J09J32N5j52o5J6J24N8k8j84l0J53O9mj07q4Q6Q9J1q8j20
4461a23P1J21N6j29j39M7R4Q7jj10r8J22Q7O7j16j36M0J61K4j19q6oQ7R7p5j17
4487i4m4Q7J34k4r0j49J05J38O7o8j93O2O7J10J4j83j7P6J54%j31j15R6J01Pr1
4513A9r5JQ6Q4j6k11M5LJ29J5j07j38J06J41O3r9q1PO8J07l1j68o5K20J00l1j32
$$ plain form
4540 20 -77 -67 49 96 -53 -76 -77 81 85 4 -28 -120 -14 112 59 -31 -127 -22 92 101 -12 -113 -127 34 144 -21
4566 -21 -42 -75 -26 108 99 -21 -88 -51 36 100 2 -100 -99 25 136 103 -43 -126 -54 180 118 -35 -66 -21 75 93 24
4593 24 -48 -105 28 134 54 -56 -111 11 61 121 -67 -103 -73 60 81 9 -108 -44 48 100 15 -87 -83 27 106 126
4619 126 -28 -80 10 92 129 4 -118 -16 94 95 -5 -22 -127 -4 73 117 -57 -80 -11 46 32 -54 -93 -125 28
4644 28 75 43 -110 -55 32 110 30 -86 -92 -5 70 32 -33 -80 -72 1 53 -6 -84 -59 -35 53 15 -77 -128 -37 166 33 14
4673 14 -94 -60 65 81 52 -78 -20 37 122 53 -35 -75 -11 52 83 -49 -99 -71 53 70 11 -87 -119 -2 124 44 -47
4700 -47 -139 -47 40 68 5 -58 -39 27 116 -18 14 -29 8 86 113 -57 -104 -57 24 74 2 -70 -31 42 39 29 -74 -56 22
4729 22 92 17 -94 -84 24 41 74 29 -50 -59 83 57 -59 -48 -83 10 64 -13 -66 -84 6 127 37 -82 -38 -28 33 104
$$ packed form
4540B0r7J0J16M7j49k3jJ58Mq1l2r2J06J26n3r0r6J05J14Rj13j01j4J61J10j65
4566b1k1l3M9J34rj20o7L7Q7O4r8j02JJ24J11l3j46q3P2K34o2j53l1M5R6J8o9
4593B4p2n7J33J06q0j10n5J22N0O0j88l6L0J33K1p2j17O4R2N2q5j02MJ10P9K0
4619A26j54n2R0Q2L7j25j22J02J10Jj00j7j05J23P7M4j74k3O9N7j4q6l9l2J53
4644B8M7l2j53N5Q7P8q0j16oQ7P5l8o5m7QP3N2n9p8K5K4Q8l8r2n1R1K03j33j9
4673A4j08L4J25J6k9j30N8N7Q5o9q8m0O4O3L1j32n0K8J24J7n9r8l2J17J26q0r1
4700d7r2R2Q7K8o3o3J9O6Q9j34L2m3L7P8K7j70m7M7Q1N0p2p2L9P3lj0j03J8P8
4729B2P0p5j11J0J08J7L3m5p9rJ42k6j16J1l5R3N4p7n3j8R0J21r0j19M4J0O1P1
$$ plain form
4757 104 -41 -123 -85 17 105 47 -48 -160 -25 48 82 39 -99 -10 54 104 41 -123 -74 4 76 20 -19 -100 -23 28 35
4784 35 -74 -100 -29 64 53 -51 -69 6 97 84 54 -40 -76 29 123 64 -45 -60 -5 55 75 -22 -48 -77 57 38 -6 -85
4812 -85 -46 -20 45 -1 -100 -100 3 51 90 -33 -85 -37 57 21 19 -26 -78 7 43 46 -48 -33 21 53 100 -58 -72 -53 11 80
4842 80 5 -31 -87 32 74 54 -33 -82 -32 28 21 18 -71 21 29 76 -23 -63 -49 3 71 19 -84 -29 1 24 108 -81 -96 -62
4872 -62 26 53 14 -65 -106 38 94 -6 -31 -78 -20 97 85 -45 -83 -24 -9 17 -7 -73 -77 55 89 74 -84 -83 -13 79
4900 79 107 -81 -100 -53 22 93 13 -105 -91 69 -16 -8 6 -132 19 94 -6 -10 -71 -41 48 88 20 -95 -1 38 94 1
4928 1 -53 -29 43 65 88 -3 -58 -8 107 84 -9 -49 -26 65 97 22 -90 -152 4 44 -3 -77 -57 -48 59 87 -23 -102 -25
4957 -25 18 120 26 -38 -33 10 102 -16 -8 -18 -8 47 127 -22 -8 -78 75 109 17 -43 -36 64 24 77 -35 -48 5 108
$$ packed form
4757A04j45q2L8J02Q8n8r5j12J35P3L4m3j38Q9O4N0o3j64M9P8P2n6l9q1P7N1P
4784C5j09k6P1R3j1j04j8P5R1j3l0r4l6J05R4n9j09j5N5O0K0r7k6k9J34j9m4p9
4812h5L9K6O5m6r9%J03M8L9j23n2M8R4l6km5n2Q5L6Lr4J5N4L2M7j58j4J9O4O9
4842H0p5l6n6J19M2k0q7m9N0O0plq9R2QM7r9m0J4N2O8n2j03N5L0K3Q4j89j5L4
4872f2Q8K7l9p9m1J44N6j00k5m7N8J17j2j30l8N9J5K6k4o6mJ32L4j5j58JP0R2
4900G9K8j88j9M7P5P1q0j18J4J60q5QJ4j38J51P5j00mo1L0Q9M0o8j15R4L9N6r3
4928An4K4P2K2K3r1n5N0J15k3r3m0K3R1L2p5j12o2J56M0m7p4K0RJ07K8j10p9P7
4957b5M3J02r4o4NM3R2j18Qj0J0N5Q0j49J4p0J53L4r2o0PJ00m0N3j12j3N3J03
$$ plain form
4985 108 25 7 -77 -45 55 89 32 -106 -64 17 79 43 -54 -21 -49 43 26 -5 -125 -8 109 19 -2 -67 -28 59 103
5012 103 49 -60 -84 25 51 30 -58 -42 -31 82 26 12 -51 -32 12 48 58 -36 -127 -37 44 64 -6 -80 -69 41 70 9
5040 9 -81 -92 30 64 44 -51 -40 -7 72 15 -3 -75 -3 64 34 29 -81 -14 37 87 66 -41 -70 -35 82 28 -44 -92 -11
5069 -11 43 37 13 -86 -40 33 30 42 -31 -68 -15 55 30 3 -77 -34 31 26 -15 -98 -63 42 43 34 -75 -2 34 55 15 -3 -40 55
5101 55 35 131 23 -75 -13 59 -6 -55 -70 -51 -12 94 30 -9 -122 -34 78 62 -35 -56 -33 61 54 36 -16 -77 6 66 36
$$ packed form
4985A08q3j8q4L2J00L4n7j38M2Q1O2l6r7L3k8R2j7l1j20J17J17r0k1o5L9Q7M4
5012A03n4j09k4J09K6k1q8J6J1J13n6j4o3J9M4L6J0r4r1R0Q1K0p0p4J1J10K9o1
5040Ir0j1J22L4k0r5J1L3P9n7j8p2P2O7l0nj10O7N1N0k1j07k9L5J17n4p2m8Q1
5069a1N4ok4r9M6P3lJ2p3l7N3P0k5k7q0M3O5nm1q3L5J05Jrj09P3L6K1m0j8l7R5
5101E5k0R6j08r8O2P2o5m9j5J9L9J06o4l9j13Q8J12j6r7k1K3R4pj8n2o1Q3O0l0
$$ [...]
8191a5
##END NTUPLES=NMR FID
##END=
