##TITLE=1H_AM_NVP319'
 CDCl3
 8 sc, 
 1.9.2023
##JCAMPDX= 6.0         $$ Bruker NMR JCAMP-DX V2.0
##DATA TYPE= NMR FID
##DATA CLASS= NTUPLES
##ORIGIN= UXNMR, Bruker Analytische Messtechnik GmbH
##OWNER= root
$$ XWIN-NMR		Version 3.5
$$ Fri Sep  1 15:59:17 2023 Russian Standard Time (UT+4h)  she@DPX200
##.OBSERVE FREQUENCY= 200.13135
##.OBSERVE NUCLEUS= ^1H
##.DELAY= (6, 6)
##.ACQUISITION MODE= SIMULTANEOUS
##.ACQUISITION SCHEME= undefined
##.AVERAGES= 8
##.DIGITISER RES= 18
##SPECTROMETER/DATA SYSTEM= spect
##.PULSE SEQUENCE= zg30
##.SOLVENT NAME= CDCl3
##.SHIFT REFERENCE= (INTERNAL, CDCl3, 0, 15.7039)
##AUDIT TRAIL= $$ (NUMBER, WHEN, WHO, WHERE, WHAT)
$$ ##TITLE= Audit trail, XWIN-NMR		Version 3.5
$$ ##JCAMPDX= 5.01
$$ ##ORIGIN= Bruker BioSpin GmbH
$$ ##OWNER= she
$$ F:/spectra/data/she/nmr/H-F/1/audita.txt
$$ ##AUDIT TRAIL=  $$ (NUMBER, WHEN, WHO, WHERE, WHAT)
(   1,<2023-09-01 15:58:10.04 +0400>,<she>,<DPX200>,
      <created by zg, POWCHK disabled, PULCHK disabled
       configuration hash MD5:
       00 E9 B6 7A A2 85 ED C7 34 08 36 98 17 FE 4E 26
       data hash MD5: 16K
       EC 38 5E DE FC F0 83 0C CF C2 32 1F 2C 51 F6 63>)
$$ ##END=
$$ 
$$ hash MD5
$$ 7D A8 AB 95 8B 81 08 5C 88 2D B9 C8 F6 C8 25 AC
##$RELAX= 
##$RELAX= 
##$RELAX= 
##$RELAX= 
##$RELAX= 
##$RELAX= 
$$ Bruker specific parameters
$$ --------------------------
##$DU= <F:/spectra>
##$EXPNO= 1
##$NAME= <H-F>
##$PROCNO= 1
##$TYPE= <nmr>
##$USER= <she>
##$AMP= (0..31)
100 100 100 100 100 100 100 100 100 100 100 100 100 100 100 100 100 100 
100 100 100 100 100 100 100 100 100 100 100 100 100 100 
##$AQSEQ= 0
##$AQ_mod= 1
##$AUNM= <au_zg>
##$AUTOPOS= <>
##$BF1= 200.13
##$BF2= 200.13
##$BF3= 200.13
##$BF4= 200.13
##$BF5= 200.13
##$BF6= 200.13
##$BF7= 200.13
##$BF8= 200.13
##$BYTORDA= 1
##$CFDGTYP= 0
##$CFRGTYP= 5
##$CHEMSTR= <none>
##$CNST= (0..31)
1 1 145 1 1 1 1 1 1 1 1 1 1 1 1 1 1 1 1 1 1 1 1 1 1 1 1 1 1 1 1 1 
##$CPDPRG= <>
##$CPDPRG1= <>
##$CPDPRG2= <>
##$CPDPRG3= <>
##$CPDPRG4= <mlev>
##$CPDPRG5= <mlev>
##$CPDPRG6= <mlev>
##$CPDPRG7= <mlev>
##$CPDPRG8= <mlev>
##$CPDPRGB= <>
##$CPDPRGT= <>
##$D= (0..31)
0 1.2 0 0 0 0 0 0 0 0.06 0 0.03 0 0 0 0 0.0002 0 0 0 0 0 0 0 0 0 0 0 0 
0 0 0 
##$DATE= 1693569489
##$DBL= (0..7)
120 120 120 120 120 120 120 120 
##$DBP= (0..7)
150 150 150 150 150 150 150 150 
##$DBP07= 0
##$DBPNAM0= <>
##$DBPNAM1= <>
##$DBPNAM2= <>
##$DBPNAM3= <>
##$DBPNAM4= <>
##$DBPNAM5= <>
##$DBPNAM6= <>
##$DBPNAM7= <>
##$DBPOAL= (0..7)
0.5 0.5 0.5 0.5 0.5 0.5 0.5 0.5 
##$DBPOFFS= (0..7)
0 0 0 0 0 0 0 0 
##$DE= 6
##$DECBNUC= <off>
##$DECIM= 32
##$DECNUC= <off>
##$DECSTAT= 4
##$DIGMOD= 1
##$DIGTYP= 9
##$DL= (0..7)
0 120 120 120 120 120 120 120 
##$DP= (0..7)
150 150 150 150 150 150 150 150 
##$DP07= 0
##$DPNAME0= <>
##$DPNAME1= <>
##$DPNAME2= <>
##$DPNAME3= <>
##$DPNAME4= <>
##$DPNAME5= <>
##$DPNAME6= <>
##$DPNAME7= <>
##$DPOAL= (0..7)
0.5 0.5 0.5 0.5 0.5 0.5 0.5 0.5 
##$DPOFFS= (0..7)
0 0 0 0 0 0 0 0 
##$DQDMODE= 0
##$DR= 18
##$DS= 0
##$DSLIST= <SSSSSSSSSSSSSSS>
$$ [...]
##$SUBNAM1= <"">
##$SUBNAM2= <"">
##$SUBNAM3= <"">
##$SUBNAM4= <"">
##$SUBNAM5= <"">
##$SUBNAM6= <"">
##$SUBNAM7= <"">
##$SUBNAM8= <"">
##$SUBNAM9= <"">
##$SW= 18.05172834244
##$SWIBOX= (0..15)
0 0 2 0 0 0 0 0 0 0 0 0 0 0 0 0 
##$SW_h= 3612.71676300578
##$TD= 16384
##$TD0= 1
##$TE= 0
##$TE2= 300
##$TE3= 300
##$TEG= 300
##$TL= (0..7)
0 120 120 120 120 120 120 120 
##$TP= (0..7)
150 150 150 150 150 150 150 150 
##$TP07= 0
##$TPNAME0= <>
##$TPNAME1= <>
##$TPNAME2= <>
##$TPNAME3= <>
##$TPNAME4= <>
##$TPNAME5= <>
##$TPNAME6= <>
##$TPNAME7= <>
##$TPOAL= (0..7)
0.5 0.5 0.5 0.5 0.5 0.5 0.5 0.5 
##$TPOFFS= (0..7)
0 0 0 0 0 0 0 0 
##$TUNHIN= 0
##$TUNHOUT= 0
##$TUNXOUT= 0
##$USERA1= <user>
##$USERA2= <user>
##$USERA3= <user>
##$USERA4= <user>
##$USERA5= <user>
##$V9= 5
##$VALIST= <valist>
##$VCLIST= <CCCCCCCCCCCCCCC>
##$VD= 0
##$VDLIST= <DDDDDDDDDDDDDDD>
##$VPLIST= <PPPPPPPPPPPPPPP>
##$VTLIST= <TTTTTTTTTTTTTTT>
##$WBST= 1024
##$WBSW= 4
##$XGAIN= (0..3)
0 0 0 0 
##$XL= 0
##$YL= 0
##$YMAX_a= 8861
##$YMIN_a= -4861
##$ZGOPTNS= <>
##$ZL1= 120
##$ZL2= 120
##$ZL3= 120
##$ZL4= 120
##$ABSF1= 10
##$ABSF2= 0
##$ABSG= 5
##$ABSL= 3
##$ALPHA= 0
##$AQORDER= 0
##$ASSFAC= 0
##$ASSFACI= 0
##$ASSFACX= 0
##$ASSWID= 0
##$AUNMP= <proc_1d>
##$AZFE= 0.1
##$AZFW= 0.1
##$BCFW= 1
##$BC_mod= 2
##$BYTORDP= 1
##$COROFFS= 0
##$CY= 11.3945322036743
##$DATMOD= 1
##$DC= 2
##$DFILT= <>
##$DTYPP= 0
##$F1P= 15.7292609196834
##$F2P= 12.9074282941183
##$FCOR= 0.5
##$FTSIZE= 0
##$FT_mod= 4
##$GAMMA= 1
##$GB= 0.15
##$INTBC= 1
##$INTSCL= 1
##$ISEN= 128
##$LB= 0.24
##$LEV0= 0
##$LPBIN= 0
##$MAXI= 10000
##$MC2= 0
##$MEAN= 0
##$ME_mod= 0
##$MI= 1.114404
##$NCOEF= 0
##$NC_proc= 0
##$NLEV= 6
##$NOISF1= 3.799351
##$NOISF2= 2.8
##$NSP= 1
##$NTH_PI= 0
##$NZP= 0
##$OFFSET= 15.70392
##$PC= 1
##$PHC0= -21206.47
##$PHC1= 11.05272
##$PH_mod= 1
##$PKNL= yes
##$PPARMOD= 0
##$PSCAL= 0
##$PSIGN= 0
##$REVERSE= no
##$SF= 200.130013532006
##$SI= 16384
##$SIGF1= 3
##$SIGF2= 2
##$SINO= 400
##$SIOLD= 16384
##$SREGLST= <1H.CDCl3>
##$SSB= 0
##$STSI= 0
##$STSR= 0
##$SW_p= 3612.71676300578
##$SYMM= 0
##$S_DEV= 0
##$TDeff= 0
##$TDoff= 0
##$TI= <>
##$TILT= no
##$TM1= 0
##$TM2= 0
##$TOPLEV= 0
##$USERP1= <user>
##$USERP2= <user>
##$USERP3= <user>
##$USERP4= <user>
##$USERP5= <user>
##$WDW= 1
##$XDIM= 8192
##$YMAX_p= 0
##$YMIN_p= 0
$$ End of Bruker specific parameters
$$ ---------------------------------
##NTUPLES= NMR FID
##VAR_NAME=  TIME,          FID/REAL,        FID/IMAG
##SYMBOL=    X,             R,               I
##VAR_TYPE=  INDEPENDENT,   DEPENDENT,       DEPENDENT
##VAR_FORM=  AFFN,          ASDF,            ASDF
##VAR_DIM=   8192,          8192,            8192
##UNITS=     SECONDS,       ARBITRARY UNITS, ARBITRARY UNITS
##FACTOR=    0.0002768,     1,               1
##FIRST=     0,             0,               0
##LAST=      2.2672688,     0,               0
##MIN=       0,             -4861,           0
##MAX=       2.2672688,     8861,            0
$$ Real data points
##PAGE= N=1
##DATA TABLE= (X++(R..R)), XYDATA
0 0 0 0 0 0 0 0 0 0 0 0 0 0 0 0 0 0 0 0 0 0 0 0 0 0 0 0 0 0 0 0 -2 8 -8 8 -8 8 -8 8 -8 10 -13 16 -16 16 -18 21 -24 25
48 25 -28 32 -34 37 -42 45 -51 56 -61 69 -77 87 -99 113 -132 155 -188 238 -317 466 -857 4356 8861
71 8861 5956 6956 6862 5107 2458 2359 918 -1722 -2767 -1846 -2611 -3522 -2362 -876 -1498 -1236 483 803
89 803 -527 -71 664 -458 -1752 -1037 -1139 -2521 -2587 -1324 -1685 -2226 -948 281 -139 139 1785 2012
107 2012 1194 1791 2568 1563 608 1241 1042 -459 -676 -48 -717 -1485 -643 0 -648 -464 772 905 293
126 293 949 1672 938 397 972 849 -503 -482 -105 -798 -1542 -903 -585 -1265 -1136 -111 -185 -654 37 631
146 631 58 -177 520 358 -544 -415 94 -497 -876 -148 110 -461 -33 874 811 478 1242 1598 994 826 1350
167 1350 879 22 18 252 -647 -1208 -721 -881 -1486 -1258 -584 -803 -985 -256 154 -252 -160 529 418 -132 281
188 281 571 29 -203 428 353 -126 233 728 431 274 843 946 387 502 907 486 -90 118 191 -527 -756
209 -756 -356 -650 -1122 -834 -480 -813 -886 -253 -201 -507 -222 226 -9 -202 231 347 -67 -38 368 200 -187
230 -187 172 433 75 -12 504 448 66 263 593 258 128 488 489 3 73 438 100 -177 107 237 -187 -254
252 -254 120 -46 -338 -149 54 -310 -376 -36 -59 -445 -291 -13 -334 -488 -192 -208 -531 -468 -190 -377 -555 -236
274 -236 -81 -382 -310 159 190 17 324 726 485 422 822 878 513 620 840 556 240 491 506 56 7 271
296 271 84 -180 5 154 -211 -315 -18 -204 -569 -514 -450 -800 -989 -831 -790 -1120 -1023 -613 -634 -674 -188 102
318 102 37 259 688 791 645 853 1071 746 573 806 655 334 341 509 222 13 247 315 47 117 318 147
340 147 -129 -16 -56 -422 -632 -480 -717 -1018 -882 -746 -903 -832 -477 -299 -281 4 393 345 411 645 701 484
362 484 417 529 239 -11 -28 20 -147 -212 26 8 -139 142 376 259 295 480 420 146 129 132 -96 -464 -353 -433
386 -433 -702 -647 -404 -439 -458 -131 26 -5 98 355 318 155 175 206 27 -229 -163 -260 -402 -352 -86 -133 -75 258
410 258 483 482 641 890 843 681 731 683 302 68 -1 -203 -591 -625 -591 -809 -888 -660 -623 -638 -500 -232 -217 -258 -94
435 -94 24 -205 -195 -37 -110 -254 -123 103 87 175 506 717 774 969 1169 1136 1071 1092 963 559 438 239 -100
458 -100 -460 -609 -722 -1024 -1078 -944 -934 -985 -775 -555 -521 -370 -172 -51 -139 -62 71 -55 -131 39 98 38 161
481 161 361 421 391 650 787 697 744 814 709 515 427 305 13 -213 -309 -461 -672 -702 -557 -614 -634 -435 -218 -210
505 -210 -14 190 207 176 340 345 213 99 149 10 -97 -49 -22 -191 -152 -7 35 -67 8 90 14 34 34 -22 -227 -188
531 -188 -211 -330 -449 -334 -232 -287 -159 26 159 178 376 569 519 529 702 648 458 445 397 247 44 55 -45
554 -45 -213 -318 -215 -338 -427 -333 -312 -406 -345 -248 -278 -401 -284 -228 -320 -322 -211 -186 -188 -44 124 129 234 363 498 448
580 448 519 573 503 447 454 525 214 169 151 12 -188 -165 -242 -360 -394 -284 -383 -504 -418 -350 -414 -372 -225 -190 -224 -159 -34
607 -34 -11 55 155 266 236 259 455 419 339 428 463 332 290 359 245 44 110 110 -72 -214 -224 -234 -403 -424 -346 -439 -484
634 -484 -436 -320 -356 -245 -142 -118 -69 56 145 154 173 282 374 303 342 382 283 239 237 191 30 -39 77 -47 -73 -88 -23
661 -23 -112 -146 -12 -77 -169 -47 59 -51 -137 -32 -27 -88 -41 21 85 39 98 195 88 154 233 175 14 -19 33 -193 -255
688 -255 -236 -304 -438 -412 -346 -426 -421 -214 -180 -146 -52 164 224 213 367 485 433 386 517 507 349 359 389 257 219 161 122
715 122 -30 -29 -34 -165 -316 -276 -355 -450 -573 -513 -608 -718 -626 -554 -595 -556 -340 -158 -184 115 276 349 429 604 768 649
741 649 660 751 639 447 470 340 226 110 125 -19 -112 -135 -122 -269 -287 -252 -350 -410 -369 -332 -473 -531 -401 -395 -447 -367
767 -367 -136 -119 -86 129 253 300 387 521 545 485 538 563 396 322 279 184 -23 -15 -65 -192 -319 -262 -311 -340 -305 -285 -282
794 -282 -277 -195 -117 -223 -119 -85 -100 -47 -22 17 21 64 178 309 220 315 330 359 336 415 334 259 193 154 14 -147 -128 -215
822 -215 -319 -305 -308 -332 -437 -355 -219 -280 -228 -84 -30 -80 -14 80 37 79 141 142 72 151 277 205 200 232 344 182 215 250
850 250 179 103 27 47 -78 -150 -128 -262 -388 -370 -351 -381 -381 -198 -159 -203 -85 10 54 31 193 244 236 235 322 298 226 224 304
879 304 172 92 165 174 54 48 70 -50 -131 -107 -126 -301 -314 -283 -346 -345 -289 -239 -316 -270 -177 -146 -79 77 132 112 181 336 282
908 282 276 331 358 324 248 205 170 101 99 53 2 -145 -125 -78 -155 -223 -165 -196 -276 -212 -188 -192 -242 -167 -75 -103 -115 19 57 23 125
939 125 182 153 146 261 193 162 176 181 92 25 59 -1 -85 -56 -52 -155 -205 -125 -95 -156 -109 -62 -101 -82 -68 31 50 48 122 112 107 119
971 119 187 121 100 99 135 -61 53 74 -47 -109 -62 -105 -162 -203 -85 -190 -258 -149 -120 -224 -151 -56 -33 -127 13 75 77
998 77 97 199 190 173 176 262 177 164 242 149 38 25 68 -30 -133 -112 -113 -186 -223 -115 -217 -284 -197 -161 -183 -214 -83 -32 -75
1027 -75 -67 71 94 86 156 204 126 179 251 262 92 195 264 132 83 142 52 -9 -52 -8 -119 -209 -73 -109 -240 -249 -137 -212
1055 -212 -226 -160 -101 -144 -157 -57 -21 -63 25 120 143 68 195 190 155 192 221 154 189 227 123 68 0 42 -23 -86 -29 -99 -159
1084 -159 -245 -96 -249 -249 -120 -97 -171 -182 -68 -34 -110 -13 47 28 6 105 179 122 129 191 216 186 203 185 161 105 119 123 16
1113 16 55 49 -135 -140 -98 -141 -200 -238 -140 -219 -286 -186 -134 -149 -165 -26 -32 -56 8 78 108 75 136 173 128 94 217 199 136 148
1143 148 213 142 70 99 119 -114 34 -37 -104 -175 -79 -142 -255 -250 -165 -180 -203 -107 -106 -95 -66 55 55 4 135 154 72 33 178
1172 178 133 -27 141 195 -9 57 96 54 18 49 78 46 -52 -42 -24 -29 -71 52 -54 -111 -52 -105 -74 -40 -1 -29 -66 30
1200 30 57 24 -18 27 94 23 -12 30 -49 -106 -63 -61 -147 -117 79 -45 21 38 65 -27 48 149 108 74 75 123 59 9 100 71
1230 71 -39 -38 11 -3 -45 -15 -10 -61 -81 -30 -74 -134 -136 -132 -120 -155 -56 -78 -208 -86 -26 -34 -58 58 194 124 151 200 220 193
1260 193 208 205 136 112 90 48 -47 -55 -2 -53 -198 -141 -109 -179 -164 -161 -162 -179 -103 -51 -92 -127 -92 -59 -72 43 20 87 79 151 131
1291 131 120 144 229 173 110 135 190 125 34 61 -1 -73 -47 -109 -120 -170 -104 -29 -141 -105 -76 -31 -78 28 14 24 59 80 70
1320 70 51 82 69 40 35 72 59 -5 47 70 -15 -88 -65 -1 -109 -67 -43 -109 -139 -70 -66 -151 -100 -56 -27 -67 -17 14 89 59 81
1351 81 125 140 98 140 150 108 145 99 77 140 47 84 27 -17 -10 -75 -129 -144 -160 -186 -162 -154 -116 -177 -110 -174 -192 -118 -68 -99 -52
1382 -52 -1 6 53 6 49 120 144 109 180 59 98 210 134 114 86 95 106 -16 21 -4 -73 -95 -59 -68 -120 -111 -183 -131 -119 -101 -14
1413 -14 -110 -74 -20 -17 13 38 68 6 19 60 20 19 61 63 63 60 45 39 32 51 64 39 53 32 -12 -33 -73 -18 -115 -144 -112 -85 -124 -78
1447 -78 -6 1 12 57 113 85 123 139 109 44 21 -33 -26 -50 -27 -41 -134 -63 -68 -53 -52 -38 -21 -54 -2 34 14 33 34 6 37 19 47
1480 47 47 -2 72 127 63 44 159 130 97 106 83 24 -71 -37 -162 -180 -184 -227 -246 -273 -258 -279 -203 -180 -50 -106 -59 77 93 133
1510 133 174 227 256 239 204 258 215 171 265 230 177 187 163 144 48 43 26 -34 -89 -159 -220 -296 -266 -370 -400 -377 -387 -334 -318 -229
1540 -229 -144 -116 4 88 150 192 318 317 321 277 325 266 218 217 212 199 112 85 80 -7 37 4 -76 -23 -113 -131 -156 -166 -206 -264 -277
1571 -277 -268 -202 -224 -195 -142 -103 6 65 107 151 128 217 233 232 162 218 148 86 92 21 -47 -59 -89 -112 -111 -112 -134 -76 -53 -74 -51 -56
1603 -56 -42 -56 -7 -38 7 -39 -36 20 20 22 9 80 102 171 144 145 148 116 98 141 59 -10 -39 -106 -169 -192 -172 -245 -208 -234 -193 -139 -77
1636 -77 -79 -40 -21 42 18 109 87 102 113 127 113 88 78 105 165 164 136 101 105 70 54 15 -23 -16 -28 -93 -129 -161 -156 -180 -207 -186 -195
1669 -195 -152 -119 -110 -57 -15 32 90 99 107 106 117 169 162 189 171 112 108 131 72 155 27 1 -41 -45 -47 -109 -59 -115 -98 -194 -180 -175 -195 -205
1703 -205 -192 -138 -107 -54 -79 -24 7 67 80 72 111 132 145 132 196 128 176 121 106 118 121 48 41 39 -54 -34 -88 -126 -118 -95 -63 -115
1735 -115 -14 -92 -61 -104 -50 -28 -4 -70 -10 -13 -66 -2 11 77 13 58 31 45 30 23 -21 -7 -20 16 20 -91 -46 -57 -21 22
1765 22 -35 -35 20 39 28 20 116 148 168 171 171 190 151 147 114 108 55 54 7 -63 -136 -161 -171 -193 -195 -224 -206 -204 -133 -160 -163 -136 -42 -54 -133
1800 -133 -3 -48 47 40 62 94 109 177 206 194 248 291 236 240 239 185 172 96 69 33 -51 -101 -169 -195 -264 -257 -302 -263 -244 -198 -231
1831 -231 -149 -121 -80 -13 7 5 38 -10 114 76 64 65 103 117 133 184 208 149 154 164 162 117 62 91 -14 -71 -102 -110 -164 -195 -289
1862 -289 -216 -248 -184 -154 -75 -28 -55 -3 40 10 102 77 68 67 56 12 42 30 -15 61 93 111 94 103 77 131 77 128 47 17 -48
1893 -48 -38 -26 -73 -101 -112 -190 -118 -141 -152 -45 -50 -76 15 5 34 75 58 14 52 23 -8 -4 -37 -6 -19 -3 -48 -65 -27 7 52
1924 52 -9 99 92 23 59 28 -43 -26 -27 -14 -17 -32 -24 -25 1 40 -39 30 95 105 119 70 70 72 -4 3 -23 -49 -124 -123 -151 -137 -160 -104
1958 -104 -86 -76 -86 -46 -11 -16 14 27 30 -15 -2 10 23 -13 63 37 137 76 83 80 157 114 154 196 113 134 71 10 -55 -50 -125 -121
1990 -121 -123 -199 -134 -125 -129 -112 -141 -69 -80 -114 -36 -32 -23 14 16 -59 11 25 -59 -38 71 0 53 65 115 92 89 59 83 77 32 42 44 54
2024 54 -23 -23 -64 -42 -88 -3 -34 -53 -64 -60 -12 -7 -5 -11 7 -41 -12 -3 -67 -24 -65 -138 -55 -84 -42 -64 -50 -65 -69 -58 -5 41 -9 -27
2058 -27 91 36 76 7 94 63 27 48 134 50 105 32 9 84 46 67 4 -16 -51 -36 -25 -62 -53 -107 -138 -152 -92 -155 -102 -113
2088 -113 -30 -56 -67 -41 -48 54 21 87 9 137 51 79 108 79 93 156 110 54 46 26 61 34 8 -27 -15 -113 -102 -73 -99 -132
2118 -132 -142 -78 -140 -139 -43 -74 -61 37 -2 -20 58 9 49 46 69 84 107 118 121 87 76 125 68 99 122 47 47 23 -2 -42 -39 -37 -19
2151 -19 -11 -88 -69 -82 -118 -70 -46 -38 -40 -78 -47 -84 -75 -79 -7 -59 -52 -49 -64 -29 31 42 73 44 47 110 127 38 55 93 75 38 17 -3
2185 -3 26 62 19 -26 -6 -14 28 31 75 44 24 8 -4 -57 -7 -20 -51 -113 -107 -103 -139 -127 -75 -113 -81 -52 -72 7 20 26 4 19 5
2218 5 13 12 22 17 0 -37 -30 -43 -3 54 80 61 95 116 98 130 33 53 24 -22 -10 -53 -47 -105 -51 -52 -133 -77 -35 -108 -64 -29 -45 -4
2252 -4 -41 -26 23 10 5 -48 -42 -59 -40 12 14 52 -2 79 62 67 42 105 98 16 28 14 -16 -2 -46 -73 4 -64 -59 -48 -87 -18 -62 -26
2286 -26 -17 30 -8 19 37 31 39 -16 15 13 -7 12 0 -48 19 -10 -4 101 -6 13 7 6 -23 -15 -2 -79 -19 -35 -93 -2 -30 -21 -42 70
2320 70 -51 77 82 48 83 104 60 39 67 26 5 -48 -43 -64 -11 -61 -79 -92 -111 -71 -92 -55 -42 -13 -31 -54 -32 -40 -21 18 38
2351 38 66 82 24 91 109 99 101 125 107 65 158 142 65 17 19 25 -39 -163 -91 -106 -107 -158 -185 -139 -110 -112 -96 -54 -52 -50 1 18 -4
2384 -4 33 45 91 61 139 174 156 113 97 117 131 105 108 54 62 47 1 -53 25 -48 -95 -69 -73 -127 -148 -107 -120 -60 -154 -87 -73 -113
2416 -113 -45 -43 -52 -22 -8 23 26 84 31 80 96 -13 91 93 35 38 58 59 23 62 -19 49 -36 -16 -5 -24 -49 -15 -40 -67 -87 3
2448 3 -31 -66 7 18 20 8 44 -13 -17 -21 29 6 3 -26 34 9 -27 31 -12 -54 -80 -19 -56 -6 -80 -50 -19 -7 -17 -10 9 21 31
2481 31 -10 9 32 50 20 31 49 76 30 82 14 -3 8 32 -10 -36 -28 -94 -56 -113 -85 -38 -87 -76 -1 -25 -88 -50 -65 -38 -10
2512 -10 -27 32 24 40 43 43 130 63 116 47 77 65 58 11 12 -5 27 -39 -43 -52 -34 -44 -57 -48 -63 -21 -101 -50 -18 -141 -57 -18 -72 -41
2546 -41 -15 4 25 47 80 44 68 60 55 69 91 75 48 66 -8 -2 -16 -53 0 -70 -17 -46 -131 -133 -51 -128 -52 -32 -54 -40 -34 -77 -42
2579 -42 -11 4 -5 92 23 -5 23 11 95 48 103 48 72 51 63 -2 17 -22 -34 -68 -69 -99 -95 -87 -61 -58 -115 -57 -30 0 -10 -1 69
2612 69 31 -36 96 111 63 74 93 37 45 95 36 52 34 -10 5 -1 -32 -40 -34 -22 -105 -67 -65 -101 -69 -99 -53 -117 -95 -75 29 17
2644 17 44 58 21 151 68 71 124 119 120 52 121 66 32 49 10 -22 -16 -73 -105 -79 -24 -118 -35 -170 -111 -100 -131 -85 -104 -127 -61
2675 -61 -13 -6 -19 -7 39 13 75 29 131 108 63 140 73 83 46 62 17 70 13 -28 -56 -67 -84 -23 -89 -14 -54 -51 -17 -18 -26 -66
2707 -66 -10 -40 -17 24 -6 45 24 21 32 -15 38 53 47 80 9 -5 -30 13 3 22 -76 -2 -37 -59 -36 13 -15 12 -31 -16 -10 -58
2739 -58 -26 -2 0 -8 -4 -37 7 30 43 16 55 -35 69 56 81 14 1 20 34 70 33 2 -28 40 -41 26 34 6 -51 12 14 29
2771 29 0 -21 -22 8 13 -1 40 15 59 82 77 80 30 15 -17 41 14 -28 -81 -22 15 -20 -16 5 -53 2 -59 -93 -36 7 -25 -9 2
2804 2 -35 -28 47 30 20 21 21 26 -5 41 87 10 68 29 31 63 35 44 -28 -32 -47 -36 6 -82 -19 -40 -67 -52 -85 -55 -44 -34 -48 29
2838 29 -37 8 74 16 22 33 1 79 64 39 54 29 -40 -4 54 -14 43 27 -28 3 54 -40 -50 -57 -21 -37 -41 -9 -52 0 -24 -24
2870 -24 9 -6 13 -35 -5 47 52 32 77 68 60 33 25 6 67 0 -12 -37 -58 -13 -23 -49 -69 -97 -57 -45 -32 14 -56 -19 6 -11
2902 -11 -19 -7 29 43 40 46 62 44 33 85 42 47 32 -9 76 66 11 1 -24 -35 0 12 -42 -51 -62 -53 -53 -43 -13 -37 -82 -13 -24 -82
2936 -82 -25 11 14 29 83 -10 44 32 73 -9 3 65 17 35 12 24 -31 -27 -17 -2 24 -1 14 -37 -10 0 9 -50 -77 -43 4 -8
2968 -8 -11 -39 18 -6 34 -20 -53 -20 9 2 -38 19 34 23 -3 35 -44 -30 -19 11 53 30 -9 -22 -12 -27 0 -21 4 -37 -7 33
3000 33 -25 -9 -47 4 11 -10 -8 19 -11 -18 0 8 -9 -7 40 10 -2 -19 -14 -26 9 24 -23 -71 41 -36 10 9 -30 23 -13 -2 24
3033 24 42 -39 44 2 43 34 8 7 6 -37 13 54 9 -7 -10 -51 11 -20 -21 26 17 5 -9 0 4 -33 -80 -33 32 -58 -13 -52 13 -9
3067 -9 -47 -10 37 -21 3 -8 27 32 -24 -5 -3 1 2 -19 -58 -26 -52 -40 -28 24 -50 -36 -63 -49 -4 -8 -22 17 16 -18 -25 -18 8 -3 -15
3102 -15 47 -4 -5 26 -15 -26 13 8 14 16 -37 58 13 -2 -7 -1 -47 -17 8 -5 -13 -3 -23 3 24 -16 3 9 -58 6 31 33 20 83 -29
3137 -29 69 -9 17 1 -38 0 -12 -10 9 -75 17 -40 -110 -13 -42 -53 -2 -53 -21 -24 -52 13 -13 36 22 15 36 -35 27 71 -13 35
3169 35 14 27 28 27 32 14 30 -9 13 -38 -68 -44 -72 26 -70 -46 -46 -42 -46 -35 -49 -53 -22 -12 10 34 49 -29 22 56 36 30 29 55 51
3204 51 59 85 2 51 -38 42 -40 41 56 -8 43 -54 23 -54 -54 -23 -29 -57 1 -64 -74 -44 2 -14 -28 -14 14 -20 -8 -9 -1 7 -3
3237 -3 27 12 6 1 51 -43 1 59 -10 -2 -16 20 29 -7 -51 -22 -20 -27 3 30 23 59 55 -12 -22 9 -12 10 19 -54 -1 -16 -42 12 -22
3272 -22 4 -14 -54 -10 -31 -48 -7 -22 -7 25 -14 35 52 -5 -26 50 57 -35 -13 47 16 53 41 71 37 34 2 20 -1 4 -34 5
3304 5 -41 -31 34 -4 0 -5 -27 9 -58 0 -54 -27 -17 -34 -8 -16 -19 22 1 27 -2 -7 35 -15 88 20 18 68 7 3 59 5 10 19 -7
3339 -7 46 -34 -36 -54 -46 -29 -9 -57 -83 -28 -24 13 -57 -21 1 -40 -21 35 23 -10 -24 37 4 51 26 64 44 21 39 34 6 -28 -77
3372 -77 -68 0 -38 12 -10 -24 -16 -10 -10 -30 -33 -43 10 18 -45 -52 22 -4 -45 -11 30 22 -28 13 -19 25 13 -27 -35 59 23 -45 3 -20 -34
3407 -34 -103 -44 -63 -49 -25 0 -46 -16 -23 18 -25 2 11 14 0 32 43 35 38 -29 48 60 23 -7 45 -18 -32 -34 -16 -31 -14 -8 -8 -55
3441 -55 -35 -60 -96 -81 -25 -54 -54 -26 -47 -53 23 -10 -14 82 71 52 12 82 7 77 26 30 39 36 26 -14 40 -38 -44 -43 -32 -32 16 -54 -59
3476 -59 -39 -70 -36 -52 -76 17 20 -77 -6 -48 -26 33 25 3 38 33 61 5 8 45 10 23 9 14 11 23 -1 56 -23 -11 23 -56 -5
3509 -5 -17 -29 -42 -57 -50 -31 -24 -27 3 1 7 12 2 -21 -10 59 -7 -26 30 59 -55 8 -51 -30 0 -7 28 -31 -35 26 -25 -3 -36 6
3543 6 7 -39 -7 -1 -1 0 26 2 4 -37 44 3 25 3 -29 14 39 3 23 29 -20 -14 7 -4 38 -8 -38 -44 -4 -46 5 52 7 6 -39
3578 -39 69 -31 55 54 5 -16 39 5 15 37 -3 -15 -1 -1 18 21 9 13 5 -39 -50 8 -39 -51 -64 -77 -81 -54 -30 -42 -31 18
3610 18 -41 -33 -44 14 65 18 -32 76 15 63 12 6 -15 23 74 94 2 30 39 -14 -25 5 -57 -5 -63 5 -44 -18 -36 -18 -44
3641 -44 -52 -70 -78 -73 -15 7 -65 -26 -6 34 33 25 109 69 40 11 63 35 1 41 51 -47 -14 -34 17 -6 -8 -19 -19 44 -4 10 -20 24
3675 24 -8 -97 -4 8 -42 -31 11 1 1 -41 15 19 -14 0 -30 -15 15 4 4 -42 -7 -32 30 37 -1 -44 -24 -50 -21 13 -86 -39
3707 -39 -42 0 25 20 -22 -8 17 -3 12 75 27 46 5 2 58 62 12 58 -33 -21 2 0 -50 10 -33 -67 -42 -27 -45 -94 -10 -43 -12
3740 -12 -6 -21 -14 -4 65 25 39 -23 -16 31 3 31 58 63 51 36 59 41 28 -30 15 25 -16 13 -24 -2 -10 -39 -27 -19 -34 -36 -57 -29
3774 -29 -38 -43 -82 -40 5 -33 -25 26 16 36 24 25 38 -5 23 63 -4 8 31 37 -30 -15 51 2 0 -23 -6 -29 60 27 7 -24 -14
3807 -14 1 -31 -47 -21 11 -40 -3 -27 -34 -14 -9 -18 6 -74 -34 12 -5 21 17 -3 -5 81 -22 50 -39 -22 -32 -37 -9 -3 5 48 -8 -26
3841 -26 8 -16 18 2 12 2 -39 37 16 -19 24 -33 5 -79 -22 -53 13 11 -52 2 5 24 31 53 -63 -19 -7 10 23 4 43
3872 43 29 4 25 -32 61 5 18 34 28 -18 18 9 3 21 21 1 -41 32 -11 -81 -29 -34 13 -58 -4 -53 -23 -43 -46 -42 -34 -23 0 6 17
3907 17 67 -12 -5 11 -1 -34 13 -2 71 23 30 44 -19 -15 -8 33 10 -20 -47 8 18 -31 33 -35 23 -7 -55 -5 3 27 -40 -22 -18
3940 -18 -5 -19 -7 10 -43 -26 -42 -38 -28 -43 2 3 -45 -5 4 -43 76 -34 12 -15 -23 29 -14 -14 -4 -20 -19 -8 -11 34 -6 -3 18
3973 18 -42 64 20 -6 -32 -47 -43 -4 -13 31 11 -17 -7 50 -43 -3 -22 16 -53 -32 4 -33 -64 -30 -21 27 -2 -1 59 -28 3 17
4005 17 14 14 36 60 23 -6 32 15 7 20 30 -24 25 -66 17 -40 -12 5 -49 -76 -26 -1 -44 -17 7 -14 -14 4 20 6 17 -35
4037 -35 2 -30 22 4 28 -13 2 60 2 40 -30 -10 28 -7 28 -28 -22 21 -65 -36 44 7 -40 -20 8 -51 -47 -106 -40 -24 -61
4068 -61 8 36 6 1 -6 -4 -19 -38 -43 15 32 -1 -43 -7 -9 2 36 10 2 -14 -14 -5 8 -2 2 -41 -56 17 -22 11 37 -26 -47 53
4102 53 -73 -8 9 -31 -54 -43 -4 -35 -55 -7 -39 -79 -15 -55 -85 -7 14 -31 -49 -27 -13 -19 -8 2 8 -24 37 22 -3 -20 14
4133 14 -5 40 62 69 31 -13 -22 -4 48 12 -22 32 -24 -7 -39 3 -35 -76 -40 -29 -46 -5 -14 1 -25 -47 72 11 5 55 -1 -10
4165 -10 1 -18 -4 16 0 30 1 -1 -5 -11 -7 35 12 35 -50 -36 26 -3 -17 -43 -10 25 -76 -54 -72 -2 7 -55 7 34 -1 -20
4197 -20 -22 -41 -15 38 15 18 14 21 -2 -8 -14 -20 -54 37 18 -24 16 4 -23 -26 -63 -3 -32 -5 5 2 -28 -46 -25 -12 17 -6 23 -25 -20
4232 -20 -26 23 54 2 30 56 30 15 18 14 35 -32 -5 -31 -37 9 31 -4 31 54 -42 -15 6 33 -16 -50 -19 -32 19 22 20 -14 24
4265 24 57 10 53 39 -12 -19 -23 69 -4 2 12 -38 8 -20 22 -10 -37 22 -63 -28 -13 -10 -5 6 -12 16 2 5 58 27 44 17 -3
4298 -3 61 14 43 -22 16 -6 -39 -30 -1 29 11 42 9 -4 -2 -68 -67 -13 -32 49 -27 -27 48 32 8 -42 -40 -37 -17 -24 3 -9 30 -24
4332 -24 -28 11 -16 12 18 -4 -58 -17 -5 13 -55 11 21 -17 -29 -38 29 -2 -57 -10 -3 -24 -39 -15 71 21 -21 -37 -15 54 6 -13
4364 -13 16 -5 -7 -15 50 -58 -42 13 -44 2 -39 -23 -30 -15 -40 2 -35 -21 -5 -39 -57 -38 19 -12 31 14 -25 7 15 4 5 -12
4396 -12 8 52 60 -20 29 31 4 5 11 -22 -15 26 -14 -63 -54 -78 -43 -8 11 -23 9 -33 42 -5 -40 -66 37 -51 33 -16 -6 -1 16
4429 16 -8 59 22 -32 -3 6 10 32 3 -34 -5 -2 18 -27 -29 -32 -8 14 23 -12 -16 -2 -13 41 20 10 3 -20 -34 48 2 -10 -9 7 35
4464 35 -46 11 -12 -34 -10 -17 -36 -73 -12 20 4 -33 11 -45 10 -12 1 -71 5 -15 -18 -47 -8 38 39 -43 24 4 -14 -2 15 -28
4496 -28 35 9 -56 49 20 57 23 -27 -12 -22 -18 -16 -12 5 -40 -43 -72 -46 21 -6 -29 -23 -2 59 12 -9 -29 -13 -9 34 31 6 -12
4529 -12 48 -10 16 9 -11 -31 -42 17 56 40 -49 -38 -12 -42 -52 -18 -37 34 -73 -14 -2 0 -17 17 11 -11 26 -5 2 12 4 29
4561 29 -12 5 53 20 40 26 -5 -39 -13 -30 -28 24 12 -37 -22 -18 -31 7 17 3 -72 -22 7 6 11 20 -22 -50 7 72 -12 -14 -15 -3
4595 -3 36 -35 53 -54 26 17 4 14 15 -30 15 -30 11 22 14 34 -14 32 -13 -14 35 9 34 41 -23 17 -30 19 32 31 -25 46 13
4628 13 64 24 1 -15 -28 -30 -20 1 -23 9 -39 -20 13 47 -17 11 -16 1 -75 2 20 -69 -23 63 -6 -3 24 1 42 -16 -27
4659 -27 -4 25 -7 -36 -27 -23 -7 -28 36 -20 -25 -48 -18 4 -62 -55 1 -22 41 4 26 16 37 21 19 -14 -37 17 -23 -32 41 49 21 10
4693 10 -6 -26 -40 -13 -33 -14 -32 9 16 -25 13 37 -52 -75 -9 29 3 -10 -64 21 20 -35 -18 -3 11 -44 -17 -7 -4 -7 34 -21
4725 -21 -29 -49 19 -17 -53 7 -19 -36 -33 8 -9 -3 27 -59 -13 -69 -6 -31 -11 -1 -14 -48 -48 14 -22 11 0 -26 55 25 16 -13 -6
4758 -6 36 3 -19 2 29 19 22 21 -41 -22 1 9 30 -16 47 3 -12 -7 42 -3 42 -6 -8 -23 -11 -43 -11 9 24 -3 -20 -20 -27 41
4792 41 -27 -29 -32 -15 -6 24 -2 -30 9 19 -10 25 6 -2 35 -43 1 16 -12 22 -37 -30 11 0 -29 8 76 -2 -13 -48 -14 14 -82
4825 -82 -26 -1 -13 12 -84 10 -26 31 -3 -20 -49 -25 -13 -38 -11 16 -65 -5 -45 -16 -30 26 -18 -25 14 5 26 45 -1 83 0
4856 0 18 -34 12 34 -8 -65 2 -28 -15 -27 -5 -24 -52 35 10 9 -20 21 24 -15 1 -13 26 -37 -11 -39 -27 1 27 29 11 20 -1
4889 -1 -54 -13 -67 -25 -8 -20 -56 -9 2 -6 -1 -24 -30 26 101 45 -40 -25 -38 60 0 27 17 -8 -9 -40 -34 -14 7 -8 0 14 -20 -15
4923 -15 -21 9 -25 -53 45 -4 -7 -53 -15 -36 -57 2 -45 13 0 36 2 11 -23 14 52 23 35 3 8 -8 -7 -55 -27 7 52 -13 -34
4956 -34 -24 73 -49 1 8 -30 -67 25 8 -41 -52 0 -9 -40 -6 -42 9 26 13 45 15 11 45 -4 21 4 3 -18 -23 -58 -21 19
4988 19 21 -49 49 63 -31 -13 -9 -39 -25 28 -25 34 -10 5 63 -4 2 36 -47 9 -5 -13 -42 -68 4 -4 34 -50 -28 -11 -3 17 -65
5021 -65 -39 -21 -19 -9 27 6 30 20 17 -20 7 -20 -11 -60 18 -7 -3 0 35 -46 -2 21 14 12 9 -33 -25 4 52 34 18 -9 -6 -31 -48
5056 -48 -18 -59 -82 -4 43 55 19 -49 4 -58 31 -8 34 17 -12 0 -29 -28 41 58 58 -1 -33 3 -23 -57 -31 -37 19 -54 3 -5
5088 -5 -34 16 -26 11 48 -25 -24 -14 11 43 2 -34 -18 -10 -9 -30 -1 -27 34 38 -32 -15 -22 -21 -14 16 -24 -47 0 22 -12 9 -3 -7 -2
5123 -2 -8 17 -2 -34 -34 11 -2 4 0 -35 -30 -4 12 -62 2 -6 -12 -12 17 20 -12 -19 1 34 12 26 11 6 16 13 4 -52 -29 -12 -6 -26 17 -6
5161 -6 15 16 50 2 13 19 -47 13 5 13 -20 6 -46 1 -6 -17 -16 -5 -33 5 -9 25 3 -19 -16 -16 20 -1 20 33 13 -46 15 19 13 50
5197 50 13 -21 -12 42 49 -17 48 41 21 38 -20 -15 1 -8 -24 30 42 -56 -47 18 -35 -3 -31 -15 -15 -87 -96 -3 2 -18 14 -6 2 10 50 6
5233 6 27 0 -2 -4 -25 -10 56 68 27 18 0 16 -38 -34 16 -8 -36 5 33 11 -23 -33 19 -36 10 32 2 26 3 8 -11 -26 -38
5266 -38 -3 -51 2 -40 -13 -23 -4 30 -13 67 -6 29 43 26 -2 15 -21 12 47 10 -51 -29 -13 11 -12 -15 -3 21 20 27 -7 23
5298 23 -48 18 -38 36 -1 26 -33 12 73 -24 -40 -28 -22 13 28 -7 -38 5 35 14 -2 58 -47 -31 -8 38 5 41 26 65
5328 65 -34 -16 22 1 38 -57 59 -57 -37 32 15 2 -15 23 27 -18 45 -46 28 -17 -20 -55 -28 37 -21 7 5 -16 19 -2 2
5359 2 -42 7 23 4 65 36 33 -18 8 42 10 37 5 43 75 -34 8 -21 3 8 -13 -28 14 -16 -36 -2 40 31 66 -18 -29 -26
5391 -26 -1 -15 -43 43 -21 -53 -38 -4 24 -31 -42 1 30 32 13 20 -7 32 8 19 -3 15 -50 -14 -41 -21 1 -21 -24 18 -24 56
5423 56 23 -26 -5 29 -23 35 -9 -12 -27 -28 5 21 -18 -60 8 -13 -24 -19 11 -32 14 17 -2 29 -8 14 -12 -10 15 -9 33 -2 15
5456 15 7 23 -33 42 8 -11 8 58 28 -11 50 21 -8 -51 23 -39 -21 -14 71 27 -54 -3 -64 39 -6 1 -62 -43 -33 -1 -47
5487 -47 -56 29 13 -11 44 -8 -17 34 46 12 -19 -8 14 -20 -52 -20 9 14 -26 -9 -15 37 -27 -28 -10 -32 3 -13 52 -13 24 99 -13
5520 -13 6 31 1 14 -43 39 24 11 36 22 -13 16 41 19 18 14 26 58 9 15 -23 18 -32 1 -12 -21 -19 -16 65 46 -13 -31 -34 13
5554 13 16 49 11 -21 -18 41 12 -15 -24 30 6 -2 -12 4 -17 24 -71 23 -23 -3 -3 -37 -51 -7 28 20 11 45 3 13 7 -17 5 -10
5588 -10 -14 -13 -15 -3 -14 -1 24 0 28 20 -4 15 -17 -40 27 2 29 4 10 -39 -16 35 31 1 -38 20 18 -5 -9 20 4 -19 22 22 -20
5623 -20 -29 -5 33 3 19 -37 14 29 -3 -74 33 33 -22 -55 14 -48 -26 -6 3 39 1 -6 18 2 -24 9 -23 31 -3 -15 22 -21
5655 -21 -61 -28 21 24 -2 -45 -15 -22 14 -10 6 -28 8 -17 -1 5 -35 20 -66 78 -1 9 14 -12 2 -57 -45 -2 21 28 -18 7
5687 7 -41 27 30 47 -52 13 9 -68 6 60 11 22 3 21 43 -9 33 -9 5 0 15 11 7 4 -9 35 -7 -20 30 -34 -8 79 4 54
5721 54 17 -27 -7 -46 -15 -26 -23 7 -31 32 -34 9 26 10 -44 46 -30 25 16 10 -5 -34 30 -12 37 -9 -15 9 51 15 -2 35
5753 35 -54 23 -29 -27 27 -2 -27 -9 -9 -18 18 -72 17 -30 56 -6 -23 -1 13 -8 -84 -54 19 26 -38 -8 9 -27 -54 47 17 -5
5785 -5 -12 37 32 -24 -18 12 -49 -8 -31 9 -13 -20 -2 4 24 10 -19 -35 -27 -73 19 -49 4 32 -52 27 7 26 -12 14 21 -32 64 -24
5819 -24 -11 6 -54 -4 -26 -5 6 -51 -6 -39 -43 -44 20 -3 -32 -8 31 -1 7 -25 14 -64 -33 9 -1 -39 -29 8 -34 5 -18 -15
5851 -15 -44 7 4 -44 -34 1 -51 -13 -24 24 4 -44 33 13 -19 -18 -20 6 -42 12 25 48 11 24 -39 -14 -3 -65 -14 -17 49 26
5883 26 57 -31 5 44 -24 35 27 1 -2 0 36 -17 -10 -38 -22 -29 -7 40 7 17 -25 -28 -54 -20 43 -9 29 38 12 -8 17 0 25 6
5917 6 -31 -18 35 -32 -44 -34 11 0 2 -28 -10 -20 -16 8 21 6 -45 -4 38 2 12 8 -37 1 -8 -27 -14 11 -34 14 11 29 13
5950 13 -2 -24 -44 16 60 -13 -36 -5 -65 -8 -41 13 14 -53 41 49 -15 -60 -47 -47 22 10 13 -56 -4 32 36 -13 8 -14 -4 55 -34
5983 -34 29 -2 -31 -13 14 -10 24 30 -8 -5 -25 -17 43 -2 16 11 13 17 27 -5 2 5 34 -29 48 13 -28 15 12 26 -5 56 -13 62 -28
6018 -28 -15 -30 -56 -61 -42 13 10 11 -35 21 37 13 -10 -8 12 0 21 3 3 4 3 38 10 14 -4 21 -14 31 -39 23 -21 43 51 17 -27
6053 -27 -21 41 -7 56 0 20 -3 10 -23 32 11 -4 -49 -4 39 -3 -50 -4 7 2 -16 -9 41 -11 0 -7 11 -8 -8 -31 51 35 3
6086 3 23 31 30 -48 9 25 -43 -49 6 -41 -37 -4 -21 -50 37 -22 11 -32 -24 -26 30 -13 -28 -36 -11 19 8 44 9 34 7 -40 -8 -11 46
6121 46 -39 -55 -12 4 28 -31 -40 19 -7 -34 34 -12 -14 -16 -22 0 13 -43 -39 29 52 14 -46 -27 -48 -52 54 -7 16 -24 -5 -28 6
6154 6 19 -30 -34 -1 -1 -30 -17 -60 8 35 -20 -23 20 48 28 35 -56 29 -6 22 -42 -9 15 64 -3 30 45 -38 52 9 -26 4 -38
6187 -38 29 9 -26 -7 11 -5 4 -56 47 -15 -13 -6 13 35 -5 44 15 -25 -35 20 -38 -5 -3 -20 1 45 -10 -11 38 -7 5 -41
6219 -41 -17 -3 43 -29 -2 15 -8 9 -13 -3 -30 27 -38 27 -23 -10 -24 3 -32 -69 5 -1 27 -57 5 -11 39 -12 31 26 23 21
6251 21 28 -12 -2 -1 39 -4 0 -18 38 58 -6 18 -8 -9 -1 12 26 35 16 15 36 -23 -35 -4 -32 28 -31 -66 15 -10 -1 -50 -20 32
6285 32 7 -36 -44 26 -20 -19 46 6 28 35 -69 49 -33 21 -3 16 -4 -32 -21 -36 -20 -41 5 12 -43 22 10 -41 -33 8 -9 -48
6317 -48 -18 -9 5 -25 -23 -41 32 -17 -26 77 -63 -7 -24 18 -24 -33 11 -63 15 -6 -18 19 18 47 -4 28 12 -37 -32 -10 4 46
6349 46 28 -10 -29 -43 -2 12 -17 -16 29 11 -54 0 10 -20 -4 -41 -25 -55 33 -27 5 -39 1 -20 28 -4 -18 -26 -27 -12 -27 -23
6381 -23 23 -40 8 10 -45 -63 -30 59 10 -29 18 64 -24 6 -11 -18 3 20 -34 -56 3 -21 -30 37 -18 -45 -29 -12 -26 -12 3 6
6413 6 37 -1 -59 -8 -8 35 -46 1 -1 6 23 7 13 41 26 -33 23 24 -9 28 22 30 2 -43 -24 -38 -39 -42 20 2 -48 28 -40 52 -26
6448 -26 36 2 17 -28 -31 -11 19 -37 -6 69 18 22 -13 -47 -15 14 -18 45 11 2 -16 75 26 17 26 29 16 65 -2 19 -24 -50 -42 -7
6482 -7 -20 -18 -15 27 4 -24 21 -22 -13 -39 -10 -33 -17 5 28 51 -47 19 -62 -26 1 23 52 -6 17 1 21 36 24 23 -47 -54 45
6515 45 12 -65 1 -13 11 29 54 28 0 -9 -35 -19 -8 31 17 -11 -63 -4 46 -2 6 10 -35 -36 10 -16 -15 0 39 -63 -3 -17
6547 -17 12 -58 -28 7 -10 22 -13 -45 -11 29 8 -23 -9 12 -14 3 -33 22 65 24 5 -50 104 2 11 -68 55 6 -43
6576 -43 8 8 -23 -21 45 -25 11 23 -15 14 -9 47 -16 15 26 -1 -16 11 2 49 15 47 -1 -29 -3 3 23 -9 12 -20 46 -4
6608 -4 -2 -40 12 17 72 -17 6 37 21 10 -7 -83 -36 -6 -33 -29 -2 -8 -23 67 -11 -9 50 29 18 -31 -10 0 -27 -22 20 -8 -7 23
6642 23 23 12 36 20 14 -20 6 16 -6 1 15 -13 4 9 -6 16 41 -23 -8 -22 17 10 -11 8 52 -4 -1 -34 -14 -23 -9 26 -22 -2
6676 -2 35 -9 -41 14 12 37 -22 -8 -14 35 -15 1 43 1 8 -27 -53 -24 -13 -17 -48 36 -17 -7 8 -8 -16 7 24 12 60 17 2
6709 2 -50 -37 33 -38 -17 39 -10 -19 -23 58 28 12 -35 -51 -9 -10 -15 -30 -15 -37 10 -23 -9 5 -4 -22 -17 -26 -22 -44 -14 10 -21 -14 25
6744 25 -15 5 -3 5 49 34 -9 45 6 -2 49 14 -23 5 -9 3 11 14 28 37 -18 -5 19 -25 -30 -27 -21 -3 12 75 -4 -13 0 42 6
6779 6 -42 20 -30 24 -2 -4 -3 4 16 7 -20 -20 -16 -8 -34 1 -5 -7 -38 -11 -7 6 21 33 -6 40 -12 25 -7 -6 24 -15 -12 -3 -32 -37 8 -11
6817 -11 45 -6 13 21 -31 58 29 -63 -19 37 -14 -4 -22 -33 19 -27 33 7 10 -32 -4 -8 -2 49 -9 13 29 -13 22 -26 -16 23
6849 23 15 18 12 75 7 -14 -27 9 60 -52 50 9 -73 4 27 34 6 -25 27 38 -46 -45 -39 -9 25 -27 60 -1 36 10 -2 30
6881 30 51 -5 32 8 -25 3 -16 17 24 10 28 -10 14 -1 23 -54 10 12 51 7 -15 47 14 18 -76 5 37 -10 46 -19 6 -1
6913 -1 -12 -10 -18 -9 -3 -5 -9 -53 -35 -21 -27 -15 -18 4 -19 -16 -4 27 -15 -10 19 -10 18 9 -23 27 -5 37 38 26 -2 1 -24 -19 5 24 17 5
6951 5 -23 -8 2 18 4 -15 -29 -22 -62 8 7 -18 -15 -26 52 -27 -55 27 19 -50 -8 -21 -25 8 -18 27 -30 -2 22 45 52 -76 -11
6984 -11 12 -16 4 3 3 -2 16 -19 2 16 -25 -31 31 55 -17 -30 18 -7 45 -49 4 -36 -6 -62 -29 38 -8 16 -45 -47 -18 -16 -34
7017 -34 37 -1 57 19 4 -41 61 8 25 19 1 30 9 -39 -29 -20 11 5 -18 -3 3 -1 -25 7 19 32 25 -34 8 11 -27 13 -33
7050 -33 -12 -39 -18 9 -83 54 -20 -17 63 -6 -5 14 -6 4 -1 34 52 -7 15 5 -38 10 -6 -3 18 32 -36 -24 -17 30 39 -14 58
7083 58 -56 -32 10 27 -18 -21 10 32 -14 -17 -3 61 62 22 38 -5 -13 -23 66 32 30 0 20 -16 35 -32 -29 -3 51 1 34 62 -6
7116 -6 -39 4 -29 38 5 4 -3 5 -23 18 -5 -11 -5 6 -17 -77 11 8 -49 -59 -2 -22 50 -8 28 22 1 -44 14 0 51 29 -5 -28
7150 -28 94 31 8 38 61 1 4 10 -13 -55 -28 26 -33 4 45 12 -15 20 -22 7 25 -33 9 34 -5 -57 -21 -14 7 -22 2
7181 2 5 -6 23 58 -22 -39 10 -40 12 -70 67 -28 15 -16 -64 35 -3 8 -18 -27 -32 57 -20 39 32 30 4 -44 -41 1 -7 -10 -40 -2
7215 -2 -37 1 15 -7 -4 1 -29 -2 5 -22 16 6 -3 -13 21 40 -10 0 26 29 -2 2 6 -20 -1 14 47 6 -24 -25 -45 -29 18 -27 75
7250 75 -15 -1 58 -18 6 -10 -34 -7 -16 11 4 -12 3 10 -21 -5 1 -55 -6 38 25 24 8 -70 -13 -42 4 -41 5 70 34 51 7
7283 7 -7 -30 46 -36 21 -46 10 -18 -36 -15 -15 -31 24 21 -47 -26 -18 8 -5 -3 -28 -36 -12 13 -11 -7 23 21 15 15 -13 -3 -24 29 -17
7318 -17 -6 15 35 -40 40 10 44 28 -10 19 14 -14 -7 -12 -2 -36 9 -62 31 39 26 -17 -53 -19 79 -51 -82 -1 -42 -5 26 9
7350 9 4 -10 -1 33 33 5 -6 -38 -23 63 22 14 6 -4 34 23 -5 -8 25 48 9 2 -24 14 3 -30 -61 18 -6 -31 -3 25 64 -27
7384 -27 5 22 -51 11 -13 -29 -28 -7 31 -33 -29 -11 -48 30 -42 -7 40 -43 -2 -1 -2 5 19 -28 25 -16 -19 -2 21 11 -26 -41 -4
7417 -4 20 4 -34 -37 -22 -46 -31 -46 11 -30 13 30 38 9 -36 5 -11 -12 -59 -26 42 -2 -24 -5 63 17 37 -7 76 18 -18 33
7449 33 -26 5 -26 35 -13 16 -85 18 4 -48 19 2 20 -58 -12 -38 17 -20 -42 1 -60 20 -5 18 -9 2 -46 -25 2
7478 2 -23 -33 -25 30 -27 -12 -4 1 -74 -13 49 -9 -4 13 35 25 16 -22 23 14 13 1 -44 -27 -42 -55 3 3 -60 19 -35 4 40 37 -39
7513 -39 11 17 11 22 4 15 -6 29 -30 -44 56 -20 24 42 21 23 -9 -5 28 -24 9 -28 3 4 -10 28 -4 -53 -18 -6 19 62
7545 62 -3 7 27 4 -38 40 -6 36 -17 -24 41 -29 10 -9 27 -27 -1 7 9 6 32 -9 9 -13 13 -40 -2 76 -39 29 6 -37
7577 -37 1 -10 -22 39 43 -12 -47 8 9 18 -49 8 -32 -4 -37 -29 -13 -54 -6 -10 -15 -23 -41 5 17 21 18 17 31 26 -9 14 32 -3 60 41
7613 41 29 0 -51 19 -28 -15 3 25 20 62 -29 -36 -9 -11 25 -30 41 -4 3 -30 -12 36 -23 -71 13 -40 -41 -54 -37 46 -8 -4 24
7646 24 21 13 10 4 2 14 -7 27 -16 -19 -7 44 -8 -44 -25 9 14 9 -1 51 7 6 -13 5 -8 18 -10 -26 12 -42 -10 4 38 -17 -2
7681 -2 -2 -70 43 -7 8 -15 19 56 18 -77 17 -1 -8 -21 2 -34 49 2 -52 18 6 -5 19 24 21 -24 3 2 -30 -9 15 18 27 22
7715 22 -19 28 14 -45 7 0 -1 6 -15 0 -19 46 -13 10 42 -34 14 -19 3 20 -29 -5 48 44 33 25 -51 -39 38 19 -27 42 0
7748 0 -5 12 18 -14 0 8 23 41 -52 -31 -34 -38 25 22 13 38 -23 7 -30 -31 28 5 -34 -40 -27 -26 -4 27 5 -11 -37 47 17 -12 15 -9
7784 -9 11 4 34 -36 25 -2 20 12 31 8 71 -21 -21 54 -13 30 23 28 -17 -6 -38 -54 -15 13 -1 -33 -10 -49 28 4 19 23 0 22
7818 22 -18 29 -46 -72 7 5 -34 20 60 -32 17 23 28 -32 8 34 -21 -35 16 -1 26 -32 20 -28 -34 -69 19 -37 -15 26 -14 -15 -40
7851 -40 47 -50 21 -7 35 3 29 17 -52 44 -33 -20 18 -2 -24 4 58 -4 3 -6 4 12 16 -43 17 -69 15 61 36 -35 16 -40
7883 -40 9 18 -2 23 -23 -30 -10 45 -23 -43 -7 -8 -18 -13 -59 -14 12 -10 23 -12 -55 -37 32 -4 -24 3 3 7 -45 -29 -1 3 -22 -20
7917 -20 -10 21 48 3 -28 1 -71 -36 -17 15 -12 -2 1 -35 -25 -29 3 11 -29 -10 -27 -14 -17 8 35 48 -1 -36 -43 -3 25 -30 32
7950 32 59 16 -40 -54 38 -21 -28 38 -44 -19 -10 -2 35 44 35 39 -30 -24 -34 4 19 42 -3 -18 -40 17 -26 -10 -22 15 -1 -2 14 26
7984 26 -40 -11 45 25 -37 -51 -68 3 59 -43 -6 11 -5 -52 -27 26 25 -16 -20 8 11 5 -13 44 4 -28 -8 -38 -52 10 -13 -18
8016 -18 -6 16 14 -4 -41 -33 -39 -3 -14 24 -11 -28 18 3 0 18 28 5 -25 -44 -6 41 -13 -1 28 46 7 6 31 0 -30 18 54
8049 54 1 21 35 9 13 -53 -25 5 31 -21 -33 -3 14 -64 -59 -32 34 72 -44 -3 -26 -31 -55 -44 -6 -22 -108 29 0 -20 11
8080 11 24 -25 15 12 46 12 43 -23 23 -67 19 22 27 41 -70 -1 13 29 -42 -25 17 -30 -22 28 -6 -31 14 34 40 36 -32 26 -40
8113 -40 -3 -25 4 -23 30 5 6 49 -31 12 -31 -40 -25 43 3 -31 36 7 -1 -27 -47 39 1 36 -30 1 -42 -13 -26 -32 7 -18
8145 -18 -8 -5 -4 36 -46 -6 18 -8 -11 26 35 25 30 -15 0 -31 14 -14 -21 -34 8 -35 45 -5 -15 -15 44 -41 -33 10 -4 -24 49 -10
8179 -10 -45 -48 58 32 1 48 -57 14 -13 -6 42 -21
8191b1
$$ Imaginary data points
##PAGE= N=2
##DATA TABLE= (X++(I..I)), XYDATA
0 0 0 0 0 0 0 0 0 0 0 0 0 0 0 0 0 0 0 0 0 0 0 0 0 0 0 0 0 0 0 0 0 4 -8 8 -8 8 -8 8 -8 8 -12 13 -16 16 -16 20 -21 24
48 24 -25 28 -31 36 -37 44 -45 52 -58 63 -71 81 -89 105 -120 141 -170 211 -279 405 -722 3710 4167
71 4167 1168 1555 -1384 -3479 -3621 -3234 -4861 -4421 -2472 -1876 -2542 -975 365 -397 -1085 89 -255 -2006
89 -2006 -2221 -1320 -2320 -3213 -2147 -1154 -1739 -1157 848 1438 1139 2474 3787 3286 2960 3956 3780 2268
107 2268 1979 2287 1030 -391 -119 -185 -1563 -1855 -948 -1238 -1991 -1127 -308 -974 -1097 56 -21 -958 -670
126 -670 46 -838 -1359 -669 -461 -1267 -1001 53 64 -331 654 1423 1024 1067 2009 1837 978 1137 1420 460 -286
147 -286 30 -213 -1229 -1178 -655 -1034 -1405 -619 -123 -629 -357 523 509 -47 507 881 147 -180 324 221 -570
168 -570 -381 150 -210 -487 186 533 10 222 923 669 186 564 693 14 -332 79 -273 -978 -770 -388
188 -388 -848 -1012 -271 -49 -485 -53 684 446 239 801 1026 481 409 842 481 -155 92 318 -298 -554 -114
209 -114 -128 -664 -490 -92 -363 -652 -216 -115 -666 -547 -117 -357 -725 -284 17 -357 -260 359 386 181 590
230 590 1087 833 728 1247 1268 787 941 1193 694 327 478 370 -277 -444 -233 -592 -1084 -947 -824 -1163 -1400
251 -1400 -914 -1034 -1250 -967 -552 -688 -715 -164 34 -124 136 674 559 395 817 1038 696 762 1057 940 586
272 586 797 943 521 285 612 454 -50 2 166 -222 -600 -411 -403 -867 -805 -504 -766 -905 -557 -290 -488 -397
294 -397 85 146 -43 251 508 249 149 425 268 -160 -134 -2 -204 -475 -280 -198 -436 -358 26 -20 -138 187
316 187 485 268 233 519 468 210 253 505 218 69 304 346 176 204 578 441 258 468 527 236 73 106 -170
339 -170 -568 -643 -678 -1124 -1284 -1096 -1127 -1236 -942 -649 -599 -400 34 262 281 506 893 731 659 851 889 598 477
362 477 675 475 289 386 508 340 257 535 510 195 151 227 -136 -453 -464 -679 -1044 -1134 -1026 -1219 -1377 -1044 -774
385 -774 -757 -504 -18 168 247 638 896 855 829 1065 969 653 674 635 376 223 349 269 102 118 234 209 53 137
409 137 117 -168 -280 -323 -473 -850 -921 -916 -1194 -1284 -1098 -949 -921 -643 -206 -28 226 549 862 798 968 1118 1076
432 1076 822 808 762 471 300 339 212 6 65 161 41 -47 144 122 -66 -99 -113 -287 -554 -576 -638 -911 -982 -841
456 -841 -867 -909 -636 -365 -270 -36 271 495 528 673 887 725 633 638 480 205 62 37 -144 -291 -253 -198 -268 -197
480 -197 13 38 44 170 302 148 92 200 84 -107 -125 -91 -185 -271 -86 -43 -56 30 233 255 221 374 380 252 100
505 100 101 -45 -248 -386 -393 -644 -724 -664 -638 -657 -443 -289 -178 -85 258 340 390 486 602 589 448 552 463 354 331
530 331 328 257 130 210 225 114 128 206 95 -105 -13 -61 -175 -404 -376 -412 -584 -622 -558 -573 -605 -417 -280 -243 -109 158
556 158 207 216 388 503 424 364 482 321 241 183 239 43 -68 57 19 -123 -94 -1 -94 -116 -32 27 -108 -108 0 -32
582 -32 -126 -114 -42 -101 -122 13 -34 -32 56 160 127 63 170 222 73 65 113 95 -82 -1 -25 -158 -197 -80 -153 -220 -140 -77
610 -77 -148 -87 29 41 -51 117 234 126 115 226 211 92 136 193 110 3 76 72 -59 -92 -74 -70 -238 -159 -136 -233 -246
637 -246 -166 -159 -225 -112 -15 -120 -95 4 69 33 33 185 129 133 261 269 288 258 330 324 257 267 331 195 29 155 19 -173
665 -173 -165 -184 -311 -403 -375 -381 -454 -346 -325 -295 -363 -182 -90 -187 -95 74 91 25 154 233 186 105 260 304 250 304 455 438
693 438 337 427 424 351 292 316 183 18 -35 -47 -266 -317 -367 -452 -557 -499 -450 -473 -462 -302 -244 -270 -101 -6 -36 -42 16 113
721 113 29 85 145 173 101 186 300 217 235 304 353 319 413 293 277 134 140 98 -115 -137 -150 -319 -345 -282 -298 -322 -259 -108
749 -108 -93 -151 26 125 15 41 164 64 37 57 45 -8 -62 -60 -8 -89 -69 39 -16 30 65 162 29 69 162 88 32 29
777 29 19 -68 -78 -17 -74 -103 12 21 39 78 159 161 102 104 144 74 -51 32 -54 -173 -204 -166 -167 -277 -242 -108 -162 -105 -5 61
807 61 105 160 268 209 175 192 164 106 107 70 24 4 -10 34 -32 -79 -7 -26 -98 -81 -70 -74 -209 -121 -139 -299 -293 -80 -176 -214
837 -214 -119 -14 -56 70 175 181 215 290 354 269 236 328 283 134 112 69 -58 -63 -90 -138 -263 -253 -162 -239 -268 -141 -137 -204
865 -204 -131 -86 -7 -92 -9 49 5 46 170 211 124 150 278 254 262 277 306 191 161 176 74 -10 -28 -121 -191 -263 -253 -275 -345
894 -345 -232 -225 -276 -274 -148 -102 -67 31 174 136 140 216 253 224 235 266 236 176 267 283 95 111 159 25 -33 -75 -5 -165 -227
923 -227 -204 -238 -248 -282 -245 -337 -326 -206 -167 -225 -156 -4 -11 -22 148 197 199 175 314 275 201 274 352 186 113 234 132 59
951 59 77 109 0 -109 -34 -130 -206 -226 -133 -231 -266 -187 -126 -243 -287 -147 -94 -154 -39 50 67 50 121 157 108 108 237 159
979 159 140 240 208 167 117 191 104 -60 -10 0 -143 -107 -92 -136 -181 -162 -106 -189 -220 -88 -70 -126 -112 49 -25 -2 66 125
1007 125 15 144 196 122 42 126 138 65 60 126 54 -19 -10 -31 -49 -108 -109 -92 -170 -102 -77 -94 -177 -39 -63 -136 -123 20 57
1036 57 47 95 121 98 100 192 141 91 114 163 107 64 68 49 -1 -74 -54 -88 -177 -133 -124 -203 -283 -153 -191 -205 -116 -43 -62 -69 14 129
1068 129 28 97 207 172 154 192 211 171 142 195 109 12 60 9 -82 -119 -66 -99 -193 -196 -178 -314 -265 -175 -150 -246 -156 7
1096 7 -33 11 147 195 155 173 290 227 255 275 327 213 181 226 168 16 -8 -46 -37 -183 -195 -160 -340 -278 -262 -303 -371 -226
1124 -226 -148 -219 -186 0 39 -19 77 194 164 135 310 348 336 320 407 314 273 359 316 159 103 43 -1 -236 -148 -222 -358
1151 -358 -393 -347 -349 -493 -349 -297 -307 -260 -176 -109 -71 -37 131 116 138 232 292 278 302 355 350 317 336 270 236 205 188 106 52
1180 52 -5 -25 -136 -224 -231 -212 -347 -388 -305 -387 -341 -330 -187 -156 -167 -39 3 40 159 205 176 192 305 302 222 287 287 219 136
1209 136 207 182 65 54 88 -15 -73 -49 -61 -148 -207 -149 -205 -244 -280 -240 -223 -271 -195 -121 -144 -77 85 61 102 178 242 216
1237 216 192 219 221 170 153 234 105 75 48 11 -37 -106 -19 -53 -66 -117 -64 -122 -83 -118 -164 -197 -129 -95 -173 -105 -100 0 -42 25
1267 25 121 115 147 146 255 128 188 210 153 73 42 94 10 -72 -39 -40 -161 -140 -59 -132 -180 -86 -68 -114 -110 41 -92 -40 -32 96
1297 96 35 32 105 55 84 111 128 146 80 112 167 124 113 87 35 -79 -38 -50 -43 -172 -158 -234 -301 -223 -240 -264 -170 -143 -59 -102
1327 -102 -10 37 29 81 150 199 187 159 221 203 159 221 192 173 125 145 40 19 -44 43 -89 -129 -68 -151 -189 -176 -189 -171 -219
1356 -219 -165 -54 -154 -86 -93 -17 -4 70 91 90 119 165 165 131 106 126 151 60 66 47 -2 -24 -36 -96 -87 -118 -82 -141 -130 -109 -72
1387 -72 -95 -41 -30 -41 40 74 99 77 76 144 120 72 153 72 48 100 26 39 -47 -25 4 -35 -47 -95 -83 -189 -181 -158 -181 -173 -149
1418 -149 -120 -191 -120 -18 -41 -39 47 127 134 145 201 254 198 241 228 136 169 141 96 -8 -84 -44 -111 -110 -161 -123 -162 -185 -123 -213
1448 -213 -136 -127 -142 -114 -147 -153 13 -109 -57 -19 -24 32 110 107 169 235 254 271 193 278 194 140 139 41 42 -6 -47 -145 -190 -201 -220 -208
1480 -208 -225 -180 -188 -170 -138 -129 -109 -110 -97 -32 -17 -41 6 31 36 42 80 126 113 211 235 224 269 280 285 248 244 164 107 3 -10 -71 -138
1513 -138 -145 -166 -219 -198 -167 -197 -168 -122 -124 -69 -84 -100 -49 -97 -78 -60 -27 -16 -19 -9 16 81 97 105 173 175 199 203 187 239 148 106 72
1546 72 53 27 -28 -49 -57 -138 -139 -104 -97 -95 -46 -71 -14 14 76 70 19 39 -1 -33 -18 -36 -56 -54 -66 -96 -38 -9 5 15 8 8 66 30
1580 30 18 -11 46 -59 -47 -58 -59 -47 -34 -12 10 47 45 103 143 166 191 163 102 121 87 80 -20 -77 -16 -67 -103 -115 -179 -155 -120
1611 -120 -117 -89 -67 -62 -30 -10 -24 -31 -38 -24 -26 27 -30 -14 3 -27 53 53 83 84 114 181 93 88 108 77 -17 26 12 -71 -90 -102 -88 -92
1645 -92 -114 -52 -54 -49 -8 -1 34 81 51 45 73 61 65 76 34 38 -3 -6 -29 -3 9 -53 -20 0 8 46 -34 -20 29 -85 -15 -55 -60 -17
1679 -17 -86 -86 52 -3 22 33 90 34 36 145 90 42 71 44 34 38 -4 -24 -21 -101 -70 -111 -159 -87 -93 -75 -92 22 3 18 -34
1710 -34 93 90 88 85 138 101 88 183 114 121 41 152 81 94 31 47 -9 -31 -23 -120 -20 -94 -90 -119 -189 -193 -160 -189 -200 -150 -126 -136
1742 -136 -76 -64 -34 -33 46 58 42 108 113 138 165 176 149 178 191 135 140 140 77 57 15 66 9 -25 -60 -100 -100 -113 -94 -112 -87 -60
1774 -60 -138 -47 -128 -125 -142 -132 -75 -104 -51 -77 -16 -53 25 80 79 123 114 118 138 115 122 106 81 76 94 49 29 56 -19 34 8 -3 61
1807 61 6 44 17 17 12 15 -11 -6 -31 -104 -55 -78 -87 -115 -69 -49 -77 -55 -5 12 -25 56 43 29 22 0 -26 19 18 -19 -29 -21 -40 -15
1841 -15 11 95 60 49 78 95 166 151 140 70 34 13 -31 -55 -118 -96 -86 -110 -99 -88 -70 -96 -70 6 -44 -31 -34 11 -27 -28 -16
1872 -16 -4 -68 -59 -20 20 42 150 100 164 210 197 234 162 141 126 82 32 14 -65 -73 -151 -176 -210 -230 -200 -179 -165 -120 -111 -58 -45
1903 -45 -17 20 1 24 108 71 65 60 98 94 81 133 148 176 165 201 181 169 129 49 133 21 20 -72 -145 -141 -207 -253 -207 -210 -163 -176 -185
1936 -185 -51 -3 37 9 53 83 112 140 82 59 77 65 -3 28 38 -35 -3 48 39 34 6 38 -5 0 -43 -103 -51 -63 -111 -102 -98 -128
1968 -128 -102 -100 -33 -1 50 83 105 137 178 196 140 146 165 124 80 64 -3 -82 -86 -140 -192 -103 -170 -200 -158 -142 -152 -162 -81 -138 -72
1999 -72 -88 -49 -47 -2 94 55 26 66 61 155 145 205 205 194 222 210 155 153 87 122 25 -33 -16 -66 -145 -136 -165 -192 -241 -175 -225 -159 -95
2032 -95 -100 -103 -74 -12 -78 -6 14 8 24 116 50 93 90 89 94 126 134 127 159 124 87 108 56 36 11 -42 -39 -96 -112 -53 -90 -156 -143 -112 -39
2067 -39 -56 -63 -30 -54 -43 -21 -9 42 31 28 67 77 47 72 97 82 56 17 18 35 29 21 0 -50 -28 -70 -16 -76 -126 -47 -41 -76 -48
2100 -48 -42 -38 17 -35 4 -45 -9 47 -17 10 -5 7 0 8 36 33 36 14 -31 -57 54 -6 -34 9 -56 -60 -59 -10 0 -53 13 -8 57 60
2134 60 97 86 71 65 47 99 42 51 79 10 56 58 20 -9 -57 1 -14 -63 -74 -23 -94 -143 -193 -123 -120 -149 -150 -96 -120 -96 -28 23 41
2167 41 120 106 163 177 144 181 181 175 145 150 113 112 46 66 -12 -43 -10 -90 -72 -94 -104 -127 -80 -176 -169 -179 -166 -168 -132 -119 -136 -79 -30
2200 -30 -36 24 29 57 118 136 148 148 152 213 127 116 79 105 124 9 69 -8 4 -72 -99 -82 -104 -100 -62 -49 -34 -38 26 -69 -31 -52 -72
2233 -72 29 -40 3 19 44 13 94 45 114 61 53 88 120 47 17 23 -6 1 -13 -70 -90 -143 -128 -102 -107 -45 -72 11 46 3 4 121
2265 121 133 70 105 40 28 61 56 42 55 58 82 -1 26 41 -23 -10 -14 37 -5 -53 -18 -29 -63 -130 -79 -77 -59 -89 -60 -73 -59 -15
2297 -15 21 57 54 64 123 103 92 165 103 62 54 43 8 -4 26 -12 -7 -65 -25 -55 33 -40 -38 -77 -73 -95 -59 -132 -38 -104 -94 4 -59
2330 -59 -30 -27 31 41 0 91 81 119 108 124 132 130 47 32 -3 24 -20 -52 -41 -29 -67 -75 -97 -106 -59 -76 -63 -44 -48 -30 -75 -78 -101 -62
2364 -62 -41 -67 -15 -44 20 -37 27 22 49 19 44 73 69 37 133 58 26 -9 57 14 7 -49 -15 -5 30 -8 18 3 9 -18 37 9
2396 9 43 -67 -37 -1 -25 -10 -3 -18 13 -6 -59 -66 -35 25 -20 -31 11 -3 -35 25 -83 25 9 24 -9 4 12 16 38 -39 7
2427 7 9 75 59 69 117 89 76 61 80 16 9 -9 -1 -7 1 -37 -42 -20 -59 -110 -159 -57 -73 -57 -88 -36 -43 -10 23 -69 51 -5 -8 -5
2461 -5 61 54 68 101 114 75 46 36 71 77 65 90 -16 5 -5 -63 11 -44 -33 -82 -38 -88 -71 -54 -78 -42 -98 -26 -44 -18 32
2492 32 72 24 58 46 7 73 65 68 129 68 74 51 -3 21 33 -15 -36 -30 5 -26 -84 -39 -53 -86 -23 -3 -23 -12 -35 -45 -22 -44
2524 -44 -34 12 -35 -38 -19 89 -17 26 0 69 -33 1 59 58 64 12 19 -24 -22 -38 44 -9 -36 -22 -5 28 17 -13 -2 2 39 -42
2556 -42 -19 54 7 -64 -1 0 34 12 31 -33 9 37 -27 26 49 -11 13 -21 14 -31 -9 -20 2 -22 -37 -3 -41 -29 -40 24 12
2587 12 22 19 88 65 41 -26 31 -14 23 -19 9 41 50 -6 -6 0 40 3 -7 -15 31 -5 -34 12 -30 31 -34 -56 -26 -28 -56 -47 -37 -2
2621 -2 -53 -48 39 43 40 34 48 -9 7 91 7 23 13 -41 24 1 -17 -15 2 -5 -28 -22 -17 29 -28 17 -5 -53 -10 -80 -16 -47 -22 2 18
2656 18 -33 -5 -46 -5 27 43 18 -10 -2 -14 -15 16 -27 -10 1 -8 -21 25 39 -2 17 28 63 28 -7 35 31 33 86 10 41 -28 43
2689 43 93 16 24 -40 1 -3 20 22 -15 -22 -47 -8 -22 -7 -21 -25 -108 -52 -8 -78 -67 -3 -28 6 -16 51 54 5 45 -9 89 47 71
2722 71 19 75 100 43 27 25 50 2 11 -36 1 -29 0 -17 -99 -96 -80 -53 -90 -21 -33 -36 -58 8 -49 7 8 25 31 67 130 76 71 54
2756 54 35 20 82 53 60 8 23 16 5 -14 3 -27 15 -64 -57 -29 -79 -121 -15 -70 -54 -40 12 -7 32 21 26 -30 18 41 111 92
2788 92 48 69 100 48 42 15 60 52 68 -16 -24 3 1 -72 -53 -49 -17 -26 -101 -33 -21 -56 -19 -23 -10 -1 -23 17 18 7 4 12 12 34 60 34
2824 34 84 14 -45 79 42 35 6 -33 34 -29 -14 -15 -16 -36 -11 -75 -28 -55 20 89 58 -48 -4 39 36 24 51 50 46 -5 61 53 98
2857 98 71 -23 -18 -47 16 -23 -47 -43 -12 -108 -82 -12 5 -12 -25 -36 34 -41 -2 -11 24 5 77 32 12 48 32 34 37 71 18 63 47
2890 47 43 40 48 30 -18 -25 38 -60 -47 -45 4 -40 -57 -39 -9 -68 -80 1 -9 -12 -9 44 -13 8 61 36 34 10 33 61 20 5 7 -2 -55
2925 -55 17 -38 12 -6 42 -35 -54 -55 -17 -41 -37 -40 -38 -82 5 11 -4 28 50 99 7 27 91 73 81 60 66 59 33 11 36 44 -49 -34 -43
2960 -43 -16 -8 -48 -4 -85 -60 -82 -42 -67 -61 -31 -41 16 -15 54 26 32 -8 -9 72 17 65 119 42 20 56 21 71 38 49 10 -61
2992 -61 -9 -50 -51 -66 -7 -19 -97 -80 -96 -46 -123 -69 -58 -38 21 -1 -8 -10 27 9 49 6 50 46 51 74 38 14 -6 -32 -11 -2 -28
3025 -28 50 -12 -34 -55 -43 -6 -80 -95 -93 -68 -39 -31 -73 -9 -17 58 38 -5 29 56 -21 81 40 41 92 99 64 37 -26 17 21 -30 -11
3058 -11 -47 -62 1 -17 -5 -81 -80 -71 -58 -78 1 2 -31 2 22 -27 6 3 -30 -12 11 82 53 44 31 58 13 35 30 4 -6 6 1 -29
3092 -29 -54 -21 -5 -82 -99 10 -75 -23 -51 19 -26 -18 29 -16 62 4 0 64 12 15 32 60 15 89 77 32 85 48 12 32 -48
3123 -48 -20 -18 -41 -20 -49 -54 -36 -26 0 -42 -45 -14 -7 -31 9 16 44 6 -43 -6 -5 59 24 20 16 39 7 -13 -10 4 22 -37 -4 -55 -60
3158 -60 -28 -64 -7 -12 -62 -38 -17 -21 -5 -9 -32 -31 -7 18 14 -18 25 -16 51 -9 -26 107 -7 -10 39 81 34 15 38 4 -20 34
3190 34 19 -40 -7 -39 -42 -4 -9 31 -22 -17 -29 7 17 -12 -2 40 14 9 64 44 33 24 36 21 -13 -15 4 -8 15 -47 17 -33 -27 -33
3224 -33 -29 -26 -9 -24 -18 4 -26 39 -13 -30 -24 -12 94 62 58 21 56 -13 61 77 57 35 18 -5 15 9 -25 40 2 6 16 -38 5
3257 5 -72 -20 -55 -108 -45 -27 -25 -10 20 -29 -34 -50 38 22 38 24 24 73 60 98 95 18 62 24 29 27 3 -41 -33 -4 23 28 -51 16 -2
3292 -2 -103 -53 -77 -83 -40 32 15 -71 6 -18 66 -2 0 40 78 70 76 34 -17 20 29 -2 -15 50 -21 -67 -13 -21 -19 -62 -40 18 -43 0
3326 0 17 -4 -30 -60 11 -6 -16 14 -15 -7 4 5 41 0 28 27 23 -10 -28 -8 22 15 30 0 42 -42 -28 -14 -2 8 3 -72 -54 32
3360 32 -48 -57 -2 14 -26 35 30 -23 31 43 4 37 27 23 0 -20 62 11 -42 -34 -12 -10 -28 -2 -22 -67 -7 -34 -18 -33 -13 -33 -68
3393 -68 -57 -41 53 11 36 -22 47 13 -8 23 2 -7 4 -21 -24 11 59 -3 14 4 7 4 -21 -14 7 32 -85 -42 -32 -31 -80 -49 -35
3426 -35 6 24 -14 13 46 -53 -48 -15 -48 37 -23 17 34 1 28 -14 57 9 16 -65 43 -6 62 4 3 34 10 7 -39 -4 -25 -11
3458 -11 -5 4 -8 -6 33 -15 -33 -48 -70 -12 11 -8 -54 -39 45 -15 30 -26 -15 -24 -33 -47 -18 1 -76 0 -17 -60 -45 36 19 17 22 75
3492 75 30 12 26 22 -37 53 41 -29 0 0 -2 -29 -24 -23 -1 -26 -6 -36 -53 -22 -17 -67 -81 -44 -32 6 -32 0 3 -34 6 4 -24 -44
3526 -44 5 34 24 -5 62 66 36 23 12 10 24 10 0 -22 16 9 22 -67 -33 2 -64 -42 -42 -41 -43 14 -25 28 -4 -56 -17 -56 30
3559 30 39 35 11 7 33 55 -16 37 41 26 -9 26 -11 33 17 -8 30 -14 -16 -24 -13 -26 -51 -28 -25 -5 -65 -28 -36 -30 -29 -31 -21 -30 -11 -54
3595 -54 42 -10 44 56 23 21 33 31 12 10 15 -9 26 5 -6 39 11 33 -17 15 -27 -7 -9 -19 10 -9 49 -18 3 24 -14 14 40
3628 40 31 -9 28 -6 -22 -20 -15 -18 -27 -34 -45 8 -52 -11 -1 -32 22 3 -28 -4 27 3 25 45 7 16 15 0 50 -15 -28 33 23 -2
3662 -2 -1 23 -32 -2 3 6 -13 -22 -18 -53 -11 -8 -42 -35 -62 -95 -27 -56 -50 1 -4 -4 74 27 11 3 -2 30 74 18 -28 48 21 75 22 -51 -3
3699 -3 -12 10 -24 -3 16 8 -21 16 -3 21 11 -82 25 -27 0 -45 -21 -3 6 13 -20 20 18 -18 -18 30 1 2 -21 48 43 39 -15 -17 -11 35
3735 35 -33 -20 -34 -15 -30 -21 -18 -37 -51 -6 -22 -58 33 -1 -32 8 -20 17 16 71 48 -39 13 -2 -13 35 24 -31 86 -29 -50
3766 -50 -37 -53 -30 -31 -25 12 -27 -39 -16 11 23 -18 -13 5 -4 -17 -49 21 35 -1 -20 -2 15 22 44 3 39 32 42 -58 7 -11 42
3799 42 7 -67 -5 -4 -25 17 -60 -6 -4 -27 -20 -10 -22 -5 -43 15 18 49 5 45 38 44 12 30 -1 7 69 23 30 91 16 6 15 3 35
3834 35 40 -35 -62 -67 -58 -77 -1 -24 -39 -22 -53 -47 -8 20 -8 50 -28 41 7 -1 20 42 7 18 18 5 -21 107 35 34 24 39 -21
3867 -21 -19 -46 -31 -16 -54 28 -25 9 30 -1 25 -44 -49 -13 -27 46 -46 -11 -23 10 29 2 45 17 4 24 -37 37 9 30 -4
3898 -4 -57 -5 12 -55 -47 -1 -57 18 24 36 -19 4 55 -32 -14 -14 29 4 -33 -6 -10 58 17 27 4 14 34 4 -58 15 2 -102
3930 -102 -7 -15 -91 -11 -31 -22 -39 -40 13 23 18 -17 0 -3 -38 44 34 33 60 13 45 56 9 51 -3 -30 42 4 18 25 -23 1 26
3963 26 27 -50 -33 30 -43 -24 -8 -17 -70 -5 -17 -5 68 -40 -40 -1 -27 19 53 3 27 33 36 9 5 45 46 28 23 -8 10 -5 -24 -33
3997 -33 -58 11 12 -45 -21 -52 -6 -10 2 -56 -37 -43 -53 23 27 12 6 32 11 11 -7 28 33 10 36 -17 -18 18 -54 54 -41 -27 38 3
4031 3 -26 -17 -48 -39 4 -28 -18 -21 30 -57 -22 -49 40 27 23 5 -11 16 -18 1 -19 -8 46 -5 -4 -48 -54 -33 -40 3 -31 -4 -58 -28
4065 -28 -2 19 10 19 2 -62 -25 18 11 20 53 28 44 30 40 32 65 11 -13 -35 11 18 42 3 45 -36 -34 -35 20 -3 30 -27 -48 -66
4099 -66 -31 -30 -28 -82 -19 -17 -54 -9 -33 -45 41 48 -11 -2 28 23 12 15 39 4 70 27 40 -14 -9 5 7 42 -35 -63 -48 -59 -74 -13 -14
4134 -14 -58 -25 -14 5 21 -17 -19 -35 32 -35 -3 -1 23 42 -6 -16 74 -11 13 3 22 -6 -16 21 -42 -35 -30 -8 29 44 -54 -34
4166 -34 -27 -35 -75 -44 -5 56 5 -43 5 35 -15 8 20 -43 -8 -18 -34 1 -3 -10 2 -6 15 -11 -46 -40 3 43 -46 75 -26 -13
4198 -13 20 20 22 -8 34 -17 -4 -37 12 -25 91 18 29 71 50 5 11 15 20 10 19 -45 -22 -48 43 -23 18 29 -26 47 -2 -6 -9 2
4232 2 38 9 -1 19 22 28 28 23 21 23 -69 -2 33 -5 21 27 -10 3 -30 -65 -1 -21 -35 -8 -32 -51 -15 -23 1 -23 -38 -14 -45 -43 -15
4267 -15 -32 -1 -31 -62 20 -18 20 6 61 62 32 48 29 74 44 -29 18 44 13 -8 -1 6 45 -44 -5 -13 45 -10 47 9 -35 -11
4299 -11 -11 -33 -14 -81 -20 37 -42 -4 -5 9 -28 -9 -26 49 56 -11 13 61 36 33 29 28 -7 -17 -24 30 12 -4 1 5 -20 7 76 63 -6
4334 -6 -18 14 41 -2 12 -21 1 24 -23 -2 -16 5 9 -28 -51 -39 -25 9 -77 -43 22 -37 -26 -15 -58 -18 -4 -25 8 10 -45 49
4366 49 23 67 45 60 19 94 38 76 72 -4 3 -4 9 25 -6 27 13 -50 -36 1 19 -18 -72 -5 0 -22 -17 8 -35 16 9 -12 -8 32
4400 32 42 9 20 44 -38 12 -17 88 -38 -1 35 18 -15 26 -7 13 -5 -14 -32 17 -15 3 4 39 3 -68 -17 -36 -5 -67
4430 -67 -13 -60 43 -25 4 -3 -23 0 -16 4 28 -25 -23 16 3 -1 0 36 6 -8 7 8 -24 9 21 -25 21 -8 10 -23 -13 50
4462 50 -38 -17 13 66 48 6 35 -17 3 17 -15 12 -11 -2 -24 -38 38 -17 -58 18 4 -20 -15 -62 38 26 3 -51 14 23 -26
4493 -26 9 11 -1 12 13 16 15 -19 29 14 -35 -26 8 15 -18 0 -16 -2 -42 -35 -25 -15 -38 6 -65 -32 -61 -35 -9 -8 -45 -17 0 -10
4527 -10 33 -28 6 5 -66 -7 10 19 -21 39 -10 19 -24 -55 31 -4 -40 9 30 -99 6 -25 6 -16 38 -18 4 37 -46 -70
4557 -70 14 5 43 -7 15 -17 -43 30 37 -5 38 91 16 -51 10 11 -5 -26 -36 13 -33 16 44 -1 6 -40 16 -38 -27 22 -14 -21 29
4590 29 -34 15 -27 37 23 -36 22 16 6 7 38 -29 4 44 -8 2 -39 7 12 10 -28 -7 -22 -105 22 -6 4 -18 17 -11 20 3
4622 3 -17 -115 -21 19 3 -33 -35 -40 26 48 -22 -2 -35 -7 30 -70 6 -39 -69 24 -56 -21 -32 -13 -15 -10 12 9 -54 39 -16 11 -19
4655 -19 14 33 33 18 -10 -20 -20 -30 33 48 -36 1 17 0 9 2 -20 3 -3 -51 -36 25 -44 49 35 -3 42 -2 -34 -25 -5 3 16 31
4689 31 15 -49 15 -7 20 0 -5 2 25 3 -22 21 0 -61 -44 -15 -66 -11 -9 -16 -40 -16 28 36 13 22 -68 14 -8 -3 32 -7 15 16
4723 16 18 40 -21 5 5 -19 24 10 19 40 -22 -27 -63 22 7 -21 -37 -8 -48 1 -8 34 26 18 -52 37 31 7 6 -1 9 26 4 -34 7
4758 7 39 -45 -26 30 26 -2 23 -27 18 14 -39 -31 4 75 -35 -3 12 -56 -4 -11 -11 -21 61 -12 30 8 -52 12 -2 5 4 -4 -15 -13 5
4793 5 40 69 -10 33 28 2 -30 27 13 22 -5 22 -6 -25 -52 -18 32 -11 -12 2 -19 -21 -28 41 0 -37 -7 -11 25 31 20 -2 -26 0
4827 0 -4 42 -22 9 33 7 -32 -18 8 -24 -12 -5 -57 7 -2 -28 44 30 26 13 -6 22 42 12 6 40 30 52 17 -9 28 25 23 -11
4861 -11 -2 -6 4 -5 -17 -5 -6 -2 -42 49 24 -10 0 -23 -25 -6 0 -49 17 -5 -24 33 -50 15 -14 -28 85 2 -5 2 16 15 8 22 -47
4896 -47 -7 28 31 2 -4 -12 -5 -48 9 -29 9 -6 -2 22 -15 36 7 -7 20 27 17 10 33 -3 29 -39 2 12 17 7 20 23 33 16 17
4931 17 11 1 26 -36 -16 23 57 -42 -18 14 38 -16 -6 -1 33 5 -22 -7 14 -19 33 18 -9 34 -4 48 -40 29 -20 11 11 1
4963 1 46 30 2 10 -47 -3 9 26 2 60 22 -52 -20 13 7 -18 26 1 -45 -46 31 -5 6 28 51 6 -16 -13 26 -14 28 62 -55
4996 -55 47 46 15 -49 -10 -64 -17 25 -52 67 -39 -26 60 -12 -7 -26 2 -22 -9 -13 2 15 -30 -5 -31 -47 3 32 -6 -75
5026 -75 -38 43 -63 -37 -22 27 -17 -9 -10 -10 -34 45 -30 10 -44 -2 -44 21 44 17 3 15 5 18 3 -1 52 -19 10 -15 -9 18
5058 18 -31 21 5 -27 -36 -10 -58 12 -29 13 35 -1 -8 -8 -2 29 10 -44 -13 26 27 38 -12 -20 8 24 23 13 40 -29 3 -27 -22 -3
5092 -3 -23 12 19 32 -64 -13 5 -75 0 -23 -56 0 -19 -37 -35 12 -15 19 10 8 -11 -14 -18 10 -11 51 5 -19 18 -11 4 40 -8 -77
5126 -77 -28 -71 28 -41 6 69 -47 -44 29 15 -5 35 36 1 -10 -13 25 -25 16 18 35 37 -14 -13 -9 86 -8 11 -18 -8 -48 -17 15
5159 15 20 -70 -4 -16 -17 -36 -70 -1 -24 19 13 -23 -48 -13 -14 43 -4 40 41 40 18 49 25 43 23 30 1 -11 26 -53 -17 -1 32 14
5193 14 19 3 -50 6 -12 3 -21 -23 -36 -35 47 -8 9 -72 -32 22 28 -64 11 21 -9 47 -9 15 1 7 47 18 35 2 7 47 -15
5226 -15 10 -3 6 -50 -48 12 0 32 47 -19 -10 12 -21 -62 -43 36 -73 5 68 -42 -40 -41 21 -10 14 8 33 -6 33 -45 18 -16
5258 -16 -26 -4 10 -37 -40 -4 -27 -18 37 -15 3 -4 4 -30 -3 -9 -7 16 41 -13 18 49 -54 36 -13 -8 17 2 -26 -5 15 -16 -19 23
5292 23 44 -9 33 -51 5 -27 -14 1 -45 31 5 12 15 58 14 -29 47 32 1 -9 -9 7 -16 1 19 67 5 -32 -38 -8 15 -31
5324 -31 -9 -19 6 -14 -14 36 -13 -15 -27 -50 1 5 27 2 -20 31 36 17 29 4 -2 12 22 0 10 -28 -22 15 9 -24 -12 21 -29 -23
5358 -23 -68 -51 -49 -23 -4 -8 -11 -60 -12 -30 -54 -8 22 -49 8 11 -45 -31 -49 -20 15 -12 -47 -9 18 2 -26 10 17 -3 33 16 0
5391 0 -7 3 5 24 37 11 -5 30 -10 10 -2 17 25 69 20 -28 -17 33 2 -29 0 -8 25 7 -21 0 -6 -8 -56 -8 6 7 5 5 -17
5426 -17 -16 -6 -29 -1 -14 9 35 1 32 27 34 -5 35 13 -2 11 18 -16 59 -3 10 21 -62 -18 -26 -4 -33 -59 -41 -41 36 64 -7
5459 -7 14 -50 -7 -22 46 26 7 37 73 -20 6 31 -10 -4 10 -43 -28 -13 1 33 0 -28 -21 -5 -46 -21 -10 -23 -9 -21 -10 -64
5491 -64 -35 6 -20 -2 2 -15 -3 26 13 -57 26 43 -14 38 -15 -10 33 24 24 -14 -65 34 -6 -34 -47 -23 20 7 58 51 -17 -37 21
5524 21 -2 -34 18 -16 -31 -38 -33 -4 -36 -40 -13 -56 -28 44 13 -6 -28 -15 -20 23 13 -60 -7 -26 66 -50 -59 17 13 14 -17 23 28 15
5558 15 -12 -2 -40 3 -19 37 29 -25 10 -23 -14 -19 5 0 -36 5 57 -19 -32 22 -39 -21 2 -77 -37 -10 16 21 19 -34 -36 3 -36 16
5592 16 9 -19 -21 7 28 -29 -15 20 44 22 9 8 17 -19 20 -11 -26 -7 0 21 -25 2 -44 -42 -24 15 -9 3 36 40 -56 -75 15 -7
5626 -7 3 6 -14 24 -27 -10 0 -15 33 -26 25 15 -20 -16 17 -38 -31 3 -12 -31 30 50 46 6 -76 23 23 -55 -31 -14 26 -25 3
5659 3 -3 -52 55 -23 -2 20 -59 -10 9 34 -17 30 -54 -47 -48 -37 1 -38 -25 -25 33 42 12 4 -28 -21 7 -36 56 8 29 15 47 -38
5693 -38 -41 44 -16 -17 -8 -19 44 8 -20 -7 16 6 -18 6 -56 -22 -23 -10 14 -9 -2 -34 -58 2 70 -25 10 23 -2 27 22 7 -7
5726 -7 -19 18 25 41 27 -14 16 12 -23 -26 31 5 -20 -91 -4 -3 19 10 -1 34 -14 -4 3 -12 -28 -45 38 -32 -17 16 16 -3 -7 -1 12
5761 12 12 21 6 -31 3 -2 20 18 5 -12 19 14 -15 43 30 9 -24 -35 -13 0 -13 13 20 -2 -26 -9 -17 5 39 -12 -31 -36 19 5
5795 5 33 -18 28 -38 48 4 -10 18 -10 -37 -40 37 2 16 21 52 -45 52 -33 10 -2 -3 14 38 22 53 35 7 2 46 21 -1 -22
5828 -22 -76 -4 19 24 50 -50 -47 -5 0 -63 9 -17 -36 -63 -37 -2 -21 52 -32 50 19 31 -17 68 -13 16 23 27 -64 17 41 16
5860 16 65 28 42 -8 -22 -10 -7 -72 21 -13 -14 19 -28 -38 -46 8 -24 8 -38 -35 -21 35 29 11 -35 -21 6 -14 -1 39 28 6 17
5893 17 31 -16 29 -16 51 -34 -33 31 21 3 16 -25 -22 1 -39 -23 28 45 -39 -25 47 -52 24 -15 -5 -25 -27 -5 -18 -9 -4 13 -50
5926 -50 27 46 20 -4 -93 -22 -30 20 -21 -10 -18 6 -52 12 11 10 -16 1 46 -44 8 -75 -13 -25 5 -7 -19 -12 -46 24 26 -12 -20 4
5960 4 -19 33 -32 -16 11 -7 19 -49 -37 -16 -15 18 56 5 50 8 7 28 -3 -19 -25 77 -32 -17 20 -29 8 21 -15 -3 -30
5991 -30 -27 37 -12 11 -5 17 -31 -47 -56 -20 -24 -12 -39 -46 -7 3 -24 -47 13 11 69 49 11 5 64 -1 13 -30 17 28 -14 36 11
6024 11 -9 -17 52 -68 21 29 -8 -10 17 -14 10 -11 -11 -47 -25 12 14 -33 -23 6 -30 -92 -15 -12 4 18 11 10 25 27 -14 -13 -14 -42 -5
6059 -5 20 6 28 -59 -32 -13 15 -22 8 -33 -2 25 14 -19 -52 25 50 -10 13 26 73 -27 28 10 4 -20 17 -19 -9 3 -8
6090 -8 13 -17 -30 -45 -16 32 -22 15 -15 -8 -13 32 20 7 -22 -1 -48 -59 -26 6 -18 52 -8 -2 -33 8 -4 21 2 -7 -19 -21 -1
6123 -1 -35 -1 7 -3 -29 22 2 -72 13 18 24 -20 -9 3 4 70 -2 23 -6 79 -17 19 59 -10 57 -7 26 37 16 34 1 -14 -12
6156 -12 40 0 10 35 6 -5 1 -28 -38 50 -3 -61 77 -9 23 35 -11 20 43 -23 33 18 -34 -6 19 41 -39 4 -28 4
6186 4 2 5 13 13 -7 10 2 16 -42 0 -39 -3 24 -8 -5 8 27 23 3 10 -39 -13 8 44 -14 19 -37 10 -1 6 -20 45 51 -53 28
6221 28 -25 22 -53 0 63 -8 -21 -46 -2 7 43 29 42 6 -6 25 24 -11 57 72 -30 18 32 -12 -10 32 15 -3 -34 1 -13
6252 -13 18 17 -19 -37 -26 8 4 -21 37 -21 -60 -7 16 -62 -1 68 17 16 10 23 43 -20 39 -19 7 -2 -48 21 30 -19 38 37 -7 24
6286 24 3 61 9 -27 40 -9 -26 18 -23 -9 1 45 -9 74 7 6 -16 -8 -51 -14 -29 9 60 10 -7 -7 10 -9 8 -35 43 -49
6318 -49 30 -35 -24 11 12 48 -27 15 -34 -37 -13 19 -4 49 -36 16 7 -2 27 -28 24 -32 -19 1 60 -9 -10 5 8 4 -57 -19 0 10
6352 10 -19 -60 -2 30 -13 34 43 5 -35 7 8 -8 -57 -24 41 -10 12 -29 24 19 9 8 -50 -3 10 11 13 36 -14 -11 32 -27 39 30
6386 30 4 -9 54 40 40 -20 8 21 -12 -15 32 23 -24 -9 -29 14 -27 -14 36 35 24 24 10 10 42 -8 14 59 1 -45 -7 40 -42
6419 -42 -33 -18 -76 14 -7 31 -5 4 -6 12 14 -5 2 -12 41 0 28 22 -37 34 26 -2 3 21 6 36 40 -12 -7 -8 6 -11 7 -8 44
6454 44 -8 -40 -41 -3 -3 -44 16 -18 -42 51 19 -22 -41 -16 25 11 -24 16 -6 -1 19 -3 -12 11 -28 16 -8 13 10 -5 -34 -9 1
6487 1 35 13 -1 24 9 -26 12 7 -22 -3 25 -23 19 53 51 19 29 -17 -23 -3 28 55 10 19 -16 -15 -5 12 -10 -37 48 42 -10 4
6521 4 30 56 3 9 52 -41 29 31 -6 10 -17 -25 7 26 -24 18 -53 -34 -14 -17 -27 -13 -13 28 -22 17 -5 -18 -34 -7 43 16 6
6554 6 10 2 21 -16 -10 9 -32 28 -13 18 -20 20 17 13 -1 -45 50 24 34 -21 -44 21 -23 57 -1 -4 2 -56 -18 28 -1 -8 20 17 -46
6589 -46 0 -2 -18 -16 7 -19 -7 10 -28 -42 10 -49 -58 33 -8 2 9 -39 35 21 10 5 -3 19 31 12 -6 -10 -66 -41 -46 -39 -40 41 -31
6624 -31 12 -31 2 23 -44 51 -36 -25 13 -53 45 0 4 61 -1 -36 24 30 16 -1 -19 -22 39 -33 -35 50 20 22 -6 14 -15 -8 4
6657 4 38 13 2 41 49 15 61 39 17 5 -19 7 -35 -9 -28 35 -16 -21 -25 19 38 -20 53 28 65 30 -1 -23 17 11 -41 -21 -5
6690 -5 -18 -6 -37 42 22 48 19 -35 0 -17 12 8 33 7 -17 -52 -35 11 -20 -13 -5 -18 5 -15 -43 -17 44 43 33 5 -20 -45 -26
6723 -26 -2 -29 -3 10 -45 -22 9 -11 13 3 9 -2 19 -48 -11 -29 -16 16 -12 -34 -1 7 10 11 -1 -15 -3 -15 -37 3 -3 -14 40
6756 40 -53 13 -3 17 49 29 -5 14 25 9 43 -35 -9 36 22 -40 10 -2 -44 10 7 -10 -13 -9 -13 -29 -30 -23 -6 8 -24 4 -20
6789 -20 -50 32 49 15 15 -36 -11 34 -1 35 8 15 5 7 8 -12 12 -21 -47 -16 -60 51 -25 -2 -4 -10 25 -23 49 -7 -8 -29 2
6822 2 -37 -37 25 5 -59 50 35 3 -25 7 -12 31 -11 -8 12 13 -1 9 2 7 34 -12 -4 -33 -31 -38 3 40 12 14 49 5 31 1 -23
6857 -23 34 -3 6 9 5 -10 -6 35 10 32 -24 -14 -20 -54 11 20 20 -10 -45 -32 57 -32 -21 19 31 -12 -5 -6 -19 17 12 19 -11 39 -32 -25
6893 -25 45 -19 1 12 11 31 -61 -12 40 45 13 -3 -13 16 -14 -19 33 -10 -16 -14 -15 -20 25 8 33 -42 19 -5 -27 16 32 -15 42 21
6927 21 -46 -19 -28 -16 2 -13 5 -21 -21 -25 -50 -24 -29 -56 11 -2 4 21 -2 16 -14 37 -17 -7 -1 55 -9 0 3 -27 28 42 9 -8
6961 -8 14 -39 45 -38 -5 18 22 24 -25 -19 52 -1 -31 0 29 -4 25 -10 45 20 38 30 -46 23 -16 16 13 18 23 8 -5 -25 29 64
6995 64 -11 -1 30 23 64 -5 -1 -26 -36 13 33 57 7 -31 31 -10 5 10 13 -30 16 -36 18 53 -67 -8 22 36 -15 67 0 -3
7027 -3 -14 22 -30 19 -8 -6 7 -41 -24 -16 12 18 -31 -10 38 25 8 1 -13 -31 -24 26 52 -43 12 -2 43 25 -11 5 19 5 46
7060 46 -27 -20 14 11 -1 -9 -23 34 -39 -29 22 -40 28 26 -5 -38 -15 55 -4 -3 -18 4 2 -54 -4 22 -4 10 -18 -41 15 -13 -49
7093 -49 22 23 -10 -56 18 31 0 13 -35 -31 11 2 -18 28 74 -6 -26 35 -31 39 17 -12 16 -34 -15 23 -8 -10 26 4 -31 21
7125 21 -54 -13 36 -13 -46 -28 -21 18 9 11 -32 -31 -2 -8 -35 51 58 25 3 34 52 -7 46 25 -24 15 3 0 11 -11 23 -48 -30 -61
7159 -61 -30 -37 14 2 -2 -16 45 63 -41 -81 -19 -14 1 35 -25 6 -1 25 6 -16 -42 32 23 -29 15 38 -16 53 -9 -13 32 47 -7
7192 -7 -7 16 7 15 20 -29 52 15 -29 -34 17 -38 -22 -1 44 -9 -30 66 8 14 12 -12 -20 -43 14 -8 9 18 29 -25 -10 41 -39 8 10 -28
7228 -28 -52 -14 20 -11 -17 15 -59 19 40 -4 -18 7 -80 -4 2 -15 12 0 8 -12 -64 2 42 -24 -3 24 -22 -31 -9 51 -8 16
7260 16 57 -28 0 -31 63 -31 -15 -23 13 -31 12 22 -31 13 17 1 -7 -39 11 -24 -14 16 3 -30 -13 -50 -1 -22 -13 -14 -30 -30 21
7293 21 1 -26 4 -19 -45 -50 11 -22 29 51 -36 24 4 -38 11 10 8 -28 46 1 -34 -24 -14 -113 4 44 28 44 -21 -10 -2 8
7325 8 -16 12 -37 -9 -12 -15 -36 36 -17 6 33 -9 33 20 -8 56 12 -36 -46 -46 21 26 61 -10 -14 -28 -44 21 -49 31 18 -19 29
7358 29 -28 -10 10 44 -10 -71 -20 2 12 11 -23 12 -45 -29 2 -47 -8 17 -31 1 63 17 -9 -17 21 18 -21 -29 -5 -28 -52 -10
7390 -10 -21 -38 25 59 -16 -36 22 -40 -9 47 12 -6 36 22 -7 8 4 -39 -21 -12 -20 -8 20 -28 2 3 -23 -13 -31 -24 -18 -11 -17 -28
7424 -28 -3 -5 -11 -36 -23 -30 1 -30 0 -4 -9 -25 -9 13 -5 22 6 -13 22 11 40 5 -18 47 -8 -19 29 -3 -9 31 -22 -7 -28
7457 -28 9 -3 1 3 -32 -13 -44 6 4 20 -7 4 30 -59 -21 61 9 -21 19 4 19 43 29 -3 -50 -7 45 -6 28 -15 -38 -50
7489 -50 40 21 39 8 17 -17 -1 -35 -5 -13 -26 -16 -5 -20 -16 -15 12 -69 -29 40 -5 -14 30 -9 -35 -54 -27 36 9 -49 -6 -24 13
7522 13 8 -75 23 31 -19 -12 -6 0 27 -11 -49 5 -19 19 2 -10 -25 -62 -49 -33 60 16 -34 -22 28 34 29 14 25 38 -14 -52 1 -4
7556 -4 -37 42 -61 16 11 -20 8 0 45 50 -44 19 0 -3 0 -45 49 4 -1 -3 -7 28 -8 55 -23 30 10 -21 15 31 -28 -23 11 -36 -15
7591 -15 -59 14 -5 -7 31 -29 -27 -77 -12 20 2 25 13 -45 11 40 -21 21 -15 -39 -40 -21 15 -12 -33 -1 -29 -7 29 -3 14 32
7623 32 23 28 -19 -11 -30 -9 30 -16 13 25 30 -30 -9 75 -20 -17 -12 -11 1 34 28 15 38 6 39 -30 -39 30 -68 33 27 17 35 -24 -17
7658 -17 4 7 -6 1 43 17 35 29 21 2 -16 -62 -1 -12 34 -3 21 -13 0 -15 14 -42 -21 -11 11 26 -28 -6 43 -33 5 25
7690 25 46 -4 -8 23 -1 27 10 -2 -8 2 37 -32 20 39 -5 -5 -11 -26 -48 4 -1 13 3 2 -8 8 44 -51 -43 -50 34 5 4 0 49
7725 49 25 -60 11 -12 47 -36 20 -12 -7 -34 3 15 18 -16 -63 32 -54 26 -38 25 9 3 18 -14 -7 -37 -42 -8 -15 -62 -14 8 11 38
7759 38 -8 4 23 9 -17 -8 0 -22 25 37 5 41 -34 -23 -15 -1 36 27 -10 8 15 -20 15 12 -14 -16 0 17 -19 -31 -55 22 16 -2
7793 -2 23 -49 2 1 -12 38 2 28 12 -37 28 6 -12 23 16 -66 37 -34 2 -4 -17 39 55 13 47 -59 40 42 -7 -15 -34 15
7825 15 -45 33 11 -7 -25 -3 10 15 55 -51 44 -24 -13 23 -34 -5 -3 -15 38 31 -36 38 -3 60 -18 -13 7 1 25 42 -10 12
7857 12 20 35 16 18 -27 -12 57 -26 -14 42 34 -8 8 -21 -27 -54 13 -9 -50 -31 -21 -22 28 31 2 -14 42 4 41 1 -36 -37 16 8
7891 8 49 -31 -19 21 33 21 -13 6 -27 -10 -42 74 -16 11 21 -35 65 -20 -21 12 -34 5 14 -9 18 45 38 -49 -1 51 2
7922 2 -12 -7 -9 24 13 34 41 23 -17 -15 -14 8 33 40 6 31 13 -5 40 0 -9 37 43 -43 40 -3 -6 -1 7 51 -41 -3 72 43 11 -15
7958 -15 50 -13 -20 -15 -26 -35 15 -46 11 -7 37 -4 -7 20 18 22 -1 15 10 4 -19 4 -21 19 34 -31 -14 -37 -13 -18 35 -41 32 -9 -8
7993 -8 -32 27 -3 -3 -12 -5 54 -3 -3 -31 23 -7 16 -72 -12 -33 -10 13 7 -14 16 -6 -2 33 59 -38 -57 14 52 -22 -22 2 -1 -8 1 6
8029 6 14 31 22 16 57 3 -4 -40 -16 -22 -42 16 -60 -28 -59 8 -54 30 -33 23 -33 -42 -13 -5 -10 21 -9 -5 7 -31 -23 -10 10 10 8 -5 16
8066 16 -19 -3 36 39 24 18 -46 2 49 4 41 64 8 14 16 -43 -16 22 2 -20 9 -14 -19 -26 39 -20 -32 -13 28 29 1 11 -1 4
8100 4 -3 8 23 43 54 16 -11 -34 37 23 -28 -25 2 12 10 45 56 26 2 -3 25 -12 -33 45 37 47 4 2 -17 -9 -6 -7 60 1 46
8135 46 -57 -69 -14 -8 55 55 34 -45 12 21 2 25 -37 -27 49 -31 6 7 2 10 -2 -44 14 -13 54 -14 -17 -17 23 -2 -27 -32 -20 21
8169 21 5 2 41 2 -10 14 12 23 -5 14 -7 -29 41 13 32 43 -8 31 4 16 14 -31
8191c1
##END NTUPLES=NMR FID
##END=
