##TITLE=1H_AM_NVNaPh4
 200.13MHz, D2O,
 8 sc
 
 10.9.2025
##JCAMPDX= 6.0         $$ Bruker NMR JCAMP-DX V2.0
##DATA TYPE= NMR FID
##DATA CLASS= NTUPLES
##ORIGIN= UXNMR, Bruker Analytische Messtechnik GmbH
##OWNER= pz
$$ XWIN-NMR		Version 3.5
$$ Wed Sep 10 16:16:35 2025 Russian Standard Time (UT+4h)  she@DPX200
##.OBSERVE FREQUENCY= 200.1313
##.OBSERVE NUCLEUS= ^1H
##.DELAY= (6, 6)
##.ACQUISITION MODE= SIMULTANEOUS
##.ACQUISITION SCHEME= undefined
##.AVERAGES= 8
##.DIGITISER RES= 18
##SPECTROMETER/DATA SYSTEM= spect
##.PULSE SEQUENCE= zg30
##.SOLVENT NAME= D2O
##.SHIFT REFERENCE= (INTERNAL, D2O, 0, 14.3821)
##AUDIT TRAIL= $$ (NUMBER, WHEN, WHO, WHERE, WHAT)
$$ ##TITLE= Audit trail, XWIN-NMR		Version 3.5
$$ ##JCAMPDX= 5.01
$$ ##ORIGIN= Bruker BioSpin GmbH
$$ ##OWNER= she
$$ F:/spectra/data/she/nmr/H-C/1/audita.txt
$$ ##AUDIT TRAIL=  $$ (NUMBER, WHEN, WHO, WHERE, WHAT)
(   1,<2025-09-10 16:15:09.06 +0400>,<she>,<DPX200>,
      <created by zg, POWCHK disabled, PULCHK disabled
       configuration hash MD5:
       00 E9 B6 7A A2 85 ED C7 34 08 36 98 17 FE 4E 26
       data hash MD5: 16K
       1B A2 AF AC 35 D1 6C E9 23 FF 93 8D 0E 7A F6 57>)
$$ ##END=
$$ 
$$ hash MD5
$$ 9A 7E C6 3D 5B 3E E9 00 27 DC 72 45 8D 12 CA A4
##$RELAX= 
##$RELAX= 
##$RELAX= 
##$RELAX= 
##$RELAX= 
##$RELAX= 
$$ Bruker specific parameters
$$ --------------------------
##$DU= <F:/spectra>
##$EXPNO= 1
##$NAME= <H-C>
##$PROCNO= 1
##$TYPE= <nmr>
##$USER= <she>
##$AMP= (0..31)
100 100 100 100 100 100 100 100 100 100 100 100 100 100 100 100 100 100 
100 100 100 100 100 100 100 100 100 100 100 100 100 100 
##$AQSEQ= 0
##$AQ_mod= 1
##$AUNM= <au_zg>
##$AUTOPOS= <>
##$BF1= 200.13
##$BF2= 200.13
##$BF3= 200.13
##$BF4= 200.13
##$BF5= 200.13
##$BF6= 200.13
##$BF7= 200.13
##$BF8= 200.13
##$BYTORDA= 1
##$CFDGTYP= 0
##$CFRGTYP= 5
##$CHEMSTR= <none>
##$CNST= (0..31)
1 1 145 1 1 1 1 1 1 1 1 1 1 1 1 1 1 1 1 1 1 1 1 1 1 1 1 1 1 1 1 1 
##$CPDPRG= <>
##$CPDPRG1= <>
##$CPDPRG2= <>
##$CPDPRG3= <>
##$CPDPRG4= <mlev>
##$CPDPRG5= <mlev>
##$CPDPRG6= <mlev>
##$CPDPRG7= <mlev>
##$CPDPRG8= <mlev>
##$CPDPRGB= <>
##$CPDPRGT= <>
##$D= (0..31)
0 0.7 0 0 0 0 0 0 0 0 0 0.03 0 0 0 0 0 0 0 0 0 0 0 0 0 0 0 0 0 0 0 0 
##$DATE= 1757506508
##$DBL= (0..7)
120 120 120 120 120 120 120 120 
##$DBP= (0..7)
150 150 150 150 150 150 150 150 
##$DBP07= 0
##$DBPNAM0= <>
##$DBPNAM1= <>
##$DBPNAM2= <>
##$DBPNAM3= <>
##$DBPNAM4= <>
##$DBPNAM5= <>
##$DBPNAM6= <>
##$DBPNAM7= <>
##$DBPOAL= (0..7)
0.5 0.5 0.5 0.5 0.5 0.5 0.5 0.5 
##$DBPOFFS= (0..7)
0 0 0 0 0 0 0 0 
##$DE= 6
##$DECBNUC= <off>
##$DECIM= 32
##$DECNUC= <off>
##$DECSTAT= 4
##$DIGMOD= 1
##$DIGTYP= 9
##$DL= (0..7)
0 120 120 120 120 120 120 120 
##$DP= (0..7)
150 150 150 150 150 150 150 150 
##$DP07= 0
##$DPNAME0= <>
##$DPNAME1= <>
##$DPNAME2= <>
##$DPNAME3= <>
##$DPNAME4= <>
##$DPNAME5= <>
##$DPNAME6= <>
##$DPNAME7= <>
##$DPOAL= (0..7)
0.5 0.5 0.5 0.5 0.5 0.5 0.5 0.5 
##$DPOFFS= (0..7)
0 0 0 0 0 0 0 0 
##$DQDMODE= 0
##$DR= 18
##$DS= 0
##$DSLIST= <SSSSSSSSSSSSSSS>
$$ [...]
##$SUBNAM0= <"">
##$SUBNAM1= <"">
##$SUBNAM2= <"">
##$SUBNAM3= <"">
##$SUBNAM4= <"">
##$SUBNAM5= <"">
##$SUBNAM6= <"">
##$SUBNAM7= <"">
##$SUBNAM8= <"">
##$SUBNAM9= <"">
##$SW= 18.0517328524113
##$SWIBOX= (0..15)
0 0 2 0 0 0 0 0 0 0 0 0 0 0 0 0 
##$SW_h= 3612.71676300578
##$TD= 16384
##$TD0= 1
##$TE= 0
##$TE2= 300
##$TE3= 300
##$TEG= 300
##$TL= (0..7)
0 120 120 120 120 120 120 120 
##$TP= (0..7)
150 150 150 150 150 150 150 150 
##$TP07= 0
##$TPNAME0= <>
##$TPNAME1= <>
##$TPNAME2= <>
##$TPNAME3= <>
##$TPNAME4= <>
##$TPNAME5= <>
##$TPNAME6= <>
##$TPNAME7= <>
##$TPOAL= (0..7)
0.5 0.5 0.5 0.5 0.5 0.5 0.5 0.5 
##$TPOFFS= (0..7)
0 0 0 0 0 0 0 0 
##$TUNHIN= 0
##$TUNHOUT= 0
##$TUNXOUT= 0
##$USERA1= <user>
##$USERA2= <user>
##$USERA3= <user>
##$USERA4= <user>
##$USERA5= <user>
##$V9= 5
##$VALIST= <valist>
##$VCLIST= <CCCCCCCCCCCCCCC>
##$VD= 0
##$VDLIST= <DDDDDDDDDDDDDDD>
##$VPLIST= <PPPPPPPPPPPPPPP>
##$VTLIST= <TTTTTTTTTTTTTTT>
##$WBST= 1024
##$WBSW= 4
##$XGAIN= (0..3)
0 0 0 0 
##$XL= 0
##$YL= 0
##$YMAX_a= 585777
##$YMIN_a= -510431
##$ZGOPTNS= <>
##$ZL1= 120
##$ZL2= 120
##$ZL3= 120
##$ZL4= 120
##$ABSF1= 10
##$ABSF2= 0
##$ABSG= 5
##$ABSL= 3
##$ALPHA= 0
##$AQORDER= 0
##$ASSFAC= 0
##$ASSFACI= 0
##$ASSFACX= 0
##$ASSWID= 0
##$AUNMP= <proc_1d>
##$AZFE= 0.1
##$AZFW= 0.1
##$BCFW= 1
##$BC_mod= 2
##$BYTORDP= 1
##$COROFFS= 0
##$CY= -3
##$DATMOD= 1
##$DC= 2
##$DFILT= <>
##$DTYPP= 0
##$F1P= 0
##$F2P= 0
##$FCOR= 0.5
##$FTSIZE= 0
##$FT_mod= 4
##$GAMMA= 1
##$GB= 0.15
##$INTBC= 1
##$INTSCL= 1
##$ISEN= 128
##$LB= 0.25
##$LEV0= 0
##$LPBIN= 0
##$MAXI= 10000
##$MC2= 0
##$MEAN= 0
##$ME_mod= 0
##$MI= 1.114404
##$NCOEF= 0
##$NC_proc= 0
##$NLEV= 6
##$NOISF1= 3.799351
##$NOISF2= 2.8
##$NSP= 1
##$NTH_PI= 0
##$NZP= 0
##$OFFSET= 14.38212
##$PC= 1
##$PHC0= -1564.884
##$PHC1= 11.99228
##$PH_mod= 1
##$PKNL= yes
##$PPARMOD= 0
##$PSCAL= 0
##$PSIGN= 0
##$REVERSE= no
##$SF= 200.129724274929
##$SI= 16384
##$SIGF1= 3
##$SIGF2= 2
##$SINO= 400
##$SIOLD= 16384
##$SREGLST= <1H.CDCl3>
##$SSB= 0
##$STSI= 0
##$STSR= 0
##$SW_p= 3205.1282051282
##$SYMM= 0
##$S_DEV= 0
##$TDeff= 0
##$TDoff= 0
##$TI= <>
##$TILT= no
##$TM1= 0
##$TM2= 0
##$TOPLEV= 0
##$USERP1= <user>
##$USERP2= <user>
##$USERP3= <user>
##$USERP4= <user>
##$USERP5= <user>
##$WDW= 1
##$XDIM= 8192
##$YMAX_p= 0
##$YMIN_p= 0
$$ End of Bruker specific parameters
$$ ---------------------------------
##NTUPLES= NMR FID
##VAR_NAME=  TIME,          FID/REAL,        FID/IMAG
##SYMBOL=    X,             R,               I
##VAR_TYPE=  INDEPENDENT,   DEPENDENT,       DEPENDENT
##VAR_FORM=  AFFN,          ASDF,            ASDF
##VAR_DIM=   8192,          8192,            8192
##UNITS=     SECONDS,       ARBITRARY UNITS, ARBITRARY UNITS
##FACTOR=    0.0002768,     1,               1
##FIRST=     0,             0,               0
##LAST=      2.2672688,     0,               0
##MIN=       0,             -510431,         0
##MAX=       2.2672688,     585777,          0
$$ Real data points
##PAGE= N=1
##DATA TABLE= (X++(R..R)), XYDATA
$$ [...]
3050D78J749R84m33j397j585j873j015J21J323J809J776J185J21j545j732k242
3066b276p09r9J152J733K068J185k9j368j560j857j405J54J033J711J823J353
3082B909K03j250j479j957j309j37R66J492J996J094O49q21j905j967j174n11
3098c201P90J896J629J666K01n88j764j914j276p99R77J551J865J517P81p58j691
3115H82j973j229n86K82J601J703J887P51o25j682j846j803m42J53J626K087J494
3132B280Q49l17j210k197j381j067L11J353J753J842O58L4j377j938j870o85J4
3149b948J159K056J940Q16p2j157j908j793j247L33J281J718J883J041j71j167
3165A764j589k006j171k1R41J889J796J179R4o03j912j881j148o07J251J640J898
$$ plain form
3050 478 2227 3211 2778 1381 -204 -2077 -3092 -2971 -1648 161 1937 3122 3243 1698 -34 -2276
3066 -2276 -2985 -3084 -1932 -199 1869 3054 3025 1657 97 -1760 -3165 -3011 -1978 -267 1556 2909
3082 2909 3112 1862 383 -1574 -2883 -3020 -2054 -562 1434 2528 3177 2356 451 -1516 -2690 -3201
3098 -3201 -2411 -515 1114 2780 2981 2393 629 -1285 -2561 -3360 -2383 -832 1033 2550 3331 2573 882
3115 882 -1091 -2320 -2906 -2624 -1023 680 2567 3318 2693 1011 -835 -2638 -3080 -2927 -1301 786 2280
3132 2280 3129 2812 1602 -595 -1976 -3043 -2732 -1379 374 2216 2874 2908 1531 -407 -2277 -2962 -2948
3149 -2948 -1789 267 2207 3023 2951 1794 -114 -1907 -3154 -2821 -1540 178 2061 3102 2931 1764
3165 1764 175 -1831 -3002 -3023 -2082 -193 1603 2782 2876 2273 361 -1520 -2668 -3275 -2024 -384 1514
3182A514J441K26r07j916j788j210l14O69J795J822J302K01m44j958j571j485
3198b623l14N70J699J700J255R25p46j569j587j899n15O63J263K095J418O00n78
3215B357j288j966j553p23N74J497J865J653M90j21j530j904j611p68L94J185
3231a449J780J767Q90l27j081j821j616j150Q3J275J836J855J046l80p70j972
3247c4j808j115J60R55J810J822J100J11j223j789j869r64k53J077J919J620J324
3264B843K44r49k015j776j475K82N45J857J924J477j12p56j548j959j289m48J167
3281a988J416J787J409J86l64j793j638j619o05O65J863J679J605M69r15j059
3297A098k016j480n45M47J725J718J521Q35r03j539j745j517q27N11J527J710
$$ plain form
3182 1514 2955 3181 2274 358 -1430 -2640 -2954 -2285 -490 1332 2634 2835 2391 433 -1138 -2623
3198 -2623 -2937 -2367 -668 1032 2287 3212 2466 897 -690 -2589 -3104 -2441 -1178 917 2335 2935 2357
3215 2357 1069 -897 -2450 -3173 -2599 -1102 763 2416 2906 2785 1255 -649 -2260 -3028 -2634 -1449
3231 -1449 331 2098 2988 2661 1580 -241 -1857 -3007 -2924 -1649 187 2042 3088 2708 1938 -34
3247 -34 -1842 -2957 -2797 -1842 -32 1790 2890 3001 1778 -11 -1880 -2844 -3097 -2020 -101 1519 2843
3264 2843 3087 2138 123 -1653 -3128 -2846 -2301 -444 1480 2957 2845 2089 541 -1418 -2707 -3155 -1988
3281 -1988 -572 1215 2624 2810 2446 653 -985 -2604 -3209 -2544 -681 998 2603 3072 2157 1098
3297 1098 -918 -2398 -2943 -2496 -771 947 2468 3303 2400 861 -884 -2401 -3228 -2717 -1190 520
3313E20J734R25n01j409j936j356n88J09Q93K083J599O18J19j468j745j803j012
3330c218M77J179J565J875J072j53j153j780j735j077J96P91K158J625R28Q9j095
3347A744j968j172j509J18Q88J639J720J510R2r02j955j592j449m9P70J631K075
3364A591J257L9p25j748j798j026m26N87J756J616J494J10n93j437j910j145p84
3381c142P22J385K153J136N81m90j357j925j318p47P27J160K078J442N16p34j443
3398G44j521j542o24L52J455J867J415P24j06j462j775j676o98K50J469J672J762
3415B306O18l04j076k056j442j008L98J003J718J548R85K59j163k015j641q41
3431b711j72J231J774J774O63R2q42j732j826j148o5R25J848J804J231K9q00j690
$$ plain form
3313 520 2254 3179 2678 1269 -667 -2023 -2611 -2502 -1609 474 2073 2691 2810 1342 -403 -2206 -3218
3330 -3218 -2741 -1562 3 1878 2950 2797 1644 -136 -1871 -2948 -2752 -1961 197 1822 2750 2839 1744
3347 1744 -224 -1396 -2905 -2787 -1899 -260 1460 2970 3062 2160 205 -1387 -2836 -2885 -2115 -484 1591
3364 1591 2848 2887 2162 414 -1384 -2410 -2836 -2249 -493 1123 2617 2727 2134 697 -1213 -2358 -3142
3381 -3142 -2420 -1035 1118 2254 2835 2345 988 -937 -2255 -3002 -2275 -1115 963 2405 2921 2187 744
3398 744 -777 -2319 -2943 -2591 -1136 731 2146 2870 2764 1302 -473 -2149 -2847 -2597 -1128 544 2306
3415 2306 2924 2620 1544 -512 -1954 -2962 -2564 -1561 157 1705 2690 2949 1786 -229 -1870 -2711
3431 -2711 -2883 -1652 122 1896 2559 2651 1809 77 -1749 -2897 -2962 -2037 -189 1615 2846 2875 2075 385
3449C85j944j382K36Q30J608J566J649j3j084j449j363j536l13P88J400J971J402
3466B751Pq40j352j520j466m87O56J488J706J391P30p13j715j499j565m21L80
3483b469J439J869J482N07n32j436j777j422n57M84J289J947J348P88l76j461
3499A123j575j802o08J55J520J619J742L73q1j208j603j591q27j07J453J846J476
3516A905Q77N9j433j965j052j370K73J339J533J634R83r8j163j476j592j118r4
3533b758R12K041J401J009R9j134j404j601r68m76J001J613J865R80K2r59j112
3550E31j839j219m02Q08J683J351J451O44q69j640j616j313l78O54J377J981J257
3567B461L23o45j267j749j401m34O91J361J456J448Q42p94j451j565j497m42L98
$$ plain form
3449 385 -1559 -2941 -2705 -1875 -267 1299 2948 2935 1851 402 -961 -2497 -2810 -2022 -622 1349 2751
3466 2751 2758 1918 566 -954 -2420 -2907 -2251 -763 943 2334 3064 2351 636 -863 -2428 -2849 -2469
3483 -2469 -1030 839 2321 2828 2296 860 -917 -2339 -2896 -2412 -1123 824 2172 2960 2584 1123
3499 1123 -452 -2254 -2862 -2707 -1187 432 2174 2547 2466 1258 -345 -1936 -2763 -2870 -1417 429 1905
3516 1905 2782 2841 1408 -557 -1609 -2979 -2706 -1367 166 1800 2783 2685 1522 46 -1546 -2664 -2758
3533 -2758 -1846 195 1596 2605 2704 1570 166 -1435 -2403 -2879 -1878 -265 1600 2580 2602 1643 531
3550 531 -1308 -2527 -2929 -2121 -438 913 2364 3008 2139 499 -1117 -2430 -2808 -2154 -777 1204 2461
3567 2461 2784 2139 872 -877 -2278 -2712 -2021 -660 796 2244 3086 2292 841 -724 -2221 -2663 -2265
3584b265J243J746J303O51n05r87j998j421m64J53J220J762J469P43k68j142j676
3601d36j327q59J40J163J394J758R52m92q45j407j556j183J0J390J363J688O71
3618B424Q1q81j825j269j077r6R07J800J535Q33K62j137j425j488r73m08Q18J757
3636a62J667R16K91q91j712j117j293j96O31J449J600J142L42p17j427j709j333
3653b519j24M86J237J877J371J95o07j113j793r55p98N40J040K097J186M18n13
3670B025j327j182j581n15L06J376J545J262O49k69j470j519j171o23J97J302
3686i95J621J417N22k45j225j559j336q97O40P29J754R88J228j12j294j266j691
3703a721n73k90J197J397J460P57J84p58j630j503q04j92R76J481J315R16M0l64
$$ plain form
3584 -2265 -1022 724 2027 2678 2173 1186 -812 -2233 -2697 -2544 -1324 438 1907 2650 2382 1240 -436
3601 -436 -1763 -2622 -2482 -1319 75 1833 2785 2293 1448 41 -1515 -2698 -2688 -1298 65 1753 2424
3618 2424 2505 1624 -201 -1470 -2547 -2643 -1736 64 1599 2432 2694 1557 132 -1356 -2329 -2737 -1919 -162
3636 -162 1505 2421 2712 1821 109 -1008 -2301 -2497 -1866 -417 1183 2325 2667 1950 523 -1186 -2519
3653 -2519 -2643 -2157 -920 957 2328 2523 1916 803 -990 -1945 -2743 -2203 -1163 934 2120 2538 2025
3670 2025 698 -484 -2065 -2580 -2274 -898 647 1909 2558 2289 819 -700 -1871 -2494 -2297 -995
3686 -995 626 2043 2565 2320 1095 -464 -1800 -2697 -2057 -1328 426 1414 2642 2530 1236 -30 -1721
3703 -1721 -2294 -2584 -1387 10 1470 2227 2411 1653 23 -1480 -2284 -2476 -1500 -19 1296 2212 2252 1888
3721A888j667j470q64l97J151J069J689R92J90o20j709j406j124j85Q99J241J433
3738A110J008N72q18j255j913r04k24M63J181J640J153M25n76j266j427j187m83
3755b501K76J420J673J132M91n56j137j167j668m25K16J298J525R14J071p02p80
3772A080j748j162o41L09J308J324J253Q90l84j190j217j335j015L31R25J840
3788E68R29Q06m8p64j612j477o78j04J342J523R19Q03k6r79j135j367j177R7J044
3807a336J386J256Q50R8q11j205j820n62k22O32J206J502J125L27n39j461j807
3824a381p87N5M99J358J404J047L66j221q70j506q03k66K68J475J334Q61O04n24
3842A913j459j349j057n97Q09J108J386J155N39q17q54j572j137n25M95J086J351
$$ plain form
3721 1888 221 -1249 -2113 -2510 -1359 -290 1399 2391 2581 1961 252 -1154 -2278 -2463 -1564 -323 1110
3738 1110 2118 2690 1872 617 -1296 -2200 -2424 -1961 -780 860 2013 2438 1862 596 -831 -2018 -2501
3755 -2501 -2225 -805 868 2000 2491 1935 798 -369 -2037 -2462 -2246 -948 577 1491 2562 1860 1080
3772 1080 -668 -1830 -2471 -2162 -854 470 1723 2613 2229 1039 -178 -1513 -2528 -2197 -1272 568
3788 568 1497 2303 2255 1491 -121 -1598 -2276 -2380 -1038 485 1404 2207 2181 1202 67 -1300 -2477 -2380 -1336
3807 -1336 50 1306 2156 2254 1443 238 -1582 -2144 -2366 -1734 -528 974 2099 2426 1887 426 -1381
3824 -1381 -2168 -2113 -1614 -256 1148 2195 2561 1340 470 -1036 -1839 -2105 -1837 -362 972 1833 2437 1913
3842 1913 454 -895 -1952 -2549 -1740 -632 754 1909 2448 1631 777 -795 -1932 -2457 -1962 -876 475
3859D75J294N93m36r96j553j073p37M56Q26J413J471O67m26j060j237j024r30
3876b277j5J324J041J387O89J48j069j531j235q12K70P74J304J373P14Q9q24j359
3894ij385o69j43Q06J342J326J009o7n71j422j315j311K45P26J126J459R74L74
3912B495p95j431j251o06r17J058J179J087J040J97n13j166j383r61k76P38R13
3929e92J306J344q0m77o70j584j171l11K96J207J323J105N83m72j053j516j037
3946a799n58L37J290R97J586O42o50j126j333j108m93K12J210J220J174P26m16
3963A911p81j485j077n88M1P67J458J110O56J21q10j528j258p54L10P60J335J304
3981A492P99k08o39j428j478n55j94Q82J346J340O65K71q39j300j447r36J40N77
$$ plain form
3859 475 1769 2362 1926 930 -623 -1696 -2433 -1977 -1151 262 1733 2400 1974 914 -323 -1347 -2277
3876 -2277 -2292 -968 73 1460 2149 2297 1228 -303 -1538 -2350 -2080 -1306 -2 1371 2085 2174 1350 -9
3894 -9 -1394 -2063 -2206 -1400 -58 1268 2277 2210 1639 217 -1098 -2409 -2164 -1438 -312 1147 2121 2495
3912 2495 1700 269 -982 -1588 -2505 -1447 -268 819 1859 2056 1543 377 -1006 -1967 -2243 -1505 -592
3929 -592 714 2058 1978 1501 831 -753 -1924 -2235 -1939 -732 591 1696 2279 1807 754 -762 -1799
3946 -1799 -2357 -2020 -730 267 1853 2495 1845 719 -614 -1722 -2215 -2003 -793 427 1601 2327 1911
3963 1911 1130 -355 -1432 -2020 -1979 -1212 246 1356 2012 2133 1323 -205 -1463 -2217 -1907 -1147 188 1492
3981 1492 2291 2083 1444 16 -1462 -2017 -2211 -1329 17 1357 2022 2293 1454 154 -1293 -2229 -2089 -1512
3999a512J172J426P21M91p76j272j296r59k25P39J081J456R81j7n47j042j305
4016h84j011n49O39J401J042J030P28n10j367j450r83l00L75J129J529Q55M45
4033B119k51j149j305j044o31M21J192J218J128O18l32r98j501j137l58M82O72
4050h56J248R90R08l51o41j410j561o71K42J099J451R56K60O33r91j616j086o42
4068b038J60Q24R95J361O75L58j130j105j166q90j23P86J460R83J085j34o67j170
4086B64j303j161m8Q30J278J241J005J67p38j319r36j251k79Q70R38J271J237
4103B066J02o81q06j829r00l12O46J338J083R25M46l20j134j382j062l93L74J397
4121d42J113J220N09o26j038j229j138o34L07J207J227J242M98m60p76j322j624
$$ plain form
3999 -1512 -340 1086 1807 2298 1522 250 -1046 -2005 -2230 -1491 -410 1046 2027 2010 1463 421 -884
4016 -884 -1895 -2444 -1805 -404 638 1668 2396 1886 519 -931 -1914 -2214 -1839 -710 819 1674 2119
4033 2119 1868 719 -586 -1630 -2261 -1840 -648 570 1698 2316 1984 986 -515 -1652 -2010 -1528 -856
4050 -856 392 1382 2290 1939 1298 -112 -1673 -2344 -2102 -1003 448 1404 1664 2297 1306 -310 -1396 -2038
4068 -2038 -1878 -1054 -59 1302 1977 2335 1205 100 -1066 -1956 -2079 -1293 167 1150 2235 2101 1434 264
4086 264 -1039 -2200 -2248 -1418 -140 1101 2106 2273 1535 216 -720 -1971 -2250 -1380 -442 829 2066
4103 2066 2168 1487 681 -1148 -2048 -2360 -1714 -376 707 1632 2078 1758 624 -758 -1820 -2213 -1839 -442
4121 -442 671 1891 2400 1774 736 -493 -1631 -2265 -1958 -751 476 1718 2216 1756 980 -342 -1966
4138a966j28P5J047J223J429N71m64o74j335j235o86J02Q23J474J279N59j37r92
4156I65j239j187p23K17M87J636J157Q59r7o09j716r18j081J20P26J216J381J040
4174B234K5q90j165j393r23j53O03J392J458P38K07p41j158j274r18k04N30J278
4192c54J343Q70L19q23q04j432j143l10O49R23J645R84K40m42j275r91j315n01
4210b417O42R65J568J080P68p85r55j324j256l30J16J055J356J412L36k74j008
4227I49j329j443n39K99N65J526J579M85R0r73j381j604l28P6R74J123J489M23
4245A981O1j012j229j177r97J18Q19J502J102J127p2r72j208j256q43j11R07J309
4263D9J038J024j64p70r45j384j193J89P28J059J365J013L39o11j296j598r56
$$ plain form
4138 -1966 -2094 -2019 -972 251 1680 2251 1787 1113 -222 -1457 -2143 -2041 -1218 256 1535 2094 1957 965
4156 965 -274 -1461 -2184 -1967 -1480 156 1313 2172 2075 1466 -250 -1168 -2249 -2129 -1403 -187 1194 2234
4174 2234 2259 1369 204 -1189 -2112 -2265 -1662 -270 1188 1926 2133 1392 234 -1040 -1958 -2162 -1632 -354
4192 -354 989 1859 2178 1355 551 -881 -2024 -2334 -1685 -762 883 1867 2107 1665 390 -601 -1916 -2417
4210 -2417 -1775 -810 758 1838 2606 1821 866 -458 -1714 -2044 -1928 -873 483 1895 2231 1957 949
4227 949 -380 -1823 -2362 -2063 -1498 28 1607 2092 2182 1209 -172 -1776 -2104 -2028 -1054 69 1558 1981
4245 1981 2042 1030 -199 -1376 -2373 -2255 -1436 66 1168 2295 2223 1251 43 -1213 -2056 -2167 -1260 49
4263 49 1087 2111 1947 1177 232 -1152 -2345 -2156 -1428 -369 996 2009 2348 1737 441 -1157 -2113
4280b113r3O37J208J452R62J55m73j567j068j254k7N70Q44J613J110J74j43r80
4298A007j791j284j53P6J191J348J338K93p4j181j601r51l07J66R12J529J299
4315A817L62l24q28j659j282m32K85P45J746J063P53j27q64j527j173r52L36R21
4333a140J353J348P38o1r76j435r73r99P7O09J274J690Q77k13j120p12j729p71
4351b163l64J202J119J526P08K69r38q95j646j129K22L38J528J111J225J21p04
4368A530j154j505j182J3L46J849J142R99J88n14r70j547j226k83M03J167J493
4385G49J013P11o96q38j563j251k03j11J293J539J127M23l20q65j441j328l82
4402b143j32J486J321J118O44r0j238j401j051j099K3J411J413J214O39J29r22
$$ plain form
4280 -2113 -2206 -1569 -361 1091 2053 2208 1735 168 -900 -2154 -2181 -1611 -767 846 1956 2130 1987 1007
4298 1007 -784 -2068 -2221 -2145 -954 394 1732 2025 1951 770 -831 -1782 -2089 -1923 -1011 518 1817
4315 1817 2179 1855 1027 -632 -1914 -2346 -2061 -1316 430 1493 2246 2119 1255 -272 -1445 -2397 -2061 -1140
4333 -1140 213 1561 2299 2238 1262 -173 -1146 -2145 -2068 -1459 -185 1505 2382 2169 1049 337 -1392 -2163
4351 -2163 -2527 -1325 -206 1320 2028 2297 1359 464 -1182 -2311 -2089 -1751 -223 888 2113 2234 1530
4368 1530 376 -1129 -2311 -2298 -1952 -103 1039 2038 2226 1712 742 -805 -2031 -2314 -1911 -744 749
4385 749 1762 2473 1777 939 -624 -1875 -2078 -2189 -896 643 1770 2193 1873 1008 -433 -1761 -2143
4402 -2143 -2275 -789 532 1650 2294 2204 966 -435 -1486 -2585 -2562 -1151 262 1476 2115 2244 1322
4419A322j457j247j117L75R32J659J045P42J92j050j420j308j054M4R64J328J648
4436A598P03P6p93j643j294q03o08Q68J645J504R34L07r51j489j323j052mO26
4454a699J328J502J035L05o13j524j308j177n04O55J407J410J242L80p37j077
4470F25j457j034p57Q26J054J364J717Q7m82r00j729j316j88L20Q48J603J487
4487B068L32l13j008j639j137p13L03J002J623J111Q40j92r02j809j081n84j18
4504b217Q39J980J041N48K35j215j476r97j137M0Q65J707J252R00j1j087j267
4521@j317j085n9O76J736J259J040k1p37j243j592p84m61Q03J317J694R40L33
4539B499p71j490j330j280q6P26J224J639J013M84q16j333j725j152J8L44J108
$$ plain form
4419 1322 -135 -1382 -2499 -2124 -1192 467 1512 2254 2446 1396 -24 -1332 -2386 -2342 -1378 -50 1598
4436 1598 2301 2377 1584 -59 -1353 -2156 -2764 -1896 -251 1253 2187 2494 1543 54 -1269 -2321 -2325 -1699
4454 -1699 -371 1131 2166 2471 1858 334 -974 -2151 -2655 -2000 -593 817 2059 2439 1702 625
4470 625 -832 -1866 -2623 -1797 -743 621 2338 2425 1943 1043 -686 -2002 -2190 -1870 -1022 581 2068
4487 2068 2400 2087 1079 -560 -1697 -2410 -2107 -1105 518 1629 2469 2277 1375 -434 -1515 -2099 -2217
4504 -2217 -1378 602 1643 2191 2426 1211 -265 -1262 -2399 -2359 -1494 213 1465 2365 2354 1267 0
4521 0 -1317 -2402 -2461 -1785 -49 1210 2250 2229 1492 249 -1343 -2127 -2588 -1785 -468 1226 2166 2499
4539 2499 1728 238 -1092 -2372 -2458 -1732 -508 1131 2144 2628 1812 479 -1246 -2398 -2380 -2036 -928
4556i28J733J111L65m47j216j404j236n31L77J426J303J309O79l66j192j621j252
4573a890q07O38J003J467J433M01J28j322j588j178q49L51J040J488J480L83o3
4590B115o85j935j257o90K80Q12J585J459R17l65p46j426j675j014M20O43J590
4607B8J717O31l3n08j818j310j224k02J020J658J473P83J84o28j343j630j173
4624b375j24O86J482J489J108K87o52j218j700j010m54N62J186J924Q78L45p88
4641A626r19j486j410m86M53J418J563J352L40k65j362j361j771l92P85J105J350
4658E40J576L25l12j204j453j009p61j73J120J786J276P71j75j296j216j708o99
4675b612N0J379J193J776R81l29j182j311j525q02j01Q57J719J314J261n23k97
$$ plain form
4556 -928 805 1916 2281 1834 618 -786 -2022 -2553 -2176 -750 553 1862 2541 2175 983 -638 -1890
4573 -1890 -2697 -2059 -1056 411 1844 2245 2373 1051 -537 -1715 -2564 -2213 -1173 315 1795 2178 2115
4590 2115 1430 -505 -1762 -2452 -2172 -1360 225 1684 2601 2236 1490 64 -1611 -2625 -2205 -1562 28
4607 28 1745 2376 2343 1835 17 -1293 -2517 -2719 -1699 -41 1432 2215 2399 1771 428 -1202 -2375
4624 -2375 -2499 -1813 -331 1158 2266 2553 1901 683 -1017 -2027 -2481 -1919 -733 1191 2069 2414 1626
4641 1626 707 -779 -2189 -2675 -2222 -804 759 2111 2451 2186 824 -537 -2308 -2700 -1915 -810 540
4658 540 2116 2441 2129 925 -528 -1537 -2298 -2471 -1351 435 1711 2482 2307 1011 -205 -1913 -2612
4675 -2612 -2562 -1183 10 1786 2767 2438 1256 -55 -1580 -2382 -2483 -1626 93 1407 2668 2145 1848
4692A848j890j474p32m07J089J383J663R68J22q73j606j208j057m94J043J453
4708a72J482Q29L34p07j385j274j250j06O48Q55J744J188M84p11j105j783j360
4725b289m25N42J275J719J175O26q07q40j691j244n29J91J409J689J217M12l91
4742B039j036j596j323o33K82J196J465J394P32j30j472j149j213r65J7R37J686
4759B31J283P88k10m40j860j495r44J89J111J496J685O88N2q45j770j394r41k14
4777b590P07J613J709J032J64j069j171j913q48j71N48J756J545Q26M38p09j487
4794C80j551q97p37O98J565J643J354R7o93j169k040r32l86M08J716J550J108
4811B114M19m30j318j623j206l77K76J088J718J501L93k32j364j890j075l98M97
$$ plain form
4692 1848 -42 -1516 -2248 -2655 -1566 -183 1480 2448 2570 1697 91 -1117 -2174 -2668 -1625 -172
4708 -172 1310 2139 2473 1766 381 -893 -2143 -2249 -1601 -746 998 2186 2670 1959 854 -929 -2289
4725 -2289 -2714 -2172 -897 822 1997 2623 1816 976 -715 -1959 -2488 -2297 -888 801 2018 2430 2039
4742 2039 1003 -593 -1916 -2549 -2267 -1071 394 1788 2520 2390 918 -231 -1444 -2409 -2392 -1455 231
4759 231 1514 2302 2092 1652 -208 -1703 -2647 -2458 -1347 149 1834 2522 2574 1729 -41 -1435 -2376 -2590
4777 -2590 -1883 -270 1439 2471 2635 1566 395 -1518 -2366 -2537 -1989 -233 1312 2138 2576 1867 380
4794 380 -1171 -2068 -2805 -2107 -542 1101 2455 2552 1859 690 -1350 -2282 -2668 -2260 -544 1006 2114
4811 2114 2533 2103 785 -838 -2044 -2421 -2145 -1057 661 2162 2555 2323 959 -931 -2006 -2404 -1907
4828a907J016J350J336O66m93q39j541j687o19N61N43J908J548N86j66j110j338
4845a86j406r15J44P85J578J536P82o1p84j513j722q61Q1R93J550J397J017pp75
4864A633j414j639r73m30J113J277J858R93J52o87j604j475j239k42P97J579J446
4881A145R15O36o12j452j432j504j40L85J566J313J396O62p23j250j857r71o13
4898b536M79J249J433J302P92l70j221j667j551l47L86Q49J662J474R88o49r82
4915A291j831j391m64J02J146J568J346J002n00q01j622j696o14k2J039J554J793
4932A900N74n2j080j730j297o65R5Q98J487J283J217j70j113j295j774p89j19
4949b630J076J282J723Q93J92o86j447j550j283k9P94J138J699J216J60p85j144
$$ plain form
4828 -1907 -891 459 1795 2461 1968 1129 -412 -2099 -2718 -2157 -1614 294 1842 2428 2262 1152 -186
4845 -186 -1592 -2507 -2363 -1578 0 1536 2318 2257 1473 -40 -1762 -2623 -2542 -1549 1 1398 2415 2408 1633
4864 1633 219 -1420 -2393 -2823 -1710 -433 1425 2418 2570 1883 279 -1196 -2435 -2677 -1880 -301 1145
4881 1145 2060 2696 2084 632 -800 -2304 -2444 -2059 -493 820 2216 2878 2155 905 -952 -1923 -2536
4898 -2536 -2057 -808 625 1927 2719 2349 1128 -539 -2090 -2437 -2051 -1202 460 1934 2922 2273 1291
4915 1291 -540 -1931 -2395 -2293 -1147 421 1767 2769 2269 1468 -154 -1850 -2464 -2486 -1447 107 1900
4932 1900 2474 2422 1342 -388 -1685 -2350 -2255 -1357 130 1413 2630 2460 1347 52 -1722 -2511 -2630
4949 -2630 -1554 -272 1451 2344 2536 1850 403 -1147 -2430 -2459 -1665 -527 1172 2388 2548 1763 619
4966F19j602j319k52O98J217J516J139O08m69j189j709j310n35M11J404J604J139
4983A970P63o89j055j685j399m90J50J466J550J429L71l06j160j239j568n79L12
5000b159Q37J584J446Q63j73j297j513j304o11K13O11J681J363J011k4r98j672
5017a42j283j070R0R34J390J447R75K24p26j759j335q73l79Q57J414J384J053
5034B201L6k96j699j454j061l81R67J345J679N83N06m95j751j170j158k01L12
5051b037J565J323J434J71n42j341j277j336m00M43J209J204J626L67k56j085
5067A068j766j263o38O58R65J709J159M24j09j234j321j500o51K92P56J798J561
5084A908M61P0j209j380j462o68p0Q98J494J347J090k02q28j637j473r23m1J114
$$ plain form
4966 619 -983 -2302 -2554 -1856 -639 877 2016 2624 2155 966 -743 -2053 -2588 -2177 -773 831 1970
4983 1970 2733 2044 989 -696 -2095 -2585 -2435 -969 581 2010 2381 2075 915 -324 -1892 -2471 -2159
5000 -2159 -1322 262 1708 2571 2398 1101 -412 -1716 -2327 -2114 -1503 178 1541 2552 2528 1530 -142
5017 -142 -1425 -2495 -2405 -1471 -81 1366 2341 2565 1839 80 -1255 -2128 -2507 -1650 -236 1148 2201
5034 2201 2237 1941 242 -1212 -2273 -2654 -1687 -342 1337 1920 2426 1931 180 -990 -2148 -2349 -2037
5051 -2037 -472 851 2285 2456 1914 573 -704 -2040 -2440 -1997 -788 416 2042 2409 2153 1068
5067 1068 -698 -1961 -2599 -1941 -976 733 1892 2316 2207 973 -348 -1848 -2499 -2207 -1451 347 1908
5084 1908 2369 2439 1230 -150 -1612 -2280 -2350 -1452 42 1389 2479 2277 1449 -188 -1661 -2584 -2625 -1511
5102a511J608J358Q12N01j336j418j331j190j85J038J480J278J208J08o52j726
5118D2j389j130j22Q75J322J412J175L61o36j329j607q31m92M21J172J718J202
5135B164N30n47j387j615j094o61N74R98J775J100Q21n23j355j259j399o00K99
5152b179J368J558J029J115m74j351j308j727k98j59J260J676J139O18K0j283
5168A004j176j735p09J96Q47J531J623Q72m9r55j454j311q73r3P96J711J103J042
5186B370o1p13j588j603o90j81P54J553J497J170k06p09j375j327r01m58O78J656
5204a34J353R68K52o01j502j280j208l18L60J282J901J007L39n31j278j268j254
5221a912l64L40J066J675J158N25k61j356j508j479l41M53J364J060J475O01k62
$$ plain form
5102 -1511 97 1455 2267 2768 1432 14 -1317 -2507 -2692 -1654 -174 1104 2312 2420 1768 42
5118 42 -1347 -2477 -2599 -1724 -402 1010 2185 2546 1910 581 -1026 -1857 -2349 -1928 -756 962 2164
5135 2164 2694 2147 760 -855 -1949 -2610 -2036 -1038 737 1837 2658 2135 780 -479 -1878 -2478 -2179
5152 -2179 -811 747 1776 2891 2417 1066 -242 -1969 -2267 -2426 -1166 510 1649 2267 2287 1004
5168 1004 -172 -1907 -2616 -2420 -1573 -42 1581 2453 2404 1449 -5 -1316 -2189 -2282 -1486 225 1328 2370
5186 2370 2309 1596 8 -1595 -2285 -2466 -1712 -159 1338 2508 2302 1593 218 -1109 -2010 -2468 -1790 -134
5204 -134 1219 2187 2439 1838 336 -944 -2152 -2470 -2110 -828 1073 2080 2419 1888 610 -658 -1912
5221 -1912 -2276 -1936 -870 805 1963 2488 2227 871 -637 -2116 -2457 -2004 -640 420 1895 2496 2234
5238B234j223j408j435o70K08J107J714J203R26o41q35j491j290n87r4J115J528
5255C61J164J013K7j362j419j147j008N3P77J439J456R23Q8q71j570j096j091
5272b263j79J024J225J607Q87L84r39j530j484j249K27P35J223J496Q23O20o99
5289A908j328j584j154l56P65J178J549J203L58n72j263j186j827l32P58J120
5305g63J653J080M41o42j264j268j397k89L25J420J221J374O09n37j118j450j097
5322a702o23J25R48J488J305P92L0j064j860j134p41K25J169J312J261Q85l02
5339B114j013j270j413n05j44R28J305J278J008k12n63j596j203r44o3P92J409
5356i2J477Q14J07o14j560j519o11k86O09J468J556N76K70o31j178j351r11m29
$$ plain form
5238 2234 1011 -397 -1832 -2502 -2294 -1187 527 1730 2656 2015 1180 -311 -1601 -2188 -2282 -1167 361
5255 361 1525 2538 2565 1203 -216 -1363 -2371 -2318 -1541 -102 1354 2277 2365 1494 -76 -1172 -2263
5272 -2263 -2442 -1418 -193 1414 2301 2685 1746 216 -1268 -2517 -2290 -1555 -332 1164 1987 2607 1908
5289 1908 580 -1004 -2158 -2514 -1749 -571 978 2181 2539 1967 704 -482 -2309 -2641 -1883 -763
5305 -763 890 1970 2411 1769 505 -763 -2160 -2449 -2124 -704 517 1891 2500 1963 845 -605 -1702
5322 -1702 -2325 -2200 -1252 236 1541 2333 2363 1299 -561 -1695 -2436 -2211 -1042 270 1531 2416 2114
5339 2114 1101 -169 -1582 -2087 -2231 -1303 2 1280 2288 2076 1513 -83 -1286 -2230 -2293 -1501 -92
5356 -92 1385 2199 2306 1692 132 -1387 -1998 -2284 -1675 -207 1349 1925 2195 1564 386 -965 -1876 -2305
5374b305N97J214J332J422J74n91j105j801p59o94O20J134J615J151M93n68j169
5391G60j714j221k90N45J372J181R85P85l92r78j522j151q66N24J009J409J139
5408A575O94k64j063j156j386o35l2J289J407J343O27m06q15j442j169p92n8P74
5426a509J216J774P95j30r06j169j350j228L05Q19J530J237O67L53p18j705j048
5443a067j114p1O49J279J594R84n5n08j257j527r79j36N65R99J498J036L97o85
5461A602r61j000j373o07O08J298J208R35M84l76j354j385n34p64P61M40J636
5478F18J139N72n27j151q87j494o38O00Q86J333J112Q73l20j282j095j310q94
5495b465M41Q97J377J177P61k41p71j350j177o51J6N81J695Q99P22K98j023j333
$$ plain form
5374 -2305 -1708 -494 838 2260 2434 1843 738 -1063 -1822 -2516 -1896 -762 853 2004 2497 1929 760
5391 760 -954 -2175 -2465 -1920 -548 633 1618 2403 2011 1033 -489 -1640 -2506 -1982 -973 436 1575
5408 1575 2269 2005 942 -214 -1600 -2235 -2267 -978 429 1772 2399 1993 1178 -264 -1433 -2225 -2283 -1509
5426 -1509 -293 1481 2276 2146 1240 71 -1279 -2507 -2202 -1383 147 1384 2051 2404 1686 -19 -1067
5443 -1067 -2181 -2252 -1603 -324 1270 2254 2199 1691 434 -1093 -2072 -2208 -1643 -644 854 1890 2287 1602
5461 1602 641 -359 -1732 -2339 -1731 -433 775 1710 2194 1818 464 -921 -1455 -2219 -1458 -1018 618
5478 618 1757 2329 1802 651 -236 -1730 -2368 -1768 -882 451 1563 2436 2116 834 -261 -1571 -2465
5495 -2465 -2024 -1127 250 1427 2188 1947 1176 -174 -1351 -2002 -1986 -1405 290 1189 1911 2209 1186 -147
5513a47j274o91m3P27J085J619Q15J95p97j335j221q34k50N37J299J223J106K66
5531B280o70j149j171j238j84M92J082J580Q64K34l61j287j076j055o70N11J153
5548f65J304R58O67q30o18j512j146l87M39R99J377R37O93m08q62j203j535l77
5566b169K82J007J275J278J87q8o81j406j398l15J58Q03J323J020Q18N0j072j487
5584d15j140n27L3Q53J169J297J003l2q91j438q53j088oN42J532R79P71K38o21
5603A406j217j067j159n3Q02Q63J439Q97J95m40j285j457o99n15O99J037J341
5620G87Q93M59n67r27j552r31l53P62J155J040J045M19m94j263q39j174p39N28
5638a751J110J395Q27N36o21n42j427j179m49L89R03R79J173M65J32r46j138j375
$$ plain form
5513 -147 -1421 -2112 -2155 -1428 -343 1276 2091 2286 1489 154 -1067 -1901 -2151 -1614 -315 908 2014 2280
5531 2280 1610 461 -710 -1948 -2132 -1640 -558 1022 1886 2120 1759 472 -604 -1659 -2329 -1818 -665
5548 -665 639 1597 2264 1434 816 -696 -1842 -2229 -1790 -791 586 1523 2216 1808 946 -257 -1792 -2169
5566 -2169 -1887 -880 395 1673 1860 1772 1091 -315 -1713 -2028 -1870 -1067 256 1276 2094 2144 1072 -415
5584 -415 -1555 -2082 -2049 -1196 -27 1270 2273 2241 1350 -88 -941 -2029 -2035 -1493 39 1018 1789 2027 1406
5603 1406 189 -878 -2037 -2090 -1288 -425 1014 1911 2106 1666 381 -1076 -1775 -2290 -1591 -554 787
5620 787 1680 2139 1572 645 -907 -1838 -2191 -1429 -274 766 1811 2230 1736 473 -366 -1540 -2279 -1751
5638 -1751 -641 754 1581 2117 1496 954 -473 -1652 -2101 -1712 -809 170 1343 1808 1940 994 -144 -1519
5656a519o04K26N88J479J387M68p2j146r95j065p79K66R09O59J388P78l6n84j085
5675B63j197j067K5Q68J300R16N90J68p46r62j180p38o9M02J183J322P49K07n24
5694A510j083j430r00j35L86J084J209R52M77p31o86j149j196m08M64R10J417
5711F91R22M28l56j029j229j119%M9J025J143J010O74n63q05j251r89n91J52J106
5730g32J156P32P56j85p33j142j083o99L07O53J350O87J086j99p49j165j083o71
5748a714j60O87J096J265P84k83n40j099r86r98K09L95J030J373O96K01o36r28
5766C92j423n27n56O62Q53J304P80P86j120j019o63r92l90N24R10J009J205K69
5784B004m70o78j423j015l73N29O22J460P07N48l59p29j298j011l72L09P28J280
$$ plain form
5656 -1519 -2123 -1897 -1309 170 1557 2025 1953 807 -188 -1253 -2032 -1766 -857 -198 1190 1968 1932 1348 263
5675 263 -934 -2001 -1976 -1108 192 1108 1698 1866 1120 158 -1022 -1760 -1829 -1427 -244 1078 1827 2034 1510
5694 1510 427 -1003 -1903 -2038 -1652 -568 641 1593 2070 1339 653 -496 -1692 -2100 -1636 -726 691
5711 691 1613 2041 1685 656 -573 -1692 -1692 -1643 -618 525 1535 2209 1646 841 -410 -1399 -1990 -1838 -732
5730 -732 424 1156 1912 1727 994 -148 -1231 -1930 -1623 -970 380 1067 2153 1954 1205 40 -1043 -1714
5748 -1714 -1874 -1187 -91 1174 1958 1675 1135 36 -950 -1948 -1739 -1344 -314 1059 1755 1956 1320 392
5766 392 -1031 -1558 -2114 -1452 -599 705 1485 2271 1151 132 -531 -1523 -1913 -1389 -479 530 1735 2004
5784 2004 1534 856 -567 -1582 -1955 -1426 -804 656 1363 1911 1552 823 -475 -1486 -1858 -1549 -821 459
5802D59P55P67n03m70j169j248m32N1R48J073R03O45j15o94j225q18q43j25J401
5821f40P18J064N83J21q94q76r67p41k00N76R80J181O10K18m15j312r05q33j83
5840a915J043N90J167R05j03m45q78j181p92l04O08O97J298P88K84l69j044r72
5858f23q08l77L39R96R63R78K30j94q24j144o66p65K00J079Q60R53N23l90m72
5877H58j207j112j61J76O59J136R02O52k69n31j462r30m28P1R60Q27J139K80j37
5896A423o16p39j187n31L2Q75R00R97O70j18o57j285o48p23J05J45R99J181O19
5915A442K68m81j056o56j139k0N53Q79R95J066m00j09j001j034p62k68K72J311
5933a40J029Q06K25n24r37j103p47k70N60L73J187J070K88m44j025j063l74p24
$$ plain form
5802 459 1214 1981 1478 1008 -161 -1409 -1841 -1790 -842 231 1134 1779 1664 970 -255 -1073 -1916 -2041 -640
5821 -640 78 1142 1725 1846 952 76 -891 -1632 -1832 -1256 -276 905 1515 1733 1318 6 -899 -1732 -1915
5840 -1915 -872 -282 885 1790 1687 1242 364 -817 -1609 -1913 -1305 -608 690 1478 1762 1393 349 -623
5858 -623 -1431 -1808 -1469 -473 490 1468 1698 1504 680 -464 -1130 -1895 -1695 -616 244 1197 1720 1330 858
5877 858 -349 -1461 -1622 -1446 -787 349 1251 1903 1634 1103 -359 -1289 -1717 -1646 -686 141 1280 1560 1423
5896 1423 807 68 -1119 -1650 -1618 -743 157 1154 1824 1706 1049 -236 -884 -1607 -1502 -1357 -358 823 1442
5915 1442 1710 1229 173 -483 -1622 -1642 -1089 -210 785 1851 1451 1342 341 -693 -1455 -1723 -1451 -140
5933 -140 889 1695 1920 1396 459 -644 -1391 -1661 -1101 -728 459 1529 1817 1373 348 -715 -1089 -1813
5951a813L45Q50J147O59M51k48n95j054q02o12J30J087M74J185L16k55n79p32
5969d6r66p16L96N41R28P47R87l68n22p04j346m47n4P71Q66Q33L91N74l78j394
5989I3j173o38K87M44O70J126O88O3m53j019r21p67k5M80Q98R09O90L98m89j296
6009c5n33r45j29K70J071Q79Q74K56n42q28q38r23m52K77J036J074R15J90n82
6028A035n34r85q01l34O9Q42J106R45J67j41n65q72j145m48K05Q48J051Q65L51
6047A659k48n47q06j092n21J56M04J210P78P93l92m73j363l57n68k0L30Q03J157
6066I03N84on56p71r35o76j63O16N33J327N20Q6k91j074p66q79jN46P30J054L08
6087A089N45l15r13q69r26l8L21O36R25P21N02n11p71o26j031m14L56R20R58N87
$$ plain form
5951 -1813 -1468 -618 529 1188 1639 1391 796 -258 -1060 -1672 -1542 -455 19 1204 1520 1265 686 -46
5969 -46 -1012 -1728 -1332 -791 137 884 1871 1503 981 277 -1069 -1516 -1570 -799 67 900 1291 1865 1487 93
5989 93 -1080 -1718 -1431 -987 -317 809 1497 1560 1107 88 -833 -1600 -1625 -1145 -247 662 1352 1750 1261 -35
6009 -35 -568 -1513 -1642 -1372 -301 578 1452 1708 1166 338 -500 -1423 -1875 -1598 -562 512 1427 1617 1035
6028 1035 501 -484 -1285 -1619 -1550 -708 398 1343 1510 1369 804 -68 -1213 -1661 -1456 -608 443 1308 1659
6047 1659 1411 864 58 -1034 -1555 -1399 -995 215 993 1786 1394 921 -442 -799 -1367 -1387 -1057 -254 903
6066 903 1487 1481 925 154 -781 -1457 -1620 -1004 -471 856 1376 1462 1171 97 -669 -1548 -1549 -1003 -273 781 1089
6087 1089 1634 1319 406 -463 -1389 -1427 -1106 -470 455 1176 1678 1167 396 -230 -1261 -1675 -1319 -399 559 1146
6107A146L42k30o24p12j083j51J48O47P89J118M01n29o08r06j084j72P7N95J104
6126B68O90O59l04n33r21o61o24q3O45R78R16L36K58r27q13p79n17R5M83R51P71
6147H88N24j65l71r96p35n71k23N18P65R28N65M41n83p78r35m44k65J07J194J030
6167H94K41J30O0r79q66n04l98L98O99R76N60L36l11n41j124p10k35L08O49P20
6187C03P60L39j20q74n30p14p56K39P11Q12P73M35k41o77p68o66n46K98P87O00
6207A65J107O4J57q72p81o31n86lQ41N89P56O65j93n60n05j110m59L04J16J032
6227I6Q23P84m21m17o20j150j59k22K38J121O44N18j39k2q79q27r03K20K89Q23
6247b03R85M93k28j17m80q44p32k60j06J159Q05P06J73l57m39j074n15m10J94
$$ plain form
6107 1146 1488 1258 634 -78 -1161 -1312 -1164 -517 272 1390 1791 1262 654 -252 -1336 -1508 -1431 -836 268
6126 268 958 1617 1313 780 -141 -802 -1426 -1509 -864 114 1030 1366 1624 697 -116 -895 -1412 -1317 -834 117 888
6147 888 1412 1247 876 -120 -855 -1426 -1649 -1131 -366 562 1127 1568 985 207 -728 -1172 -1437 -1330 -136 894
6167 894 1135 1265 1325 346 -520 -1024 -1422 -1024 -325 651 1211 1547 1236 695 -429 -1139 -1374 -1066 -417 303
6187 303 1063 1402 1282 408 -122 -836 -1592 -1353 -642 170 943 1378 1137 460 -308 -974 -1520 -1222 -435 165
6207 165 1272 1336 1493 621 -160 -791 -1377 -1380 -539 50 806 1471 1278 718 213 -897 -1356 -1052 -936 96
6227 96 919 1703 1282 865 245 -905 -1064 -1286 -1048 73 717 1235 1096 1074 195 -632 -1535 -1315 -1026 -203
6247 -203 782 1275 1047 930 450 -394 -1126 -1386 -1492 -333 472 1178 1351 994 555 -519 -1034 -1444 -1250
6266a250P69O33Q55Q43p34r36l24q53l63R8O67Q01Q83M20m48n15o71j111j56J60
6286a232L65J104N51N32m04j82q00q02l51PM12R45Q22K77K19p18p90o59n48J90
6306a062K22O98P47M68J95j34q16r22q11L58j4J161M99N18L50p44o40p57n63j08
6326a355N99K82J245M89Q0m35n95n61q83j41J47P49R64N73J92l51n39q12n87m73
6346a412K91Q10N12Q86L64l19l22j109q25j60K06P23O43N64L62j38n36j018l50
6365h28m64K2M53R56L83Q82m51q9q60q77k96j44O90P22P79K02N0k07q36p09l97
6386a019k03M15P35P13M07J6k12n63r64m22q5L85O19O38O59n7J57q82q09o06k21
6407a299K75J090J91P00L08l04m90j124m29j71M81N33O37N36K29r5q58o11n33
$$ plain form
6266 -1250 -481 152 1007 1850 1116 180 -144 -997 -1360 -1262 -595 206 1089 1509 1061 546 -125 -1236 -1392 -1232
6286 -1232 -867 237 788 1320 916 734 -66 -868 -1219 -1212 -800 145 967 1244 1463 745 -45 -704 -1252 -1062
6306 -1062 -840 -142 605 1073 1268 1134 318 -604 -1415 -1057 -1071 90 589 1107 1457 713 73 -684 -1247 -1355
6326 -1355 -756 -474 771 1260 1340 905 310 -251 -1134 -1275 -1128 -379 585 1158 1350 999 460 -352 -939 -1412
6346 -1412 -1121 -311 201 1087 1451 1132 810 -299 -1124 -1284 -1078 -355 288 852 1214 1076 540 -478 -828
6365 -828 -1292 -1270 -817 139 522 1404 953 864 4 -873 -1169 -1313 -623 99 878 1080 1130 923 87 -622 -1019
6386 -1019 -1222 -807 -72 641 1048 1064 852 289 -675 -1097 -1182 -797 -178 460 1119 1062 1219 337 -472 -1078 -1299
6407 -1299 -1024 66 257 957 1265 961 471 -653 -1082 -1253 -772 -239 398 934 1163 1068 210 -401 -934
6426i34l45M77J67J046N07M48n28m15k59j011n46L43N02P73P15N6p5l56j057l13
6446h05m01L04N47N35O15J50L8l63p00o59m78J9Q51L98P35N60n07k38m13q76j50
6467h38k57L06P15P40N24q8m89n23p15o07J64K29O79O20P20k22j82o40q50l25
6487a039o2K36O54O60N17K23l05p45k57p04j52J36N66P03K86M92m74n03m30r11
6507a109o7K15M25O10J035K4j21n03q21m68PL7K48O07N11N37l93k41o73o27m41
6528a208L04M34M53P84M43l31m01n23o48k69r7O21N17N23L31r3o05j38o43k29
6548g75k84M54N91O96L76K3m63m18r35n38K98K7R25M31P48j11m47l50o67m73J66
6569g26j31O21N17K45N73j33p39p73l13j04K49K36Q46L80M1J41q80m66k96m04
$$ plain form
6426 -934 -1279 -802 -635 411 918 1366 838 423 164 -847 -1393 -1050 -548 225 940 996 921 565 -492 -805
6446 -805 -1206 -902 -355 180 795 945 983 620 -80 -739 -1217 -1198 -347 51 786 1346 839 601 188 -688 -838
6467 -838 -1095 -789 -74 666 1190 1102 613 90 -625 -1232 -1068 -839 -160 460 1180 958 776 136 -714 -1039
6487 -1039 -1101 -865 -211 449 966 1189 884 139 -118 -822 -974 -838 -272 431 717 1209 735 232 -198 -1109
6507 -1109 -1176 -961 -536 74 1109 1133 1012 509 -312 -780 -773 -736 -488 119 630 1167 774 533 -140 -767 -1208
6528 -1208 -904 -470 -17 767 1210 879 478 -45 -693 -962 -1059 -438 79 602 933 840 235 97 -546 -775
6548 -775 -1059 -605 -14 682 1058 1081 618 200 -735 -1273 -975 -948 -23 408 1156 1045 598 248 -419 -892 -726
6569 -726 -857 -236 281 526 1099 966 227 -546 -859 -963 -714 -478 368 748 789 930 50 -416 -712 -1116
6589a116L96K47R90L47L13n07o64l73m40q9j7M50O32P32m5N7o96n51k80m29Q4
6610i59N13N58P60J62Q6p77n14o21j96J90K82L94Q63L84l34Pr03m12l40j99O28
6631d28L56O56N53k99j40k56r35n37R9K47P70N65J73K3j33m87n16m02o5L32L43
6652h1O82J06L33n17m41m92l81P1P9N50K85L88M73m70n08m89k69j89J99M31P10
6673D70K95J23j21n57o46k37j26k00M22N50P15L92l82m25l27n57m36K48N94N91
6693C86L25J92m8k12o95m75m45J97N06L95N30L03k56k61n39j07n54j88O14K77
6713e5N59M70k1k21q56o07K30j87M1Q57L06J49J88n05m79m74l05M9J37P13O30
6734F19J36o3J2n74n45l28l95N06L26O91L94L91m88m41m95n89n4K7O92P04R7Q2
$$ plain form
6589 -1116 -720 -473 517 864 1177 670 6 -367 -807 -896 -913 -463 169 901 856 913 217 -334 -614 -1043 -959
6610 -959 -446 112 872 1034 1120 343 -171 -792 -988 -798 -516 -122 741 1125 791 798 -105 -517 -857 -1056 -428
6631 -428 -72 584 1137 838 698 442 -493 -1030 -931 -684 86 651 824 847 714 227 -289 -691 -756 -424 -81
6652 -81 601 707 1040 523 82 -410 -791 -720 -641 -91 194 582 1055 585 77 -412 -681 -870 -671 -240 470
6673 470 765 888 767 210 -436 -673 -799 -999 -577 -27 688 1080 698 273 -54 -611 -1047 -799 -205 386
6693 386 711 903 855 643 -52 -527 -972 -775 -269 126 656 959 703 442 -97 -204 -758 -946 -332 -55
6713 -55 504 974 953 732 -124 -731 -501 -688 -647 210 516 665 853 348 -131 -605 -910 -861 -724 -11 619
6734 619 755 692 704 130 -415 -743 -1138 -632 -306 385 779 1170 682 241 -254 -843 -897 -870 -178 526 623 705
6756G05k08l40k94o35j42J47M94N55O29k97J20l43p00j16o24K62J37N28O64L39
6776H81o0o01n56k91j05J00K32O96M43j40K82m27m45n23l1j03N66MP21K51P4l52
6798F16q11k87j99M2L8Q05J81N69k58k41l28o56k85J47J18N65O31O5K13l48n37
6819D0k25n10k28L60L37N39L51J55k14n20k74m43J1r8M90M71N80j51j62K4o62
6840a29m21n09M87K14L18O18k7K03m71l93k42l20J32M56K79K92L73l93%m61n04
6861d98l09J25P14L22K61l0K9m35k90m99p4J22K54N19N75j73n9l93j98k52m27
6882g16j23M60K91M66L5J42k76m32j85k66p0J66K65O04K90K13l72o44l11j79j92
6903h34J92J99P77M01J41o16m01k79l39j33N41K31M82K01K52m02k05n37p9j14
$$ plain form
6756 705 497 157 -137 -772 -914 -767 -273 282 911 614 734 391 -309 -425 -1049 -787 -650 -122 542 881
6776 881 821 220 -336 -627 -732 -632 -400 296 739 599 881 454 9 -514 -545 -648 -82 -78 643 894 968 616
6798 616 -195 -482 -681 -639 -601 204 385 954 696 455 127 -529 -814 -667 -549 16 647 712 925 577 40
6819 40 -185 -695 -923 -563 -226 313 664 819 605 85 -189 -632 -621 -719 -229 242 822 671 509 533 -129
6840 -129 -550 -1059 -572 -358 -40 578 551 754 283 -110 -352 -672 -540 -84 195 487 860 467 467 6 -498
6861 -498 -807 -682 32 354 615 585 614 179 -111 -610 -684 -562 -308 211 786 613 554 161 -37 -289 -716
6882 -716 -839 -379 -88 378 413 555 279 -153 -338 -604 -674 -508 -243 361 651 864 492 -152 -463 -642 -834
6903 -834 -642 -443 334 735 876 260 -141 -420 -759 -892 -351 -120 362 563 815 413 208 -329 -408 -522
6923e22M8P00J74M45k67j18k53o75l23K65n4O08K06L02Q0l06r4l59j84n84L46
6944e65K38O32O1K34j88j29l74l66k57L06K26N2N45LL02n65k43l54m9J76o8M39
6966E6K89L07K60m10q72j83J14k11l5N61M47L66j50m13k59k73j92J1K16M00K47
6987B76J17J4J6m17l47j20J20n4M58K49J28M19m29l20m83j74m3J89K35L13J64
7008C11K91j43l80m05j09k69M92r0N83L68o2k39k67k49l17l12L98L07L62K78J50
7029F98p3m70l52j17k54K04K15M43L23j25O7m90l76J50l52P9J05K20K23O75l72
7050D21m4m13k59k82j2l3M52N92J24J19k54m86j92N3j70J16K18L02J84J1l54p5
7072A8o76K14j48J95M08J68L87p1j09k63n72l1j08L57M63J94Q6j90j38l06k01
$$ plain form
6923 -522 -474 226 400 845 578 460 207 -468 -791 -526 -580 28 234 536 616 310 216 -143 -327 -911 -565
6944 -565 -327 305 366 600 412 283 -91 -457 -714 -408 -182 -130 415 418 720 155 -88 -442 -491 -315 -383 56
6966 56 345 652 912 502 -370 -553 -439 -650 -685 -124 323 689 539 126 -133 -406 -598 -587 -371 29 276
6987 276 393 407 423 6 -341 -461 -341 -395 63 312 440 859 430 110 -373 -547 -590 -401 -166 147 311
7008 311 602 459 79 -326 -435 -704 -212 -302 281 649 587 348 81 -168 -485 -797 -399 -92 270 548 698
7029 698 625 155 -197 -314 -568 -364 -149 294 617 492 559 69 -307 -157 -509 -430 -325 -105 118 793 421
7050 421 377 -36 -295 -577 -589 -622 -170 422 546 665 411 -75 -267 -214 -384 -268 -50 252 436 447 93 18
7072 18 -658 -444 -592 -397 11 179 566 495 386 123 -449 -480 -588 -231 232 426 512 322 184 -122 -323
7093c23l20J23J97L10m6M91J49l20N4n97m00N5J50M61J17N20j31P7l89m17N7o58
7115h40L59J27N69J04J46j54k30k36k71q1J53K00P0M18J85o2l89j77q3l93J90
7136c95Q0O13J12JJ94j73l98l94K66j1O1J16J83M48o1l49k06p4n43N0L10Q1K54
7159A65J90p0K7m64k53j91M0N1L78L47L01m31L32l70m95K2j36K71L23K41L22R9
7181F99l36j78j10n65M8k8R7N12%L29n7j97l07l55l4K92k38N22K11P7K30m48l99
7204b35m4l15P2M61kN05J76l61j3k77m44M7j4L28J53M68J94m04J00l46k99l32
7226e82K38K24j6M57J40j01k57j47k09j30o9q9N16M03J27m7k57l07j88J03m22
7247f13M54R7L03K61l3j31k78j84l61J70J36K4N35j69L02M8l70j30p97K74j2L92
$$ plain form
7093 -323 -643 -520 -323 -13 -59 432 581 261 315 -282 -682 -627 -477 -16 101 621 490 567 178 -239 -182 -840
7115 -840 -481 -354 215 319 465 311 81 -155 -426 -507 -354 -154 -84 334 519 457 68 -109 -192 -585 -395
7136 -395 -315 298 410 411 605 432 34 -360 -94 -105 -44 72 255 703 642 293 87 13 -530 -480 -170 -89 165
7159 165 355 285 312 -152 -405 -596 -556 -505 -127 220 521 90 422 52 -443 -421 -557 -286 37 278 600 699
7181 699 363 185 75 -490 -442 -470 -373 139 139 468 411 214 -93 -448 -482 -190 -428 94 305 382 612 164 -235
7204 -235 -279 -594 -522 -61 -63 442 618 257 244 -33 -477 -430 -444 -116 37 505 699 295 395 49 -250 -582
7226 -582 -344 -120 -136 321 461 360 103 -44 -253 -383 -452 -541 -25 378 505 458 201 -106 -294 -191 -613
7247 -613 -159 -62 241 502 469 338 60 -124 -485 -315 -179 -155 380 211 513 561 191 61 -736 -462 -474 -82
7269h2K82N8K44r1l22m83j18J57K00q9N86K51j39J4n01l22j8k8J79k58N82L93
7291D95r6k2j42q3m22l52J24KN65L86M5l7k86m74rj42j7L39K02M18Lk35j82N4
7315A34k02l34m9L40J87K29J84J70n64M8m13j02L8j26N68K11o7L39m10m93M4j12
7337c80N0J9M26K75k40K66J46o15j38k29k95P55n7L34L7J5O8l74l9k82J48l47
7359d57O24J2K73p5n4k49j09m13J51J40q4M37N5J01J40n73r4k67Lj33L71L69J34
7382C02k47K68l65J06n37K29k38L76K37n2N09l8k46k56m95K62n46M74N16k14M67
7403E12k0p7l85l92Rj12K33L44M42j47P9k54l72l1l65J55j1L07L58K43k95K29
7425D50n47o1k39RO4K58O67j56N0j33k74l50Rj50K21J60M1K99K56k28l50l64K69
$$ plain form
7269 -82 200 258 502 411 89 -394 -512 -355 -155 -244 342 593 454 468 -33 -355 -373 -401 -222 -480 102 495
7291 495 399 377 235 152 -270 -622 -498 -496 69 455 500 463 177 -297 -306 -448 -465 -126 76 494 497 262 80 134
7315 134 -68 -402 -451 -111 76 305 489 659 95 143 -270 -372 -334 -460 108 319 252 591 181 -312 -268 -380
7337 -380 -330 -311 115 390 150 416 562 -53 -191 -420 -715 40 -17 317 354 369 437 63 24 -258 -110 -457
7359 -457 167 179 452 377 323 74 -35 -448 -297 -157 -241 196 251 352 492 -81 -175 -442 -439 -572 -201 168 302
7382 302 55 323 -42 64 -473 -244 -482 -106 131 79 588 550 304 48 -447 -185 -731 -257 259 45 512
7403 512 492 415 30 -362 -353 -465 -232 112 554 407 486 232 -140 -171 -536 -381 -392 -85 273 516 221 450
7425 450 -97 -158 -397 -388 -324 -66 601 445 495 362 88 -262 -253 -403 -182 -22 19 318 574 346 -4 -368 -99
7448i9l73J31N5L02M34m0k77j17j70l04M2L3J94M05R7L90k83j92l97j83j93j37
7470f82Q17j24K42J20o6k60O5n45J11pK87K27PJ2J41j10r5l17O5k16k7K99M40
7493C84p1j59kk91L4l04K4M6K87M54L9P0k65j36l61Q3n8R1K52N06l4m83J30l99
7517a63j73j44L7J05M19J34R2L79m59k66j9q4j63j42K94K62J78l0j04K3l23j90
7539c37p2R4K02N63K70m12J8l53l16n1j31L42K14QK68K05k91J8k36m53RK14K25
7562bL48J38K3J79p77l2k47p3L15J02K50K84j49J33k07m16r2r6j59L14L42O8K42
7585D88n0j08l36m07j9j1K50K75K15J35j88m0m23j38J4N0n6J95L85M72m22J25
7607D06m24n4l35k17M25J05K51J52O2l56K40p17k3P4j08L66P3M56J48n8l01k01
$$ plain form
7448 -99 -472 -341 -286 16 450 410 133 16 -154 -458 -416 -383 -189 216 313 703 420 228 -169 -352 -545 -682
7470 -682 135 11 253 373 307 47 112 -433 -322 -329 -42 185 192 204 345 235 140 -177 -112 -328 -355 -56 384
7493 384 313 154 152 -139 -105 -409 -385 -339 -52 402 441 511 246 110 -251 -168 -226 -135 117 623 589 106 236 -163
7517 -163 -336 -480 -443 -338 81 215 307 686 227 -39 -58 -142 -305 -447 -153 109 287 257 153 176 -147 -337
7539 -337 -409 -315 -113 450 720 308 326 -27 -343 -394 -525 -183 31 39 307 512 221 239 3 -450 -441 -227 -2
7562 -2 346 484 507 686 -91 -123 -370 -443 -128 -26 224 508 359 492 285 -131 -223 -319 -478 -164 178 246 488
7585 488 438 330 -6 -413 -432 -443 -193 82 297 432 244 204 -219 -357 -343 -293 -349 -154 231 703 281 406
7607 406 -18 -72 -407 -624 -199 -94 157 309 371 15 255 -462 -485 -411 -519 -153 -80 376 524 466 165 -36
7629c6l76j03L11J8M73j18K46R7k11n87k42p0K34M06K15J71R5k25j55l08k08k52
7651f25K94M17n3M04m1p8L1m09l82n1K21lN37k7J46r3r8l57j47k99Q4N47J65L09
7675D92J79m35m2j51m76O3Q8j77O62J44J01j2j64k96n06O3K06j72K10O66K1lk35
7698B26m03j50l5J4J28J32N58jj47k51J18m66l41R3M14K64l8M36j90o6j63k05
7720g3l99o8P8J60M19M79m08J68l91%m64J14K5M41P5J76K61l68N9o44J00k22J69
7743c13Q7N65R8j1Jn9n96k51L07k76K13M61J3K51n0n26k5j54m08K02K56K82N38
7766F05j99j68o6k34m33J10k01M4N38L51M52o54l5j1m84k33J92K50L71J28Q9K1
7788D33l84j45o8l91jL93J23L39J37K48k87n09j19l62jJ64L51L78R5j06j32J70
$$ plain form
7629 -36 -412 -515 -204 -186 287 169 415 512 301 -286 -528 -598 -364 42 257 428 523 298 143 -165 -373 -625
7651 -625 -331 86 33 437 396 318 349 -60 -442 -493 -272 -275 262 235 381 288 190 -167 -314 -613 -529 18 183 492
7675 492 671 236 194 43 -433 -370 -282 -459 203 347 448 436 272 -24 -530 -467 -261 -433 -223 443 464 461 226
7698 226 -177 -327 -362 -348 -220 -88 470 469 322 71 189 -277 -618 -525 -111 153 115 551 361 295 132 -73
7720 -73 -472 -540 -462 -302 117 596 188 356 -35 -35 -499 -385 -360 81 156 332 593 225 284 -360 -260 -482 -313
7743 -313 -226 339 437 426 427 368 -228 -479 -172 -448 -235 226 239 490 440 -86 -111 -265 -673 -471 -215 67 605
7766 605 406 238 172 -62 -495 -385 -586 -542 -4 347 799 145 110 99 -385 -618 -426 -176 195 323 412 433
7788 433 49 -96 -164 -555 -556 -163 -40 299 436 684 397 -112 -231 -593 -594 -430 -79 299 394 288 156 326
7810C26o41l05R4O1L60M14J5J54k19l83K23m07j14J3oP23Q8J53j33k88l92j75
7832d39Q6k49M74J57N59l24l8k39k27l55K1J71L68L9K41J13Q1k71l19m6n39M74
7854b62p1M85K50K97j80m71j66j32k25j36L53K58K82K11Q0j31n53k64J00k75M15
7875a35K30K45R4j78N9m86j5k52j59M75K08K35P7L9j68k70m30j52J69k8N90P9
7897B27K31M5j4n85j01k54j12N4N08Q8J85L9K67n40j24k64p8K48L32Q9L12j95
7919C58N9j52o44q2K60P8L06p9N16j22j75k88j57k29k33J99K54K80J11L18l05
7940B73k16k36l58K24k76O58j27K34M97j26l44j70j08l24k57O34N9L37L5K92l94
7961C07k39m46K65m26K90L42K35M00k50l95k42j42l03K54J58M23J58J57j43k26
$$ plain form
7810 326 -315 -620 -526 -465 -105 309 324 478 259 -124 99 -308 -422 -409 -415 308 396 549 416 128 -264 -439
7832 -439 -353 -602 -128 29 588 264 226 -13 -240 -595 -574 -403 -35 4 245 358 439 168 -151 -197 -736 -262
7854 -262 -333 152 402 699 519 48 -118 -250 -475 -611 -258 0 282 493 573 442 -111 -375 -275 -550 -135
7875 -135 95 340 434 256 315 -171 -186 -438 -597 -122 86 321 398 437 269 -1 -431 -583 -414 -442 148 227
7897 227 458 503 489 -96 -197 -451 -563 -509 -1 87 272 311 578 38 -86 -350 -428 -180 152 241 553 358
7919 358 417 265 -379 -461 -201 -123 183 104 620 498 323 35 -122 -351 -584 -385 -131 149 260 578 273
7940 273 57 -179 -537 -313 -589 69 -58 176 673 547 203 33 -75 -399 -656 -22 37 374 409 701 307
7961 307 68 -378 -113 -539 -249 93 328 728 478 83 -159 -301 -604 -350 -192 231 389 546 403 177
7981A77l44j69k11j15L02M79l4J67O7l4j29o65J14k08M46J26J66M37R7m27l54
8002a12J3l74P9J26M28J22K15k10L79n63m58j51J28k33O19L12O4J62kk44n71j72
8024d43r4K76K60K53K15N0k72J1k35o22K50N8J73K51J79K23P0l11l83j12n55L22
8046d36J02N53N3J84j46L4n20j85r2K04J20L5N33J96k9q59K05m55N4k43M43K08
8068d1M41Pj18J05p21j48J01r3K89L50J64K81L6m33k08l43J17k57P9L26L37k8
8090B43J16L2k68n22m62K60K72N3N14K67Jj66k79k45k26P3j66L33J01J81K60o1
8112C11k81nk39n50L90J82J82N38k17L3j41m40l82L5L10J06N53N1K43J4n96j17
8134b0k38j62J08J25J41M22L0Jj21m24k36j11J05J94M1M84PJ56l76l24k64k29
$$ plain form
7981 177 -167 -336 -547 -662 -360 119 85 252 319 285 156 -509 -395 -603 -157 -31 135 572 669 242 -112
8002 -112 -99 -473 -394 -268 160 282 497 287 666 103 -355 -506 -378 -611 8 320 384 546 544 300 -271 -443
8024 -443 -537 -261 -1 252 467 517 245 256 21 -601 -351 -293 -120 131 310 533 603 292 -91 -203 -758 -436
8046 -436 -334 219 272 456 310 344 -176 -361 -453 -249 -129 -94 439 635 606 -253 -48 -503 -449 -692 -249 -41
8068 -41 400 407 289 394 -327 -475 -374 -467 -178 172 336 617 653 220 12 -331 -214 -471 -392 -66 271 243
8090 243 359 391 123 -399 -861 -601 -329 -276 238 505 506 340 61 -184 -410 -337 -503 -170 -69 112 372 311
8112 311 30 25 -214 -764 -374 -192 -10 528 311 344 203 -237 -619 -584 -274 -168 385 436 679 693 97 -20
8134 -20 -258 -420 -312 -187 -46 376 406 407 286 -138 -374 -485 -380 -186 -145 339 346 502 126 -198 -462 -691
8156f91J07K47L45M30L5M7l06l28m57j5K2K14M09p2P21j1n88Q6n48k71Q2J70J60
8179b12N19J99J49l50l09l48j02r6J77L27M08J19
$$ plain form
8156 -691 -584 -337 8 438 473 520 214 -114 -571 -586 -564 -350 59 -13 708 697 109 195 -353 -624 -542 -372 -212
8179 -212 307 506 655 305 -4 -352 -454 -550 -373 -46 362 481
8191D81
$$ Imaginary data points
##PAGE= N=2
##DATA TABLE= (X++(I..I)), XYDATA
0@%%%%%%%%%qJ2j2J6j7K5l3M2n3O2p7R3j11J32j55J85k15K49k90L33l85M43n05
32b69N75o50P35q29R33j046J166j304J453j616J796j990K203k434K688k966L267
49A712l601L967m370M818n314N869o492P198q005Q940j0039J1344j2933J4915
63H009j7465K0899k5789L3379m6898P8400k94983j72104L91945K44019K03202
74D22614m2206j68544l04488k54265j59134M9142K01722L20299K89658J83824
84E38622j3112j78805k96492k84306j85414m638J59745K73263K69383J74159K223
95D54628j61335k72720k74537j81367j4886J50475K63462K73677J85485K6325
105D49207j39326k55762k73949j95122m3452J19660K36449K61570J89045M5572
$$ plain form
0 0 0 0 0 0 0 0 0 0 0 -8 4 -8 8 -9 16 -17 25 -28 34 -43 50 -61 71 -84 101 -114 135 -155 178 -207 236 -269
32 -269 306 -344 391 -438 495 -551 615 -689 764 -852 944 -1046 1157 -1277 1411 -1555 1712
49 1712 -1889 2078 -2292 2526 -2788 3081 -3411 3787 -4218 4722 -5317 6027 -6906 8009
63 8009 -9456 11443 -14346 19033 -27865 50535 -244448 -416552 -24607 219412 422614
74 422614 380408 211864 -92624 -346889 -506023 -456881 -255159 65140 354798 538622
84 538622 525510 346705 50213 -234093 -419507 -424145 -264400 8863 278246 452405 454628
95 454628 293293 20573 -253964 -435331 -450217 -299742 -36280 237397 422882 449207
105 449207 309881 54119 -219830 -414952 -458404 -338744 -102295 159275 348320 393892
115C93892j13096k28678k55820j85788m5111J14718K33949K68504K05938O9888
125D58396q9132k13232k55849k04021p7688P4328J96347K39582J91919O9190q1399
136C08441k03615k51139k06529q5817O5846J93162K49933K15750J04142m2324
146C47850j69479k29381k01484r7081M4474J69116K30325K04993J01772m0189
156C60916j68280k36177k17687j21353J7530J47482K20199K09687J21903j1479
166C22741j38866k13394k06301j21887Q465J36211K13648K11796J31680M032j25148
177B22977k06751k11483j37419j3765J14715J99847K10117J43153K4201j02425
187B43167j89398k04048j41686k6762R9097J87407K05291J46996L3968r2945j85361
$$ plain form
115 393892 280796 52118 -203702 -389490 -434601 -319883 -85934 182570 388508 458396
125 458396 369264 156032 -99817 -303838 -381526 -307198 -110851 128731 320650 389840 308441
136 308441 104826 -146313 -352842 -438659 -372813 -179651 70282 286032 390174 347850
146 347850 178371 -51010 -252494 -349575 -305101 -135985 94340 299333 401105 360916
156 360916 192636 -43541 -261228 -382581 -365051 -217569 2630 212317 334220 322741
166 322741 183875 -29519 -235820 -357707 -349242 -213031 617 212413 344093 348125 222977
177 222977 16226 -195257 -332676 -346441 -231726 -31879 178238 321391 345592 243167
187 243167 53769 -150279 -291965 -318727 -219630 -32223 173068 320064 354032 261087 75726
198G5726k09859j58506n0636P4285J68138J98093J52553M9893p0992j64899j96553
209a32757j53949n2816O8116J65676K02233J65291O9402n0977j50320j92373j61939
220b24413p2237M4889J43316J87228J60978P3879m1579j41165j88848j66752q3147
231c07851L0349J31903J84089J67030Q8621k1719j23977j78439j66467r2578J5407
242b73632J16859J74424J66281R6218r472j11264j71595j67447j01877J988J04133
253a75384J67607J68319J07367P282r4709j60348j65541j08853j2051Q9325J56663
264b0323J65505J12239J7673q3330j53422j66800j17772k6034P4413J46692J63692
275A12533J19498L1289o7730j41400j61695j21445l6422O2012J37291J61213J25143
$$ plain form
198 75726 -134133 -292639 -343275 -268990 -100852 97241 249794 299687 228695 63796 -132757
209 -132757 -286706 -339522 -271406 -105730 96503 261794 331196 280219 129899 -62474 -224413
220 -224413 -296650 -251761 -108445 78783 239761 313640 272061 130896 -57952 -224704 -307851
231 -307851 -277502 -145599 38490 205520 294141 272422 148445 -29994 -196461 -289039 -273632
242 -273632 -156773 17651 183932 280150 270678 159414 -12181 -179628 -281505 -279517 -175384
253 -175384 -7777 160542 267909 275191 180482 20134 -145407 -254260 -266311 -176986 -20323
264 -20323 145182 257421 275094 191764 38342 -128458 -246230 -272264 -197851 -51159 112533
275 112533 232031 263320 195590 54190 -107505 -228950 -265372 -203360 -66069 95144 220287
286B20287M3215n4898j31424j58869j27514m8947M7448J25856J56067J29174N3915
297B54310m1266j20637j54274j30343n8278L4506J15179J52182J32882O3948k8551
308B19658j09205j49065j33599o8385K1794J03886J45744J33948P2106j6481r8592
319A21809j43413j35245p6674R844R2051J39909J35500Q0406l474q6704j36251
330b242j35051q3781r67Q1539J33525J35901Q7529P535p5503j29570j35096r1002
342b07183j2713O9589J25275J34291R2895J7819o4354j21843j34147r6238k2531
353b19140N8475J17842J33228R8597K8323n3026j13990j31821j00748l2981M7542
364a67699J09258J30029J02926L6791m2063j05757j29012j04642m1545L6596J01480
$$ plain form
286 220287 263502 208604 77180 -81689 -209203 -258150 -210702 -84846 71221 200395 254310
297 254310 213044 92407 -61867 -192210 -250488 -215982 -100803 51379 184261 248209 219658
308 219658 110453 -38612 -172211 -240596 -218802 -114916 30828 164776 236882 220401 121809
319 121809 -21604 -156849 -233523 -223679 -131628 8281 143781 224187 220713 134009 -2242
330 -2242 -137293 -221074 -222041 -140502 -6977 128924 216453 223988 148485 18915 -116181 -207183
342 -207183 -219896 -150307 -25032 109259 202154 219973 155619 33776 -100371 -196609 -219140
353 -219140 -160665 -42823 90405 189002 217325 164299 50309 -81512 -182260 -215241 -167699
364 -167699 -58441 71588 174514 211305 169242 63485 -65527 -170169 -211714 -175118 -73638
375g3638J27806J07073M6629l0713r5561j25034j07433m9590K5852R2364J23102
386D0857J08807N3432k1102q8188j22181j10725n8358J5145Q2098J18195J10307
397A28287O0963j1234p8208j16717j11136o4116O302P4351J14474J11943O8052
408A82961m53o8677j10622j11129o9835k560O5239J09140J11630P3841Q022o0417
420A27140j05398j11802p5935j2250N5304J02252J09971P6676J5229n2357j00337
431B8493j11442q1059k1499M6368R5514J09324Q2245K4618m1957r2648j07741
442f9784q3236k7046L8744R0938J09092Q7250L2406l2279q5376j05977q6924l4915
454a67107K9124Q2513J05098Q7970L8258k5751p9864j05028r0418m3334J9326
$$ plain form
375 -73638 54168 161241 207870 177157 81596 -43438 -150871 -200461 -174609 -82245 40857
386 40857 149664 203096 181994 93806 -28375 -139100 -197458 -182313 -100215 17980 128287
397 128287 189250 178016 99808 -16909 -128045 -192161 -185859 -111508 2966 114909 182961
408 182961 182508 113831 3209 -107920 -177755 -180315 -115076 -5936 105694 179535 187557 127140
420 127140 21742 -90060 -165995 -178245 -122941 -20689 89282 165958 181187 128830 28493
431 28493 -82949 -164008 -185507 -139139 -43625 65699 147944 172562 130605 37957 -69784
442 -69784 -153020 -180066 -141322 -50384 58708 145958 178364 146085 60709 -45268 -132192 -167107
454 -167107 -137983 -55470 49628 137598 175856 150105 70241 -34787 -125205 -168539 -149213
465a49213P4369J01163Q9694M5207j6832p2383r9921r1713m8297J2493O8599R9205
477A2371R2982N2990p078o3437r5189r1850n3338M602O0835R4601R2753N6657
489A56899o44n7254r3127r3894o0172m915N1871Q9045R1958O1082P086m9388q7238
502A1309r2367o3511j0538M6103Q5405R3716O6750J5453m0261q1739r0934o6847
514a27461j7873L7915P9571R1689O9073K1486l4841p7182r1282p1793k5929K8847
526a17780P3045Q8747P1163K6793k7767p1780q9282p4236l1215K2487O8003Q7972
538B6150P5175L4737j7655o3200q4952p3697l5025J7250O3617Q6267P7639M0754
550A47060j1082n8325q3298p7288m2361P382N4097Q0272P5653M2531o899n4705
$$ plain form
465 -149213 -74844 26319 116013 161220 144388 72005 -27916 -119629 -167926 -155433 -86834 12371
477 12371 105353 158343 151265 87828 -7361 -99211 -152549 -147947 -87112 7489 100242 156899
489 156899 156255 99001 5874 -88020 -148192 -153107 -101236 -12191 79767 140849 147935 98547 11309
502 11309 -81058 -144569 -155107 -109004 -23599 70117 136867 152320 112059 30320 -60614 -127461
514 -127461 -145334 -107419 -27848 63841 132914 154400 119559 42377 -48905 -120698 -146627 -117780
526 -117780 -44735 44012 115175 141968 114201 42421 -46861 -121097 -152312 -129825 -61822 26150
538 26150 101325 136062 118407 55207 -29745 -103442 -138467 -121217 -57600 28667 106306 147060
550 147060 135978 77653 -5645 -82933 -125294 -117912 -63815 16457 92110 134641 127742 73037
562G3037q1817p9369m8401R33M8241P7709P7804M8653J987m5114p5614p6885m9642
575a28478l427M4295P5891P9495N3764Q883l8417p1929p6681n4088j0297L6422
587h4567P0165P7363N5875J3246l3791o8573p7686n8465j8099K9440O4658P5704
599D5270N7923J8735k7990o3782p6234o0383k2156K3578O1134P5464O2090K5588
611A19237j9627n7493p2625o1513k6857J8115N6293P4055O3216L0194j4663n3486
623E4846p2418o4969l2817J0086M9960O9842O3814L4594r013m8146o9195o5584
635g9000l6512N353M5554O8411O6460L9339j567m1781o6030o5276m0387J04L9666
648f5666O5129O5891M2288K876l6999o3571o6268m5068o173L3642O1544O5176
$$ plain form
562 73037 -8780 -88149 -136550 -135617 -87376 -9667 68137 116790 118777 73663 -1951 -78836 -128478
575 -128478 -131905 -87610 -11719 67776 121540 130423 92006 20077 -56604 -110692 -120989 -84567
587 -84567 -14402 62961 118836 132082 98291 29718 -47968 -106433 -124532 -95092 -30434 45270
599 45270 103193 121928 93938 30156 -46078 -106461 -128617 -105039 -43905 31559 93649 119237
611 119237 99610 42117 -30508 -92021 -118878 -100763 -44470 29585 92801 122995 108332 54846
623 54846 -17572 -82541 -115358 -105272 -55312 14530 78344 112938 103925 55779 -13416 -79000
635 -79000 -115512 -110159 -64605 3806 70266 109605 108038 66257 227 -65049 -105436 -105332 -65666
648 -65666 -537 65354 107642 110518 73519 9948 -56320 -101388 -107561 -73919 -12375 52801
660E2801M5181Q442l1816o0281o5777m7619j1467K8661N7891O5486M8923J3857
672A04282k5495n5793o4118m9556j5447K4033N3899O5307N1587J9107j9967n1467
684C6372o4028n1931k0988J7632M9638O2381N2302K2957j5590m8496o2409n4650
696g6810k5793J2096M4891O1008N4239K7364r633m3174o0010n4720k9324P414
708i2452M1558N9215N5843L1837m262l8072n7819n5493l2898J989L6026N6719
720B191N6387L4608P04l3914n5629n6499l6532l196L1312N3747N6235L7834M852
733I2100k9066n2738n6656l9310p779K6778N1424N6134M0435J0077k4597m9550
745A7252n5608m1404j1978K2277M7986N5830M2805J4260k0074m6232n5063m4154
$$ plain form
660 52801 97982 106424 74608 14327 -51450 -99069 -110536 -81875 -23984 41502 90425 104282
672 104282 78787 22994 -41124 -90680 -106127 -82094 -28195 37112 88699 107806 87839 36372
684 36372 -27656 -79587 -100575 -82943 -33305 29076 81378 104335 88745 40249 -22160 -76810
696 -76810 -102603 -90507 -45616 15392 69631 96995 87362 44188 -15822 -70542 -99866 -92452
708 -92452 -50894 8321 64164 96001 91739 53667 -4152 -59645 -92543 -90554 -54528 2191
720 2191 58578 93186 93890 59976 4347 -52152 -88684 -91880 -60568 -6821 49414 87248 92100
733 92100 63034 10296 -46360 -85670 -93449 -66671 -15247 40887 81322 91399 66802 17252
745 17252 -38356 -79760 -91738 -69461 -21475 34355 77160 91420 71346 25114 -29949 -74103
757g4103j5610J7518M4609N4881M4150J7977j5183m3099n4090m5457j9703J2990
769g5120M0968N3728M5764K1866j1066l9307n2554m6786k3627Q566L7434N1743
781A1609M7424K5096o143l5312n0857m7958k6888M429L3016N0205M8162K8169
793H0952j874l1057m9185m8326k9626j22K8785M8112M8671L1230K141k7147m6656
806E898m8834l2309m768K5504M5372M8486L3966O522k3466m4207m8606l5048q257
819g9747K1175M3212M8547L6124R903j9160m1439m8026l7208j2117J7044M0160
831b1532M7743L8450J3364j5177l8243m7523l8819j5790J3245L7262M6775L9720
843E9475J7184j1460l5615m6564l9696j9259R546L4020M5766M0958J9958p233
$$ plain form
757 -74103 -89713 -72195 -27586 27295 71445 89422 74239 31140 -22950 -68407 -88110 -75120
769 -75120 -34152 19576 65340 87206 76140 36833 -15721 -62507 -86134 -77568 -40134 11609
781 11609 59033 84129 77986 42674 -8183 -56141 -83029 -78600 -45584 4621 52783 80952
793 80952 79078 48021 -1164 -49490 -79116 -79238 -50453 -2341 46330 77560 79701 52554 5898
806 5898 -42936 -75245 -80013 -54509 -9137 39349 73315 79837 56371 12164 -36442 -71490 -79747
819 -79747 -58572 -15360 33187 69311 79214 60054 18615 -29411 -66619 -78736 -61692 -21532
831 -21532 26211 64661 78025 62848 24605 -22918 -61737 -77527 -64282 -27020 19755 59475
843 59475 76659 65199 29584 -16980 -56676 -75935 -66389 -32369 13397 54355 74313 67080
855F7080l2603m5281m1079k1476N357L0790M4660M1529K2954l547k9066m3631
867d313m2194k4216J931K7644M2869M2409K5565j44k6204m1652m2571k6933j084
880f8893K4039M0719M2761K7975L422k2811l9743m2744k9491m925K0769L8596
892a0326M2372L0421O614j9367l7563m2457l1001q531J7418L6611M2084L2250
904E8525J0261j5058l5403m1646l3007j1390J3678L4174M1823L3504J3493j2120
916E6834l3137m1025l4779j4612J0061L1567M0476L4792J6134r115l0032m0516
928a3352l5160j7969P009K8725L9726L6074J8653n031k7508l9104l6037j9695
940f3669L698K5963L8656L6750K1319j915k4289l7738l6866k2144Q83K2747L7106
$$ plain form
855 67080 34477 -10804 -51883 -73359 -68002 -37212 7448 48977 71931 68384 39318 -4313
867 -4313 -46507 -70723 -68792 -41148 1721 44130 69695 69551 43347 1695 -40876 -67809 -68893
880 -68893 -44854 -4135 38626 66601 70023 47212 7469 -35275 -64766 -69691 -48922 -10326
892 -10326 32046 62467 69081 49714 12151 -30306 -61307 -69838 -52420 -15809 26275 58525
904 58525 68786 53728 18325 -23321 -56328 -67718 -54040 -19866 21957 55461 68954 56834
916 56834 23697 -17328 -52107 -66719 -56658 -25091 15385 50177 66311 57196 27164 -13352
928 -13352 -48512 -66481 -59472 -30747 8979 45053 63706 58675 31167 -7937 -43974 -63669
940 -63669 -59971 -34008 4648 41398 62717 60802 36513 -1225 -38091 -60235 -59352 -36605 501
953E01L7006K2946J012k1828l6239l7179k4866k425J9826L4978L7169K5486L895
966F0282j8963l4047l7589k5781n808J7552L3673L7086K7830O673j5331l2405
978A3172l6894k7870q351J4137L1580L7095K8151R844j2739l0661l6748k9557
990d8841j1078J1122K8969L6261K9787J2254r625k8197l5598l0387j3669Q059
1002e0943K6966L5701L1162J5014o416k5580l4643l1509j6135N784K4293L4235
1014G929L1992J7217m061k2984l4253l2105j8425K004K1674L3029L2257J8926
1026E3200r25k0824l2894l2563k0123n35J9535L1840L2688K1555J836j7749l0845
1039D196l2452k1790k967J6588L0895L3013K3123M428j5447k9613l2888k3423
$$ plain form
953 501 37507 60453 61465 39637 3398 -33781 -58647 -61072 -41246 -6268 30901 56387 60282
966 60282 41319 7272 -30317 -56098 -61906 -44354 -10681 26405 54235 60908 45577 13172
978 13172 -23722 -51592 -59943 -45806 -14226 22869 51020 60864 48125 17464 -19284 -48841
990 -48841 -59919 -48797 -19828 16433 46220 58474 48849 20652 -14946 -45333 -59002 -50943
1002 -50943 -23977 11724 42886 57900 51484 25904 -8739 -40248 -56383 -50599 -26306 7929
1014 7929 39921 57138 53077 30093 -4160 -36265 -54690 -52686 -31012 2017 34274 53200
1026 53200 52275 31451 -1443 -34006 -54129 -54664 -35129 -3289 29399 50954 52790 35041 4196
1039 4196 -28256 -50046 -53013 -36425 -5530 27483 50606 55034 39587 9974 -22914 -46337
1051d6337n959J3759K8818L2266K4063O574j2818k7880l2829k4899q794J1583
1063d2453K6928L2348K5278R445j0325k5872l1685k6055j0387R044K5108L1837
1075A3211K6746J1947p559k3653l1092k7046j2729O181K3063L0982K7186J3930
1087E1167n489k1257l0779k8252j4851L255K0880K9867K7845J5867k247j9740
1099B6266k9633k8185j6806R85J8782K8916K8754J7430M92j7214k8322k8562j8329
1112d5426j274J6054K7777K8691J8918K774j5196k7050k8624j9902m061J3746
1124c3573K6427K8704K0547M675j2769k5622k8669k0851o295J1925K4749K8451
1136A7699K2192O837j0189k3934k8068k2551p908R231K2989K8335K3046Q783q047
$$ plain form
1051 -46337 -52296 -38537 -9719 22547 46610 53184 40366 12486 -20343 -45242 -54036 -42453
1063 -42453 -15525 16823 42101 51546 41221 15349 -16336 -42391 -52778 -43734 -18626 13211
1075 13211 39957 51904 44345 20692 -10400 -37446 -50175 -43994 -20931 10051 37237 51167
1087 51167 45678 24421 -6358 -34610 -49461 -46206 -25326 4541 32386 48253 46006 26266
1099 26266 -3367 -31552 -48358 -47373 -28591 325 29079 46509 47001 29787 1465 -27097 -45426
1112 -45426 -46700 -30646 -2869 25822 44740 47514 32318 5268 -23356 -43258 -47319 -33573
1124 -33573 -7146 21558 42105 46780 34011 8389 -20280 -41131 -47426 -35501 -10752 17699
1136 17699 39891 46728 36539 12605 -15463 -38014 -45922 -36691 -13702 14633 37679 46462 38415
1149C8415k2123k7809k3805j0390P081K1162K7271K3910J1186n986k0734k6851
1161h673k4425j1922M447J9690K6807K4633J2746l486j8135k6118k4998j3741
1173d3175K404J7564K5997K5038J4632j059j6118k5618k5107j5359pJ5063K5089
1186f56K5238J6270J084j4587k4519k5403j6924k336J3402K3689K5556J7367L365
1199D1546j2311k3232k5387j8342m106J1191K2582K5289J8825N436j0227k1672
1211I592k5514j9328o449R174K1334K5387J9929O974p892k0387k5131k0295q194
1224d0800P025K0052K4673K1066Q928o442j8639k4489k1703r358M948J7995K4448
1237G704K1598J0129l885j7520k4011k2010j1031L202J6285K3650K2144J1731
$$ plain form
1149 38415 16292 -11517 -35322 -45712 -38631 -17469 9802 33712 44898 38912 18178 -8673
1161 -8673 -33098 -45020 -40573 -20883 5924 30557 43303 39817 21682 -4436 -29434 -43175
1173 -43175 -40771 -23207 2790 27828 42460 41401 25283 -335 -25442 -40801 -40808 -25745 -656
1186 -656 24582 40852 41936 27349 2830 -22573 -39497 -41833 -28431 -4742 20814 38181 41546
1199 41546 29235 6003 -19384 -37726 -41832 -30641 -8059 17230 36055 41491 31264 9592
1211 9592 -15922 -35250 -41699 -32525 -11191 14196 34125 41099 33207 12820 -12311 -32606 -40800
1224 -40800 -33775 -13723 10950 32016 40944 34502 15863 -8626 -30329 -39687 -34739 -16744 7704
1237 7704 29302 39431 35546 18026 -5985 -27995 -39026 -35824 -19539 4111 26255 37986
1249C7986k138j5219k3485k2362j2484R64J4554K3192K2144J3787l37j4024k1894
1262F84k2456j4169p22J2925K1721K2496J5011J717j2144k0931k2844j5285k578
1275c6575J0770K0822K2644J6020L404j0239k0090k2377j6587m725R127J9718
1287h088K2399J6761N521q391j8897k2176j7460o481P261J8484K2348J7758P104
1300C6143o381j7518k2458j7972p519N236J7092K1814J8533Q782m841j6202k1548
1313f839j8982r054L657J5353K1369J9112J0033l098j4645k0774j9658j0430K123
1326c1833J4084K0411J9465J1186j039j3490j9794j9835j1712J56J2427J9627
1338c47J9900J2599J90j1601j9219j9936j3051j371J0727J9205J9671J3517K378
$$ plain form
1249 37986 35848 20629 -2856 -25218 -37702 -36738 -22184 1008 23152 36939 36602 22578 684
1262 684 -21772 -35941 -36663 -23738 -2017 20479 35490 37207 25063 4132 -18712 -33997 -36575
1275 -36575 -25805 -4983 17661 33681 37085 26846 6756 -15621 -32208 -36933 -27806 -8088
1287 -8088 14311 31072 36593 28202 9305 -12871 -30331 -36812 -29551 -11067 11281 29039 36143
1300 36143 29762 12244 -10214 -28186 -35705 -30469 -13377 8437 26970 35752 30911 14709 -6839
1313 -6839 -25821 -34875 -31218 -15865 5504 24616 34649 31551 16906 -3868 -23526 -33956 -31833
1326 -31833 -17749 2662 22127 33313 32274 18784 -1010 -20845 -32557 -32401 -19974 -347
1338 -347 19553 32152 32342 20741 1522 -18414 -31465 -32836 -22109 -2904 16767 30284 32662
1351C2662j0168j8324j9856j4002l012R221J7673J9911J4479L914q455j7343j9583
1364a2883j4507m672P603J6578J9766J5433M923o705j6278j9168j5771o107N955
1377b5833J5447J9383J5863O559n252j4953j8830j6682p479M327J4802J8568J6678
1390B2598P832l456j3400j8644j6785q741K672J3432J8025J6971R543k252j2132
1403A5663j7877j7035r685J243J1546J7769J7130J0351n40j1051j7248j7403j0442
1416b7579o89J0319J6898J7111J1150J230r881j6600j7078j1881j954R249J5988
1429c717J7294J2299K369q321j5684j7154j2445k950P615J5161J7329J2904M018
1442B8718p336j4772j6806j3383m161O114J4346J6942J3617M347m927j3882j6977
$$ plain form
1351 32662 22494 4170 -15686 -29688 -32700 -23479 -5806 14105 28584 32498 24043 6700 -12883
1364 -12883 -27390 -32062 -24459 -7881 11885 27318 32241 25536 9258 -9910 -25681 -31788 -25833
1377 -25833 -10386 8997 24860 31419 26167 11214 -7616 -24298 -31777 -27450 -12648 5920 22598
1390 22598 30430 26974 13574 -5070 -21855 -30596 -27924 -14492 3533 20504 30047 27795 15663
1403 15663 -2214 -19249 -28934 -27691 -16145 1624 18754 29105 28565 17514 266 -17137 -27579
1416 -27579 -28268 -17949 -1051 16060 27210 28440 18559 1959 -15119 -27000 -28954 -19705 -3717
1429 -3717 13577 25876 28245 19924 4240 -12914 -25359 -28309 -20694 -5533 11796 24700 28718
1442 28718 21382 6610 -10196 -23579 -27740 -21626 -7280 9662 23279 27626 22699 8817 -8160
1455h160j3759n640M790J3221J6934J3845O258m234j2782j6465j4173o744L289
1468b3620J1947J6449J4459P336k759j1514j6212j4700p238J961J0831J5723J4862
1481A7525Q172j415j0256j5591j4884q823N90J0100J5040J4819R127J15r431j4431
1495F57j5184r694m70Q523J4780J5019J0099J225p893j4082j5049j0448j713P381
1509a6849J3636J5076J0428K259o520j3578j5055j0888k946N851J3149J4724J1286
1522B0573L489n539j2415j4667j1556m469N192J1814J4658J1657M808m152j1658
1535G735j4390j1798n109L741J1220J4265J2285N765l194j0527j4281j2095o166
1548b2549K590R851J4041J2078O633j980r916j3437j2906o969J336R256J3315
$$ plain form
1455 -8160 -21919 -27559 -22769 -9548 7386 21231 27489 23255 10473 -5992 -20165 -26909 -23620
1468 -23620 -11673 4776 19235 26571 23812 12298 -3914 -18614 -25852 -23891 -13060 2663 17525
1481 17525 25697 24282 14026 -1565 -16449 -25272 -24682 -14582 458 15277 24404 24519 15088 657
1495 657 -14527 -24221 -24691 -16168 -1388 13631 23730 24955 17062 2980 -12069 -22517 -24230 -16849
1509 -16849 -3213 11863 22291 24550 18030 4452 -10603 -21491 -24437 -18586 -5437 9287 20573
1522 20573 24062 18523 6108 -8559 -20115 -24584 -19392 -7578 7080 18737 23545 19393 7735
1535 7735 -6655 -18453 -23562 -19821 -8601 5664 17949 23714 20520 9993 -4288 -16383 -22549
1548 -22549 -19959 -10108 3933 16011 22644 20664 10748 -2689 -15595 -22564 -21228 -11972 1343
1561A343J2966O946p09q577j3013j2693p930L14Q187J3032J2863P964L42p672
1575A3363j2463j3140p962o42P008J2216J2970Q762Q60o398j1847j3008r261j530
1589b1072O104J1874J2733R119K426n570j1572j3003r319k670N091J0932J2785
1602G858R932L061m932j0602j2356r936l799M424J0276J2289J0157L939l468j0074
1616F769j2404j0030m706L180R469J2196J0371N019k469r416j1876j0689m923
1629a9509K119Q561J1900J0900N318j141q548j1881j0529o076J160P997J1321
1642A592J1134O055o61p562j1322j1037o509J19P236J1280J0593P148r1o343j1035
1657E97j1000p112j146O513J0515J1118P365J148n743j0191j0950p706j349N185
$$ plain form
1561 1343 14309 21255 20546 11969 -1044 -13737 -21667 -21353 -13166 -134 12729 20693 21035 13363
1575 13363 900 -12240 -20202 -20844 -13836 -1620 11350 20112 20972 14574 2727 -10281 -19542 -21072
1589 -21072 -14968 -3094 9639 18758 21184 15614 4042 -8961 -18280 -20950 -15859 -4927 7858
1602 7858 17790 20851 15919 5317 -7039 -16975 -20774 -16350 -6074 6215 16372 20311 16843 6769
1616 6769 -5635 -15665 -20371 -17191 -7722 4474 14845 19864 17395 7979 -3897 -14586 -19509
1629 -19509 -17390 -8829 3071 13971 19289 18148 9600 -2281 -12810 -18886 -17726 -9729 1592
1642 1592 12726 18781 18120 10558 -764 -11801 -18310 -18191 -10955 325 10918 18066 17975 11632 597
1657 597 -10403 -17515 -18661 -12148 -1633 9485 16850 17998 12255 2064 -8886 -16592 -17941 -12756
1671a2756J0125J1025Q048J510m523r638j1162p858k878M610R417J0759Q687K722
1685A8088m237r291j0651q459l048L583Q689J0554Q930L422l335q370j0842q437
1699a3404l863K920P997J0376R107L749k344p609j0346q878m525J873P414J0297
1713B764Q779N069j470p016r864r399n189J333O614R665R392N427n85o703r536
1728g19r139n868K58O268R236R665N835l36n579r423r028n980m38N288R032R362
1744H434O089J182n475q748r552o480r58M664Q469R483O574J540m782p746r256
1759f562o809j704L875Q073Q937P154K150l409p942r343o601k503K957P694Q785
1774D752P412K546k846p184r073p135l008K321O891Q868P454L316j993o520r314
$$ plain form
1671 -12756 -2631 8394 16442 17952 13429 3791 -7371 -15229 -18107 -13497 -4080 6679 15366 18088
1685 18088 13851 4560 -6091 -14550 -17598 -14015 -5326 5228 14158 17580 14245 5875 -4967 -13404
1699 -13404 -17267 -14347 -6350 4026 13133 16882 14538 6929 -3417 -12295 -16820 -14947 -7533 2764
1713 2764 11543 16612 15142 8126 -1738 -11137 -16326 -14993 -8379 1286 10678 16105 15520 8817 -719
1728 -719 -9858 -15726 -15468 -9200 36 9701 15536 15200 9621 198 -8830 -14810 -15248 -9960 -928 8434
1744 8434 14523 15705 10230 1482 -8070 -14550 -15508 -10844 -2375 7108 13682 15222 10440 2694 -6562
1759 -6562 -13371 -15075 -11200 -3127 5810 12964 15114 11705 3763 -5580 -12181 -14684 -11727 -4033 4752
1774 4752 12164 14710 11864 4680 -4393 -11528 -14536 -12215 -5324 3544 10998 14314 12321 5801 -3513
1789c513p331l397J688O274Q993P847L449j398o258q526p626l823J066N763Q431
1804A639P531M502r46n516q095p860m510L27N276Q276P551M651k0n352p312p673
1820g531m789o21M778P317Q011N206M24m434p291p858n168p16M177P253P678N236
1836A1672J275l920p072p668n597j128L265O740P809N680J472l110o700p630n912
1851a0824j720K782O624P600N754K183k578o188p159o414k216K120O154P535N736
1866I389K707j921n801p286o158l024J873N605P281O235K825j504n205p246o321
1881h551l096J354M872P135O192L342q92m681o885o571l404N57M778O669O269
1896G088L689n01m065o454o667l845J18M090O400O465L938M62l861o636o397l887
$$ plain form
1789 -3513 -10844 -14241 -12553 -6279 2714 10561 14010 12612 6354 -2172 -9798 -13621 -12555 -6792 1639
1804 1639 9170 13672 12726 7210 -885 -8745 -13255 -12928 -7652 624 8175 12826 12806 7454 142 -7531
1820 -7531 -12320 -12941 -8163 -846 7165 12371 12795 8361 1070 -6788 -11956 -12672 -8495 -1242 6436 11672
1836 11672 12947 9027 1955 -5713 -11310 -12438 -9173 -2433 5376 11056 12528 9418 2718 -4912 -10824
1851 -10824 -12544 -9762 -3138 4462 10216 12399 9821 3633 -3526 -9940 -12156 -10036 -3882 3653 9389
1866 9389 12096 10175 4374 -2912 -9070 -12094 -10221 -4616 2665 8900 11725 10221 5016 -2230 -8551
1881 -8551 -11647 -10293 -5421 1714 7906 11248 10356 5675 -1210 -7781 -11185 -10628 -5850 819 7088
1896 7088 10777 10276 6211 -243 -6910 -10755 -10637 -6547 -147 6318 10256 10718 6857 221 -6176 -10063
1912a0063l55L585O167O365M364K82l090o220o293m379o77K973N927O319M194
1927I099J077k678n570o332m784j267L061N426O074M625J503k418n340o211m685
1942h420j592J942N155O220M649J768j548n150n981m822k070J573M808O066M681
1957G279K329j413m619n723n305k023J311M286N427N195K422q50m213n701m708
1972f306k720M86M129N511N404K513o08l502n592n272l109O61L358N362N233L196
1988H744j79l462n363n167l276J83L167N210M963L578O7k698n436n033l578k18
2004h498K949M668N421L370O82k804m596n180l900m17K508M203N173L858Q54j986
2020F305m916m936l466j146J842M192N193L955J176j946m018n057l674j435J624
$$ plain form
1912 -10063 -10418 -6833 -666 5699 10063 10345 7255 1035 -5258 -9637 -10314 -7341 -1414 4905 9099
1927 9099 10176 7498 1928 -4404 -9188 -10455 -7394 -1968 4106 8731 10234 7816 2476 -3735 -8420
1942 -8420 -10012 -8070 -2915 3305 7954 9722 8174 3024 -2957 -7779 -9849 -8276 -3468 2598 7279
1957 7279 9608 8195 3576 -2147 -7452 -9475 -8164 -3878 1549 6744 9166 8316 4103 -1598 -6306
1972 -6306 -9026 -8540 -4411 1100 6504 9017 8409 4907 -685 -5957 -9066 -8405 -5047 315 5548 8744
1988 8744 8565 5103 -260 -5427 -8703 -8520 -5353 -143 4820 8398 8465 5767 331 -4702 -8280 -8498
2004 -8498 -5549 -881 4540 7910 8592 5788 1192 -3988 -7888 -8305 -5797 -1594 3579 7437 8291 6305
2020 6305 1389 -3547 -7013 -8159 -6317 -2125 3068 7023 8199 6253 2235 -2822 -6496 -7931 -6307
2035f307L773N253L913J430j710l866m687m031j582J498L497M917M134J404p92
2050F844l720m844m079j821O75L385M917L920K039m37l474m654m029k251N93L446
2066c490M347M094K333m71l045m558l804k661M20K740M480M324K149j16k414m361
2082c3m216k578j06K540M361M300K308K56k346m140m224k334p62K232L977M490
2098C725K673M12k157l821m123k845n03J943L927L847K890P30j908l666m083l063
2114f022p10J798L442L726L520Q76j805l380l942k842j227J345L261M056K761
2129D857J719j324k989m025l267j392J040L203M147L024J514j337k973l858l072
2144d733j548N04L164L716L459J594p42k547l940l505j462N05K660L589L296K076
$$ plain form
2035 -6307 -2534 2719 6632 8062 6352 2486 -2201 -6232 -7814 -6316 -2819 2098 6232 7636 6844
2050 6844 3124 -1720 -5799 -7620 -6945 -3560 1357 5277 7316 6879 3405 -1249 -5278 -7529 -6936 -3490
2066 -3490 857 4951 7284 6813 3768 -790 -4594 -7255 -6835 -4095 385 4709 6858 6742 4328 -33
2082 -33 -4249 -6827 -6933 -4393 -32 4268 6576 6832 4486 346 -3878 -6212 -6974 -4742 -765 3725
2098 3725 6398 6810 4653 832 -3291 -6136 -6639 -4696 -769 3078 5968 6698 4790 1124 -2959 -6022
2114 -6022 -6732 -4934 -1492 2234 5754 6630 4825 1445 -2497 -5339 -6566 -5221 -1960 2096 4857
2129 4857 6576 5252 2263 -1762 -5029 -6421 -5381 -2178 1969 4993 6507 5170 2197 -1661 -4733
2144 -4733 -6281 -5777 -2613 1103 4562 6156 5414 2867 -1073 -4578 -6040 -5535 -2875 714 4010 6086
2160F086l96k683l715l591j429N2K372L897L103K195n61j984l595l242j899k09
2176e599K303L088L693K147m9k063l255l404j969l65J815L295L142K429J43j676
2192C675l161l262k415l34J677L320L194K326K84j368l296l201k323m59J072L295
2208i76L475K084R81j543k849l535j889j187J450K670L243K709P16j408k575l086
2224a720k799o48Q94K454L435K413J387j177k449l568k455p73L18K874K839K902
2240C927J058m15k542l209k749j170P49K208L032K738J441l37k336l237k597j234
2256d673M14K105K706K712J513k96j893k994k651j572J49J818K698K943J573J29
2272D681j926k838k830j647J83J468K693K899J797K51j714l026k300k119j78J594
$$ plain form
2160 6086 5690 3007 -708 -4299 -5728 -5676 -3304 593 3696 5891 5330 3346 -249 -3491 -5390 -5599
2176 -5599 -3296 -208 3485 5632 5583 3520 265 -3139 -5108 -5473 -3658 -363 2779 5208 5351 3675
2192 3675 514 -2748 -5163 -5497 -3820 -500 2694 5020 5304 3936 640 -2561 -4884 -5343 -4271 -976
2208 -976 2499 4583 5564 4021 1172 -2363 -4252 -5439 -3989 -1319 1924 4633 5349 3941 1366 -1720
2224 -1720 -4519 -5167 -4273 -1819 1616 4029 5416 4239 1790 -1778 -4233 -5006 -4688 -1814 1025 3927
2240 3927 4985 4570 2028 -1181 -3930 -5100 -4351 -2143 889 3627 5068 4731 2395 -842 -3439 -4673
2256 -4673 -4259 -2154 552 3264 4777 4481 2588 -406 -3057 -4629 -4480 -2662 36 2979 4552 4681
2272 4681 2755 -83 -2913 -4560 -4377 -2909 -216 2683 4480 4731 3017 -9 -2309 -4428 -4606 -3012
2288c012K653K732J916L69j572k541k894j943m7J280K678K564K094K36j321k309
2304H83k706k254m66J290K266K714K010Q79j389k111k721k318p09J229K297K632
2320A526K069P18r69j895k887k080q46P25K030K676K502N30n35j886k650k275
2336c247j030O23K109K642K003J284o23k035k372k249j215L35K017K086K474J208
2352D010m23j468k642k284j402N00J527K655K097J519q5j780k411k381j480J32
2368c916J678K480K369J301p5j536k267k412j774L54J382K084K602J526p9j194
2384B523k410k026j630l00J362K219K435J220N67j249k155k131k307lJ049K271
2400e65K325J648L87r35k011k701j672j55Q83K011K342J880L59q91j696k462k100
$$ plain form
2288 -3012 -359 2373 4289 4658 3086 545 -2349 -4292 -4339 -3059 -381 2183 4277 4513 3192 883
2304 883 -1823 -4077 -4543 -3253 -987 1727 3737 4616 3227 1116 -1605 -3923 -4632 -3403 -1106 1526
2320 1526 3595 4313 3344 1449 -1438 -3518 -4364 -3639 -1609 1067 3569 4099 3564 1678 -972 -3247
2336 -3247 -4277 -3654 -1545 1097 3100 4384 3761 1726 -646 -2895 -4110 -3775 -1758 328 2802 4010
2352 4010 3587 2119 -523 -2807 -4209 -3709 -2182 473 2570 4089 4004 2224 -187 -2568 -4048 -3916
2368 -3916 -2238 242 2611 3912 3837 2301 34 -2378 -4152 -3798 -2416 -332 2270 3796 3717 2523
2384 2523 113 -1913 -3543 -3843 -2481 -262 2173 3393 3960 2711 556 -1575 -3882 -3885 -2836 -565
2400 -565 1760 3408 3795 2860 849 -1852 -3524 -3679 -2796 -785 1557 3437 3796 2905 1209 -1253 -3353
2417c353m78J031J600K431K068N78o16j816k513j677j127O55J990K374J545J299
2433C991o81j776k222k450p83Q37J573K325K072R45o47j625k153j949j282M83
2449c342J683K097J991J323m07j654k143j920j204M70J096K053K159J152J31j444
2465B041k172j948j508J17J867J608K024J512r8j075k216k150j293N3J132J776
2481c30K499J369j77j135k073j675j720j02J053J617K545J151M20r85k103j870
2497a516j701l06J085J916K013J594L63p57k027j952j747l04M61J805K134J873
2513B934N54r05j496k210j718o58P98J756K019J585J051o35j928k090j825q32
2529c600N59J713K175J782P45n60j427k211j995q18O57J359K188J926J092m76
$$ plain form
2417 -3353 -3831 -2800 -1200 1231 3299 3877 3261 1445 -1068 -2745 -3872 -3217 -1227 1147 2692 3991
2433 3991 3310 1534 -688 -3138 -3921 -3084 -1511 814 2886 3831 3184 1559 -594 -2543 -3825 -3342
2449 -3342 -1659 438 2429 3752 3345 1691 -452 -2372 -3576 -3106 -2010 43 2202 3354 3485 2041
2465 2041 -131 -2079 -3587 -3470 -1603 5 2029 3541 3443 2368 152 -1998 -3291 -3238 -2106 -330
2481 -330 2169 3538 3361 2226 153 -1522 -3242 -3344 -2291 -674 1871 3022 3442 2457 354 -1516
2497 -1516 -3217 -3523 -2438 -522 1491 3085 3448 2691 664 -1288 -3035 -3339 -2878 -1073 1061 2934
2513 2934 3488 2583 1087 -1123 -2841 -3499 -2701 -945 1074 2659 3710 3075 1147 -943 -2768 -3600
2529 -3600 -3041 -1328 847 2629 3374 2814 1387 -824 -2819 -3637 -2980 -1621 567 2493 3585 3109
2545C109j552j866k183q72M03J126K147K052Q26j18j292j865k224j048O2J598
2561a697J574K161J202o0r23k189j981j167j06J467J545J891J360J16j452j426
2577C15k107j325j17J099J926J889J286K68r04j818k156j489p9O56K079J940J407
2594B870N48j023j582k293j360m63P15K058J779J369O93q85j486k098j446o67
2610c271O42J996J535J662O18n33j535k243j677n34O88J569J743J793Q07n62j567
2627A131j729j910p68L54J451K165J690Q43j93j581j810j987j043M55J598J841
2643E07J588R96Jj851j691j640j020K17J154J989J998Q15k8j245j632k264p35
2660b841j00J014K002J963J056M9j254j773j714j567p6J232J730J898J360K30
$$ plain form
2545 3109 1557 -309 -2492 -3364 -2961 -1835 312 2364 3190 3072 1780 -85 -2309 -3357 -3295 -1697
2561 -1697 -123 2038 3240 3180 2257 68 -1913 -3080 -3186 -1719 -174 1717 3077 3193 1741 315
2577 315 -1792 -3117 -3234 -2135 -209 1680 2966 3234 2330 512 -1644 -3133 -3212 -2556 -477 1463 2870
2594 2870 3418 2395 813 -1480 -2840 -3303 -2588 -530 1249 2618 3311 2426 940 -1158 -2604 -3271
2610 -3271 -2629 -633 902 2564 3182 2649 1114 -1129 -2806 -3340 -2652 -1083 660 2453 3260 2698 1131
2627 1131 -598 -2508 -3276 -2922 -1471 694 2384 3227 3034 1453 -357 -2344 -3387 -2932 -1334 507
2643 507 2095 3091 3092 1241 -450 -2090 -3110 -2893 -1739 250 2248 3063 3035 1790 158 -2106 -2841
2660 -2841 -2941 -1927 75 2038 3094 3143 1889 116 -1598 -3165 -3241 -2009 -279 1619 2979 3209
2676C209j082j564k339j109k09Q19J858J774J380L52p03j715j608j900n22R36
2692b423J951J697J639N84j096j573j826j730n14P10J563K179J840J45n79j566
2708A001j780j670q09P24J427K085J330J046n10j683j834j866m40L83J549J472
2724D25K165O91n59j406k052j549p36J18J450J831J676R73m51q37k214j822p98
2741c095J82J362J885J816J080n98r49j851j691j256RJ223J969J673J269K8q79
2758B177k018j843j172j56J111J740J850J108L05j079j508k118j500j61J164J578
2774e22K056J205K99p96j865j849j443k85O85J705K155J238M23p42j528k011j346
2791b621o95Q96J488K128J195O79q48j311j951j392p45P24J411J778J695N65k76
$$ plain form
2676 3209 2127 563 -1776 -2885 -3094 -2275 -417 1357 2737 3089 2386 671 -937 -2837 -3359 -2423
2692 -2423 -472 1225 2864 3448 2352 779 -1047 -2777 -3291 -2581 -1018 1161 3001 3146 2567 1001
2708 1001 -779 -2449 -3258 -2534 -1107 978 2308 3354 2844 1161 -673 -2539 -2979 -2596 -1047 425
2724 425 2590 3281 2722 1316 -736 -2285 -3021 -2903 -1453 378 2054 3027 2576 1739 -475 -2297 -3095
2741 -3095 -2913 -1551 334 2150 3230 2632 1683 -168 -1859 -3115 -3106 -1883 86 1759 3028 3056 2177
2758 2177 159 -1684 -2856 -3012 -1901 -161 1689 2797 3102 2023 515 -1603 -3103 -3264 -2100 -522
2774 -522 1534 2739 3038 2242 377 -1472 -2915 -3200 -2515 -810 1345 2583 3006 2264 736 -1275 -2621
2791 -2621 -3316 -2420 -932 1196 2391 3070 2222 911 -1040 -2432 -3177 -2453 -1042 736 2431 2996 2720
2808B720j488j875j832n62K98J521J995J808N86o33j253j828j600r57R8J852J462
2825C12J795Q70k7j102k427j471p97L1J287J614K099Q29m50q95j531j765j280
2842b908JJ135J836J609J040J30j068j734j704j069o85J362J837K051R60O9q31
2859B031j502j891j503m99J404J799J730J628k69n79j878j726j464n11J083J385
2875g62K022J306N05n59j756j519j649o23O53J582J849J738J88o73j395j690j730
2892b513o11N91J361J912J463J175p26j451k031j251q12K27J155K039J503R50
2908B981k88j121j916j929o94J89J467K050J288J049l14j072j988j708q88J26
2924b768J251J416K433L92J33j026j651k203r09J14J124J612J780J167K00j205
$$ plain form
2808 2720 1232 -643 -2475 -3037 -2739 -1218 777 2585 3171 2538 1285 -543 -2143 -3100 -3002 -1150 312
2825 312 2107 2977 2950 1848 -579 -2050 -2847 -2816 -1529 85 2184 3013 2563 1668 137 -1628 -2908
2842 -2908 -2907 -1772 64 1673 2713 2843 1775 41 -1663 -2732 -3417 -2055 -218 1833 2793 2862 2031
2859 2031 529 -1362 -2865 -3364 -1960 -161 1569 3197 2928 2349 471 -1255 -2719 -3230 -2147 -762
2875 -762 1260 2566 3071 2512 756 -763 -2412 -3035 -2382 -800 1049 2787 2975 2302 907 -783 -2513
2892 -2513 -3124 -2533 -1172 740 2203 3378 2652 1201 -830 -2081 -2893 -2666 -1511 528 2031 2981
2908 2981 2693 1572 -344 -2273 -2967 -2778 -1311 739 2027 3076 2762 1690 -298 -2006 -2894 -2768
2924 -2768 -1517 -101 2332 2724 2857 1831 180 -2023 -2932 -2818 -1694 -82 1698 2865 3065 1860
2940A860j641j782j111k35J190J402J754J431L06r25j776j894j409m29J020J509
2956g30J975J480P6m65j686j908j359m88P72J592J771J851M10q92j797j833j085
2973b316r39N57J649K189J606M72q53j314j901j641o33M61J377K163J467P66o43
2990B467j167j709k241o79N74J380K070J613R87n58j292k031j779p63N9J403J931
3007B65J717J059j61j132k059j680j173j0J727J548J936Q96L39j521j749k063
3023b061j182M19Q29J949J737J161J57j055j926j924r04k65J231J174K226J338
3039B904Oo06k021j664j355l46N27J718K170J212N90r11j713j781j697O6P80J228
3057h93K173J569K16n76j672k076j688k5M41J589J953J455Q69r89j164k067j506
$$ plain form
2940 1860 219 -1563 -2674 -2909 -1719 -317 1437 2868 3174 2249 473 -1421 -2830 -3259 -2239 -730
2956 -730 1245 2725 2801 2336 650 -1258 -2617 -3105 -2333 -741 1030 2881 3291 2399 602 -1231 -2316
2973 -2316 -3255 -2698 -1049 1140 2746 3218 2365 1051 -850 -2491 -3124 -2663 -1286 877 2344 3110 2467
2990 2467 1300 -409 -2650 -3329 -2755 -1375 695 2308 3295 2737 1445 -586 -2365 -3128 -3069 -1666 265
3007 265 1982 3041 2880 1748 -311 -1991 -3164 -3174 -1447 101 2037 2933 3272 1751 2 -2061
3023 -2061 -3243 -2824 -1995 -46 1691 2852 3009 1954 28 -1896 -2800 -3065 -1834 -660 1566 2904
3039 2904 2910 2304 283 -1381 -2736 -3082 -2555 -837 1333 2545 3135 2224 511 -1270 -2967 -2901 -2121 -893
3057 -893 1280 2849 3065 2489 817 -1259 -2947 -2972 -2531 -942 1011 2466 3335 2346 1182 -885 -2391
3074b391q55P68J131K133J655Q01n05j536j782j896m05J13J561J887J260J191
3090C130n38j339j823j424j407N31J482J847J656J006k88j375j735j681j167J1
3106c114J224K053J545J287Nj267j840j832j197M66Q23J730J889J160j42p42k055
3123gj974p50r3Q76J738K074J097n0r40j752j529j226n35J014J630J905J440R7
3141C015o53j986j858j639kJ081J187J882J635L27n98j626j759j501q77R33J475
3158i64J971J498N68o57j393j915j373q67M91J416K085J325J064n25j519j902
3174f97j615q84M05J649J911J425Q25j4j578j835j912o13J97J286J907J478R39
3191B874O1j363j734j962p99L01J105J709J806R88o8j173j828j599j322K48R93
$$ plain form
3074 -2391 -3246 -2478 -1347 786 2441 3242 2737 1201 -581 -2477 -2882 -2769 -1208 679 1939 3130
3090 3130 2592 1253 -570 -1994 -3401 -2870 -1388 459 2115 3121 2833 1458 -277 -1958 -3125 -3114
3106 -3114 -1890 163 1708 2995 3000 1733 -107 -1939 -3136 -2670 -1847 -117 1772 2932 2790 2048 -7
3123 -7 -1981 -2731 -2824 -1948 -210 1864 2961 2911 1971 219 -1310 -2536 -3071 -2057 -427 1478 2918 3015
3141 3015 2362 376 -1482 -3121 -3123 -2042 -855 1027 2662 2989 2391 765 -994 -2495 -3372 -2439 -964
3158 -964 1007 2505 3073 2416 1023 -892 -2265 -3132 -2641 -1225 860 2185 3249 2724 1205 -697
3174 -697 -2312 -3196 -2791 -1142 769 2194 3019 3005 1427 -408 -2320 -2933 -2736 -1450 457 1935 2874
3191 2874 2935 1572 -162 -2124 -2923 -2622 -1517 192 1998 2986 2918 1745 -83 -1682 -3004 -2756 -1763
3208a763J880J827O90L12j113j873j734r79j69J017J632K173J018%q34j335k182
3225a433j471j14Q82J793J588J615L27j148j527j984j240m28J096J672J483J763
3241B874L31r23j336k065j304q33P18J807J884J400N15n44j517j689j965k62N10
3258b399J212J845J872L77l13j465k073j520o15K73J653J890J460J126m88j411
3274A424j854j825p59M55J259J772J774Q85l39j189j895j754p63m5J031J954J447
3291A578J498K50j599j911j453j114j82J182J591K012J051l52q71j325k023j476
3307c144J80Q31J883J789J261P3q22j628j821j414l83Q06K024J533J430K30o57
3324B171j768j715j427j11O29J445K268J004O27r90j403j673j678n55R09J218
$$ plain form
3208 -1763 117 1944 2634 2946 1833 -40 -1774 -2753 -2922 -1905 -273 1900 2918 2918 2084 749 -1433
3225 -1433 -2904 -3018 -2136 -343 1245 2860 3187 2039 512 -1472 -2712 -3140 -2044 -372 1111 2874
3241 2874 3205 2282 946 -1119 -2423 -3256 -2538 -731 1153 2553 3068 2524 1007 -682 -2647 -2909 -2399
3258 -2399 -1187 658 2530 2907 2594 1129 -944 -2464 -3079 -2806 -1153 737 2197 3323 2835 1424
3274 1424 -430 -2255 -3014 -2559 -1300 472 2246 3131 2792 1603 -292 -2046 -2809 -2854 -1823 131 1578
3291 1578 3076 3326 1727 -184 -1637 -2751 -2933 -1751 -160 1852 2903 2551 1680 355 -1668 -3144
3307 -3144 -2964 -2133 -250 1539 2800 2873 2051 423 -1398 -2812 -3195 -2389 -365 1168 2598 2828 2171
3324 2171 403 -1312 -2739 -2850 -2221 -776 1492 2496 3123 2133 730 -943 -2621 -3176 -2267 -1049
3340a049J895J772K32l11j563j775j402r03P32J452J890J303P83m99j486j697
3356f26j469j116M72J500J724J581J125o12j405j591j916l97m5J490J816J644
3372B175Q61l07j162j735j767j023N39O16J951J792J027k34r40j840j685j350
3388c082O6J291J926J311J268n1q19j883j659p53m20J016J688J580J187J21q08
3405A979j660j750j306k84J054J447J667J644J91n98k033j866q95p96J033J531
3421f42J886J361M79q69j621j490j551m95P91J236K068J146O33m67j305k240j531
3438b611n50P29J559J575J385P94n71j173j817j666o66N41R71K124J424P06k13
3455B541j369j530j704n95k3J426J643J544J014l99j133j717j595r09K20J455
$$ plain form
3340 -1049 846 2618 2850 2539 976 -799 -2201 -3104 -2372 -920 970 2273 3056 2557 1071 -626
3356 -626 -2095 -3211 -2739 -1239 485 2066 3191 2579 1174 -417 -2333 -2730 -2775 -1285 531 2175
3372 2175 3036 2729 1567 -168 -1935 -2958 -2419 -1803 148 1940 2967 2733 1793 -47 -1732 -3082
3388 -3082 -3016 -1725 201 1512 2780 2729 1910 27 -1632 -2385 -2805 -1789 -101 1479 2666 2787 1979
3405 1979 319 -1431 -2737 -3021 -1967 -520 1147 2791 2982 2384 351 -1515 -2410 -3206 -2173 -642
3421 -642 1244 2605 3084 2215 594 -896 -2447 -2942 -2151 -915 1153 2299 2932 2465 1160 -1080 -2611
3438 -2611 -3161 -2432 -873 702 2087 2881 2310 1137 -680 -2346 -3012 -2471 -1500 624 2048 2754 2541
3455 2541 1172 -358 -2062 -2657 -2680 -1254 389 1933 2947 2548 1415 -302 -1897 -2806 -2586 -1131
3471a131J550J386J100l12j130j446j667j193K36P11J964J690J042j2q50j747
3487A91j833j201K5J234J404J809J020m6n81j507j945j363M5P92J604J598J194
3504B440K53p34j215k188j001n07Q23J498K000J195M30q13j632j626j280o75R15
3521b117J504J643J400N38j006j069k001j283n36N56J668J459J491O62l83j589
3537I37j781j133r73O80J267J780J186Q19k77j403j808j439p25M73J060J739J476
3554A878Q91m61r45j712j499o34j90J226J552J845O95j84j021j542j665r78J28
3571b616R74J783J429J194K00j342j414j760p59o45J527J231J708Q68L60p38j940
3588F0j647r73k06Q08J460J700J167M32j364j303j667p65k11N89J112J875J348
$$ plain form
3471 -1131 419 1805 2905 2593 1463 17 -1650 -2843 -2607 -1896 68 1758 2800 2788 1938 191
3487 191 -1642 -2843 -2818 -1584 -180 1629 2649 2603 2022 515 -1430 -2793 -2748 -1956 -352 1246 2440
3504 2440 2693 1959 744 -1444 -2445 -2952 -2129 -631 1369 2564 2994 2181 549 -1077 -2357 -3032 -2117
3521 -2117 -613 1030 2430 2968 1962 893 -1108 -2391 -2927 -2371 -703 756 2247 2909 2526 937
3537 937 -844 -1977 -2950 -2270 -1003 777 1963 2782 2505 1102 -706 -2145 -2870 -2397 -1337 402 1878
3554 1878 2769 2308 1363 -349 -1848 -2482 -2672 -1446 106 1951 2646 2462 1441 -101 -1766 -2744 -2616
3571 -2616 -1642 141 1570 2764 2964 1622 208 -1552 -2311 -2956 -1429 -198 1510 2378 2738 2000 60
3588 60 -1587 -2560 -2766 -1958 -498 1202 2369 2801 1437 134 -1533 -2298 -2509 -1920 -808 1067 2415
3605B415L38o83j754j457j145n93R08J221J653J323M89n40j628j483j139m65K44
3622b296J738J429J615J09m66j188j498j411n50R1J278K064J191L81p7j513j471
3639e74j390n69K96J173J550J138R21j97j108j368j890m67Q7J061J464J662P82
3656B571k03j012j591j408r57K25O26J869J551O85L25j169j772j146j243J70P72
3673a707J634J360J098j44l98j757j542q20l79J029J178J858Q39K97q17j467j709
3690a447q53m36Q46J358J537J224L03l25j399j978r86l76M17J521J646P95P63
3707B610n74j557j335j275j43L98J235J450J095P62l07j249j683j388o88N77J002
3724a070J638J162L18K96j060j731j229r00L09J260J607J196O56j42j435r60j546
$$ plain form
3605 2415 2753 2070 316 -1141 -2286 -2879 -1971 -750 903 2226 2715 2175 547 -936 -2075 -2540 -2296
3622 -2296 -558 871 2486 2595 2129 941 -557 -1968 -2518 -2427 -1149 915 2106 2487 2410 897 -574
3639 -574 -1964 -2533 -2237 -1064 486 1624 2545 2348 1240 -128 -2018 -2485 -2398 -1337 127 1789 2571
3656 2571 2368 1356 -235 -1643 -2600 -2375 -1749 120 1671 2356 2681 1512 -260 -1406 -2649 -2479 -1707
3673 -1707 -73 1287 2385 2241 1843 86 -1456 -2276 -2655 -1626 -448 1410 2249 2546 1729 262 -1447
3690 -1447 -2300 -2736 -1890 -532 1005 2229 2532 2207 808 -1170 -2156 -2532 -2115 -594 1052 1847 2610
3707 2610 2036 479 -856 -2131 -2274 -1876 -641 809 1904 2666 2359 1110 -573 -1961 -2649 -2072 -1070
3724 -1070 568 1730 2048 2344 1284 -447 -1676 -2576 -2267 -1007 600 1796 2452 2310 875 -85 -1631
3741a631p28J65P96J529J447R44n00n20j726j313q27K68N77J611J638R43l48r10
3759A415j508j309r64o9Q58J440J217J064J46o80j309j715o58m8N33J102J404
3776I19J336J46r99j084j576r46rL96J497J328R33N06p56j226j244q64n55N36
3794a662J012J505Q83Q94o35j554j034j100o16K71J198J342J353M99m58j174j350
3811f26j297l82k3J672R03J566P78m40j031j759j236l69Q3J150J212J385N54J53
3829B293r28j705j193r45J82R35J623J422O59j19q95j554j198r51J36R29J172
3846a37J498J089k19p65j723j268o93O1N47J615J213R75J17q77j121j562q85p6
3864b211P10J384J356R23J81n82j473j265r85l07N44J422J392R54J62m41j420
$$ plain form
3741 -1631 -2359 -2194 -1398 131 1578 2522 2022 1502 -224 -1537 -2364 -2096 -1519 92 1730 2673 2325 1415
3759 1415 -93 -1402 -2366 -2435 -1577 -137 1080 2144 2290 1610 301 -1414 -2072 -2120 -1587 -485 919
3776 919 2255 2401 1402 318 -1258 -2204 -2213 -1817 -320 1008 1941 2447 1691 465 -779 -1643 -2198 -1662
3794 -1662 -650 855 1738 2632 1997 443 -591 -1691 -2307 -2036 -838 504 1857 2356 1898 724 -626
3811 -626 -1923 -2305 -2328 -656 247 1813 2591 2151 1120 -639 -1875 -2244 -2161 -1011 201 1586 2140 2293
3829 2293 1365 -340 -1533 -2478 -2296 -1361 262 1684 2343 2224 1329 -225 -1423 -2374 -2238 -1309 -137
3846 -137 1361 2450 2231 1466 -257 -1525 -2218 -2157 -1610 5 1218 2193 2310 1433 312 -1250 -2135 -2211
3864 -2211 -1501 -117 1239 2162 2343 1761 288 -977 -1962 -2269 -1725 -303 1089 2043 2205 1764 344
3881C44j370r70m49Q36J000J402R91P13n32j187j243j371q42R86R80J404J037
3898A729O02m67j062j341j517k20L85J071J350J058Q41k75j161j584j203p28M29
3915b093J060J403J437N06j75r51j532j412m65K14R18J279J192J098n57n91j536
3932b05j316o13N7Q88J251J045P06N50j132j234j459q09j4R24J094J448P33J99
3950B113n69j426j120j071k10Q28J523J363O70J29p20j027j421j177Q7N29R15
3967e84J759O87L44n53j308j387o41n00N43Q53J718J290m5m19j222j270q07o74
3985b216L63J121J552R55L70j60j133j415r92n16K21Q57J489J150O30j57j141
4002I78j357j282n44L87R35J229J232O87J8j055j275j503o98J22Q64J291J537
$$ plain form
3881 344 -1026 -1996 -2445 -1609 -609 793 1784 2497 1965 778 -465 -1836 -2678 -1692 -712 692 1729
3898 1729 2331 1864 802 -539 -2056 -2276 -1891 -820 530 1588 2429 2154 993 -591 -1794 -2522 -2093
3915 -2093 -1033 370 1807 2313 2138 1187 -345 -1757 -2222 -2008 -1090 189 1381 2479 1922 1331 -205
3932 -205 -1521 -2134 -2077 -1189 62 1107 1813 2363 1231 -3 -1462 -2271 -2285 -1361 -267 1181 1914 2113
3950 2113 1544 118 -1002 -2073 -2283 -1455 68 1431 2101 2230 1510 483 -938 -2115 -2028 -1499 -584
3967 -584 1175 1862 2206 1653 345 -1042 -1683 -2183 -1640 -787 931 2221 2176 1757 535 -735 -1542 -2216
3985 -2216 -1853 -732 820 1775 2145 1985 852 -563 -1555 -2071 -1850 -993 496 1646 2276 2119 978
4002 978 -379 -1661 -2205 -1818 -883 346 1578 2265 2283 1228 -47 -1550 -2248 -2126 -1262 29 1566
4019A566O35j94o87j565j179q13K67R14J100J460P03l17n56j403j318p40Q6Q06
4037a235J080J214Q08J37m88j126j464j209K86N17J218J683M96M23p93j383j072
4054i08j137j18N52J325J204R65L20o98q27j563j029m73Q80Q88J717R56m2k52
4072A760j207j051j261l21N21P91J510J135L26j44j180j304j358l99K63Q95J528
4089E04J011N48q2r96j416j173m76K99Q42J418J182L43j51r45j172j360o04K20
4107b008Q40J166J277P15k2o68j460j193q03J3R37J279J195O47J9l75j382j227
4125a050j005l21J016J489J063N86M43n58j536r61j175k11O73J063J736R59m2
4142B169o16j200j467n76m25O53J090J357P04L77l56j049j624r35l77N43J124
$$ plain form
4019 1566 2201 2007 1320 -245 -1424 -2237 -1970 -1056 44 1504 2207 1890 1334 -69 -1387 -2127 -2041 -1235
4037 -1235 -155 1059 1867 2004 1516 390 -1074 -2283 -1997 -1480 -262 1421 1917 2340 1547 164 -908
4054 -908 -2045 -2163 -1611 -286 918 1883 2203 1505 678 -885 -1914 -2387 -1507 -619 1098 2054 2012 1760
4072 1760 553 -498 -1759 -2080 -1559 -768 742 1877 2203 2059 879 -425 -1783 -2182 -1919 -1024 504
4089 504 1515 2063 1981 985 -431 -1604 -2080 -1781 -939 479 1661 2004 1853 908 -264 -1624 -2228 -2008
4107 -2008 -1168 -2 1275 1990 1968 1300 -160 -1353 -2156 -2143 -1206 73 1268 1915 1934 1559 177 -1050
4125 -1050 -2055 -2376 -1360 129 1192 1778 2221 1663 127 -834 -2009 -2220 -1547 -484 1252 2211 2169
4142 2169 1553 353 -1114 -1690 -2115 -1462 -372 985 1689 2066 1710 661 -963 -1898 -2275 -1732 -608
4159f08J378R82N24o94j096j186j074l44L36J183J021J394J30j73j274j015j213
4176a729m59K68J030J217J469L57m37p08j341r14n45j50Q19J432J068Q59k50p79
$$ plain form
4159 -608 770 1752 2276 1582 486 -700 -1774 -2118 -1782 -599 422 1816 1946 1773 499 -516 -1729
4176 -1729 -2188 -1920 -890 327 1796 2153 1716 1008 -333 -1247 -1792 -1942 -1123 309 1377 2236 1986 1207
$$ [...]
8191B15
##END NTUPLES=NMR FID
##END=
