##TITLE=1H_AM_NVMEtOH
 
 8 sc, 
 19.09.2022
##JCAMPDX= 6.0         $$ Bruker NMR JCAMP-DX V2.0
##DATA TYPE= NMR FID
##DATA CLASS= NTUPLES
##ORIGIN= UXNMR, Bruker Analytische Messtechnik GmbH
##OWNER= root
$$ XWIN-NMR		Version 3.5
$$ Mon Sep 19 15:31:21 2022 Russian Standard Time (UT+4h)  she@DPX200
##.OBSERVE FREQUENCY= 200.1313499994
##.OBSERVE NUCLEUS= ^1H
##.DELAY= (6, 6)
##.ACQUISITION MODE= SIMULTANEOUS
##.ACQUISITION SCHEME= undefined
##.AVERAGES= 8
##.DIGITISER RES= 18
##SPECTROMETER/DATA SYSTEM= spect
##.PULSE SEQUENCE= zg30
##.SOLVENT NAME= CD2Cl2
##.SHIFT REFERENCE= (INTERNAL, CD2Cl2, 0, 15.7039)
##AUDIT TRAIL= $$ (NUMBER, WHEN, WHO, WHERE, WHAT)
$$ ##TITLE= Audit trail, XWIN-NMR		Version 3.5
$$ ##JCAMPDX= 5.01
$$ ##ORIGIN= Bruker BioSpin GmbH
$$ ##OWNER= she
$$ F:/spectra/data/she/nmr/H-F/1/audita.txt
$$ ##AUDIT TRAIL=  $$ (NUMBER, WHEN, WHO, WHERE, WHAT)
(   1,<2022-09-19 15:02:34.29 +0400>,<she>,<DPX200>,
      <created by zg, POWCHK disabled, PULCHK disabled
       configuration hash MD5:
       00 E9 B6 7A A2 85 ED C7 34 08 36 98 17 FE 4E 26
       data hash MD5: 16K
       75 F7 0F F7 58 5F 40 1E 91 84 61 32 59 99 DC CF>)
$$ ##END=
$$ 
$$ hash MD5
$$ DB BE 7E 90 E2 84 BA 14 1C B0 69 80 88 F9 9C AA
##$RELAX= 
##$RELAX= 
##$RELAX= 
##$RELAX= 
##$RELAX= 
##$RELAX= 
$$ Bruker specific parameters
$$ --------------------------
##$DU= <F:/spectra>
##$EXPNO= 1
##$NAME= <H-F>
##$PROCNO= 1
##$TYPE= <nmr>
##$USER= <she>
##$AMP= (0..31)
100 100 100 100 100 100 100 100 100 100 100 100 100 100 100 100 100 100 
100 100 100 100 100 100 100 100 100 100 100 100 100 100 
##$AQSEQ= 0
##$AQ_mod= 1
##$AUNM= <au_zg>
##$AUTOPOS= <>
##$BF1= 200.13
##$BF2= 200.13
##$BF3= 200.13
##$BF4= 200.13
##$BF5= 200.13
##$BF6= 200.13
##$BF7= 200.13
##$BF8= 200.13
##$BYTORDA= 1
##$CFDGTYP= 0
##$CFRGTYP= 5
##$CHEMSTR= <none>
##$CNST= (0..31)
1 1 145 1 1 1 1 1 1 1 1 1 1 1 1 1 1 1 1 1 1 1 1 1 1 1 1 1 1 1 1 1 
##$CPDPRG= <>
##$CPDPRG1= <>
##$CPDPRG2= <>
##$CPDPRG3= <>
##$CPDPRG4= <mlev>
##$CPDPRG5= <mlev>
##$CPDPRG6= <mlev>
##$CPDPRG7= <mlev>
##$CPDPRG8= <mlev>
##$CPDPRGB= <>
##$CPDPRGT= <>
##$D= (0..31)
0 1.2 0 0 0 0 0 0 0 0.06 0 0.03 0 0 0 0 0.0002 0 0 0 0 0 0 0 0 0 0 0 0 
0 0 0 
##$DATE= 1663585353
##$DBL= (0..7)
120 120 120 120 120 120 120 120 
##$DBP= (0..7)
150 150 150 150 150 150 150 150 
##$DBP07= 0
##$DBPNAM0= <>
##$DBPNAM1= <>
##$DBPNAM2= <>
##$DBPNAM3= <>
##$DBPNAM4= <>
##$DBPNAM5= <>
##$DBPNAM6= <>
##$DBPNAM7= <>
##$DBPOAL= (0..7)
0.5 0.5 0.5 0.5 0.5 0.5 0.5 0.5 
##$DBPOFFS= (0..7)
0 0 0 0 0 0 0 0 
##$DE= 6
##$DECBNUC= <off>
##$DECIM= 32
##$DECNUC= <off>
##$DECSTAT= 4
##$DIGMOD= 1
##$DIGTYP= 9
##$DL= (0..7)
0 120 120 120 120 120 120 120 
##$DP= (0..7)
150 150 150 150 150 150 150 150 
##$DP07= 0
##$DPNAME0= <>
##$DPNAME1= <>
##$DPNAME2= <>
##$DPNAME3= <>
##$DPNAME4= <>
##$DPNAME5= <>
##$DPNAME6= <>
##$DPNAME7= <>
##$DPOAL= (0..7)
0.5 0.5 0.5 0.5 0.5 0.5 0.5 0.5 
##$DPOFFS= (0..7)
0 0 0 0 0 0 0 0 
##$DQDMODE= 0
##$DR= 18
##$DS= 0
##$DSLIST= <SSSSSSSSSSSSSSS>
$$ [...]
##$SUBNAM2= <"">
##$SUBNAM3= <"">
##$SUBNAM4= <"">
##$SUBNAM5= <"">
##$SUBNAM6= <"">
##$SUBNAM7= <"">
##$SUBNAM8= <"">
##$SUBNAM9= <"">
##$SW= 18.0517283424941
##$SWIBOX= (0..15)
0 0 2 0 0 0 0 0 0 0 0 0 0 0 0 0 
##$SW_h= 3612.71676300578
##$TD= 16384
##$TD0= 1
##$TE= 0
##$TE2= 300
##$TE3= 300
##$TEG= 300
##$TL= (0..7)
0 120 120 120 120 120 120 120 
##$TP= (0..7)
150 150 150 150 150 150 150 150 
##$TP07= 0
##$TPNAME0= <>
##$TPNAME1= <>
##$TPNAME2= <>
##$TPNAME3= <>
##$TPNAME4= <>
##$TPNAME5= <>
##$TPNAME6= <>
##$TPNAME7= <>
##$TPOAL= (0..7)
0.5 0.5 0.5 0.5 0.5 0.5 0.5 0.5 
##$TPOFFS= (0..7)
0 0 0 0 0 0 0 0 
##$TUNHIN= 0
##$TUNHOUT= 0
##$TUNXOUT= 0
##$USERA1= <user>
##$USERA2= <user>
##$USERA3= <user>
##$USERA4= <user>
##$USERA5= <user>
##$V9= 5
##$VALIST= <valist>
##$VCLIST= <CCCCCCCCCCCCCCC>
##$VD= 0
##$VDLIST= <DDDDDDDDDDDDDDD>
##$VPLIST= <PPPPPPPPPPPPPPP>
##$VTLIST= <TTTTTTTTTTTTTTT>
##$WBST= 1024
##$WBSW= 4
##$XGAIN= (0..3)
0 0 0 0 
##$XL= 0
##$YL= 0
##$YMAX_a= 356255
##$YMIN_a= -366290
##$ZGOPTNS= <>
##$ZL1= 120
##$ZL2= 120
##$ZL3= 120
##$ZL4= 120
##$ABSF1= 10
##$ABSF2= 0
##$ABSG= 5
##$ABSL= 3
##$ALPHA= 0
##$AQORDER= 0
##$ASSFAC= 0
##$ASSFACI= 0
##$ASSFACX= 0
##$ASSWID= 0
##$AUNMP= <proc_1d>
##$AZFE= 0.1
##$AZFW= 0.1
##$BCFW= 1
##$BC_mod= 2
##$BYTORDP= 1
##$COROFFS= 0
##$CY= 11.3945322036743
##$DATMOD= 1
##$DC= 2
##$DFILT= <>
##$DTYPP= 0
##$F1P= 2.36226072786647
##$F2P= -0.459571619588291
##$FCOR= 0.5
##$FTSIZE= 0
##$FT_mod= 4
##$GAMMA= 1
##$GB= 0.15
##$INTBC= 1
##$INTSCL= 1
##$ISEN= 128
##$LB= 0.24
##$LEV0= 0
##$LPBIN= 0
##$MAXI= 10000
##$MC2= 0
##$MEAN= 0
##$ME_mod= 0
##$MI= 1.114404
##$NCOEF= 0
##$NC_proc= 0
##$NLEV= 6
##$NOISF1= 3.799351
##$NOISF2= 2.8
##$NSP= 1
##$NTH_PI= 0
##$NZP= 0
##$OFFSET= 15.70392
##$PC= 1
##$PHC0= -18120.4
##$PHC1= 16.60069
##$PH_mod= 1
##$PKNL= yes
##$PPARMOD= 0
##$PSCAL= 0
##$PSIGN= 0
##$REVERSE= no
##$SF= 200.130013532006
##$SI= 16384
##$SIGF1= 3
##$SIGF2= 2
##$SINO= 400
##$SIOLD= 16384
##$SREGLST= <1H.CDCl3>
##$SSB= 0
##$STSI= 0
##$STSR= 0
##$SW_p= 3612.71676300578
##$SYMM= 0
##$S_DEV= 0
##$TDeff= 0
##$TDoff= 0
##$TI= <>
##$TILT= no
##$TM1= 0
##$TM2= 0
##$TOPLEV= 0
##$USERP1= <user>
##$USERP2= <user>
##$USERP3= <user>
##$USERP4= <user>
##$USERP5= <user>
##$WDW= 1
##$XDIM= 8192
##$YMAX_p= 0
##$YMIN_p= 0
$$ End of Bruker specific parameters
$$ ---------------------------------
##NTUPLES= NMR FID
##VAR_NAME=  TIME,          FID/REAL,        FID/IMAG
##SYMBOL=    X,             R,               I
##VAR_TYPE=  INDEPENDENT,   DEPENDENT,       DEPENDENT
##VAR_FORM=  AFFN,          ASDF,            ASDF
##VAR_DIM=   8192,          8192,            8192
##UNITS=     SECONDS,       ARBITRARY UNITS, ARBITRARY UNITS
##FACTOR=    0.0002768,     1,               1
##FIRST=     0,             0,               0
##LAST=      2.2672688,     0,               0
##MIN=       0,             -366290,         0
##MAX=       2.2672688,     356255,          0
$$ Real data points
##PAGE= N=1
##DATA TABLE= (X++(R..R)), XYDATA
$$ plain form
0 0 0 0 0 0 0 0 0 0 0 0 0 0 0 0 8 -8 8 -8 8 -8 13 -16 16 -24 24 -29 32 -40 41 -48 56 -64 72 -83 93 -102 116
37 116 -130 145 -160 177 -198 217 -241 266 -294 324 -356 391 -432 476 -524 577 -639 708 -786
56 -786 876 -982 1105 -1254 1435 -1666 1967 -2374 2959 -3863 5428 -8653 17902 -98108 -366290
71 -366290 -3437 282927 21159 -192992 65124 185801 -146345 -273033 137094 344427
81 344427 -42647 -320718 -25409 222132 -4399 -160518 98199 197850 -145006 -287943
91 -287943 93808 322255 -1377 -260788 -26874 170156 -37006 -150575 118727 218375
101 218375 -123793 -292494 47887 285731 23125 -204994 -9871 139897 -69530 -160942
111 -160942 123408 239586 -90570 -283274 9166 240770 28928 -159124 17422 128347
$$ packed form
0@%%%%%%%%%%%%%%Qj6J6j6J6j6K1k9L2m0M8n3O1p2Q1q9J04j20J36j55J76j95K18
37A16k46K75l05L37l75M15m58N07n60O18o80P47q23R08j000J101j216J347j494
56g86J662j858K087k359K689l101L633m341N333o822R291j4081K6555j16010k68182
71c66290L62853K86364k61768k14151K58116J20677l32146j26688M10127K07333
81C44427l87074k78071K95309K47541k26531j56119K58717R9651l42856j42937
91b87943L81751K28447l23632k59411K33914J97030k07162j13569K69302R9648
101B18375l42168j68701L40381K37844k62606k28119J95123J49768k09427r1412
111a60942K84350J16178l30156j92704K92440K31604k11842j88052J76546J10925
$$ plain form
121 128347 -93152 -179008 111350 249145 -51892 -256204 -17471 190297 19206 -124047
131 -124047 46220 128708 -102844 -194321 86160 242291 -15751 -215828 -28810 143163
141 143163 -1486 -104272 70138 139348 -98396 -204813 54516 223747 11045 -173508
151 -173508 -24559 109981 -27688 -103104 85044 157631 -82369 -209145 23526 197992
161 197992 24484 -136324 -8015 93070 -52712 -114964 88067 174439 -58220 -201990
171 -201990 -2277 165337 25097 -105116 14358 87717 -69978 -129903 78263 180913
181 180913 -30215 -180899 -19451 128634 15218 -81795 36691 91057 -76325 -142904
191 -142904 58694 176128 -4167 -151625 -25489 96341 -2332 -71580 54900 103361
$$ packed form
121A28347k21499q5856K90358J37795l01037k04312K38733K07768j71091j43253
131a24047J70267Q2488k31552r1477K80481J56131k58042k00077J87018J71973
141A43163j44649j02786J74410O9210k37744j06417K59329J69231k12702j84553
151a73508J48949J34540j37669p5416J88148P2587k40000j26776K32671J74466
161A97992j73508j60808J28309J01085j45782o2252K03031Q6372k32659j43770
171b01990J99713J67614j40240j30213J19474P3359j57695n9925K08166J02650
181A80913k11128j50684J61448J48085j13416r7013J18486N4366j67382o6579
191a42904K01598J17434j80295j47458J26136J21830r8673o9248J26480M8461
$$ plain form
201 103361 -72079 -153487 34730 163848 14342 -122331 -19759 75632 -23680 -75702 65894
212 65894 120826 -59039 -158486 11404 145354 22712 -96186 -5233 66095 -43156 -87869
223 -87869 66998 134953 -39522 -152681 -7834 120160 21476 -73565 13111 64339 -55928
234 -55928 -101014 58080 139982 -17420 -135796 -19848 92358 11996 -57879 31242 69928
245 69928 -60259 -113000 42272 136941 1987 -113916 -22265 69684 -3849 -53665 46215
256 46215 82924 -56663 -123180 23768 128282 14783 -92398 -15341 56135 -22164 -60036
267 -60036 54860 98695 -45790 -127420 5625 113275 19891 -72121 -2240 50079 -37945
278 -37945 -71041 54751 109866 -29205 -121467 -9531 92015 17748 -54269 13180 49958
$$ packed form
201A03361j75440q1408J88217J29118j49506j36673J02572R5391r9312n2022J41596
212F5894N4932j79865r9447J69890J33950j22642j18898R0953P1328j09251m4713
223h7869J54867O7955j74475j13159J44847J27994r8684r5041Q6676N1228j20267
234e5928m5086J59094Q1902j57402j18376J15948J12206q0362o9875Q9121L8686
245F9928j30187n2741J55272R4669j34954j15903R1651R1949p3533m9816R9880
256D6215L6709j39587o6517J46948J04514j13499j07181P7057P1476p8299l7872
267f0036J14896M3835j44485q1630J33045J07650r3384r2012O9881N2319q8024
278c7945l3096J25792N5115j39071r2262J11936J01546p4267p2017O7449L6778
$$ plain form
289 49958 -47468 -82482 45976 113530 -10463 -106952 -18735 69681 8904 -43401 28047 56905
301 56905 -49812 -93772 31641 111264 5487 -89365 -19518 52796 -5114 -42826 39896
312 39896 69999 -45320 -102852 15493 103756 15400 -71806 -12488 43170 -20494 -49854 45762
324 45762 83385 -34708 -104967 172 89760 18667 -54660 -810 38950 -32859 -59288 43871
336 43871 91436 -19763 -97934 -11983 70858 15617 -40302 12407 40025 -39783 -69111 35385
348 35385 93541 -4349 -85027 -18034 52935 6664 -33278 25089 47683 -41053 -79045 23277
360 23277 91350 7737 -70638 -16737 40452 -6204 -34869 34771 59721 -36583 -86274 9865
372 9865 84236 14815 -55924 -9592 33347 -19196 -41574 38621 70497 -26630 -86556 -2998
$$ packed form
289D9958r7426l5014J28458O7554j23993r6489Q8217Q8416o0777n2305P1448K8858
301E6905j06717m3960J25413P9623j05777r4852O9847P2314n7910l7712Q2722
312C9896L0103j15319n7532J18345Q8263q8356q7206N9318N5658o3664k9360R5616
324D5762L7623j18093p0259J05139Q9588p1093p3327N3850L9760p1809k6429J03159
336D3871M7565j11199p8171Q5951Q2841n5241n5919N2709K7618p9808k9328J04496
348C5385N8156r7890q0678O6993P0969m6271l9942N8367K2594q8736l7992J02322
360B3277O8073q3613p8375N3901N7189m6656k8665O9640K4950r6304m9691R6139
372I865P4371o9421p0739M6332M2939n2543k2378Q0195L1876r7127n9926Q3558
$$ plain form
384 -2998 71146 16689 -41375 658 30425 -28870 -49814 35607 76456 -13301 -79468 -12758
396 -12758 54925 13159 -30324 12017 32909 -33902 -58955 27535 78213 -364 -68618 -16706
408 -16706 40970 4508 -26533 22845 41357 -34206 -68152 16938 76391 9113 -56806 -14244
420 -14244 31789 -7091 -29543 30603 52289 -29602 -73768 5538 69492 14188 -44200 -7315
432 -7315 26392 -18025 -35710 32882 60856 -20395 -72684 -5186 57374 14901 -31937 1896
444 1896 24690 -25770 -43107 29450 65540 -8781 -66031 -12732 43781 10836 -23795 12011
456 12011 28389 -29656 -51844 22131 67227 1862 -57007 -14923 32940 2370 -22337 21389
468 21389 37062 -29393 -60149 12719 65339 9428 -46853 -11900 25740 -7932 -25861 27353
$$ packed form
384b998P4144n4457n8064M2033K9767n9295k0944Q5421M0849q9757o6167O6710
396a2758O7683m1766m3483M2341K0892o6811k5053Q6490N0678p8577o8254N1912
408a6706N7676l6462l1041M9378J8512p5563l3946Q5090N9453o7278o5919M2562
420a4244M6033l8880k2452O0146K1686q1891m4166P9306O3954n5304n8388L6885
432g315L3707m4417j7685O8592K7974q1251n2289O7498O2560m2473m6838L3833
444A896K2794n0460j7337P2557L6090p4321n7250N3299N6513l2945l4631L5806
456A2011J6378n8045k2188P3975M5096o5365n8869M2084M7863l0570k4707M3726
468B1389J5673o6455l0756P2868N2620n5911n6281L4953L7640l3672j7929N3214
$$ plain form
480 27353 46638 -24346 -64136 2380 58202 13501 -35440 -5524 21377 -16919 -31424 28104
492 28104 53485 -15280 -61956 -6972 46868 13533 -25023 2728 20822 -23006 -38387 24203
504 24203 57291 -4967 -55741 -12738 35439 8955 -19320 11838 25495 -25907 -46618 17426
516 17426 58594 3770 -47868 -13474 26799 752 -19327 19846 33743 -24977 -53459 8985
528 8985 56003 9767 -38518 -10033 20789 -8294 -22689 24205 41569 -19635 -55539 -199
540 -199 48439 12777 -28075 -4095 17210 -15639 -27611 23826 46841 -11066 -52576 -8092
552 -8092 38039 12018 -19529 3411 17721 -20504 -34268 19747 49969 -2159 -46925 -12241
564 -12241 28591 7039 -15849 11609 23004 -22608 -41780 13559 50726 4979 -39861 -11843
$$ packed form
480B7353J9285p0984l9790O6516N5822m4701m8941K9916K6901l8296j4505N9528
492B8104K5381o8765m6676N4984N3840l3335l8556K7751J8094m3828j5381O2590
504B4203L3088o2258n0774M3003M8177k6484k8275L1158J3657n1402k0711O4044
516A7426M1168n4824n1638L4394M0273k6047k0079L9173J3897n8720k8482O2444
528H985M7018m6236m8285K8485L0822k9083j4395M6894J7364o1204l5904N5340
540a99M8638l5662m0852K3980K1305l2849j1972N1437K3015n7907m1510M4484
552h092M6131k6021l1547K2940J4310l8225j3764N4015L0222n2128m4766L4684
564a2241M0832k1552k2888K7458J1395m5612j9172N5339L7167m5747m4840K8018
$$ plain form
576 -11843 21586 -664 -16650 18257 30438 -20997 -46999 5921 47408 9758 -31093 -8307
588 -8307 16445 -8361 -19691 21177 36665 -15521 -47603 -2153 39829 11852 -21882 -2791
600 -2791 13803 -14408 -24277 20144 40898 -7850 -44512 -8446 30834 10295 -15325 4186
612 4186 15382 -18490 -30691 16407 43667 -501 -39625 -11030 23249 5067 -13228 11522
624 11522 20854 -19970 -37346 10830 43937 5331 -33188 -10067 17403 -1875 -14365 16829
636 16829 27288 -17802 -41184 3735 40054 9375 -25054 -6769 12989 -8291 -17195 18514
648 18514 32400 -12197 -40959 -3536 32864 10857 -17151 -1732 11395 -13259 -21798 16978
660 16978 36193 -5222 -38083 -8568 25290 8743 -12366 4773 13932 -16583 -28034 13417
$$ packed form
576a1843L3429k2250j5986L4907J2181n1435k6002N2920M1487l7650m0851K2786
588h307K4752k4806j1330M0868J5488n2186l2082M5450M1982k7977l3734J9091
600b791J6594k8211r869M4421K0754m8748l6662L6066L9280k0539k5620J9511
612D186J1196l3872j2201M7098K7260m4168l9124K8595L4279j8182j8295K4750
624A1522R332m0824j7376M8176L3107l8606l8519K3121K7470j9278j2490L1194
636A6829J0459m5090k3382M4919L6319l0679l4429J8285J9758k1280q904L5709
648A8514J3886m4597k8762L7423L6400k2007k8008J5419J3127k4654q539L8776
660A6978J9215m1415l2861K9515L3858j6547k1109J7139R159l0515j1451M1451
$$ plain form
672 13417 38642 1010 -33713 -10100 19076 3556 -11342 11154 19264 -17347 -33657 8150
684 8150 38134 5894 -27577 -8804 13956 -2573 -12523 15183 24599 -14658 -36102 1594 33756
697 33756 9206 -20033 -5672 10253 -7924 -15190 15950 28786 -9242 -35287 -4620 27142
709 27142 9904 -13485 -832 9661 -12153 -19773 14300 32132 -3219 -32629 -8328 20804
721 20804 7236 -10118 5211 12723 -14887 -25560 10895 33970 2031 -28504 -9089 15457
733 15457 2273 -9657 10548 17530 -14870 -29951 5779 32614 6303 -22448 -7707 10853
745 10853 -2926 -10745 13362 21891 -11642 -31242 -293 27979 8982 -15581 -4686 7958
757 7958 -7402 -13391 13508 25425 -6626 -30114 -5336 22111 8838 -10429 40 8276 -11102
$$ packed form
672A3417K5225l7632l4723K3613K9176j5520j4898K2496Q110l6611j6310M1807
684H150K9984l2240l3471J8773K2760j6529r950K7706R416l9257k1444L7696L2162
697C3756k4550k9239J4361J5925j8177p266L1140J2836l8028k6045L0667L1762
709B7142j7238k3389J2653J0493k1814p620L4073J7832l5351k9410K4301K9132
721B0804j3568j7354J5329P512k7610j0673L6455K3075l1939l0535J9415K4546
733A5457j3184j1930K0205O982l2400j5081L5730K6835k6311k8751J4741J8560
745A0853j3779p819K4107Q529l3533j9600L0949K8272j8997k4563J0895J2644
757G958j5360n989K6899J1917l2051k3488K4778K7447j3273j9267J0469Q236j9378
$$ plain form
770 -11102 -17927 11904 28321 -1668 -27668 -7804 16834 5684 -8191 5576 11512 -13296
782 -13296 -22919 8810 29416 2592 -23645 -7892 12178 1129 -7955 9933 15546 -12709 -26078
795 -26078 4099 27420 6170 -17889 -6467 8180 -3248 -8986 11853 19102 -9435 -26683
807 -26683 -1255 22969 8140 -12037 -3526 6166 -7153 -11782 11731 22311 -5040 -25686 -5231
820 -5231 18087 7355 -8203 1032 7250 -10413 -16267 10235 24931 -868 -23488 -6887 13688
833 13688 4190 -6696 5902 10461 -11921 -20528 7132 25446 2950 -19529 -6828 9532 253
846 253 -6615 9222 13902 -10717 -22807 2565 23073 6082 -14232 -5466 6184 -3453 -7799
859 -7799 10455 17012 -7531 -23103 -1996 19107 7327 -9489 -2473 5106 -6969 -10801 10329
$$ packed form
770a1102o825K9831J6417k9989k6000J9864K4638j1150j3875J3767N936k4808
782a3296r623L1729K0606k6824k6237J5753K0070j1049r084J7888N613k8255j3369
795b6078L0177K3321k1250k4059J1422J4647j1428n738K0839P249k8537j7248
807b6683K5428K4224j4829k0177Q511R692j3319m629K3513J0580k7351k0646K0455
820e231K3318j0732j5558R235O218j7663n854K6502J4696k5799k2620J6601K0575
833A3688r498j0886J2598M559k2382q607K7660J8314k2496k2479J2701J6360r279
846B53o868J5837M680k4619j2090K5372K0508j6991k0314Q766J1650r637m346
859g799J8254O557k4543j5572K1107K1103j1780j6816P016P579j2075l832K1130
$$ plain form
872 10329 20037 -3879 -22291 -4909 15109 5973 -6698 1916 6680 -9824 -14983 8959 22231
885 22231 -381 -20177 -5972 11298 2929 -5624 6074 9564 -10745 -18458 5851 22117 3082
898 3082 -16272 -5892 7504 -401 -5609 8513 12477 -9124 -20089 1461 19614 5816 -11504
911 -11504 -4577 4825 -3593 -7033 9316 15411 -6051 -20312 -2455 16143 6497 -7664 -1511
924 -1511 4548 -6783 -10209 9084 18277 -2836 -19528 -4649 12719 4854 -5603 2542 6339
937 6339 -9114 -13983 7565 19870 304 -17280 -5435 9203 2069 -4736 5889 8827 -9368
950 -9368 -16637 4374 19147 3429 -13419 -5283 5829 -776 -4818 7691 11322 -7555 -17733
963 -17733 487 16671 5544 -9257 -3733 3884 -3715 -6457 8373 14034 -4960 -17892 -2521
$$ packed form
872A0329R708k3916j8412J7382K0018r136j2671Q614M764j6504n159K3942J3272
885B2231k2612j9796J4205J7270q369q553J1698L490k0309p713K4309J6266j9035
898C082j9354J0380J3396p905n208J4122L964k1601j0965K1550J8153j3798j7320
911a1504O927R402q418l440J6349O095k1462j4261J7857J8598r646j4161O153
924a511O059j1331l426J9293R193k1113j6692J4879J7368p865j0457Q145L797
937F339j5453m869K1548J2305j9566j7584J1845J4638p134o805J0625K938j8195
950i368p269K1011J4773j5718j6848Q136J1112o605m042J2509L631j8877j0178
963a7733J8220J6184j1127j4801N524P617p599k742J4830N661j8994j2932J5371
$$ plain form
976 -2521 13720 5527 -6290 -577 4104 -6699 -9589 8164 16544 -2273 -17072 -4136 10676
989 10676 3718 -4679 3039 5841 -8475 -12801 6457 17530 683 -14663 -4832 7375 1369
1002 1369 -3899 5638 7977 -8143 -14786 3228 16456 3587 -10949 -4626 4474 -1065 -4173 6975
1016 6975 10299 -6265 -15665 -197 14191 5124 -7490 -2887 3215 -3867 -6100 7577 12892 -4069
1030 -4069 -15841 -2517 11678 4599 -5211 207 3831 -6520 -9071 7265 14975 -1709 -14882
1043 -14882 -3739 8906 2859 -3898 3289 5408 -7711 -11657 5379 15445 1095 -12365 -4360
1056 -4360 5899 900 -3240 5262 7269 -6993 -13210 2272 14232 3609 -9045 -4025 3544
1069 3544 -1342 -3818 6361 9493 -5281 -14047 -600 12275 4576 -6243 -2086 2857 -4023 -5912
$$ packed form
976b521J6241q193j1817N713M681j0803k890J7753Q380j8817j4799J2936J4812
989A0676o958q397P718K802j4316m326J9258J1073j6847j5346R831J2207o006
1002A369n268R537K339j6120o643J8014J3228j2869j4536O323R100n539l108J1148
1016F975L324j6564r400J5468J4388r067j2614M603O102p082k233J3677N315j6961
1030d069j1772J3324J4195p079r810N418L624j0351k551J6336P710j6684j3173
1043a4882J1143J2645o047o757P187K119j3119l946J7036J0066j4350j3460Q005
1056d360J0259m999m140Q502K007j4262o217J5482J1960j0623j2654N020P569
1069C544m886k476J0179L132j4774q766J3447J2875p699j0819M157M943o880j889
$$ plain form
1083 -5912 6899 11980 -3361 -14160 -2445 10058 3829 -4412 821 3680 -6202 -8642 6308
1096 6308 13651 -1012 -12975 -3582 7410 2334 -3240 3286 5090 -6759 -10740 4148 13668 1706
1110 1706 -10412 -4168 4660 619 -2809 4776 6803 -5823 -11997 1286 12399 3696 -7521 -3539
1124 -3539 2895 -1581 -3713 5789 8983 -4409 -12744 -920 10721 4072 -5288 -1358 2679 -4116
1138 -4116 -5814 6310 11182 -2797 -12688 -2291 8679 3135 -3772 1263 3486 -5877 -8086 5515
1152 5515 12320 -591 -11283 -3323 6147 1850 -2692 3203 4680 -6017 -9752 3294 12036 1900
1166 1900 -8825 -3769 3777 294 -2484 4483 6333 -5084 -10886 837 10907 3421 -6363 -2800
1180 -2800 2494 -1921 -3618 5506 8508 -3880 -11564 -918 9417 3398 -4529 -627 2542 -4240
$$ packed form
1083e912J2811N081j5341j0799J1715J2503o229q241N233K859r882k440J4950
1096F308P343j4663j1963R393J0992n076n574O526J804j1849l981J4888R520j1962
1110A706j2118O244Q828m041l428P585K027j2626o174J3283J1113q703j1217L982
1124c539O434m476k132R502L194j3392q335J1824J1641o649r360L930M037o795
1138d116j698J2124M872j3979r891J0397J0970n544o907N035K223r363k209J3601
1152E515O805j2911j0692P960R470m297m542N895J477j0697l735J3046Q742j0136
1166A900j0725N056P546l483k778O967J850j1417n802J1723J0070p486r784L563
1180b800N294m415j697R124L002j2388p684J0646J0335o019p927L902L169o782
$$ plain form
1194 -4240 -5650 5787 10387 -2304 -11299 -2175 7399 2543 -3162 1571 3292 -5448 -7598 4651
1208 4651 11073 -52 -9722 -3185 4997 1481 -2235 3085 4380 -5258 -8947 2498 10642 2102
1222 2102 -7470 -3340 3076 -81 -2322 4287 6061 -4482 -9987 538 9660 3033 -5468 -2073
1236 -2073 2250 -2332 -3611 5284 8063 -3539 -10554 -819 8288 2745 -3942 -17 2401 -4302 -5435
1251 -5435 5327 9555 -1954 -10048 -2009 6336 2072 -2650 1750 3068 -5016 -7013 3958 9976
1265 9976 298 -8431 -2982 4167 1184 -1916 2975 4172 -4652 -8279 1948 9539 2119 -6456 -2904
1280 -2904 2624 -435 -2315 4125 5870 -3998 -9286 291 8643 2691 -4787 -1510 2110 -2570 -3686
1295 -3686 4936 7700 -3029 -9659 -938 7281 2411 -3382 294 2312 -4065 -5271 4587 8843 -1260
$$ packed form
1194d240j410J1437M600j2691q995R124R574m856n705M733J721q740k150J2249
1208D651O422j1125r670O537Q182l516l716N320J295r638l689J1445Q144q540
1222B102r572M130O416l157k241O609J774j0543n505J0525R122o627q501L395
1236b073M323m582j279Q895K779j1602p015R735R107n543o687L925K418o703j133
1251e435J0762M228j1509q094Q039Q345m264m722M400J318q084j997J0971O018
1265I976r678q729N449P149k983l100M891J197q824l627J0227P591p420q575L552
1280b904N528l059j880O440J745r868n288R577Q352n952p478L277L620m680j116
1295c686Q622K764j0729o630Q721Q219m870n793L676K018o377j206R858M256j0103
$$ plain form
1310 -1260 -8903 -2163 5350 1928 -2205 1665 2933 -4352 -6583 3056 9010 835 -7293 -2958 3466
1325 3466 1013 -1747 2755 4055 -4008 -7739 1332 8546 2165 -5606 -2526 2270 -734 -2347 3910
1340 3910 5708 -3506 -8615 52 7688 2416 -4137 -1057 1953 -2638 -3629 4492 7275 -2445 -8687
1355 -8687 -1125 6292 2206 -2818 432 2151 -3669 -4969 3794 8041 -609 -7753 -2339 4426 1808
1370 1808 -1791 1505 2756 -3734 -6142 2256 8039 1212 -6250 -2853 2815 765 -1600 2613 3924
1385 3924 -3471 -7189 882 7608 2109 -4790 -2074 1965 -1004 -2337 3715 5492 -3004 -7853 -165
1400 -165 6753 2187 -3469 -683 1770 -2609 -3488 3979 6723 -1846 -7681 -1329 5298 2026 -2247
1415 -2247 489 1924 -3260 -4619 3053 7207 -83 -6677 -2393 3609 1629 -1441 1439 2578 -3259
$$ packed form
1310a260p643O740P513l422m133L870J268p285k231R639N954q175q128M335O424
1325C466k453k760M502J300q063l731R071P214o381p771L080M796l004j613O257
1340C910J798r214n109Q667P636n272o553L080L010m591r91Q121K783r720o242
1355h687P562P417m086n024L250J719n820j300Q763M247q650p144N414O765k618
1370A808l599L296J251o490k408Q398N783o827p462L397N668k050k365M213J311
1385C924p395l718Q071O726n499o899K716M039k969j333O052J777q496m849P688
1400a65O918m566n656K786K453m379q79P467K744q569n835O352O627l272m273
1415b247K736J435n184j359P672M154p290o594M284O002j980l070K880J139n837
$$ plain form
1430 -3259 -5659 1729 7155 1371 -5348 -2529 2327 441 -1469 2601 3799 -3120 -6608 693 6763
1445 6763 1896 -4087 -1594 1688 -1286 -2269 3536 5177 -2625 -7089 -295 5845 1934 -2884 -429
1460 -429 1531 -2514 -3312 3435 6103 -1328 -6747 -1520 4400 1906 -1772 463 1719 -2847 -4265
1475 -4265 2418 6451 348 -5743 -2378 2949 1436 -1196 1419 2495 -2844 -5252 1322 6414 1423
1490 1423 -4593 -2197 1937 112 -1442 2559 3682 -2786 -6107 438 5963 1738 -3490 -1261 1446
1505 1446 -1411 -2235 3195 4841 -2135 -6384 -576 4994 1866 -2330 -346 1326 -2235 -3102 2806
1520 2806 5577 -702 -5849 -1752 3663 1894 -1371 404 1612 -2405 -3984 1814 5819 732 -4953
1535 -4953 -2323 2407 1238 -1049 1391 2422 -2502 -4931 933 5734 1443 -3956 -1917 1613 -163
$$ packed form
1430c259k400P388N426n784o719K819M856j886j910M070J198o919l488P301O070
1445F763m867n983K493L282k974r83N805J641p802m464O794O140l911m818K455
1460d29J960m045p98O747K668p431n419N227N920k494l678K235J256m566j418
1475d265O683M033o103o091L365N327j513k632K615J076n339k408O574N092m991
1490A423o016K396M134j825j554M001J123o468l321O545N525m225n228K229K707
1505A446k857q24N430J646o976m249N808N570l128m196J984J672l561q67N908
1520B806K771o279n147M097N415j769l265J775J208m017j579N798M005n087n685
1535d953K630M730j169k287K440J031m924k429N864M801m291n399K039L530j776
$$ plain form
1550 -163 -1431 2434 3553 -2396 -5607 161 5240 1683 -2920 -1044 1238 -1376 -2134 2768 4514
1565 4514 -1546 -5651 -898 4243 1887 -1837 -337 1174 -1889 -2912 2210 5055 -170 -5100 -1920
1580 -1920 3019 1805 -1092 380 1536 -2082 -3787 1363 5249 915 -4298 -2156 2000 933 -995
1595 -995 1429 2399 -2268 -4627 721 5145 1350 -3423 -1584 1381 -392 -1399 2341 3426 -2071
1610 -2071 -5117 -32 4592 1601 -2412 -860 1072 -1300 -2029 2388 4187 -1093 -5033 -1128 3622
1625 3622 1873 -1482 -320 1057 -1653 -2781 1742 4612 151 -4505 -1938 2517 1604 -942 460
1640 460 1521 -1893 -3625 1094 4794 955 -3794 -1901 1703 601 -965 1529 2397 -2077 -4348
1655 -4348 571 4630 1289 -2950 -1289 1202 -549 -1382 2168 3280 -1707 -4684 -281 4031 1594
$$ packed form
1550a63j268L865J119n949l211N768N079l557m603J876K282k614p58M902J746
1565D514o060m105M753N141k356l724J500J511l063j023N122K845n225m930L180
1580a920M939j214k897J472J156l618j705N150L886m334n213K142M156j067j928
1595i95K424R70m667k359N348M424l795m773J839K965j773j007L740J085n497
1610b071l046N085M624k991m013J552J932k372p29M417J799n280l940L905M750
1625C622j749l355J162J377k710j128M523K870m461m656K567M455r13k546J402
1640D60J061l414j732M719L700l839m749J893L604j102j566K494Q68m474k271
1655d348M919M059l341m239J661K491j751q33L550J112m987k977M403M312k437
$$ plain form
1670 1594 -2007 -787 928 -1182 -1968 1957 3906 -651 -4512 -1337 3068 1807 -1212 -302 1000
1685 1000 -1450 -2674 1376 4248 399 -3987 -1881 2140 1363 -824 582 1541 -1743 -3448 915
1700 915 4386 946 -3313 -1636 1467 326 -946 1539 2352 -1874 -4049 366 4139 1248 -2507
1715 -2507 -1137 991 -577 -1344 1876 3081 -1293 -4228 -585 3459 1638 -1630 -780 768 -970
1730 -970 -1873 1530 3598 -225 -3994 -1494 2588 1741 -968 -242 971 -1253 -2557 1050 3920 585
1746 585 -3487 -1762 1802 1126 -742 674 1546 -1605 -3256 698 3965 956 -2866 -1429 1203 139
1762 139 -906 1454 2253 -1578 -3744 82 3620 1315 -2073 -1068 811 -506 -1256 1561 2861 -839
1778 -839 -3779 -864 2952 1701 -1295 -762 696 -795 -1781 1174 3318 95 -3523 -1556 2174 1585
$$ packed form
1670A594l601J220J715k110p86L925J949m557l861L175M405j261l019R10J302
1685A000k450j224M050K872l849m386K106M021p77k187J406R59l284j705M363
1700I15L471l440m259J677L103j141j272K485Q13m226k175M415L773k891l755
1715b507J370K128j568p67L220J205m374k935L643M044j821l268Q50J548j738
1730i70r03L403K068l823l769K500M082q47k709P26J213k224j304L607K870l335
1746E85m072J725L564o76j868J416Q72l151j651L954L267l009l822J437K632j064
1762A39j045K360P99l831k166L826L538k305l388J005J879j317p50K817J300l700
1778h39k940K915L816j251k996N33J458j491r86K955K144l223l618J967L730n89
$$ plain form
1794 1585 -799 -145 955 -1162 -2459 864 3571 643 -3059 -1584 1503 834 -691 774 1528 -1498
1810 -1498 -3067 536 3551 931 -2459 -1255 992 13 -864 1341 2168 -1265 -3399 -168 3177 1378
1826 1378 -1698 -1006 679 -410 -1209 1260 2698 -462 -3391 -1050 2516 1672 -1050 -699 639 -699
1842 -699 -1745 923 3082 262 -3137 -1513 1841 1347 -697 25 973 -1141 -2375 727 3277 627
1858 627 -2699 -1373 1272 591 -637 851 1511 -1356 -2879 375 3200 961 -2077 -1121 826 -28
1874 -28 -821 1179 2062 -947 -3105 -401 2769 1410 -1406 -986 572 -341 -1191 975 2520 -203 -3049
1891 -3049 -1174 2154 1564 -878 -594 613 -682 -1712 770 2857 350 -2781 -1383 1568 1124 -596
1907 -596 198 988 -1096 -2248 641 2994 649 -2325 -1200 1057 420 -575 858 1464 -1149 -2651
$$ packed form
1794A585k384O54J100k117j297L323K707k928l702J475L087o69j525J465P54l026
1810a498j569L603L015k620l390J204K247r79q77K205Q27l433k134L231L345j799
1826A378l076O92J685j089p99K469J438l160k929K341L566q44k722L51J338j338
1842f99j046K668K159k820l399J624L354m94k044P22R48k114j234L102K550k650
1858F27l326J326K645o81j228J488O60k867j523L254K825k239l038R56J947q54
1874b8p93K000Q83l009k158K704L170j359k816M20J558r13q50K166J545k723k846
1891c049J875L328n90k442K84J207j295j030K482K087k507l131J398K951m44j720
1907e96P94P90k084j152K889K353k345k974J125K257o37r95J433O06k613j502
$$ plain form
1923 -2651 154 2807 1029 -1737 -1085 641 -12 -768 940 1926 -621 -2788 -652 2352 1441 -1130
1939 -1130 -959 453 -247 -1135 744 2322 56 -2687 -1215 1811 1430 -670 -434 593 -657 -1611
1955 -1611 658 2597 408 -2395 -1238 1269 891 -469 315 925 -1025 -2079 479 2621 665 -1924
1971 -1924 -1096 786 310 -495 750 1342 -892 -2376 -99 2378 1101 -1372 -1057 459 32 -698 714
1988 714 1744 -318 -2441 -806 1956 1434 -843 -855 364 -220 -1047 609 2096 175 -2312 -1140
2004 -1140 1466 1218 -504 -252 524 -676 -1489 566 2298 405 -2016 -1084 983 668 -355 396 831
2021 831 -938 -1880 322 2259 684 -1587 -1011 578 255 -404 640 1223 -651 -2097 -288 2027
2037 2027 1144 -1065 -993 338 62 -620 566 1612 -124 -2127 -859 1643 1323 -639 -701 304 -286
$$ packed form
1923b651K805K653j778k766O52J726o53p56J708R86k547k167K136L004r11k571
1939a130J71J412p00q88J879J578k266k743J472L026l81k100K36J027j250r54
1955a611K269J939k189k803J157K507l78j360P84O10j950j054K558K142j956k589
1971a924Q28J882m76q05J245N92k234j484K277K477j277k473L15J516m27p30J412
1988G14J030k062k123J635K762n22k277j2J219n84q27J656J487j921k487J172
2004a140K606k48j722K52P76j200q13K055J732j893k421R32K067l15j023P51M35
2021H31j769r42K202J937j575k271N76J589l23o59J044N83j874j446J809K315
2037B027q83k209P2J331k76o82J186J046j736k003J268K502l20j962o2J005n90
$$ plain form
2054 -286 -986 540 1896 169 -2017 -1016 1181 965 -376 -70 451 -740 -1392 541 2022 352
2070 352 -1710 -926 764 496 -268 455 770 -816 -1690 207 1966 730 -1290 -944 423 233 -344
2087 -344 557 1143 -450 -1849 -404 1721 1125 -840 -901 240 33 -566 475 1455 -50 -1885 -825
2104 -825 1348 1124 -485 -510 229 -383 -920 532 1678 134 -1715 -843 940 737 -246 101 416 -739
2122 -739 -1227 477 1768 364 -1387 -806 555 391 -173 425 709 -668 -1483 52 1669 780 -1002
2139 -1002 -902 271 241 -275 417 994 -282 -1626 -508 1411 1068 -631 -796 141 -26 -514 425 1283
2157 1283 -6 -1589 -747 1065 937 -304 -321 162 -443 -803 525 1465 128 -1393 -708 696 566
2174 566 -117 196 327 -673 -1075 379 1499 390 -1105 -761 349 343 -99 328 594 -492 -1293 -113
$$ packed form
2054b86p00J526J356j727k186J001K197k16j341L06N21j191o52J933J481j670
2070C52k062P84J690k68p64P23L15j586q74J897J759j236k020L46J367j90n77
2087c44R01N86j593j399J445K125n96j965o1J141k07n99J041R80j505j835J060
2104h25K173k24j609k5P39o12n37J452J146j544j849Q72J783k03r83L47L15j155
2122g39m88J704J291j404j751N81J361j64n64N98K84j377q15J535J617q89j782
2139a002J00J173l0n16O92N77j276j344J118J919l43j699j65R37j67m88R39Q58
2157A283j289j583Q42J812j28j241j7M83o05l60J328R40j337j521O85J404j30
2174E66o83L13J31j000m02J454J120j109j495L44J110om42M27K66j086q01J180
$$ plain form
2192 -113 1372 792 -770 -849 130 204 -227 319 880 -174 -1388 -538 1143 969 -432 -626 59 -93 -425
2211 -425 429 1125 -5 -1320 -619 834 734 -162 -136 117 -483 -700 488 1240 114 -1132 -618 495
2229 495 442 -28 213 269 -596 -949 234 1251 443 -873 -738 209 314 -48 264 538 -339 -1129 -225 1145
2249 1145 791 -568 -760 65 172 -169 304 806 -102 -1193 -492 935 830 -286 -463 13 -199 -373
2267 -373 446 989 -35 -1114 -519 633 555 -82 -26 63 -518 -629 435 1075 132 -943 -574 338 375 7
2287 7 184 250 -469 -833 115 1082 507 -693 -698 132 308 -21 206 495 -218 -982 -283 966 764 -425 -650
2308 -650 9 91 -157 295 704 -102 -1022 -422 740 649 -185 -296 -39 -298 -346 438 847 -60 -913 -426 453
2329 453 418 19 62 49 -473 -536 360 926 186 -734 -534 233 354 70 163 215 -342 -730 0 906 531 -530
$$ packed form
2192a13J485n80j562p9R79P4m31N46N61j054j214Q50J681j74j401j94O85j52l32
2211d25Q54O96j130j315P01J453j00q96K6K53o00k17J188P52j126j246N14J113
2229D95n3m70K41N6q65l53J183J017q08j316J35R47J05l62L12K74q77p90R04J370
2249A145l54j359j92Q25J07l41M73N02r08j091P01J427j05j116j77M76k12j74
2267c73Q19N43j024j079N95J152p8o37N6Q9n81j11J064O40r43j075L69R12L7l68
2287GJ77O6p19l64R48R67n75j200nQ30J76l29K27K89p13p64O99J249k02j189k25
2308f50O59Q2k48M52M09q06r20O00J162r1q34j11K57k59m8P84M09r07q53M87Q79
2329D53l5l99M3j3n22o3Q96N66p40r20K00P67J21k84R3N2n57l88P30R06l75j061
$$ plain form
2351 -530 -651 46 264 8 195 427 -175 -857 -284 769 634 -303 -510 -69 -19 -124 322 592 -155 -839
2371 -839 -329 536 489 -52 -126 -79 -342 -253 447 708 -57 -717 -351 314 340 90 106 10 -417 -450 277 769 224
2394 224 -582 -510 116 301 94 135 170 -288 -640 -54 739 485 -396 -570 -21 173 17 207 353 -199 -720
2415 -720 -227 599 488 -170 -331 -104 -137 -72 405 504 -187 -674 -206 404 328 27 -3 -104 -374 -214 451 606
2437 606 -60 -583 -296 207 253 99 115 -10 -377 -417 197 655 220 -481 -461 60 233 86 134 161 -261 -566
2459 -566 -54 625 400 -300 -420 -42 59 22 286 327 -243 -598 -97 505 336 -104 -151 -114 -240 -49 463
2480 463 431 -237 -572 -127 296 208 49 59 -100 -406 -210 389 513 -62 -508 -270 132 195 102 118 10 -333
2502 -333 -381 176 585 221 -395 -393 41 177 84 179 166 -254 -488 4 540 301 -215 -277 -73 -60 56 365 278
$$ packed form
2351e30j21O97K18k56J87K32o02o82N73J053j35r37k07M41N0j05M46K70p47o84
2371h39N10Q65m7n41p4M7k63Q9P00K61p65o60L66O65K6k50J6r6m27l3P27M92n45
2394B24q06P2O26J85k07M1L5m58l52N86P93k54q81j74N49J94j56J90J46n52n21
2415g20M93Q26j11o58j61K27l3O5M77R9o91m87M68O10p6l01l0j01k70J60O65J55
2437F06o66n23K87N03M6j54J6j25l67m0O14M58m35p01K0N21J73j47M8K7m22l05
2459e66N12O79k25p00j20L78J01l7K64M1n70l55N01O02j69m40m7L7j26J91N12
2480D63l2o68l35M45M23q8j59J0j59l06J96N99J24n75m46K38M02O3r3J6j08l43
2502c33m8N57M09l64o16KM34J36r3R5j3m20k34M92N36k39n16o2K04J3J16L09q7
$$ plain form
2525 278 -301 -505 -9 376 192 -32 -28 -157 -333 -33 464 361 -270 -470 -70 214 129 83 110 -119 -388 -177
2547 -177 346 447 -42 -403 -225 119 188 112 139 14 -313 -329 159 500 176 -308 -292 -6 86 115 234 119
2569 119 -307 -414 71 406 168 -136 -134 -133 -183 82 418 195 -357 -387 70 262 75 34 73 -180 -361 12 467
2592 467 279 -255 -347 -31 153 98 123 127 -109 -346 -132 323 381 -23 -309 -183 44 118 135 158 -10 -306 -279
2615 -279 163 371 89 -223 -195 -64 -41 124 295 69 -373 -318 144 282 49 -53 -7 -168 -257 125 454 134
2637 134 -394 -286 123 174 21 98 126 -179 -361 34 437 223 -228 -280 -24 83 63 118 133 -129 -342 -129
2659 -129 266 304 -39 -264 -154 2 48 128 185 -36 -332 -227 193 295 25 -152 -73 -97 -117 150 358 33
2681 33 -383 -226 199 206 -17 10 75 -173 -318 130 455 92 -360 -236 130 122 -10 94 115 -186 -337 17 360
$$ packed form
2525B78n79k04M96L85j84k24Mj29j76L00M97j03o31k00M00K84q5m6K7k29k69K11
2547a77N23J01m89l61J78L44O9p6K7j25l27j6M88L41l24m84J6K86R2K9J19j15
2569A19m26j07M85L35k38l04KJn0K65L36k23n52l0M57J92j87m1L9k53j81L73M55
2592D67j88n34r2L16J84n5K5Mk36k37K14M55N8m04k86J26K27P4J7K3j68k96K7
2615b79M42K08k82l12K8J31K3J65J71k26m42N5M62J38k33j02M6j61q9L82L29l20
2637A34n28J08M09N1j53P7K8l05j82L95M03k14m51n2K56J07k0N5J5k62k13K13
2659a29L95L8l43k25J10J56M6Q0N7k21k96J05M20J02k70j77P9k4k0K67K08l25
2681C3m16J57M25Pk23K7O5k48j45M48L25l63m52J24L66qj32J04K1l01j51L54L43
$$ plain form
2704 360 188 -199 -270 -41 56 40 121 126 -110 -312 -119 249 260 -38 -203 -97 -11 -7 139 223 -41 -343 -160 228
2728 228 228 -38 -70 9 -127 -179 160 385 -9 -402 -164 227 140 -71 42 105 -219 -307 124 418 59 -325 -194
2751 -194 100 83 -19 96 98 -178 -294 10 315 165 -165 -205 -30 39 39 125 157 -87 -286 -71 260 205 -76
2774 -76 -138 -26 -61 -70 167 275 -69 -368 -112 263 145 -99 -19 65 -185 -242 184 394 -63 -411 -119 236 77
2797 77 -104 85 122 -206 -311 129 387 50 -296 -148 108 58 -14 116 120 -151 -277 27 298 156 -164 -165 9
2820 9 11 -14 122 176 -113 -321 -40 277 141 -147 -85 36 -99 -150 163 306 -124 -418 -58 300 86 -163 26
2843 26 121 -187 -259 196 390 -65 -385 -85 244 66 -104 78 137 -173 -279 104 362 54 -274 -139 110
2864 110 62 -27 96 130 -131 -281 12 297 119 -187 -143 38 -19 -79 128 215 -124 -350 -40 302 109 -186
$$ packed form
2704C60j72l87p1K29R7j6Q1Nk36k02J93L68J1k98j65J06Q6MJ46Q4k64l02J83L88
2728B28%k66l2P9j36n2L39K25l94l93K38L91q7k11J13O3l24q8M31K94l59l84J31
2751a94K94j7j02J15Kk76j16L04L05j50l30m0J75O9%Q6L2k44j99K15L31n5k81
2774g6o2J12l5rK37J08l44k99K56L75j18k44Q0Q4k50n7M26K10m57l48K92L55j59
2797G7j81J89L7l28j05M40K58l37l46J48K56n0p2J30Mk71j26L04K71j42l20jJ74
2820IKk5J36N4k89k08K81L17j36k88O2J21j35n1L13J43m30k94L60L58k14k49J89
2843B6R5l08p2M55J94m55l20L00L29j78j70J82N9l10j06L83K58l08l28J35K49
2864A10m8q9J23L4k61j50K93K85j78l06M4J81n7o0K07Q7l39k26L10L42j93k95
$$ plain form
2886 -186 -42 108 -109 -191 192 348 -100 -408 -41 323 71 -164 41 158 -167 -258 178 386 -25 -352 -88
2907 -88 215 71 -97 58 126 -149 -261 61 335 63 -253 -158 93 52 -65 55 146 -109 -293 -5 308 98
2929 98 -205 -109 97 -21 -122 129 270 -113 -372 6 348 100 -209 -24 155 -101 -207 188 364 -85 -396
2950 -396 -46 302 52 -170 22 157 -132 -260 119 357 -11 -331 -115 185 85 -104 20 114 -103 -254
2970 -254 44 312 85 -255 -148 123 68 -83 65 193 -93 -308 14 336 95 -231 -76 152 -27 -168
2990 -168 141 288 -115 -393 -2 358 71 -239 -16 173 -110 -249 155 346 -95 -402 -49 299 77 -186
3010 -186 2 156 -112 -249 96 346 16 -315 -115 190 101 -116 23 151 -75 -263 32 332 89 -264
3030 -264 -122 173 49 -133 67 229 -92 -340 17 370 66 -267 -67 176 -56 -212 124 313 -123 -410
$$ packed form
2886a86J44J50k17q2L83J56m48l08L67L64k52k35K05J17l25r1M36K08m11l27K64
2907h8L03j44j68J55O8k75j12L22K74k72l16R5K51m1j17J20R1k55j84K88L13k10
2929I8l03R6K06j18j01K51J41l83k59L78L42k48l09J85J79k56j06L95J76m49l11
2950c96L50L48k50k22J92J35k89j28L79K38l68l20K16L00j00j89J24R4k17j51
2970b54K98K68k27l40J07K71n5j51J48J28k86k15L22L22k41l26J55K28j79j41
2990a68L09J47m03k78L91L60k87l10K23J89k83j39M04J91m41l07L53L48k22k63
3010a86J88J54k68j37L45K50l30l31K00L05q9k17J39J28k26j88K95L00k43l53
3030b64J42K95j24j82K00J62l21k48L57L53l04l33K00K43k32j56L36J89m36k87
$$ plain form
3050 -410 2 363 52 -254 -21 188 -101 -255 121 351 -58 -367 -62 279 97 -162 -12 164 -66 -235
3070 -235 72 332 55 -306 -133 214 117 -126 -1 170 -60 -279 23 349 77 -297 -115 190 26 -170
3090 -170 71 240 -118 -369 27 362 42 -300 -51 204 -56 -215 134 322 -95 -381 14 333 67 -230
3110 -230 -19 185 -59 -224 114 339 -11 -338 -84 257 111 -163 -33 150 -53 -243 36 303 48 -293
3130 -293 -131 200 80 -150 3 172 -84 -299 31 339 55 -301 -91 201 7 -184 100 271 -112 -357
3150 -357 38 368 33 -272 -27 203 -46 -207 124 314 -72 -371 -9 317 81 -213 -37 162 -56 -217
3170 -217 50 301 -10 -330 -105 231 95 -168 -45 156 -51 -251 39 302 34 -307 -98 212 62 -178
3190 -178 31 207 -96 -305 60 362 13 -309 -45 247 -17 -199 111 285 -123 -357 53 366 24 -282
$$ packed form
3050d10M12L61l11l06K33K09k89j54L76K30m09l09L05L41j82k59J50J76k30j69
3070b35L07K60k77l61J73L47r7k43J25J71k30k19L02L26k72l74J82L05j64j96
3090a70K41J69l58k51L96L35l20l42K49K55k60j59L49J88m17k86L95L19k66k97
3110b30K11K04k44j65L38K25l50l27K54L41j46k74J30J83k03j90K79K67k55l41
3130b93J62L31j20k30J53J69k56k15L30L08k84l56K10K92j94j91K84J71l83k45
3150c57L95L30l35l05K45K30k49j61L31J90l86k99L62L26k36k94J76J99k18j61
3170b17K67K51l11l20K25L36j36k63J23K01k07k00K90K63k68l41K09L10j50k40
3190a78K09J76l03k09L65L02l49l22K64K92k64j82L10J74m08k34M10L13l42l06
$$ plain form
3210 -282 -28 208 -55 -223 95 286 -84 -361 -37 314 73 -223 -45 173 -48 -228 66 301 -3 -321
3230 -321 -85 256 86 -186 -20 185 -75 -268 68 339 15 -324 -62 247 39 -190 65 238 -117 -340
3250 -340 87 369 -8 -314 -30 236 -44 -226 116 279 -125 -358 32 348 7 -283 -30 193 -36 -224
3270 -224 94 294 -61 -337 -32 308 95 -217 -40 184 -36 -226 56 314 -3 -321 -61 276 72 -187
3290 -187 16 195 -83 -270 89 334 -32 -338 -22 260 -10 -215 80 228 -147 -330 98 354 -31 -309
3310 -309 -17 222 -54 -222 114 270 -115 -335 44 336 26 -259 -13 193 -25 -204 88 280 -49 -311
3330 -311 -20 278 76 -206 -15 170 -53 -218 70 294 -43 -321 -45 246 27 -205 34 189 -116 -280
3350 -280 110 311 -58 -312 -1 244 -50 -208 106 233 -150 -304 104 341 -21 -278 9 225 -43 -194
$$ packed form
3210b82K54K36k63j68L18J91l70k77L24L51k41k96J78K18k21j80K94K35l04l18
3230c21K36L41j70k72J66K05k60j93L36K71l24l39K62L09k08k29K55J73l55k23
3250c40M27K82l77l06K84K66k80j82L42J63m04k33L90L16l41k90K53K23k29j88
3270b24L18K00l55k76L05L40k13l12J77K24k20j90K82K58l17l18K60L37k04k59
3290a87K03J79k78j87L59K45l66l06L16K82k70k05K95J48l75j83M28K56l85k78
3310c09K92K39k76j68L36J56l85k20L79K92l10k85K46K06k18j79K92J92l29k62
3330c11K91K98k02k82J91J85k23j65K88K24l37k78K76K91k19k32K39J55l05j64
3350b80L90K01l69k54L11K45k94j58L14J27l83j54M08K37l62k57K87K16k68j51
$$ plain form
3370 -194 109 260 -107 -305 53 301 22 -230 -26 178 -41 -197 74 250 -55 -322 -20 257 32 -211
3390 -211 -14 163 -79 -232 93 293 -65 -305 1 268 -15 -204 71 201 -123 -265 119 325 -71 -311
3410 -311 32 247 -39 -194 117 228 -140 -290 94 318 -21 -276 -9 196 -41 -194 79 231 -95 -295
3430 -295 19 281 22 -241 -34 176 -49 -203 78 258 -72 -301 -7 273 23 -209 19 180 -86 -228
3450 -228 112 301 -64 -316 24 262 -22 -193 92 212 -131 -266 133 308 -65 -299 20 228 -42 -185
3470 -185 91 208 -126 -292 68 296 -7 -249 -23 190 -42 -193 68 220 -79 -282 9 284 40 -212
3490 -212 -13 183 -43 -182 90 270 -51 -287 20 274 13 -206 50 175 -103 -237 126 290 -86 -286
3510 -286 34 233 -34 -200 85 189 -141 -245 109 281 -74 -272 0 201 -45 -173 76 190 -108 -260
$$ packed form
3370a94L03J51l67j98L58K48k79k52K04K04k19j56K71J76l05k67L02K77k25k43
3390b11J97J77k42j53L25K00l58k40L06K67k83j89K75J30l24j42L84K06l96k40
3410c11L43K15k86j55L11J11l68j50L84K24l39k55K67K05k37j53K73J52l26k00
3430b95L14K62k59k63K07K10k25j54K81J80l30k29K94K80k50k32K28J61k66j42
3450b28L40J89l65k52L40K38k84j71K85J20l43j35L99J75l73k34L19K08k70j43
3470a85K76J17l34j66L60K28l03k42K26K13k32j51K61J52k99k03K91K75k44k52
3490b12J99J96k26j39K72J80l21k36L07K54k61k19K56J25k78j34L63J64l76k00
3510b86L20J99k67j66K85J04l30j04L54J72l55j98K72K01k46j28K49J14k98j52
$$ plain form
3530 -260 53 265 3 -217 -22 180 -8 -153 84 225 -59 -255 25 275 37 -196 6 179 -60 -180
3550 -180 98 249 -83 -275 24 246 -30 -193 58 160 -119 -222 122 242 -92 -274 34 213 -56 -182
3570 -182 81 170 -134 -237 107 268 -46 -240 2 194 -24 -155 64 192 -78 -242 66 258 5 -215
3590 -215 -19 177 -26 -160 83 214 -79 -261 26 248 -8 -203 13 162 -79 -185 108 242 -110 -275
3610 -275 49 235 -27 -189 75 170 -114 -202 129 261 -77 -257 40 223 -24 -175 80 196 -108 -231 91
3631 91 269 -30 -226 0 207 -10 -167 59 193 -75 -254 35 247 -9 -238 -15 175 -41 -190 64
3651 64 214 -89 -257 47 257 -25 -207 42 190 -84 -188 123 258 -92 -264 78 260 -32 -186 75
3671 75 178 -107 -217 123 273 -68 -254 15 221 -18 -178 52 194 -100 -242 55 265 -27 -264 -18
$$ packed form
3530b60L13K12k62k20J95K02j88j45K37J41k84j96K80K50k38k33K02J73k39j20
3550a80K78J51l32j92K99K22k76j63K51J02k79j03L44J20l34j82L08J79k69j26
3570a82K63Q9l04j03L44J61l14j94K42J92k18j31K19J28k70j64L08J92k53k20
3590b15J96J96k03j34K43J31k93j82K87K22k56j95K16J49k41j06K93J34l52j65
3610b75L24J86k62j62K64R5k84q8L31J32l38j80K97J83k47j51K55J16l04j23L22
3631I1J78k99j96K26K07k17j57K26J34k68j79K89K12k56k29K23J90k16j49K54
3651F4J50l03j68L04K10k82j82K49J48k74j04L11J35l50j72L42J82k92j54K61
3671G5J03k85j10L40J50l41j86K69K06k39j60K30J42k94j42K97K10k92k37K46
$$ plain form
3691 -18 197 -14 -188 54 195 -86 -269 45 270 -9 -237 21 202 -45 -180 99 241 -96 -263 72
3711 72 281 -23 -216 61 189 -103 -203 122 263 -96 -281 43 259 -41 -202 68 188 -99 -237 105
3731 105 263 -73 -280 7 225 -11 -202 55 193 -85 -248 59 284 -19 -260 -14 217 -22 -191 87
3751 87 233 -90 -253 77 283 -14 -228 30 211 -72 -195 122 245 -124 -285 84 265 -50 -226 39
3771 39 192 -111 -224 124 249 -114 -283 44 250 -38 -212 46 193 -96 -234 98 268 -57 -266 9
3791 9 232 -12 -202 57 210 -75 -260 79 292 -23 -263 13 226 -31 -199 88 228 -105 -269 63 271
3812 271 -52 -251 31 188 -86 -214 105 242 -123 -284 71 254 -44 -222 52 191 -100 -218 121 269
3832 269 -78 -285 36 261 -21 -208 42 202 -76 -239 87 284 -35 -276 13 235 -4 -199 57 219
$$ packed form
3691a8K15k11j74K42J41k81j83L14K25k79k28K58J81k47j35K79J42l37j67L35
3711G2K09l04j93K77J28k92j00L25J41l59j85L24K16l00j61K70J20k87j38L42
3731A05J58l36k07K87K18k36j91K57J38k78j63L07K25l03k41K46K31k39j69K78
3751H7J46l23j63L30K06k97k14K58J81k83j23L17J23l69j61L69J81l15j76K65
3771C9J53l03j13L48J25l63j69L27K06k88j74K58J47k89j38L32J70l25k09K75
3791IK23k44j90K59J53k85j85L39K13l15k40K76K13k57j68K87J40l33j64L32K08
3812B71l23j99K82J57k74j28L19J37l65j61L55J83k98j78K74J39k91j18L39J48
3832B69l47k07L21K25k82j87K50J60k78j63L26J97l19k41K89K22k39j95K56J62
$$ plain form
3852 219 -84 -270 69 286 -33 -262 1 201 -44 -203 82 226 -116 -265 71 278 -46 -247 44 202
3872 202 -77 -198 115 243 -98 -270 66 276 -19 -210 42 206 -82 -217 100 272 -47 -268 14 247
3892 247 4 -213 27 209 -71 -240 62 277 -46 -287 -12 224 -13 -208 49 207 -90 -269 69 257
3912 257 -28 -260 20 213 -45 -189 94 227 -97 -242 82 279 -28 -211 46 196 -75 -197 105 236
3932 236 -97 -261 51 258 -33 -224 25 189 -79 -227 71 239 -64 -286 -1 232 -2 -212 22 197
3952 197 -75 -240 66 268 -34 -265 9 220 -23 -195 71 204 -101 -234 82 274 -28 -237 31 214
3972 214 -62 -178 98 214 -115 -251 80 246 -55 -223 28 179 -67 -203 90 234 -84 -276 26 239
3992 239 -7 -218 18 195 -53 -214 67 257 -52 -269 9 248 -15 -186 37 201 -62 -226 86 264
$$ packed form
3852B19l03j86L39K17l19k29K63K00k45j59K85J44l42j49L36K07l24k01K91J58
3872B02k79j21L13J28l41j72L36K10k95j91K52J64k88j35L17J72l19k21K82K33
3892B47k43k17K40J82k80j69L02K15l23k41K75K36k37j95K57J58k97j79L38J88
3912B57k85k32K80J93k58j44K83J33l24j45L24J97l07j83K57J50k71j22L02J31
3932B36l33j64L12K07k91j91K49J64k68j48K98J68l03k22K85K33k34k10K34J75
3952A97k72j65L06K02l02k31K74K11k43j72K66J33l05j33L16J92l02k09K68J83
3972B14k76j16K76J16l29j36L31J66l01j68K51J51k46j36K93J44l18j92L02K13
3992B39k46k11K36J77k48j61K81J90l09k17K78K39k63j71K23J64k63j64L12J78
$$ plain form
4012 264 -53 -245 21 224 -30 -185 75 208 -100 -236 85 256 -51 -229 33 183 -61 -197 85 211
4032 211 -106 -261 63 236 -33 -232 14 176 -66 -205 78 233 -73 -268 26 264 -9 -208 30 202
4052 202 -54 -213 82 273 -36 -261 11 239 -3 -197 46 188 -74 -236 71 261 -47 -244 10 201
4072 201 -49 -192 60 181 -99 -247 68 234 -35 -232 15 188 -65 -186 81 219 -76 -250 50 264
4092 264 -2 -221 12 211 -25 -208 66 265 -52 -270 10 248 5 -211 13 195 -59 -244 53 260
4112 260 -38 -263 -6 225 -18 -208 29 181 -87 -247 64 264 -41 -245 10 197 -37 -198 61 195
4132 195 -80 -242 52 264 -25 -228 10 206 -23 -184 69 237 -69 -267 28 272 15 -237 1 203
4152 203 -31 -229 50 245 -48 -288 0 244 8 -237 2 201 -64 -234 45 260 -40 -276 -6 228
$$ packed form
4012B64l17j92K66K03k54j55K60J33l08j36L21J71l07j78K62J50k44j36K82J26
4032B11l17j55L24J73k69j99K46J62k42j39K83J55l06j95K94K38k73j99K38J72
4052B02k56j59K95J91l09k25K72K28k42j94K43J42k62j62L07J90l08j97K54J91
4072B01k50j43K52J21k80j48L15J66k69j97K47J73k53j21K67J38k95j74L00K14
4092B64k66k19K33J99k36j83K74J99l17k18K80K38k43k16K24J82k54j85K97K07
4112B60k98k25K57K31k43j90K37J52k68j60L11K00l05k04K55J87k34j61K59J34
4132A95k75j62K94K12k89k03K38J96k29j61K53J68l06j98K95K44k57k52K38K02
4152B03k34j98K79J95k93k40K88K44k36k45K39J99k65j70K79K15l00k36K70K34
$$ plain form
4172 228 -11 -196 41 195 -83 -227 72 255 -31 -245 15 221 -19 -193 69 217 -70 -257 40 267
4192 267 -1 -233 -17 209 -22 -210 45 247 -51 -285 0 264 12 -242 -22 204 -32 -226 51 263
4212 263 -32 -281 -6 254 19 -208 -3 200 -43 -226 61 277 -21 -255 9 240 -1 -199 47 208
4232 208 -56 -239 50 262 -10 -248 -20 212 -4 -207 29 215 -42 -272 8 257 4 -253 -32 213
4252 213 -5 -235 10 250 -27 -291 -11 275 34 -236 -22 226 -10 -209 45 284 -9 -267 -15 258
4272 258 42 -208 10 206 -29 -229 39 270 2 -269 -25 226 20 -203 4 196 -44 -235 22 253
4292 253 18 -257 -50 211 6 -208 9 222 -27 -269 -6 281 40 -243 -49 235 21 -213 26 259
4312 259 13 -269 -22 272 54 -235 -21 221 -8 -228 24 257 -8 -263 -33 236 31 -207 -6 183
$$ packed form
4172B28k39j85K37J54k78j44K99J83k86k14K60K06k40j74K62J48k87j87K97K27
4192B67k68k32K16K26k31j88K55K02k98k34K85K64k52k54K20K26k36j94K77K12
4212B63k95k49K75K60k35k27K05K03k43j83K87K16k98k34K64K31k41j98K46J61
4232B08k64j83K89K12k72k38K28K32k16k03K36J86k57k30K80K49k53k57K21K45
4252B13k18k30K45K40k77k64K80K86k41k70K14K48k36j99K54K39k93k58K52K73
4272B58k16k50K18J96k35k00K68K31k68k71K44K51k06k23K07J92k40j91K57K31
4292B53k35k75K07K61k05k14K17K13k49k42K63K87k41k83J94K84k14k34K39K33
4312B59k46k82K47K94k18k89K14K42k29k20K52K33k65k55K30K69k05k38K01J89
$$ plain form
4332 183 -33 -244 9 236 4 -259 -38 207 31 -198 -5 216 -35 -247 14 274 27 -238 -56 218
4352 218 32 -200 10 243 4 -272 -22 289 62 -252 -47 223 22 -234 -4 244 -10 -265 -43 256
4372 256 43 -223 -45 200 -7 -226 14 252 0 -269 -38 220 41 -207 -15 197 -20 -229 17 256
4392 256 25 -233 -48 227 39 -190 7 214 -11 -255 -11 269 51 -250 -51 227 27 -218 -3 238
4412 238 -17 -279 -37 258 43 -257 -60 210 8 -233 -2 238 -22 -273 -50 253 53 -217 -34 199
4432 199 -5 -215 20 251 18 -245 -36 220 50 -184 -7 199 -24 -219 12 264 36 -262 -53 221
4452 221 35 -213 -16 223 -10 -270 -27 268 42 -253 -65 204 31 -221 -15 234 -3 -282 -38 263
4472 263 52 -234 -37 206 15 -203 5 244 12 -264 -37 240 54 -202 -31 195 2 -201 6 235
$$ packed form
4332A83k16k11K53K27k32k63K21K45j76k29J93K21k51k12K61K60k47k65J82K74
4352B18j86k32K10K33k39k76K50L11k27l14K05K70k01k56K30K48k54k55K22K99
4372B56k13k66J78K45k07k19K40K38k52k69K31K58j79k48J92K12k17k09K46K39
4392B56k31k58J85K75j88k29J97K07k25k44K44K80k18l01J99K78k00k45K15K41
4412B38k55k62K42K95k15l00J97K70k02k41K31K40k60k51K23L03k00k70J83K33
4432A99k04k10K35K31k33k63K09K56j70k34J77K06k23j95K31K52k28k98K09K74
4452B21j86k48J97K39k33k60K43K95k26k95J88K69j73k52K06K49k37k79K44L01
4472B63k11k86J97K43j91k18K08K39k32k76K27K77j86k56J71K26j93k03K07K29
$$ plain form
4492 235 19 -255 -54 219 47 -192 -31 189 -13 -231 -15 242 15 -262 -72 214 26 -224 -28 216
4512 216 -2 -264 -36 278 47 -232 -57 211 26 -203 -3 230 9 -256 -27 257 62 -204 -28 191
4532 191 18 -198 -1 231 14 -233 -54 210 46 -203 -45 162 -4 -222 -2 228 10 -245 -54 190
4552 190 37 -193 -23 200 -12 -240 -7 269 47 -242 -59 229 46 -204 4 232 6 -254 -17 265
4572 265 54 -235 -53 213 22 -202 7 229 -4 -256 -33 224 35 -212 -49 174 0 -207 -6 224
4592 224 -7 -239 -42 199 42 -192 -30 173 -14 -203 -1 246 31 -241 -44 221 46 -192 -11 215
4612 215 -2 -227 -5 272 46 -248 -60 217 34 -206 -6 221 -1 -252 -24 239 37 -224 -58 187
4632 187 8 -204 -2 212 -3 -246 -40 220 49 -203 -34 173 11 -195 11 225 17 -226 -35 221
$$ packed form
4492B35k16k74K01K73j72k39J61K20k02k18K16K57k27k77J90K86j88k50J96K44
4512B16k18k62K28L14k31k79J75K68j85k29K00K33k21k65K29K84j95k66J76K19
4532A91j73k16J97K32k17k47J79K64j64k49J58K07j66k18K20K30k18k55J91K44
4552A90j53k30J70K23k12k28K33K76k22k89J83K88j83k50K08K28k26k60K37K82
4572B65k11k89J82K66j91k24K09K22k33k52K23K57j89k47J63K23j74k07K01K30
4592B24k31k32J97K41j57k34J62K03j87j89K02K47k15k72J97K65j75k38J81K26
4612B15k17k25K22K77k26k94J88K77j83k40K00K27k22k51K28K63k02k61J66K45
4632A87j79k12K02K14k15k43K06K60j71k52J69K07j62k06K06K14k08k43J91K56
$$ plain form
4652 221 54 -162 -14 193 12 -194 4 244 42 -237 -45 212 46 -196 -18 205 -8 -248 -22 254
4672 254 30 -240 -55 197 38 -191 -10 211 -2 -238 -41 225 45 -213 -58 172 16 -177 5 214
4692 214 14 -220 -34 205 57 -181 -26 183 18 -188 -2 211 24 -233 -52 208 44 -198 -36 182
4712 182 1 -217 -23 223 27 -245 -62 192 39 -194 -21 197 7 -220 -32 233 47 -210 -50 191
4732 191 37 -179 -16 200 16 -207 -39 234 65 -180 -53 162 40 -158 -9 192 36 -208 -44 199
4752 199 51 -181 -45 157 9 -187 -26 198 28 -230 -58 197 39 -190 -35 168 13 -217 -31 215
4772 215 49 -225 -70 187 59 -171 -12 183 17 -212 -32 211 56 -192 -65 172 33 -157 -18 190
4792 190 21 -205 -38 198 55 -174 -60 146 19 -169 -21 193 29 -209 -58 182 51 -186 -50 159
$$ packed form
4652B21j67k16J48K07j81k06J98K40k02k79J92K57j66k42J78K23k13k40K26K76
4672B54k24k70J85K52j59k29J81K21k13k36J97K66j80k58J55K30j56j93J82K09
4692B14k00k34J86K39j48k38J55K09j65k06J86K13j87k57J81K60j64k42J62K18
4712A82j81k18J94K46j96k72J83K54j53k33J73K18j90k27J88K65j86k57J60K41
4732A91j54k16J63K16j84k23J68K73j69k45J27K15j22j98J49K01j56k44J64K43
4752A99j48k32J36K02j48j96J61K24j70k58J72K55j58k29J55K03j55k30J86K46
4772B15j66k74J55K57j28k30J59J95j66k29J80K43j55k48J27K37j39j90J39K08
4792A90j69k26J67K36j43k29J14K06j27j88J48K14j64k38J51K40j31k37J36K09
$$ plain form
4812 159 14 -196 -21 209 42 -212 -61 202 65 -179 -35 191 31 -205 -24 227 53 -214 -69 178
4832 178 57 -163 -16 179 11 -210 -52 198 57 -196 -71 151 26 -162 -35 168 18 -197 -54 184
4852 184 62 -169 -64 154 24 -164 -29 196 40 -210 -50 196 70 -170 -35 171 37 -181 -14 218
4872 218 38 -210 -63 188 55 -173 -33 179 20 -204 -32 208 52 -215 -68 165 40 -177 -38 158
4892 158 9 -206 -53 185 47 -178 -65 137 29 -160 -31 165 17 -192 -43 188 72 -174 -59 160
4912 160 24 -160 -14 198 42 -203 -50 192 52 -185 -48 160 6 -193 -43 198 41 -221 -79 173
4932 173 45 -173 -38 163 15 -191 -38 194 56 -189 -68 157 44 -149 -39 163 20 -191 -34 203
4952 203 58 -162 -65 153 33 -156 -22 181 25 -197 -40 189 61 -153 -54 152 25 -181 -25 190 27
$$ packed form
4812A59j45k10J75K30j67k54J51K63j37k44J44K26j60k36J81K51j74k67J45K47
4832A78j21k20J47J95j68k21J58K50j41k53J25K22j25j88J27K03j50k15J43K38
4852A84j22k31J05K18j30j88J35K25j56k50J60K46j26k40J35K06j34k18J67K32
4872B18j80k48J47K51j33k28J40K12j59k24J72K40j56k67J47K33j25k17J39J96
4892A58j49k15J53K38j38k25J13K02j08j89J29J96j48k09J49K31j16k46J15K19
4912A60j36j84J46K12j56k45J53K42j40k37J37K08j54j99J50K41j57k62J42K52
4932A73j28k18J35K01j48k06J53K32j38k45J21K25j13j93J10K02j43k11J57K37
4952B03j45k20R7K18j20j89J34K03j56k22J57K29j28k14R9K06j27k06J56K15j63
$$ plain form
4973 27 -221 -56 182 51 -178 -40 169 19 -191 -22 203 37 -191 -64 179 55 -152 -27 167 21
4993 21 -174 -20 199 65 -170 -53 160 58 -146 -21 154 29 -180 -41 189 56 -184 -55 142 27
5013 27 -176 -38 173 13 -208 -50 186 44 -194 -54 147 20 -190 -25 204 17 -215 -53 185 55
5033 55 -158 -27 184 31 -187 -12 209 46 -186 -58 174 56 -148 -28 155 29 -194 -37 183 47
5053 47 -178 -64 144 43 -144 -27 154 20 -194 -50 171 44 -178 -62 155 12 -172 -15 192 22
5073 22 -200 -56 195 59 -181 -35 185 27 -186 -7 209 30 -203 -39 193 50 -170 -32 167 17
5093 17 -191 -32 189 33 -188 -62 153 33 -157 -43 149 11 -182 -47 178 46 -172 -56 142 36
5113 36 -165 -22 160 18 -191 -39 191 52 -162 -46 165 24 -167 -9 195 23 -182 -41 199 53
$$ packed form
4973B7k48J65K38j31k29J38K09j50k10J69K25j66k28J27K43j24k07J25J94j46
4993B1j95J54K19j34k35J17K13j02k04J25J75j25k09J39K30j33k40J29J97j15
5013B7k03J38K11j60k21J58K36j42k38J40K01j27k10J65K29j87k32J62K38j30
5033E5k13J31K11j53k18J75K21j63k32J28K32j18k04J20J83j26k23J57K20j36
5053D7k25J14K08j01j87J17J81j34k14J44K21j27k22J16K17j43j84J57K07j70
5073B2k22J44K51j36k40J46K20j58k13J79K16j79k33J64K32j43k20J38J99j50
5093A7k08J59K21j56k21J26K15j20j90J14J92j38j93J35K25j32k18J16J98j06
5113C6k01J43J82j42k09J52K30j39k14J16K11j41j91J58K04j72k05J41K40j46
$$ plain form
5133 53 -167 -40 163 9 -178 -18 188 25 -202 -52 164 18 -160 -27 148 0 -180 -34 170 34
5153 34 -171 -61 146 40 -133 -35 153 18 -173 -28 181 59 -152 -41 156 35 -151 -16 169 16 -192
5174 -192 -36 175 46 -166 -37 158 9 -175 -27 180 11 -197 -53 168 20 -169 -42 140 -2 -181
5194 -181 -26 168 30 -188 -48 162 47 -146 -17 144 8 -159 -21 174 49 -156 -56 142 44 -139
5214 -139 -25 158 20 -169 -42 169 39 -177 -55 142 30 -153 -19 164 9 -192 -44 178 29 -180
5234 -180 -42 154 -9 -179 -14 174 9 -187 -39 172 47 -160 -33 151 25 -157 -15 183 39 -147
5254 -147 -35 159 42 -131 -15 140 11 -157 -21 167 38 -168 -52 135 27 -158 -27 141 -2 -185
5274 -185 -40 172 36 -174 -46 140 12 -160 -19 171 9 -199 -30 176 37 -162 -32 154 21 -154
$$ packed form
5133E3k20J27K03j54j87J60K06j63k27J50K16j46j78J33J75j48j80J46K04j36
5153C4k05J10K07j06j73R8J88j35j91J45K09j22k11J11J97j21j86J35J85j53k08
5174a92J56K11j29k12J29J95j49j84J48K07j69k08J44K21j48j89J27J82j42j79
5194a81J55J94j38k18J40K10j15j93J29J61j36j67J38J95j25k05J00J98r8j83
5214a39J14J83j38j89J27K11j30k16J22J97j12j83J34J83j55k01J48K22j49k09
5234a80J38J96j63j70J65J88j65j96J48K11j25k07J27J84j26j82J42J98j44j86
5254a47J12J94j17j73J16J55j29j68J36J88j29k06J16J87j08j85J31J68j43j83
5274a85J45K12j36k10J28J86j28j72J41J90j62k08J69K06j39j99J30J86j33j75
$$ plain form
5294 -154 -9 192 30 -171 -29 173 45 -137 -26 145 20 -170 -21 161 35 -168 -59 137 25 -144
5314 -144 -35 134 13 -166 -34 155 31 -166 -50 147 25 -151 -23 149 20 -177 -22 169 43 -164
5334 -164 -32 149 25 -149 8 171 9 -165 -31 177 42 -150 -33 150 21 -157 -12 156 14 -169
5354 -169 -41 150 35 -141 -45 130 13 -154 -24 151 28 -168 -52 136 32 -132 -34 148 21 -154 -26
5375 -26 165 45 -154 -22 160 28 -141 -1 170 22 -170 -7 181 40 -155 -33 149 20 -151 -1
5395 -1 166 21 -176 -42 150 37 -154 -40 121 8 -157 -24 159 31 -158 -39 134 34 -129 -26 148
5416 148 24 -146 -21 171 43 -148 -41 156 47 -125 -15 154 21 -149 -24 183 30 -160 -35 148
5436 148 17 -145 -16 160 16 -183 -38 164 21 -168 -36 134 10 -161 -20 148 27 -178 -37 157
$$ packed form
5294a54J45K01j62k01J42K02j28j82J11J71j25j90J49J82j26k03J09J96j12j69
5314a44J09J69j21j79J32J89j24j97J16J97j22j76J28J72j29j97J55J91j26k07
5334a64J32J81j24j74J57J63j62j74J34K08j35j92J17J83j29j78J45J68j42j83
5354a69J28J91j15j76R6J75j17j67J30J75j23j96J16J88j04j64R8J82j27j75J28
5375b6J91j20j99J32J82j32j69J40J71j48j92J63J88j41j95J22J82j29j71J50
5395aJ67j45j97J34J92j13j91J14J61j13j65J33J83j28j89J19J73j00j63J03J74
5416A48j24j70J25J92j28j91J07J97j09j72J10J69j33j70J25K07j53j90J25J83
5436A48j31j62J29J76j44j99J45K02j43j89J32J70j24j71J41J68j21k05J41J94
$$ plain form
5456 157 47 -146 -43 139 24 -148 -14 159 47 -156 -39 156 63 -133 -26 141 14 -161 -33 167
5476 167 33 -166 -51 132 17 -148 -29 153 9 -177 -34 162 24 -176 -49 138 16 -157 -21 158
5496 158 15 -178 -40 159 35 -157 -45 146 16 -157 -19 169 42 -166 -51 155 65 -136 -32 136
5516 136 38 -149 -31 151 38 -178 -68 136 44 -147 -49 131 2 -179 -48 166 27 -170 -57 138 26
5537 26 -150 -31 162 17 -179 -27 170 43 -149 -30 151 50 -149 -7 168 30 -178 -34 169 50
5557 50 -143 -38 137 41 -136 -24 168 24 -158 -50 144 41 -138 -52 120 19 -161 -46 154 31 -176
5578 -176 -56 150 29 -154 -31 138 11 -163 -26 166 44 -151 -32 156 39 -139 -15 174 21 -169
5598 -169 -20 174 47 -164 -38 146 28 -148 -26 154 16 -178 -51 156 39 -151 -49 124 11 -144
$$ packed form
5456A57j10j93J03J82j15j72J34J73j12k03J17J95r3j96J07J67j27j75J28K00
5476A67j34j99J15J83j15j65J19J82j44j86J43J96j38k00J27J87j22j73J36J79
5496A58j43j93J38J99j24j92J12J91j30j73J38J88j27k08J15K06r0k01J04J68
5516A36r8j87J18J82j13k16J10K04r2j91R8J80j29j81J31K14j39j97J13J95j12
5537B6j76J19J93j45j96J52J97j27j92J19J81j01j99J42J75j38k08J44K03j19
5557E0j93J05J75r6j77J12J92j44j82J08J94j03j79Q6J72j01j80J15K00j23k07
5578a76J20K06j21j83J23J69j27j74J37J92j22j95J19J88j17j78J24J89j53j90
5598a69J49J94j27k11J26J84j18j76J22J80j38j94J27K07j17j90J02J73j13j55
$$ plain form
5618 -144 -36 147 27 -174 -51 143 46 -137 -38 139 30 -145 -32 152 29 -165 -50 153 38 -134 -18
5639 -18 158 25 -156 -13 173 33 -165 -48 138 28 -148 -29 156 14 -165 -49 160 44 -152 -55 132
5660 132 28 -162 -32 143 32 -175 -60 146 48 -139 -52 139 32 -141 -24 149 45 -161 -43 154 53
5681 53 -140 -30 149 41 -159 -26 171 37 -164 -47 152 30 -146 -33 140 26 -166 -48 169 24
5701 24 -170 -52 134 15 -157 -23 146 13 -169 -36 157 40 -145 -53 137 35 -142 -28 154 34 -146
5722 -146 -45 148 57 -134 -42 133 49 -143 -30 154 39 -157 -56 142 37 -151 -40 141 1 -161 -36
5743 -36 148 19 -167 -46 131 19 -156 -26 144 1 -168 -27 166 22 -164 -44 129 45 -129 -12 155
5764 155 43 -154 -50 154 46 -134 -32 124 32 -139 -30 136 38 -155 -42 142 37 -141 -43 120 11
$$ packed form
5618a44J08J83j20k01J23J94r7j83R9J77j09j75J13J84j23j94J15K03j15j72J16
5639a8J76j33j81J43J86j40j98J17J86j10j76J19J85j42j79J16K09j16j96R7J87
5660A32j04j90J30J75j11k07J15K06r8j87Q7J91j07j73J17J73j04k06J18J97j01
5681E3j93J10J79j08k00J33J97j34k01J17J99j22j76J13J73j14j92J18K17j45
5701B4j94J18J86j19j72J34J69j33j82J33J93j17j85R2J90j02j77J14J82j20j80
5722a46J01J93r1j91R2J75q4j92J13J84j15j96J01J98j05j88J11J81j40j62J25
5743c6J84j29j86J21J77j12j75J30J70j43j69J41J93j44j86J20J73q4j74J17J67
5764A55j12j97J04K04j08j80J02J56r2j71J09J66r8j93J13J84j05j78R8J63j09
$$ plain form
5785 11 -144 -24 152 17 -154 -48 135 25 -150 -35 131 7 -154 -18 153 33 -149 -28 144 30
5805 30 -122 -9 156 15 -152 -29 164 49 -140 -38 129 34 -131 -33 131 32 -161 -48 144 41 -138
5826 -138 -56 110 24 -130 -42 124 28 -148 -48 135 41 -135 -51 120 6 -154 -22 163 38 -148 -42 150
5848 150 35 -115 -21 136 16 -146 -14 151 30 -143 -41 139 37 -125 -25 126 7 -152 -36 130
5868 130 36 -148 -67 117 18 -141 -39 132 17 -148 -67 131 44 -139 -52 125 27 -143 -24 131 41 -139 -37
5891 -37 134 48 -129 -30 127 14 -130 -21 148 36 -148 -29 142 30 -130 -30 117 17 -156 -39 127
5912 127 29 -160 -67 110 26 -130 -49 111 20 -137 -51 131 42 -136 -54 110 34 -125 -37 131 46 -137 -46 137
5936 137 65 -117 -46 121 39 -124 -34 140 30 -137 -46 145 34 -137 -29 118 12 -153 -41 128 13 -154
$$ packed form
5785A1j55J20J76j35j71J06J83j10j75J15J66j24j61J36J71j20j82J21J72j14
5805C0j52J13J65j41j67J23J93j15j89J02J67r5j65R8J64r9j93J13J92j03j79
5826a38Q2J66q6j54Q8J66r6j76J00J83r4j76Q4J71j14j60J32J85j25j86J06J92
5848A50j15j50R4J57j20j62J32J65j21j73J02J80j02j62J00J51j19j59J16J66
5868A30r4j84Q1J84r9j59J02J71j15j65Q1J98q7j83Q7J77r8j70J19J55r0j80J02
5891c7J71q6j77R9J57j13j44J09J69j12j84J19J71j12j60J00J47j00j73J17J66
5912A27r8j89R3J77q4j56Q1J60r1j57Q6J82q9j78Q2J64p6j59Q8J68q5j83R1J83
5936A37p2j82P1J67q2j63R0J74j10j67R1J91j11j71J08J47j06j65J12J69j15j67
$$ plain form
5958 -154 -49 119 22 -136 -39 121 23 -150 -40 131 33 -137 -66 110 38 -118 -38 126 36 -125 -50 133 59
5981 59 -127 -65 109 47 -117 -43 129 35 -139 -54 122 52 -121 -53 110 16 -138 -42 122 27 -148 -54 110 28
6005 28 -133 -35 110 21 -130 -47 121 29 -130 -49 120 44 -118 -29 125 36 -134 -42 141 66 -124 -65 111 54
6029 54 -112 -44 120 41 -124 -57 117 56 -128 -74 115 31 -121 -61 103 27 -134 -62 121 51 -127 -54 107 34
6053 34 -136 -41 120 25 -136 -50 108 42 -118 -38 122 35 -132 -39 139 55 -119 -52 118 47 -115 -47 106 38
6077 38 -126 -68 110 51 -139 -82 86 49 -120 -55 105 32 -134 -59 112 43 -121 -61 117 37 -125 -41 128 38
6101 38 -131 -43 127 46 -110 -40 112 32 -118 -34 138 53 -131 -45 115 47 -115 -46 111 34 -132 -55 126 44
6125 44 -131 -73 100 42 -131 -68 101 41 -138 -65 116 65 -129 -76 113 52 -106 -46 130 41 -125 -55 113 47
$$ packed form
5958a54J05J68r7j58R7J60r8j73J10J71r8j70P1J76p2j56Q0J64r0j61P5J83p4
5981E9j86O2J74o2j64P4J72r4j74Q5J76p0j73O8J63r4j54R6J64r5j75R4J64q2
6005B8j61R8J45q9j51Q3J68r2j59Q1J69p6j62Q9J54q9j70R2J83p5j90N9J76n7
6029E4j66O8J64p9j65O7J74o1j84N4J89q4j52O0J64p6j61P2J83p0j78P3J61p3
6053C4j70R5J61r5j61Q6J58o6j60Q0J60q7j67R3J78q4j74O7J70p1j62O8J53o8
6077C8j64N8J78n9j90N7J68l7j69O5J60p3j66P5J71o9j64O0J78q0j62Q4J69r0
6101C8j69Q8J70q1j56P0J52q0j50Q4J72q5j84Q6J60o8j62O9J57p7j66P7J81q2
6125D4j75N8J73n8j73O3J69o0j79P3J81n1j94N3J89o1j58O0J76q9j66P0J68o6
$$ plain form
6149 47 -108 -53 114 32 -114 -29 123 40 -116 -48 125 48 -110 -40 114 40 -135 -44 120 44 -135 -51 106 42
6173 42 -123 -57 99 35 -130 -60 120 54 -121 -54 104 61 -113 -42 112 46 -115 -58 137 59 -96 -50 118 48
6197 48 -111 -46 124 39 -119 -46 114 43 -116 -49 110 26 -121 -42 108 15 -132 -49 101 36 -127 -57 94 29
6221 29 -130 -43 111 36 -121 -69 104 45 -109 -47 117 42 -127 -49 121 61 -116 -57 102 55 -118 -39 115 50
6245 50 -124 -40 134 48 -120 -60 104 27 -122 -39 109 33 -120 -50 102 31 -116 -39 104 21 -117 -29 117 25
6269 25 -119 -44 115 45 -101 -30 109 26 -128 -45 121 53 -113 -41 120 58 -99 -50 109 39 -129 -48 115 50
6293 50 -114 -67 108 39 -113 -44 107 24 -142 -55 114 30 -126 -47 111 25 -105 -38 112 31 -115 -42 115 39
6317 39 -118 -33 104 38 -98 -24 126 36 -127 -42 110 54 -103 -45 107 40 -108 -52 114 40 -123 -72 99 46
$$ packed form
6149D7j55N5J67q2j46Q5J52q3j56O8J73p7j58P0J54p4j75R1J64p6j79Q4J57o4
6173D2j65O6J56o4j65P0J80o6j75O7J58m3j74P1J54o6j61N7J95p8j55M6J68p0
6197D8j59O5J70q5j58P3J60p1j59O7J59q4j47P9J50r3j47Q3J50o5j63P0J51o5
6221B9j59Q7J54p5j57N2J73n9j54O2J64p5j69P8J70o0j77N9J59m7j73P9J54o5
6245E0j74Q4J74q6j68O0J64p7j49Q3J48p6j53P0J52p1j47P7J43q3j38Q8J46r2
6269B5j44P5J59p0j46P1J39q3j54Q3J66o8j66P2J61o2j57M9J59p0j68Q1J63o5
6293E0j64M7J75o9j52O9J51q3j66Q7J69q4j56P9J58q6j30O7J50q1j46P3J57p6
6317C9j57Q5J37o6j36P4J50r0j63Q5J52n6j57N8J52o7j48N6J66p4j63N1J71n3
$$ plain form
6341 46 -108 -60 97 27 -118 -61 97 38 -122 -64 90 24 -111 -47 118 39 -119 -40 108 48 -105 -37 118 27
6365 27 -98 -25 127 30 -112 -41 103 50 -97 -49 103 31 -111 -46 104 40 -125 -54 104 39 -111 -60 103 32
6389 32 -120 -53 101 36 -113 -64 99 51 -109 -51 103 38 -112 -35 116 47 -91 -42 108 36 -101 -20 112 36
6413 36 -89 -39 101 43 -100 -32 102 26 -102 -34 101 29 -117 -46 103 39 -108 -49 86 26 -107 -48 99 41
6437 41 -113 -53 113 45 -98 -41 97 43 -109 -35 115 65 -97 -42 108 53 -95 -26 120 44 -101 -34 117 32
6461 32 -98 -40 90 31 -102 -28 91 16 -119 -32 100 28 -108 -41 90 15 -104 -48 106 42 -106 -53 107 45
6485 45 -97 -38 105 41 -98 -42 109 40 -102 -50 110 50 -99 -41 99 39 -106 -40 116 47 -105 -45 92 15
6509 15 -91 -29 86 29 -120 -44 78 19 -109 -48 84 14 -102 -31 85 30 -103 -40 94 42 -92 -29 92 40
$$ packed form
6341D6j54M8J57p0j45N7J58n9j60N8J54o6j35O4J65p9j58P9J48o0j53O8J55r1
6365B7j25P3J52r7j42P1J44n3j47M8J52p2j42O5J50o4j65P1J58o5j50N1J63p1
6389C2j52O7J54o5j49M9J63m8j60N8J54o5j50P7J51o9j38M9J50p2j37Q1J32p6
6413C6j25N0J40n8j43O8J34p6j28O8J35p2j46P1J49o4j47N9J35o0j33N9J47n8
6437D1j54O0J66o8j43N7J38n4j52P4J50n0j62N5J50n5j48O9J46p6j45O7J51q5
6461C2j30N8J30n9j33P4J19p5j35Q7J32p2j36O7J31p5j19N6J54o4j48N3J60o2
6485D5j42N9J43o4j39N6J51o9j42N2J60o0j49N8J40o0j45O6J56o9j52O0J37p7
6509A5j06O2J15n7j49P6J22n9j28O1J32p0j16P1J16n5j33O3J34n2j34O3J21n2
$$ plain form
6533 40 -103 -39 85 37 -90 -50 109 47 -86 -41 93 39 -97 -33 107 50 -97 -59 94 50 -93 -39 81 27
6557 27 -111 -46 88 22 -92 -47 78 33 -96 -36 86 23 -88 -26 118 33 -86 -28 103 30 -99 -19 102 38
6581 38 -94 -26 98 47 -84 -27 88 40 -94 -33 102 49 -99 -40 95 40 -103 -39 88 29 -108 -50 92 43
6605 43 -105 -50 93 32 -96 -36 97 35 -104 -22 99 37 -98 -21 102 34 -83 -23 109 36 -91 -21 98 49
6629 49 -86 -27 91 26 -96 -44 101 27 -99 -43 82 34 -98 -44 81 35 -103 -45 94 38 -98 -49 89 40
6653 40 -95 -39 86 33 -94 -34 97 40 -90 -26 98 47 -84 -19 96 30 -100 -26 101 27 -90 -30 86 29
6677 29 -98 -27 86 13 -106 -38 92 27 -92 -41 89 27 -92 -45 90 28 -108 -41 91 54 -97 -35 84 38
6701 38 -94 -35 112 44 -100 -47 88 34 -90 -37 103 31 -85 -26 99 27 -100 -41 77 22 -88 -43 78 7
$$ packed form
6533D0j43O4J24m8j27M0J59o2j33M5J34n4j36O4J40n7j47L8J53m4j43N4J20n4
6557B7j38O5J34o6j14M5J25m5j29O0J22o3j11O2J44q5j19N8J31p3j29Q0J21o4
6581C8j32O8J24n1j31N7J15m8j34O1J35n3j48N9J35n5j43O4J27n9j37N8J42m9
6605D3j48N5J43o1j28O0J33o2j39Q2J21o2j35P7J23o8j17O0J32p3j27P0J19m9
6629D9j35N9J18o5j22N2J45p4j26N6J25m8j32N4J25m6j38N8J39n6j36M9J38m9
6653D0j35N6J25n3j27O0J31n7j30O4J24n1j31O5J15o6j30P4J27p4j17O0J16n7
6677B9j27P1J13p3j19O8J30o5j19N1J30o2j19M7J35o2j36O7J32l7j51O2J19m6
6701C8j32N9J47o8j44N3J35n4j24N3J40p2j16N9J25p2j27N9J18n5j10M5J21p1
$$ plain form
6725 7 -107 -30 81 17 -109 -44 76 17 -111 -38 88 22 -106 -47 92 35 -92 -36 98 40 -97 -27 96 38 -102
6750 -102 -45 96 42 -96 -33 101 38 -93 -32 96 33 -104 -40 88 30 -94 -37 79 21 -98 -31 91 23 -105
6774 -105 -37 77 16 -94 -30 91 16 -98 -36 86 33 -95 -27 88 40 -85 -24 96 33 -86 -40 93 47 -83
6798 -83 -34 107 40 -104 -29 94 31 -103 -46 92 39 -100 -39 77 21 -93 -31 90 28 -99 -48 81 20 -91
6822 -91 -38 89 24 -110 -32 93 30 -99 -31 82 33 -80 -18 92 28 -91 -36 91 32 -90 -43 89 32 -100
6846 -100 -34 99 25 -117 -45 84 35 -106 -48 80 22 -98 -43 89 23 -114 -48 90 22 -102 -34 90 15 -99
6870 -99 -25 94 29 -89 -23 89 30 -76 -27 90 24 -101 -25 89 31 -88 -30 97 28 -93 -24 93 19 -106
6894 -106 -35 94 17 -100 -48 79 25 -109 -39 82 24 -91 -50 89 35 -92 -40 79 26 -83 -28 100 28 -92
$$ packed form
6725Gj14P7J11o4j26O5J20n9j28P3J26o6j28N9J39n7j27N6J34n8j37P0J23n8j40
6750a02N7J41n4j38O3J34o3j31O1J28o3j37O4J28n8j24N7J16n8j19O7J22o8j28
6774a05O8J14o1j10O4J21p5j14O2J22n3j28O8J15m8j25O1J20o3j19M6J33m6j30
6798h3M9J41o7j44P5J23o3j34N7J38n3j39O1J16n6j14O2J21o2j27N1J29o1j11
6822i1N3J27o5j34P8J25o3j29O8J13m9j13O2J10o4j19N5J27n9j22M7J32n7j32
6846a00O6J33p4j42P2J29m9j41N8J28n8j20N5J32o6j37O6J38o8j24O8J24p5j14
6870i9P4J19o5j18O6J12n9j06M9J17o6j25P6J14n8j19N8J27o9j21O9J17p4j25
6894a06P1J29p7j17N2J27n4j34P0J21n8j15M1J39n4j27N2J19n3j09N5J28p2j20
$$ plain form
6918 -92 -27 103 38 -80 -21 89 24 -90 -8 88 18 -90 -25 84 19 -90 -20 84 14 -103 -23 74 14 -102 -49
6943 -49 76 21 -91 -38 83 8 -98 -43 91 25 -91 -43 80 29 -87 -19 94 33 -91 -28 103 40 -87 -26
6967 -26 93 24 -81 -21 74 21 -84 -23 83 19 -91 -25 77 9 -98 -35 75 6 -100 -31 64 9 -98 -19 79
6992 79 11 -102 -22 83 21 -97 -20 73 22 -87 -16 91 32 -88 -24 94 44 -83 -17 85 23 -80 -27 85 16
7017 16 -87 -24 86 12 -86 -28 72 3 -80 -31 76 8 -95 -27 71 3 -93 -25 76 3 -77 -14 75 16 -84 -20 87
7044 87 23 -75 -19 85 24 -87 -15 82 36 -78 -27 86 29 -86 -9 83 19 -95 -30 76 21 -98 -38 76 7 -93
7070 -93 -22 84 7 -110 -26 73 8 -78 -22 67 7 -95 -13 79 10 -80 -7 84 22 -67 -12 80 23 -83 -14 90 21 -74
7098 -74 -19 79 7 -80 -15 84 29 -98 -24 82 23 -88 -31 76 11 -100 -27 74 16 -108 -24 70 10 -84 -31 78
$$ packed form
6918i2O5J30o5j18N9J10o5j14Q2R6p0j08O5J09o5j09P0J04p0j17Q0R7o0j16N3
6943d9J25n5j12N3J21p5j06N5J34o6j16M8J23n1j16O8J13o1j24O3J31o3j27O1
6967b6J19o9j05O0R5n3j05O1J06o4j10O6J02o8j07O3J10o9j06O9R5n5j07P9R8
6992G9o8j13Q0J05o2j18P7R3n1j09P1J07n9j20O4J18n0j27O6J02o2j03N3J12o9
7017A6j03O3J10p4r8N8J00o9q3M9J07o8j03O8R8o8r6O8J01p3q0O3Q9n9j00O4J07
7044H7o4r8N6J04o1j11P2R7m6j14N1J13n7j15P7R2o4j14O5J06n5j19O0J14o9j00
7070i3P1J06p7j17Q4R9o5q6N6Q9o0j02Q2R2o9r0P3R1o2q9N5R2n7j06O9J04o9r5
7098g4N5R8p2q7O5R9n5j27P4J06n9j11N7J07o5j11P3J01n8j24Q4R4o0r4N3J09
$$ plain form
7124 78 16 -89 -24 87 18 -91 -17 93 17 -76 -8 88 14 -73 -17 82 20 -80 -16 72 14 -67 -23 82 15 -91 -25
7151 -25 79 8 -82 -27 73 13 -94 -23 77 5 -104 -41 75 14 -96 -24 74 14 -82 -18 89 7 -78 -25 89 33
7177 33 -90 -12 81 15 -81 -13 86 14 -74 -16 72 3 -70 -14 70 9 -93 -19 70 15 -93 -20 72 20 -81 -34 66 14
7205 14 -85 -27 89 22 -84 -29 85 16 -72 -20 89 27 -77 -10 88 36 -74 -20 79 14 -73 -16 79 18 -81 -28 68
7232 68 10 -70 -20 72 6 -89 -18 69 5 -88 -17 72 13 -91 -16 66 3 -91 -14 79 11 -90 -19 75 23 -82 -25 87
7260 87 19 -86 0 85 34 -76 -14 95 28 -67 -12 68 8 -82 -20 83 10 -86 -25 69 14 -78 -19 68 7 -84 -37 63
7288 63 -2 -72 -23 63 6 -81 -19 73 15 -70 -14 67 23 -59 -22 67 17 -70 -10 88 32 -77 -24 89 15 -70 -18 81 20
7317 20 -86 -27 79 19 -89 -28 65 12 -83 -22 61 9 -87 -33 69 11 -78 -21 59 7 -75 -16 70 12 -79 -11 70 12
$$ packed form
7124G8o2j05O5J11o9j09P4J10p6r3O8R6p4q7N6R9o2j00O4Q8n8q1M4J05o7j06O6
7151b5J04p1r0N5J00o0j07P1J00p2j09O3J16o1j10P2R8o0r6O4J07q2q5N3J14n6
7177C3j23P8R3o6r6O8R9p2q8N8Q8o9p3N6Q4o1j02P4Q9n5j08P3R2n2j01M7J00n2
7205A4r9N8J16o7j06N5J14o9q8N2J09o2j04O7R8n2j10N4R9o5q7N7R5o1r9N3R6
7232F8n8q0N0R2o6r5P1Q7o4r3P1Q9n9j04P5Q2o3r4P7R3o8j01P1R4n2j05N7J12
7260H7o8j05Q6Q5n1j10O2J09o7r5N5Q0o0r0O2J03p3r6O1R4n5r2N9Q7o1r1M7J00
7288F3o5p0M9Q6n7q7O2R2n8q5N6Q1m4q2L7Q9n0q7O0R8n6j09N3J13p4q5N2R9o1
7317B0j06N9J06o0j08O1R3n3r5O1Q3n2r6N4J02n8q9N7Q0n2q2N9Q6n8r1O8Q1n8
$$ plain form
7345 12 -69 -8 84 21 -66 -11 73 20 -65 -19 70 12 -75 -18 69 20 -76 -23 75 17 -88 -25 69 22 -85 -19 74 9 -89
7374 -89 -24 78 9 -78 -23 81 21 -75 -19 77 17 -80 -10 74 17 -63 -10 69 12 -66 -8 80 16 -64 -9 74 8 -78 -8
7403 -8 74 4 -85 -13 78 15 -85 -20 61 4 -86 -20 73 2 -91 -40 79 18 -84 -26 71 21 -68 -3 71 20 -76 -15 81
7432 81 13 -73 -18 75 19 -66 -7 78 21 -66 -8 69 14 -62 -10 63 3 -76 -14 71 2 -74 -14 64 13 -83 -14 66 9 -78
7462 -78 -30 70 7 -78 -15 78 24 -73 -5 76 17 -72 -14 88 18 -72 -7 72 17 -64 -11 71 10 -62 -19 61 9 -64 -10
7491 -10 52 7 -71 -18 55 -4 -76 -9 55 1 -67 -16 54 -4 -73 -32 69 -2 -67 -26 68 21 -62 -12 79 17 -74 4 82 19
7521 19 -68 -3 90 25 -71 -3 75 5 -67 -11 68 7 -70 -20 57 -3 -74 -15 55 -1 -82 -5 63 1 -79 -22 49 -1 -60 -8
7551 -8 64 0 -59 -15 62 13 -64 -12 62 4 -60 4 75 11 -65 -12 62 12 -57 -6 61 3 -64 -7 59 5 -85 -24 64 -8 -85
$$ packed form
7345A2q1O1R2o3q7N5Q4n3q5M6Q9n8q7N7Q7m9r6N3R8n8j05O3R4m7j07O6R3o5r8
7374h9O5J02o9q7N5J04o0r6N6R6o0r7P0Q4n7q0N3P9n7p8N8Q8o4q0N5Q3o6q6P0
7403hQ2p0q9P2R1o3j00O5Q1n7r0O6R3p1r3N1J19o1j02N8R7n0q9O5P4n1r6O1R6
7432H1o8q6N5R3n6q5N9Q5n7q7N8P7n5p6N2P3o0p9O2Q5o9p6O0P8n1r6O9Q0n7q7
7462g8M8J00o3q5O3R3n4r7O8Q1n9q9N8J02p0r0O5P9n5q1N3Q2o1p2M3Q0n2p3N4
7491a0O2m5p8N3P3n9p2O7O4n4o8N1P0n8o9M1J01p1o5M1R4m7q3N0R1o2r1P8P8o3
7521A9q7O5R3o5r6O8P8p0p2N6P9o1p7N0P7o0p1N9P0n6q1P7O8o2q0N7P1n0n9N2
7551hP2o4n9M4P7m9p7N2P4n8o4O4P1o4p6N3P4n0o9N1O7n8o7N7O6n4r0O1Q8p2p7
$$ plain form
7582 -85 -14 63 -8 -82 -28 55 -2 -82 -12 58 0 -64 -8 58 3 -63 -2 66 -2 -60 4 66 9 -51 6 62 11 -54 5 73
7612 73 8 -61 -12 69 7 -70 -6 65 1 -73 -11 59 -4 -68 -19 54 -9 -68 -17 59 -6 -67 -29 59 -8 -57 1 65 4 -65
7642 -65 9 71 6 -65 -1 59 -2 -56 12 57 6 -61 1 66 12 -51 -2 51 -6 -61 -11 57 3 -73 -16 48 3 -67 -19 53
7672 53 -11 -66 -5 58 -6 -70 -6 55 -2 -67 -7 73 2 -57 9 61 12 -48 3 59 5 -59 2 57 6 -57 -5 68 10 -58
7702 -58 -2 43 -14 -52 -6 63 3 -61 -2 45 -4 -59 4 50 -2 -62 -17 61 -4 -59 -14 56 11 -58 -17 71 7 -55 4 59
7732 59 4 -53 1 64 8 -50 0 66 5 -52 9 48 -3 -57 -7 45 -5 -57 -9 42 -11 -63 -2 36 -13 -48 -10 50 -8 -54
7762 -54 1 52 3 -62 -12 54 8 -49 -1 51 10 -57 13 62 0 -49 -4 51 12 -47 5 56 2 -59 -7 68 7 -67 -5 35
7792 35 -8 -57 -11 31 -11 -52 -10 42 -11 -50 -9 31 -8 -53 -2 41 -9 -50 -4 55 5 -50 0 50 10 -41 2 50 1 -51
$$ packed form
7582h5P1P7p1p4N4Q3n7q0P0P0n8o4N6O6n5o6O1O8o8n8O4O2n7o0N7N6n1o5N9O8
7612G3o5o9M9Q1o2p7O4P1o4p4O2P0o3o4M9P3o3n9N1P6o5o1L8Q8o7m9N8O4o1o9
7642f5P4O2o5p1O4O0o1n4O8M5n1o7O2O5n4o3M9N3n7n5N0O8n4p6N7O4m5p0M8P2
7672E3o4n5O1O3o4o4O4O1n7o5O0Q0p1n9O6N2m9o0N1N6n4o4O1N5n1o3N2P3n8o8
7702e8N6M5n7l8M6O9o0o4N9M7m9n5O3M6n2o0M5P8o5n5M5P0m5o9M1Q8o4o2N9N5
7732E9n5n7N4O3n6n8N0O6o1n7O1L9n1n4N0N2n0n2M8N1n3n2O1L8m9l5L8O0n8m6
7762e4N5N1m9o5N0O6m6n7M8N2m1o7P0M9o2m9M5N5l9n9N2N1n4o1N2P5o1p4O2M0
7792C5m3m9M6M2m2m1M2N2n3l9M1M0l9m5N1M3n0m1M6N9n0n5N0N0m0n1M3M8m9n2
$$ plain form
7822 -51 9 46 6 -44 1 55 -3 -49 1 54 -8 -59 5 43 -1 -55 -18 43 -15 -51 -5 41 -8 -62 0 37 1 -36 5 44
7852 44 -7 -45 3 44 9 -49 4 47 -5 -39 12 44 5 -40 8 49 -6 -44 7 48 -7 -45 0 44 -8 -67 -1 37 -14 -53
7882 -53 -18 27 -12 -53 -3 36 -7 -56 -8 46 -16 -61 7 43 -3 -48 10 55 -3 -38 8 45 9 -31 15 32 -1 -45 6 36
7912 36 1 -30 3 30 -19 -43 6 27 2 -45 2 34 -12 -50 -11 35 -13 -56 1 45 -13 -65 -3 44 -13 -38 2 43 -5 -43
7942 -43 1 44 -1 -36 8 40 -13 -34 8 31 -8 -42 9 45 -7 -39 7 35 -11 -39 8 32 -11 -48 -13 39 -21 -40 -4 19
7972 19 -14 -46 1 48 -14 -49 6 33 -10 -53 -5 37 -2 -35 9 55 6 -35 7 44 4 -38 6 36 0 -33 12 47 -19 -39
8002 -39 14 29 -11 -40 -3 30 -24 -48 -1 21 -11 -35 3 33 -14 -37 14 27 -8 -42 9 46 -9 -34 13 43 -12 -31 12 47
8032 47 6 -36 17 39 2 -31 15 44 -18 -36 13 45 -7 -46 5 37 -10 -46 13 27 -23 -45 -1 27 -20 -46 15 17 -10 -28 9
$$ packed form
7822e1O0L7m0n0M5N4n8m6N0N3o2n1O4L8m4n4L7O1n8l6M6M6m9n4O2L7l6l7M1L9
7852D4n1l8M8M1l5n8N3M3n2l4N1L2l9m5M8M1n5l8N1M1n5l8M5M4n2n9O6L8n1l9
7882e3L5M5l9m1N0L9m3m9M8N4o2m5O8L6m6m5N8M5n8l5M6L7l6m0M6J7l3m4N1L0
7912C6l5l1L3K7m9k4M9K1k5m7M7L2m6l8L9M6m8m3N7M4n8n2O2M7n7k5M0M1m8l8
7942d3M4M3m5l5M4L2n3k1M2K3l9l4N1L6n2l2M6K8m6k8M7K4m3l7L5N2o0j9L6K3
7972A9l3l2M7M7o2l5N5K7m3m3M8M2l9l3M4M6m9m1M2L7m0m2M4L0l6l3M5L5o6k0
8002c9N3J5m0k9L7L3n4k4M7K2l2k4L8L0m7k3N1J3l5l4N1L7n5k5M7L0n5j9M3L5
8032D7m1m2N3K2l7l3M6K9o2j8M9L2n2l9N1L2m7l6N9J4n0k2M4K8m7k6O1Kk7j8L7
$$ plain form
8063 9 31 -7 -27 18 31 -10 -32 16 38 -15 -28 20 52 -3 -26 21 43 -10 -27 1 39 -18 -49 15 30 -16 -42 4 30 -10 -41
8094 -41 6 31 -22 -51 -2 30 -15 -41 -5 13 -22 -44 -1 28 -19 -32 4 40 -7 -27 11 24 -6 -21 12 45 -4 -29 25 32 -6
8125 -6 -31 12 43 -9 -27 16 26 -18 -49 -3 30 -18 -37 4 35 -25 -42 -2 20 -23 -42 9 25 -15 -29 6 15 -34 -30 12 28 -7
8157 -7 -29 15 27 -17 -22 12 34 -6 -15 16 28 -10 -23 18 29 -16 -23 14 20 -25 -37 10 17 -24 -45 2 20 -27 -42 11 27 -21 -55
8190 -55 10
$$ packed form
8063IK2l8k0M5J3m1k2M8K2n3j3M8L2n5k3M7K2n3j7K8L8n7l1O4J5m6k6M6K6m0l1
8094d1M7K5n3k9M9L2m5k6L6J8l5k2M3K9m7j3L6L6m7k0L8J3l0j5L3L3m9k5N4Pl8
8125fk5M3L1n2j8M3J0m4l1M6L3m8j9M1L1o0j7M0K2m3j9N1J6m0j4L5Rm9MM2J6l5
8157gk2M4J2m4nL4K2m0rL1J2l8j3M1J1m5pL7Om5j2M7Pm1k1M7J8m7j5N3J6m8l4
8190e5O5
8191A0
$$ Imaginary data points
##PAGE= N=2
##DATA TABLE= (X++(I..I)), XYDATA
$$ plain form
0 0 0 0 0 0 0 0 0 0 0 0 8 -8 8 -8 8 -16 16 -24 24 -32 40 -48 56 -64 78 -88 104 -121 137 -159 182 -209 233
33 233 -265 301 -339 381 -425 476 -533 592 -657 730 -810 894 -987 1090 -1203 1325 -1459
50 -1459 1608 -1772 1954 -2153 2383 -2636 2925 -3258 3643 -4099 4642 -5309 6148 -7239 8723
65 8723 -10866 14255 -20422 35224 -145604 -740 356255 11795 -220775 5357 182349
76 182349 -119520 -217949 151198 321672 -98126 -342969 -4256 276993 21114 -178275
86 -178275 48096 168817 -134823 -241786 129238 318462 -46759 -300503 -26153 212853
96 212853 2973 -147027 82057 177553 -134364 -261061 91500 301842 -5490 -249757
106 -249757 -28773 164448 -26827 -138772 105365 198631 -117897 -271066 50164 272110
$$ packed form
0@%%%%%%%%%%Qj6J6j6J6k4L2m0M8n6P2q8J04j20J42j66J92k25K58k96L41l91M42
33B33m98N66o40P20q06R01j009J125j249J387j540J704j881K077k293K528k784
50a459L067l380L726m107M536n019N561o183O901p742Q741r951J1457j3387J5962
65H723j9589K5121l4677N5646j80828J44864L56995l44460k32570K26132J76992
76A82349l01869r8429L69147J70474m19798k44843L38713K81249k55879j99389
86a78275K26371J20721l03640j06963L71024J89224l65221k53744K74350K39006
96B12853k09880j50000K29084R5496l11917j26697L52561K10342l07332k44267
106b49757K20984J93221j91275j11945K44137R3266l16528j53169L21230K21946
$$ plain form
116 272110 20106 -198885 -14843 133178 -57610 -145584 113092 217666 -88584 -263526
126 -263526 12568 229095 29133 -151439 8904 115841 -81153 -158101 104666 225718
136 225718 -53131 -238729 -14632 180445 22687 -115088 36016 113489 -93308 -173450
146 -173450 83934 223564 -19280 -205212 -27258 138216 4038 -97087 60798 125719
156 125719 -93025 -188672 56556 212618 6513 -169702 -24962 107978 -20880 -95812
166 -95812 77642 144266 -80813 -195940 27366 190660 21702 -133675 -11624 88199
176 88199 -44702 -103365 82420 158823 -58845 -189183 1157 158496 25467 -100261
186 -100261 7947 78541 -62094 -115115 75047 165664 -32351 -170948 -17281 124012
$$ packed form
116B72110k52004k18991J84042J48021j90788q7974K58676J04574l06250j74942
126b63526K76094K16527j99962j80572J60343J06937j96994p6948K62767J21052
136B25718k78849j85598K24097J95077j57758j37775J51104P7473k06797q0142
146a73450K57384J39630k42844j85932J77954J65474j34178j01125J57885O4921
156A25719k18744r5647K45228J56062k06105j76215J44740J32940j28858p4932
166i5812J73454O6624k25079j15127K23306J63294j68958j55377J22051R9823
176H8199j32901n8663J85785P6403k17668j30338J90340J57339j33029j25728
186a00261J08208P0594j40635n3021J90162R0617j98015j38597J53667J41293
$$ plain form
196 124012 18163 -76974 29520 81514 -70676 -130173 58700 166031 -7605 -147627
206 -147627 -24464 95629 1828 -68315 48851 95293 -69659 -144336 37399 158871 10884
217 10884 -122101 -20571 75439 -18470 -70811 61168 111771 -58944 -150199 14707 141537
228 141537 21209 -94976 -8701 62278 -37142 -78831 63683 123774 -40922 -144505 -5124
239 -5124 116476 22340 -70672 7943 57692 -50676 -90540 57134 130266 -20318 -130875
250 -130875 -17779 91235 14209 -55788 26294 63827 -57458 -105005 44135 131839 -1889
261 -1889 -113623 -21139 71058 -756 -52085 42262 77401 -56139 -117281 27017 125959 11775
273 11775 -93313 -16308 56131 -17924 -55691 51615 91233 -46418 -121139 8429 110690
$$ packed form
196A24012j05849r5137J06494N1994j52190n9497J88873J07331j73636j40022
206a47627J23163J20093r3801p0143J17166M6442j64952p4677J81735J21472j47987
217A0884j32985J01530R6010r3909n2341J31979N0603j70715r1255J64906J26830
228A41537j20328j16185Q6275P0979r9420m1689J42514O0091j64696j03583J39381
239e124J21600r4136r3012P8615M9749j08368l9864J47674P3132j50584j10557
250a30875J13096J09014p7026o9997Q2082L7533j21285m7547J49140Q7704j33728
261a889j11734R2484R2197p1814n1329R4347L5139j33540o1142J44298R8942j14184
273A1775j05088P7005P2439p4055l7767J07306L9618j37651p4721J29568J02261
$$ plain form
284 110690 19241 -71116 -5669 46494 -32931 -63389 52326 101165 -30416 -115700 -7778
295 -7778 89907 19120 -52462 8651 45123 -43339 -75022 45447 107244 -12730 -104654 -17445
307 -17445 70123 11098 -42710 24051 52993 -47789 -88540 33301 108485 2596 -90139
318 -90139 -19065 54384 -2245 -41543 36656 65431 -45019 -98094 18045 101887 13446 -72245
330 -72245 -13940 42361 -16583 -45296 42984 76488 -35236 -99436 2234 87361 18581 -53442
342 -53442 -4066 35402 -28700 -52597 42277 84356 -21292 -93810 -10224 69864 16674 -39383
354 -39383 8872 36409 -37039 -63532 35938 89380 -7043 -84381 -16555 54342 8281 -33266
366 -33266 22208 44733 -40097 -75148 25333 89660 5052 -71721 -16472 41707 -3669 -33324
$$ packed form
284A10690r1449r0357O5447N2163p9425l0458J15715M8839j31581q5284J07922
295g778R7685p0787p1582O1113L6472q8462l1683J20469O1797j19974r1924Q7209
307a7445Q7568n9025n3808O6761K8942j00782m0751J21841P5184j05889r2735
318i0139P1074P3449n6629l9298P8199K8775j10450n3075J16139Q3842q8441q5691
330g2245N8305N6301n8944k8713Q8280L3504j11724o4200J01670Q5127o8780p2023
342e3442M9376L9468o4102k3897R4874M2079j05648p2518Q3586Q0088n3190n6057
354c9383M8255K7537p3448k6493R9470N3442r6423p7338O7826P0897m6061m1547
366c3266N5474K2525q4830l5051J00481O4327q4608p6773N5249N8179m5376k9655
$$ plain form
378 -33324 32185 55417 -36540 -82081 11936 82515 13599 -55899 -11359 31979 -15618 -37119
390 -37119 36288 64463 -27067 -82063 -1496 69387 17058 -40450 -2341 27571 -25498 -44611
402 -44611 34645 71446 -14804 -77172 -11356 55165 14132 -30363 9244 30658 -32111 -55304
414 -55304 28546 75973 -2938 -69258 -15487 42892 5862 -26836 20646 39025 -33911 -65204
426 -65204 19060 75380 6832 -57927 -14343 32519 -4731 -27599 28504 48095 -29869 -70020
438 -70020 7374 68017 13460 -43992 -9186 24802 -14887 -31531 31188 55784 -21137 -69352
450 -69352 -3794 56537 15343 -31625 -652 22616 -23272 -39266 29220 62244 -10567 -65260
462 -65260 -11316 45006 11604 -24512 9885 27008 -28624 -49377 23475 66081 -487 -58198
$$ packed form
378c3324O5509K3232r1957m5541R4017P0579o8916o9498M4540M3338m7597k1501
390c7119P3407K8175r1530n4996Q0567P0883n2329n7508L8109K9912n3069j9113
402d4611P9256L6801q6250o2368O5816O6521m1033m4495L9607K1414o2769k3193
414e5304Q3850M7427p8911o6320N3771N8379l7030l2698M7482J8379p2936l1293
426f5204Q4264N6320o8548o4759M3584M6862l7250k2868N6103J9591p7964m0151
438g0020P7394O0643n4557n7452L4806L3988l9689j6644O2719K4596p6921m8215
450f9352O5558O0331m1194m6968L0973K3268m5888j5994O8486L3024p2811n4693
462f5260N3944N6322l3402l6116L4397J7123n5632k0753P2852M2606o6568n7711
$$ plain form
474 -58198 -14032 34804 3735 -22433 19481 34858 -29183 -57545 14385 64383 7952 -47477
486 -47477 -12586 25769 -5457 -23511 25334 42599 -24370 -60705 3646 56840 13336 -35071
498 -35071 -7549 19752 -14083 -27758 26763 49381 -16089 -59651 -5729 46764 13930 -25252
510 -25252 633 19442 -21205 -35598 24491 55156 -6910 -55870 -11335 37076 9534 -20208
522 -20208 10159 24370 -25338 -44564 18901 57711 1670 -48870 -12866 28096 2162 -18804
534 -18804 18092 31168 -24775 -50631 10353 54734 8780 -38551 -11023 20175 -5822 -20003
546 -20003 22338 37615 -19639 -52411 776 47234 12848 -27750 -5981 15828 -13264 -24605
558 -24605 22895 43695 -12017 -51165 -6871 38531 12282 -20167 1817 16909 -19330 -32259
$$ packed form
474e8198M4166M8836l1069k6168M1914J5377o4041k8362P1930M9998n6431n5429
486d7477L4891L8355l1226j8054M8845J7265o6969l6335O4351N3194m3504m8407
498c5071K7522K7301l3835j3675N4521K2618o5470m3562N3922N2493l2834l9182
510b5252K5885J8809m0647j4393O0089L0665o2066m8960M4535M8411k7542k9742
522b0208L0367J4211m9708j9226O3465L8810n6041n0540L6004M0962k5934k0966
534a8804L6896J3076n5943k5856O0984M4381m5954m7331K7528L1198k5997j4181
546b0003M2341J5277n7254l2772N3187M6458l4386m0598K1769K1809k9092j1341
558b4605M7500K0800n5712l9148M4294M5402k6249l2449K1984J5092l6239j2929
$$ plain form
570 -32259 20437 48627 -4115 -47482 -10892 30235 7547 -16554 10235 21811 -22239 -39793
582 -39793 14932 49829 3247 -40461 -11627 22207 879 -15556 16549 27577 -20788 -44123
594 -44123 7002 46028 9154 -30866 -9478 15557 -6078 -17055 19646 33164 -15741 -45131
606 -45131 -1126 39203 11833 -21967 -4327 12894 -12657 -21998 19865 38733 -9190 -43992
618 -43992 -7030 31912 10310 -16313 3030 14910 -17811 -29185 17359 42823 -2384 -40347
630 -40347 -9957 24686 5679 -13579 10236 19485 -19635 -35350 11892 42926 4165 -33435
642 -33435 -10337 17491 -147 -12904 15131 24461 -17434 -38540 4409 38852 9196 -24822
654 -24822 -8086 12182 -6218 -14991 17264 29676 -12510 -39302 -2606 32854 10841 -17674
$$ packed form
570c2259N2696K8190n2742m3367L6590M1127k2688k4101K6789J1576m4050j7554
582c9793N4725L4897m6582m3708K8834L3834k1328j6435L2105J1028m8365k3335
594d4123N1125L9026l6874m0020K1388K5035k1635j0977L6701J3518m8905k9390
606d5131M4005M0329k7370l3800J7640J7221k5551r341M1863J8868m7923l4802
618d3992L6962L8942k1602k6623J9343J1880l2721j1374M6544K5464m5207l7963
630d0347L0390L4643j9007j9258K3815R249l9120j5715M7242L1034l8761l7600
642c3435K3098K7828j7638j2757K8035R330m1895k1106M2949L4443k9656l4018
654b4822J6736K0268j8400q773L2255J2412m2186k6792L6696L5460k2013k8515
$$ plain form
666 -17674 -2948 10978 -12026 -20284 17085 34861 -6674 -38201 -7242 26612 8718 -13392
678 -13392 3824 13538 -16170 -26750 14369 37890 -628 -34303 -9374 20039 4340 -11186
690 -11186 9822 17528 -16976 -31502 8940 36945 5135 -27478 -9391 13636 -762 -10853
702 -10853 13555 21864 -14343 -33780 2195 32828 9100 -19962 -6830 9674 -6222 -13427
714 -13427 15148 26734 -9857 -34324 -3530 27609 9707 -14306 -1688 9540 -11355 -18686
726 -18686 14689 31235 -4676 -32955 -7148 21987 7270 -10870 4333 12138 -14468 -24186
738 -24186 11630 33083 880 -28682 -8833 15843 3336 -8992 9120 15552 -14297 -27726
750 -27726 6217 31328 5935 -22117 -8508 10344 -1220 -9108 11975 19485 -11513 -29375
$$ packed form
666a7674J4726J3926k3004q258L7369J7776m1535l1527L0959L3854j7894k2110
678a3392J7216R714k9708j0580M1119K3521l8518l3675K4929K9413j5699j5526
690a1186K1008P706l4504j4526M0442K8005l1810l2613J8087K3027j4398j0091
702a0853K4408Q309l6207j9437L5975L0633k3728k9062J3132J6504j5896p205
714a3427K8575J1586l6591k4467L0794L1139j7902k4013J2618J1228k0895p331
726a8686L3375J6546l5911k8279K5807K9135j4717j8140J5203P805k6606r718
738b4186L5816K1453l2203k9562J9849K4676j2507j2328J8112O432k9849j3429
750b7726L3943K5111k5393k8052J3609J8852j1564p888K1083P510l0998j7862
$$ plain form
762 -29375 369 27433 8755 -15797 -5550 7650 -6211 -12103 13218 23958 -7590 -29686
774 -29686 -4066 22894 8421 -11384 -498 8248 -10688 -16976 12588 27557 -3165 -27972
786 -27972 -6709 17800 5812 -8542 4721 10585 -12900 -21308 9451 28350 1706 -23539
798 -23539 -7924 12192 2323 -6976 8519 13513 -12182 -23999 4445 26310 5915 -17674 -7232
811 -7232 7779 -1815 -7658 10833 17251 -9584 -25453 -461 22936 7781 -12602 -4092 6215
824 6215 -6402 -10991 11831 21426 -6159 -25682 -3988 19030 6964 -9108 592 7205 -10099
837 -10099 -15411 10820 24269 -2020 -23674 -6225 14277 4599 -6694 4882 9312 -11385 -18916
850 -18916 7466 24363 2479 -19301 -7177 9375 1523 -5606 7913 12055 -10324 -21123 2956
$$ packed form
762b9375K9744K7064j8678k4552J0247J3200j3861n892K5321J0740l1548k2096
774b9686K5620K6960j4473j9805J0886Q746j8936o288K9564J4969l0722k4807
786b7972K1263K4509j1988j4354J3263N864k3485q408L0759J8899k6644k5245
798b3539J5615K0116r869r299J5495M994k5695j1817K8444K1865k0395k3589J0442
811g232J5011r594n843J8491O418k6835j5869K4992K3397j5155k0383Q510J0307
824F215j2617m589K2822R595k7585j9523K1694K3018j2066j6072R700O613j7304
837a0099n312K6231J3449k6289k1654J7449K0502r678j1293J1576M430k0697p531
850a8916K6382J6897k1884k1780J2124J6552p852p129J3519M142k2379j0799K4079
$$ plain form
863 2956 22367 5815 -14313 -6065 6064 -2358 -6849 9919 15703 -8074 -22474 -957 19550
876 19550 6781 -10341 -2742 5362 -6578 -10243 10721 19447 -5107 -22487 -3734 16024 5680
889 5680 -7428 1434 6427 -9504 -14037 9391 21471 -1217 -20178 -5706 11576 3637 -5309
902 -5309 4904 8283 -10079 -16881 5921 21116 2904 -16042 -6432 7320 841 -4733 7360
915 7360 11018 -8819 -18865 1853 19295 5567 -11834 -5005 4969 -2843 -6469 9102 14601
928 14601 -6758 -20101 -1399 16799 5940 -8551 -1680 4812 -6538 -9743 9499 17756 -3909
941 -3909 -19691 -3780 13386 4801 -5975 1898 5803 -8663 -12859 7776 18984 -209 -17081
954 -17081 -5455 9232 2949 -4202 4722 7479 -8746 -15136 4507 18315 3237 -13306 -5723
$$ packed form
863B956J9411j6552k0128Q248J2129q422m491J6768N784k3777j4400K1517K0507
876A9550j2769j7122P599Q104j1940l665K0964Q726k4554j7380J8753J9758j0344
889E680j3108Q862M993j5931m533K3428J2080k2688j8961J4472J7282p939q946
902e309J0213L379j8362o802K2802J5195j8212j8946R610J3752o479n574J2093
915G360L658j9837j0046K0718J7442j3728j7401O829R974p812l626J5571N499
928A4601k1359j3343J8702J8198j0859j4491O871O492j1350l205J9242Q257k1665
941c909j5782J5911J7166q585j0776P873L905j4466m196K0635J1208j9193j6872
954a7081J1626J4687o283p151Q924K757j6225o390J9643J3808j5078j6543P583
$$ plain form
967 -5723 5758 230 -4124 6920 10155 -7641 -16908 1188 16707 5043 -9845 -3864 4180
980 4180 -3321 -6105 8493 13462 -5855 -17870 -1434 14403 4989 -7053 -738 4220 -6464
993 -6464 -9024 8486 15965 -3052 -17043 -3616 11051 3999 -4726 2199 5104 -7835 -11589 6425
1007 6425 16614 480 -14347 -5106 7285 2324 -3342 4531 6777 -7603 -13585 3369 15907
1020 15907 3365 -11059 -4936 4587 -375 -3763 6551 9509 -6634 -15239 656 14519 4479
1033 4479 -8217 -2862 3615 -3679 -5847 7843 12470 -4981 -15878 -1538 12300 4241 -5786
1046 -5786 -56 3746 -6171 -8351 7424 14288 -2216 -14728 -3523 9084 3389 -3734 2336 4550
1060 4550 -6996 -10488 5236 14613 1020 -12158 -4721 5852 1781 -2784 4362 6320 -6680
$$ packed form
967e723J1481n528m354J1044L235j7796r267J8096J5519j1664j4888N981Q044
980D180p501k784J4598M969j9317j2015J6436J5837r414j2042O315M958j0684
993f464k560J7510P479j9017j3991J3427J4667p052q725O925K905j2939l754J8014
1007F425J0189j6134j4827R241J2391m961n666P873K246j4380n982J6954J2538
1020A5907j2542j4424O123R523m962l388J0314K958j6143q605J5895J3863j0040
1033D479j2696N355O477p294k168J3690M627j7451j0897J4340J3838q059j0027
1046e786N730L802r917k180J5775O864j6504j2512J1205J2607n695p123O070K214
1060D550j1546l492J5724R377j3593j3178P437J0573m071m565P146J958j3000
$$ plain form
1073 -6680 -12369 2566 14003 3256 -9391 -4143 3832 -930 -3626 6237 9030 -5840 -13897 287
1087 287 12738 3975 -6957 -2048 3211 -3865 -5685 7118 11593 -4042 -14156 -1803 10480
1100 10480 3773 -4720 304 3399 -5684 -7831 6193 12905 -1206 -12721 -3674 7409 3035 -2968
1114 -2968 2271 4248 -6089 -9692 4041 13021 1593 -10362 -4411 4746 1285 -2510 4203 6116
1128 6116 -5864 -11441 1879 12468 3142 -8041 -3393 3312 -1428 -3603 5953 8646 -5115 -12682
1142 -12682 37 11207 3478 -5910 -1368 2868 -3946 -5429 6460 10669 -3327 -12553 -1877
1155 -1877 8919 3315 -3859 576 3006 -5244 -7192 5300 11554 -620 -11018 -3526 6133 2557
1169 2557 -2393 2335 3944 -5512 -8919 3346 11619 1680 -8951 -3845 3979 668 -2366 4218
$$ packed form
1073f680n689J4935J1437j0747j2647N248P975m762k696R863K793j4870q057J4184
1087B87J2451q763j0932M909N259p076j820J2803M475j5635j0114J2353J2283
1100A0480o707q493N024L095r083k147J4024O712j4111j1515R047J1083m374o003
1114b968N239J977j0337l603J3733Q980j1428j1955N951R157l461l795O713J913
1128F116j1980n577J3320J0589r326j1183M648O705m740k175R556K693j3761p567
1142a2682J2719J1170p729r388M542M236o814j483J1889M209j3996r226J0676
1155a877J0796n604p174M435K430q250j948J2492O254j2174j0398P492R659l576
1169B557m950M728J609r456l407J2265Q273r939j0631N106P824l311l034O584
$$ plain form
1183 4218 5899 -5364 -10592 1544 11128 2775 -6954 -2605 2912 -1905 -3552 5684 8198 -4516
1197 -4516 -11516 -176 9765 3053 -4939 -818 2525 -3893 -5156 5721 9787 -2538 -11054 -2068
1211 -2068 7478 2972 -3084 773 2735 -4757 -6705 4410 10411 -85 -9553 -3360 5063 2073
1225 2073 -2031 2443 3819 -5046 -8339 2809 10492 1637 -7785 -3195 3433 46 -2321 4299 5747
1240 5747 -4988 -9855 1384 9979 2352 -6039 -1886 2575 -2289 -3471 5427 7703 -4038 -10439
1254 -10439 -306 8526 2664 -4172 -435 2236 -3752 -4831 5079 8935 -1965 -9789 -2115 6353
1268 6353 2634 -2524 920 2552 -4367 -6290 3755 9486 251 -8398 -3102 4324 1594 -1850 2567
1283 2567 3797 -4639 -7902 2381 9563 1583 -6866 -2654 3034 -435 -2352 4229 5670 -4479
$$ packed form
1183D218J681j1263n228J2136R584q353r729M349N517m817j647R236K514j2714
1197d516p000J1340R941o712p992M121L343o418j263J0877M066j2325q516Q986
1211b068R546m506o056L857J962p492j948J1115O001j0496r468O193Q423k990
1225B073m104M474J376q865l293J1148P683q855r422M590O628l387k367O620J448
1240E747j0735m867J1239Q595p627q391M153M461m864j182Q898K276j1741o401
1254a0439J0133Q832n862o836L737K671n988j079R910L856j0900p824P674Q468
1268F353l719n158L444J632o919j923J0045N731r235q649N296P426k730l444M417
1283B567J230q436l263J0283P182p980q449M212N688l469j917O581J441j0149
$$ plain form
1297 -4479 -9195 1005 8935 2210 -5217 -1459 2296 -2349 -3421 4894 7290 -3240 -9443 -734
1311 -734 7383 2627 -3445 -333 2019 -3396 -4615 4231 8228 -1167 -8648 -2367 5361 2452 -2088
1326 -2088 940 2484 -3908 -6005 3054 8684 611 -7391 -2897 3720 1188 -1754 2620 3802 -4236
1341 -4236 -7498 1941 8669 1560 -6028 -2240 2628 -749 -2346 4027 5471 -3898 -8459 589 7895
1356 7895 2171 -4395 -1216 1974 -2247 -3264 4254 6765 -2442 -8420 -1150 6284 2587 -2776 -285
1371 -285 1787 -2998 -4346 3456 7519 -522 -7582 -2480 4491 2211 -1741 1032 2430 -3518 -5697
1386 -5697 2475 7906 841 -6460 -2592 3141 759 -1660 2672 3757 -3810 -7011 1544 7750 1557
1401 1557 -5135 -1855 2219 -964 -2234 3732 5170 -3272 -7640 152 6808 2149 -3611 -1061 1620
$$ packed form
1297d479m716J0200P930o725p427L758L755m645j072Q315K396j0530o203Q709
1311g34Q117m756o072L112K352n415j219Q846L997r395p481O281P728k909m540
1326b088L028J544o392k097R059N630q073q002M494O617k532k942M374J182q038
1341d236l262R439O728p109p588L788M868l377j597O373J444r369m561R048P306
1356G895n724o566L179L190m221j017P518K511r207n978P270P434l697n363K491
1371b85K072m785j348P802M063q041p060N102O971k280l952K773J398n948k179
1386e697Q172N431p065p301L868N733k382k419M332J085p567l201Q555O206o193
1401A557o692L280M074l183j270N966J438q442m368P792O656m659n760K550K681
$$ plain form
1416 1620 -2089 -3055 3626 6176 -1740 -7401 -1452 5261 2460 -2179 -174 1589 -2713 -4083 2893
1431 2893 6808 -146 -6606 -2354 3768 1822 -1476 1230 2365 -3296 -5360 2159 7138 813 -5615
1446 -5615 -2170 2644 323 -1551 2715 3608 -3482 -6468 1226 6863 1485 -4352 -1533 1818 -1080
1461 -1080 -2070 3383 4796 -2673 -6849 -234 5827 2140 -2919 -954 1331 -1902 -2841 3044 5629
1476 5629 -1157 -6503 -1655 4419 2294 -1751 -39 1477 -2489 -3868 2405 6216 128 -5805 -2195
1491 -2195 3171 1445 -1286 1385 2334 -3074 -5072 1802 6438 872 -4865 -1890 2218 36 -1463
1506 -1463 2613 3480 -3020 -5923 800 6019 1565 -3651 -1413 1480 -1021 -1938 2901 4440 -1994
1521 -1994 -6087 -664 4967 2197 -2313 -918 1114 -1642 -2687 2478 5175 -608 -5716 -1818 3722
$$ packed form
1416A620l709r66O681K550p916n661N949O713k801m639K005J763m302j370O976
1431B893L915o954o460M252O122j946l298K706J135n661k064P519M979o325o428
1446e615L445M814k321j874M266Q93p090k986P694N637n378n837K819L351k898
1461a080r90N453J413p469m176O615O061l687n059J965K285l233r39N885K585
1476E629o786n346M848O074k125m045J712J516l966j379O273L811o088n933L610
1491b195N366j726k731K671R49n408j998O874M636n566n737K975M108k182j499
1506a463M076Q67o500k903O723N219m454n216K238K893k501r17M839J539o434
1521a994m093N423N631k770m510J395K032k756j045N165K697n783n108L898N540
$$ plain form
1536 3722 2111 -1411 87 1445 -2273 -3729 2003 5690 341 -5080 -2026 2658 1105 -1152 1471
1551 1471 2321 -2765 -4785 1421 5780 991 -4184 -1695 1814 -100 -1352 2388 3321 -2475 -5391
1566 -5391 312 5225 1714 -2986 -1366 1178 -890 -1811 2395 4133 -1361 -5415 -1050 4218 2200
1581 2200 -1853 -833 991 -1457 -2570 2048 4759 -268 -5062 -1817 3178 1843 -1189 282 1415
1596 1415 -2172 -3592 1727 5212 446 -4476 -1789 2265 785 -1071 1565 2286 -2529 -4473 1117
1611 1117 5175 1053 -3593 -1535 1503 -202 -1274 2135 3139 -1986 -4891 -51 4557 1781 -2464
1626 -2464 -1313 962 -792 -1727 2006 3863 -936 -4855 -1227 3645 2086 -1535 -654 930 -1413
1641 -1413 -2531 1781 4442 -81 -4536 -1681 2730 1498 -1055 513 1464 -2093 -3480 1511 4786
$$ packed form
1536C722j611l522J498J358l718j456N732L687n349n421L054M684j553k257K623
1551A471Q50n086k020O206M359m789n175K489L509j914j252L740R33n796k916
1566e391N703M913l511m700J620K544k068r21M206J738n494m054M365N268k018
1581B200m053J020J824k448j113M618K711n027m794L245M995j335l032J471J133
1596A415l587j420N319L485m766m922K687M054j480j856K636P21m815j944N590
1611A117M058m122m646K058L038j705j072L409J004n125k905M840M608k776m245
1626b464J151K275j754r35L733J857m799l919L628M872j559l621Q81J584k343
1641a413j118M312K661m523m455K855M411j232k553J568R51l557j387M991L275
$$ plain form
1656 4786 472 -3965 -1588 1923 513 -994 1544 2227 -2214 -4170 776 4620 1171 -3053 -1460
1671 -1460 1222 -196 -1196 1833 2977 -1524 -4457 -413 3985 1841 -2032 -1233 828 -718 -1692
1686 -1692 1684 3631 -591 -4399 -1318 3148 1898 -1296 -434 938 -1378 -2472 1587 4146 44
1701 44 -4064 -1530 2346 1190 -928 701 1470 -1973 -3322 1272 4361 586 -3459 -1458 1596 378
1717 378 -899 1415 2159 -1837 -3870 392 4096 1337 -2560 -1443 976 -130 -1123 1493 2805 -1061
1733 -1061 -4046 -724 3460 1893 -1659 -1131 711 -637 -1660 1409 3392 -316 -3948 -1360 2703
1748 2703 1684 -1074 -239 924 -1355 -2397 1361 3854 158 -3601 -1422 1959 950 -806 751
1763 751 1443 -1754 -3112 953 3920 750 -2938 -1421 1287 351 -795 1212 2035 -1421 -3524 6
$$ packed form
1656D786m314m437K377L511j410j507K538O83m441j956M946L844l449m224J593
1671a460K682j418j000L029J144m501k933M044M398k144l873P99K061j546r74
1686a692L376J947m222l808L081M466j250l194Q62J372k316j094M059K559m102
1701D4m108K534L876j156k118J629P69l443j349M594L089l775m045K001L054j218
1717C78j277K314P44l996k033M262L704k759l897J117K419j106r93K616J312l866
1733a061k985L322M184j567l552N28J842j348j023L069J983l708l632K588M063
1748B703j019k758Q35J163k279j042L758K493l696l759K179L381j009j756J557
1763G51O92l197j358M065K967l170l688J517K708r36j146K007Q23l456k103L530
$$ plain form
1779 6 3582 1476 -2105 -1421 773 -57 -1062 1218 2622 -685 -3654 -917 2977 1819 -1355 -958
1795 -958 649 -642 -1618 1235 3174 -155 -3532 -1283 2303 1415 -893 -21 917 -1331 -2327 1189
1811 1189 3530 267 -3153 -1307 1643 767 -701 781 1399 -1522 -2903 647 3511 900 -2495
1826 -2495 -1399 1027 334 -734 1015 1950 -1041 -3226 -310 3144 1576 -1745 -1345 647 -74 -1053
1842 -1053 1030 2501 -442 -3318 -987 2591 1641 -1143 -737 625 -738 -1623 1141 2995 -78 -3182
1858 -3182 -1163 1980 1149 -766 167 922 -1300 -2247 1006 3237 365 -2758 -1230 1371 654 -615
1874 -615 722 1368 -1267 -2714 336 3126 1050 -2113 -1368 835 338 -693 833 1866 -748 -2968
1890 -2968 -512 2759 1549 -1473 -1200 557 -121 -1065 908 2375 -295 -3014 -982 2243 1438 -960
$$ packed form
1779FL576k106l581O84K194q30j005K280J404l307k969K737L894j158l174L97
1795i58J607j291r76K853J939l329l377K249L586q88k308Q72R38k248r96L516
1811A189K341l263l420J846K950q76j468J482O18k921j381L550K864k611l395
1826b495J096K426o93j068J749R35k991k185K916L454j568l321M00J992p21r79
1842a053K083J471k943k876K331L578r50k784M06J362j363q85K764J854l073l104
1858c182K019L143q31j915R33P55k222r47L253K231k872l123J528K601p17j269
1874f15J337O46k635j447L050K790k076l163P45K203m97j031J526J033k614k220
1890b968K456L271j210l022K73J757o78r44J973J467k670k719K032L225q05k398
$$ plain form
1906 -960 -508 603 -800 -1584 1040 2777 7 -2810 -1076 1659 953 -644 269 902 -1187 -2112 772
1923 772 2917 508 -2350 -1232 1087 609 -518 598 1282 -951 -2481 30 2739 1192 -1757 -1368
1939 -1368 645 345 -646 661 1750 -487 -2670 -663 2370 1500 -1181 -1036 463 -188 -1012 831
1955 831 2199 -183 -2659 -938 1870 1237 -738 -309 543 -815 -1487 894 2501 114 -2411 -1031
1971 -1031 1330 828 -473 272 802 -986 -1924 482 2555 686 -1943 -1229 807 601 -407 455 1183
1988 1183 -669 -2230 -238 2351 1266 -1404 -1276 468 305 -577 565 1611 -315 -2352 -719 1988
2004 1988 1340 -909 -815 359 -301 -936 792 1992 -134 -2300 -849 1529 1020 -545 -133 472 -802
2021 -802 -1364 761 2216 211 -2030 -981 1034 735 -331 251 743 -786 -1737 259 2207 808
$$ packed form
1906i60M52J111j403p84K624J737k770k817J734K735p06j597R13O33k089r25K884
1923G72K145k409k858J118K319m78j127J116O84k233j530K511K709j547k949L89
1939a368K013l00r91J307J089k237k183K007L033q70k681J45J499o51q24J843
1955H31J368k382k476J721K808o33j975M29Q52j358o72K381J607k387k525J380
1971a031K361n02j301P45N30j788r38K406K073j869k629P14K036k06j008Q62P28
1988A183j852j561J992K589j085k670J28J744j63q82J142J046j926k037J633K707
2004A988o48k249R4J174o60o35J728J200k126k166J451K378n09j565M12O05j274
2021h02n62K125J455k005k241J049K015k99j066N82M92j529r51J996J948j399
$$ plain form
2037 808 -1600 -1201 608 576 -326 371 1096 -468 -1992 -358 2004 1213 -1119 -1119 342 184 -537 558
2055 558 1488 -272 -2090 -643 1682 1116 -698 -574 279 -424 -880 769 1800 -108 -1997 -741 1244
2072 1244 831 -387 -18 404 -766 -1253 618 1957 294 -1710 -959 822 671 -242 212 663 -625
2089 -625 -1569 77 1926 862 -1316 -1137 453 502 -284 335 1021 -378 -1772 -388 1713 1102 -883
2106 -883 -904 244 39 -488 594 1348 -261 -1818 -555 1387 921 -513 -373 221 -510 -785 738 1598
2124 1598 -77 -1682 -680 977 699 -251 42 345 -646 -1112 441 1697 407 -1406 -953 586 630
2141 630 -147 158 601 -457 -1391 -74 1624 876 -1038 -1044 292 406 -209 327 906 -299 -1547 -374
2159 -374 1420 937 -653 -697 140 -94 -418 607 1190 -249 -1542 -479 1089 751 -329 -216 123 -513
$$ packed form
2037H08k408L99J809l2r02O97P25j564j524J634K362p91k332%J461j58p21J095
2055E58R30j760j818J447K325n66j814J24Q53p03m56J649J031j908j889J256J985
2072A244m13j218L69M22j170m87J871J339j663k004P51J781j51r13M54M51j288
2089f25r44J646J849j064k178J79J590M9p86O19O86j399j394J384K101o11j985
2106h83k1J148k05n27J082P54j609j557J263J942m66j434J40N94p31k75J523Q60
2124A598j675j605J002J657k78r50K93L03r91m66J553J256j290j813M53J539M4
2141F30p77L05M43j058r34J317J698p48j914oJ336J14o15N36N79j205j248J173
2159c74J794m83j590m4Q37k34l24J025N83j439j293J063J568l38j080J13L39o36
$$ plain form
2177 -513 -689 626 1371 7 -1380 -677 732 633 -123 28 255 -534 -982 270 1434 498 -1137 -926
2195 -926 405 571 -64 129 512 -347 -1213 -156 1349 827 -792 -884 153 259 -159 348 784 -301
$$ packed form
2177e13j76J315P45j364j387P03J409r9p56J51K27p89m48J252J164r36j635K11
2195i26J331J66o35J93L83q59q66J057J505n22j619r2J037J06m18N07M36j085
$$ [...]
8191D2
##END NTUPLES=NMR FID
##END=
