##TITLE=1H_AM_NVIOPBENZ
 CDCl3
 8 sc, 
 9.9.2024
##JCAMPDX= 6.0         $$ Bruker NMR JCAMP-DX V2.0
##DATA TYPE= NMR FID
##DATA CLASS= NTUPLES
##ORIGIN= UXNMR, Bruker Analytische Messtechnik GmbH
##OWNER= root
$$ XWIN-NMR		Version 3.5
$$ Mon Sep  9 16:26:47 2024 Russian Standard Time (UT+4h)  she@DPX200
##.OBSERVE FREQUENCY= 200.1318
##.OBSERVE NUCLEUS= ^1H
##.DELAY= (6, 6)
##.ACQUISITION MODE= SIMULTANEOUS
##.ACQUISITION SCHEME= undefined
##.AVERAGES= 8
##.DIGITISER RES= 18
##SPECTROMETER/DATA SYSTEM= spect
##.PULSE SEQUENCE= zg30
##.SOLVENT NAME= CDCl3
##.SHIFT REFERENCE= (INTERNAL, CDCl3, 0, 15.7039)
##AUDIT TRAIL= $$ (NUMBER, WHEN, WHO, WHERE, WHAT)
$$ ##TITLE= Audit trail, XWIN-NMR		Version 3.5
$$ ##JCAMPDX= 5.01
$$ ##ORIGIN= Bruker BioSpin GmbH
$$ ##OWNER= she
$$ F:/spectra/data/she/nmr/H-F/1/audita.txt
$$ ##AUDIT TRAIL=  $$ (NUMBER, WHEN, WHO, WHERE, WHAT)
(   1,<2024-09-09 16:25:31.28 +0400>,<she>,<DPX200>,
      <created by zg, POWCHK disabled, PULCHK disabled
       configuration hash MD5:
       00 E9 B6 7A A2 85 ED C7 34 08 36 98 17 FE 4E 26
       data hash MD5: 16K
       E7 F6 9F F6 6C EA C2 CD 11 1D 8E 9D 7E 4D 97 FD>)
$$ ##END=
$$ 
$$ hash MD5
$$ 62 BB E9 A8 19 92 26 B8 0A 7C F9 72 51 09 6F AD
##$RELAX= 
##$RELAX= 
##$RELAX= 
##$RELAX= 
##$RELAX= 
##$RELAX= 
$$ Bruker specific parameters
$$ --------------------------
##$DU= <F:/spectra>
##$EXPNO= 1
##$NAME= <H-F>
##$PROCNO= 1
##$TYPE= <nmr>
##$USER= <she>
##$AMP= (0..31)
100 100 100 100 100 100 100 100 100 100 100 100 100 100 100 100 100 100 
100 100 100 100 100 100 100 100 100 100 100 100 100 100 
##$AQSEQ= 0
##$AQ_mod= 1
##$AUNM= <au_zg>
##$AUTOPOS= <>
##$BF1= 200.13
##$BF2= 200.13
##$BF3= 200.13
##$BF4= 200.13
##$BF5= 200.13
##$BF6= 200.13
##$BF7= 200.13
##$BF8= 200.13
##$BYTORDA= 1
##$CFDGTYP= 0
##$CFRGTYP= 5
##$CHEMSTR= <none>
##$CNST= (0..31)
1 1 145 1 1 1 1 1 1 1 1 1 1 1 1 1 1 1 1 1 1 1 1 1 1 1 1 1 1 1 1 1 
##$CPDPRG= <>
##$CPDPRG1= <>
##$CPDPRG2= <>
##$CPDPRG3= <>
##$CPDPRG4= <mlev>
##$CPDPRG5= <mlev>
##$CPDPRG6= <mlev>
##$CPDPRG7= <mlev>
##$CPDPRG8= <mlev>
##$CPDPRGB= <>
##$CPDPRGT= <>
##$D= (0..31)
0 1.2 0 0 0 0 0 0 0 0.06 0 0.03 0 0 0 0 0.0002 0 0 0 0 0 0 0 0 0 0 0 0 
0 0 0 
##$DATE= 1725884730
##$DBL= (0..7)
120 120 120 120 120 120 120 120 
##$DBP= (0..7)
150 150 150 150 150 150 150 150 
##$DBP07= 0
##$DBPNAM0= <>
##$DBPNAM1= <>
##$DBPNAM2= <>
##$DBPNAM3= <>
##$DBPNAM4= <>
##$DBPNAM5= <>
##$DBPNAM6= <>
##$DBPNAM7= <>
##$DBPOAL= (0..7)
0.5 0.5 0.5 0.5 0.5 0.5 0.5 0.5 
##$DBPOFFS= (0..7)
0 0 0 0 0 0 0 0 
##$DE= 6
##$DECBNUC= <off>
##$DECIM= 24
##$DECNUC= <off>
##$DECSTAT= 4
##$DIGMOD= 1
##$DIGTYP= 9
##$DL= (0..7)
0 120 120 120 120 120 120 120 
##$DP= (0..7)
150 150 150 150 150 150 150 150 
##$DP07= 0
##$DPNAME0= <>
##$DPNAME1= <>
##$DPNAME2= <>
##$DPNAME3= <>
##$DPNAME4= <>
##$DPNAME5= <>
##$DPNAME6= <>
##$DPNAME7= <>
##$DPOAL= (0..7)
0.5 0.5 0.5 0.5 0.5 0.5 0.5 0.5 
##$DPOFFS= (0..7)
0 0 0 0 0 0 0 0 
##$DQDMODE= 0
##$DR= 18
##$DS= 0
##$DSLIST= <SSSSSSSSSSSSSSS>
$$ [...]
##$SUBNAM2= <"">
##$SUBNAM3= <"">
##$SUBNAM4= <"">
##$SUBNAM5= <"">
##$SUBNAM6= <"">
##$SUBNAM7= <"">
##$SUBNAM8= <"">
##$SUBNAM9= <"">
##$SW= 24.0689170037331
##$SWIBOX= (0..15)
0 0 2 0 0 0 0 0 0 0 0 0 0 0 0 0 
##$SW_h= 4816.95568400771
##$TD= 16384
##$TD0= 1
##$TE= 0
##$TE2= 300
##$TE3= 300
##$TEG= 300
##$TL= (0..7)
0 120 120 120 120 120 120 120 
##$TP= (0..7)
150 150 150 150 150 150 150 150 
##$TP07= 0
##$TPNAME0= <>
##$TPNAME1= <>
##$TPNAME2= <>
##$TPNAME3= <>
##$TPNAME4= <>
##$TPNAME5= <>
##$TPNAME6= <>
##$TPNAME7= <>
##$TPOAL= (0..7)
0.5 0.5 0.5 0.5 0.5 0.5 0.5 0.5 
##$TPOFFS= (0..7)
0 0 0 0 0 0 0 0 
##$TUNHIN= 0
##$TUNHOUT= 0
##$TUNXOUT= 0
##$USERA1= <user>
##$USERA2= <user>
##$USERA3= <user>
##$USERA4= <user>
##$USERA5= <user>
##$V9= 5
##$VALIST= <valist>
##$VCLIST= <CCCCCCCCCCCCCCC>
##$VD= 0
##$VDLIST= <DDDDDDDDDDDDDDD>
##$VPLIST= <PPPPPPPPPPPPPPP>
##$VTLIST= <TTTTTTTTTTTTTTT>
##$WBST= 1024
##$WBSW= 4
##$XGAIN= (0..3)
0 0 0 0 
##$XL= 0
##$YL= 0
##$YMAX_a= 735046
##$YMIN_a= -534194
##$ZGOPTNS= <>
##$ZL1= 120
##$ZL2= 120
##$ZL3= 120
##$ZL4= 120
##$ABSF1= 10
##$ABSF2= 0
##$ABSG= 5
##$ABSL= 3
##$ALPHA= 0
##$AQORDER= 0
##$ASSFAC= 0
##$ASSFACI= 0
##$ASSFACX= 0
##$ASSWID= 0
##$AUNMP= <proc_1d>
##$AZFE= 0.1
##$AZFW= 0.1
##$BCFW= 1
##$BC_mod= 2
##$BYTORDP= 1
##$COROFFS= 0
##$CY= 11.3945322036743
##$DATMOD= 1
##$DC= 2
##$DFILT= <>
##$DTYPP= 0
##$F1P= 15.6554695791079
##$F2P= 12.8336369535428
##$FCOR= 0.5
##$FTSIZE= 0
##$FT_mod= 4
##$GAMMA= 1
##$GB= 0.15
##$INTBC= 1
##$INTSCL= 1
##$ISEN= 128
##$LB= 0.24
##$LEV0= 0
##$LPBIN= 0
##$MAXI= 10000
##$MC2= 0
##$MEAN= 0
##$ME_mod= 0
##$MI= 1.114404
##$NCOEF= 0
##$NC_proc= 0
##$NLEV= 6
##$NOISF1= 3.799351
##$NOISF2= 2.8
##$NSP= 1
##$NTH_PI= 0
##$NZP= 0
##$OFFSET= 15.70392
##$PC= 1
##$PHC0= -25990.51
##$PHC1= 7.58748
##$PH_mod= 1
##$PKNL= yes
##$PPARMOD= 0
##$PSCAL= 0
##$PSIGN= 0
##$REVERSE= no
##$SF= 200.130013532006
##$SI= 16384
##$SIGF1= 3
##$SIGF2= 2
##$SINO= 400
##$SIOLD= 16384
##$SREGLST= <1H.CDCl3>
##$SSB= 0
##$STSI= 0
##$STSR= 0
##$SW_p= 3612.71676300578
##$SYMM= 0
##$S_DEV= 0
##$TDeff= 0
##$TDoff= 0
##$TI= <>
##$TILT= no
##$TM1= 0
##$TM2= 0
##$TOPLEV= 0
##$USERP1= <user>
##$USERP2= <user>
##$USERP3= <user>
##$USERP4= <user>
##$USERP5= <user>
##$WDW= 1
##$XDIM= 8192
##$YMAX_p= 0
##$YMIN_p= 0
$$ End of Bruker specific parameters
$$ ---------------------------------
##NTUPLES= NMR FID
##VAR_NAME=  TIME,          FID/REAL,        FID/IMAG
##SYMBOL=    X,             R,               I
##VAR_TYPE=  INDEPENDENT,   DEPENDENT,       DEPENDENT
##VAR_FORM=  AFFN,          ASDF,            ASDF
##VAR_DIM=   8192,          8192,            8192
##UNITS=     SECONDS,       ARBITRARY UNITS, ARBITRARY UNITS
##FACTOR=    0.0002076,     1,               1
##FIRST=     0,             0,               0
##LAST=      1.7004516,     0,               0
##MIN=       0,             -534194,         0
##MAX=       1.7004516,     735046,          0
$$ Real data points
##PAGE= N=1
##DATA TABLE= (X++(R..R)), XYDATA
$$ [...]
2428c2n06p13l24O6L03N50J133J213Q00M81L05q87r23j439j564j447q88k34L72
2447c734R47J732J771J627J115O69k59p40j481j588j742j007p37l2Q55J054J500
2464e0J278R52L94m37m80j318j279j093k65r0O00J168J196J431J069M82l87j111
2482B060j477j416j846q33j74K07R18J350J619J597Q85P52k57n95j314j338j273
2499a135j146l57P5O20O63J264Q56N66L02m53q29n46n41l11O5J31O12Q14O76N35
2519A861Ol73q06j015j103p53o94K90P40Q32J241R86J319L01K1o68j039j223j341
2538a418q42m09K98Q11Q98J268J111M93K1l43r62j462r47q17l43J73N58J581J564
2557A233J250P22L52n98j197j526j765j433r74j96N52J442J341J880J715J036
$$ plain form
2428 -32 -538 -1251 -1575 -1509 -1206 -656 477 1690 2490 2971 3276 2389 1466 27 -1537 -2984 -3872 -4106 -3734
2447 -3734 -2787 -1055 716 2343 3458 4127 3868 3128 1647 59 -1683 -2690 -3427 -3459 -2604 -1550 -50
2464 -50 1228 2180 2574 2137 1657 339 -940 -2033 -2298 -2388 -1788 -620 576 2007 3076 3558 3171 2060
2482 2060 583 -833 -2679 -3512 -3686 -3479 -2561 -1211 408 2005 2890 3642 3385 2790 1476 138 -1135
2499 -1135 -2281 -2638 -2563 -1943 -1280 -16 840 1406 1708 1255 426 -120 -661 -972 -907 -776 -164 650 1326 1861
2519 1861 1867 1494 688 -327 -1430 -2183 -2877 -2587 -1847 -1015 226 1212 2531 2832 2853 2185 1146 -77 -1418
2538 -1418 -2260 -2669 -2371 -1560 -662 606 1717 2210 2231 1888 926 -536 -1483 -2300 -2643 -2470 -1912 -331 1233
2557 1233 2483 3205 3557 2959 1762 236 -1529 -2962 -3936 -4132 -3580 -2138 -797 1083 2798 3834
2573C834M13o86j093j443j859j323j242k35K07J226J436J423J037J096K36o97
2589B330p80j272j230o25q29P2N79Q32J103Q93J046J90k71o50j106r07j017m41
2607b083j90N12N35Q68Q35R20L86P9m68m88o59o90n29k13k5K58M48O10M10K49
2627G65k7m75J3n05k57l5o0L86L60L22M12J21R1l30o93o26o04l73j8PO27P42Q82
2650G25P69K99K50l54o29p19j246n64l86l79N15P34N40J127Q16L69J07m13m59
2669A102j044q03p11l41n3L97P23Q14O61O45M88p8n52m99p40r36n36k39J28J34
2689a440Q08O42P25M48L47R6l80p17m58l34q64j68j68K51K62N84P11K62Q4J52
2709H43J1rl33n07k52l21j17J18j4JQ3L02J26L22o8Q5L07N4k32P5k40k31k33k51
$$ plain form
2573 3834 4247 3561 2468 1025 -834 -2157 -3399 -3634 -3427 -2201 -765 658 1695 2791 3027 2330
2589 2330 1550 278 -952 -1577 -2406 -2334 -1755 -923 180 1073 2119 2309 2038 1388 282 -625 -1642 -2083
2607 -2083 -2273 -1761 -1226 -358 477 1397 1783 1862 1394 906 247 -443 -972 -1185 -1210 -952 -504 106 516 765
2627 765 738 263 276 -229 -486 -521 -581 -195 165 487 899 1020 1111 781 88 -538 -1142 -1515 -1533 -1526 -899 -157 725
2650 725 1494 1793 2043 1689 1060 341 -905 -1469 -1855 -2234 -1719 -985 -445 682 1498 1867 1974 1561 1102
2669 1102 58 -745 -1456 -1797 -1850 -1453 -730 84 745 1390 1878 1800 1248 749 9 -927 -1463 -1702 -1574 -1440
2689 -1440 -632 10 735 1183 1530 1626 1246 529 71 -263 -1127 -1295 -1463 -1212 -950 -366 345 607 691 843
2709 843 854 845 512 5 -247 -568 -685 -567 -581 -580 -497 -195 -69 253 185 270 577 631 399 474 234 3 -230 -481
2733d81j56J2j02K01R2P09K69N0J60q8R4k71k81n33l08j35j58K76O9N12M27L12
2755F70L90l25qm18l57l84k03l35R9l3M23L82N21J82M82k9l91l27m13j40m82Q7
2777f09Oj07L60J76N42O2J73J21q7k90k78o8l93m7q4R4J28K52K24k20P7J79k68
2800e7L95j88j07n7J19J14j26J25n5l03k29m3l00J55m9K63K43L54L34J48J38k24
2822F50ok29n14m14n62M1J12K16M98M84P8L85Q0rq2n35l40l92l23J15J53K29K29
2845a36N04L18K74j41l16l69n78k40n63J63k8M47M88O40L97N07J25o1k65m95r41
2866b70p16k72k08R8K10M28N25N75N27K32J9p8m58l73m76j49k95J09K55J27K10
2887B0J24R5M6j99l48k53O3k25k4M00K45O00K65L84LPk72p35l40o66m65k82R2
$$ plain form
2733 -481 -637 -625 -727 -526 -434 275 544 594 754 666 760 489 208 -325 -633 -768 -926 -650 -581 -69 358 670
2755 670 1060 735 727 309 -48 -432 -635 -970 -871 -904 -481 -99 422 604 1086 1057 666 339 -74 -214 -696 -609
2777 -609 -603 -710 -350 -174 368 430 603 724 637 347 69 1 -392 -439 -523 -429 -301 -49 175 -45 32 211 -57
2800 -57 338 150 43 -14 105 219 93 218 163 -140 -369 -412 -712 -557 -606 -343 -100 254 588 736 874 650
2822 650 644 415 -99 -513 -1075 -1034 -922 -706 -208 276 354 739 819 810 728 193 -147 -539 -862 -747 -594 -365 -136
2845 -136 368 686 960 819 503 134 -444 -684 -1247 -1084 -1112 -665 -177 463 860 1367 1492 1431 1166 671 -270
2866 -270 -986 -1258 -1466 -1368 -1158 -730 -205 370 897 1129 1148 1070 612 239 -237 -386 -681 -572 -317 -190 20
2887 20 144 239 285 86 -262 -515 -452 -677 -701 -301 -56 544 809 1193 1196 1203 931 196 -144 -810 -1275 -1557 -1465
2910a465K64M01L22P99N13O7L98q6j70m33m28l88l7k63k5k5M69K1j10Q9j9l24
2932d30j34j09N5J53L29L84N99J19N40J24l69l55n33n62o21o02j67M2N6K27N00
2953g54P61O54L86M47J23j20m39k95o83k94l52k05J47m5R0J07J10J83l03J77m6
2974c51J45J80R8L41N05J99k5N5K18o73k67o58q17l95k61l8j83M33M94Q07P83
2995E90M96L97K18j59k02j50o79l55m85l64l69j18L42l31L79L32J49J46L9K57
3015A33m0K83K71K74K42J25p0n9l38n83m91o65n24l12k03L8L57N15O15R79O74
3036A221M49K02K47k48m13o35o67n87o26k44k20J30M24J54J36M30K81K21K03j04
3056C54J10J89K93O4L3j3j67L0n25l70p13l09m14n59J73J97M62N94Q14Q47N67
$$ plain form
2910 -1465 -1201 -800 -478 321 834 901 1299 1213 1043 610 182 -206 -243 -506 -531 -556 -87 -66 -176 -87 -106 -430
2932 -430 -564 -673 -618 -465 -136 248 847 966 1506 1630 1261 906 373 -189 -810 -1412 -1579 -1537 -1481 -1254 -754
2953 -754 7 661 1047 1494 1617 1497 1058 763 80 -214 -566 -771 -624 -669 -579 -472 -362 -179 -482 -305 -351
2974 -351 -206 -26 72 413 918 1117 1092 1147 1365 692 425 -233 -1050 -1445 -1706 -1744 -1927 -1494 -1000 -193 590
2995 590 1086 1483 1701 1542 1340 1190 511 156 -329 -693 -1062 -1180 -838 -1169 -790 -458 -309 -163 -124 133
3015 133 93 376 647 921 1163 1288 1218 1159 821 238 -253 -918 -1442 -1754 -1957 -1919 -1562 -1047 -432 547 1221
3036 1221 1670 1872 2119 1871 1458 823 156 -431 -1057 -1301 -1521 -1391 -967 -813 -677 -247 34 255 458 354
3056 354 464 653 946 1010 1043 1030 863 893 368 -2 -715 -1024 -1438 -1997 -1824 -1627 -1165 -571 243 1090 1657
3077A657N28k4R0n82o56o46q96n78m40k86m3L27L32L62N78K65M85K45L09j37o6
3098H24J05p1p7k39k6j83n5l33p00k56n05J2k27K84L61M71O94Q39O07L89J84J48
3120B246n38o47o74o57m84n76m03m2o5N03N01L63M27L84M21J27L0K8P3k40K10
3141I87l98ok83l25l15m39j26m63jj89L12K95O04O80O15L40L84K38j2n88m27p73
3163A10n29o78l68k62K96J16K47N66M66N34l8L37j86l4L2k75K30j53j57K15k04
3184B65j57j58m79k25j69l85Q6N4L68M24M73O09M69M86P2M2l47o85n22q13n65
3205a157n34j2j27M78N92M45O20K33N44J52k2m12j19j77n14k3j36k13K05J8l1
3226a90j58q5k3j43O2P0k5M34K79L26K65K51J46j76k87k59l11q01j56j84k41j14
$$ plain form
3077 1657 2185 2161 2251 1669 1013 367 -529 -1107 -1547 -1833 -1876 -1549 -1217 -855 -277 -12 473 718 1027 890 824
3098 824 929 858 781 542 516 333 278 -55 -755 -1011 -1516 -1504 -1731 -1447 -1086 -615 79 918 1525 1914 2098 2246
3120 2246 1708 1061 387 -270 -754 -1330 -1733 -1775 -1840 -1337 -836 -473 -46 338 759 886 916 944 1017 777 987
3141 987 589 583 300 -25 -340 -779 -905 -1368 -1369 -1558 -1246 -951 -347 333 948 1288 1672 1910 1898 1310 883 110
3163 110 -419 -1097 -1465 -1727 -1431 -1315 -1068 -502 -36 498 460 797 611 577 609 334 564 411 254 469 265
3184 265 108 -50 -529 -754 -923 -1308 -1222 -1168 -800 -376 97 706 1175 1661 1733 1775 1428 743 221 -592 -1157
3205 -1157 -1691 -1703 -1830 -1352 -760 -315 305 538 1082 1234 1212 800 681 504 -10 -33 -169 -382 -177 -159 -190
3226 -190 -348 -433 -456 -599 -537 -467 -492 -58 221 547 812 1063 1209 1033 746 487 176 -625 -781 -965 -1206 -1320
3248a320M80K61K76N90M09K01O1n0l15j41j76j94j70n9l36O5k07K38l0J12j87
3269d92K80J35p7K12J36K75J12L96l35l8n7l29k44m79k38k30J40r2J70M13K70
3290g2N38J58K79L3r4j6m60k07k39l71j56o6j1J43P0L3L16l4M05j70L44J7M4P8
3314E62K6j65p0k70m7k41o7l13l00M12m75K86L06K34M54N5L87J17J4p2j8m78j85
3337A52m63m13Qk17J65k21J21M20N1M14J53K88L63k47K54j11j46K70l72k84k28
3358d3l92m4m49j96n3J83J26L32L39M61K56N03J34K22J6l35j64o06n18m69l37
3379a034l04k43M2K23K86N79K43N54M98N41j45K07K3k95l25l27l77o02k49l37
3399a042k65q0J5J47J43L48M69O62M11K43M13L0J1J51n67k78o35m98n26l88k93
$$ plain form
3248 -1320 -840 -579 -303 287 696 897 958 908 593 452 276 82 -88 -147 -483 -418 -625 -387 -417 -305 -492
3269 -492 -212 -77 -154 58 194 469 581 977 642 604 547 218 -26 -505 -743 -973 -833 -925 -755 -342 -72
3290 -72 466 624 903 936 842 826 366 159 -80 -451 -607 -673 -684 -541 -471 -438 -122 -156 249 79 423 440 484 562
3314 562 588 423 353 83 36 -205 -272 -585 -885 -473 -948 -662 -356 -122 332 387 774 891 905 833 815 337 152
3337 152 -311 -724 -716 -933 -768 -989 -868 -448 -397 17 170 458 821 574 828 717 571 841 469 185 -43
3358 -43 -435 -479 -928 -1124 -1177 -994 -868 -536 -197 264 520 1023 1157 1379 1395 1060 896 290 -228 -697 -1034
3379 -1034 -1338 -1581 -1539 -1316 -1030 -451 -208 346 844 1385 1240 1447 1470 1175 850 523 146 -456 -705 -1042
3399 -1042 -1307 -1387 -1372 -1225 -1082 -734 -265 397 808 1051 1464 1494 1505 1656 1089 811 176 -322 -848 -1236 -1529
3420a529j71p6Q7M32O53L38N66P71L38L05J84j54j26l46o30n55q03l24n89k41
3440a870p1N8J95O36M03O97M69O11N83J71M3J56n08l17l45r20q57k48n80j23l26
3461b143N3L22O42M72M45J106L13N00L55R1k40j17m97o93o63q30n40m46n15J75
3481b210J88J93M85O82P01O24O69P61J97n4J66n35o21o11p57p49n21o82m34j1
3501b519L92L43P13L03J054Q33O53N10j4Q0j76n24n52q15q36m45m89m20j54l05
3521b368J73N86L43O20M91P72P79L50M18J59K92l11n31q23p11p83j058q04m64
3540b870M5r7O00O36R73Q15J304P14M41N33m32q9p71o93r57p68q50n31n43qQ5
3561b463L91N01O53Q10P54L90N55L69J24K9j93m07p01l33n06p43o75n37j63j43
$$ plain form
3420 -1529 -1700 -1776 -1689 -1257 -604 -266 300 1071 1409 1714 1898 1744 1618 1272 642 87 -716 -1040 -1629 -1870
3440 -1870 -1941 -1883 -1688 -1052 -649 48 517 1128 1711 1882 1925 2081 1573 1256 911 -9 -866 -1114 -1694 -1817 -2143
3461 -2143 -2090 -1768 -1126 -654 -209 897 1210 1710 2065 2156 1916 1799 1302 609 -54 -884 -1424 -1870 -2385 -2210
3481 -2210 -2022 -1829 -1344 -662 39 663 1332 2093 2290 2236 2402 1867 1246 635 -122 -871 -1392 -2074 -2508 -2519
3501 -2519 -2127 -1784 -1071 -768 286 1119 1772 2282 2268 2348 2172 1648 1096 281 -555 -1000 -1489 -1909 -2063 -2368
3521 -2368 -2195 -1609 -1266 -646 -155 617 1396 1746 2164 2323 2615 2304 1773 950 239 -544 -1602 -2406 -2870
3540 -2870 -2825 -2922 -2322 -1686 -713 102 1406 2120 2561 3094 2662 2573 1802 1109 152 -616 -1466 -1997 -2540 -2548 -2463
3561 -2463 -2072 -1571 -918 -108 646 1036 1591 1960 2084 2113 1920 1513 812 479 -27 -770 -1445 -1982 -2145 -2288
3581b288J11M03L79N44P39R96O69M66L81K59k68m41n21o89p58q35n73o33k29n35
3601b823L14L80M96R52Q05P80Q41O75N00M5k18o70o69q00j110r56q58m86k88J68
3621b922Q23N94P31J260O63O02M67K65j23l96n37p12n98m61l86m30n6qk7k29L20
3642a160L83j57K54K44M61M36L45O17L81K57L5j52n61p07q69j040r07m59k40j33
3662b972M83O77J109J107Q87R50N09qon45n65r83q68r66l33n57j89M46R3L96O04
3683g31P59K55N99K26K75O7j93j13J8l61k14l01m53l63l83l08m3k31K17J11J22
3704a045O81K95O20N38L10J51J06k40n7p23n20l99k12n20o6j70p1k0K49K27L74
3725d92M95K58O49K09L57K12k6k70m62k65q81l93o53l89j39mK37N66N26Q65L63
$$ plain form
3581 -2288 -2177 -1774 -1395 -851 -112 884 1553 2019 2400 2659 2391 1950 1429 740 -18 -853 -1426 -2059 -2288 -2823
3601 -2823 -2509 -2129 -1633 -681 124 904 1745 2420 2920 2965 2747 2077 1408 608 -502 -1458 -2316 -2802 -3090 -2922
3621 -2922 -2099 -1505 -774 486 1149 1751 2218 2483 2360 1964 1427 715 117 -344 -730 -1160 -1216 -1224 -1251 -1480 -1160
3642 -1160 -777 -934 -680 -436 25 461 806 1423 1804 2061 2096 1944 1383 676 -193 -1233 -2140 -2599 -2839 -2972
3662 -2972 -2489 -1812 -703 404 1291 2241 2750 2742 2736 2191 1626 643 -225 -1191 -1524 -2081 -2270 -1824 -1731 -1335 -731
3683 -731 28 283 882 1108 1383 1450 1257 1144 1162 801 587 286 -167 -530 -913 -1221 -1264 -1495 -1278 -1167 -1045
3704 -1045 -364 -69 551 1089 1399 1550 1656 1416 1359 636 116 -283 -495 -1015 -1081 -1251 -1322 -1342 -1093 -866 -492
3725 -492 3 261 910 1119 1476 1688 1662 1392 930 665 -216 -609 -1262 -1651 -1790 -1794 -1557 -991 -465 400 763
3746G63M83K94K39l97j17n31p23m35l58k34k10L96L5L49J7N91q4K23k35nj22j0
3768g1J27J16%K86L19qJ41k73l52m96l90m96nk48K01K49O15M69N92L09L21p1j72
3791A163k14o91n27n19l05j63K63M18J06N50N84K2L12j99k99m01k34l02j16m5
3811e97K54K14M58j40M90J5ol01n37l60j22l78K56J07N1P89L03L05J21l1r4l44
3833D53n98l79l68k65J40Q7M38M15P68R5L52j55N5k73l54o17m57l98k03L08L41
3854f15K00M07L54J62N59k56q9o8l64k72j68K8mp2j12K44j38k9j95J03n4M5J80
3877a54l1L66L85K34O1J29l53j49l88l17k88l96r0q9M88Q7O25L23J46j7Kl01k63
3900A0k67k68L6J34M57J55L54M16K45m66l29o64p28o42m84L2o0J148N91J261R18
$$ plain form
3746 763 1246 1540 1779 1382 1265 734 11 -424 -782 -1016 -1226 -830 -795 -446 -429 162 78 301 66 61 -61 -71
3768 -71 56 172 172 458 777 769 910 637 285 -211 -601 -1097 -1102 -1350 -1149 -900 -285 184 776 1085 1406 1335 1163
3791 1163 949 258 -269 -788 -1093 -1256 -993 -575 -469 81 665 687 999 800 501 100 -134 -436 -552 -597
3811 -597 -343 -129 329 189 679 694 688 387 -150 -510 -632 -1010 -754 -647 -596 193 496 801 922 891 797 453
3833 453 -145 -524 -892 -1157 -1017 -930 -492 -77 691 786 1138 983 1038 765 411 -206 -663 -1061 -1264 -956 -615
3854 -615 -415 -8 346 508 1067 811 722 654 290 18 -150 -122 -126 -198 -310 -66 -204 -233 -428 -325 -379 -334 -154
3877 -154 -185 181 566 800 861 990 637 488 100 -217 -505 -901 -991 -1080 -592 -505 120 443 589 572 574 273 10
3900 10 -257 -525 -489 -355 102 257 611 1027 1272 806 477 -187 -915 -1557 -2041 -2009 -2069 -921 -330 931 1849
3921A849P27K47r3m11j199j313j095j046p15l4M24P46R55J335J153Q01J10O9n04
3940B006q55r40j017n87k41J41M47L55O59O59L62J21m76m44p00o24m41J61J45
3959a269N48R18R07P36K77K69o21k45r12j167j045n79l37J35M14O27J053Q51N87
3978A147O56K20j31l13l42p05m58m23l27j45K1n7o4mj2P5J74Q7J62N80M95N01
4000A137M46J70J05l22m80o93q00r54l94j45M5L23M40P92P25M64M17M3k58l55
4020G06l78n39rj66K25K13K73N15K6l15k73n23n67q85m47p6K96Q89J060Q69J057
4041A951O47L82J5q09p78j208j333r81n95k83K83P85R48R20J299M43M04j02m00
4060A588l74q10q39j29n6k08O21K55M44P3k00k16m38m02n86k29m3N64P11N82R73
$$ plain form
3921 1849 2576 2823 2730 2319 1120 -193 -1288 -2334 -3049 -3083 -2659 -1913 -958 377 1530 2331 2441 2510 2006
3940 2006 1151 211 -806 -1393 -1634 -1493 -1046 -691 -32 627 989 1110 634 190 -510 -1134 -1575 -1414 -1269
3959 -1269 -721 197 1104 1840 2117 2386 1765 1520 608 -559 -1604 -2183 -2520 -2385 -1971 -1344 -291 560 1147
3978 1147 1803 2023 1892 1579 1237 532 74 -349 -676 -821 -800 -857 -921 -925 -937 -862 -688 -601 -439 141 636 1137
4000 1137 1583 1753 1858 1536 1056 363 -437 -1391 -1785 -1930 -1885 -1562 -1122 -330 395 859 1276 1319 1061 706
4020 706 328 -211 -220 -386 -161 52 325 840 866 551 278 -245 -812 -1697 -2144 -2220 -1924 -1035 25 894 1951
4041 1951 2598 2980 2995 2186 1408 200 -1133 -2114 -2709 -2992 -2709 -1924 -976 -56 1243 1686 2090 1988 1588
4060 1588 1214 404 -435 -564 -620 -828 -207 48 492 565 365 149 -289 -691 -1277 -1506 -1549 -985 -274 308 1281
4081A281L25N13J40k83o67r33q66q30m87l43O2M09N03P48P92N61L08J04j82m4
4101A111n63j49m63j29l2k4J72J3K2k50J07l65m59J17P6M7K18N44N80M11L76l9
4123A321J22k15n50l58o38m40j20j82O0R5K52O3M45L29K8n3m1J68K03K11M7Q2
4145H29L0k04k42j48n75l98n69l74M6K62L95N44P20Q96L92J32Q8l49o11o98o03
4166d37o15n72J03K18L05O81M92N58L89j91l30k82o06l11m35k20M43N27M43N70
4186G30N16L30j94l50m55o45n26r47l94J57nQ20N90R30N65N85L37j08m15l80q22
4207C19p04p21l16n4o2L92J18O95M45L16N41j5j0n5k52k37l41k36j15j93j83o5
4229g33J65K74l3L81L96R5J85k7k36l45j66m06k05j86p8L48J57M54N77J85N45
$$ plain form
4081 1281 1606 2119 2259 1976 1309 376 -490 -1320 -1807 -2150 -2088 -1679 -1176 -428 364 925 1233 1337 1155 1111
4101 1111 548 399 -64 -193 -225 -249 -77 -64 -42 -292 -185 -550 -1009 -892 -816 -769 -551 -7 573 984 1360 1321
4123 1321 1443 1228 678 320 -318 -758 -878 -1060 -1000 -905 -653 -590 -145 184 212 159 118 286 489 700 747 829
4145 829 859 655 413 265 -310 -708 -1277 -1651 -1605 -1343 -948 -404 316 1212 1604 1736 1824 1475 864 166 -437
4166 -437 -1052 -1624 -1521 -1303 -998 -317 175 733 1122 931 601 319 -287 -598 -1033 -1253 -810 -283 160 730
4186 730 1246 1576 1382 1032 577 -68 -594 -1541 -1935 -1778 -1783 -963 -373 557 1122 1707 2044 1936 1521 1141 319
4207 319 -385 -1106 -1422 -1476 -1538 -1146 -1028 -333 112 428 969 954 944 889 637 400 59 -177 -292 -485 -668 -733
4229 -733 -568 -294 -327 54 450 545 730 703 467 122 -44 -450 -655 -841 -919 -571 -414 40 617 802 1347
4250A347n8p0m25o95p31n55l63k29J8N45M93P48R28P73L02J55l12r19r11o01q11
4271a371p67O9J77N18Q23N67J090O37L71j31m48p30q12q94p80k41N3N06M16R28
4291a9O41O67M28N5l68m76q32n80n72n16K13q3O61M22N53O15L42J81M8k21m58
4312G01q29m03j88n56J02L5N92K74M26L50K29J03K05k09l39k50k77k23l24o2q6
4333g29K00J2K53J93K23L45J84P0q4O1l27j13o23j1l85k26J43L76J34L34M55J83
4355F68J29N8j35j33k08l65m68l29j05J09k0L51J64P37K11J01K55l87J13m38l73
4376f5m49n6l16L5J52L33K01O02K33K06k00P7k89m43m05k24l07J00J8K87M71N81
4398E42R1L29O3Rm66l94m47m40j83l29J72K33L08N40L74K39M49k36n1k95l08n01
$$ plain form
4250 1347 1289 1219 794 99 -632 -1187 -1550 -1779 -1761 -1216 -723 25 953 1726 2028 2183 1871 952 41 -560 -1371
4271 -1371 -2138 -2069 -1892 -1374 -551 16 1106 1743 2114 1983 1535 805 -7 -901 -1681 -1922 -1869 -1363 -947 -19
4291 -19 622 1289 1717 1772 1404 928 96 -484 -1056 -1572 -1359 -1442 -781 -359 194 809 1151 1332 1380 1159 701
4312 701 -128 -531 -719 -1275 -1173 -1138 -546 -272 154 504 733 836 1041 832 493 243 -34 -257 -581 -643 -729
4333 -729 -529 -517 -264 -71 152 497 681 751 667 728 401 288 -335 -346 -731 -957 -814 -438 -304 30 485 668
4355 668 797 855 720 587 379 14 -454 -783 -888 -779 -799 -448 -284 453 664 765 1020 633 746 308 -65
4376 -65 -514 -570 -886 -851 -699 -366 -165 437 670 876 676 753 464 21 -384 -608 -915 -815 -797 -510 -39 542
4398 542 633 962 1025 1034 568 174 -273 -713 -896 -1225 -1053 -820 -512 28 402 641 1090 854 803 508 200 -301
4420c01p9k97j13J28K73L00M27N8J80J61m87j88j94k82l39j39L05J89M60L12M45
4441H19J44J44j87n29m74l64k79o72Q1L40L36M13K73M59N63J42l14j35k88p76
4461c04k40l55j76J24N53P0N09K49L79j22k35l93l15k52lk75J84N43J94K98J74
4482F07L63q0J83o15n64l56o59k28J76J46L73L70O47K08N17k33J51j53n54l98
4502i9j72M9j67j41K89K50k54nN9j82Mj2k52K67J60N30L93K39J72j2r0l98o27
4525An68m58m29k4R7M55N99N00M70M34K05k30k55n61l84m14n58L4M75L48O33N35
4547I05J40K45l03m81r54o72n65l84J54K24R76J128J015P59N71l1l65q27j283
4566B52j099r70q06k95L58P45R45R84J280N79L58j59l61o99q49r40q80j06J91
$$ plain form
4420 -301 -380 -677 -790 -662 -389 -89 338 396 576 737 250 62 -132 -414 -753 -892 -587 -398 62 374 819
4441 819 963 1107 920 391 -83 -447 -726 -1398 -1317 -977 -641 -228 45 504 1067 1209 895 760 472 -304
4461 -304 -544 -899 -1075 -951 -398 -328 181 430 809 687 452 59 -256 -508 -511 -786 -602 -59 135 433 607
4482 607 970 890 1073 458 -106 -462 -1121 -1349 -1173 -1027 -654 -284 363 571 1088 855 1006 853 299 -99
4502 -99 -271 -222 -389 -530 -241 9 -245 -250 -191 -373 -369 -381 -633 -366 -206 324 717 956 1128 1116 1026 628 1
4525 1 -567 -1025 -1454 -1478 -1381 -926 -327 173 643 1077 1282 1052 797 236 -148 -562 -1120 -1086 -611 -263 370 905
4547 905 1045 1290 987 506 -448 -1120 -1685 -2069 -1915 -1691 -715 413 1428 2187 2758 2727 2362 1535 252
4566 252 -847 -1817 -2623 -2918 -2560 -1815 -870 114 1394 1973 2331 2172 1811 1112 263 -677 -1557 -1663 -1472
4585a472L13P09M87O46K80P8j95o35n24l46l93k08K97L63N65P90N90K09o3J5p15
4606G91n59n56q44l53O4K1K23M22Q24K34O07K01l25q6p3O6m66J41m8j87J34j18
4628A13l28j91l95j38m43mL58k3P64P81N87L64M25j18l4p03m64j051q86k94k16
4649a896L78K61N53P90M17M72R6Rk83m86n76o1l30J30K08M30M90J59N19j05n56
4670F19p09n18p60l87j39j18N40Q93Q49R17R85q7P7l0p43j123p55q97n52m2n9
4691b039M97M53P97O60N13N4K28n8m57r5o20p0P2j85L14K79n6k05Q3k41m21k73
4713g70Mk31l3K52L78M15N96L42M63j3k13m02k57o94m10l16j94k2K80K41J78L16
4735i0J36K95J2M1j93J0m5L07j45J74l0J52k23j77k64m05j71m73n0J34O2L76M90
$$ plain form
4585 -1472 -1159 -450 37 683 963 1041 846 211 -313 -659 -1052 -1260 -963 -600 -35 755 1345 1554 1491 1506 791
4606 791 232 -324 -1168 -1521 -1457 -1436 -1213 -791 33 267 874 1075 750 664 591 657 191 332 284 97 231 113
4628 113 -215 -406 -801 -939 -1382 -1386 -1028 -1051 -287 494 1081 1445 1870 1752 1718 1015 551 -500 -1386 -1680 -1896
4649 -1896 -1518 -1257 -704 86 503 975 1071 1080 797 311 -265 -326 -656 -526 -318 112 602 761 1280 1175 619
4670 619 -90 -608 -1368 -1755 -1894 -2012 -1472 -579 270 1187 2172 2085 2162 2132 1389 266 -489 -1386 -1938 -1980 -2039
4691 -2039 -1542 -1089 -292 368 881 935 1163 1105 648 553 -67 -137 -65 -250 64 343 287 82 165 -76 -497 -770
4713 -770 -766 -997 -1030 -778 -400 15 611 953 1416 1403 1190 788 531 -163 -573 -889 -1083 -1105 -825 -584 -406 -90
4735 -90 46 341 353 394 201 211 166 473 328 502 472 624 401 224 -40 -445 -616 -1089 -1139 -1005 -943 -567 -77
4758g7M99M22Q4K50J12k75m27j77o64k68j33l66K55J68J29R7J88J76n0L01j22
4779A22K77j18j55K29R6J45l2k07m7q2l82k84j87j02j98Q5J25L64J07L92L89J11
4801F48K86j40M3l39k17j66l46j81k72J25p2L9K27K44k4L50j01q7K5J72j42J1
4823H3N9J27P8m2j27P1k17K7p1m12l08J66k6K7O8K00K98L93p7M98r6J05j48k56
4847D20k94j31m79j2j39r5K9J17L78K80K76K58j50N0Qj52l03j82n0J9j02J25K33
4870A04j0KJ21p9N3l09Q0m55R4j05K98m3L40l8M61J13l69J98k02K20m96k04j51
4893c77R5l2j06O8Q1J67L4K42k8LK36r4j94J19p2N8Kq9n2Pj38nj74j03J84j36
4919c04J38J36J71oj3J85k10p6p3m9L4k08K83R1o4J59j12K38q4j01k03j59l4l13
$$ plain form
4758 -77 422 844 928 1178 1290 1015 588 411 -253 -521 -654 -1020 -765 -597 -468 -371 -183 -7 -57 244 122
4779 122 399 281 126 355 451 596 564 357 310 228 -154 -438 -625 -727 -925 -840 -715 -351 -244 148 537 648
4801 648 934 794 837 498 281 115 -231 -412 -684 -559 -631 -592 -365 -121 -145 205 104 17 42 214 72 83
4823 83 142 269 347 305 178 249 32 59 -12 -424 -732 -566 -592 -565 -497 -297 1 394 317 815 719 824 676 420
4847 420 126 -5 -484 -496 -635 -730 -701 -584 -206 74 350 608 458 508 516 364 61 -121 -171 -152 -254 -129 104
4870 104 94 96 217 138 191 -118 -38 -493 -399 -504 -206 -249 91 53 514 627 258 456 254 474 -22 -226 -377
4893 -377 -282 -314 -420 -352 -271 -104 -70 172 144 147 383 289 95 214 142 200 202 113 61 68 -70 -75 -249 -352 -168 -304
4919 -304 -166 -30 141 135 122 307 97 21 -52 -101 -67 -275 8 99 35 194 82 320 236 135 -68 -227 -261 -574
4943e74m2J02K51L0K32L94L48O9l8r6k60j38m94l34j31r2J30J41P3N23K38L6J35
4966E03k04k6l08Q1l00J99J42n0j15N89q4l2k25mk51k40j17l12j54O0K74N41K09
4989A76K53N05j87R3q8m10Km85k61l14J14M6O9J66J35J29J42m4R6p6K2o7J70K1
5013B07J80J51QQ8j65k44k54j78l94m7k59J04K3M62L32L28L64J97O4o2l36j58
5035D11k12j41j80k13L8k00J86k05K96j66j13K75O3l01N47L9J80J45L06L2J53
5056I40j53j62m70l14m00k91j00l4J63j3M07M58L01K50M06J77m80qk1l95n3m92
5078b84r7K44j68J99l29K25j76j62K08k78J82J6O08J53K71M25J79m7k92k41m03
5099B33l83m01l96l67J25j80L82N05L06O40K11K28P0p4j92k58M0k78j95n5k2k21
$$ plain form
4943 -574 -616 -514 -263 -233 -1 393 741 810 772 676 416 278 -216 -550 -681 -773 -643 -502 -429 94 332 368 503
4966 503 299 273 -35 46 -254 -55 87 37 -78 511 427 395 170 166 -85 -325 -442 -754 -908 -848 -574 -33 176
4989 176 429 934 747 840 752 342 344 -141 -402 -716 -602 -556 -487 -321 -186 -57 85 41 137 61 83 16 186 207
5013 207 387 538 546 634 469 225 -29 -207 -601 -648 -907 -803 -780 -318 14 342 706 903 967 905 569 411
5035 411 199 58 -122 -335 -297 -497 -311 -516 -220 -386 -499 -224 -161 -462 85 124 304 449 755 787 940
5056 940 787 625 155 -159 -559 -850 -950 -984 -821 -834 -427 31 332 582 988 1165 685 677 656 261 208 -284
5078 -284 -381 -137 -305 -106 -435 -210 -386 -548 -340 -618 -436 -420 188 341 612 1037 1216 1169 877 636 233
5099 233 -150 -551 -947 -1314 -1189 -1369 -987 -482 -176 464 675 903 973 899 707 449 489 211 16 -39 -61 -282
5121b82j79J7k57P8oK7QJ41K61M08K64N58QJ53j4j93n17k13m57m72l14k23j77
5144a381K46J75P10N6L18K99J68N2J36k18j12p5P9j87j16J8k16j01k04m21j39
5165i13M3l15K47J15N98K64N03L54M61K49j72j72m22o06m26k98n40j70j45J88
5185a157M28K15L00L45N17j01J59O6k35N2J09j07k79J19k24k94k44r3k40j62r7
5206i23k72K35Q2M09O23K56M77J88K08N0l11j38o77l87l83j28k94j34J21K7L50
5227f21J02L58K99J30J97m8J37K31n5m9k6r7k04k96j66n94N0k39k16J29J50N6
5249g72L36N77L27L15L19N8J01k75n37j30l38n73k27j4j27k6J93J76K06J34R3
5270a84L03K33J98r5Q5L25k55R6k3j12l72l06l50j01k42k25L06q7J74K53N08K02
$$ plain form
5121 -282 -461 -444 -701 -623 -629 -602 -594 -453 -192 216 480 1038 1046 1199 1185 992 475 262 -195 -667 -981 -1204 -1381
5144 -1381 -1135 -960 -250 -194 124 423 591 643 779 561 449 374 453 266 150 168 -48 -149 -353 -774 -913
5165 -913 -870 -1185 -938 -823 -225 39 542 896 1357 1606 1434 1262 840 234 -192 -490 -1030 -1200 -1345 -1157
5185 -1157 -729 -514 -214 131 648 547 706 772 537 589 698 591 312 431 207 -87 -331 -424 -664 -826 -923
5206 -923 -1195 -960 -878 -469 154 410 887 1075 1283 1333 1022 884 207 -180 -563 -691 -985 -1119 -998 -971 -621
5227 -621 -519 -161 138 268 465 417 554 785 730 681 655 558 354 58 -108 -702 -652 -891 -1107 -978 -828 -772
5249 -772 -436 141 468 783 1102 1160 1261 986 449 319 -19 -592 -819 -833 -960 -986 -793 -617 -411 -277 -184
5270 -184 119 352 550 455 540 865 610 706 683 571 199 -107 -457 -558 -800 -1025 -719 -806 -632 -379 129 331
5292C31K71JL84j09R7l57l73k74j03j88k30k18J61l02K06R8L69m7K23L57K26J27
5314F50J38J29k33j45m8j23k76k51j88k28p4j67j5J38Q4L73K55K49L04J38K8n3
5336F85j34Q7m86m9r1k16k75Q1j33j19N3J75J61p3J91K06O5N0K66L7K24o5j25
5359E15k74l3nk12m47j27m3j05J17J04Q7J94L12q5M48J90o5J21rj53l85j20q8
5382f3j96j54k5k73r1L15J66LM86k11M36J39j27O8rJ06k97q0o6j25k15j21P5%
5406b59j49P4n7J13J15N1K04Q5k7J04K45n6M8l7r1m08m1M1l04j70J28j01J72j02
5430d22L5K87J05M07k65J62J51r1k08P2K0l88J23k95K91o8k78J34j35L7K09J17
5452@k18K44J63n2K28k00P7n9n4K43m06K67j63j21mj9j81O3rJ22j64L52j79J44
$$ plain form
5292 331 602 603 987 878 975 618 245 -29 -132 -320 -550 -768 -607 -909 -703 -605 -236 -283 -60 297 523 650
5314 650 788 917 684 539 491 368 92 -159 -347 -575 -649 -816 -831 -693 -609 -236 19 268 572 710 738 685
5336 685 551 638 152 103 12 -204 -479 -398 -531 -650 -597 -422 -261 -334 -143 63 128 178 444 481 705 640 515
5359 515 241 208 203 -9 -456 -583 -626 -731 -614 -510 -423 -229 83 -2 446 636 571 692 683 530 145 25 -63
5382 -63 -259 -413 -438 -711 -802 -487 -321 -318 168 -43 393 532 405 473 464 570 273 193 127 2 -213 -334 -259 -259
5406 -259 -408 -334 -391 -278 -163 -112 92 177 150 254 499 443 491 454 363 -45 -86 -45 -349 -519 -391 -492 -320 -422
5430 -422 -387 -100 5 412 147 309 460 369 161 233 253 -135 -12 -307 -16 -84 -362 -228 -363 -326 -117 0
5452 0 -218 26 189 137 365 165 242 183 129 372 -34 233 70 -51 -55 -74 -255 -192 -201 -79 -243 109 -70 74
5476G4K93j96N2o6M7Kp2r1j39N9j3j83r5R7J1M5N4j10O5J70j1lJ38K05l3Qj72
5503A36Q1k9j76Q5l97J02p7Jp0J14R6k8J08R9j49K85n8J12p7L4n9Lk6jj2P9k55
5530g9n6J7o8k22L04k63L6L09n3K23N8K39r4M3rO9j90j89j93j00l91J60L8p3J73
5555c11J79rJ17J88M2j91L47J00O9m58J39j25m7J84j89j02j55j7jk95J88p8K44
5578a81J73J79j58J74J89K23q5M1k92q8j98j13k10j84N1L9k4J48P0PJ97K02J09
5601B69l0J97j19J2J50q9O7k14j16m11k2j87m8m3l5M9p4O42P1L13O3J22J59j32
5625E94j11l62N2k08j61n4j58NJ24P7q5J61Op2Kk2K36J64R9K14n4J72j64j45k04
5650A06Jl19k68l73RpJ64O4M29J57M52K43j01J06n1q0j20j37j82k28n7k95OJ05
$$ plain form
5476 74 367 171 223 157 204 206 134 43 -96 -37 -50 -233 -328 -231 -220 -175 -121 -231 -166 4 -7 -10 128 333 300 308 136
5503 136 217 188 12 97 -300 -198 -275 -274 -344 -230 -134 -162 -54 45 -104 181 123 235 158 192 133 136 110 109 97 176 -79
5530 -79 -135 -118 -186 -408 -104 -367 -331 -22 -75 148 206 445 351 394 385 454 264 75 -118 -218 -609 -449 -411 -484 -311
5555 -311 -132 -141 -24 164 206 15 362 462 531 73 212 87 40 224 35 -67 -222 -239 -240 -535 -347 -425 -181
5578 -181 -8 171 13 187 376 599 514 555 263 175 -23 -136 -346 -530 -479 -440 -464 -316 -246 -239 -42 160 269
5601 269 239 436 317 329 479 390 457 243 127 -284 -306 -493 -541 -584 -619 -570 -644 -2 69 382 445 567 726 594
5625 594 483 121 173 -35 -196 -250 -408 -403 -279 -202 -287 -126 -120 -192 -190 -212 24 188 287 501 447 619 455 310 106
5650 106 107 -212 -480 -853 -844 -851 -687 -623 -194 -37 415 658 557 663 612 532 412 275 93 -135 -192 -487 -481 -376
5674c76j05R6l5j2J94O3J82L10r2L51qJ2K95k46j84k85k40m65j81j35j70J8M62
5697e51L20K63J77M06N8Pk63J25r3k65j92j68rR8N2L5k07P4j90j56J02r2j79K33
5721d15K02K76M51R2L30J53j05k80l15m42l64n34k35K8Q4J39N84M28M74J82o7
5742F66K91k74q2j77n27j8j87J24j2K04j64K13m4k48j49j41o4r2K32O0M73K97
5764C81L88L08J95k31m72j59o54n07l40j71o6M85N26J55K89M32J51J86j51m01
5784C44m0k45q3k02K5O2K63J00l5J50l53j72m08j04k57J65J63M84K82M84P76M5
5806A444j05j20n35m73n97m92m17k83K30L73N36O13M05M00o4J54n33k85l80m61
5826e90j09K20J08M04J00M02J19q1k04k80n23m14l92K34J74L61N96M47M32N00
$$ plain form
5674 -376 -481 -385 -420 -432 -238 -175 7 317 225 576 568 580 875 629 445 160 -80 -545 -726 -861 -1031 -1013 -551
5697 -551 -231 32 209 615 673 680 417 542 449 184 -8 -176 -185 -87 -35 0 -207 -133 -323 -479 -377 -469 -648 -415
5721 -415 -213 63 514 606 936 1089 984 704 389 -53 -417 -951 -1186 -1158 -1074 -935 -351 77 551 733 666
5742 666 957 683 601 424 -103 -121 -308 -184 -196 8 -156 57 13 -235 -384 -525 -589 -681 -449 -389 84 381
5764 381 769 1077 1272 1041 569 410 -244 -751 -1091 -1262 -1328 -843 -317 -162 127 559 710 896 745 344
5784 344 304 59 -24 -226 -201 -139 124 224 189 339 -14 -186 -594 -698 -955 -790 -627 -143 139 623 1399 1444
5806 1444 1339 1219 684 211 -386 -878 -1295 -1578 -1348 -975 -439 174 579 979 915 1069 536 251 -129 -590
5826 -590 -699 -479 -371 33 133 535 654 573 369 89 -434 -848 -1240 -1006 -832 -471 125 572 1004 1504
5846A504l6j65m92n27q67m37m37J37p6L43N05O19N01L45J04k16l0n17m74k30r
5867d55K6r6K27O28K67Q8j62j84l63l88n03M3r0K20N13K80P64K48K90j72j55m73
5889E53n83m19n82k61Q0J37L12O25N68J70K09M4j34k97l24l37m09J66l4K74K27
5910a5L52J47J89J03m48m60m76m19r4J38L90L91N71K76L42K84j58j68m36n10p57
5931g58k65k49R5J26M48O64M55L47J43k6k44m51k41n87k74K21p6K55M23L26J60
5952D92K94j32k94n03r6m24K2j28J44M64L77L80K29ln8L9k94o79l39m48j26J65
5974i18L14J1N70L43J58J52J1L8m78l18j72k00j33J99J43K47J34J00K17j72l95
5995a49Rk16k41M2R8K44L47R0K23J26O6l2j06m52m57j7k66k3J90J35L49K03J68
$$ plain form
5846 1504 1468 1303 811 284 -583 -1020 -1457 -1320 -1396 -1053 -548 71 572 917 1021 805 775 258 -216 -446 -455
5867 -455 -429 -525 -298 330 597 685 523 339 -24 -412 -915 -872 -962 -742 -229 51 815 1063 1353 1181 1026 553
5889 553 -30 -449 -1031 -1292 -1212 -1075 -763 -138 430 600 809 853 719 422 98 -239 -648 -482 -516 -242 -15
5910 -15 337 484 673 776 328 -132 -608 -1027 -1121 -983 -593 -202 369 645 987 1271 1113 945 509 -1 -758
5931 -758 -1023 -1272 -1177 -1051 -603 61 516 863 1006 980 736 285 44 -543 -817 -596 -672 -417 6 332 492
5952 492 786 654 360 -143 -239 -663 -641 -769 -625 -161 216 596 825 822 764 803 509 -170 -509 -957 -1083 -918
5974 -918 -604 -593 -23 320 478 630 641 679 201 -117 -289 -489 -622 -423 -280 -33 101 201 418 246 -149
5995 -149 -140 -356 -597 -555 -457 -213 134 224 447 573 639 607 501 49 -408 -425 -691 -714 -524 -389 -40 163 331
6018C31Q3J1k3j34k20q4j90M9j85J10K39J96J19J06j53j97L6k55J35l95K3M2J45
6041b11M14Q5K0J65q5k28Nn1r3l05j9k90K13J57m5L56K66j07k6op8r1l06Q4K22
6066D6k29N7J60p1J11N9q2Kk36q0J56P5k0k7J38%K59q8Rj52j07j6J20k39J54j57
6092a58L4q0K42J25j87p2j0n7J48l0M9J1J31O2R5k8j81o2j74l6J14j60lk5K04
6117d8K62O6j47P7M7k3j85k31Lj4nj03J12J27J91jL98k73l7k53n1k2j82M7K23
6142b2RN5o3K91J63m65J70L5k79K3j99k3p0J92O3J96J74J5Q8j33rk56j40m2j55
6167c82K51J15J1j18L59Q9k1j08p3j47k05N1j52N2J90J8N6J24P4%J29l18J69l08
6191a44L5j83J58J6L1J64K06l8P4j99K7k32J17j61jk16J84P7j05K71jL78l04L23
$$ plain form
6018 331 414 425 402 268 48 -36 -226 -177 -362 -252 -13 183 302 408 255 58 94 -161 -26 -421 -398 -356 -211
6041 -211 203 288 308 473 388 160 165 114 21 -284 -303 -593 -380 -223 -268 88 354 247 221 215 137 46 -260 -176 46
6066 46 -183 -126 34 -37 74 133 51 53 -183 -263 -107 -32 -52 -79 59 59 318 230 239 87 -20 -36 84 -155 -1 -158
6092 -158 -124 -204 38 163 -24 -96 -106 -163 -15 -45 4 15 146 208 303 275 94 32 -142 -178 -64 -224 -227 -252 -48
6117 -48 214 280 133 210 257 234 49 -182 -179 -193 -198 -301 -189 -62 129 128 526 253 216 -37 -88 -110 -292 -245 -22
6142 -22 -13 42 -21 270 433 -32 138 173 -106 -83 -282 -305 -375 -183 -120 76 250 265 353 220 211 -45 -185 -227 -382
6167 -382 -131 -16 -5 -123 236 325 304 196 123 -24 -229 -178 -330 -278 -88 -70 -14 110 184 184 313 -5 164 -144
6191 -144 -109 -292 -134 -118 -87 77 283 245 319 120 147 -85 32 -129 -130 -346 -162 -85 -190 81 80 458 154 477
6215D77l18P3k77j18p4l6k4K53J34J77K0J10k46M4p2q2k32J39j77K7j17Q0J64
6238g5K24mmL18k23p1k20j15Q1J14j42q7j9L8J79K31j95J74M2P4j98o6j20k05
6262b69L3J57q2J15n5J55k1L59l34K22p7j69O1j29j93r9J72j08J5K79R8J98R5
6285D23m2J3l38q5j73l5j18J1J45K12K24l6K52r7r3M0k05j87j02k64rNJ71K06
6309h2M04J36j64J20p7k20j68k49j41J6PJ78K01L00M7J41P1k01j26m15l08n4O2
6332e22l4O7K57K54K84K82l4q6j6l55m39O3k32l7j09M01L01L30M4K09L2k24l97
6355C9k18l18l68K47j1J95O67J08L32K56K39k64m47n44n00k04l01R1J68M97M55
6376A19N72K93J74j27m25m71l47l54k33k69L15K22N56M95J32M53j62k82m77k72
$$ plain form
6215 477 159 232 -45 -163 -237 -273 -297 -44 90 267 287 397 151 195 123 41 -191 -52 -229 -202 -319 -239 -75
6238 -75 149 145 141 459 236 165 -55 -170 -89 25 -117 -204 -223 -185 -6 225 30 204 246 320 122 56 -64 -269
6262 -269 -236 -79 -161 -46 -101 54 33 392 58 280 203 34 95 -34 -227 -326 -154 -262 -247 32 130 328 423
6285 423 381 394 56 -29 -202 -237 -355 -344 -199 13 237 201 453 356 263 303 98 -89 -191 -455 -464 -459 -288 -82
6309 -82 322 458 294 414 337 117 -51 -300 -441 -425 -418 -240 -39 261 308 449 520 319 193 -222 -530 -584 -522
6332 -522 -556 -489 -232 22 306 588 554 468 452 97 -342 -279 -511 -548 -657 -256 45 375 419 628 660 436 39
6355 39 -179 -497 -865 -618 -629 -434 233 341 673 929 1168 904 457 -87 -587 -791 -1092 -1001 -833 -336 119
6376 119 691 984 1158 1031 606 135 -212 -566 -799 -1068 -753 -531 25 520 652 1105 943 661 184 -88
6396h8n97m46J21l8L09P15M57L46L88K4k79l56m31p68m01k05j5J88N59M78M52
6417D13O07P4Ok70m85n04n04j36k30JM88M31L98N01K51j46k68l97m28m97o05N4
6439a246K21K19J001N66L44M02q1l94l36p67o88m36m53n0N26O71O45N78M71K68
6459A461j31k84n84q06m00k70j75J83N36L57N97M54L16k59l43o42o17m25j53k10
6479a395K36O12L69P71P96K43j91l52m32p41p21n47l95Q4K30O16O92P41N62J80
6499A358r8k49m20p12l36n21q1J22L78N54M23K78J72L6l89m36m70l49l82J74J33
6520h15M02N73N59K66K31J34k23p03o32m87n19l37K50L14M48N07O60K86M35k48
6540A101l61l71n13k97l25N5J25J93L09O47J57Jj65l30k19m93j90m75L55K13K16
$$ plain form
6396 -88 -685 -1131 -1010 -1048 -739 -24 433 779 1167 1191 912 556 125 -643 -1044 -1249 -1264 -1076 -517 -39 413
6417 413 1020 1094 1100 830 345 -159 -663 -799 -1029 -1028 -540 -109 289 790 1041 895 627 230 -198 -695 -1300 -1246
6439 -1246 -1025 -806 195 761 1105 1507 1426 1032 696 -71 -759 -1195 -1648 -1698 -1172 -501 144 722 1193 1461
6459 1461 1330 1046 462 -344 -744 -1014 -1189 -1006 -470 -113 484 938 1254 995 652 10 -607 -1032 -1185 -1395
6479 -1395 -1159 -547 -178 593 1389 1632 1441 1089 657 -84 -805 -1352 -1747 -1663 -1433 -817 -125 616 1178 1358
6499 1358 1260 1011 591 -121 -457 -978 -1059 -937 -559 -5 418 696 868 904 515 79 -391 -740 -1122 -948 -815
6520 -815 -413 160 719 985 1216 1350 1127 424 -208 -695 -1214 -1551 -1301 -987 -539 -32 628 914 1349 1101
6540 1101 740 369 -144 -441 -766 -711 -586 -393 -84 563 720 721 556 226 7 -486 -676 -1151 -796 -583 -367
6561c67O29N64J88L59j73r7o54m83n85m28k17L1L57J78N90N79M46J2P6k53l34
6582D18n50k06r9j62J96L9L55L10Q2K31Rk43o56j89l88K00m4M5N40K41L69L43
6604H41J93P3j03m38m20m36m39k67R7L7J11O21M28j3J47J97N9k83k48k14l3k7
6626a17o5j7L19J27j81K04j65k34pq1k00j05nL63K08K33J82J42J87k63j7l68j98
6649e8k41j17k52K31J11OJ77J37J34J88k40j16J24j06j68K67j67J71J19J54j25
6670B29j67j25N0j33k7k57k29K78J32J98OR1K59J86k0L6j59j4k69j83j47J52l59
6693d72J65m6K36l4J53M5N4R2k0j48J8J52j08r6K9K30k00O9P2k96o0o4O8Q5j2
6718h8J26j21j66J35J13p2K8K15J26R2j6q0j33o3m9j31k80M9L2n0j51L54M4J63
$$ plain form
6561 -367 262 826 1014 1373 1200 1103 449 -34 -619 -1047 -1264 -1233 -876 -698 -108 471 917 929 1005 752 418
6582 418 -132 -338 -437 -599 -403 -364 -9 301 383 614 623 380 -276 -465 -853 -653 -697 -652 -112 129 498 841
6604 841 1034 1107 1004 566 146 -290 -729 -996 -899 -862 -751 -130 298 285 432 629 688 405 157 -57 -90 -117
6626 -117 -182 -199 120 247 66 270 105 -129 -136 -217 -417 -522 -527 -164 44 277 459 601 788 525 508 140 -58
6649 -58 -299 -416 -668 -437 -326 -320 -143 -6 128 316 76 -40 84 -22 -190 77 -90 81 200 354 229
6670 229 62 -63 -13 -146 -173 -430 -659 -381 -249 -51 -45 46 305 491 471 507 348 334 65 -118 -265 -113 -472
6693 -472 -307 -353 -117 -151 2 47 101 193 173 25 43 195 87 -9 20 250 50 119 191 -105 -165 -229 -161 -76 -88
6718 -88 38 -83 -249 -114 -1 -73 -45 170 296 388 372 292 159 96 47 -84 -364 -315 -283 -333 -484 -130 -86 77
6742G7J13O7Q0N3j72r8l7k07j67L10j54r7OM8L04j52R6J04k90J30j24r3m6n3M86
6767A84j02K17J28K2r5L4j84j74j45j07j67k08k3J40M4K94K11K02J28n6J31p7
6789C97p6k36k90J07j59J20k38J65N3J2R5j1k2l11L16n3J36J30r6N0K56Q0j44
6812B81p6l2m3o7j68j59j42j63J89J07N9J20J33M1J36J0M4k4J7M4j62K7k35J48
6836H5k97J99k19j28k55J02J02o7K45O6K13K10K12O8j28K01N1l92k26k76q7j26
6858d47k42j05L7K64J67J93N5K51L74k53L0J71J06k94o6q1k12L5k51J00p1J5j84
6881d08J46r6LR6LK52N1K68Q1J62l9j08P0q9l29J6k18n30k4K01j56j23K88J26
6905c57L75J58J13K98J84r4l7M7l20j85l42j24j99o6k60J63M2K61m1K39J98K49
$$ plain form
6742 77 190 257 337 390 218 120 83 -124 -291 19 -135 -232 -226 -178 126 -26 70 174 -116 14 -110 -203 -249 -302 184
6767 184 82 299 427 449 354 388 204 30 -115 -222 -389 -597 -620 -480 -436 -142 69 271 399 343 474 397
6789 397 321 85 -205 -98 -257 -137 -375 -210 -157 -145 -50 -61 -83 -394 -78 -131 5 135 39 89 345 425 281
6812 281 205 173 130 63 -105 -264 -406 -569 -380 -273 -214 -94 39 80 216 226 270 246 263 307 145 172 -63 85
6836 85 -212 -13 -232 -360 -615 -513 -411 -478 -233 -167 46 256 468 536 408 609 660 268 42 -234 -321 -447
6858 -447 -689 -794 -757 -493 -326 -133 -78 173 547 294 324 495 601 307 241 160 -52 -17 -268 -168 -239 -224 -408
6881 -408 -262 -358 -355 -259 -256 -4 47 315 396 558 519 411 481 392 63 79 -139 -669 -693 -492 -648 -771 -483 -357
6905 -357 18 176 289 587 771 677 640 687 367 182 -160 -284 -483 -549 -809 -646 -604 -343 -384 -145 53 302
6927C02j19M4N3J22R2k04N6kn7l8j45l87j87j23p3pJ49K4K21L43K12R3J79K33
6951G81R9k74o9k76k6m61q2m98J22J75o9J68J25q5M24J34R8j98K95j51J09J17
6973D58r7J6m2m8k73k18k6l37l11Q4M0J45L76J87J64O13n1L37j6l38l5l30k52
6996D6m03k79j11P2j73K71j9M14jJ90L15j59J10j30K35j50J95j46K87j72L4j95
7018B31j68l25m63R5l92N1J51L63M22K68M58K69J55n0j34l46j65m27m97j39j20
7039g63O4K61n3L73P5j9K55k02l2K18K8j53L6K06K01K02j70N6j74l03l61l91j00
7062g46j86j88Q1L94K87N91L06M44J5J79j52n12l42k60l12k88o0qL15M8L74J46
7084A26N0k3P4j84j70K96j08n0J99J13L20k11R1q6km52l25l08j5k32j6M39qN18
$$ plain form
6927 302 183 227 280 402 494 290 346 344 287 249 104 -283 -470 -593 -666 -673 -524 -500 -279 64 276 369 548 781
6951 781 880 606 537 261 235 -226 -308 -806 -684 -509 -578 -410 -285 -370 54 188 286 88 383 232 341 458
6973 458 361 377 335 287 14 -204 -230 -567 -878 -794 -754 -609 -233 -46 118 731 680 1017 1001 663 628 298 46
6996 46 -357 -636 -747 -675 -848 -577 -596 -182 -183 7 322 163 273 143 378 228 423 277 564 392 426 231
7018 231 63 -262 -725 -630 -1022 -971 -820 -457 -35 233 691 960 1115 1065 931 585 420 -7 -504 -643 -763
7039 -763 -699 -438 -491 -118 -43 -62 193 -9 -41 177 205 52 88 294 495 697 527 583 409 106 -255 -646 -746
7062 -746 -932 -1120 -1039 -645 -358 233 539 983 998 1177 1025 513 171 -89 -401 -689 -749 -757 -442 -394 -20 126
7084 126 176 153 227 43 -127 169 61 11 210 323 643 432 523 437 435 -17 -342 -650 -665 -897 -913 -474 -482 36
7108C6L81K66K08O0n0l41j51l60n52J98l63P9j65L60K42J03PO5J57J98k30k18
7130g0K76j82q2J92J58j45K76l50P9m02p9j70k16j00R2M01J63L68J98P6K36n1
7152F68l1k70l6m20j38j88N3M7j9K63n2K0M3J51j65J65p6j68PP7J64N4K22lJ20
7177D88l17J56k91k38k94j33m6qK09NL30L02K66JK69r6q0k96j07j58l58j30j1
7200e37Q7K15J24K30pk2Q5m5n9j98J55l0M8n5N9P2Q0o8J54k99k2n6j26j39q8K18
7226b24k03L38Q5K64l4J12k01P2Kj11j29n8j02j52J58j12K25O6r0R7j27J17q2
7249h9J31r0r2pP6J95r5J90p9j0n9O8m38K65k24J73p3J06M3R6p0K02q8r7N6L3
7275A23L0k67Q4j38p8K03J61j00O9j02K42r5Ok85n1k8Q7K4N5k0J69KJ23kN2O1
$$ plain form
7108 36 417 683 891 951 901 560 409 49 -503 -305 -668 -589 -754 -394 -152 -49 -42 23 180 378 148 -70
7130 -70 206 24 -58 134 292 147 423 73 152 -250 -329 -499 -715 -815 -723 -322 -159 209 407 483 719 668
7152 668 637 367 331 -89 -227 -415 -362 -315 -334 -71 -123 -103 -60 91 -74 91 15 -153 -146 -69 95 149 371 368 488
7177 488 171 327 36 -202 -496 -629 -675 -683 -474 -469 -139 163 429 430 699 603 523 227 120 -38 -396 -526 -537
7200 -537 -450 -235 -111 119 112 90 175 130 71 -127 28 -2 46 -9 50 122 202 134 288 -11 -33 -89 -215 -354 -442 -224
7226 -224 -427 -89 -4 260 226 338 137 209 211 100 -29 -87 -189 -341 -183 -295 -70 -4 -94 3 -124 -7 -89
7249 -89 42 -48 -140 -147 -71 124 29 219 140 130 71 139 -299 -34 -258 -85 -158 -52 -9 87 17 219 131 34 90 123
7275 123 153 -114 -30 -168 -246 -43 118 18 87 -15 227 132 138 -147 -198 -226 -139 -115 -60 -80 89 91 214 212 264 325
7301C25l05j40R1K6l12K69m5J1O2N4m6J38j87J43p6r3nJ62qq8M1J00O0j07P7J93
7327C40q1j53j82O2l18m2K53k69L77k1J31M7m3J29q3N6ml8q0mj88l2J10l9Okr5
7354a63J15mJ62j15J71j30o8O6Q4J35l34K69r8j4j23p0J19j77J7M5j97O0J40n0
7378a60R3K34j80K03K8J59k06j02j99r6O3j44J94j71J72j57J37P7N6O0J47j39
7400F9P0J18l5r3K36j56k41J88p0j33k6j84j0j18n0L39j62K1K13J84l6%K24j43
7424B05Mk16Q5P5j76k44J14k7j50P1J52l6K9P0M0J64k89K80L0L2M5o1j33K4j23
7449c5j28L0q6O8j31R5j59J04M5K00J31M7J92N0J8K3l09K01l08k92J82j23k52
7472d37R4P2K83k48J38K1J69J10j09J13k6J46k53J81j96pp4q6J43j38j11Nr1l9
$$ plain form
7301 325 20 -120 -29 -3 -315 -46 -91 -80 -18 36 -10 128 -59 84 8 -85 -90 72 64 -24 17 117 177 70 147 340
7327 340 259 106 -76 -14 -332 -374 -121 -390 -13 -34 97 144 101 230 147 203 199 161 81 77 -111 -143 -33 -72 -66 -68 -163
7354 -163 -48 -52 110 -5 166 36 -32 34 118 253 -81 188 90 76 -47 -117 2 -175 -158 -113 -310 -250 -110 -160
7378 -160 -67 167 -13 190 218 377 171 69 -130 -226 -163 -307 -113 -284 -112 -269 -132 -55 1 61 208 69
7400 69 139 257 222 129 365 209 -32 156 86 -47 -73 -257 -267 -385 -435 -96 -258 -237 -24 160 124 124 348 205
7424 205 209 -7 78 153 -23 -267 -153 -180 -330 -259 -107 -143 -114 -44 -4 160 -129 151 181 213 258 197 64 88 -35
7449 -35 -163 -133 -219 -151 -282 -187 -346 -242 -197 3 134 181 373 423 441 464 155 356 48 -244 -62 -185 -437
7472 -437 -343 -271 12 -236 -98 -77 92 202 93 206 180 326 73 254 58 51 -23 -109 34 -104 -215 -210 -301 -340
7496c40R9M0MK56N8j57K70O1o9r8J45M9l45P2m08L44p3l91J82p0J60J10L2O2L
7521dL69l01K62N7j85J5j13o1j12K4k49j42J39J82l02R9J64o8L05j8J78Qn1l2
7545A64Q1r5k41N2r3m4J27k37J80j80O0J5N8J31m1M4J34MJ7K82k87J49J1j51n4
7570H6mk96j30p0J78o8L4J84OJ28J01j23K15M2J56j60j2l24J91j80J22l00n5N0
7594b29Pn2J84j84N25m75L25k3K9J22n5K02k61K05k81k1Rj03j10m6n7QO7j5K48
7619A9p1L94l3k11P6O7j08j41J96j24J32j34P2k56J4k1j21l1J62m9p5L02k1M6
7643H4J44p5P5j58p5R0l8j51q6J17q7J8N5j15K58j9n9K49j24K2Rj12p7J97j7K4
7669A49j30n2L5L1J54j93j19J54k21R3j87P7PJ92K77j28J40Q9m4j14j55K13l11
$$ plain form
7496 -340 -241 -201 -197 59 117 -40 230 291 222 124 269 318 -27 45 -363 -19 -92 -483 -301 -371 -211 -101 -69 -7 -4
7521 -4 365 64 326 383 198 213 100 39 -73 -49 -298 -440 -301 -119 -421 -322 -158 -226 79 61 239 247 196 164
7545 164 245 150 -91 -39 -132 -176 -49 -286 -106 -286 -226 -211 -153 -22 -63 -19 115 119 136 418 131 280 291 140 86
7570 86 82 -214 -344 -414 -236 -304 -270 -86 -80 48 149 26 241 283 439 279 267 -57 134 -46 76 -224 -279 -229
7594 -229 -222 -274 -90 -274 251 -224 101 78 107 229 174 376 115 320 39 18 27 -76 -186 -232 -289 -281 -214 -229 19
7619 19 -52 342 309 98 174 241 133 -8 188 64 196 62 134 -122 -108 -129 -250 -281 -119 -168 -243 59 38 84
7643 84 228 153 228 70 -5 85 47 -104 -190 -73 -160 -142 -87 -202 56 37 -22 227 103 125 134 22 -55 142 125 149
7669 149 19 -33 2 33 187 -6 -125 29 -192 -99 -286 -209 -202 -10 267 139 279 368 324 210 55 268 -43
7692d3k09q2J01M8M3O1J41m6j6M46p2j68j29J0k03P8k1p2R4OJ67l07K06K5q5Q3
7718E6k28j%J79k03J89K31l0j03q5K37J9M6j88k43l8o5R0k46K40J07J6M8j33J71
7743F6k8J46J03q7j54K58k80lM2l9j8J31r4l54J78j24K20K4J2J55R2j10K3Kn4
7768A07j29R3k02j32j04J95k9L28J76j67P0p9R2j38o9k38Q0j50K57k66Q5K40K23
7791B43J9r6M1P0k16j08m1j04Nl38J84M5kK39K67K47j19J03j8l62j66k03J09r8
7815b99L8j07L1J89K98L4K04j3K35l90j84r8r8l36K98j48J82m4J76k8K57J55J3
7838C65j18n6j30l36J71j79o4p7K12P0J63J70M7J43j75L2j45j13J29k80J1j79
7860c39K04k02N16l83K82j10J26Q5R3r1j10q0Oj32j31N4j35J26l0K11J10k3K20
$$ plain form
7692 -43 -252 -334 -233 -185 -142 -81 60 14 -2 444 372 204 75 85 -118 -40 -61 -133 -39 -33 134 -173 33 58 -27 56
7718 56 -172 -173 -173 6 -197 -8 223 193 90 5 242 261 307 119 -124 -162 -227 -137 -383 -143 -36 -20 28 -105 66
7743 66 38 184 287 200 46 304 24 21 63 24 6 137 43 -311 -133 -257 -37 -13 -1 154 246 136 159 161 107
7768 107 -22 71 -131 -263 -367 -172 -201 127 303 136 206 127 219 81 12 -226 -146 -296 -39 -305 -220 20 243
7791 243 262 166 207 277 61 -47 -88 -192 -187 -525 -341 -296 -298 -59 208 455 336 439 421 59 -107 -310 -201 -299
7815 -299 -261 -368 -337 -148 150 184 388 375 610 220 36 -62 -160 -496 -198 -346 -164 -208 -32 -60 197 352 365
7838 365 247 191 61 -275 -104 -283 -347 -424 -212 -142 21 191 238 381 206 238 93 -20 109 -171 -160 -339
7860 -339 -135 -337 179 -204 78 -32 94 179 272 181 71 -9 -3 -135 -266 -212 -347 -221 -251 -40 70 47 267
7883B67J05q3j26j83J09j54q3j84K2P9J5K18q3J79lJ75n5j70J90r5k33p4j00p7
7907c44J06k7J11k1J74O0J21J84j24p0Qn2l2k71K3j45J56J04J25m2p4M12j20J0
7931B72O4j28j95Rk72J43k06N6J21R5J22J17L66k65n6j14j29j18k1j14k8j34J39
7954b76K96jJ98O9l4J73j75k11n7m7M1k97J50j9P5J04J15j41K12J27j96m3nj04
7978d6j37J34r1J09m6O7n7K78m1p4J02k70Kp7L4k01n9K52O4M1q7M52j62lJ70j35
8004B19k72K7J2j86QqR6O7K5r1J0M7K49j61N1k91K34K43J3R3k68J53j57K0j27
8029Fj85J06K9p3Q1k13J96m3N8O2P1R3K5P3j58Pq2p3llj4r8K43l14K54j85K16
8056G6j91j1MJ04K4M2Q0K00j52J3n5j99P7m20k1K18mj03J71MJ50J69%P4M7nj88
$$ plain form
7883 267 372 289 163 -20 89 -65 -148 -332 -310 -231 -216 2 -81 98 95 270 215 45 235 140 -93 -167 -267 -344
7907 -344 -238 -265 -154 -175 -1 59 180 364 240 170 178 126 94 -177 -154 -299 -143 -39 86 44 -30 382 262 272
7931 272 336 208 13 22 -250 -107 -313 -257 -136 -41 81 198 564 299 243 129 0 -118 -139 -253 -281 -415 -276
7954 -276 20 19 217 286 252 425 250 39 -18 -65 -24 -321 -171 -190 -115 -11 104 -37 175 302 106 63 58 -46
7978 -46 -183 -49 -140 -31 -77 -10 -67 211 170 96 198 -72 -70 -147 -113 -314 -373 -121 -57 -16 -103 349 187 184 354 219
8004 219 -53 -26 -14 -200 -192 -200 -104 -37 -12 -103 -93 -46 203 42 93 -198 36 279 292 385 117 270 113 133 6
8029 6 -179 -73 -44 -117 -36 -249 -53 -96 -38 24 95 188 213 286 128 135 53 -20 -23 -26 -40 -138 105 -209 45 -140 76
8056 76 -115 -126 -122 -18 6 48 128 328 176 189 134 -65 12 -408 -429 -211 -215 -318 -147 -143 7 176 176 250 297 292 104
8083A04j31l07J77J65l5o9K59Jk80rJ89o2j4J62k76r3J19QJ9K09J77l4K3j10m9
8108A43j4n2k98j32O2j19o5L63jK85K5O4K87p9j79k9j01k18k3l32J7K89m8m9J27
8133g7J47k20K85m5j04J15j96l7J28m5J94k25J63q2K46k48K0k39K76q1l8n0n6
8156a69l0J36j43o2J73M5J63J70K11j55j44J00j97j35r5k65J64k18j73L85J27
8177a12K54m1J62%K76j17K2k30k29K1o4j76m8J39
$$ plain form
8083 104 -27 -334 -157 8 -27 -96 163 164 -116 -125 64 2 -12 150 -126 -219 -100 -92 -73 136 313 279 302 192 143
8108 143 129 77 -221 -353 -291 -410 -475 -112 -113 172 197 261 548 469 290 261 160 -58 -81 -413 -396 -107 -155 -204 -77
8133 -77 70 -150 135 90 -14 101 -95 -132 -4 -49 145 -80 83 1 247 -1 19 -220 56 -25 -63 -113 -169
8156 -169 -199 -63 -206 -268 -95 -50 113 283 494 339 195 295 98 -37 -132 -397 -233 -451 -624 -239 -112
8177 -112 142 101 263 263 539 422 444 214 -15 6 -58 -234 -282 -143
8191a43
$$ Imaginary data points
##PAGE= N=2
##DATA TABLE= (X++(I..I)), XYDATA
0@%%%qJ6j6J7j7K4l3M2n8P3r0J08j32J58j88K26k64L09l62M23m89N61o44P37q37
28d44R49j073J210j361J527j711J913k134K374k641K931l249L598l983M411m884
44b567N411n999O662p413Q274r271J0440j1834J3530j5652J8389k2081K7371l5644
58b0384N0560q6114L27207M63777j25589q1705k47119k31035k62014j74025j38459
69e24900r294N9669J39028J60099J90011J35101R3261K8550k2934q1568q1061
80H5962q3101n7023j7113L3669M7302O6374O0726K7369k0742n1796r5591j18245
92a22209j06465p6185m0331K5449Q5419J21764J46641J53447J18039O7860J8250
103C91679m5479j01837j23492j32244j26873q9669m2287p771L1421O4038O7582
$$ plain form
0 0 0 0 0 -8 8 -8 9 -8 16 -17 25 -33 40 -50 58 -74 84 -104 122 -142 167 -195 228 -261 300 -344 393 -444
28 -444 505 -568 642 -719 808 -903 1010 -1124 1250 -1391 1540 -1709 1889 -2094 2317 -2567
44 -2567 2844 -3155 3507 -3906 4368 -4903 5537 -6297 7233 -8419 9970 -12111 15260 -20384
58 -20384 30176 -55938 271269 735046 609457 527752 280633 49598 -212416 -386441 -524900
69 -524900 -534194 -474525 -335497 -175398 14613 149714 242975 271525 248591 167023 85962
80 85962 2861 -54162 -71275 -37606 9696 76070 136796 164165 143423 91627 -3964 -122209
92 -122209 -228674 -304859 -345190 -319741 -234322 -112558 34083 187530 305569 373429 391679
103 391679 346200 244363 120871 -11373 -138246 -227915 -270202 -277973 -246552 -182514 -114932
114a14932O0689N6778L5493J3117J1289J0279O543K0238L2597K5554J8608P634
126A83887k5651n9564p8284r8691j07801q4965n0530j3367M2121R4217J20406
137g8222J36204J35738J00034N0662L697n1667j00927j18813j20274j10005p0581
148b24154k1753J4740N1320P9627P8440O1809M4303J1295k3332l6628m1473m0549
160d6355j6923J5033L5513N4446O8160N3831K6129j900m2139q2863r9711j02917
172a39696r5603n9997r988L3594P8409J17897J27412J16586R6254N2452k931m5510
184B68879q1764j11333j12539r3603p1105l4394R643L7958N6610P1707O6315M6940
196E3314L1493J2963j0390j9256j7166j9338j1472L737P203N964Q471p80j7799
$$ plain form
114 -114932 -54243 2535 38028 51145 62434 72713 79256 99494 132091 157645 176253 183887
126 183887 158236 98672 20388 -78303 -186104 -271069 -321599 -334966 -292845 -198628 -78222
137 -78222 57982 193720 293754 344416 348113 296446 195519 76706 -43568 -153573 -224154
148 -224154 -245907 -231167 -179847 -100220 -21780 40029 84332 95627 72295 35667 -5806 -46355
160 -46355 -63278 -48245 -12732 41714 109874 163705 189834 187934 145795 62932 -36779 -139696
172 -139696 -235299 -295296 -305284 -271690 -193281 -75384 52028 168614 264868 317320 314389 268879
184 268879 187115 75782 -36757 -130360 -201465 -235859 -226216 -188258 -131648 -59941 6374 53314
196 53314 84807 97770 87380 68124 50958 31620 20148 23885 31088 37052 45523 44743 26944
209B6944k5306l1732m0429l4146j8068n981J2687L6605M7511N0528N3974M3249
221A15836K1117N035j2623l4741m3837m2267m3297l4817j6521o014K303J6026
233g3800J9617J5070J6777J5736P428P750J2486R696J0997J7129J3018M649J592
246G8145q485k4973l0704l4403m0055l3740j8507p627Q215K9385L9243M2798M6636
259D5928L9253K1612Q753n890k5557l4511l4881l6869l1146j5396n328K649J6026
272e5357K1009J7097J7157J4141L582o87n12n155n030K929M249L633R092P855
286C4003k93l258p417j7300k0105j7304j7599j3125l61O718J2593K2811K6586
299E949K1750K0384J5590K122o148j0701j9756k3794j8735j7231j4333l976L538
$$ plain form
209 26944 1638 -30094 -70523 -104669 -122737 -128718 -116031 -79426 -31915 18613 72587 115836
221 115836 136953 141988 129365 94624 50787 8520 -34777 -69594 -86115 -92129 -89826 -73800
233 -73800 -54183 -39113 -22336 -6600 828 8578 21064 30760 41757 58886 71904 76553 78145
246 78145 69660 44687 13983 -20420 -60475 -94215 -112722 -120349 -112134 -82749 -43506 -708 45928
259 45928 85181 106793 115546 109656 84099 49588 14707 -22162 -53308 -68704 -74032 -71383 -55357
272 -55357 -34348 -17251 -94 14047 17629 16942 16430 11275 6245 9174 13423 17056 26148 34003
286 34003 33710 30452 23035 5735 -14370 -31674 -49273 -62398 -62759 -56041 -43448 -20637 5949
299 5949 27699 48083 63673 65795 59647 48946 29190 5396 -13339 -30570 -44903 -48879 -45341
312d5341M981J1527J5776J1471J0421J0877M291r27N23k972p068l742k697n918
326A202k996j62l502k966M34k283l549J344J059j098M027N652K480N113O982K455
342A4192J153K662k139n573l308n265q424m007k614l800J22M667K938M110P864
357B578M776K129M186R30l996k672l072o770m633j485k863j091M139L190K244
372b410N783M283M30J717R24m079l997j622m998m187j77n84j027L403L700Q78
388a963L855L969O4L81J973j728k475O73j697l032r6r3k884q28L54l009j547R77
406g106j462n25L268K479K076N789N759K360L531L051k073l735l476p743r058
421f865o172o840n947j47L017L570Q416J1173Q276Q353Q518K355j536k338o746
$$ plain form
312 -45341 -40360 -28833 -13057 -1586 8835 19712 24003 23076 23599 20627 13559 9817 7120 1202
326 1202 -1794 -1956 -5458 -8424 -7990 -10273 -13822 -12478 -11419 -12517 -8490 -2838 -358 4755 11737 14192
342 14192 15345 18007 15868 10295 6987 1722 -6702 -10709 -13323 -17123 -17001 -12334 -9396 -5286 2578
357 2578 7354 9483 13669 14599 10603 7931 4859 -1911 -6544 -8029 -10892 -11983 -7844 -4654 -2410
372 -2410 3373 7656 8086 9803 10727 6648 2651 1029 -3969 -8156 -8333 -8917 -9944 -6541 -2841 -1963
388 -1963 1892 5861 5925 6306 8279 6551 4076 4749 3052 20 -76 -169 -3053 -3881 -3527 -6536 -8083 -7106
406 -7106 -8568 -9093 -5825 -3346 -1270 4519 10278 12638 16169 19220 17147 13412 9936 2193 -6865
421 -6865 -13037 -19877 -25824 -25971 -22954 -19384 -10968 205 8481 16834 25352 27707 26171 23833 17087
436A7087j0220p933p580p946l728P14L76K743O258M201L073M482K223o14J870
451E006K056m0K640M431J513J506J659l103o705o929r960j2572q653n647l824
466c8622L352J0067J2037J5233J8021J3671Q696N107k734j1035j3121j5668j8169
479a3165j3983q088n083J655Q352R905J0436J2366R060L956K731Q5l819l014p26
494A0668k376m18K539L44j991j434m969r344q468p969q425l309K974N906J0654
509a5618J6022J5365J2927J1232M964l087p146j1710j6229j5153j2014r984m601
522c5032K475M867O618R608P831M762M083K596o67P97L047K368L927O233L333
537B6846o30k279p806j4456j5151j5596j4815q904k37O355J4249K2370K3072K1606
$$ plain form
436 17087 6867 -1066 -8646 -16592 -20320 -19606 -19230 -16487 -10229 -6028 -2955 1527 3750 3136 5006
451 5006 7062 7022 9662 14093 15606 17112 18771 15668 8963 2034 -7926 -20498 -29151 -34798 -38622
466 -38622 -35270 -25203 -13166 2067 20088 33759 42455 47562 44828 33793 20672 5004 -13165
479 -13165 -27148 -35236 -40319 -38664 -30312 -20407 -9971 2395 11455 15411 18142 18227 14408 11394 10668
494 10668 8292 7874 10413 10757 8766 7332 2363 -6981 -15449 -23418 -31843 -35152 -32178 -26272 -15618
509 -15618 404 15769 28696 39928 44892 41805 34659 22949 6720 -8433 -20447 -30431 -35032
522 -35032 -32557 -27690 -21072 -11464 -3633 1129 5212 7808 7141 7938 10985 13353 17280 23513 26846
537 26846 26216 23937 16131 1675 -13476 -29072 -43887 -52791 -53028 -46673 -32424 -10054 13018 34624
551C4624J8063R645k103j0027j7243k3970k3046j8522j3358m458N940J2368J5165
564a6922J8155J4673P198K104l959j1173j1928q874o782n22Q453J1920J3437J4579
578C0359R027M23o980j4671k2280k3397j9759j4693m719Q405J7866K4657L0055
591A4293K7865J9493J1273p69j4040k2283k6062k7964k3164j3348m266M817J4762
604c9393J9063J8396J6585J1868L021k979o283j0055r640m911j647J672O503P587
618I787M695K564j770q199j1161j1938j1893q401q87N058J0120J6222J7762J4567
632B6526J1184N522l521r587j2815j6219j4883r333m997K52O516R479Q330P840
646D294M533j312m673n688o800m639J057N689Q739J3400J3095Q184L837l069j2482
$$ plain form
551 34624 52687 62332 60229 50202 32959 8989 -14057 -32579 -45937 -50395 -44455 -32087 -16922
564 -16922 1233 15906 23104 25208 21249 10076 -1852 -10726 -17508 -18030 -9577 2343 15780 30359
578 30359 39386 39809 32829 18158 -4122 -27519 -47278 -61971 -66690 -58285 -40419 -15762 14293
591 14293 42158 61651 72924 72155 58115 35832 9770 -18194 -41358 -54706 -58972 -54155 -39393
604 -39393 -20330 -1934 14651 26519 29540 26561 20278 10223 583 -4328 -5975 -4303 2200 9787
618 9787 14482 17046 15276 7077 -4084 -16022 -27915 -36316 -37203 -32145 -22025 -5803 11959 26526
632 26526 37710 43232 39711 30124 17309 1090 -13793 -23126 -28123 -27871 -21355 -11876 -3546 4294
646 4294 8827 7515 2842 -2846 -9646 -14285 -13228 -7539 1200 14600 27695 35879 39716 36647 24165
661B4165j8228k0045k0807j6554o791K230J1219K0794K5505K4021K0803J3356
673E9668J333q904j6626k3200k4507j9774j3363m887O096J3991J7455J9275J6404
686B2961Q923J276n498j2820j6298j3832j0294m870M534J1063J4187J6614J4883
699C0829P542J26p084j4824j9610j8580j5631j0491o71Q328J4131J9433K1266
712A4764J6889J1141M224m523j2247j5095j6894j5997j0139m057O24O744J0895
725a3671J0099Q748P375J763k310l757n244n696k339O43J839M768O036L660J440
740A3354n73m781p736p483p094o072j298K643N074Q534J0267P748N529K958j959
755A9111n918o579p642p664l635k02J596M815O797M713K994J232k904n555n927
$$ plain form
661 24165 5937 -14108 -34915 -51469 -58260 -56030 -44811 -24017 1488 25509 46312 59668
673 59668 61001 52097 35471 12271 -12236 -32010 -45373 -50260 -44164 -30173 -12718 6557 22961
686 22961 31884 33160 27662 14842 -1456 -15288 -25582 -30452 -25918 -14855 -668 15946 30829
699 30829 38371 38497 31413 16589 -3021 -21601 -37232 -47723 -48394 -40066 -25935 -6502 14764
712 14764 31653 42794 47018 42495 30248 15153 -1741 -17738 -27877 -31934 -31310 -24566 -13671
725 -13671 -3572 5176 12551 14314 12004 8247 3003 -2693 -5032 -4389 -2550 2218 8254 11914 13354
740 13354 12781 8000 264 -7219 -14313 -20385 -21683 -19040 -13966 -5432 4835 12583 18112 21070 19111
755 19111 13193 6614 -1028 -8692 -12327 -12529 -10933 -6118 679 5392 8386 9618 6714 1159 -4768
770d768n706n178q80L385N598Q549J0176P749N048J736l822q645j0114j1631j1176
785a9679o929k093J845P195J1041J1362J0490Q659L751j445n140p757j0276q887
799g863o128m249P33M629N864O815P042M242P72j033m100o489n634m217k656L94
815a1878L884N075N735O614M215J218q28l553o489o380n870n032k321J291K627
830a1692M460O333N265L594K765N89k116k670k957l887k987p90n38M67K086J239
846h39O12P89n1j666j009l30j231K55J833J560J918K807J789J2j67j185l326k755
864i84k110k732j122O50Q22J833K920K366J225J310M55j401j472j214j883q32
880b169O04K17N84K128J250M33J51o18k330j704j546k028q24O09J104J603K852
$$ plain form
770 -4768 -10474 -15652 -16532 -13147 -7549 1000 11176 18925 23973 25709 21887 13242 3128 -8503 -19679
785 -19679 -26608 -28701 -26856 -19661 -8620 2742 13232 21891 25642 24197 19057 11300 1024 -7863
799 -7863 -13991 -18240 -17507 -12878 -7014 -199 6843 11085 11857 10824 6724 235 -5399 -9616 -12272 -11878
815 -11878 -7994 -2919 2816 9430 13645 14863 14035 10482 3993 -2387 -8257 -13289 -15610 -14319 -11692
830 -11692 -7232 -899 4366 7960 10725 11314 9198 6528 3571 -316 -3303 -4093 -4631 -4164 -2078 -839
846 -839 -227 562 511 -1155 -2164 -2494 -3725 -3470 -1637 -77 1841 4648 6437 6449 6282 5097 1771 -984
864 -984 -3094 -5826 -6948 -6298 -5476 -3643 -723 1643 2868 4178 4633 3232 1760 546 -1337 -2169
880 -2169 -1565 -1348 -764 1364 2614 3047 3198 2580 250 -1454 -3000 -5028 -5852 -5243 -4139 -2536 316
897C16K833J739J732M63j436j413k111k991k573j266j244l38J672J787J293K677
913A140J765M21L86J17j310j484o76j355r64L80L88K47J001J112l37K46P0q51
931B96j165m03n69o80N80N16O18J130J404K94N11N96p80q20m16j441j404l99m50
950b582j28K74J029M36J079J176J53J60M33m46o95l19n17q96n9M1k60K44Q71q2
970h8K19N75j08l34j14m3p63K23L9k55n2P29M5J02O11k8l46L86k37r67K05j91
992c92k93RN49k4J9Q79j41m64L86j94p20k03L21n84Q0L19K40%Q99M02j02M01P0
1015A457o78m56o3j056m36Q4m85k42N84L75P4J076M86K39L03M60l91J3l2n99n34
1036A79j41m32p95M05l57m00K86M18j85J03O65Q2L20R06K62m0M64L25o26q7k93
$$ plain form
897 316 3149 4888 6620 7083 5647 4234 2123 -868 -3441 -4707 -5951 -6289 -4617 -2830 -1537 1140
913 1140 2905 3326 3712 3829 2519 1035 359 -996 -1960 -1580 -1192 -945 56 1168 831 1077 1147 296
931 296 -869 -1272 -1841 -2521 -1941 -1425 -807 323 1727 2021 2532 3128 2348 1528 1112 -329 -1733 -2132 -2582
950 -2582 -2710 -2436 -1407 -971 108 1284 1437 1597 2030 1584 889 570 53 -843 -902 -861 -1121 -877 -6 -88
970 -88 131 706 598 264 150 107 -656 -433 -394 -649 -701 28 73 175 786 758 412 798 561 -406 -201 -392
992 -392 -685 -676 -127 -151 -132 747 606 142 528 334 -386 -589 -268 -852 -772 -453 -213 -213 686 1088 986 1387 1457
1015 1457 779 323 260 -796 -1232 -1148 -1633 -1875 -1291 -916 -842 234 720 959 1262 1722 1331 1344 1312 713 179
1036 179 38 -394 -1189 -784 -1141 -1541 -1255 -837 -1022 -919 -254 -172 148 1054 1316 1276 1740 2065 1439 1352 1059
1057A059r29p15k23j088m19Mj58j2R12O09Q94R64J162M78J49O44k49r91k32j026
1077H33j442m97p08j110j78J97K31K78J332P94O59J014P20K1N09L21o36j13l01
1096A924j075q99o29p30r23m20j52m63M32P51M02Q00J381R12J047J083N43RM3
1115D036p59j368j154j344j636j185p53n75l1R23J066J169J946J221J022J222
1131C800M97l17k56k44j398j400o19j193j405j79m23o65K91L68K19Q21J082P97
1149b24J380J310Q44R83N30L53j089o90j738k115j410j902j255r28K80L42J079
1166d250K222J995J637J927J425J33n1m18j254j418j088j373j290m40l89k11J37
1183b706M4q1O0L93J61N34J150J104J182J901J218O49N91l99j566k139k146l214
$$ plain form
1057 1059 130 -585 -808 -1896 -2315 -2311 -2469 -2481 -1569 -960 -66 898 2060 2538 2687 3331 3082 2091 1859 833
1077 833 -609 -1106 -1814 -2924 -3102 -2905 -2674 -2396 -1064 -270 389 1403 2123 2144 2653 2974 2338 2225 1924
1096 1924 849 -50 -679 -1409 -2332 -2752 -2904 -3367 -2935 -2184 -1782 -982 399 1311 2358 3441 3984 3993 4036
1115 4036 3277 1909 755 -589 -2225 -3410 -4163 -4738 -4769 -3846 -2780 -1611 335 1556 2578 3800
1131 3800 4297 3980 3724 3480 2082 682 63 -1130 -2535 -2714 -3137 -3802 -3511 -3143 -2924 -2103 -1021 -224
1149 -224 1156 2466 3310 4293 4823 5176 4087 3397 1659 -456 -1866 -3768 -5023 -5951 -5671 -5329 -4250
1166 -4250 -2028 -33 1604 3531 4956 5089 5038 4620 3366 1948 860 -513 -1803 -2243 -2632 -2843 -2706
1183 -2706 -2662 -2743 -2683 -2290 -2129 -1595 -445 659 1841 3742 4960 5609 6200 5801 4235 2096 -50 -3264
1201c264k400j464j363J71J430K461K607L424K982J919J114L45j032k123k018
1216B789k187k551j520o85n49N18Q52Q25J149O00J96M7L17P7O8Q20J062Q54J164
1235C846J144R6m61q87k113k597k447j861j786l96L18J244K433K761K700K354
1251D348J859Q29l73q09j448k223j776j558j684n94k69r1J24L56K14J62N48P67
1269a618O37J384J598J394J604J221L89m45j230k223l037k696k463k320p28N93
1285g940J049K950L029K807K656J954M97o84j264k138k402j934j091o89M30J275
1301a495P36J041Q53j73j147j308j327j414o02M08J327K413L209K698K470J441
1317I130j9j938k422m168m348l603k734j087O40K541L174M377M191L412J710Q08
$$ plain form
1201 -3264 -5664 -7128 -8491 -8320 -6890 -4429 -1822 1602 4584 6503 7617 7962 6930 4807 2789
1216 2789 602 -1949 -3469 -4154 -4703 -4185 -3333 -2508 -1359 -759 -563 -516 -199 -122 -54 766 1828 2682 3846
1235 3846 4990 5086 4625 3738 1625 -972 -3419 -5280 -7066 -7462 -7144 -5900 -3467 -706 1994 4348
1251 4348 6207 7036 6663 5854 4406 2183 407 -1151 -2835 -3429 -3698 -3789 -3665 -3309 -3095 -2933 -2385 -1618
1269 -1618 -981 403 2001 3395 4999 6220 6609 6164 4934 2711 -326 -3022 -5485 -7805 -8533 -7940
1285 -7940 -6891 -3941 -912 1895 4551 6505 7002 6318 5054 2916 514 -1420 -2511 -3200 -2770 -1495
1301 -1495 -759 282 1135 962 -185 -1493 -2820 -4234 -4836 -4428 -3101 -688 2521 5219 7689 9130
1317 9130 9111 7173 4751 583 -3765 -7368 -10102 -11189 -10549 -8008 -4834 -457 3734 7146 8856 9664
1333I664j173k609k766l115k878j746o12J80J079J800J622J103O88M2q08j181
1349g10o54p43o8R44J557J313K291J012N30k01j339k356k571k526k231j054J85
1366f621Q31J957K518K543J724J805M24n17p96j398j775j173n64k95K21O49L26
1383a41J56m41k52j247j103n20l25N36J368J989K079K413J866O19j41j567k538
1400B751l053k943k823j686j86P82K163L016L204K644J947Q19m76j250k222k794
1416a07k135j309q35N23J581J558J604J856Q65o66r10j579k218j650j105m14R42
1433c999J918K366K561J997J313M03p04j820k885k745k658j754r30K96J382K304
1449b955K667K431J947J148M35j060j196j570k166j666p54l72M2R15P95J042P94
$$ plain form
1333 9664 8491 5882 3116 1 -2877 -4623 -5235 -5055 -3976 -2176 -554 549 1237 1279 471 -710
1349 -710 -1364 -2107 -2175 -1231 326 1639 3930 4942 5472 5271 3932 1576 -995 -3521 -5752 -6806 -6621
1366 -6621 -5790 -3833 -1315 1228 2952 4757 5181 4664 3868 2470 695 -478 -1042 -1337 -1116 -467 -141
1383 -141 15 -426 -678 -1925 -3028 -3548 -3873 -3337 -1969 20 2099 4512 6378 6997 6856 5289 2751
1400 2751 -302 -3245 -6068 -7754 -7940 -7158 -4995 -1979 1225 3869 5816 6635 6159 4909 2687 -107
1416 -107 -2242 -3551 -4386 -3863 -2282 -724 880 2736 3601 2935 2025 446 -1772 -3422 -4527 -4941 -3999
1433 -3999 -2081 285 2846 4843 6156 6559 5855 4035 1150 -1595 -4253 -6007 -6937 -6641 -5259 -2955
1449 -2955 -288 2143 4090 5238 5673 4613 3417 1847 -319 -1985 -2739 -3111 -3069 -2154 -1359 -317 477
1466D77M18K5k57j73n25o06m4K48L04P51M43K68J40J12n50n13q05o68n07j97J77
1487a482P8N22O57M78M77L25k63n4k19n04l5J37J96N9K33r0k1m10o9o63p15J27
1509a236l89n9M88Q55N50P54J079P2K03j94r52m93j324q87q37P5K04m4J326R74
1529A65P18M96J094n31k37l76j224p00o38k26l63K36P23J79R30Q09N43N6O0m52
1549A262o33p45o48l29m66J2L56N38M95N33M58L54J25k89k80m63n44n89k95k02
1569a350L52L60J09O30O43M54j9%k79n46m26n50n63L4k31J2N33Q98O41K89O97
1590A688J38m93J08o71r54o46o73m73K2K82M97K83P64P31L92N72J65k98M6n20
1610I60p31l96k67l53l08O0J23J43J79L40J6J64L97k21K56J58O8j2K46M2m16J6
$$ plain form
1466 477 895 920 663 490 -35 -641 -685 -437 -133 618 1061 1329 1469 1581 1031 518 -287 -955 -1462 -1659 -1482
1487 -1482 -1404 -882 -225 253 730 1055 792 738 519 15 -20 117 313 372 605 515 494 84 15 -648 -1363 -1236
1509 -1236 -1625 -1684 -1196 -341 209 963 2042 2114 2317 2123 1171 678 -646 -1533 -2370 -2295 -2091 -2135 -809 165
1529 165 883 1379 2473 1942 1705 1329 105 -595 -1233 -1459 -1822 -1586 -863 -684 246 1055 1598 1654 1714 1262
1549 1262 629 -116 -764 -1093 -1559 -1547 -1191 -653 -158 375 833 1187 1312 1023 743 280 -264 -853 -1148 -1350
1569 -1350 -998 -638 -529 101 744 1198 1179 1179 900 354 -72 -622 -1185 -1151 -1382 -1370 -837 61 702 991 1688
1590 1688 1826 1333 1441 770 -184 -830 -1503 -1976 -1954 -1672 -1175 -892 -128 603 995 1567 1732 1434 1480 960
1610 960 229 -167 -434 -787 -1095 -1035 -912 -769 -590 -250 -234 -70 327 106 362 520 588 576 822 864 448 464
1632D64q3n27j83j6m20k31K89l25J67K18J76J76K11M63O6J66J63K16n2N9j30o2
1654H05j97n08o63j84l93m72j97O6L83K97Q32P48N05P71M64P7j62j45q72p73p92
1675d10j116p20k06j68K23O38P68P88Q38P63M74J53ll15m23n90r04j73n17j61
1695a061j44K08L31R9L95K34J5j80j70j13j46q0K96K46N25O92L87N89QJ89r36
1716A384q94j167j190q74o53l82J61J178J139J783J493J343J014J25o22r32j392
1733A514j608j849j177l89k00M19J179J117J177J215N55K00m51l47q05q81m46
1750g77j34J93O50Q88M00M66M8m65p99j214j169q23o65j02P68J312J479J470J550
1769C076P89O0l9r44j765j445j287j228n61K85N89J060R48Q78O11J15l48l56o48
$$ plain form
1632 464 381 -146 -329 -345 -765 -996 -707 -1032 -865 -647 -471 -295 -84 379 445 611 774 990 938 997 867 805
1654 805 608 100 -563 -747 -1140 -1612 -1809 -1743 -1360 -1063 -231 517 1022 1793 2257 2334 2172 2027 1155 382 -410
1675 -410 -1526 -2246 -2452 -2620 -2397 -1759 -991 -203 635 1398 1872 2025 2022 1707 1284 694 -210 -383 -900 -1061
1695 -1061 -1205 -997 -666 -567 -172 62 77 -103 -273 -386 -532 -612 -316 -70 455 1147 1534 2123 2131 2320 1384
1716 1384 490 -677 -1867 -2741 -3394 -3776 -3615 -2437 -1298 485 1978 3321 4335 4460 3838 2906 1514
1733 1514 -94 -1943 -3120 -3509 -3709 -3290 -2111 -994 183 1398 1953 2153 1702 1355 550 -331 -777
1750 -777 -911 -718 -68 820 1220 1686 1734 1269 470 -744 -1913 -2736 -3401 -3503 -2735 -1423 56 1526 3076
1769 3076 3865 3925 3886 2942 1177 -268 -1555 -2783 -3344 -3059 -2470 -1410 -462 416 1027 1142 794 438 -210
1788b10l53M9L76O77N25R93Q92j30o73r13j529j835j469j003l44M87J526J943
1806i91K340K382J421M36k3j297k156k360k110j818o69L29R54J634K280J677J367
1823C396M69n58j479j663j857j503p72N02J164J916K364J927J355L86p82k090
1839B775k642k856k537j806m51J434J722K977L123K930K405Q16r12j773k887k900
1855e82l046j837n44J09J518K265K346K272J326K08n02j339j862j740j283m74
1871c165M78J154J837J842J467P66rj343j914k421k218j634m96L37J625K250K497
1888A053K364J366R39n36j253k328k419j835j085k93M98J398J740J613J100M71
1904B793j66j452j692j586j020k81L51J380J928K081K150J337j06j037k245k809
$$ plain form
1788 -210 -563 -514 -138 539 1064 2057 2949 2819 2146 1233 -296 -2131 -3600 -4603 -4947 -4460 -2934 -991
1806 -991 1349 3731 5152 5588 5565 4268 2112 -248 -2358 -4176 -4845 -4516 -3562 -1928 352 2029 3396
1823 3396 3865 3307 1828 165 -1692 -3195 -3967 -3465 -2301 -385 1979 3906 5261 5647 4865 2775
1839 2775 133 -2723 -5260 -7066 -7517 -6083 -4361 -1384 1739 4669 7074 7890 6978 5205 2318 -582
1855 -582 -3628 -5465 -6009 -5900 -4382 -2117 229 2501 3827 4035 3533 2194 332 -1408 -2691 -3165
1871 -3165 -2687 -1533 304 2146 3613 4379 4370 3027 1113 -1308 -3526 -5160 -5656 -5319 -3694 -1444 1053
1888 1053 3417 4783 5722 5186 3933 1605 -814 -2649 -3734 -4027 -3529 -2131 -391 1222 2322 2793
1904 2793 2627 1175 -517 -2103 -3123 -3404 -3053 -1673 255 2336 4486 5823 5717 4680 2435 -374
1920c74k936k255j480k16J281K350L018L155L026J280M07j107k359k823k886k500
1936d419j302k93J397J637K718K653J709Q91l82j260k498k304k142j558l1J026
1952d158J936K408K874K099J027R3j705k240k838k814k368j029K69J170K376K851
1968d9K702J960J436m7j172j923k309k193j822p23j28R19J763J607J407R91L62
1985B781m74j008j528j305o16l20L57J167J439J363R83O14k45j016j420j667j699
2002b594q35m90L32J062J558J787J263J113K61m00j234j352j401j095m85J0P84
2019a716J248J071R72P50J02p21o94j720j412p23l39P5J391J637J470J539J125
2036D055J24l39j275j750k060j857j001n78M15J267J534K147J862R13Q13l10j054
$$ plain form
1920 -374 -3310 -5565 -7045 -7261 -5980 -3630 -612 2543 5569 6849 7256 6149 3790 967 -1919 -4419
1936 -4419 -5721 -6014 -4617 -2980 -262 2391 4100 4991 4609 3349 851 -1453 -3595 -5153 -5184 -4158
1952 -4158 -2222 186 3060 5159 6186 6279 4574 2334 -504 -3318 -5686 -6715 -6446 -5276 -2900 -49
1968 -49 2653 4613 6049 6002 4830 2907 598 -1595 -3417 -4140 -4268 -3349 -1586 21 1428 2419 2781
1985 2781 2307 1299 -229 -1534 -2150 -2470 -2113 -946 493 1856 2839 3453 3208 2192 772 -895 -2594
2002 -2594 -3429 -3919 -3587 -2525 -967 820 2083 3196 3457 3057 1823 471 -930 -2025 -2510 -2500 -1716
2019 -1716 -468 603 1575 2325 2427 1706 1012 -708 -2120 -2843 -3182 -3107 -1716 -79 1391 2930 4055
2036 4055 4179 3840 2565 815 -1245 -3102 -4103 -4681 -4266 -2999 -1465 682 2544 3457 4270 3960 2906
2053B906j512j744j342j174l12j2R20J120J451J052P86K62k74p41q87j228p05
2070a434l93j78M82L88J103Q95M90N80K4m85n64o69j065n71l17q8K13L94N95N71
2090b9N94O00m4K45j06m17k48m25k66n86K9k48p9J21q5L75M7Q42j06M78M19K19
2112A330j50j96l80m26p12m43l20k36J75K83P15M94N46K63L71p1l97k37o63m65
2132e19o01J03r7K07M78N34K73M08p6Q0k91l09k87k37k27j32R3L14L17J99L35
2153E65J62j66q0k61k07p4m00j32k4K78Q6J38N7oQ4J40N1j05K69R2J25k9N2j08
2177E07m35k46o14l28l20J13oL07Q72P96O94N93L08J1n72n66j173j154o75m50
2197b338l39K78P54J211J039Q84Q05K27k88p19q36r48r52m66m34L70O54Q19Q86
$$ plain form
2053 2906 1394 -350 -1692 -2866 -3178 -3190 -2270 -1150 301 1353 2139 2401 2127 1386 499 -729 -1434
2070 -1434 -1827 -2005 -1523 -1135 -32 863 1353 1933 1957 1472 908 239 -826 -1397 -1714 -1802 -1589 -1195 -600 -29
2090 -29 565 1165 1121 1366 1260 843 595 170 -96 -682 -653 -901 -980 -859 -944 -569 -522 320 214 692 1111 1330
2112 1330 1180 984 604 178 -534 -977 -1297 -1533 -1358 -1075 -360 134 680 943 1314 1243 846 609 -54 -519
2132 -519 -1120 -1017 -1114 -907 -429 105 378 786 710 790 499 190 -97 -334 -561 -693 -600 -286 31 230 565
2153 565 727 561 481 220 13 -61 -461 -593 -617 -339 -253 -115 -58 -64 20 160 211 106 375 467 592 563 615 507
2177 507 72 -174 -788 -1116 -1436 -1323 -1329 -1022 -150 646 1340 1933 2241 2252 1680 1114 -59 -1213 -1888 -2338
2197 -2338 -2677 -2399 -1645 -434 605 1489 2294 2521 2233 1514 678 -270 -1222 -1688 -2122 -1752 -1098 -279 607
2216F07O36N21J54o41o49r26r42r16J07p9O99J004J188J095Q63K30m56m30j133
2235I32j196j193o83p59O1M84P68J130J245Q72N55L54k60o58p23o35r49n14k04
2254a373R8M04N8L50L66O4K75k23q9q0j35J80J97L18L65K94K6M5m38l21n34m77
2276f30n23l91j20M99K91O01L66N18M27L6N8k54m21k92l93k35K57j08L60K14L16
2297E76l49nl07m65n27k76j62KM24R20O21J000Q59K46J86n97o96j073r84j216
2317a823q67n61R0N29R69R55J364J229O48M61j06p08q76j134p91j102n81K22M51
2336a631N26O06Q90K85M63k1m29n90l70n08k96k59N28N74Q66O41L58M26M5m11
2356A693r69r36j162q10q19J38J61P11J425J147J151Q80N13K22n93j002j023j049
$$ plain form
2216 607 1243 1764 1918 1277 628 -298 -1240 -2156 -2049 -2128 -1429 -425 763 1858 2721 2951 2495 2065 932
2235 932 -264 -1457 -2140 -2899 -2838 -2354 -1586 -456 789 1661 2216 2570 2310 1652 929 294 -655 -1169 -1373
2254 -1373 -1275 -871 -813 -463 -97 -33 242 19 -70 -150 -285 -105 92 410 775 1069 1095 1140 702 381 -153 -630
2276 -630 -1153 -1544 -1664 -1165 -874 -273 93 611 1038 1074 1132 878 457 165 -228 -463 -206 -314 46 260 576
2297 576 227 222 -85 -550 -1077 -1353 -1515 -1513 -1089 -169 452 1452 2311 2557 2743 2146 1450 377 -607 -1823
2317 -1823 -2690 -3251 -3161 -2632 -1663 -708 656 1885 2533 2994 2888 2180 1304 170 -621 -1723 -2304 -2082 -1631
2336 -1631 -1105 -499 391 676 1139 1118 689 99 -271 -779 -1075 -1334 -806 -232 634 1275 1633 2059 2104 1693
2356 1693 724 -212 -1374 -2184 -3003 -2865 -2704 -1993 -568 579 1730 2610 3123 3345 2752 1750 727 -322
2374c22j107o41l06l8N46O32P83N96O20M66q7l27p9j96k91k34m1J41M22K26Jk20
2396E44m10k52o93p13k18j94O8O14Q09P88R51Q34J12L1l93q71o05r36q37m45J21
2417a695L05L90N77Q51L09J79j39m60n22m30k77j4K83N34Q35J004K87L81l53m02
2437A643j212j570j028j120m21M40N24J406J716J504J513N60K17o87r78j938j709
2454a140j452r24n02O49R34J689J438J279R59K0l95r88j448j063r58n06L8R45
2472a425R29J242J281P82J11o52j066j454j369j201o97j00N96J186J748J878J247
2489C036P45P6n36j163j498j465j527r10L1M44P86J294J020J084N85Ql94o05p99
2508B12q03k29l26K56N02Q12N92M23o0m80o23r40q26q23j81N09N59J191J285J007
$$ plain form
2374 -322 -1429 -2070 -2376 -2414 -1868 -1236 -453 143 763 1229 1142 815 736 540 249 15 -26 115 537 763 764 544
2396 544 134 -118 -811 -1524 -1742 -1936 -1868 -1254 -445 343 1294 2128 2240 2271 1878 1007 402 -534 -1371 -1816 -1695
2417 -1695 -1390 -1000 -423 428 737 916 777 317 -205 -635 -912 -926 -643 -109 726 1730 2017 2398 2045 1643
2437 1643 431 -1139 -2167 -3287 -3708 -3268 -2744 -1338 378 1882 3395 3955 4172 3485 2507 569 -1140
2454 -1140 -2592 -3516 -4018 -3369 -2435 -746 692 1971 2930 2950 2555 1567 119 -944 -1902 -2408 -2370 -1425
2472 -1425 -496 746 2027 2809 2920 2268 1202 -252 -1621 -2822 -3519 -3619 -3023 -1837 -89 1789 3036
2489 3036 3781 3857 3321 2158 660 -805 -2332 -3242 -3211 -2767 -1981 -687 333 1417 2002 2010 1616 1011 212
2508 212 -591 -820 -1146 -890 -388 424 1016 1439 1379 899 276 -664 -1490 -2313 -2494 -1985 -1426 -235 1050 2057
2528B057P44J57l99p98j297j243q85q71k88N01R63R28J340R46N58k59o10r74j031
2547d61r97q49n8L00J040J114J409J103L65qp89j153j670j487j174n09J51J016
2565b657J392J845J524J342N38j2r40j508j811j494j522m75L4P16J354J483J546
2582A355J368N52m7o33j339j270j238j053m10L39O38J138J132J059O85k8l98p82
2600A068r75j006r46k45K3M91P98Q98R42P48K13P0n46r48q41m78o37j92O7M86
2620a010M58R21L10J89O2l3o00n47k34j57k9L65K21L97L60R3J07m51m39o08m96
2641a121l04M0L23O07N81Q25K89N21q9l81o19r64q66n80l67K15P97M61R05Q09
2661A082N77L71r0m68p74j185o73n21m11K15P06O67J006P16O64ko9o71p83r91
$$ plain form
2528 2057 2801 2958 2559 1761 464 -779 -1664 -2535 -2823 -2322 -1359 -431 909 1855 2413 2154 1544 570 -461
2547 -461 -1458 -2307 -2365 -2065 -1025 89 1498 2601 2966 2958 2169 1016 -654 -2141 -3315 -3824 -3673 -2657
2565 -2657 -1265 580 2104 3446 3984 3972 3032 1524 -287 -1781 -3303 -3778 -3744 -3028 -1674 -191 1355
2582 1355 2723 3275 3228 2595 1256 -14 -1252 -2305 -2715 -2376 -1738 -600 532 1591 2276 2248 1850 1068
2600 1068 93 -913 -1859 -2104 -2081 -1590 -792 106 1048 1796 2009 2079 1533 585 -256 -734 -1371 -1563 -1496 -1010
2620 -1010 -552 369 679 868 930 897 297 -250 -484 -641 -670 -305 -84 313 673 766 873 422 -17 -625 -1121
2641 -1121 -1425 -1385 -1062 -455 126 951 1240 1761 1672 1291 672 -292 -1158 -1738 -2105 -1890 -1093 -632 273 1082
2661 1082 1659 2030 1940 1472 698 -487 -1160 -1681 -2092 -1877 -1171 -504 502 1218 1882 1880 1811 1140 357 -634
2681f34n21o12j15M55L10O39R32Q82K81m2J92o91p98o22o70l75Q7r1L90M04O87
2702H8M96J72O08j15k75n19j0n13m06l52J40J5j5K96L33K27J00K38P2J11o8l04
2724C19J14j87k48k07j99j76n7K09p9K72P7M93M04j52K65k95k27P0n85l06k83
2745g78j32k5K47L37K41P47j7L35k7k57l17m36m17l56r4j14N26Q9N89K98L44J60
2767I43j48k64j45l96l28o24kJ42P1N57K76M72J26N4r0o6k55l30m55m7J09k22
2789f22O6M98J25K62l4J96k19K4k11Nj07p2Q6R5m0j13L8J8l53j08J63j97K73M8
2813a79K59J76N08j24M9j27k98l27m14l13j74Q6K51J66M20K46M28J14K26k16j99
2834E58o42q2l52l96M4K22L32L61L79K20R9N6k42n03l30m94k38k6K40N34L63N88
$$ plain form
2681 -634 -1155 -1767 -1882 -1427 -1117 -478 454 1336 1617 1575 1767 1076 278 -344 -1014 -1389 -1302 -1393 -1003 -599 88
2702 88 584 756 1364 1249 974 455 445 -68 -474 -826 -686 -671 -686 -390 -57 170 270 508 580 691 623 319
2724 319 433 246 -2 -209 -408 -584 -641 -432 -511 -239 -162 331 735 583 848 553 326 396 -189 -495 -778
2745 -778 -910 -935 -688 -351 -110 637 620 955 928 671 354 -82 -499 -855 -949 -1063 -537 -448 141 439 783 943
2767 943 795 531 386 -10 -338 -962 -964 -822 -751 -194 82 554 680 734 644 578 323 -7 -462 -509 -400 -622
2789 -622 -556 -58 67 329 295 491 272 296 85 90 -17 -89 -3 92 52 -61 -23 -5 -358 -466 -303 -500 -227 -179
2813 -179 80 256 764 640 689 562 264 -63 -477 -790 -964 -878 -627 -461 -41 205 633 747 973 757 558
2834 558 -84 -166 -518 -914 -870 -648 -316 45 424 644 743 799 557 54 -276 -770 -1008 -1034 -794 -260 103 691
2856F91J76M27J98k88m71o85p51m42j81o3J64L90L99Q81L11L79K81j68l01l00
2876F47q35l09k34l33L32m3M06L56L76j36N6j96j62k74j45P8N2K30L27L95K53
2897H41K36r1l82n17l73m75m61k43j4L26L98L88O51M41L06L82N4l51m70m89n43
2918c86k01J7k41J1J77L43N5N37k15ok53K5lK9K0K78K81K79K04J49P5m94k98p15
2942c32m68m35l00k69L39N22L25R52N09M10N47Q3l84k85m78p74n03l56l37O8L7
2963a129J91N50p4N22P3O4o7k9K45J84P5j06L34j88K34j64p9n23n78k55n22l86
2985a628P5M0K71O72P41N36N38N56KP4l83m71p13m62o20m39l67K7K33L13M05L50
3007b50K97J43K87Q9J09r3R4L12k67K7j1k54k71k95m46l42p13j1j54K68L09L76
$$ plain form
2856 691 867 1294 1492 1204 733 48 -703 -1145 -1326 -1389 -1225 -835 -436 445 756 1135 1416 1248 947 647
2876 647 -188 -497 -731 -1064 -732 -775 -369 -13 363 227 283 87 -75 -349 -494 -416 -364 -134 193 588 841
2897 841 1077 986 604 87 -286 -761 -1222 -1465 -1479 -1153 -755 -367 284 725 1031 1413 1467 1116 646 157 -386
2918 -386 -587 -570 -811 -800 -623 -280 -225 312 97 91 -162 -137 -140 -111 -91 187 468 747 951 1100 1175 681 383 -332
2942 -332 -800 -1235 -1535 -1804 -1465 -943 -618 334 843 1253 1800 1883 1499 1214 736 -38 -541 -897 -1234 -1166 -1129
2963 -1129 -938 -388 -462 60 133 197 130 101 346 530 605 499 833 645 879 715 636 113 -465 -720 -1242 -1628
2985 -1628 -1553 -1513 -1242 -570 171 707 1245 1801 1803 1877 1494 1023 310 -152 -772 -1211 -1578 -1551 -1318 -1005 -600 -250
3007 -250 47 190 477 566 675 582 676 988 721 748 737 483 212 -83 -529 -871 -1584 -1595 -1749 -1481 -1172 -796
3029g96P58P33N72O02K28Nk06q51n83o57o42l94n27k09J92M67L20N71N08M29M77
3050I97j11J04J04j49k86k0k12N2k14l02jn43k09l04o7n33K72K19M94L09R40M94
3072A034P85K39J44j71m64o34j134l87o98l49j46m87O17M40N63P94O00L83J51
3091A280R2p9j62p9l29m65j68o0k01j82j11m39L14n00%j01J3L95N69N83O17N91
3113A578R7M82l64l19n14q10p14n98n15l32M7J27L73O83N06P64M36K50Q0J24k58
3134A123j01m41j94j48l06k80l51j03k87k9M8j64K79J09M38M71L31Q56O5O34k50
3155A700p6l94o48o22p18m38n96K5j31N13M36O39N15P25M4L16n2j42l22k28k01
3176C45m11O3j69k7r3j24n4l92L4j60J31M0J94L12P66L97M72J73O8P5l79o25o95
$$ plain form
3029 -796 -38 695 1267 1869 2097 2102 1896 1045 462 -195 -837 -1231 -1758 -1967 -1775 -1308 -988 -417 91 520 997
3050 997 886 990 1094 945 659 639 427 479 265 -37 -38 -581 -790 -1094 -1161 -1694 -1422 -1203 -709 -400 540 1034
3072 1034 1819 2058 2202 2031 1567 933 -201 -588 -1286 -1635 -1781 -2268 -1651 -1211 -648 146 746 1129 1280
3091 1280 1372 1293 1131 1052 723 258 90 30 -171 -353 -464 -903 -589 -1089 -1089 -1190 -1177 -782 -213 370 987 1578
3113 1578 1675 2157 1793 1474 960 150 -564 -1162 -1677 -2009 -1962 -1835 -1462 -779 -273 491 927 1177 1257 1381 1123
3134 1123 1022 581 387 239 -67 -347 -698 -801 -1088 -1117 -1069 -1233 -954 -845 -407 64 395 1251 1316 1950 1700
3155 1700 1624 1230 582 -40 -758 -1196 -1792 -1767 -1898 -1385 -949 -310 205 930 974 1290 1238 1096 774 546 345
3176 345 -66 -3 -172 -199 -292 -416 -470 -862 -828 -988 -857 -817 -623 -311 455 852 1324 1497 1565 1640 1261 636 -59
3199e9n59o03m19j84R2L30L36Q29N63O60M77N1k61k78q7m57m15k08j53k28p5l2
3221f80J89l4K23J83r3j1J28m8K89K2K87K60K78m3o2k02m55m14m20r2l15q6j51
3244a247L24L07N31K81M08L99O3L3l6k85n24k75m29j48o7pL5J62J7L19m5Q3J06
3267EK34M0J12l9J0K62j89q0j5k61m46L7l73r9j4LK57L66N13J49K00J53J46R8
3291A069l79l4m08l75m48k38R1l12J97K27L28K40J92K43o0K1M03n4k10j65k55
3312G3Kj52j06m4j00l83Ll2L4K06M92J24N48Q1N7j8j40K22l71k35k93m92j58k17
3336h99k12M6L53J5K00M57K67K54N6J28K10Q0k86k28kj99k86m22k96j8j28L1J44
3359g35j00L95L15K37M64J16N20k7P0j11k62l34m27n03o68j39k61O0rK50M18N91
$$ plain form
3199 -59 -618 -1221 -1640 -1824 -1732 -1402 -1066 -237 326 986 1463 1514 1253 975 888 431 16 -192 -345 -573 -648 -680
3221 -680 -491 -525 -302 -119 -212 -223 -95 -143 146 168 455 715 993 950 888 686 231 -183 -603 -695 -1010 -1096 -1247
3244 -1247 -923 -616 -85 196 604 1003 1066 1099 1063 778 254 -21 -450 -598 -665 -672 -637 -475 -458 -139 -184 -101 5
3267 5 239 279 391 352 362 624 435 355 340 79 -367 -330 -703 -802 -816 -813 -556 -190 323 472 672 825 971 1069
3291 1069 690 656 248 -127 -575 -813 -722 -1034 -837 -610 -282 -42 150 393 333 354 757 703 493 328 73
3312 73 75 -77 -183 -227 -327 -710 -707 -739 -705 -499 -7 117 665 746 803 785 645 867 496 261 -32 -524 -682 -899
3336 -899 -1111 -1065 -712 -697 -497 -40 227 481 537 665 875 955 669 441 439 240 -46 -468 -764 -782 -910 -879 -735
3359 -735 -835 -440 -125 112 576 692 1212 1185 1255 1144 882 548 121 -382 -1050 -1189 -1450 -1390 -1399 -1149 -731 -140
3381a40L55P26K21J60J07R9l64k27n37l56n27r8m46k12j64j35L06K72O10J14N54
3402C18K74K43L90K64n0j2k44m68m34l78p70k62k39k95j10K64K13O19L22P09L66
3423G20O48L70L6j1Q0o97m53n10q29n49m21l53q8K44K77K78O10N05O97N95O72
3444A821P3J84j90k83l25o77o02n76m98p16k16j1P2L90J82O15P43O98N83N45J15
3465A927K95j13m50l06p10q21n95n70n47m08K2M13j09O46O26N97R14O11L94L42
3485B158J13R6n34l34q77p23p14n11o77l51o5J44L94M15O27J013Q34O79M74K96
3505B457k3k13m19o33q27p86o05o74l53j47k39O96J69O76N21O02Q30L45N07K60
3525B144P6M3l42m57n63q23o51o86p04n06l3j72L35M94Q66J222N83J043O07K52
$$ plain form
3381 -140 215 941 1162 1322 1429 1528 1164 937 400 44 -483 -581 -1027 -1239 -1403 -1538 -1232 -960 -350 -236 318
3402 318 592 835 1225 1489 1439 1427 1183 715 281 -97 -867 -1129 -1368 -1663 -1773 -1509 -1296 -677 -355 354 720
3423 720 1368 1738 1774 1763 1843 1146 693 183 -646 -1195 -1616 -1969 -2057 -1813 -1536 -1258 -648 -143 554 1149 1821
3444 1821 1894 2078 1888 1605 1280 603 1 -575 -1073 -1789 -2005 -2016 -1944 -1554 -1372 -757 -14 684 1267 1812 1927
3465 1927 2222 2109 1659 1353 643 -178 -773 -1343 -1890 -2298 -2276 -1863 -1972 -1326 -700 -103 811 1422 1816 2158
3485 2158 2271 2367 1833 1499 622 -101 -815 -1326 -2003 -2354 -2419 -2275 -1881 -1466 -839 174 1008 1687 2161 2457
3505 2457 2434 2221 1802 1169 342 -444 -1049 -1723 -2076 -2223 -2462 -1766 -1597 -921 -400 202 1032 1377 1884 2144
3525 2144 2220 2263 1921 1464 901 78 -573 -1259 -1963 -2469 -2502 -2674 -2339 -1845 -979 243 826 1869 2476 2728
3545B728K04j71o52n27j205q95r39o90k60m17K8N14O78P11P46R44O29M69K22L31
3565B448l80j97k91q17p06m43o06l75o00j02j50J49L44N87N31N56P91O95M57M02
3585B293J52j93m32m78n98p80o78p93m55m34k19M25m7O38R20O82Q51Q30O47J16
3605B447N28p0q03l85r07j105j087n78o06l77n1L96N00R11R28J081R81P31K21
3624B755J0l77m17r07q39o54q68k01k66l1J49L32L25K50M56K73L56J42J69L89
3644A046L45J92L3k74K59j84o30o63o96q88m92n44n1j78M45J108R23J066P26R81
3664B524M43Q3l35n98q02j299j003r56m27k61j2L41N35R00P86P75M43L07K10O4
3684A718j66j95k55n48k31n43j15l93j89J3l52o9j6J73L20M34N77L54M16K20L22
$$ plain form
3545 2728 2932 2761 2109 1582 377 -518 -1457 -2147 -2407 -2824 -2796 -2282 -1604 -893 -147 797 1426 1895 2117 2448
3565 2448 2068 1871 1580 763 57 -386 -992 -1367 -1967 -2069 -2219 -2070 -1726 -1139 -608 -52 739 1434 1891 2293
3585 2293 2445 2252 1820 1342 744 -36 -714 -1507 -1962 -2396 -2615 -2190 -2237 -1599 -679 3 854 1684 2331 2447
3605 2447 2975 2905 2102 1717 810 -295 -1382 -1960 -2566 -2943 -2994 -2598 -2098 -1187 -259 822 1803 2534 2755
3624 2755 2765 2388 1971 1064 225 -429 -1297 -1498 -1764 -1795 -1646 -1314 -989 -739 -283 -10 346 488 657 1046
3644 1046 1391 1583 1616 1342 1601 1417 787 124 -572 -1460 -1952 -2496 -2547 -2725 -2280 -1172 -249 817 1543 2524
3664 2524 2967 3050 2715 2117 1315 16 -987 -1943 -2370 -2631 -2643 -2302 -1767 -867 -81 694 1137 1444 1654 1718
3684 1718 1552 1357 1102 554 323 -220 -335 -728 -917 -904 -1256 -1325 -1341 -1168 -848 -414 163 517 933 1153 1475
3705A475q2L3l19n20k69p02l00j97m34j05j75L36J75M10M46L57M96J44L21J30
3725A220K08k00j5m20l13m20n13o02l35k25j88K17K79M14O24P38L86O36J64J53
3745A808r2m97m34n95p69l96l18J5M4L14K99M69L21K94j74L80j54k25j51j30K50
3766B59j12J49K9oK32p1l31l30k97m83k4l6K4K63N14N69K34M74M16j87j16l59
3788H11l61o63n74l39l99L76rM43O59M35N49K05j75j9n53l07j79l71k94M3L26
3809c96k5N12L74J59J83k31m46k01l02k43j74J97K8M17L20L41J81L00j14l53l79
3830A48o00l91K4l50J24L18L91N64O21L14p4j32k06l58m97o36k12m56K41K13K63
3851f91N74M98L88J85J37k31o9m51k39j77n15j60Q7L26l7J36P2J8J17j87J9K14
$$ plain form
3705 1475 1393 1426 1107 587 318 -384 -684 -881 -1315 -1420 -1595 -1259 -1084 -674 -228 129 625 769 1090 1220
3725 1220 1428 1228 1213 793 480 60 -453 -1055 -1390 -1615 -1803 -1586 -1307 -893 -269 469 855 1491 1655 1808
3745 1808 1716 1219 785 190 -579 -975 -1293 -1278 -1234 -920 -621 -152 169 463 289 669 515 290 139 9 259
3766 259 147 296 325 319 551 480 149 -181 -478 -961 -985 -1021 -997 -734 -220 349 583 1057 1473 1286 1170 811
3788 811 450 -213 -787 -1126 -1525 -1149 -1158 -715 -56 379 928 1133 958 939 386 79 -100 -471 -765 -722 -396
3809 -396 -421 91 465 624 807 576 130 -71 -373 -616 -790 -593 -565 -148 172 513 694 994 880 527 148
3830 148 -452 -843 -819 -1169 -1045 -727 -336 228 849 1163 1089 957 751 393 -104 -740 -952 -1408 -1167 -954 -691
3851 -691 -117 381 769 954 1091 860 791 340 101 -76 -591 -751 -664 -338 -375 -239 -167 -149 -32 -219 -200 14
3873A4pK30L9M03J94l07j62K26m01m42l13m12J29k71J34L10O32N58K07P1K15k43
3895H04k55l10m73k9j31n8L19K42L85l4k8j20k46n49n43n8n35L42M51N88Q33J076
3917A671K84O22n7m32q52j322j243q99o07l18J09P63J120J240J528P72N85j29
3935B835l86q32j264q18j055l37m24M07O65O68Q45O27J85k0j61o60m18o37l57
3954a137k2K17M62R30Q00O20R8j30m97r31j137n43j033k73J37M75N26R70J036
3973E68R69P48J59q1n70m06q81o64p61j33n11K09K06Q0L26K96K73O9J05K73J39
3994D13M20L05J44J60j35j93n44l71p80o08o52k55j3L71P18P25N61J008K84K61
4014A819j94j77n34q39l51q3l98J65L42J75J88l3K04j53o16l78l93k98L77O4R37
$$ plain form
3873 14 7 237 276 679 873 566 404 630 229 -213 -526 -938 -809 -1080 -946 -636 -4 554 761 832 1047 804
3895 804 549 239 -234 -263 -394 -452 -133 109 494 460 432 312 66 -483 -1026 -1084 -1619 -1277 -826 -238 595 1671
3917 1671 1955 2577 2520 2088 1236 -86 -1329 -2228 -2835 -3153 -3044 -2281 -1161 79 1607 2379 2964 2835
3935 2835 2449 1617 353 -465 -1520 -1857 -2281 -1874 -1209 -541 304 931 1116 1096 935 275 -143 -780 -1137
3954 -1137 -1159 -942 -480 450 1250 1870 1968 1838 1341 410 -727 -1270 -2303 -2576 -2439 -1964 -1438 -468 568
3973 568 1537 2285 2444 2363 1793 1387 506 -158 -919 -1052 -1563 -1354 -1148 -1068 -742 -446 -173 -104 1 274 413
3994 413 833 1138 1282 1442 1307 1114 570 199 -581 -1189 -1841 -2096 -2109 -1738 -1020 -295 266 1274 1558 1819
4014 1819 1625 1448 914 75 -276 -359 -757 -592 -250 -75 113 80 284 131 -485 -863 -1256 -1554 -1177 -1113 -176
4035a76O66J208M85O29k96l97q56j082j163j136p27j99O4Q02R79J186J008R36
4053A931O10L2l61p26q04r34p88r3n36L61O57K23L82L66jl05J6o42P9m50K95J37
4075e51Q28M54M86N08K88l36n54o11j055o59p77l65J1M69O05Q52Q06P39N76J62
4095A876km31n65m64o39l47l07l2K31K9K93K9J72j31k42Q5J10m0J72M55J48M15
4117H15J24M34l02j31n10k27p47l69j50k98L7J67N79J97M27L72L78r%q0Ok61J64
4140F16j80J6k32j90r5m82k17k99k92j16L54K55P05M15O67O35K2J91k99n89n29
4161C56o62p23n16k57J48N40N49M36Q65K99K86k13m01l05o35j11n25pK96K93L29
4182D2N44N15J13l3l12o19p84o88j91k50oM48O44Q30R27N00M16j34m03m96o98
$$ plain form
4035 -176 490 1698 2183 2812 2516 2119 1263 181 -982 -2118 -2845 -3044 -2980 -2178 -1199 -13 995 1931
4053 1931 2541 2573 2212 1486 682 -252 -1040 -1133 -1669 -1308 -651 -428 -46 320 319 14 30 -612 -533 -983 -688 -551
4075 -551 277 731 1217 1725 2013 1677 1123 512 -543 -1202 -1979 -2344 -2333 -1864 -1259 -407 399 1138 1714 1876
4095 1876 1874 1443 878 414 -225 -572 -879 -911 -680 -651 -358 -329 -157 -288 -530 -445 -335 -375 -203 252 400 815
4117 815 939 1373 1071 940 430 203 -544 -913 -1063 -1361 -1324 -1157 -578 -381 46 418 796 787 787 707 713 452 616
4140 616 436 452 220 30 -65 -547 -764 -1063 -1355 -1471 -1117 -862 -157 258 925 1560 1582 1773 1474 885 356
4161 356 -306 -1029 -1545 -1802 -1654 -1114 -565 -129 736 1035 1321 1108 707 402 -233 -344 -869 -876 -580 -287 42
4182 42 586 1101 1214 1181 869 250 -534 -1222 -1413 -1663 -1669 -1221 -577 253 1180 1680 2096 1962 1559 1063 365
4203C65q00o07o22j60p7M25L58Q57O40N11L93o4J62k85l86l71l66l37j58j08l38
4224i68J43J76K28K48J50L46L6K83J43j98l94j74j61m59o9m6J31m6O05J86M05
4245E65L90O3J93m41m19n39o57m92l23K16R6P56O15P91O61L87K12Jp65j029o86
4266d05r19p22k46rN88R02P79Q99R11K68J83m84l08r78p76j076m70p3J26N02Q37
4287d71R02O75M30L16m2o57n63o71r46l61k04kO11P09L07P87N67J47j99k15m57
4308F63n18o42l39k94j70K84J34L63N24M63L19K49Q6k36m38j62k11m22l83k69
4328i99K30J23O7L84L37J75K02L01n0j29k28k06m8l80l13L3l97J37K43R9L24M20
4350C25K44K27J45j56k43k18n21j61k54p5j84J11K67K34N07K58K84K36j01l05
$$ plain form
4203 365 -435 -1042 -1664 -1824 -1901 -1476 -1118 -261 379 890 1283 1219 1381 1096 710 339 -27 -364 -522 -630 -968
4224 -968 -825 -649 -421 -173 -23 323 359 642 785 587 193 19 -142 -601 -670 -716 -585 -631 -26 160 565
4245 565 955 1018 1211 770 351 -188 -845 -1337 -1660 -1444 -1348 -592 23 814 1475 1862 2074 2075 1310 281 -405
4266 -405 -1324 -2046 -2292 -2301 -1713 -811 -32 867 1778 2046 2229 1745 1437 459 -317 -1393 -1863 -1936 -1810 -1308 -471
4287 -471 431 1106 1536 1852 1810 1153 590 -81 -1027 -1388 -1592 -1594 -983 -274 33 820 1387 1534 1335 1120 663
4308 663 145 -497 -836 -1130 -1300 -1016 -882 -519 5 468 787 1036 1122 886 448 286 75 -347 -730 -999
4328 -999 -769 -646 -579 -195 142 317 519 820 770 641 413 207 159 -221 -534 -501 -898 -761 -518 -419 -95 325
4350 325 569 796 941 785 542 324 -197 -358 -612 -687 -871 -760 -493 -259 248 506 790 1026 925 620
4370F20n5n19j66n17j70j88L02K12K49N74K34J65oO7k00m54k00m95j68l44L23
4391g36Q0J98O33N17J41K24k71p4l23n72l15l54r8q6J17L51N18L08L98K16K63
4412A135j91l37m09k31o01k17j06J15K54L19L43K47K17J97m1k78j36m61l52r8
4432f31J77LJ44N77M35k3K53j24k24k19o71k53l53j55j05M25L42P42L76J07L58
4453A181k8l0o21k18p36l86k85L2O6N11M58K39K41K47K5j97l54k88k59j78j05
4474f85O2L79L56M85K33r6j00k58k89m19l09k48k82l0L36N32M62N44L94o9K48
4495A246m29k21n12l30k41j80m5O1Q4M73P5M2j08J87k43L8m8Q4J61L87K72K41
4517I94q4J3m01m58m78l73m56j12R8J70O67N03O84L45L73j12k58l94o05o76m81
$$ plain form
4370 620 565 46 -120 -637 -807 -995 -693 -481 -232 342 576 741 735 802 602 148 -52 -547 -715 -1059 -736
4391 -736 -656 -458 175 692 833 1057 786 712 389 -183 -498 -852 -950 -1036 -919 -568 -50 258 656 872 1135
4412 1135 944 607 198 -33 -634 -851 -957 -842 -588 -269 74 321 538 735 694 416 280 -181 -533 -631
4432 -631 -454 -451 -307 270 705 682 935 811 587 368 -303 -556 -909 -1064 -1169 -744 -402 340 716 823 1181
4453 1181 1153 1123 502 284 -452 -838 -1123 -1091 -1025 -514 -56 183 424 671 696 499 145 -143 -402 -580 -685
4474 -685 -623 -244 112 597 830 734 634 376 87 -332 -641 -889 -1171 -1201 -865 -333 129 673 1067 998 1246
4495 1246 817 596 84 -246 -487 -667 -712 -651 -567 -94 -19 23 -85 102 -141 -103 -151 -67 94 481 753 994
4517 994 910 923 522 64 -414 -787 -1243 -1355 -1257 -1087 -420 83 767 1112 1485 1373 1115 721 116 -560 -1041
4538a041k30K95J28N96M01P16L2P8k64m70p41n12m01q4j17O14J025Q98Q27N30
4558B280J14k0p64j096j216r72r09m72K96P34R30J130J164P31O37J79m40r61o39
4577G06j041j074n71j18M26L71R31N16P55J25K0k62m32n53n63j78j17K31L69P30
4597B71M93M08L48j50m29o84n05q63m20j48l0N65L22O39P09L79K81K33l99j4n28
4618D78l28k70p8j83k8K64j91j94m2j05o3O0j21K53N97L76M10M04M22k8k32l59
4640A042n39r76p82m81j57j26M87O59O93Q91O01J36j47J9n30k71p99k60k32j12
4660h84K76O03L99L90R5ml39p11n89n07l19M0M19M18Q21P75Q06M72J79j35p50
4681A455q92r14r69m83n83K72J18Q09O80R81P72J02K93j63j96p15m24m12j55k84
$$ plain form
4538 -1041 -1271 -976 -848 -252 149 865 897 975 711 241 -500 -1012 -1413 -1497 -1614 -1000 25 923 1750 2280
4558 2280 2394 2374 1610 514 -702 -1674 -2583 -3055 -2759 -2025 -1095 35 1199 1930 2567 2746 2306 1345 706
4577 706 -335 -1409 -1980 -2098 -1672 -1301 -370 146 901 1026 1046 784 352 -201 -764 -942 -1059 -828 -459 271
4597 271 764 1172 1520 1370 941 257 -248 -1111 -1531 -1679 -1709 -1144 -822 -183 526 905 1186 1419 1020 1006 478
4618 478 150 -120 -198 -381 -409 -145 -336 -530 -572 -677 -740 -680 -801 -548 49 425 835 1239 1661 1633 1401 1042
4640 1042 503 -473 -1255 -1736 -1893 -2019 -1532 -873 -180 711 1312 1448 1301 1320 790 519 -280 -540 -772 -884
4660 -884 -608 -5 394 784 879 875 536 -175 -764 -1271 -1590 -1550 -1131 -713 108 883 1689 2161 2340 2205 1455
4681 1455 563 -351 -1320 -1803 -2386 -2114 -1996 -1187 -507 474 1246 1348 1641 1478 1282 567 143 -269 -424 -708
4701g08LL24K88M5K6j6k15j23j04k93J05K37J56N29J94N81K02j5j14j28n44n01
4723g1m53n69j46j87L07J55M80M75M06K41Q7J01j73k55J7l24r7J07n7K7k2q6L0
4746gn25M0j75j97P4J07L28J00P10M10R9R3K04k70m31l38l40m99l39l17K65J47
4768h61J02N26K58J44L11O5mj59J22k94K9J04k66J24j6k30P5j88J3k15l48n4r4
4791h56O4O00j0M37M15J22J16R2k67j73m14l16j33n67oJ22R1J54K03L44J25p4
4813F9QL34j02j6k27J24j1j56J33l1l8N1oj04k90j07j45n5K5K24q2L48L3K54L95
4838F28j48M93j12m80j23l00q2k71l83j03J23K5K54L14L1L68N42P0j49j40j51
4859D06q9m35l6k06M0O5Q2R2K46m5n0Lj88K69l57j32K28j52r2K64PK82K55p2j9
$$ plain form
4701 -708 -705 -381 -93 -48 -22 -38 -253 -376 -480 -773 -668 -431 -275 254 448 1029 1231 1216 1102 974 430 -71
4723 -71 -524 -1093 -1239 -1426 -1119 -964 -484 -9 397 638 725 826 653 398 415 91 -6 101 44 71 49 -37 -7
4746 -7 -532 -492 -667 -864 -790 -683 -355 -255 455 865 964 1057 1261 991 560 222 -118 -617 -956 -1273 -1008 -861
4768 -861 -759 -233 25 169 480 545 541 382 504 210 239 343 77 201 185 -45 30 -158 -145 -360 -708 -762 -856
4791 -856 -792 -192 -202 235 650 772 888 980 713 540 126 -190 -323 -890 -896 -774 -683 -529 -326 18 143 69
4813 69 77 411 309 293 66 190 179 23 156 125 87 138 132 28 -262 -369 -514 -569 -544 -320 -402 -54 -21 233 628
4838 628 480 973 861 381 258 -42 -124 -395 -778 -881 -758 -733 -479 -165 -134 234 776 846 697 557 406
4859 406 317 -118 -154 -360 -320 -255 -173 -81 165 120 70 73 -115 154 -203 -335 -107 -259 -351 -87 -80 202 457 385 366
4884C66J84k05j71m38n9m7L1k3N8J34K23j16M09M0r5N0J05p2m56J52j72j8K38
4907A18k57N9KO8k5o0r2R9j17J85J11N2j39J91n3Mk07R6p1m4j97J93M3J65k34
4932a10L30j73J06k00n5j69j69J19j2L1LL24J56L21J37J7j75M8l80l13l32j80
4954f76j15L4L03K33K92Q0L37K72k13M8k75k94j89K4m4j98R4L09K84j23K36j82
4976B37m18o8q8l88J00J45J45K17K78L99j0M18j93J5j65n72l24j67k36k21J43
4997g53J26J01M39K27J35J92k56J86p7p2k98K73j48Q3J72j13J34k01k70j38l65
5018f23M1k16K4K24j4O14K63L95J20n5J18k95j51k32l78j58k92o3J65k8K22J60
5040a59qK0K43JPJ57q5P3Q5P5R7R4k2j71k98l38l57k88j61n9K39K00M30J86M74
$$ plain form
4884 366 550 345 174 -264 -323 -370 -339 -362 -304 -170 53 -63 346 386 291 341 446 374 -82 70 -102 -120 118
4907 118 -139 -80 -78 -10 -35 -95 -187 -88 -205 -20 91 143 4 195 142 146 -61 35 -36 -80 -277 -84 -41 124 -110
4932 -110 220 47 153 -47 -102 -271 -440 -321 -333 -302 -299 25 181 502 639 656 481 529 149 -164 -496 -676
4954 -676 -791 -757 -454 -221 71 151 488 760 547 595 320 26 -163 -139 -183 -381 -287 22 306 183 419 237
4976 237 -181 -249 -337 -725 -625 -480 -335 -118 160 559 549 967 774 789 624 52 -272 -439 -675 -896 -753
4997 -753 -627 -526 -87 140 275 467 211 397 320 248 -50 223 75 158 330 217 351 150 -120 -258 -623
5018 -623 -582 -798 -774 -550 -564 50 313 708 828 773 891 596 445 213 -165 -323 -615 -678 -513 -541 -319 -159
5040 -159 -167 -147 96 97 104 261 176 249 334 409 506 600 578 407 109 -229 -586 -874 -1035 -1094 -855 -655 -225 -39 435
5065D35L19K86j16N0l76kl07l65l88j15j54J07M6J00K29J0L1R5J06j33J53L30
5087C41N8J97P7p1L44J3m32l51m51n48k18k53m9J90K51M38N32K74N61L32p2q6
5109A077Km90k16l80j50k89k29J92k02J9Q8K08r3p9K65K04J17J59L13J85K73L6
$$ plain form
5065 435 754 1040 924 974 598 596 289 -76 -464 -579 -733 -626 -580 -480 -251 -241 -210 -115 -9 -142 11 341
5087 341 399 596 673 602 946 959 527 176 -275 -823 -1041 -1294 -1343 -1153 -902 -464 68 342 903 1235 1163 1077
5109 1077 1079 589 373 -7 -157 -446 -675 -483 -685 -666 -578 -370 -463 -542 -277 -73 44 203 516 701 974 1010
$$ [...]
8191H9
##END NTUPLES=NMR FID
##END=
