##TITLE=1H_AM_NVHexyNE3
 CDCl3
 8 sc, 
 7.6.2023
##JCAMPDX= 6.0         $$ Bruker NMR JCAMP-DX V2.0
##DATA TYPE= NMR FID
##DATA CLASS= NTUPLES
##ORIGIN= UXNMR, Bruker Analytische Messtechnik GmbH
##OWNER= root
$$ XWIN-NMR		Version 3.5
$$ Wed Jun  7 16:24:00 2023 Russian Standard Time (UT+4h)  she@DPX200
##.OBSERVE FREQUENCY= 200.13135
##.OBSERVE NUCLEUS= ^1H
##.DELAY= (6, 6)
##.ACQUISITION MODE= SIMULTANEOUS
##.ACQUISITION SCHEME= undefined
##.AVERAGES= 8
##.DIGITISER RES= 18
##SPECTROMETER/DATA SYSTEM= spect
##.PULSE SEQUENCE= zg30
##.SOLVENT NAME= CDCl3
##.SHIFT REFERENCE= (INTERNAL, CDCl3, 0, 15.7039)
##AUDIT TRAIL= $$ (NUMBER, WHEN, WHO, WHERE, WHAT)
$$ ##TITLE= Audit trail, XWIN-NMR		Version 3.5
$$ ##JCAMPDX= 5.01
$$ ##ORIGIN= Bruker BioSpin GmbH
$$ ##OWNER= she
$$ F:/spectra/data/she/nmr/H-F/1/audita.txt
$$ ##AUDIT TRAIL=  $$ (NUMBER, WHEN, WHO, WHERE, WHAT)
(   1,<2023-06-07 16:22:57.09 +0400>,<she>,<DPX200>,
      <created by zg, POWCHK disabled, PULCHK disabled
       configuration hash MD5:
       00 E9 B6 7A A2 85 ED C7 34 08 36 98 17 FE 4E 26
       data hash MD5: 16K
       89 0B E6 68 31 A9 D1 F6 88 9C 8B B5 14 93 E7 00>)
$$ ##END=
$$ 
$$ hash MD5
$$ D8 FD 46 C0 CF A7 FE B6 48 0A 17 35 0B 0D 27 81
##$RELAX= 
##$RELAX= 
##$RELAX= 
##$RELAX= 
##$RELAX= 
##$RELAX= 
$$ Bruker specific parameters
$$ --------------------------
##$DU= <F:/spectra>
##$EXPNO= 1
##$NAME= <H-F>
##$PROCNO= 1
##$TYPE= <nmr>
##$USER= <she>
##$AMP= (0..31)
100 100 100 100 100 100 100 100 100 100 100 100 100 100 100 100 100 100 
100 100 100 100 100 100 100 100 100 100 100 100 100 100 
##$AQSEQ= 0
##$AQ_mod= 1
##$AUNM= <au_zg>
##$AUTOPOS= <>
##$BF1= 200.13
##$BF2= 200.13
##$BF3= 200.13
##$BF4= 200.13
##$BF5= 200.13
##$BF6= 200.13
##$BF7= 200.13
##$BF8= 200.13
##$BYTORDA= 1
##$CFDGTYP= 0
##$CFRGTYP= 5
##$CHEMSTR= <none>
##$CNST= (0..31)
1 1 145 1 1 1 1 1 1 1 1 1 1 1 1 1 1 1 1 1 1 1 1 1 1 1 1 1 1 1 1 1 
##$CPDPRG= <>
##$CPDPRG1= <>
##$CPDPRG2= <>
##$CPDPRG3= <>
##$CPDPRG4= <mlev>
##$CPDPRG5= <mlev>
##$CPDPRG6= <mlev>
##$CPDPRG7= <mlev>
##$CPDPRG8= <mlev>
##$CPDPRGB= <>
##$CPDPRGT= <>
##$D= (0..31)
0 1.2 0 0 0 0 0 0 0 0.06 0 0.03 0 0 0 0 0.0002 0 0 0 0 0 0 0 0 0 0 0 0 
0 0 0 
##$DATE= 1686140576
##$DBL= (0..7)
120 120 120 120 120 120 120 120 
##$DBP= (0..7)
150 150 150 150 150 150 150 150 
##$DBP07= 0
##$DBPNAM0= <>
##$DBPNAM1= <>
##$DBPNAM2= <>
##$DBPNAM3= <>
##$DBPNAM4= <>
##$DBPNAM5= <>
##$DBPNAM6= <>
##$DBPNAM7= <>
##$DBPOAL= (0..7)
0.5 0.5 0.5 0.5 0.5 0.5 0.5 0.5 
##$DBPOFFS= (0..7)
0 0 0 0 0 0 0 0 
##$DE= 6
##$DECBNUC= <off>
##$DECIM= 32
##$DECNUC= <off>
##$DECSTAT= 4
##$DIGMOD= 1
##$DIGTYP= 9
##$DL= (0..7)
0 120 120 120 120 120 120 120 
##$DP= (0..7)
150 150 150 150 150 150 150 150 
##$DP07= 0
##$DPNAME0= <>
##$DPNAME1= <>
##$DPNAME2= <>
##$DPNAME3= <>
##$DPNAME4= <>
##$DPNAME5= <>
##$DPNAME6= <>
##$DPNAME7= <>
##$DPOAL= (0..7)
0.5 0.5 0.5 0.5 0.5 0.5 0.5 0.5 
##$DPOFFS= (0..7)
0 0 0 0 0 0 0 0 
##$DQDMODE= 0
##$DR= 18
##$DS= 0
##$DSLIST= <SSSSSSSSSSSSSSS>
$$ [...]
##$SUBNAM2= <"">
##$SUBNAM3= <"">
##$SUBNAM4= <"">
##$SUBNAM5= <"">
##$SUBNAM6= <"">
##$SUBNAM7= <"">
##$SUBNAM8= <"">
##$SUBNAM9= <"">
##$SW= 18.05172834244
##$SWIBOX= (0..15)
0 0 2 0 0 0 0 0 0 0 0 0 0 0 0 0 
##$SW_h= 3612.71676300578
##$TD= 16384
##$TD0= 1
##$TE= 0
##$TE2= 300
##$TE3= 300
##$TEG= 300
##$TL= (0..7)
0 120 120 120 120 120 120 120 
##$TP= (0..7)
150 150 150 150 150 150 150 150 
##$TP07= 0
##$TPNAME0= <>
##$TPNAME1= <>
##$TPNAME2= <>
##$TPNAME3= <>
##$TPNAME4= <>
##$TPNAME5= <>
##$TPNAME6= <>
##$TPNAME7= <>
##$TPOAL= (0..7)
0.5 0.5 0.5 0.5 0.5 0.5 0.5 0.5 
##$TPOFFS= (0..7)
0 0 0 0 0 0 0 0 
##$TUNHIN= 0
##$TUNHOUT= 0
##$TUNXOUT= 0
##$USERA1= <user>
##$USERA2= <user>
##$USERA3= <user>
##$USERA4= <user>
##$USERA5= <user>
##$V9= 5
##$VALIST= <valist>
##$VCLIST= <CCCCCCCCCCCCCCC>
##$VD= 0
##$VDLIST= <DDDDDDDDDDDDDDD>
##$VPLIST= <PPPPPPPPPPPPPPP>
##$VTLIST= <TTTTTTTTTTTTTTT>
##$WBST= 1024
##$WBSW= 4
##$XGAIN= (0..3)
0 0 0 0 
##$XL= 0
##$YL= 0
##$YMAX_a= 247759
##$YMIN_a= -265954
##$ZGOPTNS= <>
##$ZL1= 120
##$ZL2= 120
##$ZL3= 120
##$ZL4= 120
##$ABSF1= 10
##$ABSF2= 0
##$ABSG= 5
##$ABSL= 3
##$ALPHA= 0
##$AQORDER= 0
##$ASSFAC= 0
##$ASSFACI= 0
##$ASSFACX= 0
##$ASSWID= 0
##$AUNMP= <proc_1d>
##$AZFE= 0.1
##$AZFW= 0.1
##$BCFW= 1
##$BC_mod= 2
##$BYTORDP= 1
##$COROFFS= 0
##$CY= 11.3945322036743
##$DATMOD= 1
##$DC= 2
##$DFILT= <>
##$DTYPP= 0
##$F1P= 15.7292609196834
##$F2P= 12.9074282941183
##$FCOR= 0.5
##$FTSIZE= 0
##$FT_mod= 4
##$GAMMA= 1
##$GB= 0.15
##$INTBC= 1
##$INTSCL= 1
##$ISEN= 128
##$LB= 0.24
##$LEV0= 0
##$LPBIN= 0
##$MAXI= 10000
##$MC2= 0
##$MEAN= 0
##$ME_mod= 0
##$MI= 1.114404
##$NCOEF= 0
##$NC_proc= 0
##$NLEV= 6
##$NOISF1= 3.799351
##$NOISF2= 2.8
##$NSP= 1
##$NTH_PI= 0
##$NZP= 0
##$OFFSET= 15.70392
##$PC= 1
##$PHC0= -20062.2
##$PHC1= 9.652719
##$PH_mod= 1
##$PKNL= yes
##$PPARMOD= 0
##$PSCAL= 0
##$PSIGN= 0
##$REVERSE= no
##$SF= 200.130013532006
##$SI= 16384
##$SIGF1= 3
##$SIGF2= 2
##$SINO= 400
##$SIOLD= 16384
##$SREGLST= <1H.CDCl3>
##$SSB= 0
##$STSI= 0
##$STSR= 0
##$SW_p= 3612.71676300578
##$SYMM= 0
##$S_DEV= 0
##$TDeff= 0
##$TDoff= 0
##$TI= <>
##$TILT= no
##$TM1= 0
##$TM2= 0
##$TOPLEV= 0
##$USERP1= <user>
##$USERP2= <user>
##$USERP3= <user>
##$USERP4= <user>
##$USERP5= <user>
##$WDW= 1
##$XDIM= 8192
##$YMAX_p= 0
##$YMIN_p= 0
$$ End of Bruker specific parameters
$$ ---------------------------------
##NTUPLES= NMR FID
##VAR_NAME=  TIME,          FID/REAL,        FID/IMAG
##SYMBOL=    X,             R,               I
##VAR_TYPE=  INDEPENDENT,   DEPENDENT,       DEPENDENT
##VAR_FORM=  AFFN,          ASDF,            ASDF
##VAR_DIM=   8192,          8192,            8192
##UNITS=     SECONDS,       ARBITRARY UNITS, ARBITRARY UNITS
##FACTOR=    0.0002768,     1,               1
##FIRST=     0,             0,               0
##LAST=      2.2672688,     0,               0
##MIN=       0,             -265954,         0
##MAX=       2.2672688,     247759,          0
$$ Real data points
##PAGE= N=1
##DATA TABLE= (X++(R..R)), XYDATA
0 0 0 0 0 0 0 0 0 0 0 0 0 0 0 0 0 0 0 -3 8 -8 8 -8 9 -16 16 -21 24 -25 32 -37 41 -49 56 -63 71 -83 93 -103
38 -103 116 -130 146 -162 178 -201 223 -247 272 -299 331 -363 402 -442 488 -536 592 -651 720
57 720 -794 882 -977 1090 -1220 1374 -1554 1768 -2016 2274 -2391 1392 12423 245638 -25669
72 -25669 -222223 127277 99383 -125666 4075 49456 -56362 65988 10305 -144931 91616
83 91616 146827 -200836 -64790 247759 -50263 -211650 141329 112174 -153892 -5207 92648
94 92648 -49207 10933 25088 -90213 61740 104103 -159390 -41921 211025 -60473 -189428
105 -189428 145822 103800 -170967 -6004 121767 -55547 -32804 45111 -47187 23861 70576
116 70576 -111350 -26045 165547 -59616 -154280 139868 86415 -167835 3408 134067 -62451
127 -62451 -55782 65414 -17743 -11419 48931 -63348 -21272 115629 -47297 -116508 115599
138 115599 64522 -148009 8030 124965 -65498 -65167 74907 -653 -38339 34190 -22252
149 -22252 -21067 70236 -28551 -78473 85683 45006 -115734 13229 105543 -61083 -58884 76472
161 76472 5173 -51062 28708 3208 -24952 39558 -11852 -54146 57647 31214 -88451 12443
173 12443 84020 -55652 -51021 71770 5170 -56742 26350 19031 -29273 18535 4795 -34897
185 -34897 32407 23866 -58148 9095 61397 -41526 -37806 59041 4537 -50246 22804 23814
197 23814 -29114 5755 13506 -22456 12457 17349 -35208 2916 39616 -28698 -27047 42517 2520
210 2520 -40114 18136 22112 -25727 -110 17346 -13841 1537 14299 -17879 -323 25027
222 25027 -16428 -17195 29017 1784 -28358 14135 17211 -20920 -1640 16092 -10241 -4202 11228
235 11228 -9391 -4238 14679 -8704 -12251 17145 1634 -19253 8808 12568 -14888 -2357 13472
248 13472 -5722 -5698 8949 -2043 -4534 7910 -1581 -6639 8273 2324 -9675 4251 7397 -7900
262 -7900 -2075 7658 -2954 -4639 4417 -535 -3724 2792 -461 -3752 3098 976 -4918 1720 3667
277 3667 -3987 -1201 4376 -949 -2538 2746 1053 -1680 1349 1053 -1094 1057 1048 -1423 528 1587
293 1587 -1339 -931 1463 -275 -1671 247 412 -1089 -606 93 -487 -438 -162 -436 -168 237 -286 -325 541
312 541 565 -388 142 1079 299 -332 632 863 -204 -41 740 226 -279 140 175 -246 -288 -110 -277 -482 -312
333 -312 -122 -544 -572 143 -167 -836 208 356 -787 -12 1056 -590 -318 1594 -68 -1011 1741 882
351 882 -1802 1134 2113 -1800 -409 2571 -1023 -1601 1866 -318 -1934 1401 -227 -2520 1760 712
367 712 -3842 1107 3049 -3908 -1467 4506 -1534 -3510 3645 908 -3240 2350 1382 -2955 2662 2106
383 2106 -4706 2035 5311 -5410 -2100 7729 -2003 -6435 5484 2380 -6434 1737 3229 -4718 1160
398 1160 2834 -5945 1195 6380 -7317 -3513 10420 -2697 -9745 8151 5062 -9801 1698 7434
412 7434 -5386 -625 5577 -4744 115 7617 -6714 -4183 12137 -2476 -12236 9658 6973 -13343
426 -13343 280 10713 -6781 -4529 7014 -3417 -2770 6626 -5619 -4931 11848 -2673 -13276
439 -13276 11060 8483 -15873 552 14872 -7642 -7261 10508 -980 -5517 6946 -2700 -5304
452 -5304 11127 -1858 -13736 11611 9080 -18480 27 17800 -9943 -11207 13319 553 -10327
465 -10327 6083 787 -6906 8164 -252 -12667 10427 9375 -18163 351 19721 -10163 -12841
478 -12841 16290 3040 -13566 6067 5515 -7701 4813 2393 -10378 7690 8438 -16647 -204
491 -204 18891 -10816 -14252 17129 3580 -16989 5346 8890 -9406 965 5025 -8137 4409
504 4409 7912 -13753 -133 18064 -10081 -13589 18469 4427 -18687 6339 12393 -11007 -1711
517 -1711 8511 -6301 348 7595 -10346 -1635 15254 -9001 -13296 17086 3991 -19693 5750
530 5750 13889 -12327 -4518 11031 -4395 -3651 7193 -5699 -2726 12206 -5916 -11006 14900
543 14900 4483 -17767 5577 14718 -11952 -5862 12781 -2628 -6861 6715 -2031 -4338 8367
556 8367 -3594 -9689 11536 3767 -16384 4540 13703 -12125 -6793 13636 -1925 -9191 6903
569 6903 1283 -5692 6120 -344 -7805 8779 4408 -13336 3781 13129 -10636 -6785 13709 -950
583 -950 -10604 6517 3617 -7122 3026 1982 -6670 4619 3885 -10431 1751 10653 -8850 -6609
597 -6609 12057 -386 -10690 5847 5287 -7190 1313 4256 -4633 2115 4253 -6822 898 8877
611 8877 -6356 -5651 10491 283 -10022 5092 5825 -7401 -375 5184 -3961 -722 3817 -4686
625 -4686 -857 6545 -4661 -5322 8299 592 -9040 4267 6023 -6795 -1030 6119 -2603 -1981 4180
640 4180 -2025 -1600 5136 -2183 -4310 6137 1321 -7356 2817 5634 -5817 -2084 5619 -1891 -3493
655 -3493 3145 -558 -2586 2814 -831 -3562 3750 1325 -5507 1806 4814 -4332 -1968 5236 -687
670 -687 -3351 3043 963 -2330 1994 570 -2534 2440 1641 -4043 887 3898 -3377 -2250 4091 -508
686 -508 -3737 2025 1194 -2804 598 970 -2134 789 1438 -2663 208 3050 -2016 -1739 3437 245
702 245 -2903 1840 1905 -1938 289 1688 -1042 111 1327 -1394 -269 1966 -1241 -1722 2072 205
718 205 -2666 704 1428 -1859 -653 1243 -761 -724 869 -560 -469 1196 -440 -1042 1570 583 -1531
735 -1531 735 1536 -1004 -327 1425 -166 -663 816 -12 -446 705 -215 -945 596 249 -1414 64
752 64 868 -1075 -785 881 -154 -921 320 245 -558 250 354 -353 342 514 -406 157 847 -171 -312
771 -312 778 297 -501 262 356 -333 -129 203 -290 -194 124 -427 -280 185 -373 -572 205 45 -543 45 258
792 258 -345 -49 331 -16 -55 349 94 28 414 178 -102 337 312 -162 188 298 -222 -39 302 -217 -283 215
814 215 -258 -498 115 -74 -474 -62 83 -340 -54 160 -257 34 379 -164 -129 585 138 -184 470 442 -191
835 -191 215 410 -24 53 214 -174 88 266 -528 -192 454 -413 -728 300 43 -848 -67 278 -582 -99
855 -99 233 -395 100 482 -511 -21 1002 -287 -596 1038 513 -789 452 933 -486 -94 628 -369 -110
874 -110 524 -667 -392 890 -587 -1133 924 211 -1566 159 936 -1146 -427 830 -503 -384 771
891 771 -452 -360 1255 -329 -1046 1489 693 -1614 668 1623 -1264 -476 1576 -388 -819 1002 -372
908 -372 -798 1142 -435 -1526 1389 467 -2384 584 1843 -1921 -949 2088 -589 -1409 1385 103
924 103 -1165 1325 181 -1557 1583 1031 -2317 723 2497 -1973 -1093 2796 -467 -2142 1723 548
940 548 -1792 841 407 -1843 955 959 -2574 397 2424 -2416 -1508 3085 -518 -2690 2064 1099 -2262
957 -2262 872 1318 -1675 873 1611 -2277 432 2887 -2239 -1492 3652 -442 -3228 2366 1538 -3118
973 -3118 517 1875 -2169 -70 1678 -2257 -308 2640 -2210 -1858 3586 -410 -3637 2551 2007 -3413
989 -3413 376 2804 -1931 -537 2370 -1459 -625 2763 -1448 -1779 3556 -171 -3678 2509 2203 -3814
1005 -3814 28 3229 -2230 -1479 2458 -1220 -1503 2214 -1125 -2101 2970 -76 -3667 2451 2427 -3857
1021 -3857 151 3867 -2167 -1763 3227 -516 -1849 2484 -216 -2066 2675 450 -3439 2120 2401
1036 2401 -3893 -169 3830 -2319 -2357 3198 -259 -2704 1884 350 -2434 1695 710 -3001 1518 2336
1052 2336 -3329 -205 3901 -1856 -2305 3491 283 -2818 1939 1219 -2250 1193 1246 -2447 990 2157
1068 2157 -2980 -410 3407 -1951 -2560 3219 77 -3316 1562 1366 -2611 585 1497 -2189 395 2102
1084 2102 -2257 -492 3183 -1421 -2097 3156 457 -3080 1774 1856 -2411 236 1967 -1680 -279 1971
1100 1971 -1623 -863 2411 -1099 -2172 2409 420 -3054 1129 1774 -2421 -216 2011 -1431 -782 1738
1116 1738 -909 -984 1986 -467 -1707 2055 705 -2304 1121 1854 -2019 -258 2110 -1088 -954 1665
1132 1665 -482 -1233 1477 -262 -1699 1268 495 -2173 647 1504 -1937 -490 1824 -965 -1154 1566
1148 1566 -88 -1168 1187 349 -1240 968 848 -1395 509 1457 -1231 -382 1676 -543 -1082 1223
1164 1223 113 -1285 756 400 -1210 299 636 -1202 -18 973 -1012 -553 1181 -466 -1033 972
1180 972 279 -1019 559 654 -777 295 833 -610 29 1033 -450 -346 1001 -163 -741 729 186
1197 186 -902 336 441 -809 -115 592 -572 -310 640 -362 -542 561 -43 -682 436 277 -671 233
1215 233 578 -446 51 761 -182 -192 611 -5 -390 434 168 -426 227 276 -491 -68 292 -444 -188 324
1235 324 -284 -462 260 -123 -447 175 24 -395 118 284 -260 90 337 -138 -45 456 43 -91 357 166
1255 166 -219 228 229 -222 43 239 -233 -161 161 -231 -263 153 -156 -347 67 59 -366 9 168 -248 -36 241
1277 241 -148 -52 245 -19 -77 289 130 -101 314 169 -188 144 273 -113 -21 272 -103 -202 134 -113 -239
1298 -239 67 -93 -210 78 -63 -347 65 174 -313 -71 228 -95 -129 292 -11 -118 272 59 -74 349
1318 349 165 -263 217 434 -301 -122 439 -171 -266 264 -49 -336 62 -61 -370 97 17 -476 46 307 -459
1339 -459 -147 484 -114 -355 391 125 -198 269 205 -156 271 236 -362 263 527 -403 -161 592 -216 -536 418
1360 418 139 -520 41 109 -414 50 98 -546 81 332 -616 -281 737 -182 -671 586 428 -582 162 517
1380 517 -190 73 365 -270 170 549 -474 -217 918 -178 -877 577 485 -850 -133 569 -451 -321
1398 -321 264 -322 -87 388 -508 -331 792 -106 -974 707 653 -935 -55 963 -258 -361 568 9 -90
1417 -90 485 -283 -248 827 -72 -1027 698 791 -1180 -310 1068 -384 -891 561 143 -501 194 -126 -403
1436 -403 622 -14 -969 679 861 -1116 -273 1393 -210 -991 795 549 -604 176 344 -231 398 49
1454 49 -794 542 761 -1220 -468 1389 -408 -1378 768 623 -1022 -144 536 -359 10 180 -552 429
1472 429 734 -1044 -295 1594 -215 -1358 1053 1038 -1176 -96 1080 -287 -355 336 -283 161 627 -880
1490 -880 -434 1327 -411 -1536 1023 1002 -1552 -409 1301 -338 -804 497 30 -168 433 -426 -194
1507 -194 1181 -182 -1267 1090 1182 -1424 -338 1653 -304 -1111 774 365 -532 123 -106 -355 711
1524 711 -268 -1269 762 938 -1576 -429 1621 -451 -1357 880 640 -884 127 360 -279 511 129
1541 129 -847 718 961 -1243 -308 1695 -415 -1324 1059 753 -1206 -25 719 -444 -75 163 -655
1558 -655 245 628 -1096 -330 1351 -534 -1375 1047 728 -1291 -22 1092 -482 -267 566 -225 77
1575 77 658 -621 -200 1248 -259 -1151 1084 692 -1362 86 1101 -650 -608 657 -296 -416 444 -445
1593 -445 -529 836 -251 -1049 765 647 -1175 44 1156 -569 -530 876 -28 -499 580 83 -370 637
1611 637 98 -786 568 568 -1001 -65 1080 -609 -679 769 -46 -800 443 198 -583 291 165 -651 244
1630 244 490 -722 -120 917 -397 -480 858 99 -617 494 388 -578 264 446 -535 83 543 -501
1648 -501 -272 646 -343 -653 529 -38 -744 284 308 -661 52 394 -519 -172 529 -293 -312 563 -24 -385
1668 -385 516 239 -482 351 415 -439 31 496 -336 -209 499 -130 -458 395 -50 -523 231 204 -523 55 327
1689 327 -489 -110 402 -333 -319 413 -128 -365 423 166 -382 243 325 -263 122 416 -264 -33 464 -129 -268
1710 -268 399 -31 -428 267 166 -398 35 195 -349 -165 240 -221 -259 258 -185 -297 284 40 -320 234
1730 234 210 -345 69 365 -165 -108 350 -23 -117 347 -4 -253 307 117 -307 115 197 -323 -47 234 -250
1751 -250 -187 190 -185 -273 172 -2 -317 179 77 -280 227 240 -307 80 422 -166 -76 383 -36 -193 295
1772 295 100 -273 226 140 -362 132 244 -390 -27 327 -316 -319 330 -58 -426 206 68 -421 138 123 -309
1793 -309 120 305 -324 19 462 -173 -226 525 39 -344 344 171 -306 184 210 -345 66 256 -448 -102 402
1814 402 -399 -412 439 -97 -562 223 178 -485 58 274 -359 111 370 -446 -6 653 -326 -348 741 77 -663
1835 -663 468 454 -505 62 423 -353 -27 342 -502 -91 546 -483 -496 771 -66 -925 422 498 -732
1854 -732 -121 574 -399 -128 417 -370 -10 687 -387 -354 988 12 -994 704 737 -950 -49 903 -456
1873 -456 -348 483 -283 -240 565 -414 -471 912 -136 -1046 686 653 -1158 -105 1142 -525 -670 785
1891 785 0 -401 542 -143 -408 910 1 -968 821 867 -1266 -66 1380 -649 -769 946 89 -762
1909 -762 452 36 -564 561 -55 -976 707 702 -1372 -101 1424 -747 -881 1217 193 -997 536
1926 536 421 -520 547 271 -830 689 792 -1246 22 1455 -820 -1040 1330 219 -1292 475
1942 475 540 -871 148 379 -806 242 679 -1129 -124 1424 -793 -1059 1427 348 -1427 545
1958 545 927 -849 62 704 -595 153 746 -823 -125 1346 -654 -1028 1341 258 -1547 502 939
1975 939 -1076 -185 830 -591 -247 686 -656 -293 1148 -568 -978 1298 251 -1421 545 1043 -979
1992 -979 -164 1109 -426 -430 766 -361 -351 920 -295 -917 1053 327 -1393 440 1036 -1127 -389 1116
2010 1116 -510 -646 692 -144 -667 701 -57 -818 793 435 -1092 413 1082 -920 -318 1137 -305
2027 -305 -669 774 32 -627 557 115 -738 610 390 -1025 221 861 -928 -399 938 -360 -802
2044 -802 680 115 -735 508 194 -683 353 492 -725 69 863 -579 -353 919 -103 -646 632
2061 632 205 -631 397 328 -607 160 405 -628 -115 621 -446 -425 598 -127 -643 419 159 -633 208
2080 208 360 -476 19 425 -417 -168 589 -186 -360 589 49 -483 401 279 -442 215 439 -354 10 405
2100 405 -351 -225 464 -167 -439 307 12 -470 168 175 -376 35 271 -333 -82 317 -144 -153 386 47 -253
2121 -253 300 247 -264 114 230 -207 26 188 -173 -59 230 -140 -183 214 -25 -313 162 94 -331 -50 143
2142 143 -161 -63 106 -93 1 182 -81 -77 185 18 -135 136 176 -151 -6 151 -10 -43 95 -39 -77 139
2164 139 -37 -55 94 -62 -126 66 67 -179 -91 80 -9 -93 97 51 -7 35 -14 33 46 33 2 101 46 47 31 155 7
2191 7 -94 88 22 -16 -43 -34 -40 -40 -73 -76 -28 0 -59 31 25 -43 23 26 -30 -10 24 27 76 12 27 10 89 48 34 34 90 17 -21 66
2225 66 48 -31 -26 34 60 -52 -103 39 -2 -62 -68 6 -70 -45 45 -51 -40 23 -35 -22 10 24 -31 83 16 19 5 108 15 4
2255 4 24 -19 -49 96 -5 -36 47 12 -35 -45 -23 -98 -4 -2 -90 -48 51 -28 -55 35 2 -106 26 93 -17 79 36 -25 7
2284 7 110 -17 48 104 -54 12 110 -8 -207 57 55 -199 11 2 -69 -73 69 -81 -12 98 -47 -33 180 -18 -162
2309 -162 165 161 -173 105 176 -32 -21 109 -74 10 121 -57 -41 178 -29 -200 145 89 -313 6 237 -186
2331 -186 -123 73 -7 -99 120 -142 -42 180 -67 -186 218 172 -304 137 356 -180 -111 317 -36 -122 156 -9
2353 -9 -100 251 -57 -300 324 88 -510 22 427 -312 -346 378 -32 -379 181 36 -156 147 -79 -316 352
2374 352 147 -541 167 592 -394 -238 635 51 -445 284 171 -253 140 46 -236 336 160 -563 153 618
2394 618 -567 -396 689 -101 -679 261 267 -397 80 165 -364 210 222 -598 214 722 -593 -360 935 -33
2414 -33 -756 507 443 -654 1 358 -300 68 227 -504 38 657 -677 -445 965 -80 -978 548 565
2433 565 -814 -48 638 -350 -151 383 -360 41 688 -488 -410 1042 -70 -983 700 734 -965 -93 868
2452 868 -388 -331 493 -301 -201 593 -422 -472 917 -19 -1083 683 733 -1175 -146 1058 -460 -549
2470 -549 662 -69 -407 527 -194 -453 820 46 -1024 790 827 -1222 -95 1272 -515 -713 794
2487 794 63 -614 476 -31 -519 589 24 -1020 534 704 -1188 -164 1258 -552 -892 921 240
2504 240 -820 347 335 -463 438 265 -751 456 836 -1014 -192 1315 -491 -952 1051 328 -966
2521 -966 303 487 -635 159 317 -666 168 628 -917 -278 1169 -462 -1033 986 395 -1011 306
2538 306 709 -650 -31 575 -506 19 651 -614 -234 1068 -345 -970 1011 384 -1134 275 843
2555 843 -714 -215 680 -318 -207 521 -427 -337 832 -270 -836 830 410 -1122 240 922 -638 -344
2573 -344 806 -161 -356 542 -139 -396 549 -71 -719 633 416 -986 137 900 -673 -433 808 -181
2591 -181 -512 485 -36 -439 463 69 -604 473 431 -774 130 793 -555 -466 735 -53 -589 436 241
2610 241 -474 304 225 -542 235 431 -655 -4 701 -453 -552 699 -23 -661 342 269 -606 85 295 -465
2630 -465 27 428 -360 -96 627 -273 -423 604 148 -582 328 407 -467 50 488 -328 -47 416 -254 -213
2650 -213 434 -162 -395 451 103 -542 152 404 -371 -69 356 -213 -195 372 -124 -243 297 -20 -332 336
2670 336 222 -415 124 423 -323 -50 370 -163 -176 289 -22 -323 265 5 -328 139 207 -397 -11 279 -286
2691 -286 -187 342 -80 -244 275 100 -231 182 163 -332 86 242 -287 -42 342 -217 -169 324 -24 -225 245
2712 245 12 -292 129 152 -281 43 251 -234 -61 294 -73 -234 250 -32 -277 214 139 -243 53 222 -308
2733 -308 -24 295 -209 -116 342 -31 -255 244 83 -294 171 109 -225 59 208 -236 -123 271 -155 -209 266
2754 266 -24 -287 120 198 -303 94 150 -260 -37 260 -161 -2 319 -58 -197 300 55 -281 111 233 -212
2775 -212 62 148 -225 20 218 -286 -127 289 -90 -269 294 54 -380 157 171 -251 -55 227 -170 -37 278
2796 278 -203 -154 376 -24 -293 333 177 -344 129 299 -227 -113 290 -175 -60 262 -245 -210 321 -75 -367
2817 -367 326 175 -439 45 302 -267 -106 245 -112 -47 196 -88 -147 388 -81 -292 343 175 -452 87 438
2838 438 -315 -210 378 -66 -203 254 -85 -165 289 -60 -375 373 215 -521 28 484 -330 -277 427 46 -335
2859 -335 277 95 -306 301 59 -429 326 310 -512 85 544 -407 -314 560 12 -422 232 115 -301 137 55
2880 55 -325 176 221 -612 52 599 -406 -452 643 54 -586 295 256 -383 112 195 -275 163 277 -477 31
2901 31 591 -396 -392 626 126 -704 311 360 -465 -55 339 -283 -9 230 -352 -21 494 -334 -471 649
2921 649 76 -782 308 496 -549 -127 517 -181 -138 320 -190 -186 466 -275 -439 631 141 -777 319 591
2941 591 -647 -288 584 -188 -342 333 -86 -272 355 -173 -464 498 175 -750 345 655 -673 -227 770
2960 770 -150 -478 454 78 -317 237 52 -362 356 207 -621 230 541 -599 -325 720 -95 -554 443
2979 443 206 -470 165 215 -406 197 272 -565 154 590 -553 -299 745 -99 -639 518 290 -506 56 378
2999 378 -351 27 326 -381 4 500 -454 -321 597 -96 -735 418 348 -594 85 517 -344 -136 406 -238
3019 -238 -52 468 -247 -297 613 25 -622 476 443 -637 6 589 -314 -222 424 -129 -227 353 -128 -456 406
3040 406 33 -617 336 399 -641 -65 569 -313 -361 473 -27 -332 324 6 -361 303 127 -479 260 381
3060 381 -469 -81 583 -211 -334 491 34 -443 308 162 -395 163 211 -395 79 340 -440 -194 508 -263
3080 -263 -433 418 67 -457 269 254 -350 67 308 -313 30 426 -266 -248 515 -64 -433 342 160 -476 166
3101 166 254 -384 -53 343 -250 -142 296 -194 -261 420 -22 -386 330 155 -387 126 344 -346 -121 351 -153
3122 -153 -216 338 -23 -292 307 22 -375 202 258 -338 25 333 -299 -137 377 -174 -247 306 96 -339 176
3143 176 105 -341 121 277 -325 -30 365 -147 -200 328 -40 -236 305 57 -288 106 199 -310 27 246 -266
3164 -266 -105 319 -165 -271 258 20 -299 189 99 -328 91 181 -251 -57 268 -143 -117 299 -31 -225 219
3185 219 72 -253 111 159 -218 46 270 -206 -65 281 -89 -132 236 0 -283 227 49 -274 62 210 -243
3206 -243 -40 233 -197 -111 279 -76 -235 249 32 -218 91 178 -276 90 162 -196 -56 233 -145 -101 267
3227 267 -47 -255 254 75 -280 92 188 -213 25 203 -171 -57 264 -193 -238 198 -20 -282 170 115 -275
3248 -275 80 229 -198 32 230 -184 -101 287 -101 -181 299 15 -340 178 160 -325 66 256 -197 -111 208
3269 208 -158 -108 203 -104 -162 262 -25 -299 214 193 -334 7 271 -196 -113 264 -69 -100 225 -66 -169 225
3291 225 -6 -337 259 181 -446 39 357 -249 -199 284 -32 -239 158 -36 -165 154 -3 -318 195 215 -444
3312 -444 15 432 -193 -256 396 24 -210 178 35 -154 252 11 -343 273 225 -444 14 415 -293 -343 392
3333 392 12 -350 142 113 -217 73 43 -249 189 150 -419 55 504 -298 -340 521 58 -449 214 277 -247 76
3355 76 109 -197 173 171 -347 30 505 -366 -336 578 53 -576 165 376 -371 -25 189 -229 8 205 -288 0
3377 0 538 -333 -402 583 122 -662 241 419 -477 -36 364 -106 -22 210 -241 -18 415 -335 -321 580 94 -691
3399 -691 280 489 -463 -226 383 -162 -143 244 -141 -82 393 -200 -300 568 82 -638 277 551 -470 -232
3419 -232 549 -80 -310 299 -52 -148 304 -160 -345 471 109 -652 280 574 -551 -186 589 -121 -379 296
3439 296 105 -225 238 28 -266 408 130 -535 304 511 -518 -204 639 -151 -433 385 134 -373 166 94
3459 94 -278 177 134 -472 159 509 -435 -260 700 -89 -560 375 236 -435 64 240 -229 78 188 -377 76
3480 76 441 -405 -253 688 -22 -574 361 292 -496 74 326 -253 27 219 -337 -19 366 -308 -276 546 -34
3501 -34 -560 362 357 -473 -12 411 -266 -140 248 -190 -116 301 -159 -279 433 61 -511 301 401 -450 -113
3522 -113 453 -203 -271 335 -134 -197 270 -142 -300 357 45 -453 238 355 -399 -157 489 -251 -262 375 32
3543 32 -300 204 36 -311 220 107 -366 183 407 -424 -164 381 -99 -395 315 90 -336 123 64 -232 173
3564 173 213 -321 38 312 -281 -161 428 -126 -348 353 227 -292 87 188 -241 49 290 -178 -65 293
3584 293 -255 -137 388 -32 -375 215 147 -407 -9 264 -183 -86 241 -159 -75 249 -91 -190 315 6 -281
3605 -281 151 213 -313 16 283 -215 -152 264 -24 -168 209 -16 -198 187 41 -310 116 228 -285 -86 298
3626 298 -172 -182 224 -21 -204 153 14 -270 157 100 -180 74 161 -235 -21 279 -177 -213 272 -5 -265
3647 -265 184 103 -210 113 158 -230 2 271 -184 -64 236 -114 -237 248 69 -242 122 119 -193 10 211
3668 211 -178 -43 163 -95 -118 186 -88 -227 240 79 -251 153 196 -214 15 200 -155 -140 225 -62 -146
3689 -146 155 -45 -241 119 116 -267 101 182 -237 9 227 -152 -135 183 -50 -165 196 12 -214 148 120 -216
3711 -216 63 163 -229 -69 217 -166 -204 299 -55 -201 140 22 -268 33 101 -177 18 163 -184 4 197
3732 197 -163 -132 246 -66 -267 247 82 -264 97 180 -171 -11 190 -151 -87 230 -200 -171 272 -108 -303
3753 -303 289 130 -339 28 233 -230 -120 238 -129 -102 212 -94 -165 312 -33 -292 286 203 -386 100 369
3774 369 -247 -121 328 -33 -160 196 -88 -151 278 -41 -251 318 196 -421 58 480 -290 -194 356 27 -247
3795 -247 123 -13 -124 171 -54 -287 297 154 -452 94 457 -342 -281 446 -14 -357 131 174 -283 118 17
3816 17 -191 250 117 -419 113 486 -434 -326 566 36 -501 237 217 -256 66 150 -221 160 127 -415 105
3837 105 488 -431 -286 596 -24 -542 226 327 -396 -59 253 -181 29 139 -306 84 395 -406 -283 601
3857 601 10 -625 317 384 -494 -99 388 -134 8 225 -265 -34 414 -421 -299 619 5 -601 425 482
3877 482 -592 -86 497 -162 -184 277 -127 -82 355 -306 -323 612 -43 -652 365 517 -610 -148 584 -171
3897 -171 -320 349 27 -166 277 -164 -234 522 28 -638 332 514 -659 -170 662 -244 -446 407 91 -339
3917 -339 222 -32 -265 355 45 -602 327 414 -631 -227 673 -205 -593 478 168 -430 165 113 -312 239
3937 239 126 -471 282 456 -631 -224 795 -209 -607 523 231 -500 103 259 -341 31 206 -402 139
3956 139 451 -536 -184 656 -167 -597 512 354 -579 75 424 -286 -70 254 -341 13 383 -439 -270 635
3976 635 -126 -609 513 278 -718 76 525 -301 -183 366 -221 -45 388 -210 -229 538 -91 -602 492 336
3996 336 -658 33 597 -331 -332 469 -140 -317 335 -106 -297 432 -48 -559 434 318 -664 33 583 -418
4016 -418 -371 489 -42 -353 303 41 -350 328 3 -460 285 301 -555 5 636 -324 -400 518 40 -442 253
4037 253 157 -374 217 126 -419 196 356 -501 -82 586 -283 -425 519 77 -526 266 243 -360 30 274 -340
4058 -340 -4 341 -357 -130 479 -160 -474 491 87 -518 175 342 -378 9 409 -281 -116 387 -294 -156
4078 -156 453 -91 -446 429 183 -480 207 376 -395 -50 407 -221 -136 365 -170 -261 430 -82 -430 292 193
4099 193 -510 100 364 -322 -96 381 -168 -218 352 -127 -311 302 81 -400 243 242 -432 43 412 -390 -111
4120 -111 420 -148 -277 357 94 -319 258 175 -363 125 259 -407 0 363 -257 -189 399 -89 -340 285 53
4141 53 -373 203 183 -380 86 342 -319 -119 450 -179 -226 429 30 -340 312 101 -386 180 234 -396 84
4162 84 331 -338 -143 415 -190 -297 342 -9 -358 306 167 -365 148 223 -402 6 356 -321 -222 419 -91
4183 -91 -276 329 98 -378 191 184 -354 137 260 -374 -45 411 -259 -237 443 -1 -326 282 136 -380 168
4204 168 178 -359 48 286 -330 -48 415 -231 -300 444 -17 -385 285 136 -425 73 274 -364 10 340 -306
4225 -306 -125 440 -257 -291 461 30 -431 264 261 -342 46 297 -326 19 318 -246 -160 389 -207 -317 453
4246 453 4 -426 245 260 -467 -6 355 -284 -74 361 -226 -188 386 -190 -290 469 8 -506 216 382 -489
4267 -489 -75 463 -309 -181 383 -163 -230 429 -136 -403 500 111 -569 263 403 -482 -64 505 -277 -242 460
4288 460 -108 -183 350 -68 -303 470 49 -612 293 410 -585 -115 601 -282 -330 430 -108 -349 352 -3 -349
4309 -349 350 179 -555 239 460 -595 -59 707 -262 -436 480 26 -445 280 105 -422 299 232 -520 228
4329 228 513 -547 -167 718 -277 -538 595 93 -537 230 215 -420 155 236 -517 137 449 -558 -155 726
4349 726 -272 -537 630 141 -663 219 381 -458 77 331 -429 39 419 -503 -151 665 -317 -537 694
4368 694 181 -723 261 462 -526 -103 449 -294 -75 459 -374 -189 624 -252 -571 620 204 -816 235
4387 235 607 -613 -207 571 -270 -275 443 -237 -294 502 -149 -546 645 224 -869 286 733 -589 -218
4406 -218 661 -208 -445 454 -32 -307 449 -32 -479 503 254 -753 245 682 -660 -283 807 -190 -544
4425 -544 477 77 -468 338 21 -495 364 257 -709 122 773 -624 -331 833 -110 -663 475 263 -560
4444 -560 165 225 -476 198 303 -542 102 652 -562 -365 839 -90 -695 520 314 -601 114 449 -392
4463 -392 65 430 -485 -66 536 -356 -388 760 -86 -763 506 390 -619 -19 470 -314 -190 366 -307
4482 -307 -182 445 -329 -421 634 21 -777 419 467 -670 -4 614 -411 -277 412 -177 -336 444 -146
4501 -146 -433 491 100 -645 340 468 -642 -65 653 -285 -431 493 -76 -452 336 7 -438 354 147 -647
4521 -647 197 482 -530 -96 682 -335 -464 546 29 -457 330 149 -423 258 204 -543 137 505 -473
4540 -473 -151 660 -206 -459 524 93 -587 250 290 -432 59 377 -410 -23 520 -402 -226 558 -178 -509
4560 -509 466 202 -530 170 298 -415 -8 359 -336 -182 443 -253 -345 500 -42 -473 399 293 -566 94
4580 94 461 -399 -23 429 -257 -256 493 -138 -329 430 73 -507 336 259 -440 67 449 -314 -167 480 -193
4601 -193 -326 398 -71 -411 308 178 -450 244 349 -464 -36 487 -302 -214 467 -168 -402 381 18 -437
4621 -437 289 246 -481 105 382 -413 -88 526 -202 -265 439 -64 -367 387 137 -477 200 274 -436 6 372
4642 372 -313 -150 384 -195 -328 400 -30 -415 346 191 -442 219 372 -402 -61 398 -258 -262 385 -121 -351
4663 -351 331 79 -435 209 221 -454 136 427 -365 -139 459 -215 -310 467 -24 -378 273 107 -384 181 275
4684 275 -423 59 388 -361 -145 453 -155 -372 364 33 -442 216 138 -342 146 220 -360 3 437 -307 -203
4705 -203 533 -129 -413 399 98 -393 184 220 -357 122 338 -317 11 438 -274 -230 534 -88 -468 377 214
4726 214 -444 155 300 -389 0 301 -337 -67 350 -314 -289 515 -131 -511 394 270 -509 87 394 -321
4746 -321 -38 398 -218 -118 366 -209 -236 440 -50 -472 420 229 -619 116 441 -322 -180 395 -159 -108 348
4767 348 -152 -223 347 -42 -455 347 257 -590 85 516 -393 -190 450 -104 -285 348 -69 -239 389 -26 -427
4788 -427 360 269 -524 107 551 -393 -263 454 -45 -360 352 58 -321 303 70 -391 283 223 -575 74 557
4809 557 -405 -310 613 -95 -433 307 172 -373 196 124 -401 192 245 -563 83 545 -429 -374 657 -83 -575
4830 -575 341 283 -400 168 270 -361 181 314 -413 27 555 -352 -357 688 -19 -646 354 310 -532 53 353
4851 353 -371 10 336 -348 -37 507 -313 -357 586 51 -653 317 346 -532 19 500 -263 -96 398 -277 -83
4872 -83 478 -221 -311 547 9 -586 330 434 -606 -28 507 -338 -185 413 -182 -289 451 -128 -371 514
4892 514 95 -614 309 466 -591 -86 609 -224 -281 449 -57 -291 316 -55 -394 360 174 -557 215 461
4912 461 -564 -91 628 -244 -437 488 -25 -379 288 112 -391 208 222 -456 145 400 -482 -176 558 -198
4932 -198 -444 461 83 -468 265 219 -419 138 314 -427 34 475 -436 -251 591 -143 -510 408 139 -516
4952 -516 237 363 -386 23 390 -379 -52 481 -299 -245 557 -123 -561 419 241 -564 197 401 -473 -22
4972 -22 404 -325 -161 437 -163 -298 468 -92 -497 310 275 -495 74 493 -428 -173 381 -235 -253 375 -114
4993 -114 -326 373 69 -415 304 307 -551 -8 481 -335 -218 460 -114 -313 423 11 -414 331 96 -486 236
5014 236 382 -512 -17 480 -316 -315 488 -78 -387 311 114 -390 229 203 -402 100 347 -438 -99 507 -217
5035 -217 -340 438 5 -427 300 177 -435 85 257 -355 44 380 -365 -179 446 -184 -381 441 63 -469
5055 -469 273 203 -395 62 314 -365 -25 360 -259 -186 425 -118 -394 371 108 -473 221 302 -374 -5 294
5076 294 -272 -109 339 -140 -223 405 -79 -331 333 122 -392 136 294 -365 -27 424 -224 -197 388 -78 -296
5097 -296 296 -14 -371 225 175 -388 106 337 -334 -60 346 -155 -245 332 -77 -309 253 21 -356 187 190
5118 190 -368 6 367 -315 -119 428 -162 -242 325 15 -338 268 89 -322 116 250 -348 9 326 -247
5138 -247 -97 371 -116 -257 387 82 -389 184 190 -374 80 241 -244 -45 284 -202 -182 313 -96 -248 310
5159 310 105 -277 196 217 -329 74 277 -268 -127 342 -98 -221 271 -24 -255 158 67 -227 153 163 -370
5180 -370 12 315 -239 -144 332 -65 -278 297 81 -322 171 73 -261 51 240 -308 29 393 -239 -233 355
5201 355 -21 -314 226 118 -304 110 168 -312 63 223 -273 13 307 -194 -234 362 -66 -288 195 158 -351
5222 -351 81 214 -261 12 209 -188 -31 307 -126 -247 282 -20 -384 170 171 -374 59 229 -189 -46 169
5243 169 -170 -92 292 -141 -177 287 28 -398 242 194 -312 63 255 -217 -48 214 -106 -141 237 -113 -211 272
5265 272 68 -303 183 208 -342 12 297 -199 -107 287 -38 -231 259 -101 -236 203 32 -342 174 268 -329
5286 -329 -16 326 -177 -199 306 2 -162 187 9 -220 186 99 -323 141 249 -331 -53 352 -153 -163 288
5307 288 19 -220 134 112 -246 108 127 -279 57 231 -304 -29 397 -125 -271 338 51 -327 150 132 -222
5328 -222 71 187 -231 21 264 -250 -129 338 -106 -250 306 67 -310 127 213 -287 34 256 -170 -91 270
5349 270 -204 -149 300 -104 -340 210 101 -319 109 204 -252 5 215 -237 -9 201 -145 -119 249 -63 -284
5370 -284 267 133 -301 114 250 -266 -95 259 -140 -115 262 -87 -215 176 40 -229 201 117 -314 53 331
5391 331 -243 -61 299 -111 -117 245 -35 -202 206 72 -229 136 213 -302 -6 251 -183 -149 264 -33 -222
5412 -222 257 39 -236 175 67 -293 82 190 -223 1 342 -157 -181 225 -4 -211 175 36 -292 127
5432 127 178 -238 37 191 -228 -2 271 -74 -183 286 -4 -179 194 92 -190 70 161 -247 -19 219 -177
5453 -177 -98 224 -101 -229 268 -4 -256 145 154 -280 41 201 -184 -15 219 -162 -187 268 -24 -220 255
5474 255 96 -265 171 187 -216 16 206 -139 -99 235 -74 -100 174 -34 -206 158 68 -241 116 219 -272
5495 -272 -61 238 -162 -142 179 -54 -168 181 -20 -215 99 117 -192 143 195 -158 -40 261 -124 -151 217
5516 217 -5 -169 124 45 -182 124 146 -205 48 189 -172 -107 224 -63 -177 189 15 -179 149 50 -219
5537 -219 86 157 -181 -41 212 -115 -120 211 -1 -144 183 59 -164 77 109 -162 -10 201 -99 -22 203 -72
5559 -72 -87 222 -28 -210 177 35 -213 76 167 -202 -16 180 -112 -106 233 -148 -162 183 -62 -219 134 67
5581 67 -178 10 156 -111 -56 175 -116 -108 149 12 -151 151 37 -175 93 109 -217 46 200 -129 -67 175
5603 175 -82 -88 207 -46 -177 164 12 -180 90 70 -184 -18 99 -118 -11 195 -32 -127 192 10 -144
5624 -144 121 50 -125 14 135 -169 48 196 -149 -73 222 -8 -117 143 35 -224 116 92 -131 103 94 -119
5646 -119 -24 216 -89 -122 197 -9 -150 110 -5 -145 127 94 -155 -17 124 -103 -47 135 -70 -154 175 -15
5668 -15 -139 112 110 -148 98 106 -156 -16 178 -92 -79 154 -19 -112 149 20 -130 117 104 -173 97 131 -160
5691 -160 33 161 -124 -71 137 -23 -184 93 74 -171 103 99 -110 29 115 -161 -10 147 -88 -109 153 -69
5713 -69 -174 72 36 -120 46 125 -159 -20 141 -133 -14 156 -105 -86 201 22 -147 162 107 -151 1 66
5735 66 -184 -9 97 -88 -47 192 -123 -148 154 -24 -177 87 18 -148 52 144 -121 -58 119 -53 -78 170
5757 170 -10 -129 168 51 -190 44 128 -186 4 168 -81 -54 153 -89 -64 119 -31 -144 127 7 -189
5778 -189 144 129 -164 24 161 -138 -113 163 11 -80 50 -3 -86 114 32 -181 11 61 -173 -11 142 -65
5800 -65 -130 174 -33 -122 137 10 -96 143 79 -174 111 173 -132 -29 164 -80 -100 204 26 -130 52 7
5822 7 -96 33 78 -170 52 93 -205 -23 133 -72 -107 121 29 -152 97 91 -216 28 100 -99 73 126 -138
5845 -138 -14 210 -63 -126 181 82 -89 112 76 -92 45 105 -172 35 115 -101 -45 164 -70 -182 97 21
5867 21 -154 137 101 -185 -29 56 -142 1 86 -53 -147 123 -15 -127 133 101 -179 92 116 -136 32 146
5889 146 -97 -64 131 -27 -114 103 67 -104 114 82 -184 98 161 -171 -45 205 -112 -146 158 -40 -67 99
5911 99 -5 -162 80 49 -87 66 125 -120 -36 190 -81 -124 153 39 -109 23 9 -187 81 91 -117 11
5933 11 136 -168 -65 228 -32 -148 146 42 -115 109 41 -125 32 145 -101 -81 153 -150 -91 115 -23
5954 -23 -144 142 63 -149 23 41 -126 3 161 -122 -30 151 -112 -56 128 -53 -130 134 100 -143 72 98 -119
5977 -119 12 108 -29 -42 152 -57 -44 169 -22 -114 100 63 -188 109 137 -139 -37 157 -101 -18 109 -31
5999 -31 -76 139 67 -203 47 62 -141 10 97 -84 -76 120 -78 -65 152 -29 -119 124 77 -171 105 36 -146 5
6023 5 133 -112 -91 121 -19 -91 158 -9 -135 34 69 -137 35 92 -155 -7 108 -76 -71 88 -38 -128 50
6046 50 37 -145 99 87 -177 10 78 -102 14 113 -56 -84 95 -49 -124 90 60 -94 32 66 -78 -25 101
6069 101 -91 4 152 -35 -126 184 -37 -107 134 59 -91 55 82 -143 -44 120 -115 -20 126 -46 -120 94 -48
6092 -48 -112 88 32 -157 -12 106 -88 0 120 -72 -69 122 -17 -79 81 1 -87 60 46 -113 -25 93 -81 -27
6116 -27 117 -37 -76 103 -38 -135 52 77 -139 37 67 -42 -3 101 -104 -81 107 -18 -168 132 12 -85 59
6139 59 96 -110 12 83 -85 67 137 -102 -39 95 -47 -82 25 30 -111 64 9 -105 21 19 -112 -1 142 -80
6163 -80 -27 105 -45 -62 57 26 -111 30 104 -95 -21 67 -48 -80 149 0 -29 124 -50 -122 117 67 -94 19
6187 19 45 -60 4 50 -88 -28 161 -15 -97 120 4 -124 98 71 -129 43 130 -120 -29 139 -104 -107 95 -25
6211 -25 -55 61 -20 -98 31 74 -108 43 123 -126 -63 106 -46 -82 59 -20 -86 65 -27 -160 9 73 -24 16 133
6236 133 -79 -61 142 -48 -68 76 -87 -103 63 18 -90 56 72 -97 -55 118 -63 -74 110 -42 -122 90 66
6259 66 -128 7 57 -44 67 85 -69 -34 86 -22 -53 51 19 -28 82 43 -73 17 78 -109 41 43 -69 22
6283 22 76 -5 -7 59 11 -79 43 60 -83 37 37 -47 -12 53 -13 -31 49 -105 -64 93 30 -63 45 84 -115 72 71 -41
6311 -41 -17 83 -9 -56 99 -38 -51 125 -13 -49 26 37 -82 -6 94 -53 -70 103 -23 -14 34 -16 -52 31 41 -98
6337 -98 44 73 -84 16 69 -77 -59 21 21 -38 80 14 -83 58 56 -44 22 100 -91 46 112 -48 -78 128 7
6362 7 -126 59 49 -83 45 5 -89 37 107 -68 -25 56 -21 -68 95 29 -104 -24 -31 -134 -23 50 -40 -17 77 -39
6388 -39 -30 23 -44 -35 86 21 -79 20 115 5 -22 38 1 -45 26 27 -48 49 29 -68 44 19 -87 5 -2 -120 -60 64 -78
6417 -78 -10 2 -25 -102 38 -11 -50 23 1 -79 8 110 -52 -33 36 -38 -21 44 8 -81 79 49 -24 33 61 -47 14 37
6445 37 -142 5 60 73 -67 0 -9 -99 45 13 -74 -10 13 -41 -2 67 3 -40 52 4 -34 51 8 -29 -3 75 -37 1
6473 1 48 -83 65 80 -48 -28 81 23 -58 76 4 -64 52 60 -20 -2 82 -32 6 99 0 -34 108 59 -37 14 23 -59
6501 -59 62 24 -73 -7 5 -21 -67 73 -24 -36 18 0 -43 21 44 -49 27 71 -34 -53 46 -25 -15 106 12 -41 40 30
6529 30 -59 -34 94 -20 89 53 -50 0 49 -1 -29 -4 25 -81 -9 10 -48 18 40 -54 -8 45 18 -82 70 -37
6555 -37 -86 48 -14 -39 33 46 -38 -13 47 13 -41 51 58 -29 32 -1 -9 28 46 4 -3 38 -37 -5 37 -21 12 -15 -27 -55 20
6586 20 -28 13 44 17 -70 -39 9 -13 0 11 -11 -32 17 -49 -70 -24 28 9 3 -21 -50 9 10 -102 15 73 25 -40 47 33
6616 33 -30 33 -3 -55 -25 -2 -60 30 46 -33 -22 18 -28 -35 3 5 -34 -16 68 -59 -19 64 -65 -1 70 -26 -41 42 -19 -118
6646 -118 51 16 -22 14 14 -61 -37 44 12 7 37 29 -3 77 -41 -34 64 71 -30 -9 103 4 -87 8 -20 -99 31 12 -80 69
6676 69 84 -77 20 -13 -30 -60 37 -52 -14 66 31 -67 1 -100 -32 17 35 -43 11 -7 -44 45 132 -18 -88 25 -11 -17 -2
6705 -2 -9 -10 15 -14 -5 -11 4 -46 31 76 -67 -67 71 41 -42 21 46 -35 1 53 -26 28 74 -78 4 64 -39 -16 61 68 -73
6736 -73 24 49 -26 -23 48 -3 16 5 8 40 78 28 6 31 34 -60 -6 50 -57 -31 92 33 2 45 -17 5 74 -10 -64 34 27
6767 27 -83 -2 11 -63 -65 92 -10 -9 14 -30 18 10 63 -2 19 68 17 10 62 -54 -7 60 -31 -40 54 7 -64 44 -16 -24 56
6798 56 -1 -46 29 41 -31 -95 110 -42 -35 -35 -5 1 3 -15 29 76 22 -52 24 43 -59 -75 61 19 -58 17 24 -3 -1 52 20
6829 20 56 13 -81 57 55 -25 -14 61 38 -79 35 48 -22 10 128 -11 2 29 -19 1 21 9 -7 23 45 17 65 66 -49
6858 -49 1 63 -7 23 61 7 9 -17 -6 4 61 15 -94 20 -11 -46 37 65 -36 2 -9 -25 -21 60 19 -9 28 -4 -100 -4
6888 -4 61 -47 -37 14 -68 -25 68 -50 -38 -2 -7 -71 13 10 -10 23 25 -30 12 53 -35 30 1 7 -31 41 -5 -50 21 26 -33 48
6920 48 23 -104 0 68 -82 -14 91 -13 -40 5 -31 -47 9 -18 -29 73 106 -23 25 57 -71 -42 41 10 -3 80
6946 80 49 -14 28 24 12 29 21 -73 46 -11 -54 -67 74 7 -59 11 22 -36 -57 14 -29 24 -70 -25 -80 65 -40 -22 90
6975 90 1 -35 17 14 4 -18 92 -17 -7 -19 -56 5 68 -16 -29 75 14 -61 62 23 -83 64 2 -42 5 32 -11 8
7003 8 13 -6 -36 54 -27 -60 30 12 -52 -7 65 22 2 59 -12 -8 37 20 -68 14 -1 -5 38 4 11 -2 10 -11 -31 56 -40 -74 72
7036 72 26 2 84 14 -11 5 30 -39 -55 34 -57 -24 40 19 -45 17 -38 -45 12 5 -74 6 22 -44 7 21 -80 -72 41 -24 -90
7067 -90 149 -12 -27 29 62 -29 56 4 -13 -2 115 -7 -14 76 40 -44 71 -5 -24 44 21 -66 54 71 -45 -6 -20
7094 -20 -9 -100 36 -33 -55 2 3 -93 20 39 -58 63 61 29 -51 34 48 4 32 -90 -22 13 -23 -83 47 -3 -22 -40 54
7123 54 -16 -29 108 -66 -71 -34 40 0 16 42 -96 0 63 -109 -23 78 26 -15 -23 -15 -25 -12 -10 -73 9 -17 -2 33 25 -53
7153 -53 -40 55 -32 -88 -19 25 -72 6 28 -53 45 46 -96 13 30 24 22 35 -38 -71 80 38 -56 32 14 24 2 42 -69 -9
7183 -9 31 -29 3 35 -47 -100 71 -2 -73 9 30 -36 61 -25 -37 1 -23 -37 29 96 -22 -84 53 8 -83 35 9 -101
7211 -101 21 36 -75 -57 49 -29 5 67 -20 -77 107 -3 -46 -31 34 9 -19 0 -43 -40 69 40 2 56 -18 -62 39
7238 39 42 -61 -4 114 -11 -5 112 -19 -45 36 55 -12 30 -16 -27 12 -12 10 -17 44 -92 -27 73 -27 -42 12 4 -46
7266 -46 16 -15 -70 70 -21 -71 44 72 -4 -24 110 15 -32 51 19 -52 -31 -15 -49 -9 51 -52 8 58 -58 -21 39 15
7294 15 -51 48 25 -116 36 26 12 -1 38 -33 0 22 -71 1 134 37 -69 29 59 -72 -28 59 -20 -21 -15 -17 34 57 -16
7323 -16 -63 6 -16 -56 84 61 -16 24 73 3 -28 42 6 -24 53 3 -27 20 -26 -41 52 29 -93 -25 66 -44 -37 26 -29
7352 -29 -19 39 -23 -80 87 31 -46 37 58 -78 -37 48 -60 -51 55 -21 -17 75 16 16 46 14 -11 76 84 -27 58 1 -24 -9
7382 -9 60 -40 -61 19 40 -21 17 26 -101 11 14 -14 -20 83 -2 -50 23 8 -90 48 11 -46 43 24 -51 -37 67 -18 17
7411 17 92 -65 -35 26 31 -83 23 18 -35 -63 19 5 44 75 -55 31 116 -29 -93 63 24 -49 21 30 -68 43 38 -8 -25
7440 -25 37 -1 -37 1 -36 -32 -17 17 -75 67 105 -71 -37 45 -13 -63 47 -67 -70 51 30 -23 17 18 -36 10 82 -64 -64
7469 -64 43 -43 -88 7 -56 -72 44 -24 -20 12 24 -69 -17 61 -35 17 98 25 -31 49 -42 -56 31 58 -55 53 43 -28 -42
7498 -42 94 -59 -52 19 -16 2 53 -29 -26 59 56 -47 -28 100 -18 -42 35 -31 -85 7 4 -28 37 8 -82 -11 50 14 40 20
7528 20 -29 -53 62 -66 -93 26 25 -17 -9 38 -39 -19 47 15 -36 79 -66 4 35 32 -32 94 27 -64 2 31 -31 -29 43
7557 43 -90 -70 99 -29 -27 14 27 -76 12 8 -61 47 18 -58 -42 107 -55 -60 8 5 -70 49 18 -47 -23 113 -9
7584 -9 32 77 -48 -2 77 15 -68 45 -2 -98 28 20 -55 -22 30 -1 -18 -3 -19 -20 21 -83 -13 60 -29 -102 57 87 -126
7613 -126 -24 95 1 -31 95 -19 -72 65 -29 -55 72 13 -63 40 41 -100 0 76 -10 -35 56 -3 -66 58 -51
7638 -51 -18 31 36 -19 32 27 -43 -52 53 -84 -140 75 -53 -7 30 66 -25 62 15 -117 -5 87 -71 -42 127 -24 -83
7665 -83 103 4 -42 58 73 -73 53 62 -74 13 88 -61 -35 121 -2 -121 61 68 -74 39 45 -100 -16 46 -71
7690 -71 16 84 -97 -39 110 -49 -79 97 56 -107 32 73 -81 6 95 3 -52 20 9 -25 75 9 -24 82 25 -86
7716 -86 39 106 -34 -58 145 19 -52 59 45 -120 81 4 -28 106 31 -152 9 112 -104 -92 58 -52 -84
7739 -84 54 -5 -59 44 54 -65 42 53 -108 25 84 -42 -27 113 36 -82 39 40 -105 29 97 -60 14 80
7763 80 -64 33 131 -36 2 96 -33 -102 106 15 -73 5 28 -37 -1 27 -33 -17 57 -57 -56 102 13 -115 100 67 -139
7790 -139 13 57 -54 -1 91 -64 -19 56 -12 -22 112 -8 -97 82 82 -74 -27 153 -85 -21 51 -40 -43 0 -6 -96 20
7817 20 22 -97 77 76 -101 28 107 -47 -20 28 8 -73 115 -36 -84 72 85 -74 46 47 -81 -30 114 -53 -64
7842 -64 164 -25 -93 7 34 -71 61 58 -88 6 124 -64 -29 120 -116 -39 73 56 -101 83 61 -69 21 45
7866 45 -55 33 107 -61 -22 73 -51 -68 93 6 -126 44 26 -103 18 75 -62 30 84 -19 -20 130 -41 -114 98
7891 98 41 -76 -21 54 -72 -36 45 -121 -61 62 -38 -28 59 7 -78 65 53 -132 -56 131 -66 -39 136 -54 -61
7916 -61 99 -9 -41 83 13 -112 58 58 -123 17 163 -102 -46 63 -53 -1 77 -27 -66 35 26 -177 31 94
7940 94 -132 -17 126 -37 -25 150 -31 -89 99 -6 -86 105 18 -94 -6 72 -50 -21 108 -5 -43 76 18
7963 18 -42 88 83 -89 93 85 -132 68 83 -69 -5 110 -34 -113 100 22 -107 60 96 -153 24 36 -116 -18
7987 -18 81 -118 -93 148 -11 -48 164 -55 -120 76 115 -73 -55 75 -62 -11 120 -66 -53 114 -23 -74 102
8010 102 40 -116 141 117 -84 6 43 -60 -40 131 -78 -65 66 -38 -94 49 -21 -82 -3 49 -118 52 52 -65
8034 -65 -48 140 -46 -103 134 46 -75 62 62 -139 67 72 -57 9 86 -112 -12 184 41 -103 35 13 -138 9
8058 9 93 -109 35 93 -74 -55 99 15 -76 131 -16 -146 97 40 -138 11 51 -144 -30 73 -80 -17 98
8081 98 -30 -44 169 39 -100 55 43 -63 78 106 -82 -32 99 -40 -75 46 41 -77 86 -44 -120 49 58 -101
8105 -101 34 58 -87 -24 106 -33 -86 76 2 -81 38 37 -50 14 41 -83 35 132 -61 -91 53 -13 -113 95
8129 95 46 -58 46 -7 -71 67 34 -69 19 86 -43 -14 86 55 -95 109 32 -96 22 55 -90 -33 55 -118
8153 -118 15 101 -40 -79 137 38 -124 77 62 -93 12 8 -16 15 101 -88 -19 131 -1 -82 109 1 -131 67
8177 67 55 -139 -16 117 -66 -84 159 -6 -75 82 14 -87 54 69
8191F9
$$ Imaginary data points
##PAGE= N=2
##DATA TABLE= (X++(I..I)), XYDATA
0 0 0 0 0 0 0 0 0 0 0 0 0 8 -8 8 -8 16 -16 17 -24 32 -32 40 -48 57 -65 75 -89 105 -121 138 -156 179 -203
33 -203 228 -260 293 -326 367 -412 457 -511 568 -626 696 -771 850 -935 1032 -1138 1253 -1381
51 -1381 1521 -1675 1850 -2045 2265 -2516 2803 -3137 3534 -4011 4596 -5335 6302 -7628 9557
66 9557 -12632 18294 -32033 131656 54411 -265954 99513 155478 -130138 -49394 101123
77 101123 -45789 12009 39911 -110819 32736 158871 -153317 -112817 231650 8683 -242347
88 -242347 103723 165072 -157427 -56676 132395 -31784 -40914 46714 -55615 13294 108343
99 108343 -112789 -79908 193961 -6598 -209434 109447 152110 -167314 -53295 154375
109 154375 -32820 -79748 58821 -12379 -16819 66909 -69542 -56669 144546 -15011 -169107
120 -169107 103210 125356 -162154 -41090 158393 -38877 -97351 72385 16313 -43099 41213
131 41213 -25407 -41266 95558 -9498 -122714 84667 96057 -137844 -28317 143017 -41264
142 -41264 -98222 76428 29853 -61968 22384 8157 -34142 49192 -1292 -80645 58051 66035
154 66035 -105702 -16997 115953 -40079 -85021 74219 31541 -67612 16480 28912 -31093
165 -31093 21186 10033 -50945 35689 47072 -76374 -10705 90714 -36120 -70668 67452
176 67452 27505 -68612 13012 38810 -32454 579 19237 -30693 13273 32444 -48025 -9004
188 -9004 63162 -26366 -51946 53523 21757 -57230 11604 39022 -28348 -7678 24181 -15977
200 -15977 -490 22846 -25101 -8385 39960 -16310 -35491 37300 15008 -43931 8552 31938
212 31938 -24491 -11369 22839 -8875 -8853 15708 -10801 -8649 23101 -8092 -22495 24223 10383
225 10383 -29830 7280 24333 -18449 -8846 20387 -4857 -10264 12453 -2828 -8482 13253 -2194
238 -2194 -14789 13447 7108 -19636 3502 16222 -13261 -8147 14481 -2740 -10462 7779 1315
251 1315 -7584 5475 1654 -7846 5403 5134 -9293 1437 9461 -6063 -4337 8762 -231 -6093
265 -6093 4461 2292 -4276 2087 1824 -3736 1715 2344 -4621 -33 4093 -3441 -2983 3971 -379 -3960
281 -3960 1766 1544 -2646 189 1452 -1239 299 1425 -1119 128 2102 -471 -819 1904 701 -1256
297 -1256 660 1336 -490 -413 636 -60 -418 -90 -342 -422 -8 -405 -770 -52 9 -856 -567 524 -64 -838
317 -838 169 712 -311 -239 738 413 -192 402 639 186 158 454 319 -11 106 357 -73 -306 241 -26
337 -26 -820 -183 277 -936 -638 635 -692 -1073 810 -46 -1613 831 988 -1855 230 2251 -1246
354 -1246 -952 2715 136 -1824 1963 1113 -1734 1338 1204 -2005 1193 1819 -3048 -81 3525 -2831
370 -2831 -2778 4104 -404 -4720 2369 1989 -4112 460 2240 -3122 492 2738 -3841 -115 5505 -3535
386 -3535 -3795 7220 487 -7154 4423 5045 -6134 48 5452 -3438 -1022 4398 -3810 -1216 6489
401 6489 -4510 -5692 8981 251 -11120 5293 7403 -9970 -1915 8905 -4184 -4424 6078
414 6078 -2256 -3135 6972 -3194 -6304 10246 1486 -12577 6650 10541 -11803 -3098 13020 -3792
428 -3792 -7861 7742 370 -5611 5603 -1494 -6762 8937 1243 -13748 6683 11249 -14441 -4451
442 -4451 15929 -4727 -11717 9840 3083 -8718 4738 1837 -6780 7647 2647 -13038 7150
455 7150 12591 -15391 -4562 19300 -5242 -15029 12565 5912 -12811 3350 5804 -7741 3743
468 3743 3769 -11671 4869 11615 -15351 -5363 19758 -5667 -17264 13987 8052 -15836 2185
481 2185 10241 -7611 110 6146 -8048 2760 10730 -12391 -4584 18954 -5250 -17278 14802
494 14802 9178 -18100 1235 13431 -8638 -4117 7896 -5643 -993 8713 -9823 -5038 16588
507 16588 -5183 -16909 14905 9426 -19612 1362 16485 -9275 -6842 11015 -2643 -4225 8255
520 8255 -5269 -5083 13918 -3327 -15058 13650 9260 -19353 960 17493 -10074 -9648 12313
533 12313 -720 -8233 6324 -1433 -6124 9272 -1574 -12652 10686 8306 -17175 641 17180
546 17180 -9250 -10423 13479 1512 -10206 5769 2794 -6092 6041 1025 -9706 7874 7417
559 7417 -14610 273 15719 -9010 -10917 13403 2004 -12418 4849 5162 -7360 2527 2948
572 2948 -7940 4512 6770 -11653 -470 14120 -7402 -10320 13154 3134 -12541 4632 7671
585 7671 -7303 224 5305 -5283 1385 6015 -7995 -1426 11044 -5669 -9346 10783 3009 -12222
599 -12222 3166 8036 -7438 -2088 6067 -3631 -1381 4962 -4766 -2024 8547 -3518 -7587 9107
613 9107 3377 -10575 2952 8544 -6472 -2836 7002 -1990 -3038 4470 -2123 -2755 5929 -2056 -6564
628 -6564 6547 2902 -9417 1644 7572 -6205 -3891 6700 -1265 -4457 3761 -70 -3204 4036
642 4036 -45 -4951 4620 3288 -6834 1060 7122 -4325 -3724 6261 164 -4678 2891 1544 -3194
657 -3194 1833 900 -3714 2112 2455 -5154 -128 5187 -3529 -3802 4808 334 -4678 1998 2154 -2959
673 -2959 696 1766 -2345 1114 2562 -3113 -220 4487 -1991 -3016 4186 1042 -4018 1563 2613
688 2613 -2609 -238 1975 -1699 -317 1739 -2087 -915 2729 -1465 -2754 2702 908 -3471 763
703 763 2451 -2014 -758 1989 -685 -690 1541 -539 -675 2018 -248 -1688 2023 1176 -2351 385 2149
720 2149 -1362 -1100 1585 -199 -1180 685 -213 -959 700 -263 -1453 799 690 -1758 59 1560 -1010
737 -1010 -892 1354 229 -915 698 510 -509 607 452 -593 631 766 -990 -56 1275 -580
753 -580 -943 929 133 -1169 115 432 -767 -263 185 -572 -204 319 -577 -339 657 -188 -637 577 408
772 408 -489 168 711 -121 10 575 112 4 365 28 -132 366 17 -461 176 188 -538 -131 240 -421 -438
793 -438 91 -208 -479 55 -93 -366 93 74 -358 165 335 -187 112 418 2 51 516 54 -127 464 212
814 212 -228 180 252 -281 -71 216 -295 -212 51 -302 -296 124 -309 -466 157 -72 -560 142 337 -325 -109 396
836 396 2 -50 382 70 146 372 -92 -89 604 30 -481 453 435 -579 -75 477 -378 -402 235 -402 -292 302
858 302 -499 -454 610 -152 -987 612 567 -1002 3 997 -386 -384 841 88 -198 721 -37 -277 980
877 980 48 -945 890 777 -1309 -17 1229 -865 -814 824 -195 -923 487 -264 -807 730 -105 -1339
895 -1339 880 878 -1735 65 1742 -1015 -960 1689 151 -1072 1078 432 -794 1037 388 -1328 1004
912 1004 1199 -1937 -29 2103 -1411 -1607 1902 -128 -2079 938 616 -1560 502 585 -1745 595
928 595 1302 -2088 -126 2605 -1332 -1761 2666 485 -2357 1404 1535 -1756 439 1418 -1401 338
944 338 1643 -1881 -395 2635 -1478 -2198 2682 347 -3205 1207 1774 -2557 -190 1804 -1696 -379
960 -379 1755 -1707 -725 2792 -1335 -2337 3247 761 -3432 1680 2700 -2703 -318 2835 -1361 -948
976 -948 2195 -1122 -1130 2594 -1043 -2545 2944 686 -4009 1403 2840 -3328 -988 3133 -1466 -1882
992 -1882 2312 -583 -1598 2299 -426 -2397 2731 1082 -3660 1501 3331 -3165 -990 3916 -1159
1007 -1159 -2363 2634 70 -2208 1868 117 -2509 1983 1037 -3641 1082 3060 -3489 -1401 3957
1022 3957 -1357 -3051 2812 536 -2791 1687 931 -2416 1622 1617 -3103 1013 3340 -3011 -1230 4264
1038 4264 -994 -3217 3084 1096 -3181 1209 1616 -2438 640 1637 -2730 149 2682 -2780 -1596
1053 -1596 3666 -1049 -3337 2757 1306 -3405 987 2250 -2224 163 2063 -1774 5 2729 -1876
1068 -1876 -1270 3542 -674 -3056 2839 1491 -3458 824 2464 -2364 -492 2112 -1714 -827 2202
1083 2202 -1610 -1642 2753 -641 -2981 2348 1363 -3283 649 2650 -2163 -740 2516 -997 -1041 2201
1099 2201 -606 -1490 2330 26 -2375 1938 1390 -2840 430 2570 -1984 -1136 2283 -821 -1620 1625
1115 1625 -257 -1712 1436 180 -2158 1233 1215 -2422 209 2244 -1647 -1009 2285 -339 -1518 1711
1131 1711 366 -1462 1227 678 -1661 971 1292 -1853 -14 1974 -1388 -1149 1879 -411 -1794 1194
1147 1194 363 -1649 627 772 -1488 288 1070 -1324 -179 1596 -827 -916 1658 37 -1336 1173
1163 1173 791 -1226 493 1037 -982 72 1095 -829 -381 1100 -588 -885 1021 -114 -1295 585
1179 585 420 -1266 57 728 -940 -265 847 -540 -451 916 -244 -664 886 223 -827 674 604
1196 604 -736 249 845 -417 -163 811 -264 -481 607 -74 -706 434 162 -875 132 369 -723
1213 -723 -240 506 -483 -410 495 -152 -516 382 154 -443 294 346 -351 137 495 -206 13 556 -110 -171 438
1234 438 18 -356 253 107 -446 82 184 -361 -153 183 -340 -236 182 -230 -354 166 -37 -320 189 163
1254 163 -295 126 306 -180 8 420 -35 -62 354 51 -155 276 48 -258 104 167 -265 -71 199 -308 -210
1275 -210 192 -156 -273 96 -42 -265 62 68 -249 117 215 -191 53 318 -76 -41 354 51 -57 325 141
1296 141 -129 221 97 -172 101 104 -279 -47 224 -348 -244 188 -172 -347 85 1 -299 63 25 -287 49
1317 49 213 -252 131 486 -144 -130 498 46 -267 378 246 -171 212 189 -204 101 177 -299 -51 349 -358
1338 -358 -328 296 -135 -547 142 172 -493 -42 150 -266 10 283 -377 41 506 -269 -246 686 131 -519 456
1359 456 453 -394 47 420 -182 -44 285 -340 -11 425 -418 -469 574 -33 -852 298 476 -672 -236 487
1379 487 -260 -262 340 -244 -176 506 -231 -389 785 205 -837 502 770 -636 -233 818 -140 -441 339
1398 339 -17 -281 284 -217 -531 600 4 -1007 338 751 -912 -478 927 -168 -776 390 230 -333
1416 -333 295 79 -311 731 292 -921 498 1032 -866 -451 1249 -32 -1027 482 501 -646 20 108
1434 108 -484 302 114 -972 268 884 -968 -708 1272 -20 -1280 527 814 -700 -45 555 -217
1451 -217 199 332 -500 347 958 -813 -521 1447 99 -1427 592 1037 -1017 -434 771 -279 -429
1468 -429 158 -494 26 612 -872 -694 1298 -32 -1600 625 1225 -1153 -485 1238 -5 -630 418
1485 418 127 -56 587 -435 -399 1296 102 -1461 670 1351 -1317 -736 1473 -120 -1190 395 324
1502 324 -470 118 -226 -488 788 -31 -1376 621 1239 -1299 -694 1657 67 -1380 628 810 -601
1519 -601 30 353 -302 554 189 -1009 518 1195 -1250 -717 1657 -101 -1650 642 832 -1036 -249
1536 -249 589 -324 -31 225 -747 267 974 -1002 -634 1605 -10 -1555 835 1207 -1148 -286 1090
1553 1090 -238 -348 463 -273 -6 685 -698 -586 1201 -113 -1520 693 1000 -1391 -466 1194 -370
1570 -370 -782 532 -56 -380 586 -283 -481 1036 75 -1201 778 1113 -1091 -250 1385 -271 -758 762
1588 762 183 -556 421 32 -603 583 122 -1141 419 830 -1223 -481 1150 -442 -964 709 245 -785
1606 -785 308 339 -577 321 389 -689 327 836 -692 -266 1126 -152 -819 841 413 -783 245 472
1624 472 -591 23 368 -529 -70 547 -609 -432 754 -255 -853 557 297 -847 230 535 -540
1641 -540 -4 582 -382 -94 625 -224 -317 798 90 -590 566 383 -657 169 585 -518 -135 526 -352
1660 -352 -371 479 -177 -539 346 28 -625 233 303 -548 16 506 -339 -174 542 -158 -318 483 104 -388 371
1681 371 292 -410 167 374 -373 -29 398 -299 -284 364 -238 -415 325 6 -578 123 169 -439 -14 266 -330
1702 -330 -192 396 -182 -178 390 -12 -303 382 266 -340 227 361 -301 -3 431 -206 -219 358 -102 -294 241
1723 241 -34 -363 172 89 -437 -13 178 -365 -141 323 -192 -211 265 20 -304 195 176 -240 205 296 -187
1744 -187 102 369 -175 -67 369 -112 -199 317 54 -314 174 84 -351 10 159 -379 -94 165 -324 -217 233
1765 233 -157 -310 245 63 -338 218 211 -323 163 296 -237 40 340 -223 -96 440 -43 -263 347 90 -317
1786 -317 135 155 -305 -31 163 -356 -74 268 -338 -192 357 -129 -426 362 124 -358 172 314 -302 -1
1806 -1 350 -180 -20 378 -211 -165 494 -88 -507 488 213 -609 109 350 -448 -123 349 -365 -153 279 -409
1827 -409 -287 504 -256 -537 586 164 -811 222 606 -443 -163 589 -208 -167 484 -163 -153 517 -154 -566
1847 -566 657 228 -877 205 695 -806 -321 664 -303 -480 349 -107 -334 469 -216 -573 659 187
1865 187 -1016 362 876 -785 -360 1022 -188 -534 603 68 -361 484 5 -519 747 236 -1123
1882 -1123 402 965 -1056 -475 1166 -289 -948 627 142 -743 280 63 -596 470 163 -1022 420
1899 420 1019 -1098 -394 1442 -271 -1088 925 557 -836 266 534 -511 366 321 -864 345 934
1916 934 -1081 -492 1395 -468 -1274 937 499 -1240 119 628 -665 22 472 -748 214 924 -954
1933 -954 -379 1546 -359 -1327 1197 723 -1365 251 1060 -710 -203 755 -493 -131 821 -828 -479
1950 -479 1313 -426 -1445 1090 610 -1558 130 1184 -833 -506 874 -367 -338 769 -464 -425 1194
1967 1194 -236 -1227 1151 761 -1478 202 1364 -885 -557 1052 -256 -631 708 -311 -645 885
1983 885 -190 -1168 881 593 -1515 85 1257 -950 -650 1148 -194 -827 729 17 -646 754 160
2000 160 -907 793 722 -1161 87 1272 -876 -729 1186 -89 -901 661 189 -823 407 252 -868
2017 -868 412 559 -1086 -61 1125 -743 -802 1111 -64 -920 632 407 -733 350 443 -715 262
2034 262 697 -712 -62 1049 -479 -643 999 60 -954 530 376 -779 152 467 -710 -20 564
2051 564 -687 -264 774 -439 -718 734 93 -796 420 474 -684 50 573 -504 -100 612 -386 -241
2069 -241 715 -158 -585 614 223 -696 320 384 -573 10 463 -439 -258 451 -284 -380 514 -115 -511 408
2089 408 228 -537 154 386 -395 -21 441 -284 -177 498 -86 -312 487 118 -424 299 253 -434 -27 301
2109 301 -351 -123 295 -234 -255 274 -153 -339 252 111 -402 141 285 -261 -41 262 -140 -86 333 -40 -107
2130 -107 231 55 -201 238 92 -227 73 266 -253 -19 240 -105 -153 88 -81 -128 61 -34 -221 65 -1
2151 -1 -291 11 122 -202 -99 174 -115 -84 52 69 -52 71 52 -17 169 36 -46 64 138 -51 -66 131 -28
2174 -28 -89 3 12 -101 -104 7 -47 -55 -52 -149 8 19 -47 -72 29 61 -49 5 91 52 -12 68 86 31 35 43 59 49 -53 -35
2204 -35 79 30 -111 10 -32 -6 -57 -42 26 14 -34 -56 37 -45 -103 24 6 -3 28 42 42 1 15 0 42 -7 -9 45 21 -50
2234 -50 -24 21 25 -90 7 -36 -43 -58 -74 -14 -43 7 -104 43 -16 -33 12 51 -20 -28 34 13 -7 74 91 37 88 49 14 40
2264 40 131 -22 -11 32 -13 -86 -12 -33 -97 28 8 -135 -70 29 -102 -84 17 -33 -84 57 -40 -37 104 -33 -42 134 91
2291 91 -51 133 172 -96 26 144 -16 -36 50 5 -61 58 -51 -52 133 8 -246 63 111 -167 -85 129 -23
2314 -23 -168 39 21 -77 116 -5 -60 133 43 -208 158 194 -197 -41 269 -65 -191 189 58 -80 57 2
2336 2 -107 88 9 -270 155 221 -358 -54 355 -186 -297 211 95 -227 104 88 -64 202 42 -251 224 311
2358 311 -455 -17 503 -199 -393 401 49 -388 116 217 -256 5 55 -344 222 179 -473 -5 569 -314 -489
2379 -489 567 141 -558 147 361 -320 5 190 -204 160 292 -467 30 654 -343 -476 687 201 -723
2398 -723 220 486 -495 -146 334 -246 13 229 -429 -35 669 -437 -578 797 144 -913 241 686 -546
2417 -546 -200 611 -249 -153 352 -282 -90 696 -338 -620 886 210 -1015 361 821 -748 -315 737
2435 737 -222 -439 329 -215 -264 478 -313 -656 772 171 -1123 338 900 -886 -390 1007 -161 -581
2453 -581 602 79 -409 489 -107 -564 763 255 -1122 366 1022 -964 -438 1141 -189 -904 544
2470 544 273 -647 334 30 -594 597 208 -1022 323 1006 -976 -523 1298 -207 -972 712 449 -758
2488 -758 212 340 -641 400 382 -885 248 957 -923 -562 1247 -322 -1155 772 492 -1027 165
2505 165 586 -576 43 440 -664 102 861 -785 -444 1260 -125 -1192 873 686 -1052 74 793
2522 793 -549 -210 508 -437 -144 761 -603 -534 1052 -184 -1161 750 659 -1173 -58 900 -586 -405
2540 -405 683 -225 -325 665 -347 -445 924 -38 -1013 801 734 -1078 -13 1047 -508 -536 796 -87
2558 -87 -491 501 -155 -521 622 45 -908 513 610 -1066 -115 1040 -522 -627 774 54 -689 470
2576 470 230 -507 420 183 -702 381 701 -817 -157 969 -405 -677 780 124 -693 308 280 -509
2594 -509 203 318 -599 157 529 -698 -189 863 -368 -696 643 193 -768 326 456 -485 5 417
2612 417 -394 -4 513 -454 -214 707 -241 -599 721 256 -716 235 492 -462 -150 501 -266 -134 405 -306
2632 -306 -324 500 -89 -575 459 252 -615 87 531 -422 -164 532 -177 -265 417 -49 -340 396 30 -474
2652 -474 353 260 -551 32 525 -326 -256 391 -139 -321 257 -27 -373 276 128 -410 175 327 -448 23 427
2673 427 -262 -186 421 -24 -341 326 117 -325 176 208 -300 51 308 -288 -137 372 -147 -289 280 11 -324
2694 -324 143 87 -324 50 211 -305 -41 335 -205 -195 363 -26 -207 203 74 -266 231 169 -237 26 241
2715 241 -221 -34 318 -103 -156 301 -48 -315 173 132 -274 64 198 -287 -68 219 -191 -161 288 -102 -272
2736 -272 236 -5 -279 127 161 -227 75 189 -136 -61 341 -138 -93 273 -34 -321 146 139 -296 94 181 -250
2758 -250 -120 247 -196 -78 206 -143 -184 243 -48 -298 192 151 -313 28 193 -223 -4 248 -169 -159 250
2779 250 -128 -193 352 14 -301 263 196 -358 7 279 -213 -175 216 -149 -173 237 -129 -227 320 42 -415 228
2801 228 250 -385 31 349 -165 -149 329 -61 -151 239 -17 -202 340 73 -351 193 239 -404 -144 393 -194
2822 -194 -296 325 -35 -245 211 15 -227 218 31 -401 228 351 -415 -65 488 -153 -334 402 97 -313
2842 -313 205 113 -196 177 88 -395 186 261 -449 -137 535 -223 -421 475 137 -401 148 238 -256 145 123 -338
2864 -338 58 311 -455 -115 611 -263 -454 508 179 -561 80 348 -334 -14 218 -278 91 312 -391 -134
2884 -134 600 -264 -549 574 159 -675 122 440 -363 -113 345 -197 -42 295 -318 -140 547 -223 -547 561
2904 561 296 -693 110 546 -425 -280 392 -137 -226 248 -154 -231 428 -134 -537 481 313 -782 73 652
2924 652 -455 -382 567 -1 -382 260 26 -243 350 -47 -436 469 330 -728 116 729 -460 -373 648
2943 648 -3 -535 330 153 -355 258 31 -457 341 240 -659 48 678 -509 -448 701 60 -679 316 324
2963 324 -389 156 242 -348 181 347 -489 78 723 -433 -458 723 121 -733 308 475 -495 -42 331 -292
2983 -292 -38 274 -421 -122 578 -383 -482 708 118 -818 322 521 -563 -79 467 -263 -192 429 -217 -166
3003 -166 472 -247 -447 606 171 -695 257 567 -568 -210 596 -259 -355 356 -75 -300 389 -34 -448 421
3023 421 182 -699 242 527 -581 -185 597 -205 -439 461 94 -421 271 97 -375 298 254 -521 152 515
3043 515 -536 -265 632 -122 -497 356 153 -508 178 180 -392 173 279 -453 34 491 -351 -229 580 -68
3063 -68 -523 425 220 -509 180 314 -356 16 314 -334 -83 419 -288 -309 486 -115 -587 284 252 -548 99
3084 99 412 -378 -97 405 -232 -240 399 -124 -308 387 49 -499 248 362 -419 -12 497 -235 -180 425 -127
3105 -127 -256 268 19 -336 298 99 -479 163 289 -391 -108 373 -288 -269 298 -51 -299 292 98 -364
3125 -364 156 222 -339 133 318 -275 -92 359 -178 -285 388 4 -339 250 133 -263 130 249 -280 24
3145 24 351 -230 -191 308 -70 -331 274 41 -342 150 176 -301 48 258 -223 -104 216 -156 -218 265 -19
3166 -19 -315 231 84 -313 107 225 -288 -17 279 -207 -119 285 -68 -280 273 69 -320 212 171 -303 39
3187 39 189 -220 -9 231 -138 -147 265 -63 -229 176 113 -256 159 170 -288 21 220 -198 -164 310 -122 -203
3209 -203 217 -17 -262 127 115 -199 123 202 -228 -73 246 -184 -78 257 -95 -212 241 61 -282 116 144
3230 144 -265 3 205 -227 -34 235 -134 -181 213 -95 -209 188 21 -307 155 187 -288 -25 241 -194 -92
3251 -92 240 -87 -176 247 -28 -231 234 106 -254 157 311 -264 -28 301 -76 -213 231 24 -114 182 -2
3272 -2 -197 203 79 -341 95 192 -296 -143 295 -145 -265 224 39 -199 154 44 -203 203 60 -302 155
3293 155 327 -333 -62 382 -132 -340 256 109 -223 133 88 -226 118 102 -272 150 312 -323 -112 489 -135
3314 -135 -354 359 151 -292 79 223 -213 65 101 -233 124 272 -344 -83 434 -162 -403 346 135 -475
3334 -475 57 259 -231 -27 155 -193 58 240 -333 -110 536 -182 -463 418 200 -485 129 361 -249 -90
3354 -90 235 -159 30 252 -294 -18 461 -189 -496 490 221 -550 16 467 -309 -208 280 -67 -45 186 -247
3375 -247 -111 392 -191 -460 444 222 -610 69 520 -302 -233 419 -7 -167 188 -73 -92 396 -129 -398 469
3396 469 225 -629 108 583 -423 -314 489 -39 -375 213 14 -186 293 -130 -359 381 231 -663 67 617
3416 617 -452 -437 581 28 -475 243 168 -230 183 58 -338 338 221 -600 42 582 -409 -410 635 75
3436 75 -476 197 273 -343 77 98 -317 203 234 -458 54 549 -386 -413 606 32 -588 232 294 -421 3 269
3458 269 -254 108 227 -431 1 486 -392 -394 568 59 -619 249 418 -404 -67 310 -251 -78 254 -241 -70
3479 -70 450 -227 -372 546 114 -629 272 466 -412 -119 396 -182 -159 253 -122 -110 400 -154 -342 442 131
3500 131 -623 136 452 -463 -228 452 -96 -245 253 -33 -255 343 -65 -325 324 161 -478 157 501 -303
3520 -303 -194 484 -76 -288 288 80 -316 178 77 -312 171 212 -395 43 429 -375 -295 516 -56 -476 257
3541 257 224 -296 75 184 -285 148 272 -322 21 347 -205 -280 406 80 -427 239 162 -336 28 296 -222
3562 -222 -35 287 -230 -41 355 -156 -269 332 109 -401 182 297 -352 -14 283 -200 -164 244 -166 -135 247
3583 247 -87 -245 232 77 -392 139 243 -273 -59 274 -142 -168 204 -61 -195 215 1 -190 161 132 -306
3604 -306 102 277 -305 -97 322 -100 -241 268 37 -201 192 149 -233 141 123 -290 49 269 -230 -142 276
3625 276 -63 -225 233 56 -313 68 141 -190 58 163 -248 6 273 -154 -146 300 -22 -285 219 95 -254
3646 -254 112 246 -175 21 225 -96 -7 190 -140 -132 282 -26 -288 170 135 -261 -39 230 -178 -45 230
3667 230 -115 -176 202 -8 -224 185 5 -183 144 145 -188 46 209 -218 -127 259 -127 -207 262 32 -225 174
3689 174 94 -214 97 142 -244 -4 278 -125 -113 276 -102 -190 216 3 -224 160 137 -271 14 216 -146 -20
3711 -20 215 -205 -97 251 -70 -272 205 29 -288 110 119 -222 -36 246 -162 -81 209 -107 -135 263 -12 -166
3733 -166 245 61 -234 127 161 -243 -25 311 -173 -143 221 -41 -125 201 -49 -227 198 32 -317 121 253
3754 253 -301 -73 320 -197 -211 254 -4 -245 191 10 -167 169 41 -298 164 288 -379 -55 399 -175
3774 -175 -256 292 70 -268 132 124 -187 183 46 -206 152 195 -343 -17 429 -245 -314 322 93 -355 96 123
3796 123 -225 96 96 -263 207 185 -367 0 422 -260 -417 457 144 -377 100 235 -213 -50 186 -170 132
3817 132 281 -368 -46 476 -275 -414 452 145 -517 142 325 -285 -108 221 -185 -27 247 -320 -84 399
3837 399 -258 -376 553 126 -598 174 451 -372 -149 307 -115 -108 238 -167 -44 414 -209 -356 525 147 -633
3858 -633 270 536 -443 -269 468 -47 -226 226 -79 -140 363 -216 -379 547 151 -744 180 591 -440 -320
3878 -320 522 -47 -401 219 -12 -177 223 -149 -408 378 94 -697 176 619 -576 -299 585 -20 -482 321
3898 321 224 -289 201 34 -324 356 139 -631 183 595 -601 -373 735 -47 -609 314 267 -387 77 182
3918 182 -271 182 201 -541 97 487 -499 -331 698 -106 -700 333 343 -555 -22 321 -262 13 279 -348
3938 -348 55 508 -441 -313 756 -17 -654 393 432 -582 -51 445 -251 -101 260 -242 -35 401 -335
3957 -335 -346 582 -65 -726 340 426 -638 -160 536 -251 -230 343 -146 -113 379 -206 -360 573 76 -656 299
3978 299 529 -577 -111 669 -231 -376 399 26 -257 308 -42 -308 450 106 -568 295 462 -647 -147
3997 -147 661 -273 -477 438 75 -427 269 129 -373 281 95 -570 244 448 -581 -226 624 -202 -556 431
4017 431 130 -463 203 250 -303 168 215 -409 115 425 -447 -222 650 -161 -529 424 224 -487 137 340 -314
4038 -314 5 313 -310 -15 429 -329 -272 545 -75 -574 389 226 -560 51 445 -332 -164 333 -233 -198 393
4059 393 -254 -263 459 -74 -437 356 276 -560 140 452 -336 -115 408 -169 -197 401 -94 -333 401 21 -450
4080 -450 280 325 -519 -3 462 -283 -237 416 -109 -328 307 -27 -372 303 118 -429 184 350 -472 -38 450
4101 450 -242 -302 400 -42 -323 323 90 -386 186 213 -363 111 404 -318 -97 470 -234 -264 381 50 -395
4122 -395 268 177 -383 144 262 -430 -2 417 -323 -166 443 -136 -374 367 -24 -336 222 142 -348 122 254
4143 254 -327 -33 350 -278 -217 398 -81 -354 303 126 -384 246 270 -248 61 360 -283 -119 347 -206 -166
4164 -166 373 -45 -382 246 169 -400 101 280 -347 25 337 -218 -159 325 -157 -265 362 34 -407 191 221
4185 221 -305 101 252 -275 -17 280 -292 -186 369 -108 -314 419 68 -404 226 273 -373 31 350 -248
4205 -248 -31 348 -192 -232 422 -78 -400 359 143 -394 113 321 -424 -53 385 -285 -111 304 -181 -247 397
4226 397 -65 -407 356 161 -463 156 424 -367 -85 363 -216 -128 365 -119 -244 371 -24 -417 346 202
4246 202 -510 130 382 -382 -122 387 -195 -215 346 -27 -288 334 -6 -442 373 199 -548 126 483 -405
4266 -405 -196 437 -190 -347 425 10 -369 322 85 -415 306 296 -571 149 558 -413 -268 521 -104 -380
4286 -380 438 82 -328 258 71 -368 351 296 -557 44 540 -444 -253 596 -124 -498 369 146 -484 247
4306 247 184 -387 156 286 -487 35 496 -402 -283 639 -116 -551 412 239 -543 95 381 -373 158 333
4326 333 -479 -14 557 -393 -314 697 -96 -635 437 336 -631 17 453 -468 -84 391 -377 -110 548 -396
4346 -396 -332 679 -131 -680 451 351 -677 71 498 -374 -180 459 -271 -227 443 -283 -233 624 -108 -618
4366 -618 524 439 -736 9 661 -428 -308 489 -137 -259 400 -123 -365 537 -45 -679 440 404 -771
4385 -771 25 704 -474 -477 655 -54 -463 369 58 -374 429 83 -561 396 437 -759 66 834 -430 -459
4405 -459 730 31 -532 344 127 -436 292 105 -505 317 379 -660 40 759 -445 -534 682 101 -670
4424 -670 335 302 -513 137 293 -415 90 443 -560 -48 741 -430 -510 732 160 -732 300 457 -603
4443 -603 -43 470 -419 -26 436 -387 -141 649 -304 -477 694 168 -814 326 545 -523 -125 547 -289
4462 -289 -161 445 -316 -259 472 -211 -544 599 241 -755 300 598 -616 -165 581 -289 -361 496 -128 -284
4482 -284 471 -65 -490 449 226 -668 162 614 -569 -248 723 -213 -496 494 21 -384 379 142 -480 331
4502 331 309 -610 114 607 -511 -340 635 -158 -541 373 153 -536 234 220 -437 118 311 -530 43 540
4522 540 -409 -314 627 -86 -581 402 294 -477 123 344 -447 53 423 -375 -98 508 -257 -396 628 -15
4542 -15 -636 392 320 -592 63 462 -378 -81 371 -283 -212 505 -230 -379 460 102 -593 295 378 -528 17
4563 17 524 -340 -195 431 -212 -277 427 -56 -407 380 207 -481 211 431 -522 -11 503 -292 -258 444 -91
4584 -91 -332 423 7 -466 265 250 -420 151 415 -410 -183 484 -233 -380 419 -38 -426 298 85 -464 232
4605 232 310 -467 -2 438 -310 -231 469 -174 -394 406 19 -453 294 238 -447 116 398 -399 -66 450 -222
4626 -222 -247 485 -61 -411 346 91 -430 181 255 -500 32 379 -382 -121 428 -204 -310 396 4 -433 287
4647 287 199 -437 100 341 -472 -21 440 -321 -213 445 -83 -343 413 72 -354 304 217 -367 104 361 -372
4668 -372 -63 489 -273 -265 485 -85 -448 314 127 -447 198 273 -358 60 315 -371 -133 428 -192 -326 458
4689 458 -5 -491 286 221 -425 134 262 -263 -48 309 -330 -154 402 -166 -294 479 22 -491 264 268 -436
4710 -436 18 271 -322 -66 390 -230 -189 444 -80 -345 419 25 -555 276 320 -495 -56 412 -295 -186 289
4731 289 -189 -234 415 -103 -335 411 147 -515 195 447 -528 -77 459 -253 -214 372 -65 -289 322 -31 -310
4752 -310 358 58 -456 218 383 -487 -127 530 -249 -265 382 -32 -300 253 60 -341 269 131 -469 187
4772 187 343 -500 -118 546 -265 -372 487 53 -405 287 60 -395 260 173 -418 216 415 -505 -81 605
4792 605 -228 -436 515 59 -463 258 258 -368 143 227 -417 84 344 -509 -153 608 -275 -476 513 71 -564
4813 -564 213 259 -392 28 285 -388 17 386 -386 -152 599 -236 -489 557 158 -611 226 451 -384 -72
4833 -72 389 -259 -87 399 -258 -196 542 -303 -485 565 143 -607 176 504 -496 -175 488 -255 -225 310
4853 310 -199 -213 436 -173 -497 455 158 -632 156 544 -487 -219 499 -156 -258 338 -133 -263 383 -22
4873 -22 -472 415 228 -604 159 606 -479 -226 580 -233 -355 425 -11 -322 294 81 -437 325 274 -577
4893 -577 67 490 -451 -290 651 -115 -502 430 132 -434 292 191 -448 241 271 -529 106 548 -412 -262
4913 -262 648 -10 -527 464 220 -479 178 257 -374 114 372 -419 -33 543 -359 -415 582 -51 -633 314 254
4934 254 -533 60 346 -380 -47 348 -307 -154 518 -277 -384 515 20 -596 337 344 -519 43 452 -327 -140
4955 -140 368 -207 -208 452 -124 -366 444 122 -572 311 357 -492 -62 491 -313 -262 425 -105 -318 340 -19
4976 -19 -372 391 93 -518 144 351 -498 -59 492 -270 -293 424 -39 -358 274 117 -386 262 234 -432 106
4997 106 374 -415 -108 546 -190 -304 423 39 -408 311 176 -359 177 273 -394 34 373 -371 -213 501
5017 501 -218 -414 366 111 -477 158 250 -372 103 322 -318 -59 391 -276 -247 414 -72 -384 378 102 -489
5038 -489 192 309 -344 15 398 -273 -98 376 -224 -250 426 -26 -390 380 198 -464 96 381 -412 -123
5058 -123 358 -246 -234 386 -140 -280 333 -14 -463 239 226 -471 46 406 -346 -149 437 -128 -283 386 -28
5079 -28 -286 288 107 -340 162 330 -414 12 387 -258 -188 360 -60 -340 319 37 -330 212 138 -390 73
5100 73 246 -352 -62 397 -251 -232 372 -71 -385 287 106 -406 140 233 -321 82 340 -365 -82 353 -183
5121 -183 -287 342 10 -296 347 171 -394 78 271 -323 65 266 -232 -103 327 -138 -208 304 35 -359
5141 -359 167 149 -328 96 268 -319 -65 360 -204 -211 350 -62 -286 244 66 -348 279 218 -353 33 300
5162 300 -254 -80 358 -149 -272 346 79 -260 215 137 -243 149 214 -320 68 235 -288 -117 333 -101 -252
5183 -252 250 53 -331 191 155 -291 74 185 -362 7 266 -295 -143 344 -157 -290 302 62 -337 175
5203 175 312 -286 33 224 -199 -4 275 -200 -106 312 -56 -235 337 108 -350 127 233 -315 -44 299
5223 299 -231 -149 263 -130 -170 297 -53 -325 230 103 -369 147 240 -294 -80 304 -136 -199 220 -129 -191 243
5245 243 2 -210 278 194 -308 112 307 -249 -138 328 -146 -176 269 -30 -243 170 79 -242 205 107 -324
5266 -324 49 243 -278 -149 363 -116 -244 246 13 -244 185 99 -276 172 103 -339 7 285 -275 -117 367
5287 367 -99 -272 336 83 -289 171 152 -168 92 114 -288 86 338 -242 -163 366 -58 -268 209 100 -267
5308 -267 102 148 -228 15 207 -178 -44 285 -203 -221 346 -119 -324 215 126 -245 76 202 -186 -42 182
5329 182 -180 -69 278 -147 -187 379 13 -280 275 159 -320 97 223 -178 -21 240 -141 -142 267 -111 -188
5350 -188 218 0 -327 208 199 -259 1 268 -247 -107 296 -135 -179 182 -88 -249 258 15 -276 130 171
5371 171 -247 -8 291 -159 -178 246 -34 -155 248 38 -218 185 96 -243 138 237 -296 -6 238 -142 -144 264
5393 264 -88 -222 161 105 -244 101 105 -260 39 240 -185 -49 278 -71 -207 241 67 -269 135 95 -203
5414 -203 37 128 -213 43 260 -182 -152 277 -52 -213 246 55 -248 127 211 -245 23 187 -129 -28 249
5435 249 -148 -143 255 -35 -203 181 71 -289 93 169 -197 -12 168 -195 -84 198 -131 -218 254 6 -171
5456 -171 134 111 -232 92 237 -196 -21 259 -90 -124 279 -37 -187 164 25 -193 164 127 -277 -1 180
5477 180 -251 -110 213 -107 -173 219 -16 -240 139 59 -190 82 116 -192 18 225 -168 -80 259 -85 -162 222
5499 222 70 -177 168 78 -233 78 152 -257 23 259 -182 -161 242 -51 -209 159 97 -255 75 68 -208 -20
5521 -20 259 -178 -60 262 -132 -172 178 5 -210 205 70 -201 73 202 -174 16 213 -128 -72 261 -43
5542 -43 -211 256 24 -258 148 138 -185 49 181 -171 -101 156 -169 -39 231 -72 -161 197 69 -184 145
5563 145 151 -105 -20 152 -173 -135 217 -105 -163 145 -1 -151 104 124 -224 137 149 -218 -12 193 -105 -122 214
5586 214 -69 -97 152 -18 -172 152 120 -160 73 174 -175 -73 183 -62 -101 157 -39 -125 97 59 -200 32
5608 32 137 -242 17 109 -190 -39 161 -28 -165 173 -48 -174 110 3 -156 38 157 -114 52 163 -141
5629 -141 -108 190 -24 -120 195 9 -215 66 130 -142 -15 189 -137 -26 179 -118 -97 194 -24 -176 104
5650 104 3 -189 74 60 -132 48 136 -133 -88 144 -164 -143 187 -60 -135 114 61 -171 60 120 -158 -5
5672 -5 187 -141 -41 202 -5 -120 120 86 -168 143 108 -177 50 123 -140 -37 190 -135 -66 221 -38 -158
5694 -158 135 25 -192 84 132 -192 30 60 -175 -29 149 -119 -94 153 -6 -107 160 29 -141 71 102
5715 102 -92 18 126 -82 -51 190 -35 -126 130 -30 -173 121 50 -201 104 166 -148 25 217 -95 -85 116
5737 116 22 -142 149 -19 -149 87 67 -173 44 156 -155 -30 153 -108 -81 109 -31 -89 86 -3 -78 76
5759 76 67 -190 126 168 -135 -43 170 -54 -166 139 -67 -165 92 43 -113 97 88 -211 32 119 -122 -93 169 -39
5783 -39 -141 129 34 -72 54 85 -155 124 106 -110 31 143 -92 -45 234 -78 -141 98 92 -116 101 57 -116
5806 -116 50 122 -134 -58 176 -153 -116 128 -1 -158 97 32 -249 37 100 -106 -2 147 -74 -60 125 -117
5828 -117 -118 151 -27 -160 133 35 -138 81 157 -98 -5 126 -73 -12 160 -11 -20 222 -25 -177 154 146 -128
5851 -128 75 176 -153 -43 155 -21 -54 182 -30 -74 114 15 -110 94 74 -205 -5 127 -171 -63 85
5872 85 -15 -31 57 -32 -62 143 4 -131 101 96 -179 -14 194 -120 -73 203 -2 -93 169 24 -123 71 53
5895 53 -112 93 94 -177 -14 140 -97 -97 191 -56 -117 105 58 -112 53 54 -156 -4 110 -100 -43 204 -65
5918 -65 -153 193 -11 -193 108 40 -176 79 99 -97 61 147 -100 -64 146 -113 -120 154 27 -162 92 110 -131
5941 -131 32 84 -83 16 67 -126 -84 122 -84 -83 162 40 -196 85 105 -170 1 116 -135 -15 128 -49
5963 -49 -20 55 -44 -97 105 46 -215 88 133 -125 -31 118 -57 -22 178 -54 -106 156 8 -119 153 -17 -172
5986 -172 22 73 -188 -5 92 -127 -105 93 -101 -159 119 42 -155 75 92 -118 -17 92 -148 -26 140 -81
6008 -81 -100 120 -18 -84 111 39 -72 127 75 -135 -29 145 -90 -70 137 -86 -76 116 -23 -97 101 22 -141
6031 -141 82 49 -137 -23 115 -76 -82 131 -50 -76 118 36 -86 78 13 -128 65 93 5 -43 99 -116 -47
6054 -47 140 -14 -68 106 104 -72 83 67 -88 -34 71 -124 -55 76 -122 -49 124 10 -112 20 1 -98 -18 45
6078 45 -165 -13 111 -82 -25 90 -44 -96 72 -1 -76 93 44 -79 42 31 -55 3 132 -49 -58 98 60 -82
6102 -82 118 -41 -65 59 47 -114 -1 154 -103 0 101 -83 -59 78 -40 -120 75 71 -156 18 17 -121 47
6125 47 89 -110 -39 112 -69 -71 101 -28 -51 89 50 -148 63 130 -111 32 141 -68 -2 101 -13 -52 102
6148 102 33 -79 71 62 -71 7 60 -93 -66 98 -55 -119 89 -33 -100 43 39 -104 72 74 -131 56 130 -88
6172 -88 -40 81 -47 -104 128 2 -6 72 21 -76 53 112 -88 16 144 -53 -15 116 -80 -2 95 -22 -109 73
6196 73 0 -116 11 64 -117 -19 64 -47 -69 73 -31 -133 35 3 -128 48 -9 -43 33 48 -97 25 156 -30
6220 -30 -108 114 -29 -107 129 35 -64 38 54 -103 -2 115 -36 -19 159 -38 -79 119 -44 -103 112 64 -112
6243 -112 10 93 -109 12 43 -116 -27 61 -48 -110 123 52 -120 16 104 -150 15 58 -98 36 132 -52 -40
6266 -40 80 -82 -90 85 61 -124 42 23 -93 -36 81 -38 -30 93 -73 -57 34 -34 -55 123 15 -85 2 32 -102
6291 -102 -6 60 -63 -50 68 10 -45 74 -17 -66 15 42 -45 44 186 -55 -4 118 -67 -16 56 -17 -93 94 72 -66
6317 -66 57 2 -84 15 9 -51 -40 57 2 -101 4 72 -68 23 -70 -132 38 82 -94 -41 55 -108 -29 80 -1 -98 16
6344 16 70 -54 111 88 -38 -27 14 -66 11 96 -50 26 54 -35 -85 85 36 -46 55 30 -79 -2 79 -77 -3 66
6370 66 -47 -56 53 -12 -67 34 59 -86 16 76 -101 10 41 -48 -18 65 -37 -92 92 90 -30 -15 35 -54 6 98
6396 98 -42 -65 152 -53 -15 100 15 -40 96 -33 -21 35 -8 -68 35 93 -69 -7 64 -9 -80 -10 20 -66 97 0
6422 0 -83 24 15 -57 -39 70 -15 -75 70 34 -39 91 56 -62 13 47 -63 20 155 -35 56 48 -45 -101 69 37 -80
6449 -80 42 69 -8 56 22 -23 -59 46 -24 -61 23 7 -73 32 24 -78 -19 1 -44 46 97 -55 13 62 -8 -52 105 6
6477 6 -26 73 46 -52 9 60 -70 52 -9 -21 -19 28 -63 -96 69 -17 -41 17 12 -115 -14 56 -19 -30 58 -56 -38 18 18
6506 18 -57 -6 -2 -51 95 4 -45 7 129 -37 -17 70 -50 -35 89 29 -114 12 3 -33 4 42 -53 -56 54 -33 -21 51
6534 51 -20 -54 -25 -56 -9 38 81 -44 -1 91 -67 5 52 -83 -26 10 16 -86 6 100 -55 33 15 -36 15 -19 3 0 20
6563 20 12 -13 71 -16 -57 35 35 -55 34 24 13 -15 50 -28 -11 -31 -10 -49 -33 54 -108 12 4 -7 37 -9 -40 7 80 -23
6593 -23 -56 33 -25 -45 74 26 -18 30 21 -11 29 53 -22 -73 81 8 -64 77 34 -1 6 62 -33 -1 21 -43 60 2 -51
6622 -51 -32 49 -7 -134 20 -11 -21 38 64 -17 5 37 -43 -48 67 -11 -4 50 -43 -42 38 22 -33 53 -5 -33 -16 25 -36 -49
6652 -49 31 65 -44 35 10 -55 -35 10 -72 2 5 -83 3 40 -61 -9 48 -44 -49 -5 6 -14 -39 0 -19 -31 14 1 16 47
6682 47 -2 -66 66 -20 -29 61 67 -42 12 24 2 5 35 -31 0 90 1 -14 34 29 -73 -26 43 6 -42 13 -61 -1 8 -42 -38 36
6714 36 22 -28 30 33 -91 37 26 -17 27 26 -11 42 74 -35 31 48 -5 -86 9 19 -33 -6 18 7 7 73 -24 -23 21 -2 -49
6745 -49 47 -28 -88 37 88 -71 -13 6 -60 -33 65 -22 -47 26 12 -13 5 11 -66 23 21 -14 -12 52 -59 12 91 5 -49 25
6775 25 60 -72 53 -56 -17 -13 14 20 58 93 -39 -53 36 43 -101 32 -1 -54 8 21 -26 20 43 7 46 62 -6 -65 66
6804 66 2 -26 26 4 -14 25 33 -22 -21 32 -27 70 33 2 -63 21 -38 -83 39 47 -8 -32 12 15 -2 62 2 -23 25 -38 -46 43
6836 43 3 -94 22 27 -85 -38 -12 -36 -58 36 -72 -24 -15 20 -26 -18 -8 -47 42 65 -68 13 80 -30 12 17 -16 -16 -40 -39 -24
6867 -24 35 -18 3 47 48 -56 -4 68 -79 -78 37 -35 24 21 -38 -21 18 6 -59 54 74 -58 -23 29 11 -27 5 2 -16 41
6897 41 20 -6 37 43 -17 74 14 -57 -57 65 7 -60 39 -2 16 22 -3 -33 -35 -14 -15 -17 82 -6 -12 51 -37 1 -3 28 5 -7 34 -37
6931 -37 4 23 -24 86 69 -36 -4 98 -12 -40 86 -10 -76 62 75 -36 -5 40 13 10 61 -43 6 34 -52 -59 58
6958 58 15 -6 6 53 -19 -72 -38 -28 2 3 -9 -68 37 10 -19 39 -18 -77 -2 25 -60 1 -3 29 -26 12 -18 2 41 59 -24
6989 -24 39 4 -2 43 57 7 -40 40 -42 -7 53 -19 -57 12 -16 -20 12 28 -69 -8 0 -74 -11 44 -35 -62 54 55 -22 12 33 -2
7021 -2 58 -35 -55 20 64 -51 10 63 -6 -13 46 69 -28 44 6 -75 20 -8 -60 -9 34 -13 -22 63 5 -26 -2 -25 -78 11 3 -11
7053 -11 -11 64 -98 -24 55 -4 45 -2 -7 14 81 -42 -25 40 50 -42 1 99 -9 51 72 -27 -25 34 47 16 46 -20 -51 67
7083 67 26 -99 -3 48 -39 51 -34 -28 -50 6 3 5 70 22 -52 11 26 -27 26 40 -13 -5 13 -9 19 25 -21 -47 -10 5 -43 36
7115 36 44 -82 -9 63 -53 32 53 2 -42 19 -20 20 -31 -1 -59 51 -26 -71 -23 29 -69 -66 55 -35 -87 24 2 -72 5
7144 5 102 12 3 56 -40 5 90 -51 -26 103 9 -116 101 78 -99 2 -8 -59 -9 34 -25 30 63 -58 -82 75 5
7171 5 -40 39 34 -31 -32 -2 -21 20 38 -39 4 48 -47 -42 -17 3 -8 10 78 -37 -42 -11 -26 -8 48 -17 -2 -21 7 -50 48 -28
7203 -28 -27 44 57 -32 -3 105 -19 13 54 -35 -32 -6 19 -2 -29 11 -62 10 2 -65 0 49 -49 -21 40 -32 -70 -9 44 -75
7233 -75 44 28 -28 77 98 -89 31 62 -2 -35 40 70 -24 34 -24 -46 -6 -42 -54 69 12 -84 -5 73 -93 -67 101
7260 101 33 -115 4 38 -35 3 19 -71 74 16 -33 22 43 -29 -61 89 -30 -108 11 17 35 46 16 9 -15 49 -23 -42
7288 -42 68 -42 -31 21 39 -82 -30 6 -93 -40 -21 -87 -13 32 -10 -16 -1 -115 -30 46 -5 -54 5 105 -71 19 5 -12
7316 -12 32 4 3 32 0 2 3 30 13 -5 24 96 -34 -13 83 -19 -3 34 38 -25 58 -7 -28 25 15 -56 32 73 -54 -32 82
7347 82 50 -114 57 51 -65 -43 3 -5 25 -29 -30 36 76 -14 -53 111 26 -89 30 97 -4 13 -4 -3 25 51 -63 19
7375 19 45 -46 -35 82 63 -64 49 68 -46 -8 20 -59 4 49 -35 2 20 14 -9 91 -65 -31 108 32 -68 -5 55
7402 55 -66 42 17 36 2 24 -17 -24 50 22 -47 100 39 -40 13 -4 -12 53 16 -43 -62 -5 -34 -68 77 -30 -58 30 31
7431 31 -125 46 40 -41 -70 41 8 11 61 23 -19 61 -20 -62 48 52 -82 -38 67 37 -3 43 0 -51 30 -23 29 46 -11
7460 -11 -53 25 38 -93 -55 40 -13 -100 20 9 -22 7 21 -64 24 2 -52 -17 68 -50 -85 62 -26 -72 62 4 -77 44
7488 44 57 -41 8 57 -24 32 84 -53 0 35 27 -43 45 83 -99 38 55 -38 -9 -1 -74 -49 16 -45 -36 34 -2 -76 0 40
7518 40 -53 -20 22 -56 22 45 -18 -47 59 -12 -58 58 -37 -74 -2 19 -40 36 43 -46 55 13 -42 -68 78 -4 -13 13 11 -8
7548 -8 3 62 -89 -24 14 -69 -56 48 -43 -94 82 -8 -47 7 72 -28 -27 81 -26 21 41 -9 -17 56 27 -10 60 53 -72
7577 -72 23 70 -52 22 83 -32 -20 110 -16 -47 49 -26 -27 85 -28 -88 7 31 -64 -91 80 -21 -51 41 -66 -61 22
7604 22 -2 -83 17 24 -102 -39 73 -61 -37 41 18 -6 63 -4 -51 63 -1 -86 40 39 -32 46 32 -58 -28 105 -62
7631 -62 -74 11 38 -116 18 38 -32 -5 -5 -36 -3 57 -89 -6 63 -17 -105 49 12 -115 39 67 16 49 68 -72 -12
7658 -12 31 -4 -46 76 -30 -77 151 97 -60 -21 62 -35 8 40 1 -38 82 2 -11 93 -55 -22 70 50 -58 14
7684 14 86 -64 -100 71 -25 -16 41 -42 -50 88 13 -61 67 109 -12 26 55 -59 -80 38 -2 -32 77 14 -21 -5 21
7711 21 -57 18 47 -119 11 111 -74 -70 93 -10 -2 7 24 -4 15 61 -58 15 17 -124 -11 77 -51 -66 52 58 -52
7738 -52 73 10 -79 -34 49 -69 61 32 -106 10 142 -63 -99 122 22 -77 56 52 -172 26 60 -60 -60 73
7762 73 -69 -2 101 -56 -81 108 -75 -181 10 78 -45 51 123 -6 -75 132 -23 -12 55 57 -34 94 61 -115
7786 -115 115 68 -90 -7 83 -1 -29 92 44 -64 111 -18 -69 44 13 -117 35 87 -109 -63 94 -27 -76 111
7810 111 2 -83 -14 -34 -92 55 58 -43 38 81 -98 -12 94 -55 -80 49 71 -36 34 79 -68 40 31 -51 75
7835 75 131 -49 -84 129 -30 -149 113 14 -86 23 87 -88 3 60 -67 -43 65 -30 -31 102 1 -94 80 12
7859 12 -138 4 65 -112 -12 107 -98 -2 184 -41 -2 127 -9 -77 95 78 -87 24 99 17 16 50 -120 -67
7883 -67 97 -7 -100 121 -53 -128 -8 46 -97 -30 64 -68 -32 127 -12 -84 87 39 -56 42 64 -114 34 50
7907 50 -103 -28 141 -17 -84 105 -4 -74 87 54 -92 39 64 -88 15 65 -49 -21 89 -82 -44 110 -7
7930 -7 -137 53 2 -44 72 63 -90 24 73 -38 -47 110 -12 -84 95 3 -94 52 46 -31 23 74 -118 32 112 -51
7956 -51 -28 70 -6 -106 83 63 -88 59 54 -85 77 68 -70 -34 161 -48 -89 62 -25 -114 77 34 -118 -1 57
7981 57 -108 -40 135 -119 23 145 -56 -120 94 -14 -81 89 95 -100 60 120 -38 12 85 -70 -15 167 17
8004 17 -119 62 -3 -79 46 76 -83 15 89 -106 -75 61 -115 -78 113 11 -74 28 16 -170 76 86 -134 9
8028 9 97 -28 -4 186 -28 -46 126 10 -61 102 89 -101 57 52 -65 18 55 -75 -43 69 -8 -69 119 -5 -105
8053 -105 46 32 -27 25 97 -83 -58 107 -34 -109 74 -16 -94 80 20 -101 32 55 -93 8 48 -68 -41 130
8077 130 -29 -72 94 -2 -71 135 25 -82 48 77 -99 -43 153 -55 -94 90 -2 -87 118 13 -93 56 31
8100 31 -70 -16 84 -125 -84 138 -64 -143 24 4 -87 56 69 -128 71 105 -100 35 102 -70 -7 81 -24 -75
8124 -75 73 14 -58 37 31 -82 66 59 -107 12 67 -67 -45 73 -64 -146 102 20 -122 26 51 -90 -18 47 -113
8149 -113 -2 56 -56 -31 93 -39 -47 101 52 -87 69 42 -60 18 140 -55 -41 95 -7 10 69 19 -96 55
8173 55 58 -159 11 66 -139 -42 156 -43 -47 97 -46 -75 88 -5 -23 47 10 -60
8191f0
##END NTUPLES=NMR FID
##END=
