##TITLE=1H_AM_NVHEXYNE
 
 8 sc, 
 24.3.2023
##JCAMPDX= 6.0         $$ Bruker NMR JCAMP-DX V2.0
##DATA TYPE= NMR FID
##DATA CLASS= NTUPLES
##ORIGIN= UXNMR, Bruker Analytische Messtechnik GmbH
##OWNER= root
$$ XWIN-NMR		Version 3.5
$$ Fri Mar 24 13:56:42 2023 Russian Standard Time (UT+4h)  she@DPX200
##.OBSERVE FREQUENCY= 200.13135
##.OBSERVE NUCLEUS= ^1H
##.DELAY= (6, 6)
##.ACQUISITION MODE= SIMULTANEOUS
##.ACQUISITION SCHEME= undefined
##.AVERAGES= 8
##.DIGITISER RES= 18
##SPECTROMETER/DATA SYSTEM= spect
##.PULSE SEQUENCE= zg30
##.SOLVENT NAME= DMSO
##.SHIFT REFERENCE= (INTERNAL, DMSO, 0, 15.7039)
##AUDIT TRAIL= $$ (NUMBER, WHEN, WHO, WHERE, WHAT)
$$ ##TITLE= Audit trail, XWIN-NMR		Version 3.5
$$ ##JCAMPDX= 5.01
$$ ##ORIGIN= Bruker BioSpin GmbH
$$ ##OWNER= she
$$ F:/spectra/data/she/nmr/H-F/1/audita.txt
$$ ##AUDIT TRAIL=  $$ (NUMBER, WHEN, WHO, WHERE, WHAT)
(   1,<2023-03-24 13:55:18.54 +0400>,<she>,<DPX200>,
      <created by zg, POWCHK disabled, PULCHK disabled
       configuration hash MD5:
       00 E9 B6 7A A2 85 ED C7 34 08 36 98 17 FE 4E 26
       data hash MD5: 16K
       F3 2D 17 A8 6E 47 89 46 42 AD 6B E5 67 4B 8A 51>)
$$ ##END=
$$ 
$$ hash MD5
$$ 92 81 E3 B0 47 EC 5F C4 16 54 DE 1D 13 C2 39 4C
##$RELAX= 
##$RELAX= 
##$RELAX= 
##$RELAX= 
##$RELAX= 
##$RELAX= 
$$ Bruker specific parameters
$$ --------------------------
##$DU= <F:/spectra>
##$EXPNO= 1
##$NAME= <H-F>
##$PROCNO= 1
##$TYPE= <nmr>
##$USER= <she>
##$AMP= (0..31)
100 100 100 100 100 100 100 100 100 100 100 100 100 100 100 100 100 100 
100 100 100 100 100 100 100 100 100 100 100 100 100 100 
##$AQSEQ= 0
##$AQ_mod= 1
##$AUNM= <au_zg>
##$AUTOPOS= <>
##$BF1= 200.13
##$BF2= 200.13
##$BF3= 200.13
##$BF4= 200.13
##$BF5= 200.13
##$BF6= 200.13
##$BF7= 200.13
##$BF8= 200.13
##$BYTORDA= 1
##$CFDGTYP= 0
##$CFRGTYP= 5
##$CHEMSTR= <none>
##$CNST= (0..31)
1 1 145 1 1 1 1 1 1 1 1 1 1 1 1 1 1 1 1 1 1 1 1 1 1 1 1 1 1 1 1 1 
##$CPDPRG= <>
##$CPDPRG1= <>
##$CPDPRG2= <>
##$CPDPRG3= <>
##$CPDPRG4= <mlev>
##$CPDPRG5= <mlev>
##$CPDPRG6= <mlev>
##$CPDPRG7= <mlev>
##$CPDPRG8= <mlev>
##$CPDPRGB= <>
##$CPDPRGT= <>
##$D= (0..31)
0 1.2 0 0 0 0 0 0 0 0.06 0 0.03 0 0 0 0 0.0002 0 0 0 0 0 0 0 0 0 0 0 0 
0 0 0 
##$DATE= 1679651718
##$DBL= (0..7)
120 120 120 120 120 120 120 120 
##$DBP= (0..7)
150 150 150 150 150 150 150 150 
##$DBP07= 0
##$DBPNAM0= <>
##$DBPNAM1= <>
##$DBPNAM2= <>
##$DBPNAM3= <>
##$DBPNAM4= <>
##$DBPNAM5= <>
##$DBPNAM6= <>
##$DBPNAM7= <>
##$DBPOAL= (0..7)
0.5 0.5 0.5 0.5 0.5 0.5 0.5 0.5 
##$DBPOFFS= (0..7)
0 0 0 0 0 0 0 0 
##$DE= 6
##$DECBNUC= <off>
##$DECIM= 32
##$DECNUC= <off>
##$DECSTAT= 4
##$DIGMOD= 1
##$DIGTYP= 9
##$DL= (0..7)
0 120 120 120 120 120 120 120 
##$DP= (0..7)
150 150 150 150 150 150 150 150 
##$DP07= 0
##$DPNAME0= <>
##$DPNAME1= <>
##$DPNAME2= <>
##$DPNAME3= <>
##$DPNAME4= <>
##$DPNAME5= <>
##$DPNAME6= <>
##$DPNAME7= <>
##$DPOAL= (0..7)
0.5 0.5 0.5 0.5 0.5 0.5 0.5 0.5 
##$DPOFFS= (0..7)
0 0 0 0 0 0 0 0 
##$DQDMODE= 0
##$DR= 18
##$DS= 0
##$DSLIST= <SSSSSSSSSSSSSSS>
$$ [...]
##$SUBNAM2= <"">
##$SUBNAM3= <"">
##$SUBNAM4= <"">
##$SUBNAM5= <"">
##$SUBNAM6= <"">
##$SUBNAM7= <"">
##$SUBNAM8= <"">
##$SUBNAM9= <"">
##$SW= 18.05172834244
##$SWIBOX= (0..15)
0 0 2 0 0 0 0 0 0 0 0 0 0 0 0 0 
##$SW_h= 3612.71676300578
##$TD= 16384
##$TD0= 1
##$TE= 0
##$TE2= 300
##$TE3= 300
##$TEG= 300
##$TL= (0..7)
0 120 120 120 120 120 120 120 
##$TP= (0..7)
150 150 150 150 150 150 150 150 
##$TP07= 0
##$TPNAME0= <>
##$TPNAME1= <>
##$TPNAME2= <>
##$TPNAME3= <>
##$TPNAME4= <>
##$TPNAME5= <>
##$TPNAME6= <>
##$TPNAME7= <>
##$TPOAL= (0..7)
0.5 0.5 0.5 0.5 0.5 0.5 0.5 0.5 
##$TPOFFS= (0..7)
0 0 0 0 0 0 0 0 
##$TUNHIN= 0
##$TUNHOUT= 0
##$TUNXOUT= 0
##$USERA1= <user>
##$USERA2= <user>
##$USERA3= <user>
##$USERA4= <user>
##$USERA5= <user>
##$V9= 5
##$VALIST= <valist>
##$VCLIST= <CCCCCCCCCCCCCCC>
##$VD= 0
##$VDLIST= <DDDDDDDDDDDDDDD>
##$VPLIST= <PPPPPPPPPPPPPPP>
##$VTLIST= <TTTTTTTTTTTTTTT>
##$WBST= 1024
##$WBSW= 4
##$XGAIN= (0..3)
0 0 0 0 
##$XL= 0
##$YL= 0
##$YMAX_a= 220436
##$YMIN_a= -245603
##$ZGOPTNS= <>
##$ZL1= 120
##$ZL2= 120
##$ZL3= 120
##$ZL4= 120
##$ABSF1= 10
##$ABSF2= 0
##$ABSG= 5
##$ABSL= 3
##$ALPHA= 0
##$AQORDER= 0
##$ASSFAC= 0
##$ASSFACI= 0
##$ASSFACX= 0
##$ASSWID= 0
##$AUNMP= <proc_1d>
##$AZFE= 0.1
##$AZFW= 0.1
##$BCFW= 1
##$BC_mod= 2
##$BYTORDP= 1
##$COROFFS= 0
##$CY= 11.3945322036743
##$DATMOD= 1
##$DC= 2
##$DFILT= <>
##$DTYPP= 0
##$F1P= 2.36226072786647
##$F2P= -0.459571619588291
##$FCOR= 0.5
##$FTSIZE= 0
##$FT_mod= 4
##$GAMMA= 1
##$GB= 0.15
##$INTBC= 1
##$INTSCL= 1
##$ISEN= 128
##$LB= 0.24
##$LEV0= 0
##$LPBIN= 0
##$MAXI= 10000
##$MC2= 0
##$MEAN= 0
##$ME_mod= 0
##$MI= 1.114404
##$NCOEF= 0
##$NC_proc= 0
##$NLEV= 6
##$NOISF1= 3.799351
##$NOISF2= 2.8
##$NSP= 1
##$NTH_PI= 0
##$NZP= 0
##$OFFSET= 15.70392
##$PC= 1
##$PHC0= -19185.57
##$PHC1= 12.00076
##$PH_mod= 1
##$PKNL= yes
##$PPARMOD= 0
##$PSCAL= 0
##$PSIGN= 0
##$REVERSE= no
##$SF= 200.130013532006
##$SI= 16384
##$SIGF1= 3
##$SIGF2= 2
##$SINO= 400
##$SIOLD= 16384
##$SREGLST= <1H.CDCl3>
##$SSB= 0
##$STSI= 0
##$STSR= 0
##$SW_p= 3612.71676300578
##$SYMM= 0
##$S_DEV= 0
##$TDeff= 0
##$TDoff= 0
##$TI= <>
##$TILT= no
##$TM1= 0
##$TM2= 0
##$TOPLEV= 0
##$USERP1= <user>
##$USERP2= <user>
##$USERP3= <user>
##$USERP4= <user>
##$USERP5= <user>
##$WDW= 1
##$XDIM= 8192
##$YMAX_p= 0
##$YMIN_p= 0
$$ End of Bruker specific parameters
$$ ---------------------------------
##NTUPLES= NMR FID
##VAR_NAME=  TIME,          FID/REAL,        FID/IMAG
##SYMBOL=    X,             R,               I
##VAR_TYPE=  INDEPENDENT,   DEPENDENT,       DEPENDENT
##VAR_FORM=  AFFN,          ASDF,            ASDF
##VAR_DIM=   8192,          8192,            8192
##UNITS=     SECONDS,       ARBITRARY UNITS, ARBITRARY UNITS
##FACTOR=    0.0002768,     1,               1
##FIRST=     0,             0,               0
##LAST=      2.2672688,     0,               0
##MIN=       0,             -245603,         0
##MAX=       2.2672688,     220436,          0
$$ Real data points
##PAGE= N=1
##DATA TABLE= (X++(R..R)), XYDATA
$$ plain form
0 0 0 0 0 0 0 0 0 0 0 0 0 0 0 0 0 0 0 0 4 -8 8 -8 8 -8 8 -8 13 -16 16 -16 20 -23 24 -28 29 -36 37 -44 44 -51 54
41 54 -60 66 -73 80 -87 95 -104 116 -126 138 -153 170 -188 212 -238 269 -306 352 -412 488 -592
62 -592 733 -941 1260 -1790 2782 -4959 11496 -64944 -245603 162126 128429 -217684 28167
75 28167 144993 -100851 -33673 72020 -27503 -2747 11272 -30209 31457 12318 -42799 13579
87 13579 18936 -4292 -8108 -28546 44555 30691 -102439 32385 114975 -125614 -43724 169688
99 169688 -74858 -114987 152670 -6514 -128304 104884 22898 -108807 78708 26448 -102714
110 -102714 67788 45833 -103916 31716 74364 -69009 -26460 59384 6678 -44071 -14670
121 -14670 57258 11169 -86483 30835 87848 -89148 -37286 111419 -36785 -70414 75445
$$ packed form
0@%%%%%%%%%%%%%%%%%%Mj2J6j6J6j6J6j6K1k9L2l2L6m3M7n2N7o5P3q1Q8r5J05
41E4j14J26j39J53j67J82j99K20k42K64k91L23l58M00m50N07n75O58p64R00j080
62e92J325j674K201l050M572p741J6455p6440j80659M07729l3697l46113K45851
75B8167J16826k45844O7178J05693r9523K4756J4019m1481O1666j9139n5117N6378
87A3579N357k3228l816k0438P3101j3864j33130J34824Q2590k40589Q1890K13412
99A69688k44546m0129K67657j59184j21790K33188q1986j31705J87515n2260j29162
110a02714J70502k1955j49749J35632M2648j43373M2549Q5844n2706n0749K9401
121a4670P1928m6089r7652J17318N7013j76996N1862J48705j48204l3629J45859
$$ plain form
132 75445 -3465 -46219 46839 -22987 -21638 67993 -48986 -46647 102543 -24646 -94702 88804
144 88804 36209 -101295 23878 67492 -46299 -28943 34248 17715 -21691 -27185 33013 26243
156 26243 -56572 2713 59541 -42106 -26427 55738 -21020 -26992 42644 -21459 -18856 47311
168 47311 -29294 -28103 59034 -18416 -45828 51462 4587 -45501 27197 12239 -25404 14013
180 14013 -566 -11329 20858 -11088 -16361 26853 -3601 -20933 14586 4356 -5050 -242 -11093
193 -11093 17667 10086 -40388 16242 42703 -50061 -15489 63750 -24084 -46059 48139 11991
205 11991 -43252 12298 21141 -13347 -5443 137 8386 7409 -21663 1215 27728 -18071 -18397 26918
219 26918 1916 -21030 6874 9371 -2684 -5920 -4981 14528 2583 -24485 12700 21609 -29091
$$ packed form
132G5445p8910m2754R3058o9826J349Q9631j16979K339J49190j27189p0056J83506
144H8804n2595j37504J25173M3614j13791J7356O3191j6533l9406n494O0198o770
156B6243q2815N9285N6828j01647J5679Q2165p6758n972O9636o4103K603O6167
168D7311p6605J191Q7137p7450k7412R7290m6875n0088P2698j4958l7643L9417
180A4013j4579j0763L2187l1946n273M3214l0454j7332L5519j0230r406M808j0851
193a1093K8760p581n0474N6630K6461r2764L4572P9239q7834k1975R4198l6148
205A1991n5243N5550Q843l4488P904N580Q249r77k9072K2878K6513m5799l26M5315
219B6918k5002k2946K7904K497j2055l236R39J9509j1945k7068L7185Q909n0700
$$ plain form
232 -29091 -3158 31440 -18547 -15804 27527 -6472 -18503 19254 663 -16118 11641 4283
244 4283 -11879 4345 5412 -4626 -1928 1302 4637 -2006 -8348 8381 6168 -14519 2270 13729
258 13729 -10440 -6167 11650 -1308 -6161 2156 992 3388 -2480 -8333 10438 5984 -18116 3870
272 3870 18725 -14922 -11122 20501 388 -18858 7507 13423 -10677 -8520 11486 5270 -12614
285 -12614 -1684 13687 -3808 -12283 9643 6993 -12414 83 10365 -4986 -5421 5573 1444
298 1444 -3488 -724 2074 1931 -3254 -1919 5745 -795 -6690 4857 4578 -7610 -567 7725 -3008
313 -3008 -5968 5116 4031 -6436 -2322 7956 -191 -9204 4311 8423 -8966 -4540 11694 -1409
327 -1409 -10811 6617 6875 -8880 -2435 8286 -357 -6811 1385 6184 -2326 -6350 4438 5618
$$ packed form
232b9091K5933L4598m9987K743M3331l3999j2031L7757j8591j6781K7759p358
244D283j6162J6224J067j0038K698L230L335o643o342J6729k213k0687J6789J1459
258A3729k4169M273J7817j2958m853Q317j164K396n868n853J8771m454k4100K1986
272C870J4855l3647L800L1623k0113j9246K6365N916k4100K157K0006o216j7884
285a2614J0930J5371j7495q475K1926k650j9407J2497J0282j5351m35J0994m129
298A444m932K764K798j43n185J335P664o540n895J1547k79j2188P043Q292j0733
313c008k960J1084j085j0467M114J0278q147r013J3515M112j7389M426J6234j3103
327a409r402J7428K58j5755O445J0721q643o454Q196M799q510m024J0788J180
$$ plain form
341 5618 -7273 -2832 8870 -1291 -7936 4652 5016 -5741 -2154 5059 806 -4384 -481 4975
355 4975 -620 -6001 3521 5422 -7070 -2014 8733 -3002 -6800 6787 2292 -7194 1939 4730
369 4730 -3593 -1979 2857 1109 -1981 -1910 2920 2073 -5259 292 6492 -4560 -4505 7911 -253 -7777
385 -7777 4821 4322 -6317 -391 4670 -1196 -2569 232 2723 629 -5099 1375 6785 -6037 -4748
400 -4748 10028 -918 -9757 6660 5083 -8480 382 5890 -2541 -2338 732 1849 1618 -4997 -376
415 -376 8111 -4852 -6797 10038 644 -10445 6023 5407 -8098 733 4736 -2826 -189 -171 -422
430 -422 3900 -3705 -3037 7999 -2852 -7086 8832 348 -8984 6877 2558 -8225 5003 2595
444 2595 -6996 4673 2123 -6724 4438 2072 -6002 4046 1124 -4950 4895 -635 -5294 7087
$$ packed form
341E618j2891M441J1702j0161o645J2588L64j0757L587P213m253n190L903N456
355D975n595n381R522J901j2492N056J0747j1735l798J3587m495r486R133K791
369D730q323J614M836j748l090P1M830q47p332N551O200j1052N5J2416q164p524
385g777J2598m99j0639N926N061n866j373K801K491k094n728O474N410j2822J289
400d748J4776j0946q839J6417j577j3563Q862N508q431K03L070J117k31o615M621
415c76Q487j2963j945J6835r394j1089J6468o16j3505Q831M003p562K637J8k51
430d22M322p605O68J1036j0851m234J5918q484r332J5861m319j0783J3228k408
444B595r591J1669k550q847J1162k366q074J0048k922o074R845n530m659J2381
$$ plain form
458 7087 -1108 -7556 8390 1005 -9417 6390 3222 -7425 3611 1318 -3691 5025 -3528 -3872
472 -3872 10655 -5363 -9453 14832 -773 -15567 12069 6430 -15131 4711 8406 -8493 658
485 658 3297 -3077 3673 -2729 -3912 9578 -3527 -9113 11323 692 -11254 7744 3045 -7875
499 -7875 5036 -184 -4477 7727 -4605 -6065 13035 -4581 -11539 14638 164 -14442 11193
512 11193 3715 -12393 7797 2866 -9688 7807 1074 -9462 8908 1266 -10248 7876 2310
525 2310 -8503 5887 457 -5202 7092 -3847 -5131 11644 -5510 -9133 14696 -2505 -13045
538 -13045 12773 1746 -12171 8366 1850 -7726 7452 -2474 -6054 11402 -4967 -9511 14786
551 14786 -2052 -13667 12604 2740 -12556 7335 2926 -7101 5830 -2168 -4474 10102 -5734
$$ packed form
458G087q195o448J5946p385j0422J5807l168j0647J1036k293n009Q716q553l44
472c872J4527j6018m090K4285j5605j4794K7636n639k1561J9842L695j6899R151
485F58K639o374O750o402j183J3490j3105n586K0436j0631j1946J8998m699j0920
499g875J2911n220m293J2204j2332j460J9100j7616o958K6177j4474j4606K5635
512A1193p478j6108K0190m931j2554J7495o733j0536J8370p642j1514J8124n566
525B310j0813J4390n430n659J2294j0939j284J6775j7154l623K3829j7201j0540
538a3045K5818j1027j3917K0537o516r576J5178r926l580J7456j6369m544K4297
551A4786j6838j1615K6271r864j5296J9891m409j0027J2931p998k306J4576j5836
$$ plain form
564 -5734 -7688 14387 -3591 -12243 13233 966 -12190 8830 2002 -8084 6851 -1428 -5481
577 -5481 9271 -4380 -6899 12214 -3670 -9519 11828 -1422 -9330 9689 -1405 -7021 9420
590 9420 -3919 -6359 11993 -5189 -8901 14040 -2854 -11664 12266 430 -10865 8812 803
603 803 -7736 7580 -1527 -6249 9146 -2807 -7530 10096 -1179 -8349 7866 25 -5854 5765
617 5765 -2189 -2708 7127 -6035 -2830 11085 -7385 -6345 13697 -4710 -9676 12188 -1327 -9467
631 -9467 9290 -507 -7390 8049 -1691 -6311 8661 -2372 -7060 9146 -971 -7703 7139
644 7139 368 -5685 4882 -889 -2761 4944 -3844 -1642 7297 -5846 -3167 9717 -5112 -5467
658 -5467 9621 -3297 -5830 8492 -2768 -5370 8203 -2847 -5579 8392 -2277 -6412 7950
$$ packed form
564e734j954K2075j7978q652K5476j2267j3156K1020o828j0086J4935q279m053
577e481J4752j3651k519J9113j5884n849K1347j3250p908J9019j1094n616J6441
590I420j3339k440J8352j7182l712K2941j6894q810K3930j1836j1295J9677q009
603H03q539J5316r107m722J5395j1953m723J7626j1275p170J6215p841n879J1619
617E765p954n19R835j3162L205J3915j8470J040K0042j8407m966K1864j3515q140
631i467J8757r797o883J5439r740m620J4972j1033m688J6206j0117o732J4842
644G139o771o053J0567n771j872P705q788K202Q939j3143K679J2884j4829l55
658e467J5088j2918k533J4322j1260k602J3573j1050k732J3971j0669m135J4362
$$ plain form
671 7950 -630 -6645 5893 514 -4941 3992 -238 -2868 3707 -1884 -1786 4516 -3245 -1867 5744
686 5744 -3520 -2663 6088 -3182 -2883 6104 -3253 -3030 6515 -3208 -3714 6848 -2601 -4631 6716 -1209
702 -1209 -5224 5350 112 -4494 3678 279 -3126 2816 -357 -2052 2607 -1140 -1396 2897 -1710
717 -1710 -1224 3083 -2085 -1012 3403 -2581 -1089 4055 -2801 -1709 4608 -2499 -2550 4877 -1630 -3419
733 -3419 4424 -404 -3697 3356 547 -3213 2160 804 -2295 1348 470 -1398 1149 -78 -950 1222
749 1222 -444 -736 1240 -697 -439 1316 -1159 -254 1739 -1639 -499 2444 -1708 -1247 2949 -1137
765 -1137 -2148 2777 -67 -2481 1934 676 -2138 1095 849 -1547 638 659 -1116 560 469 -1034
781 -1034 478 558 -844 152 459 -388 76 33 -124 389 -378 -281 896 -420 -855 1136 130 -1252 748
$$ packed form
671G950q580o015J2538n379n455Q933m230k630O575n591R8O302p761J378P611
686E744r264Q57Q751r270K99Q987r357K23R545r723n06J0562r449k030J1347p925
702a209m015J0574n238m606Q172l399l405N942l173j695M659l747k56M293m607
717a710M86M307n168J073M415n984J492N144o856J092O317p107n1P427o507j789
733c419P843m828l293P053k809l760N373j356l099L643q78j868K547j227q72K172
749A222j666k92J976j937K58J755k475R05J993l378J140K943m152M61M196m086
765a137j011M925k844k414M415j258k814L233k46k396K185K1j775J676r1j503
781a034J512Q0j402R96L07q47M64m3j57N13p67R7J177j316m35J991j006j382K000
$$ plain form
800 748 583 -1095 341 629 -850 166 542 -641 185 399 -662 250 489 -685 99 493 -497 114
818 114 330 -520 271 322 -643 332 384 -821 339 666 -940 52 883 -740 -186 847 -579 -308 855
837 855 -406 -477 741 -151 -573 562 110 -609 184 446 -284 -403 346 408 -592 -240 881 -288 -870
856 -870 940 353 -1240 458 924 -994 -136 954 -573 -351 784 -288 -450 620 -119 -472 561
873 561 7 -678 510 453 -918 20 1050 -679 -752 1264 -2 -1436 947 941 -1624 17 1579 -965
891 -965 -868 1357 -25 -1144 621 624 -755 -242 674 75 -657 114 658 -498 -403 817 -208 -650 798
910 798 -70 -697 818 -181 -766 1191 -292 -1301 1626 140 -2052 1567 1001 -2456 831 1836 -2077
927 -2077 -284 1869 -873 -778 830 48 -111 -384 -36 1105 -909 -971 2049 -431 -2038 2068 441
$$ packed form
800G48j65j678J436K88j479J016L76j183Q26K14j061R12K39j174P84L94r90O11
818A14K16q50P91N1r65R75N2j205J160L27j606R92Q31j623N54J033j426K71J163
837H55j261p1J218q92m22J135m52p19P93K62p30j19P49O2j000L52J121j169n82
856h70J810n87j593J698M66j918Q58J090j527K22J135j072j62J070p39l53J033
873E61n54o85J188n7j371R38J030j729p3K016j266j434K383ok565J641J562k544
891i65R7K225j382j119J765Lj379N13R16n99p32P71N44j156R5J220j025m42J448
910G98q68o27J515r99n85J957j483j009K927j486k192L619n66l457L287J005l913
927b077J793K153k742R5J608p82j59k73L48J141k014o2L020k480j607M106j627
$$ plain form
944 441 -2323 1502 786 -2024 1228 593 -1774 1444 259 -1988 1947 383 -2633 2011 1062 -2937
960 -2937 1455 1553 -2642 855 1585 -2040 435 1114 -1329 568 239 -968 1311 -649 -1199 2514 -1108
977 -1108 -2349 3670 -377 -3913 3581 1254 -4457 2210 2268 -3519 910 1775 -2100 1012 302 -1808
993 -1808 2444 -286 -3119 3258 860 -4161 2290 2207 -3439 569 1893 -1356 203 -384 -115 2293
1009 2293 -2494 -1528 4945 -2063 -4305 5632 307 -5895 4043 2355 -5233 2038 2492 -3690 1473
1024 1473 1554 -3067 1866 1198 -3120 1792 1262 -2699 1422 779 -1906 1667 -290 -1668 2678 -983
1040 -983 -2326 3505 -774 -2909 3565 -689 -2811 3854 -1315 -3129 5146 -1470 -4909 6276 302
1055 302 -7241 5143 3640 -7374 1351 5399 -3957 -1951 3183 343 -1400 -1281 1491 2402 -3650
$$ packed form
944D41k764L825p16k810L252o35k367L218j185k247L935j564l016M644r49l999
960b937M392R8m195L497P30l625K475O79k443J897l29j207K279j960n50L713l622
977a108j241O019m047l536P494k327n711O667N8n787M429Q65l875L112p10k110
993a808M252k730k833O377k398n021O451q3n646M008J324l249J559n87K69K408
1009B293m787R66O473p008k242R937n325o202R938j688p588P271M54o182N163
1024A473Q1m621M933o68m318M912n30l961M121o43k685L573j957j378M346l661
1040i83j343N831m279k135O474m254k122O665n169j814Q275o616l439J1185n974
1055C02p543J2384j503j1014Q725M048r356K006N134k840j743J19K772R11o052
$$ plain form
1070 -3650 -1167 5306 -2130 -4018 4603 344 -3686 2460 28 -1525 2768 -2477 -1457 5658 -3348
1085 -3348 -4566 7714 -611 -7828 6026 3424 -7684 1980 4910 -4505 -711 3257 -1414 -735
1099 -735 709 -191 588 -884 -142 1593 -1842 87 2646 -3312 -243 4855 -4175 -2431 6936 -2718
1115 -2718 -5312 6641 329 -6175 4044 1994 -4338 2140 832 -2666 3060 -504 -3765 4390
1129 4390 1012 -5724 2657 4067 -4487 -1560 4189 449 -3672 -562 4520 -167 -6113 3092 5941
1144 5941 -7052 -2476 8867 -2863 -6638 6543 1597 -6002 2531 2154 -2923 1504 -85 -1899
1158 -1899 3313 -914 -3671 4084 1119 -4891 1985 3153 -3182 -866 2353 18 -1312 -515 1578
1173 1578 604 -2613 922 2466 -3042 -77 3421 -3176 -784 4501 -3405 -2326 6027 -2228 -5005
$$ packed form
1070c650K483O473p436j888Q621m259m030O146k432j553M293n245J020P115r006
1085c348j218J2280q325p217J3854k602j1108R664K930r415L794L968m671O79
1099g35J444r00P79j472P42J735l435J929K559n958L069N098r030J744R367r654
1115b718k594J1953o312o504J0219k050o332O478j308l498N726l564l261Q155
1129D390l378o736Q381J410q554K927N749l740m121L110N082m687n946R205K849
1144E941j2993M576J1343j1730l775J3181m946p599Q533l77n077M427j589j814
1158a899N212m227k757P755k965o010O876J168o335K316L219k335j330P97K093
1173A578r74l217L535J544n508K965L498o597K392N285p906J079Q353q255k777
$$ plain form
1188 -5005 6014 1049 -6595 2963 4132 -4608 -1031 3717 -440 -2124 64 1753 632 -2703 -67
1203 -67 3568 -1568 -3053 2871 1509 -2690 -424 1690 890 -1475 -2019 3056 1916 -5421 560 6425
1219 6425 -4375 -4552 7115 539 -6985 3214 4315 -4722 -1138 3915 -647 -2323 748 1503 -377
1234 -377 -1664 678 1713 -1606 -827 2052 -675 -1216 1523 -402 -902 1388 -645 -808 1665 -735
1250 -735 -1112 1761 -529 -1106 1726 -776 -1139 2346 -901 -2202 2940 355 -3518 1889 2458 -3186
1266 -3186 -819 3224 -346 -2808 852 2723 -1418 -2907 2654 2419 -4182 -685 4904 -1780 -4039
1281 -4039 3686 1924 -4058 100 3100 -967 -1905 733 1606 -414 -2121 992 2528 -2345 -1865 3529
1297 3529 232 -3599 1492 2568 -2300 -1245 2192 484 -1868 -260 1991 -74 -2395 1074 2284
$$ packed form
1188e005J1019m965p644R558J169q740L577M748m157j684K188J689j121l335K636
1203f7L635n136j485N924j362m199K266K114q00k365n44N075j140p337N981N865
1219F425j0800j77J1667o576p524J0199J101r037L584N053m562j676L071P55j880
1234c77j287K342J035l319P79K879k727n41K739j925n00K290k033j63K473k400
1250g35l77K873k290n77K832k502l63L485l247j301N142k585l873N407N69n644
1266c186K367M043l570k462L660J871m141j489N561k35o601L497N589o684k259
1281d039P725j762n982M158L000m067r38K638Q73k020j707L113J536m873M80N394
1297C529l297l831N091J076m868J055L437j708k352J608K251k065k321L469J210
$$ plain form
1312 2284 -2448 -1086 3215 -861 -2614 2424 894 -2717 817 1784 -1565 -583 1327 38 -873 -134
1328 -134 970 180 -1537 532 1789 -1744 -1069 2628 -384 -2458 1710 1422 -2131 -346 1864 -105
1344 -105 -1593 187 1854 -544 -2297 1658 2105 -3055 -816 3753 -1093 -3168 2560 1690 -2934 -315
1360 -315 2431 -308 -1957 344 2032 -659 -2349 1632 2119 -2858 -899 3443 -835 -2881 2159
1375 2159 1604 -2456 -437 2119 -70 -1853 304 1998 -877 -2073 2012 1343 -2982 248 2924
1390 2924 -1916 -1631 2631 -27 -2085 1019 1014 -1019 -420 613 573 -710 -851 1461 382 -2177 893
1407 893 1987 -2193 -751 2607 -674 -2007 1447 1152 -1417 -793 1336 932 -1837 -727 2779 -413
1423 -413 -3139 2263 2188 -3623 -179 3571 -1687 -2238 2384 712 -1932 -58 1282 217 -1366 -288
$$ packed form
1312B284m732J362M301m076j753N038j530l611L534R67l349R82J910j289r11P39
1328a34J104p90j717K069J257l533O75L697l012k074M168k88l553J785K210j969
1344a05j488J780J667k398j753L955M47n160K239M569m846k075N728q70m624K619
1360c15K746k739j649K301J688k691j690L981M87m977J959M342m278k046N040
1375B159n55m060K019K556k189j783K157J694k875j196M085o69m325L230K676
1390B924m840K85M262k658k058L104nk033N99J033m0j283j41K312j079k559L070
1407H93J094m180J442L358l281j333L454k95k569O24K129m04k769J110L506l192
1423d13k726N402p5n811L444L750n258n51M622j672k644J874J340j065j583J078
$$ plain form
1439 -288 2026 -500 -2306 1882 1468 -2766 131 2411 -1368 -1189 1452 235 -776 -281 472 872
1455 872 -1186 -784 2297 -561 -2459 2434 1024 -3344 1292 2477 -2900 -450 2886 -1223 -1668 1629
1471 1629 616 -1147 -512 957 903 -1685 -653 2679 -721 -2770 2427 1426 -3164 429 2382 -1429
1487 -1429 -991 1048 377 -147 -1111 169 2179 -1636 -2089 3501 281 -4067 2207 2719 -3637 -413
1503 -413 3239 -1215 -1780 1370 799 -756 -917 691 1373 -1598 -915 2534 -699 -2164 2298 368
1519 368 -2430 1616 861 -2157 1070 934 -1727 760 693 -1258 750 146 -1021 1354 -356 -1605
1535 -1605 2136 140 -2705 1861 1567 -2841 253 2326 -1238 -1233 1054 934 -630 -1574 1275 2093 -2923
1552 -2923 -1107 4287 -1317 -3886 3672 1691 -4280 852 3007 -1967 -1125 1319 395 -145 -1144 85
$$ packed form
1439b88K314k526j806M188m14m234K897K280l779J79K641j217j011M95P53M00
1455H72k058M02L081k858j898M893j410m368M636J185n377K450L336m109m45L297
1471A629j013j763O35J469n4k588J032L332l400k049N197j001m590L593J953l811
1487a429M38K039o71n24r64J280K010l815m53N590l220m348O274N12o356L224
1503d13L652m454n65L150n71j555j61J608O82k971O83L449l233j465M462j930
1519C68k798M046p55l018L227j36k661K487o7j951K008o04j167K375j710j249
1535a605L741j996k845M566k94m408L094K073l564NK287j20j564r44K849Q18n016
1552b923J816N394n604k569P558j981n971N132K155m974Q42K444r24n40r99J229
$$ plain form
1568 85 2174 -1416 -2013 2920 398 -3123 1387 1847 -1977 -338 1169 -85 -207 -661 336 1311 -1531
1585 -1531 -671 2453 -1059 -1797 2510 -202 -2195 2077 270 -2238 1801 668 -2389 1268 1318 -2021
1601 -2021 218 1376 -792 -398 196 344 452 -1310 -12 2163 -1438 -1753 2732 207 -2690 1263
1617 1263 1492 -1468 -378 535 507 147 -1698 581 2564 -2464 -1792 4047 -406 -3951 2631 2274 -3406
1634 -3406 -240 2668 -765 -1504 613 1110 -190 -1523 527 1809 -1550 -1153 2233 -209 -1780 1209
1650 1209 455 -1009 527 -157 -254 1005 -959 -615 1833 -802 -1430 1924 -76 -1690 1416 234
1666 234 -1484 1213 242 -1508 1184 589 -1674 618 1161 -1125 -424 915 310 -715 -652 1193 660
1683 660 -2088 304 2467 -1787 -1646 2768 15 -2484 1277 1275 -1380 -202 548 168 162 -1001 133
$$ packed form
1568H5K089l590n97M933k522l521M510M60l824J639J507j254j22m54R97R75k842
1585a531Q60L124l512p38M307k712j993M272j807k508M039j133l057L657N0l339
1601b021K239J158k168L94N94J48J08j762J298K175l601l15M485k525k897L953
1617A263K29k960J090R13k8l60j845K279J983n028O72N839m453l545O582l57n680
1634c406L166K908l433p39K117M97j300j333K050J282l359L97L386k442j571K989
1650A209p54j464J536o84r7J259j964L44K448k635o28L354k000j614L106j182
1666B34j718K697r71j750K692n95k263K292N43k286P01J339o05j025O3J845n33
1683F60k748K392K163m254J41M414k753k499L761kk655J178P50l80oj163J134
$$ plain form
1700 133 1693 -1266 -1395 2302 173 -2384 1081 1599 -1540 -672 1284 296 -955 -388 1144 356 -1623
1717 -1623 356 1717 -1399 -923 1978 -376 -1438 1286 212 -1133 799 143 -810 767 35 -837
1733 -837 733 163 -792 487 196 -464 315 -139 -209 609 -417 -456 900 -166 -775 600 234 -456 82
1752 82 -27 275 161 -920 437 1124 -1415 -430 1984 -750 -1593 1672 528 -1715 462 1099 -723
1769 -723 -470 430 338 -178 -625 397 792 -909 -428 1218 -263 -942 711 368 -595 -29 175 175 -71
1788 -71 -577 490 613 -1088 -4 1230 -863 -636 1278 -318 -879 939 31 -768 589 127 -529
1805 -529 404 85 -352 253 12 -118 172 -221 92 323 -493 26 589 -521 -180 669 -347 -303 450 -187
1825 -187 -71 219 -422 295 412 -879 216 941 -993 -305 1297 -577 -865 1045 116 -861 338 385
$$ packed form
1700A33J560k959j29L697k129k557L465N18l139Q68J956r88j251N67J532p88j979
1717a623J979J361l116M76K901k354j062K724j074j345J932o56r53J577p32q72
1733h37J570n70r55J279k91o60P79m54p0Q18j026l9J356j066o09J375l66o90N38
1752H2j09L02j14j081J357O87k539R85K414k734q43L265j144k243K177O37j822
1769g23K53R00r2n16m47J022L95j701M81J646j481o79J653l43r63N66K04%k46
1788g1n06J067J23j701J084J234k093K27J914j596n61J818r08p99J357m62o56
1805e29R33l19m37O05k41j30K90l93L13K31q16N19N63j110L41Q49j016M4P53o37
1825a87J16K90o41P17J17j291J095P25j934O88J602j874k88J910r29r77J199M7
$$ plain form
1843 385 -258 -112 6 302 36 -540 363 468 -743 37 696 -501 -184 505 -294 -16 268 -433 240
1862 240 323 -711 314 587 -894 88 852 -780 -210 861 -496 -333 681 -291 -292 461 -193 -117 279
1881 279 -237 60 216 -351 227 198 -533 360 330 -725 309 538 -752 147 604 -622 49 502 -542
1900 -542 137 389 -616 289 473 -816 211 694 -802 -53 749 -515 -205 513 -272 -70 190 -265
1918 -265 261 75 -508 480 193 -753 458 387 -788 345 467 -733 277 453 -687 302 417 -757
1936 -757 329 493 -815 231 602 -723 85 558 -566 46 437 -476 113 295 -464 221 247 -496 273
1955 273 196 -495 385 97 -605 560 143 -810 604 331 -933 480 518 -902 293 551 -732 217
1973 217 444 -632 268 372 -626 273 362 -613 255 345 -558 225 261 -453 295 96 -467 496 20 -642 620
$$ packed form
1843C85o43J46J18K96k66n76R03J05j211P80O59j197L17O89p99K78K84p01O73
1862B40Q3j034J025K73j481R82P64j632N70J071j357J63J014r72jP53o54P6L96
1881B79n16K97J56n67N78k9p31Q93l0j055J034K29j290Q99M57j226O71M53j044
1900e42O79K52j005R05J84j289J027M83j496P49Q02j264L10P18p85K02K60m55
1918b65N26j86n83R88k87r46J211p1j175J133J22j200J010J76j140R89J15j174
1936g57J086J64j308J046L71j325Q08M73j124O12L91r13N89J82p59O85K6p43P69
1955B73p7o91Q80k88p02J165m17r53J414k73j264J413L8j420J195K58j283R49
1973B17K27j076R00J04r98Q99Q9r75Q68R0r03P83L6p14P48j99n63R63m76o62J262
$$ plain form
1994 620 147 -826 583 337 -862 392 450 -723 262 345 -605 318 246 -597 375 268 -642 357 278 -593
2014 -593 324 221 -496 370 113 -525 520 91 -674 584 216 -769 508 313 -770 384 363 -678
2032 -678 284 306 -560 269 232 -500 292 182 -460 307 91 -404 372 -6 -410 484 -70 -499 607 -35
2052 -35 -675 657 120 -763 553 254 -734 434 305 -677 359 310 -620 317 323 -578 220 343 -455 107
2072 107 247 -271 114 33 -187 270 -152 -236 476 -212 -412 641 -129 -605 647 23 -698 570 156 -689
2092 -689 468 240 -637 368 259 -564 301 258 -519 231 263 -418 167 215 -321 148 122 -232 183 24 -198
2113 -198 269 -78 -242 382 -96 -351 453 -37 -449 455 55 -508 374 119 -460 325 125 -439 320 113
2133 113 -459 306 148 -436 277 179 -413 220 174 -339 197 140 -316 215 119 -310 175 125 -244 165 67 -200
$$ packed form
1994F20m73r73J409k46j199J254N8j173R85Q3r50R23p2q43R72j07r10R99p9q71
2014e93R17j03p17Q66k57o38J045m29p65J258l68r85J277j95j083J154k1j041
2032f78R62K2q66Q29l7p32P92j10o42P67k16m95P76l78m04Q94n54m29J106o42
2052c5o40J332n37q83J316k99r88J168j29r82J036m9r30R37Or01P98J23p98N62
2072A07J40n18L85q1k20M57m22q4P12o88k00J053p70m76J252o24p21J268m14q45
2092f89J157k28q77J005j09q23Q65m3p77P50L2o81N85M8n36M69k6l54M15j59k22
2113a98M67l47j64O24m78k55Q04m90m12R04m00n63Q82k55n79P85k00n64P59k07
2133A13n72P65j58n84P13r8n92O33m6n13N36n7m56N31r6m29M85n0l69M09r8k67
$$ plain form
2155 -200 160 -6 -159 236 -92 -206 363 -91 -323 381 1 -393 343 64 -400 296 92 -404 289 119
2175 119 -429 294 203 -483 188 323 -397 20 319 -202 -71 177 -43 -4 -15 -9 184 -104 -140 277 -49 -212
2197 -212 268 -45 -220 282 -72 -240 376 -77 -382 464 44 -557 364 299 -543 124 401 -348 -63 294
2217 294 -137 -74 103 -45 37 -3 -91 116 7 -107 126 -27 -82 147 -95 -78 267 -165 -183 409 -121 -377
2239 -377 430 72 -457 300 206 -420 138 214 -301 85 166 -231 80 142 -206 54 135 -117 1 32 3 74 -133
2262 -133 -15 253 -183 -165 376 -90 -310 313 63 -284 175 85 -155 136 -31 -127 242 -92 -217 337 -21
2283 -21 -347 254 146 -313 77 169 -132 -27 0 16 101 -192 -31 308 -204 -235 386 -35 -344 251 125 -244
2305 -244 84 83 -80 71 -57 -12 176 -136 -72 260 -135 -141 288 -87 -183 263 -68 -180 243 -48 -180 212
$$ packed form
2155b00L60j66j53L95l28j14N69m54k32P04l80l94P36k79m64O96k04m96O93j70
2175A19n48P23r1o86O71J35p20M17K99n21J31K48k20L9j1OJ93k88l6M17l26j63
2197b12M80l13j75N02l54j68O16m53l05Q46m20o01R21o5q42O67K77p49K85L57
2217B94m31O3J77j48Q2m0q8K07j09j14K33j53n5K29k42J7L45m32j8N92n30k56
2239c77Q07l58n29P57r4o26N58P6n15L86Q1l97L11O2l48K60Q1k52J18L1k9P1k07
2262a33J18K68m36J8N41m66k20O23k50l47M59r0k40K91j67r6L69l34j25N54l58
2283b1l26O01j08m59L90R2l01J05K7J6Q5k93J61L39n12l1O21m21l09N95j26l69
2305b44L28jj63J51j28M5J88l12O4L32l95oM29l75r6M46l31j12M23k91j32L92
$$ plain form
2327 212 -41 -157 177 -67 -101 189 -114 -91 236 -155 -140 299 -104 -223 270 5 -217 130 46 -75 24 -66
2349 -66 103 75 -268 126 317 -385 -78 486 -239 -302 410 23 -302 169 95 -82 6 -89 122 115 -318 97 363
2372 363 -363 -124 450 -190 -260 316 6 -220 111 12 -5 35 -159 123 131 -325 82 302 -348 -35 366 -248
2394 -248 -136 317 -129 -130 209 -80 -39 128 -137 67 95 -238 173 184 -409 132 370 -446 -48 501 -317 -246
2416 -246 413 -56 -264 125 57 -24 -65 -135 258 16 -408 253 302 -497 31 470 -320 -176 306 -52 -92 25
2438 25 -55 193 -47 -323 371 151 -585 275 463 -578 -42 570 -312 -246 379 -62 -179 120 -9 28 -19
2459 -19 -124 210 9 -301 267 119 -420 232 233 -454 118 327 -358 -12 273 -202 2 107 -168 192 19
2480 19 -337 355 133 -580 291 443 -586 -39 571 -269 -296 312 96 -159 -111 129 273 -316 -237 602 -79
$$ packed form
2327B12k53j16L34k44l4K90l03K3L27l91J5M39m03j19M93k65k22L47q4j21R9r0
2349f6J69k8l43L94J91p02L07N64p25o3P12l87l25M71p4j77Q8r5K11pm33M15K66
2372C63p26K39N74o40p0N76l10k26L31r9j7M0j94K82Qm56M07K20o50L13M01o14
2394b48J12M53m46jL39k89M1J67k65K04K8l33M11J1n93N41K38q16L98N49q18P1
2416b46O59m69k08L89o8q1m1p0L93k42m24O61M9p99N28M39p90J44M82l58m0J17
2438B5q0K48k40k76O94k20p36Q60J88j041N36O12q82O6O25m41j17K99j29L7m7
2459a9j05L34k01l10N68j48n39O52Jo87N72K09o85L46K85m75K04J05k75L60j73
2480A9l56O92k22p13Q71J52j029N47O10q40k7O08k16k55M8K40J44n89P9Q39o81
$$ plain form
2501 -79 -659 491 353 -691 100 509 -381 -128 284 -100 0 -4 -149 279 -33 -391 345 170 -509 196
2521 196 328 -410 17 312 -229 -23 177 -102 48 20 -91 180 -94 -165 369 -144 -354 513 3 -617 471
2542 471 316 -712 164 542 -467 -191 420 -60 -217 0 115 157 -282 -176 523 -113 -582 460 327
2561 327 -608 19 461 -179 -234 92 192 55 -379 42 605 -386 -492 773 90 -844 426 530 -663
2580 -663 -46 531 -237 -190 191 1 -1 -78 -62 229 -103 -215 293 -21 -285 266 19 -294 247 32 -327 255
2602 255 96 -319 159 121 -187 126 -47 -101 300 -197 -279 553 -51 -624 495 364 -691 26 605 -266
2622 -266 -371 268 277 -221 -330 324 378 -597 -190 802 -217 -723 571 373 -667 21 458 -172 -221 53
2642 53 163 97 -336 -50 537 -244 -483 546 186 -616 177 414 -322 -134 247 23 -87 -64 89 157 -213
$$ packed form
2501g9n80J150j38j044P91M09q90K53M12l84J00mj45M28l12l58P36j75o79P05
2521A96J32p38M27K95n41K06K00k79J50k8j11K71k74p1N34n13k10Q67n10o20J088
2542D71j55j028Q76L78j009K76O11m80j57K17J15M2m39J06O99o36m69J042j33
2561C27r35O27M42o40n5L26J00j37m34M21N63r91j06J265o83r34J270J04j193
2580f63O17N77p68M7L81j90kp7J6K91l32j12N08l14k64N51k47l13N41k15l59N82
2602B55j59m15M78l8l08L13j73n4M01m97q2Q32o04n73J119j31j055P17N79q71
2622b66j05O39Rm98j09O54N4r75M07R92j019n06J294j98j040O88M37o30m9K74
2642E3J10o6m33K86N87p81k39J029l60q02P93K37p36J88L81k24j10K3J53O8l70
$$ plain form
2663 -213 -32 313 -198 -168 376 -175 -248 438 -98 -412 427 101 -511 227 326 -356 -92 273 0 -142 -101
2684 -101 182 175 -374 -69 523 -211 -473 475 244 -531 -2 427 -84 -311 43 365 -32 -504 246 564 -569
2705 -569 -361 813 -62 -768 441 462 -583 -141 475 -31 -303 24 247 -5 -329 90 350 -285 -223 396
2725 396 -39 -329 203 103 -200 55 32 -55 67 -80 -21 153 -143 -46 227 -166 -92 308 -163 -214 391 -49
2747 -49 -377 316 185 -400 26 336 -119 -238 116 241 -152 -303 308 269 -516 -61 602 -248 -477 448 214
2768 214 -463 -10 339 -41 -237 -25 303 -2 -426 156 458 -413 -269 570 -20 -516 260 321 -323 -135
2788 -135 271 80 -219 -73 265 29 -335 155 313 -329 -107 400 -141 -253 277 17 -230 122 55 -115
2808 -115 36 8 -3 12 -101 82 99 -221 48 254 -253 -122 369 -104 -310 258 139 -262 -27 211 22
$$ packed form
2663b13J81L45n11L0N44n51p3O86n36l14Q39l26o12P38R9o82K64L65k73j42M1
2684a01K83pn49L05N92p34k62R48k31p75N29M29n11k27L54L22l97m72P50L18j133
2705e69K08J174q75p06J209K1j045M42O16n06k72L27K23k52l24M19K60o35O2O19
2725C96m35k90N32j00l03K55k3q7J22j47N9J74k96R7K73l93P4M00m71n1O05m40
2747d9l28O93j31n85M26L10m55j19L54J25l93j51O11l9p85M55O63q50k29R25k34
2768B14o77M53L49l80j96K12L28l05m24N82L02q71J44Q39n90m96P76O1o44J88
2788a35M06j91k99J46L38k36l64M90J58o42K22N07n41j12N30k60k47L52o7j70
2808a15J51k8j1J5j13J83J7l20K69K06n07J31M91m73k06N68j19m01K35K38j89
$$ plain form
2829 22 -196 -41 296 -32 -375 269 330 -472 -92 535 -184 -399 347 177 -330 -26 227 28 -200 -64 288
2850 288 -15 -382 183 334 -394 -134 451 -103 -333 245 161 -215 -51 135 66 -134 -89 228 21 -288 173
2871 173 238 -321 -10 334 -196 -158 288 -40 -183 131 50 -72 -6 6 81 -37 -140 172 92 -304 106 277
2893 277 -302 -103 352 -125 -264 210 105 -193 -40 132 65 -164 -77 289 -14 -362 237 276 -410 -33 414
2914 414 -169 -240 252 76 -171 -20 89 94 -112 -138 239 64 -354 130 302 -318 -109 346 -96 -234 175
2935 175 83 -152 -40 75 72 -115 -78 216 -21 -251 212 138 -333 94 268 -272 -52 276 -146 -128 201 -11
2957 -11 -90 61 8 44 -11 -108 163 69 -259 105 234 -250 -82 269 -77 -189 105 110 -74 -118 65 198 -181
2980 -181 -190 357 38 -431 217 324 -423 -57 414 -175 -235 238 51 -153 20 36 43 -35 -100 131 63 -204 76
$$ packed form
2829B2k18J55L37l28l43O44O1q02L80O27p19k15P46j70n07L04K53j99k28J36L52
2850B88l03l67N65J51p28K60N85n54k30N78q4l76J64J86o9k00M5L17k07l09M61
2871A73O5n59L11L44n30L8M46l28j43L14q1j22O6J2P5j18j03L12q0l96M10J71
2893B77n79J99M55m77j39M74j05k98J53J72o7k29Q7L66l03l48N99L9o86L77M47
2914D14n83p1M92j76k47J51J09Nk06k6L77j75m18M84J72o20K09M55m42j38M09
2935A75r2k35J12J15lj87L7K94k37k30M63p4m71M27J74n40K20L28m22J8L29k12
2957a1p9J51n3L6n5r7K71r4l28L64J29m84J68L51l46j12K94Nj84m4J83J33l79
2980a81rN47l19m69O48J07p47L66M71n89o0M73j87k04J73J6Pp8o5K31o8k67K80
$$ plain form
3003 76 174 -165 -28 149 -80 -26 62 -40 43 -10 -90 133 -10 -179 184 51 -259 173 155 -321 95 272 -297
3026 -297 -64 324 -116 -196 210 56 -151 -12 113 49 -147 -42 257 -47 -269 220 165 -304 24 258 -137
3047 -137 -86 115 12 6 -69 -60 210 -40 -282 250 179 -386 76 340 -257 -151 256 -38 -175 66 68 -21 -69 -21
3071 -21 140 -48 -155 159 49 -185 112 92 -173 94 97 -159 87 112 -169 59 136 -136 25 118 -85 33
3093 33 35 -102 116 25 -195 123 131 -228 11 212 -121 -94 106 32 -27 -73 10 161 -142 -169 291 32 -345 193
3117 193 239 -309 -42 256 -84 -125 95 50 2 -74 -32 165 -47 -188 203 89 -240 65 167 -137 -28 69
3139 69 -34 29 -46 -72 144 -42 -179 159 52 -212 98 109 -175 56 73 -131 65 72 -155 58 104 -134 7
3162 7 96 -54 -2 12 -11 74 -83 -58 190 -52 -177 204 80 -236 92 169 -151 0 87 -31 30 -39 -53 161
$$ packed form
3003G6R8l39J37J77k29N4Q8j02Q3n3q0K23j43j69L63j33l10M32j8m76M16J77n69
3026b97K33L88m40q0M06j54k07J39J25o4j96J05K99l04k22M89n5m69L28K34l95
3047a37N1K01j03op5RK70k50k42N32p1n65M62K64n97J06M07k94j37K41Kq9m8M8
3071b1J61j88j07L14j10k34K97k0k65K67Lk56K46K5k81K28P7k72J61R3k03J18
3093C3Kj37K18r1k20L18Ql59K39K01l33K7K00p4n9m6Q3J51l03k7M60k59l77N38
3117A93M6n48K67K98l40m1K20m5m8p6M2J97k12j41L91j14l29L05J02l04J09R7
3139F9j03O3p5k6K16j86j37L38j07k64L10J1k84K31J7k04J96Pk27K13M6k38J41
3162GQ9j50N2J4k3Q5j57K5K48k42j25L81j24l16L28P7l20J51Q7j18O1o9j4K14
$$ plain form
3186 161 -54 -176 201 67 -260 86 173 -170 -51 127 -24 -37 -28 33 88 -113 -52 203 -42 -182 171 60
3208 60 -178 83 78 -104 58 23 -77 99 -11 -107 150 17 -155 123 58 -116 60 61 -98 64 20 -85 74
3231 74 2 -98 91 17 -110 68 11 -68 43 -30 -49 99 -62 -94 158 -29 -154 148 49 -163 83 77 -99 34
3255 34 15 -48 75 -44 -69 142 -31 -135 137 39 -154 75 67 -98 24 30 -33 34 -47 -30 103 -68 -84 141 -41
3280 -41 -127 117 1 -127 86 7 -95 76 -28 -73 116 -22 -87 137 -4 -117 120 24 -121 75 25 -81
3302 -81 59 13 -69 65 -8 -62 70 -12 -54 79 -41 -64 73 -44 -48 113 -50 -84 113 -37 -103 113 -20 -110
3326 -110 94 0 -103 101 -7 -94 86 1 -85 94 -3 -77 83 9 -68 62 -4 -55 69 -22 -25 69 -48 -35 111
3351 111 -60 -69 128 -35 -87 96 -29 -86 94 -29 -68 75 -27 -59 95 -43 -71 116 -34 -93 109 -7 -92
$$ packed form
3186A61k15j22L77j34l27L46Q7l43J19J78j51j3RO1N5k01O1K55k45j40L53j11
3208F0k38K61nj82J62l5j00J76j10r6K57j33j72K78o5j74J76Jj59J62m4j05J59
3231G4p2j00J89p4j27J78n7p9J11p3j9J48j61l2K52j87j25L02r9k12K46oj76J33
3255C4j9o3J23j19k5K11j73j04K72r8j93K29qj65J22Oo3O7q1J7J33j71j6K25j82
3280d1q6K44j16j28K13p9j02J71j04m5J89j38o5K24j41j13K37r6j45J96n0j06
3302h1J40m6q2J34p3n4J32q2m2J33j20k3J37j17mJ61j63l4J97j50o6K16j33r0
3326a10K04r4j03K04j08q7J80q5q6J79r7p4J60p4p7J30o6n1J24r1lR4j17J3J46
3351A11j71rJ97j63n2J83j25n7J80j23l9J43j02l2J54j38k8J87j50n9K02j16q5
$$ plain form
3374 -92 84 6 -72 70 -6 -41 76 -37 -20 90 -62 -57 102 -57 -67 122 -27 -77 89 -24 -54 78 -50 -42
3398 -42 103 -61 -65 108 -61 -82 119 -33 -98 106 -21 -80 95 -20 -77 77 -12 -54 73 -32 -26 83 -39 -31
3422 -31 105 -53 -38 112 -69 -61 127 -49 -63 119 -41 -69 101 -37 -56 108 -44 -57 116 -44 -65 126 -34
3445 -34 -82 100 -12 -73 66 -13 -45 63 -34 -5 76 -74 -7 116 -92 -43 144 -70 -61 150 -41 -73 122 -28
3469 -28 -67 108 -30 -52 110 -45 -44 97 -54 -41 90 -47 -46 98 -56 -41 76 -66 -39 81 -75 -25 100 -86
3493 -86 -38 130 -93 -46 135 -98 -74 133 -53 -83 129 -36 -72 103 -23 -60 88 -35 -23 87 -52 -1 88
3516 88 -73 -14 106 -97 -19 121 -88 -31 125 -91 -28 120 -87 -36 128 -95 -57 124 -77 -64 132 -61 -68
3539 -68 114 -34 -46 79 -30 -23 60 -68 4 87 -83 21 103 -100 5 120 -104 0 129 -106 -22 156 -118
$$ packed form
3374i2J76p8p8J42p6l5J17j13J7J10j52NJ59j59j0J89j49n0J66j13l0J32j28Q
3398d2J45j64mJ73j69k1K01j52o5K04j27n9J75j15n7J54q9m2J27j05OJ09j22Q
3422c1J36j58J5J50j81QJ88j76j4J82j60k8J70j38j9J64j52j3J73j60k1J91j60
3445c4m8J82j12o1J39p9l2J08r7K9Q1j50O7J23k08M9J87k14RK11j91l2J95j50
3469b8l9J75j38k2J62j55JJ41j51J3J31j37JJ44j54J5J17j42K7J20j56N0J25j86
3493h6M8J68k23M7J81k33K4K07j86l0K12j65l6J75j26l7J48j23J2J10j39N1Q9
3516H8j61N9J20k03P8J40k09N7J56k16O3J48k07N1J64k23L8J81k01J3J96j93p
3539f8J82j48j2J25j09PQ3j28P2Q3j70J04Q2k03J05J15k24J04J29k35Q4J78k74
$$ plain form
3562 -118 -45 161 -91 -62 140 -65 -72 107 -27 -44 75 -56 -23 68 -70 0 72 -89 17 90 -80 27 81 -108
3586 -108 25 102 -126 22 121 -129 21 149 -133 -24 158 -88 -44 154 -63 -56 114 -49 -35 90 -44 -25
3608 -25 71 -41 5 56 -52 37 44 -91 63 56 -141 62 118 -157 6 153 -122 -24 126 -86 -17 101 -75 10
3632 10 94 -96 14 113 -109 -5 127 -61 -32 93 -23 -19 35 -22 52 5 -101 103 49 -166 96 118 -163 18
3656 18 149 -125 -11 128 -85 -22 96 -78 -3 85 -76 6 75 -57 5 44 -60 25 39 -88 43 64 -93 40
3680 40 85 -80 28 74 -63 38 39 -75 82 40 -144 86 91 -188 49 170 -154 -60 160 -42 -95 66 28 -20
3704 -20 -59 -14 94 -42 -127 134 66 -176 45 140 -132 -35 96 -30 -16 7 -37 83 -8 -113 120 58 -165 85
3728 85 138 -149 7 146 -78 -39 85 -46 -19 44 -30 10 2 -33 37 -7 -60 73 -11 -99 111 33 -145 93 93 -160
$$ packed form
3562a18P3K06k52K9K02k05pJ79j34j7J19j31L3R1j38P0P2j61J06P3j70J07N4j89
3586a08J33P7k28J48R9k50J50J28k82J09J82k46M4J98k17PJ70j63J4J25j34J9
3608b5R6j12M6N1j08Q9Pj35J54pj97K03N6k75J63J47k75R8J50k12O9J18j76Q5
3632A0Q4j90J10R9k22J04J32j88K9J25j16MN4n7P4m7j06K04n4k15K62K2k81J81
3656A8J31k74J14J39k13O3J18j74P5Q8j61Q2O9j32O2L9j04Q5J4j27J31K1j57J33
3680D0M5j65J08M6j37J01Jj14J57m2j84K30Nk79K37J21l24R4K20k02n3J61l8m8
3704b0l9M5J08j36q5K61o8k42K21R5k72R7J31j26J4K3m4J20r1j05K33o2k23K50
3728H5N3k87J56J39k24L9J24j31K7O3p4M0ql5P0m4n3J33q4q8K10p8j78K38%k53
$$ plain form
3754 -160 37 122 -90 -29 74 -16 2 -4 -14 110 -19 -133 143 98 -203 43 196 -124 -88 145 30 -94 -11
3777 -11 93 53 -134 -15 194 -69 -194 205 82 -238 63 160 -152 -56 130 -27 -57 16 8 41 -27 -71 115 16
3801 16 -140 95 99 -130 32 104 -80 -5 70 -26 18 23 -8 42 -19 -29 84 -42 -70 143 -20 -162 175 67 -214
3826 -214 80 167 -183 -46 179 -49 -108 35 70 -25 -96 18 143 -98 -138 202 40 -237 81 186 -139 -83
3848 -83 150 23 -83 -33 104 79 -154 -30 239 -76 -224 242 111 -277 60 211 -147 -80 130 5 -69 2
3870 2 39 42 -76 -34 139 -53 -138 141 27 -167 86 93 -149 17 100 -68 -25 48 1 -8 -42 17 85 -110 -45 202
3896 202 -80 -176 217 66 -247 113 187 -184 -49 164 -13 -103 4 91 31 -153 9 210 -123 -190 241 62
3918 62 -282 80 206 -159 -95 134 65 -98 -66 134 97 -212 -11 272 -145 -212 273 57 -283 120 185 -178
$$ packed form
3754a60J97Q5k12O1J03r0J8oj0J24j29j14K76m5l01K46J53l20L6K33j15j24Q3
3777a1J04m0j87J19K09k63j25L99j23l20L01R7l12R6J86j57l0P3qL3o8m4J86r9
3801A6j56K35Mk29J62P2j84P5P5r6M4Nl1N0o1j0J13j26k8K13j63j42L37j08k81
3826b14K94Q7l50J37K25k28n9J43L5r5p1J14J25k41m0L40j62k77L18J05l25N6
3848h3K33j27j06N0J37k5k33J24K69l15j48M66j31l88L37J51l58O7K10j25p4P1
3870BL7Lj18M2J73j92q5K79j14j94K53Pk42J66Q3j68M3P3m7rl4N9O8j95O5K47
3896B02k82r6L93j51l13L60P4l71J35K13j77r0J07Q7o0j84J62K01l33o7M31j79
3918F2l44L62J26l65O4K29o9j63L2K00l7l09K01K83m17o7M85k16l40M03O5l63
$$ plain form
3940 -178 -42 148 -14 -58 10 50 37 -94 -11 147 -101 -100 174 -23 -165 138 73 -143 41 88 -69 -35 13 35
3964 35 1 -112 57 141 -192 -35 289 -136 -219 291 44 -306 134 220 -197 -78 178 38 -128 -35 155 42
3986 42 -216 60 253 -174 -159 271 22 -251 98 140 -107 -83 65 82 -49 -149 135 140 -277 -23 320 -181
4008 -181 -235 312 34 -299 137 169 -189 -34 153 -7 -100 6 116 -14 -135 106 138 -186 16 223 -142
4029 -142 -107 224 -29 -151 122 43 -86 13 5 47 18 -143 92 166 -248 -46 324 -145 -250 300 75 -312 64
4052 64 241 -117 -172 151 161 -192 -135 283 37 -341 145 295 -283 -115 339 -67 -208 171 80 -103 -2 18
4074 18 62 4 -146 98 144 -217 -37 249 -135 -179 209 44 -202 53 121 -90 -71 90 85 -115 -51 197 -41
4097 -41 -229 204 134 -313 86 290 -245 -111 305 -62 -211 154 94 -127 -34 74 81 -81 -112 186 75 -258
$$ packed form
3940a78J36J90j62m4O8M0j3j31Q3J58k48JK74j97j42L03o5k16J84M7j57L4M8K2
3964C5l4j13J69Q4l33J57L24m25q3N10k47l50M40Q6m17J19K56j40j66R3J90j13
3986D2k58K76J93m27J5M30k49k73L49M2k47K4J48J7j31j00K84Nm17K54L43n01
4008a81n4N47k78l33M36L2l58J55J87j60r3J06J10j30j21K41L2l24K02K07l65
4029a42L5L31k53j22K73p9j29R9qM2k9j61K35P4m14K02L70m69j05N50k25l87L76
4052F4J77l58n5L23J0l53N7M18k46l78M86J50n78J68M54m06j41L79r1j83J01K0
4074A8M4n8j50K44M6l61J80K86l84m4L88j65k46K55O8k11J9J61nk00O4K48k38
4097d1j88M33p0m47L99K04n35J34M16l67j49L65o0k21R3J08Pj62l1K98j11l33
$$ plain form
4119 -258 45 265 -177 -162 240 42 -218 21 169 -16 -198 40 228 -138 -238 289 116 -378 82 317
4139 317 -245 -158 304 3 -215 98 120 -65 -84 47 112 -70 -103 165 51 -211 100 155 -188 -17 192 -97
4161 -97 -82 127 0 -72 23 35 19 -67 -29 138 -55 -168 179 75 -264 73 228 -210 -110 223 -6 -177 39
4184 39 129 -28 -150 61 209 -156 -196 300 91 -362 114 315 -251 -161 294 25 -244 47 181 -51 -161
4205 -161 74 176 -143 -160 231 51 -267 68 189 -158 -68 149 -13 -75 0 31 47 -68 -45 150 -28 -161
4227 -161 159 73 -218 75 177 -193 -17 219 -99 -129 156 33 -142 17 133 -20 -133 78 161 -154 -115
4248 -115 250 -15 -273 152 181 -251 -57 215 -50 -149 38 84 -7 -129 6 204 -90 -216 225 124 -323
4269 -323 21 291 -156 -190 211 86 -182 -14 169 4 -180 41 215 -136 -143 225 45 -238 99 168 -158
$$ packed form
4119b58L03K20m42J5M02j98k60K39J48j85j82K38J88l66j00N27j73m94M60K35
4139C17n62Q7M62l01k18L13K2j85j9J31O5j82l3K68j14k62L11N5l43J71K09k89
4161i7J5K09j27p2R5J2j6q6L8J67j93j13L47j04l39L37J55m38J00L33k29j71K16
4184C9R0j57j22K11J48l65m0M96k09m53M76K01n66R0M55k69k69K91J34k32j10
4205a61K35J02l19j7L91j80l18L35J21l47R0K17j62o2P5L1J6j15K3J95j78j33
4227a61L20q6k91K93J02l70J76K36l18l0K85j23j75J59J16j53j13K11Q3l15L9
4248a15L65k65k58M25K9m32J94K72k65r9J87M6r1j22J35J98k94j26M41j01m47
4269c23L44K70m47l4M01j25k68J68J83j65j84K21J74l51pL68j80k83L37O9l26
$$ plain form
4290 -158 -24 135 -50 -61 47 -1 1 -24 -22 56 -34 -85 94 11 -139 95 71 -176 36 149 -133 -57 128 -16
4314 -16 -98 28 75 3 -103 37 158 -119 -130 234 34 -257 106 191 -185 -99 186 -8 -141 18 122 20
4336 20 -151 19 206 -123 -195 230 70 -287 66 214 -176 -95 159 12 -112 17 81 11 -93 3 145 -63
4358 -63 -125 146 52 -162 67 102 -106 13 75 -41 -7 29 -17 32 -22 -33 89 -40 -80 145 -20 -150 146 71
4382 71 -190 66 138 -159 -61 130 -25 -94 8 69 -3 -118 21 151 -120 -134 214 16 -224 112 144 -153 -24
4405 -24 126 -15 -37 -17 49 70 -112 -38 187 -57 -174 184 80 -205 47 146 -105 -60 80 12 -34 -26 35 65 -105
4430 -105 -27 147 -76 -110 155 -12 -140 120 17 -126 89 49 -104 59 43 -68 49 -1 -38 82 -38 -50
4452 -50 126 -46 -105 140 21 -136 82 81 -98 -13 54 17 -22 -65 75 81 -166 -2 204 -137 -119 236 -12 -190
$$ packed form
4290a58J34J59j85j1J08m8Kk5KP8r0n1J79q3j50K34k4k47K12J13k82P6J85j44
4314a6q2J26M7p2j06J40J21k77j1L64k00k91L63Q5l76Q6K85j94j33J59J04j02
4336B0j71J70J87l29p2M25j60l57L53J48l90Q1K54j47j24J29O4p0j04R6J42k08
4358f3o2K71r4k14K29L5k08J19O2j16L4L6m6M9n4j1J22j29m0K25j65j30K96p5
4382G1k61K56P2k97R8J91j55o9J02O1p2j15J39J30k71j4L48j98k40L36L2k97J29
4405b4J50j41k2K0O6K1j82P4K25k44j17L58j04k85K52R9k51M5J40o8m6QO1L0j70
4430a05P8J74k23l4K65j67j28K60j03j43K15m0j53J63j6j11J17n0l7J20j20j2
4452e0J76j72n9K45j19j57K18jj79Q5O7l7l9m3J40Ok47J64K06l41J8L55k48j78
$$ plain form
4476 -190 128 80 -137 34 48 -41 14 -43 3 97 -82 -64 148 -26 -115 114 34 -93 26 31 -12 10 -26 44 58 -98
4502 -98 35 114 -110 -8 150 -108 -52 170 -91 -93 173 -47 -127 132 11 -114 62 40 -47 30 -6 9 44 -62
4526 -62 11 102 -64 -34 115 -32 -57 80 3 -4 32 -42 65 48 -139 61 146 -173 -22 211 -108 -123 187 -2
4550 -2 -132 96 36 -60 26 -2 -8 37 -68 18 57 -68 -17 85 -54 -10 68 -49 10 48 -85 38 88 -104 26 106
4576 106 -100 3 123 -90 -12 113 -77 -25 122 -70 -46 119 -31 -69 68 -3 -28 23 3 15 -21 -69 73 34
4600 34 -129 55 98 -123 6 111 -78 -24 84 -52 5 48 -78 27 75 -110 7 121 -94 -37 121 -22
4622 -22 -46 59 19 -8 6 -5 55 -12 -74 77 49 -112 43 77 -97 14 68 -86 12 69 -90 23 57 -97 5
4647 5 94 -85 -15 86 -49 -31 45 -29 4 21 -34 21 18 -59 31 28 -55 28 24 -53 44 24 -80 54 42 -103 58 68 -108
$$ packed form
4476a90L18m8k17J71J4q9N5n7M6R4j79J8K12j74q9K29q0j27J19Nm3K2l6P0J4j56
4502i8J33P9k24J02J58k58N6K22k61kK66k20q0K59j21j25J76k2q7P7l6J5L5j06
4526f2P3R1j66L0J49j47k5J37p7pL6p4J07j7j87K00Q5l19J51K33l19j5L10j89
4550bj30K28o0r6Q6k8oM5j05Q6L9j25N1J02j39M4P8j17N9L8j33J23N0j92J30Q0
4576A06k06J03J20k13P8J25j90N2J47j92K4J65j50l8J37p1k5N1k0J2l6m8J42l9
4600C4j63J84M3k21J29J05j89N4J08j36N7M3j26J05M8j85J17J14k15N7J58j43
4622b2k4J05m0k7J4j1O0o7o2J51k8j61J55L4j74J11N4j54R8N7j59J13L4j54J02
4647EQ9j79P0J01j35J8P6p4L3J7n5N5lp7R0lq3Q3mp7R7k0j04J34j2j45J61J0j76
$$ plain form
4676 -108 10 94 -83 -22 82 -27 -27 36 -35 6 20 -49 30 33 -61 19 48 -50 3 38 -22 3 10 -18 51 -1 -58 64 27
4705 27 -90 46 68 -87 23 93 -56 -15 73 -24 -7 28 -26 10 40 -41 18 35 -37 1 34 -39 -4 36 -31 5 10 -40
4733 -40 6 22 -36 17 12 -40 46 21 -56 41 41 -53 17 48 -60 9 70 -34 -8 53 -22 -3 44 -22 9 32 -32 16 29 -48
4763 -48 3 53 -38 6 51 -20 -11 29 -11 2 -4 -35 20 1 -57 33 28 -79 24 56 -82 4 77 -68 -24 71 -22 -25 46 -15
4793 -15 -13 19 -28 14 34 -43 6 56 -38 -2 49 -25 -24 26 -15 -1 -1 -27 32 6 -62 36 37 -82 25 57 -76 3 76 -59
4823 -59 -12 77 -45 -21 51 -39 -16 51 -37 -13 45 -27 -6 48 -21 6 35 -25 25 33 -43 21 38 -49 16 35 -48 27 36 -47 29
4854 29 40 -80 26 66 -89 12 82 -76 -26 83 -20 -25 38 -3 2 13 -11 31 0 -50 43 43 -60 29 53 -59 27
4881 27 44 -43 30 25 -50 51 25 -78 56 68 -103 19 82 -68 -27 75 -37 -20 29 -29 3 13 -31 19 17 -43 22
$$ packed form
4676a08J18Q4j77O1J04j09%O3p1M1J4o9P9Lr4Q0K9r8N3L5o0K5Pk8O9n2n7J22l7
4705B7j17J36K2j55J10P0j49M1Q8r7J7L5n4L6L0q1N9J7p2L8L3p3L5M0o7L6Nn0
4733d0M6J6n8N3nn2Q6k5p7R7%r4P0L1j08O9O1j04K6O1p5J9M7o6L1K3o4M8J3p7
4763d8N1N0r1M4M5p1RM0m0J3ol1N5j9n8R0nj07J03L2j38Q6P3j45M4R5r3lP1o1
4793a5KL2m7M2K0p7M9N0r4L6N1p4JN0m1J4%k6N9k6o8R8Jj19J07L2j33P9P3j35
4823e9M7Q9j22K4P2r0K3O7q8K4N8p2K1N4o9K7K9o0N0Qp6O4J7q7O5J9q3P5Rq3P6
4854B9J1j20J06M0j55J01P0j58N0J09j03nO3m1NJ1k4M2l1n0R3%j03Q9K4j12Q6
4881B7J7q7P3np5J01k6j03J34J2j71J22O3j50M1J02j12J7M9n8L2J0m4N0ko0O5
$$ plain form
4908 22 10 -40 37 13 -31 62 6 -48 71 6 -98 63 53 -89 24 73 -64 12 64 -32 9 28 -23 35 19 -57 26
4935 26 29 -36 19 35 -29 -2 -2 -3 45 -34 -30 76 -28 -72 76 19 -91 53 42 -68 36 32 -52 35 21 -46 48 16 -53
4964 -53 33 40 -37 15 24 -8 29 -17 -6 58 -42 -34 87 -17 -61 75 14 -64 39 9 -37 23 -7 -23 60 -29 -53 78 -15
4993 -15 -80 67 22 -72 9 35 -29 2 -8 24 24 -48 6 65 -48 -25 101 -28 -40 74 -11 -46 63 -10 -30 51 -21 -37
5021 -37 52 -14 -28 46 -2 -18 28 -13 -10 38 -25 -14 48 -25 -15 42 -10 4 25 -29 24 27 -45 34 58 -95 6 107 -73
5050 -73 -41 124 -20 -68 63 39 -49 4 33 21 -14 -27 43 32 -65 -3 66 -45 -34 60 -14 -25 8 -1 19 -6 -43 50 15
5079 15 -96 49 69 -109 4 106 -76 -39 91 -27 -65 66 10 -33 27 9 -7 -2 3 25 -4 -33 38 9 -58 43
5105 43 39 -60 10 52 -50 -19 30 -20 10 -8 -29 63 -14 -92 63 54 -127 17 114 -90 -70 106 -3 -89 34 63 -35
$$ packed form
4908B2j2n0P7k4m4R3n6n4J19o5j04J61j0j42J13M9j37P6N2r6M1J9n1N8j6p6Q3
4935B6Lo5N5J6o4K7%jM8p9MJ06j04m4J48n7j10J44j1j10J04mq4Q7j4o7R4l2o9
4964e3Q6Pp7N2Rl2L7m6J1O4j00QJ21j04m4J36o1p8J03l0m6O0l0j6Q3q9k4J31r3
4993a5o5J47m5r4Q1K6o4L1j0L2%p2N4N9j13K3J26j29j2J14q5l5J09p3k0Q1p2j6
5021c7Q9o6j4P4m8j6M6m1LM8o3J1O2p3J0N7n2J4K1n4N3Lp2P9K4j53J01J01j80
5050g3L2J65j44m8J31k4q8N3K9j2l5j3P0j1r7O2O9j11J1R4p4j1L3rK0k5l7R3l5
5079A5j11J45K0j78J13J02j82L7J30j18l8J31n6m3O0j8j6NNK2k9k9P1k9o7J01
5105D3mr9P0M2j02L1M9n0L0j8k1R2p7p8J55rj81J44R7k04K0J76j09q6J23K9r8
$$ plain form
5132 -35 -40 41 52 -55 -35 88 11 -81 54 53 -69 -1 62 -4 -14 16 12 22 -16 -28 71 -3 -73 67 45 -101 29 87
5160 87 -77 -30 85 -22 -62 54 32 -48 -5 58 -2 -54 25 68 -51 -26 97 2 -75 52 61 -71 -12 74 -17 -30 23
5187 23 28 4 -33 -3 52 -35 -75 77 52 -114 5 119 -72 -78 96 34 -108 15 102 -31 -81 53 67 -76 -36 111
5213 111 3 -91 57 73 -72 -26 91 -11 -55 48 41 -21 -8 27 26 -27 -28 57 15 -84 22 78 -79 -44 90 -16
5239 -16 -78 61 45 -74 -17 75 -14 -65 25 69 -45 -52 92 25 -102 31 112 -72 -65 111 13 -88 25 89 -25 -46
5265 -46 49 71 -44 -51 100 45 -120 20 130 -78 -89 122 38 -113 12 90 -52 -70 44 57 -62 -50 92 31
5289 31 -105 29 95 -87 -44 102 -8 -93 59 57 -58 -20 49 20 -48 -21 72 -2 -85 47 76 -96 -24 104 -42
5314 -42 -83 88 41 -88 11 80 -11 -55 35 72 -49 -66 108 39 -137 34 136 -93 -89 131 29 -114 35 92 -34
$$ packed form
5132c5nQ1J1j07K0J23p7r2J35jj22O8O3o6j0L0mJ0l8j2R9p4p0J40k2j46J30N8
5160H7j64M7J15j07m0J16k2q0M3O3o0n2P9M3j19K5J23r5p7J27Rj32N9Q6r1j3N3
5187B3Nk4l7L0N5q7m0J52k5j66J19J14j91oJ74o2j42J23Q7j33n0J34J4j43M0J47
5213A11j08r4J48J6j45M6J17j02m4J03po2J3L5jn3jQ5m2r9J06N6j57L5J34j06
5239a6o2J39j6j19N7R2q9n1R0M4j14pJ44o7j27J33Q1j84PJ76r8j01J13O4j14k1
5265d6R5K2j15pJ51n5j65J40J10k08j1K11q4j51J25P8j42j8J14J3j19J2J42o1
5289C1j36J34O6j82M3J46j10q5J52kj15L8O9k9o8K7R3p4q3J32K9j72P2J28j46
5314d2m1J71m7j29R9O9r1m4R0L7j21j7J74o9j76J71J02k29MK20j02j43J49N7j26
$$ plain form
5339 -34 -63 47 85 -64 -69 108 54 -129 28 135 -78 -81 129 14 -100 32 72 -35 -48 33 70 -51 -61 94
5363 94 29 -122 47 95 -108 -40 111 -25 -88 61 44 -57 -20 51 9 -51 -22 87 -32 -94 88 58 -125 23
5387 23 127 -77 -57 110 22 -93 20 74 -16 -79 28 93 -72 -91 114 53 -155 34 148 -93 -96 111 27 -109
5411 -109 -5 89 -18 -86 28 92 -76 -94 118 35 -144 38 120 -94 -64 97 6 -79 22 67 -19 -56 28 57 -66
5436 -66 -41 105 -4 -95 68 69 -93 3 93 -25 -64 50 30 -51 -32 60 31 -88 10 112 -73 -106 125 35 -153
5461 -153 37 122 -81 -60 98 29 -75 -8 98 -1 -95 38 108 -88 -73 133 27 -121 39 104 -60 -57 65 55
5485 55 -56 -47 89 29 -121 19 118 -83 -86 133 14 -130 51 74 -90 -38 70 -12 -59 3 43 -29 -57 57 33
5510 33 -82 9 98 -57 -50 88 12 -84 38 58 -34 -24 38 33 -38 -47 73 39 -102 22 120 -86 -85 120 17 -123 22
$$ packed form
5339c4k9J10L8j49nJ77n4j83J57J07k13lK10j15j14J32M0j07j3Q1L7j21j0J55
5363I4o5j51J69M8k03O8J51j36o3J49j7j01L7P1m2o0K9J09j19o2J82l0j83J48
5387B3J04k04K0J67q8j15J13N4r0o3J07O5j65j9K05o1k08J89J14k41lK07q4j36
5411a09J04R4j07o8J14O4j68j8K12q3j79J82Q2k14L0J61r1q5J01M5q6l7Q4K9j23
5436f6K5J46j09r1J63Jj62R6R0j18l9J14k0q1J9R2k9j19R8J02j85l3K31r0j88
5461a53J90Q5k03K1J58o9j04O7J06r9r4J33P0j96J5K06j06j48J60O5j64LJ22j0
5485E5j11RJ36o0j50J40R9k01lK19j19j44J81K3j64N2J08q2m7O2M0p2k8J14k4
5510C3j15R1Q9j55PJ38p6r6J22K0r2J0O2np1rJ20l4j41J24R8k06JK05j03j40J45
$$ plain form
5537 22 103 -61 -86 68 65 -93 -48 110 20 -135 45 121 -101 -64 122 -2 -103 34 69 -32 -39 36 47 -29 -39
5562 -39 70 41 -80 31 98 -63 -37 75 -11 -67 35 42 -50 -11 37 9 -60 -1 65 -30 -66 74 27 -95 30 77
5588 77 -78 -51 90 -6 -82 27 64 -34 -62 42 51 -68 -50 89 15 -113 39 107 -78 -59 97 19 -93 13 76
5613 76 -15 -72 32 83 -69 -77 107 19 -118 33 81 -80 -53 82 -1 -64 19 43 -29 -50 16 27 -43 -21 65 -2 -64
5640 -64 25 41 -52 -6 58 -12 -25 38 22 -24 -9 36 9 -37 18 58 -30 -48 81 28 -86 22 81 -63 -40 74 11 -81
5668 -81 8 64 -32 -66 36 45 -74 -44 75 5 -90 20 79 -57 -42 63 29 -65 -12 70 -5 -58 25 52 -40 -42 69 18
5696 18 -71 9 69 -40 -42 59 13 -66 4 39 -30 -26 25 22 -27 -13 37 -6 -41 12 18 -39 -6 38 -31 -39 36 14 -54 3 37 -13
5728 -13 -24 8 35 -15 -27 44 30 -49 1 63 -22 -53 55 26 -55 -2 50 -20 -42 19 36 -31 -38 60 26 -61 8 76 -37 -48
$$ packed form
5537B2Q1j64k5J54lj58M5J58r0j55J80P6k22L7J86j24j01J37L5j01pP5J1p6j0
5562c9J09k9j21J11O7j61K6J12q6n6J02Pr2L9M8k8o9N9O6r5l6J40m7j22J25M7
5588G7j55K7J41r6p6J09L7r8k8J04Rj19J8J39p4j28J52O8j85J9J56p8j12J06O3
5613G6r1n7J04N1j52qJ84q8j37J51M8j61K7J35q3o3Q3K4p2k1O6J1p0K2Q6o7o2
5640f4Q9J6r3M6O4p0j3O3j6m6J5M5k7m6N5M0q8j8J29n3j14J08N9j44K3J14o3r2
5668h1Q9N6r6l4J02Rj19L0J19p0r5J10N9j36J5J05l4r4N3Q2p5n3Q3K7r2kJ11n1
5696A8q9Q0O0j09kJ01m6p9P0L5o9MN1lm9J4N0m3l5N3On7L3M4o9qP5k2o8N7L4n0
5728a3j1L2K7n0j2P1j4p9N0O2q5l1J08k9q1N3N2p0k2O1J7o7pR8l4q7O9O8j13j1
$$ plain form
5758 -48 53 -1 -61 2 48 -25 -31 6 12 -26 -24 20 23 -39 -14 45 -31 -25 41 6 -37 18 17 -23 -3 9 7 -15 -25 11 2 -48 2 32
5792 32 -41 -30 45 -28 -46 34 4 -57 4 13 -21 -11 -1 13 -4 -32 17 19 -34 -3 64 -23 -38 45 4 -40 20 25 -22 -1 0 16
5824 16 14 -35 14 39 -38 -8 57 -26 -38 49 10 -43 7 19 -24 -17 -1 8 -1 -27 17 24 -46 3 47 -25 -26 54 -16 -31 41 1 -15
5857 -15 18 -7 -15 19 -21 4 21 -19 -8 34 -19 -4 44 -13 -22 24 0 -13 16 1 15 2 -18 19 9 -44 9 27 -48 -9 41
5888 41 -30 -29 25 -9 -32 12 -2 -16 -4 -4 8 10 -26 23 31 -36 -2 31 -25 -2 28 -3 -7 0 -2 2 -8 -19 6 5 -29 14 25 -33 2
5923 2 22 -23 -12 24 -11 -12 1 -11 4 -3 -18 12 1 -29 23 10 -41 8 17 -27 1 25 -16 -11 16 -8 9 -4 -8 9 -4 -24 5
5956 5 5 -26 6 12 -22 -1 3 -14 -8 -7 -8 19 -10 -15 19 -12 -25 17 10 -30 12 14 -31 3 11 -13 0 6 11 11 -11 -12 12 -6 -13 24 0 -6 30
5995 30 2 -9 11 2 -8 13 -5 -3 8 -15 -16 26 -12 -11 17 -1 -25 8 -1 -14 -2 -3 -6 -3 -3 0 8 -23 1 26 -21 -14 29 -13 -18 29 -8
$$ packed form
5758d8J01n4o0O3M6p3oL7Ol8KM4Lo2K5N9p6OO6l5m3N5jm0K0J2kk2j0L6rn0N0L0
5792C2p3J1P5p3j8Q0l0o1O1Rl4J0J0J4j7k8M9Kn3L1O7q7j5Q3m1m4O0Nm7K1JJ6
5824A6km9M9K5p7L0O5q3j2Q7l9n3N0J2m3PJ6Rrk6M4Pp0M9M4p2jQ0p0j5P2m0j6
5857a5L3k5qL4m0K5J7m0J1M2n3J5M8n7rM6k4j3K9j5J4j3k0L7j0n3N3J8p5L9N0
5888D1p1JN4l4k3M4j4j4J2%J2Kl6M9Qo7L4L3n6K3L0l1mPkMj0j1K5jl4M3J1n8L5
5923BK0m5J1L6l5jJ3j2J5pj5L0j1l0N2j3n1M9Rm4K8K4m1NK7k4J7j3mJ7j3k0K9
5956E%l1L2Ol4K1Mj7OJjK7k9nL4l1j3M2pm0M2Km5L4Qk4J3ON%k2jK4j8pL7k4oL6
5995C0k8j1K0rj0K1j8KJ1k3jM2l8JK8j8k4L3rj3J2jlL%LQl1K4K5m7PM3m2nM7l7
$$ plain form
6032 -8 -14 17 2 -14 8 -7 -10 12 -10 -1 16 -11 -15 14 1 -12 14 -12 1 -3 -19 5 2 -27 12 6 -33 -1 26 -31 -13 34 -17 -17 30
6067 30 -1 -21 17 10 -5 3 4 10 3 -8 14 14 -11 19 7 -15 14 20 -12 2 10 -14 4 1 -20 7 2 -27 12 9 -40 0 35 -29 -26 26
6103 26 -9 -31 -2 9 -10 -10 12 16 -11 -5 21 -2 -18 14 15 -22 12 13 -10 4 10 -6 8 9 -8 14 10 -15 0 10 -31 -5 9 -14
6137 -14 -14 7 -11 -11 -4 -5 -6 -11 -4 -1 -14 1 6 3 -12 16 6 -23 10 17 -16 10 27 -2 -7 8 2 -5 -8 -5 9 1 -2 4 9 -15 8 14 -17 -13 17
6178 17 -8 -20 -1 3 -4 -22 -4 15 -18 -9 8 1 -12 3 16 -12 -2 11 -5 10 7 -4 5 4 -1 0 2 -12 2 16 -5 -12 14 -11 -11 20
6214 20 2 -20 7 14 -19 -4 12 -19 -16 10 0 -20 -10 0 -13 -13 -7 6 -24 -14 9 -10 -8 11 6 -13 17 0 -15 3 -1 -4 15 -3
6248 -3 -17 14 6 -17 11 18 -18 0 13 2 -16 13 3 -14 -11 7 2 -9 -12 19 -19 -9 20 -13 -19 23 -7 -25 21 -10 -22 21 4 -18
6282 -18 19 1 -18 14 0 -8 3 1 -13 0 16 -12 3 -1 -4 -8 12 -3 0 7 -3 7 -14 0 23 -17 -11 20 -6 -24 28 7 -15 9
$$ packed form
6032hoL1j5j6K2j5lK2k2RJ7k7mK9j3j3K6k6J3mj6K4lk9L9ol9L2K7n7J8M7n1%M7
6067C0l1k0L8pj5QJOpj1K2%k5L0j2k2K9Ol2J4Qk4J8lk1K7nk9L9lm9M0L5o4LN2
6103B6l5k2K9J1j9%K2Mk7OK6k3j6L2Jl7L4Jk3J4Oj6J4Jj7K2mk5J5J0m1K6J4k3
6137a4%K1j8%PjjnPLj3J5Nlj5K8j0k9L3Pl3K6J7k9nJ5oplLJ4qlONk4K3Ol1ML0
6178A7k5j2J9Mpj8J8J9l3RJ7pj3J5J3k8J0J3j6J5lj1RjnJKj4J4J4k1pK6k5%L1
6214B0j8k2K7Pl3J5J6l1LK6j0k0J0J0j3%OJ3l0J0K3j9KJ9nj9L0j7j5J8mlJ9j8
6248cj4L1qk3K8Pl6J8J3j1j8K9j0j7LJ8nj1lL1l8J0K9l3oM2l0j8M6l1j2M3j7k2
6282a8L7j8j9L2j4qJ1kj4J3J6k8J5mlmK0j5LPj0J0k1J4K3m0OL1k6j8N2k1k2K4
$$ plain form
6316 9 3 -22 8 -4 -12 12 2 0 8 -9 -7 11 -2 -4 15 8 -7 19 -3 -12 16 -2 0 12 -9 -7 17 2 -8 19 -1 -9 10 -3 -10 15 -6
6353 -6 -5 10 5 -5 10 -16 -9 13 4 -3 18 -16 0 9 -19 0 19 -13 -13 25 -2 -8 25 6 -3 18 -9 7 5 3 6 13 -13 10 9 -10 5 20
6391 20 -18 -1 5 -7 -17 11 0 -6 7 -16 9 0 -15 5 21 -18 -9 18 -7 -13 14 -3 -17 6 16 9 -1 1 16 2 -18 14 25 -11
6425 -11 3 28 -12 -4 15 -10 8 3 -1 1 5 -10 11 -1 -21 18 3 -17 6 7 -20 2 13 -5 -7 6 6 -8 0 -1 13 4 -1 28 -5 -10 22
6462 22 13 -18 13 29 -3 -4 12 8 -10 -19 13 20 -9 -3 28 -16 -21 14 19 -28 -5 22 -19 -18 7 5 -8 -12 9 12 -13 -13 9 -7 -12 19 2
6499 2 -21 9 13 -3 -1 10 2 -4 -20 -1 10 -23 5 4 -16 -14 9 -15 -24 21 7 -35 -3 12 -20 -14 9 -3 -16 -20 18 15 -36 -2 33 -27
6535 -27 -23 30 5 -34 1 19 -9 -21 9 10 -17 -16 25 16 -30 5 52 -23 -21 37 5 -13 3 17 2 -8 -6 14 -17 -13 11 14 -28 -3
6569 -3 24 -12 -16 32 -1 -25 12 14 -17 -14 9 5 -24 -6 14 -9 -27 20 17 -33 -1 33 -11 -19 32 18 -29 6 23 -4 -19 -1 22 -18
$$ packed form
6316Iok5L0j2qK4j0kQj7KJ8j3kJ9pj5K6k2rK8j8KJ2k1KK4j5j0K7k0qJ9j3pK5k1
6353fJJ5nj0J5k6PK2rpK1l4J6Rk8J9J9l2%L8k7oL3j9rK1k7J6kkLPk6K3jj9J5J5
6391B0l8J7Oj2j0K8j1oJ3k3K5rj5K0J6l9RK7k5oK7j7j4K3J0pj0KJ5j4k0L2J1l6
6425a1J4K5m0QJ9k5J8nmKMj5K1j2k0L9j5k0K3Jk7K2J1j8kJ3%j4QjJ4rnK9l3nL2
6462B2rl1L1J6l2jJ6mj8rL2Pk9OL1m4nL5Nm7K3K7m1JK5kj3mK1Lk5%K2j6nL1j7
6499Bk3L0Mj6KJ1qoj6J9J1l3K8jk0KK3k4rM5j4m2L2J5l2OK3j2j3mL8ln1L4L5o0
6535b7MN3k5l9L5J8k8j2L0Jk7JM1rm6L5M7p5KN8l2j8J6J4j5j0KK0l1MK4Lm2K5
6569cK7l6mM8l3k4L7Kl1LK3mk9J8K0k3j8M7ln0L2L4m4qN1j4m7L5J7k7j5J8K3m0
$$ plain form
6603 -18 -10 21 -3 -37 0 31 -27 -45 19 4 -47 -12 31 -6 -39 10 16 -29 -26 35 12 -46 8 44 -28 -26 28 7 -30 0 15 -18
6635 -18 -12 7 6 -20 -10 14 0 -25 3 17 -17 -11 10 -10 -30 9 23 -21 -17 13 -11 -30 -4 24 -18 -35 14 15 -36 -8 33 -29 -32
6668 -32 37 20 -29 -7 39 -14 -28 18 19 -13 -16 24 15 -36 4 44 -18 -45 30 23 -45 8 41 -8 -35 1 16 -25 -34 25 17 -41 -5
6701 -5 32 -12 -38 39 8 -42 -4 27 -27 -24 20 16 -16 6 28 -1 -19 17 28 -14 -1 34 0 -30 35 19 -36 -20 26 -6 -26 1
6733 1 17 -9 -33 16 17 -35 -18 41 -12 -51 31 25 -52 -22 34 -13 -38 31 18 -25 -21 24 -1 -52 -6 45 -20 -31 40 19 -45 -1
6765 -1 40 -4 -14 24 24 -11 -11 29 6 -24 -2 43 -23 -26 31 18 -44 4 34 -32 -20 20 0 -28 -8 18 0 -23 18 30 -32 -22
6797 -22 44 -1 -46 23 32 -39 -15 30 -4 -27 21 26 -8 -19 19 22 -32 -8 47 -11 -39 27 19 -42 -9 28 -7 -32 1 18 -32 -21
6829 -21 20 2 -43 2 43 -10 -35 33 23 -45 -5 36 -14 -26 17 24 -21 -12 29 20 -26 13 46 -19 -19 36 -1 -36 25 34 -31 -6 19
$$ packed form
6603a8QL1k4l4L7L1n8j8O4j5n1L5M3l7l3M9Om5LO1k3n8N4L6p2KN4k1l7L0J5l3
6635a8OJ9jk6J0K4j4k5K8J4l4OK1k0k0L9J4m4ML0k4j9K6K8m2j7M9Jn1K8M1o2l
6668c2O9j7m9K2M6n3j4M6Jl2lM0rn1M0M0o2k7P5po8N3L3m9k7L6J5m1rN9qn8L6
6701eL7m4k6P7l1n0L8L1n4LM4ml2K2K2k9j8L6J1m2J3L5l4l0O5j6n5J6M6l2k0K7
6733AJ6k6k4M9Jn2J7N9n3l9Q2op7L0N6m7k5O9j3m3MM5k5n1M6N1o5j1P1k1o4M4
6765aM1m4j0L8%l5%M0k3l0K2M5o6lN7j3o2M8L0o6J2M0k0k8K0K6j8k3M1J2o2J0
6797b2O6m5m5O9Rp1K4M5l4k3M8Nl4j1L8Ln4K4N5n8k8O6qo1L3L7l5k5L3J7n0J1
6829b1M1j8m5M5M1n3k5O8j0o8M0M1n0j2M3Pm5RM1rm6L9L3o5%N5l7l5O1Ro5K5K5
$$ plain form
6862 19 13 -25 10 21 3 -22 5 22 -43 -13 26 1 -44 23 31 -27 -13 28 10 -30 8 37 -8 -21 40 26 -43 1 60 -16 -38
6893 -38 27 17 -36 0 20 -10 -35 11 23 -30 -14 33 8 -44 6 24 -11 -30 26 14 -20 -11 24 -1 -25 12 22 -16 -17 37 6
6924 6 -29 10 29 -24 -22 28 5 -23 20 27 -18 -19 13 21 -26 4 36 -14 -19 30 7 -27 -2 17 -21 -31 11 17 -31 -20 21 1 -29 2
6958 2 27 -18 -33 21 18 -42 -3 46 -9 -33 18 26 -24 -10 36 2 -35 11 32 -20 -15 30 5 -30 14 29 -15 -18 17 17 -18 -6 19
6991 19 0 -34 -6 18 -17 -15 16 -11 -27 -2 21 -14 -12 19 6 -21 0 10 -14 -21 24 17 -36 -1 30 -27 -32 27 3 -41 1 31 -14
7024 -14 -13 11 25 -18 -26 10 18 -30 -2 30 -19 -24 16 17 -29 -6 15 -6 -30 -3 19 -9 -26 25 7 -33 3 29 -17 -23 29 0 -20
7057 -20 9 22 -8 -4 17 11 -9 -5 14 -3 -3 7 12 -18 -7 20 -7 -11 8 13 -18 -12 10 1 -15 0 6 -15 -14 17 9 -31 -16 29 -15 -30
7093 -30 13 17 -20 7 27 10 -12 13 15 -13 -12 25 14 -18 6 26 -7 -11 18 7 -21 -6 15 -6 -23 -4 2 -21 -26 9 4 -26 -10 13
$$ packed form
6862A9ol8L5J1j8k5K7J7o5L0L9k5m5O7Qn8J4M1j8m0L8K9m5j3O1j4o9M4N9p6k2
6893c8O5j0n3L6K0l0k5M6J2n3J6M7k5n2N0J8l5j9N6j2l4RL5k5k4L7J0l8jN4l1
6924Fl5L9J9n3KN0k3k8M3Pm5jL2Qm7L0L2n0nM9k3l4K5J9l8j0M2Om8J1M1k0l0L1
6958BK5m5j5N4lo0L9M9n5k4N1Qn0J4M6l4l7M6K1n2NM5k5l5M4J5m4lL5%l5J2K5
6991A9j9l4K8K4l5KL1k7j6K5K3l5KL1j3k7K1J0k4pM5pn3L5L1n7nN9k4m4M2L0m5
7024a4JK4J4m3qL6Qm8K8L2m9nM0Jm6K3K1k1k4K7K2k8j7N1j8m0L6K6m6oN2k9k0
7057b0K9J3l0MK1ok0MJ9j7%J0Nl0J1K7k7mJ9Nl1OK2rj6J5Ok1JL1qm0J5M5m4j5
7093c0M3Ml7K7K0j7k2K5Kk8JL7j1l2K4K0l3mK9j1k8J5K1k1j7J9Ok3nL5nl0J6K3
$$ plain form
7127 13 -10 -19 7 0 -18 -1 0 -18 1 4 1 -3 4 3 0 -9 8 18 -9 2 17 5 -6 16 18 -5 -2 13 -1 -7 6 14 -19 -10 11 9 -18 4
7165 4 9 -16 -16 10 5 -19 -2 11 -1 -16 2 7 0 -14 5 15 -7 -17 21 1 -17 13 19 -6 -3 18 -2 -8 7 9 -2 -3 5 5 -3 -6 13 -7
7203 -7 -6 15 0 -20 -7 6 -6 -8 6 -7 -4 -14 -3 3 -6 -10 6 -5 -7 4 3 -14 8 17 -7 -1 13 2 -15 -3 -1 0 -7 9 15 -6 -7 12
7241 12 8 -11 4 9 -5 -6 7 1 -14 -12 18 2 -13 2 14 -12 -11 12 2 -23 11 11 -11 -7 5 0 0 3 9 22 5 -6 8 3 -2 3 6 -9
7279 -9 4 1 0 1 16 4 1 5 13 5 -19 -4 13 -17 -2 15 -11 -13 17 -5 -9 3 4 -7 1 3 -11 -17 -8 4 5 -5 -1 12 -1 -8 12 14 -6 -7
7319 -7 12 -4 3 3 10 1 -6 3 6 -8 -6 19 -7 -20 8 5 -17 -7 -5 -4 -14 11 -7 0 -7 -8 8 2 -6 8 6 -7 6 -3 -4 6 10 0 2 4 6 5 -2
7362 -2 6 9 2 -2 9 5 -9 11 -3 -8 -3 5 -5 -11 -2 -7 -14 -3 -2 1 -17 -8 9 -7 -8 7 -12 -15 2 13 -14 -1 11 -2 -19 -2 -1 0 -2 6 6 -1
7404 -1 7 3 -1 -15 -8 5 0 -5 2 -2 -2 -10 12 1 -2 6 9 -14 -15 -3 -5 -8 2 -3 -2 -15 -1 3 -23 1 -1 -6 -4 5 2 -5 10 10 -9 3 11 10 0 5 9 3
$$ packed form
7127A3k3rK6pj8J7Jj8J9LlmPjlrJ7J0k7J1J5j2j1K2Kk3LJ5j4oJ3Ql3RK1kk7K2
7165DNk5%K6nk4J7J3j2j5J8Npj4J9J0k2j0L8k0j8L0Ok5LK1k0oJ5Kj1jQ%qlJ9k0
7203gJK1j5k0J3J3j2kJ4j3Lj0J1OrmJ6j1kJ1jj7K2Rk4OJ4j1j7J2KJpJ6Ok1jJ9
7241A2mj9J5Nj4jJ3oj5KL0j6j5J5J2k6JK3j0k5L4%k2MJ2n%LOJ3j7j1J4nnNLj5
7279iJ3ljJJ5j2lMQqk4J5J7l0J5J7k6kL0k2mJ2Jj1QKj4oRJ2Jj0MJ3j3pK0Kk0j
7319gJ9j6P%PrpRLj4KK5k6j3K8lk2J0KJj0K5j8PpjJ6oqJ4kj3J3rjJ0Mj0KKKjp
7362bQLpmJ1mj4K0j4nNQj0oRnpJ1JLj8RJ7j6jJ5j9lJ7J1k7J3J2j3j7J7JJkQ%p
7404aQmmj4PJ3nnPm%qK2j1lQLk3jJ2klJ0nJj3J4Mk6K4knKRlpJ5%j9J2Qjj0NMo
$$ plain form
7450 3 1 6 -5 -6 -7 11 0 -13 -3 6 -8 -13 -8 -6 -11 -16 3 2 -20 5 9 -11 -13 9 -8 -22 0 5 -11 -9 10 4 -6 8 5 0 -3 8 11 -4 -1
7491 -1 4 5 2 0 3 -3 -2 -4 1 5 -5 6 -2 -3 -7 19 -15 -2 7 -11 -20 2 -8 -20 0 11 3 -11 2 1 -13 -7 10 -2 -1 10 10 -11 5 19 0
7532 0 -1 8 14 6 11 6 14 6 0 5 6 -15 -18 -3 -8 -19 4 -4 -12 0 0 -10 -5 15 5 -8 -1 12 2 -10 10 6 -4 11 15 -9 -3 12 3 -6 7 17
7574 17 4 2 0 5 5 6 7 10 -2 -4 18 11 -2 8 10 2 -5 12 -3 -6 2 -2 0 -17 3 -2 -13 -3 17 -3 -6 6 -10 -5 -2 -5 7 8 -1 19 10 3 5
7617 5 4 0 1 12 1 -7 7 0 0 3 8 -3 -4 8 -2 10 -4 4 -7 8 7 2 -4 -2 18 -16 -12 11 -5 -14 -3 -5 -3 -2 -5 1 11 1 17 13 -3 -5
7659 -5 14 3 0 4 0 4 -2 -1 -5 4 10 2 6 -8 7 -3 2 -5 2 -1 -1 -4 -7 -4 12 -5 5 5 -3 -9 6 3 -12 3 -4 4 9 -2 -1 5 5 -4 24 2 5 9 18
7706 18 5 11 4 11 11 7 4 7 2 2 9 -3 -7 -2 -6 -8 -6 -1 -13 5 -8 -22 -3 7 -7 -4 3 -4 -9 -5 4 -7 0 -11 15 -2 -7 21 6 -13 12 1
7748 1 -2 9 14 8 1 5 3 8 6 -5 4 -1 -12 9 9 -13 6 0 -17 -3 -1 0 -11 3 4 1 2 -1 7 2 -15 13 4 -4 11 9 -13 10 14 7 -6 4 11 7
$$ packed form
7450CkNj1jjJ8j1j3J0Rj4nNKnnJ9jk2K5Mk0kK2j7j4K2Nj6KJ9oj0J4lnlJ1Lj5L
7491aNJlkLoJkNMj0J1qjmK6l4J3Rj8rK2j0j2K0J1qj4J3jj4OJ7j2JJ1%k1J6J4j9
7532@jROqNnQqoNJk1lJ5nj1K3qqJ2%j0NK0j0j3PJ3j0j2K0mj0J5Mk4OJ5rrJ3J0
7574A7j3kkN%JJLj2kK2pj3J0KqpJ7j5lQmKj7K0nj1J0K0k0lJ2j6NLlJ2JrK0rpK
7617EjmJJ1j1qJ4p%LNj1jJ2j0J2j4Qj1J5jnoKK0l4MK3j6rJ1kKJlOJ0j0J6mj6k
7659eJ9j1lMmMoJmROqMj4J5j0NpPl%llLJ6j7J0%qoJ5lj5J5pQNj1JO%rK8k2LMR
7706A8j3OpP%mlLn%Pj2mNmkKNj2J8j3j4J9J0j4LPpnMRj1Pj1K6j7nK8j5j9K5j1
7748AlJ1NopMkNkj1Rnj1K1%k2J9oj7J4KJj1J4JlJlQnj7K8rqJ5kk2K3Mpj3J0Pm
$$ plain form
7792 7 -4 -4 -3 5 -12 9 -6 -9 7 13 -6 5 8 -9 5 -3 -3 -9 -2 -5 -11 -8 3 2 -16 -2 13 3 -11 13 4 -10 -6 8 2 -4 0 15 9 0 0 9
7834 9 13 -6 22 -3 -20 1 12 -11 -2 7 -13 -20 1 -2 -19 -3 0 -3 -8 -3 12 -7 -17 1 5 -15 6 11 -16 -6 10 6 1 8 11 2 -11 2 15
7873 15 -5 -5 16 5 -12 8 18 -1 -4 10 -2 -16 -1 3 -22 -7 -2 -4 -23 -11 10 -3 -26 3 0 -27 -18 24 -4 -16 4 2 -9 -13 11
7908 11 12 -7 -7 9 10 -6 1 20 -13 -1 14 7 -8 5 23 -10 -9 7 7 -15 9 6 -5 -7 11 -13 -26 8 14 -8 -25 0 -1 -6 5 16
7944 16 -13 -15 7 14 -10 -5 18 6 -17 16 16 -14 -1 16 -3 -12 16 16 -3 -12 18 10 -20 -6 10 -9 -25 7 18 -27 -10 18 -9 -20
7978 -20 -8 2 -16 -5 11 -3 -13 -1 8 -3 -11 11 6 -10 -2 19 -9 -12 16 10 -2 7 8 -9 -15 7 19 -1 -6 26 -2 -18 6 23 -6
8013 -6 -24 23 -5 -23 -3 11 -19 -19 5 0 -19 -4 18 -17 -26 10 7 -19 -16 25 -4 -23 -1 15 -10 -11 24 8 -26 -3 24 -4 -13 18
8047 18 15 -11 -3 15 2 -24 9 5 -22 -17 2 2 -26 -11 6 -12 -9 8 5 -18 -1 8 -18 -12 19 10 -21 2 20 -8 -7 20 9 -20 -5 25
$$ packed form
7792Gj1%JQj7K1j5lJ6Oj9J1Lj7J4q%oPloLJ1jj8J4J5j0j4K4rj4MJ4ooMJ5or%R
7834IMj9K8k5j7K1J1k3RRk0pK1lj7J6LlnNJ5j9j0J8Mk0K1Nk7J0J6mnPLrj3J3J3
7873A5k0%K1j1j7K0J0j9lJ4j2j4J5Mk5J5Nkj9J2K1j3k3K9lk7RM2k8j2K0kj1mK4
7908A1Jj9%J6Jj6PJ9l3J2J5pj5J3J8l3JJ6%k2K4lj1kJ8k4j3L4Ok2j7K5jnJ1J1
7944A6k9kK2Pk4NK3j2k3L3%l0J3J7j9rK8%j9rL0ql0J4J6j9j6L2J1m5J7K8k7j1
7978b0J2J0j8J1J6j4j0J2Rj1qK2nj6QK1k8lK8oj2RJj7oK2J2k0nL2k8j6K4J7k9
8013fj8M7k8j8K0J4l0%K4nj9J5K2l5rL6lk6LM1k9j9K2J6k5jL5j6l4K3K7k8rL1
8047A8lk6QJ8j3k6L3mk7NJ9%k8J5J7j8LJ7lk3J7Rk6OL1rl1K3J8k8JK7j1k9J5L0
$$ plain form
8083 25 7 -13 18 25 -19 -6 26 16 -12 1 33 -15 -19 24 17 -23 -11 18 -3 -24 4 14 -28 -7 16 -6 -22 9 21 -20 -18 20
8115 20 9 -32 4 23 -4 -10 16 8 -17 0 23 -7 -13 19 28 -15 -12 17 8 -1 11 24 -11 -2 9 -3 -17 13 6 -5 -13 6 1 -17 -6 22
8151 22 -8 -23 5 6 -25 -7 18 -2 -28 9 18 -20 -12 23 2 -26 3 25 -14 -20 27 14 -14 -6 27 -10 -34 7 13 -20 -7 10 9 -25
8185 -25 -3 9 -17 -22 14 7
$$ packed form
8083B5j8k0L1Pm4J3L2j0k8J3L2m8mM3pm0J2K9k1k1K8J0m2K1K3k2j6L1J2m1KL8
8115B0j1m1L6J9k7oK6qk5J7K3l0oL2Rm3LK9rrJ2J3l5RJ1j2j4L0pj1qJ9nj8J1K8
8151B2l0j5K8Jl1J8K5k0k6L7Rl8QL5k1k8K9K2l9oM7j3k8QL3l7k4M1Ol3J3J7jl4
8185b5K2J2k6nL6p
8191G
$$ Imaginary data points
##PAGE= N=2
##DATA TABLE= (X++(I..I)), XYDATA
$$ plain form
0 0 0 0 0 0 0 0 0 0 0 0 0 -8 8 -8 8 -16 16 -24 24 -32 40 -43 54 -64 73 -86 97 -113 130 -153 172 -196 225
33 225 -255 288 -323 361 -405 454 -506 563 -627 694 -771 854 -942 1037 -1146 1260 -1389
50 -1389 1530 -1685 1857 -2050 2264 -2507 2781 -3095 3462 -3893 4410 -5038 5829 -6856 8242
65 8242 -10231 13332 -18859 31598 -118981 62586 220436 -221694 -34369 184731 -71074
76 -71074 -93637 101819 -11772 -33171 23300 -17975 8411 28534 -44957 5528 31067 -12498
88 -12498 -10370 -11046 18972 37980 -75736 -5683 117676 -78941 -90022 159075 -15532 -154446
100 -154446 123625 57855 -154361 64988 81104 -119816 34051 74754 -102920 24530
110 24530 81216 -95246 -4991 95414 -57210 -48793 68087 11762 -49630 -9400 46518
$$ packed form
0@%%%%%%%%%%%qJ6j6J6k4L2m0M8n6P2q3R7j18J37j59J83k10K43k83L25l68M21
33B25m80N43o11O84p66Q59r60J069j190J321j465J625j796J979k183K406k649
50a389K919l215L542l907M314m771N288n876O557p355Q303r448J0867j2685J5098
65H242j8473K3563l2191N0457j50579J81567J57850m42130J87325K19100k55805
76g1074k2563J95456j13591k1399N6471m1275K6386K0123p3491N0485K5539m3565
88a2498K128o76L0018J9008j13716P0053J23359j96617j1081K49097j74607j38914
100a54446K78071o5770k12216K19349J6116k00920J53867M0703j77674J27450
110B4530N6686j76462R0255J00405j52624Q417J16880n6325o1392M0230N5918
$$ plain form
121 46518 16967 -72388 5343 93393 -60982 -68502 107658 -557 -98435 63728 33716
132 33716 -68929 32726 12935 -42737 52357 -11674 -66159 81619 13950 -107020 61385
143 61385 69214 -102313 -3020 87950 -40748 -46158 42629 19298 -25805 -21596 24344 29983
155 29983 -45170 -14955 62373 -23479 -47082 53993 1948 -46059 37290 2695 -35957 39500
167 39500 -4847 -43243 48766 5757 -57772 39042 26554 -53424 14754 30267 -30758 3715
179 3715 13613 -16481 13207 1034 -21716 21381 6860 -26492 11486 12429 -12117 383 -3762
192 -3762 6808 13939 -30015 541 45293 -34081 -32316 60687 -4593 -58441 39524 29465 -49065
205 -49065 2777 32869 -15689 -11298 7227 4614 5414 -14821 -4964 26559 -9632 -24815 24271
$$ packed form
121D6518k9551q9355P7731Q8050j54375p520J76160j08215r7878J62163l0012
132C3716j02645J01655j9791n5672R5094o4031n4485J47778o7669j20970J68405
143F1385P829j71527R9293R0970j28698n410Q8787k3331m5103M209M5940N639
155B9983p5153L0215P7328q5852k3603J01075n2045m8007Q3349l4595l8652P5457
167C9500m4347l8396R2009m3009o3529R6814j2488p9978O8178J5513o1025L4473
179C715R898l0094K9688j2173k2750M3097j4521l3352L7978R43k4546J2500m145
192c762J0570P131m3954L0556M4752p9374J765R3003o5280n3848R7965j0059p8530
205d9065N1842L0092m8558M391J8525k613Q00k0235R857L1523l6191j5183M9086
$$ plain form
218 24271 10005 -25632 4107 14958 -6066 -5972 -1636 9134 5576 -20370 3865 25178 -21838
231 -21838 -13836 32681 -8346 -25408 25348 4409 -24994 14756 9704 -19506 6900 10530 -13137
244 -13137 1046 8857 -5422 -2883 2872 2672 -844 -6862 4745 8249 -11962 -2414 15179 -6939
258 -6939 -10495 12080 1896 -9372 2768 3043 189 -707 -6437 5962 8249 -14853 -1716 19553
272 19553 -9712 -15697 18680 5736 -20452 4149 16283 -9620 -10740 11179 6803 -11924 -3644
285 -3644 13305 -835 -13474 6879 10067 -11602 -3428 11970 -3009 -8003 5809 3087 -4672
298 -4672 -707 2498 1293 -2355 -2222 4536 894 -6567 2811 5990 -6556 -2684 7982 -1393 -6944
313 -6944 4237 4959 -5791 -3201 7151 1220 -8713 2066 9189 -6711 -6840 10734 1656 -11734
$$ packed form
218B4271j4266l5637K9739J0851k1024R4M336J0770l558k5946K4235K1313m7016
231b1838Q002M6517m1027j7062N0756k0939k9403L9750n052k9210K6406L630k3667
244a3137J4183P811j4279K539N755k00l516o018J1607L504k0211R548J7593k2118
258f939l556K2575j0184j1268J2140K75k854q96n730J2399K287k3102J3137K1269
272A9553k9265n985L4377j2944k6188K4601J2134k5903j120K1919m376j8727Q280
285c644J6949j4140j2639K0353L188k1669Q174J5398j4979m994J3812k722p759
298d672L965L205j205l648J33O758l642p461R378L179j2546L872J0666r375n551
313f944J1181P22j0750K590J0352n931r933J0779P123j5900j29J7574r078j3390
$$ plain form
327 -11734 4282 9072 -8170 -4542 8845 777 -7497 1019 6360 -1767 -6261 3216 6185 -5877
341 -5877 -4496 8354 820 -8748 3203 6599 -5523 -3459 5506 1266 -4598 -613 4528 140
355 140 -5548 1855 6036 -5380 -4076 8285 -453 -8205 5232 4698 -7453 44 6179 -3150 -3215
370 -3215 3433 1278 -2284 -1407 2201 2247 -4022 -1223 6184 -2323 -5936 6549 2322 -8349 2768
385 2768 6332 -6034 -2203 5751 -803 -3488 905 2280 425 -3780 -56 6252 -3537 -6329 8377
400 8377 2188 -10535 4085 7816 -8190 -2129 7600 -2025 -3917 1987 1555 702 -3128 -1588 6876
415 6876 -1921 -8165 7798 4152 -11009 3003 8433 -7815 -2104 6927 -2472 -2238 1781 -816
429 -816 2324 -1254 -4221 6229 515 -8401 6269 4210 -9856 3654 6350 -8532 1555 6063
$$ packed form
327a1734J6016M790j7242L628J3387q068q274Q516N341q127m494R477K969j2062
341e877J381J2850p534r568J1951L396j2122K064Q965m240n864L985N141m388
355A40n688P403M181j1416J304J2361q738p752J3437n34j2151P497O135r329o5
370c215O648k155l562Q77L608M6o269K799P407q507l613J2485m227j0671J1117
385B768L564j2366L831P954o554k685M393J375j855m205L724O308r789k792J4706
400H377o189j2723J4620L731j6006O061R729r625j892N904m32q53l830J540Q464
415F876q797o244J5963l646j5161J4012N430j6248N711R031r399K34M019k597
429h16L140l578k967J0450n714q916J4670k059j4066J3510K696j4882J0087M508
$$ plain form
443 6063 -6959 1336 5228 -6613 1436 5046 -6110 1296 4171 -5423 2227 2738 -6047 4244
457 4244 2686 -8317 5162 4904 -9941 3125 6954 -7967 662 4966 -4761 2397 658 -5654
471 -5654 7713 -90 -11386 10726 5112 -16611 6956 11894 -14982 -434 12681 -7864 -3514
484 -3514 6708 -3060 576 891 -4936 6654 831 -10540 8006 5537 -12541 4174 7796 -9097
498 -9097 1660 4469 -6084 4706 590 -8297 9633 1413 -13804 10432 6611 -16130 6285
511 6285 9934 -13388 2720 8522 -10292 3081 6279 -10102 4501 6203 -10976 3903 7008
524 7008 -9551 2478 5129 -6912 4079 1257 -7544 8626 408 -11891 11047 3927 -15445
537 -15445 8580 8045 -14060 4238 7687 -9619 3714 3274 -8311 7860 1204 -12034 10810
$$ packed form
443F063j3022Q295L892j1841Q049L610j1156P406K875r594P650N11q785J0291
457D244j558j1003J3479k58j4845J3066L829j4921Q629M304r727P158j739o312
471e654J3367p803j1296K2112n614k1723K3567M938k6876J4548J3115k0545M350
484c514J0222r768L636L15n827J1590n823j1371J8546k469j8078J6715L622j6893
498i097J0757K809j0553J0790m116q887J7930q220j5217K4236l821k2741K2415
511F285L649k3322J6108N802j8814J3373L198j6381J4603J702j7179J4879L105
524G008j6559J2029K651j2041J0991k822q801J6170q218j2299K2938p120j9372
537a5445K4025n35k2105J8298L449j7306J3333m40j1585J6171o656j3238K2844
$$ plain form
550 10810 4405 -15825 8224 8896 -14142 3176 8414 -8713 2314 3059 -6649 7042 -66 -10398
564 -10398 11015 2602 -14863 9367 7197 -14257 4873 7698 -9938 3339 3879 -7619 6275
577 6275 1076 -9511 9276 2071 -12330 8758 4478 -12043 6610 4398 -9844 6470 1979
590 1979 -9392 9047 1041 -11973 10703 3505 -14404 8564 6554 -13065 5139 6354 -9705
603 -9705 4276 3582 -8284 6195 2164 -9615 7310 3549 -10429 5385 4498 -8012 3775
616 3775 2062 -5364 5616 -1486 -6157 9590 -2101 -9941 11630 1050 -12993 9505 4478
629 4478 -12158 6299 4837 -9636 5196 3220 -8424 6024 2358 -9029 6534 3357 -9528
642 -9528 4799 4295 -7403 3004 2605 -4746 3691 -429 -4209 6409 -2054 -6148 8693 -940
$$ packed form
550A0810o405k0230K4049O72k3038J7318N238j7127J1027P45r708J3691p108j0332
564a0398K1413q413j7465K4230k170k1454J9130K825j7636J3277N40j1498J3894
577F275n199j0587J8787p205j4401K1088m280j6521J8653k212j4242J6314m491
590A979j1371J8439q006j3014K2676p198j7909K2968k010j9619J8204J215j6059
603i705J3981o94j1866J4479m031j1779J6925l761j3978J5814q87j2510J1787
616C775j713p426J0980p102m671J5747j1691p840K1571j0580j4043K2498n027
629D478j6636J8457j462j4473J4832j976j1644J4448l666j1387J5563l177j2885
642i528J4327n04j1698J0407l99p351Q437m120l780J0618q463m094J4841r633
$$ plain form
656 -940 -8567 8270 1147 -8730 6811 1658 -7938 6346 1430 -7907 6417 1883 -8345 5840
670 5840 3132 -8201 3890 3807 -6219 2308 2532 -4147 2535 595 -3415 3782 -690 -3814 5111
685 5111 -829 -4862 5456 -275 -5158 5322 -165 -5268 5567 -55 -5844 5674 653 -6451
699 -6451 5247 1826 -6665 3811 2829 -5552 2239 2549 -3965 1674 1516 -2909 1864 522 -2428
714 -2428 2417 -138 -2443 2805 -451 -2438 3187 -824 -2643 3775 -900 -3297 4164 -400 -4043
729 -4043 4120 508 -4628 3398 1605 -4515 2180 2252 -3683 1049 2159 -2583 459 1503 -1645 506
745 506 742 -1278 812 296 -1179 1026 43 -1021 1220 -372 -969 1678 -705 -1326 2269 -603 -2086
762 -2086 2565 90 -2807 2163 1122 -2881 1162 1684 -2275 310 1597 -1524 -32 1208 -1045
$$ packed form
656i40p627J6837p123r877J5541n153r596J4284m916r337J4324m534j0228J4185
670E840k708j1333J2091q3j0026Q527K24o679O682j940m010P197m472l124Q925
685E111n940m033J0318n731m883J0480n487n103J0835n622n789J1518n021p104
699f451J1698l421q491J0476r82q381P791L10o514N639j58m425M773j342k950
714b428M845k555k305N248l256j987N625m011j819O418m675k397P461m564l643
729d043Q163l612n136Q026j793o120O695P2n935M732J110m742L042J044l148K151
745E06K36k020K090n16j475K205r83j064K241j592n97K647k383o21L595k872j483
762b086M651k475k897M970j041m003M043N22l959K585J287l121J492J240k253
$$ plain form
777 -1045 -18 893 -928 28 883 -764 -192 721 -360 -172 264 -183 228 -80 -423 674 -12 -974
795 -974 826 552 -1303 353 1001 -1023 -99 956 -677 -238 786 -494 -195 613 -495 -85 661
812 661 -539 -216 680 -366 -216 488 -378 -48 494 -514 -18 607 -648 -57 837 -693 -350 1008
830 1008 -442 -592 890 -221 -627 807 -55 -726 644 169 -691 404 330 -618 74 535 -250 -411
848 -411 296 412 -444 -359 749 12 -945 618 668 -1160 43 1164 -788 -563 1052 -270 -711 754
866 754 3 -676 520 167 -607 364 257 -662 250 613 -739 -249 1022 -346 -950 1010 429 -1425
884 -1425 477 1275 -1361 -504 1691 -542 -1285 1264 411 -1332 390 884 -755 -409 709 127 -650
901 -650 -1 667 -306 -576 685 101 -828 550 339 -854 477 333 -921 729 345 -1414 991 853
$$ packed form
777a045J027R11j821R56Q55j647N72R13j081J88M36m47M11l08l43J097o86r62
795i74J800k74j855J656O48k024R24J055j633M39J024j280K99Q08j108M10P46
812F61j200L23Q96j046J50P04q66L30N42j008M96O25j255N91Q94j530L43J358
830A008j450j50J482j111m06J434q62o71J370m75q60J095p4r48O92M61p85j61
848d11P07J16q56Q5J108p37r57J563N0j828J203J121j952K25J615j322m41J465
866G54p51o79J196l53p74R71j07r19R12L63j352M90J271j368o04J960n81j854
884a425J902P98k636Q57K195k233p43K549q53j743J722M94j639L46J118n82p77
901f50O49O68r73k70J261n84r29J378k11j193J331j44j254J650l84j759K405j38
$$ plain form
919 853 -2010 735 1693 -2185 -75 2343 -1592 -1094 2141 -412 -1358 985 301 -479 -90 -85 782 -325
937 -325 -1211 1545 386 -2260 1319 1383 -2451 607 1736 -2036 279 1494 -1785 485 1235 -1999
953 -1999 895 1412 -2577 865 2088 -2773 236 2506 -2330 -329 2377 -1695 -547 1816 -1120
968 -1120 -220 980 -1026 631 347 -1567 1712 251 -2778 2536 1217 -4196 2105 2866 -4419 570
984 570 3672 -3266 -618 2963 -1898 -312 1489 -1803 1157 1060 -3166 1866 2278 -4085 789 3459
1000 3459 -3224 -731 2926 -1328 -716 713 -539 1524 -993 -2333 3960 -46 -5102 4095 2597
1015 2597 -6298 2082 4475 -5174 -12 4234 -3368 -411 3001 -2730 232 2478 -2909 371 2495
1030 2495 -2640 180 2003 -2070 589 1033 -2083 1670 544 -2936 2478 969 -3698 2444 1313
$$ packed form
919H53k863K745R58l878K110K418l935M98L235k553r46K343o84p80L89NQ67j107
937c25q86K756j159k646L579O4l834L058J129l772K315J215l279K270P50l234
953a999K894N17l989L442J223m861L009K270m836K001K706m072J148K363k936
968a120R00J200k006J657k84j914L279j461l029N314j319n413O301P61p285M989
984E70L102o938K648L581m861J586J801l292K960r7m226N032M12o363M874K670
1000C459o683K493L657m254O12J429j252K063k517j340O293m006n056R197j498
1015B597q895Q380K393r649N162M246p602K957L412n731K962K246n387L280K124
1030B495n135K820J823m073K659M44l116L753j126l480N414j509m667O142j131
$$ plain form
1045 1313 -3725 2585 990 -4085 3540 1139 -5641 4154 3001 -7385 2612 5888 -6819 -1051
1059 -1051 6813 -3108 -3624 3884 774 -2210 -581 1106 2013 -2437 -2164 4735 -364 -5088 3682 2312
1075 2312 -4626 1391 2005 -2542 1746 -299 -2691 4447 -703 -5739 5875 2300 -8421 3581
1089 3581 6018 -7464 -558 6703 -3746 -2722 4258 -736 -1933 1343 -39 68 -196 -644 1461
1104 1461 -797 -1090 2574 -1692 -1851 4490 -1925 -4149 5994 -21 -6720 5089 3028 -7022 2209
1119 2209 4351 -4807 348 2901 -2968 1345 1404 -3926 2614 2708 -5467 928 5176 -3891 -2749 4513
1135 4513 788 -3810 -452 3906 434 -5348 1375 6409 -5123 -4612 8400 -162 -8264 5126
1149 5126 4262 -6826 816 4307 -3273 -67 1689 -2201 1910 752 -3947 2650 2635 -4871 544
$$ packed form
1045A313n038O310j595n075P625k401o780R795j153j0386R997L276j2707N768
1059a051P864r921n16P508l110k984J629J687R07m450K73O899n099m724Q770j370
1075B312o938O017O14m547M288k045k392P138n150n036J1614l575j0721J2002
1089C581K437j3482O906P261j0449J024O980m994j197L276j382J07k64m48K105
1104A461k258k93L664m266j59O341o415k224J0143o015o699J1809k061j0050R231
1119B209K142r158N155K553n869M313N9n330O540R4q175O395M248r067J142P262
1135D513l725m598L358M358l472n782O723N034j1532N11J3012q562q102J3390
1149E126q64j1088P642L491p580L206J756l890M111j158m699O597j5p506N415
$$ plain form
1164 544 4242 -2914 -1925 2936 208 -1725 -196 1260 729 -2109 -34 2810 -2044 -1538 3590 -1609
1180 -1609 -2449 4240 -1289 -3843 5099 166 -5990 4426 3251 -6764 1137 5628 -4163 -2502 4383
1195 4383 25 -2860 407 1719 381 -2131 -540 3254 -701 -3517 2365 2315 -2968 -808 2203
1210 2203 469 -1376 -1493 2060 2249 -4265 -947 6229 -2437 -5853 6034 2682 -7443 1541 5875
1225 5875 -4309 -2646 4528 17 -3090 860 1759 -541 -1516 405 1774 -1125 -1409 1958 80
1240 80 -1794 1253 415 -1405 1061 158 -1298 1321 70 -1602 1410 325 -1663 1294 247 -1679
1256 -1679 1712 214 -2537 2042 1427 -3463 829 3141 -2708 -1640 3339 147 -3002 656 2705
1271 2705 -1085 -2838 1951 2789 -3439 -1700 4716 -539 -4692 2887 3054 -4088 -818 3683 -719
$$ packed form
1164E44L698p156R89M861k728j933J529J456n31k838K075K844m854N06N128n199
1180a609q40O689n529k554Q942m933o156J0416j175j0015P901M491r791J661O885
1195D383m358k885L267J312j338k512J591L794l955k816N882n0n283K160L011
1210B203j734j845j17L553J89o514L318P176q666l416J1887l352j0125Q984M334
1225E875j0184J663P174m511l107L950Q99k300r75J921J369k899k84L367j878
1240H0j874L047q38j820K466r03j456K619j251j672L012j085j988K957j047j926
1256a679L391j498k751M579o15m890M292K312n849J068M979l192l149L658K049
1271B705l790j753M789Q38o228J739O416n255m153P579J67p142L270M501m402
$$ plain form
1286 -719 -2448 933 1607 -509 -1823 560 2401 -1626 -2362 3036 1112 -3733 692 3191 -2032 -1884
1302 -1884 2329 772 -2003 -330 1857 170 -2199 478 2467 -1772 -1825 2996 159 -3101 1765
1317 1765 1839 -2751 35 2351 -1344 -1141 1525 185 -1063 -36 834 216 -1230 69 1738 -1137
1333 -1137 -1556 2286 377 -2690 1114 1997 -2049 -845 2048 39 -1670 159 1660 -278 -2098
1348 -2098 1028 2328 -2383 -1579 3549 -128 -3619 1952 2493 -2891 -925 2745 -101 -2132 353
1363 353 1922 -430 -2203 1064 2353 -2272 -1628 3271 16 -3318 1596 2277 -2434 -961 2324 97
1379 97 -1943 161 1885 -518 -2104 1414 1843 -2572 -636 3117 -1146 -2398 2447 802 -2496 662
1395 662 1559 -1123 -621 800 432 -558 -755 1032 730 -1907 179 2232 -1612 -1476 2531 -9 -2411
$$ packed form
1286g19j729L381O74k116j314K383J841m027p36N398j924m845M425K499n223J48
1302a884M213j557k775J673K187j687k369K677J989m239n3M821k837l260M866
1317A765P4m590K786K316l695K03K666j340j248J027Q70o18j446J299J669k875
1333a137m19L842j909l067L804Q83m046J204K893k009j709J829J501j938j820
1348b098L126J300m711Q04N128l677l491N571N41n384J966L670k846k031K485
1363C53J569k352j773L267J289m625O44M899l255l334M914O81m711J473L285k227
1379I7k040K104J724k403j586L518M29m415J936L753m263j252M845j645l298L158
1395F62Q97k682N02J421l68r90j97J787l02k637K086K053l844J36M007k540k402
$$ plain form
1412 -2411 1164 1555 -1494 -899 1321 840 -1505 -935 2306 281 -3102 1312 2846 -3080 -1257 3785
1428 3785 -854 -3000 2219 1423 -2244 -253 1570 71 -1218 -334 1674 12 -2275 1172 2036 -2441
1444 -2441 -702 2752 -866 -1839 1552 603 -1148 -136 507 571 -730 -981 1777 245 -2576 1516
1460 1516 1926 -3090 116 3120 -2290 -1523 3107 -512 -2352 1593 1038 -1428 -435 965 713 -1212
1476 -1212 -922 2224 84 -2894 1625 2246 -2976 -473 2944 -1101 -1670 1403 523 -561 -613 -30 1688
1493 1688 -751 -2355 2618 1365 -4033 975 3608 -3154 -1602 3650 -570 -2549 1466 1151 -1076
1508 -1076 -746 587 1194 -1058 -1320 2149 212 -2566 1609 1409 -2598 731 1807 -2123 173 1714
1524 1714 -1631 -24 1380 -1231 91 854 -1104 667 493 -1709 1299 1036 -2652 889 2310 -2562
$$ packed form
1412b411L575L91l049N95K220m81k345N70L241k025l383M414J534n926J823N042
1428C785m639k146N219p96l667J991J823j499j289Q84K008j662k287L447Q64m477
1444b441J739L454l618r73L391r49j751J012O43O4j301k51K758j532k821M092
1460A516M10n016L206L004n410P67M630l619j840L945n55k466R93J400k52j925
1476a212K90L146k140k978M519O21n222K503L417m045n69L073q80j084n2N83J718
1493A688k439j604M973j253n398N008K633o762J552N252m220j979M015l15k227
1508a076L30J333O07k252k62L469j937k778M175k00m007L329J076l930K296J541
1524A714l345J607J404k611J322P63j958J771j74k202L008k63l688L541J421m872
$$ plain form
1540 -2562 -645 2724 -919 -1766 1250 931 -777 -1195 777 1951 -2031 -1834 3766 1 -4360 2620
1556 2620 2952 -4256 -327 3850 -1652 -2007 1817 547 -670 -628 -89 1736 -622 -2290 2253 1331
1572 1331 -3227 576 2612 -1876 -1019 1683 -65 -628 -214 100 1088 -876 -1207 2119 -137 -2354
1588 -2354 1922 895 -2608 1277 1369 -2428 862 1602 -2339 358 2004 -1851 -504 1825 -659 -827
1604 -827 595 222 210 -753 -391 1844 -636 -2136 2197 1054 -2894 646 2191 -1537 -827 1076 254
1621 254 -74 -1053 21 2274 -1457 -2420 3385 789 -4231 1620 3232 -3230 -1199 3180 -441 -2058
1637 -2058 786 1186 -365 -1257 247 1743 -1013 -1608 1994 507 -2148 834 1169 -1250 169 475
1653 475 -554 720 -304 -988 1525 -31 -1817 1486 752 -2006 851 1044 -1646 574 972 -1536
$$ packed form
1540b562J917L369l643q47L016l19j708m18J972J174l982J97N600l765m361O980
1556B620L32p208L929M177n502l55L824j270j217M2N39J825k358j668M543r22
1572A331m558L803K036m488Q57K702j748n63M14L14R88j964l31L326k256k217
1588b354M276j027l503L885R2l797L290P40l941K697J646l855J347K329k484j68
1604h27J422l73j2r63L62K235k480j500M333j143l948L540J545l728P10J903q22
1621B54l28r79J074K253l731r63N805k596n020N851J612o462K031M379l621j617
1637b058K844M00j551q92J504J496k756n95L602j487k655K982L35k419J419L06
1653D75j029J274j024o84K513j556j786L303p34k758K857J93k690K220L98k508
$$ plain form
1669 -1536 521 1145 -1590 38 1504 -984 -762 1061 274 -767 -469 878 754 -1641 -304 2400
1685 2400 -1023 -2214 2413 880 -2787 750 1945 -1487 -655 1035 50 -105 -525 -155 1435 -644
1701 -644 -1693 1861 858 -2484 505 2062 -1433 -1114 1472 395 -1092 -318 964 436 -1393 -93
1717 -93 1759 -890 -1415 1807 271 -1845 938 870 -1364 387 700 -930 388 482 -919 423 569
1734 569 -856 241 549 -568 121 207 -359 434 -62 -616 711 163 -916 444 518 -596 -15 204
1752 204 19 170 -614 51 1118 -939 -881 1787 -140 -1908 1286 1100 -1808 27 1463 -685 -735
1769 -735 614 320 -265 -453 222 760 -647 -664 1122 105 -1143 561 681 -715 -132 380 38 -62
1787 -62 -389 217 675 -808 -379 1240 -444 -1021 1152 140 -1185 699 469 -948 342 481 -646
$$ packed form
1669a536K057O24k735J628J466k488K22J823p87j041K98J347j24k395J337K704
1685B400l423j191M627j533l667L537J195l432Q32J690r85j55m20L70J590k079
1701f44j049L554j003l342K989J557l495L19K586j077j487P74J282n28j829J300
1717i3J852k649n25L222j536k116K783o8k234J751L13j630J318R4j401J342J46
1734E69j425J097L08j117O89Q6n66P93m96n54J327n48j079J360P4j114N81K19
1752B04j85J51p84O65J067k057N8K668j927j768L194j86k908J835J436k148n0
1769g35J349k94n85j88O75N38j407j7J786j017j248J704J20j396N83N12l42j00
1787f2l27O06M58j483M29J619j684n77K173j012j325J884k30j417J290J39j127
$$ plain form
1804 -646 185 321 -448 140 195 -236 129 -59 -92 333 -307 -200 601 -290 -421 661 -95 -527 480 47
1824 47 -303 289 -205 -19 492 -630 -156 1003 -632 -683 1234 -157 -1163 892 482 -1032 179 629
1842 629 -377 -205 113 153 73 -429 130 555 -596 -250 795 -303 -470 580 -81 -289 356 -252 -35
1861 -35 463 -521 -35 759 -651 -285 972 -476 -590 913 -185 -662 682 -28 -548 449 25 -350
1879 -350 310 -88 -153 274 -262 -8 340 -438 54 496 -607 -41 713 -588 -226 758 -442 -306 651
1898 651 -351 -206 542 -431 -61 640 -604 -151 864 -552 -407 875 -271 -500 604 -71 -305 307
1916 307 -136 21 229 -429 205 422 -686 127 645 -704 -38 715 -626 -110 680 -570 -83 644 -613
1935 -613 -54 721 -637 -154 794 -545 -277 717 -384 -265 587 -303 -163 468 -352 -48 438 -418 8
$$ packed form
1804f46Q31J36p69N88N5m31L65j88l3M25o40J07Q01q91j31J082p56m32J007m33
1824D7l50N92m94J86N11j122M74J159j635n1J917j391j006K055m10j514J211M50
1842F29j006J72L18M0q0n02N59M25j151L46J045j098j67J050o61k08O45o08K17
1861c5M98r84M86P94j410L66J257j448j14J503j098m77J344p10n20R97m24l75
1879c50O60l98o5M27n36K54L48p78M92M42j103N66P54j301L62R84j200J36R57
1898F51j002J45P48r73L70P01j244M53J015j416J45J282j146k29J104o75k34O12
1916C07m43J57K08o58O34K17j108Q13N18j349O66P53j341N16P90j250M87P27j257
1935f13N59P75j358M83R48j339K68R94j101J19Q52q90J40O31q20L04M86q56M26
$$ plain form
1954 8 414 -462 101 361 -576 236 435 -781 246 655 -864 86 807 -782 -122 812 -591 -187 667
1973 667 -512 -108 578 -520 -51 575 -518 -51 551 -469 -53 477 -408 39 342 -459 216 322 -636
1992 -636 323 482 -794 240 672 -805 37 720 -642 -87 603 -503 -10 485 -557 71 518 -586
2010 -586 42 525 -556 23 480 -495 71 371 -538 207 371 -683 271 516 -761 168 625 -710 52
2029 52 644 -602 -26 571 -486 -7 467 -453 47 397 -425 73 327 -426 153 250 -469 256 213 -570
2049 -570 358 282 -728 375 444 -806 231 563 -741 95 574 -635 35 561 -561 9 536 -501
2067 -501 -52 522 -382 -103 403 -242 -41 191 -202 139 56 -305 348 55 -512 464 170 -699 421 358
2087 358 -759 303 474 -716 165 510 -625 70 491 -541 34 465 -482 -12 434 -391 -49 365
$$ packed form
1954HM06q76N63K60r37Q12J99j216J027M09j519R50P21j589O60R34j403M04Q54
1973F67j179M04O86j098M69O26j093M67O02j020M16N30q85M47L03q01O75J06r58
1992f36R59J59j276J034M32j477Q42O83j362N55O90j106M93M95j042O28M47j104
2010e86O28M83j081N79M57r75N66L00r09P45J64j054R54K45j277R29M57j335P62
2029E2N92j246N76N97j057M79M74r20N00L50q22M98K54p53N79R7p19P25m3p83
2049e70R28p6j010J103O9j250J037L32j304Q36M79j209O70N26j122N70N27j037
2067e01M49N74r04K79N06o45K01K32l93L41q3l61O53k93n67R76k94q69J120o3
2087C58j117J062J71j190Q81L45j135O95M21j032N75M31r47M70M46q25L42M14
$$ plain form
2105 365 -297 -25 253 -248 53 162 -221 150 90 -302 254 101 -419 297 190 -506 289 299 -539 191 354
2126 354 -477 131 323 -446 122 317 -446 113 339 -437 76 340 -403 29 330 -323 8 273 -296 34
2146 34 236 -298 36 241 -259 31 189 -216 68 126 -187 147 64 -265 242 94 -380 270 195 -429 204
2167 204 253 -420 135 284 -389 108 296 -403 94 348 -436 -11 443 -329 -162 389 -145 -203 215 -22 -93
2188 -93 30 -28 91 -24 -176 204 67 -264 184 104 -273 192 102 -314 254 114 -426 294 255 -555 174 471
2210 471 -481 -76 521 -250 -226 359 -54 -184 149 -7 -41 34 -82 54 55 -134 61 52 -128 103 -8 -152
2232 -152 202 -25 -264 311 51 -430 305 251 -483 128 368 -392 -22 352 -247 -48 268 -187 -38 206
2252 206 -162 -35 187 -106 -60 87 -27 30 -49 -65 200 -80 -247 280 51 -379 211 205 -344 48 195 -207
$$ packed form
2105C65o62K72K78n01L01J09l83L71o0l92N56j53n20P16j07o96P95J0q38P30J63
2126C54q31O08J92p69N68J95p63N59K26p76N13K64p43M32L01o53L31K65n69L30
2146C4K02n34L34K05n00K90J58m05K84N8l13L34q3l29N07j48m74O50p5o24O33
2167B04M9o73N55J49o73M97J88o99M97K54p84M25M54p72J67N51n34n8M18k37p1
2188i3J23n8J19j15j52L80j37l31M48q0l77M65r0m16N68j40n40P20l9q10P29K97
2210D71r52M05N97p71K4N85m13j30L33j56l4P5j16J36Jj89J95rj80K31j11j44
2232a52L54k27k39N75k60m81P35n4p34O11K40p60L70L74n99J99L16m55J49K44
2252B06l68J27K22k93M6J47j14N7p9j6K65k80j67N27k29m30N90on49L92J47m02
$$ plain form
2274 -207 30 71 -164 157 28 -273 228 121 -362 155 265 -307 -21 268 -127 -81 78 8 70 -91 -98 272
2296 272 -78 -296 306 107 -402 161 233 -286 -2 167 -120 8 11 -79 129 -54 -156 219 -38 -245 233
2317 233 25 -267 192 65 -264 181 74 -244 148 84 -200 136 48 -157 153 9 -163 203 -22 -225 253
2338 253 20 -280 202 121 -275 76 137 -122 -4 -4 12 85 -197 0 324 -270 -229 467 -85 -438 345 156
2360 156 -381 93 194 -157 -18 -2 37 133 -227 -37 369 -228 -257 439 -42 -390 288 141 -280 87 111 -84
2382 -84 37 -83 28 177 -237 -54 332 -240 -190 391 -133 -297 316 -14 -257 194 5 -143 128 -73 -58
2403 -58 143 -180 13 251 -305 -53 426 -326 -229 518 -141 -397 405 82 -355 139 138 -90 -24 -71 130 109
2425 109 -338 97 396 -414 -153 521 -190 -338 330 41 -230 69 -16 67 23 -301 209 260 -532 49 573
$$ packed form
2274b07K37M1k35L21j29l01N01j07m83N17J10n72K86K89l95M6J59p0O2j61pL70
2296B72l50k18O02j99n09N63P2n19K84J69k87J28Lr0K08j83j02L75k57k07M78
2317B33k08k92M59j27l29M45j07l18L92o4k84L36q8k05L10j44j72L66k25k03M78
2338B53k33l00M82q1l96L51O1k59J18%J6P3k82J97L24n94M1O96n52l53P83j89
2360A56n37M74J01l51J39J6L9R6l60J90M06n97k9O96m81l48O78j47m21L67K4j95
2382h4J21j20J11J49m14J83L86n72N0N81n24j64O13l30k43M51j89j48K71k01J5
2403e8K01l23J93K38n56K52M79p52R7P47o59k56Q02l23m37M94jk28O6m7K01k1
2425A09m47M35K99q10K61O74p11j48O68k89k71K99q5Q3m4l24N10N1p92N81N24
$$ plain form
2446 573 -473 -281 627 -154 -430 391 67 -301 121 68 -64 30 -100 117 98 -284 132 255 -372 54 369
2467 369 -372 -73 430 -269 -188 353 -128 -144 181 -123 32 131 -306 173 277 -515 61 545 -471 -259 622
2488 622 -151 -447 327 169 -244 -73 113 197 -189 -286 469 124 -656 297 564 -637 -115 647 -287 -328 382
2509 382 -13 -148 87 -104 139 83 -378 178 322 -482 4 453 -349 -170 388 -165 -177 219 -70 -66 90
2530 90 -104 87 16 -218 256 51 -409 350 234 -623 250 527 -627 -74 675 -355 -369 494 35 -327
2550 -327 65 132 82 -177 -200 412 62 -601 292 472 -578 -152 563 -146 -355 155 172 -13 -258 -57 503
2571 503 -185 -598 595 335 -860 190 733 -601 -279 635 -133 -360 248 81 -101 -5 -45 160 19
2590 19 -248 218 126 -321 164 182 -308 137 190 -334 123 243 -320 35 236 -225 11 81 -166 179 -20 -338
$$ packed form
2446E73j046J92R08p81k76Q21l24l68M22n3j32R4j30K17j9l82M16J23o27M26L15
2467C69p41K99N03o99Q1N41m81j6L25l04J55R9m37M79J04p92N76M84j016K12Q81
2488F22p73k96P74j58m13J71J86Q4l86r7P55l45p80R53K67j201N22P62r34m1P10
2509C82l95j35K35j91K43n6m61N56J44q04M86M49q02J79N58n53j2L96k89MJ56
2530I0j94J91p1k34M74k05m60P59j16q57Q73K77j154N53P49j030j4Q63m59l62
2550c27L92O7n0k59k3O12l50o63Q93J80j050M26P15p09k09N10J7j85k45K01N60
2571E03o88m13J193k60j195J050N43j334L22R14p68k27O08j67j82R6m0K05j41
2590A9k67M66r2m47M85J8m90M45N3n24M57J20n63L55K01m61K36P0k47L45j99l18
$$ plain form
2612 -338 385 139 -633 293 532 -633 -171 676 -179 -485 287 315 -236 -295 255 386 -445 -307 724 15
2632 15 -794 414 566 -676 -149 581 -140 -339 139 149 29 -218 -110 442 -84 -549 409 342 -631 -5
2652 -5 525 -294 -271 304 31 -163 -28 53 115 -135 -117 282 -74 -263 311 2 -340 346 109 -455 287 298
2674 298 -496 81 443 -318 -185 338 13 -196 -44 135 148 -258 -159 466 -45 -547 344 377 -533 -122 480
2695 480 -80 -345 53 319 -6 -432 113 551 -394 -497 720 169 -830 272 650 -542 -282 555 35
2714 35 -373 55 268 21 -277 40 362 -166 -302 367 95 -385 153 210 -232 -13 115 -85 37 -9 -70
2735 -70 126 -67 -126 206 -75 -192 263 -26 -294 306 92 -410 206 302 -388 -72 394 -68 -263 127 238
2756 238 -111 -269 223 311 -400 -170 585 -87 -555 365 354 -486 -89 400 -34 -267 14 247 36 -366 49
$$ packed form
2612c38P23k46p72R26K39j165M62Q47q55l06P72K8n51n9N50J31q31J38J031p09
2632A5q09J208J52j242N27P30p21j99M78J0j20k47J08N52n26m65R58o7r73O26
2652eN30q19K3N75k73j94J35Q1O2k50J8L99l56j89N74l09l42O86k37n64P42J1
2674B98p94N77L62p61J33N23l25k09J52J79J3m06R9O25n11n02Q91L3r10M11O02
2695D80n60k65L98K66l25m26N45M38r45j03J217n51r99J102L78j192K60Q37n20
2714C5m08M28K13k47k98L17L22n28j36O69k72m80N38N7m42K19J28k00J22m6o1
2735g0J96j93n9L32k81j17M55k89k68O00k14n02O16R6o90L16M66m62j95L90J11
2756B38l49j58M92Q8p11K30P55o72m68R20j1q40L97M89m34k33K81K33k11m02M15
$$ plain form
2777 49 457 -290 -393 522 134 -575 154 413 -304 -220 308 93 -225 -70 245 79 -311 47 351 -251 -224
2798 -224 393 -14 -329 238 150 -264 78 156 -140 16 63 -36 24 -47 13 113 -165 -43 264 -157 -218 328 17
2821 17 -360 188 205 -280 -76 230 3 -204 -38 248 16 -354 136 394 -365 -222 526 -48 -483 287 291
2842 291 -349 -79 286 33 -189 -46 239 66 -345 85 382 -306 -253 435 16 -413 189 243 -243 -90 165
2863 165 42 -121 -83 158 58 -274 71 277 -258 -133 346 -92 -252 274 60 -237 114 112 -118 -1 55
2884 55 41 5 -114 94 145 -237 10 313 -215 -208 357 -9 -330 189 173 -220 -56 147 44 -140 -91 223 47
2907 47 -346 124 332 -348 -174 425 -78 -343 233 159 -214 -24 125 62 -81 -121 177 131 -310 25 356 -222
2929 -222 -204 366 0 -301 165 142 -164 -41 100 48 -89 -79 156 32 -251 105 215 -295 -39 320 -203
$$ packed form
2777D9M08p47j03R15l88p09P29K59p17Q4N28k15l18J55L15j66l90L58L04o02K7
2798b24O17m07l15N67q8m14L42P8k96J56M7r9O0p1O0J00k78J22L07m21o1N46l11
2821A7l77N48J7m85K04L06k27k07J66K86k32l70M90K58p59J43P48n74m35P70M
2842B91o40K70L65k53k22J43K85j73m11M30K97o88N3O88m19m29O02N4m86J53K55
2863A65j23j63L8K41j00l32L45K06n35J25M79m38j60N26k14k97L51kk30J17N6
2884E5j4l6j19K08N1l82K47L03n28PN65l66l21N19j6l93J64K03j03j84M9L14j76
2907D7l93M70K08o80J74N99n03k65N76p4l73J90J49o3j43m0K98m6m41L35L31n78
2929b22J8N70l66l01M66k3l06J23J41n2j37J0K35j24k83L56J10n10K56L59n23
$$ plain form
2950 -203 -176 304 -59 -236 181 53 -160 60 37 -3 4 -92 86 116 -210 10 269 -185 -143 302 1 -227 120
2973 120 137 -89 -101 62 161 -105 -214 265 148 -418 93 402 -359 -205 442 -88 -349 233 124 -219 -9
2994 -9 83 4 -34 -90 74 102 -181 8 203 -133 -87 177 -28 -74 97 -24 19 37 -73 85 62 -158 102 143
3018 143 -224 70 252 -261 -30 327 -201 -181 324 -44 -274 190 111 -198 -19 114 24 -111 -65 189 15
3039 15 -276 138 223 -285 -79 289 -102 -168 156 37 -41 -8 -32 147 36 -246 158 255 -336 -48 392 -165
3061 -165 -244 290 49 -227 60 107 -41 -52 -13 104 -15 -172 105 117 -200 28 156 -177 -14 147 -149 1
3083 1 150 -141 -32 165 -108 -65 146 -61 -30 86 -69 52 92 -162 44 177 -190 -48 237 -79 -141 136
3105 136 61 -62 -27 21 126 -65 -187 213 110 -344 72 306 -267 -142 302 -40 -207 110 71 -47 -39 -38 132
$$ packed form
2950b03K7M80l63j77M17j28k13K20k3m0Pr6J78L0l26K20K59m54M2M45l01k28L47
2973A20J7k26j2J63R9k66j09M79j17n66N11L09p61J54O47n30k61N82j09l43K10
2994iR2p9l8n6J64K8k83J89J95l36M6K64k05m6J71j21M3J8j10J58k3k20K60M1
3018A43l67K94J82n13K31L57n28K0N05l68k30M64p9l09J79J33r0j35M6K54j74
3039A5k91M14Q5n08K06L68l91o6L24j19p8L3k4J79j11k82M04R7n91K88M40n57
3061a65p9N34k41k76K87M7j48j1L9J17j19j57K77J2l17K28J28l33J63J61k96J50
3083AJ49k91J09J97k73M3K11k07L1J16j55J21M0k54K06J33l67J42K85l16o2K77
3105A36p5j23L5M8J05j91j22M00j03m54M16K34n73J25M44l42j67L17l9j18QJJ70
$$ plain form
3128 132 5 -203 123 166 -231 -6 229 -106 -90 131 -8 -8 19 -51 93 37 -177 110 133 -199 34 188 -155
3151 -155 -24 138 -112 -15 118 -119 -15 126 -127 -46 117 -56 -62 43 -23 30 -37 -88 145 7 -207 146 150
3174 150 -253 24 202 -136 -63 137 -28 -12 20 -48 104 12 -178 140 148 -242 7 237 -145 -101 173 -5 -73
3197 -73 6 24 66 -71 -107 156 4 -206 108 119 -198 23 134 -123 -3 78 -77 45 46 -128 97 78 -158
3220 -158 59 124 -129 18 113 -70 20 73 -82 47 65 -98 58 77 -101 35 75 -86 22 16 -66 70 -7 -128
3244 -128 115 40 -189 99 102 -174 32 127 -103 -6 63 -63 41 11 -83 98 26 -149 106 106 -162 37 134 -95
3268 -95 -15 73 -28 19 1 -43 83 -14 -94 110 27 -139 89 73 -147 42 72 -108 34 34 -103 56 23 -127 85
3293 85 48 -140 66 83 -128 35 77 -96 29 57 -61 32 43 -59 53 19 -65 60 23 -63 78 18 -84 91
$$ packed form
3128A32j27k08L26M3l97K25K35l35J6K21j39%K7p0J44n6k14K87K3l32K33J54l43
3151a55J31J62k50R7J33k37J04J41k53Q1J63j73oJ05o6N3o7n1K33j38k14L53M
3174A50m03K77J78l38P3K00j65J6L2o8J52r2j90L18Ql90K49K30l82M4K74j78o8
3197g3P9J8M2j37l6K63j52k10L14J1l17K21J11k57J20Q1j55J22Jj74K25j9k36
3220a58K17O5k53J47R5j83R0N3j55J29J8j63J56J9j78J36M0j61J08oq2J36p7j21
3244a28K43p5k29K88Lk76K06R5k30R7O9j26J04l0r4J81p2j75K55%k68J99R7k29
3268i5Q0Q8j01M7j8m4J26r7q0K04q3j66K28j6k20J89L0j80J42%j37J59l3j50K12
3293H5l7j88K06J7k11J63M2j73J25K8j18R3J1j02J12l4q4J25l7q6J41o0j02J75
$$ plain form
3317 91 13 -94 100 27 -127 90 41 -124 69 49 -117 63 49 -112 58 35 -115 51 44 -110 44 55 -99
3340 -99 26 35 -70 46 21 -59 56 -2 -57 93 -12 -91 117 21 -118 89 35 -105 79 43 -85 69 16 -86
3364 -86 82 11 -97 86 22 -118 77 35 -130 48 47 -105 27 19 -70 40 -15 -71 71 -16 -83 91 -2 -98 84
3389 84 30 -107 80 26 -88 78 20 -63 93 -4 -88 95 1 -106 106 24 -117 75 27 -110 57 39 -98 43
3413 43 31 -86 47 7 -67 51 -20 -70 72 -20 -69 98 -16 -107 100 1 -97 97 14 -103 91 21 -86 92
3437 92 16 -86 96 4 -92 104 16 -103 74 30 -108 63 24 -67 45 -12 -48 69 -38 -60 98 -47 -99 123
3461 123 -27 -126 116 3 -131 97 34 -112 79 10 -93 73 2 -86 92 3 -86 91 -1 -80 86 14 -76 86
3485 86 -6 -61 104 -21 -64 103 -37 -84 119 -34 -99 121 -22 -119 112 -10 -128 93 11 -119 66 15 -103
$$ packed form
3317I1p8j07J94p3j54K17m9j65J93k0j66J80j4j61J70k3j50J66pj54J54J1j54
3340i9J25Rj05J16k5q0J15n8n5J50j05p9K08r6j39K07n4j40J84l6j28J54n3j02
3364h6J68p1j08J83o4j40J95m2j65J78jj52J32qq9J10n5n6J42q7o7J74r3r6J82
3389H4n4j37J87n4j14J66n8q3J56r7q4J83r4j07K12q2j41J92m8j37J67j8j37J41
3413D3j2j17J33m0p4J18p1n0J42r2m9J67j14r1K07r9r8J94q3j17J94p0j07J78
3437I2p6j02J82r2r6J96q8j19J77m4j38J71l9r1J12n7l6J17j07k2J58j45n2K22
3461A23j50r9K42j13j34K28o3j46J91o9j03J66p1q8J78q9q9J77r2p9J66p2r0J62
3485H6r2n5J65j25m3J67j40m7K03j53o5K20j43r7K31j22j18K21q2j30J85n1j18
$$ plain form
3508 -103 59 17 -66 56 -25 -65 81 -36 -58 109 -43 -71 125 -34 -77 126 -28 -83 114 -30 -88 130 -15
3531 -15 -97 123 -20 -104 120 -3 -121 87 8 -88 66 -15 -68 66 -33 -50 76 -63 -50 95 -81 -49 115 -63
3555 -63 -61 131 -71 -88 149 -49 -102 154 -24 -115 136 8 -116 104 24 -84 73 3 -53 73 -23 -45 69 -56
3579 -56 -47 92 -65 -35 105 -81 -61 102 -85 -58 126 -99 -79 144 -77 -105 153 -62 -122 136 -13 -103 103
3602 103 -4 -80 79 -17 -64 88 -3 -41 56 -42 3 64 -69 9 92 -126 -24 135 -128 -63 168 -80 -105 137
3626 137 -49 -99 107 -37 -83 94 -62 -57 99 -72 -73 118 -38 -93 90 -2 -57 36 -8 11 35 -70 59 79 -138
3651 -138 19 169 -132 -49 190 -76 -80 143 -48 -89 96 -39 -68 89 -52 -58 83 -44 -57 68 -44 -39 54 -66
3675 -66 -7 86 -87 -27 89 -75 -29 87 -62 -23 71 -70 30 74 -120 22 137 -141 -38 190 -96 -110 177
$$ packed form
3508a03J62m2q3J22q1m0J46j17k2J67j52k8J96j59m3K03j54n5J97j44n8K18j45
3531a5q2K20j43q4K24j23j18K08p9r6J54q1n3J34r9j7J26j39J3J45j76L2J64j78
3555f3KJ92k02j7K37j98n3K56j78r1K51j28j24K20q0j08J57p0n6J26r6k2J14j25
3579e6RJ39j57L0J40j86K0J63j87K7J84k25K0K23k21k8K58k15o0K58j49r0K06
3602A03j07p6J59r6m7J52r1l8R7r8M5O1j33P8Q3k18J02J59k63O5K31k48k5K42
3626A37j86n0K06j44m6J77j56NJ56j71jJ91j56n5J83r2n5R3m4J9K4j05J29K0k17
3651a38J57J50l01Q3K39k66mK23j91m1J85j35k9J57j41oJ41j27j3J25j12NR3j20
3675f6N9R3j73O0J16j64M6J16j49L9R4j41J00M4j94J42J15k78J03K28k86j4K87
$$ plain form
3698 177 2 -122 71 49 -25 -26 -10 70 -5 -132 70 96 -164 -15 161 -98 -87 112 -23 -65 26 -32 12 4 -110
3723 -110 64 83 -157 4 169 -123 -67 161 -42 -96 101 -5 -57 61 -15 -7 39 -22 18 28 -61 47 31 -89
3747 -89 61 73 -148 25 126 -146 -42 141 -64 -94 82 -3 -56 3 -36 45 3 -130 74 118 -193 -22 208
3770 208 -82 -141 152 60 -128 -14 90 36 -102 -43 173 -17 -206 136 147 -234 -3 232 -119 -116 148 -3
3792 -3 -104 26 6 7 -20 -85 77 50 -151 20 123 -114 -35 123 -70 -70 74 -31 -34 39 -23 8 13 -48 56 9 -86
3819 -86 98 35 -169 101 125 -189 21 219 -133 -116 195 3 -142 53 91 -32 -98 3 114 -57 -162 138
3841 138 100 -231 12 207 -133 -140 146 39 -116 -30 77 44 -124 -69 194 -16 -241 176 178 -266 -27 261 -117
3864 -117 -139 166 29 -106 26 59 33 -47 -48 112 2 -145 105 90 -173 18 135 -135 -51 117 -67 -71 54
$$ packed form
3698A77j75j24J93k2p4jJ6Q0p5j27K02K6k60J49J76k59J1J99j35m2R1n8M4qj14
3723a10J74J9k40J61J65k92N6K28k03n4J97j06n2J18p6QM6o1M0J0q9J08j6j20
3747h9J50J2k21J73J01k72J04J83k05l0J76q5n3N9l9Q1m2j33K04M4l11J71K30
3770B08k90n9K93r2j88J14J04n4j38N9K16j90j89L42J1l81K31K35l51LK64j51
3792cj01J30k0Jk7o5J62k7k01J71J03k37P9J58j93%J44j05lP3o2L1No1J04m7r5
3819h6J84o3k04K70K4l14K10J98l52J7L11j92j45J95L8j23o6J01J11j71j05L00
3841A38l8l31K43J95l40pK86j07j55Q6J07l3j68N5K63k10k25M17Km44K39K88l78
3864a17k2L05j37j35J32L3k6q0jJ60j10j47K50j5k63J91J17k70Q4J68j84mJ25
$$ [...]
8191c4
##END NTUPLES=NMR FID
##END=
