##TITLE=1H_AM_NVHEXENE
 
 8 sc, 
 24.3.2023
##JCAMPDX= 6.0         $$ Bruker NMR JCAMP-DX V2.0
##DATA TYPE= NMR FID
##DATA CLASS= NTUPLES
##ORIGIN= UXNMR, Bruker Analytische Messtechnik GmbH
##OWNER= root
$$ XWIN-NMR		Version 3.5
$$ Fri Mar 24 14:23:25 2023 Russian Standard Time (UT+4h)  she@DPX200
##.OBSERVE FREQUENCY= 200.13135
##.OBSERVE NUCLEUS= ^1H
##.DELAY= (6, 6)
##.ACQUISITION MODE= SIMULTANEOUS
##.ACQUISITION SCHEME= undefined
##.AVERAGES= 8
##.DIGITISER RES= 18
##SPECTROMETER/DATA SYSTEM= spect
##.PULSE SEQUENCE= zg30
##.SOLVENT NAME= DMSO
##.SHIFT REFERENCE= (INTERNAL, DMSO, 0, 15.7039)
##AUDIT TRAIL= $$ (NUMBER, WHEN, WHO, WHERE, WHAT)
$$ ##TITLE= Audit trail, XWIN-NMR		Version 3.5
$$ ##JCAMPDX= 5.01
$$ ##ORIGIN= Bruker BioSpin GmbH
$$ ##OWNER= she
$$ F:/spectra/data/she/nmr/H-F/1/audita.txt
$$ ##AUDIT TRAIL=  $$ (NUMBER, WHEN, WHO, WHERE, WHAT)
(   1,<2023-03-24 14:22:14.96 +0400>,<she>,<DPX200>,
      <created by zg, POWCHK disabled, PULCHK disabled
       configuration hash MD5:
       00 E9 B6 7A A2 85 ED C7 34 08 36 98 17 FE 4E 26
       data hash MD5: 16K
       7E 2D 06 07 A2 A2 2B 4A 6B 96 6C F8 C4 FA 17 15>)
$$ ##END=
$$ 
$$ hash MD5
$$ 20 A3 6E 99 23 9B 41 58 A7 72 3F 92 28 93 80 FF
##$RELAX= 
##$RELAX= 
##$RELAX= 
##$RELAX= 
##$RELAX= 
##$RELAX= 
$$ Bruker specific parameters
$$ --------------------------
##$DU= <F:/spectra>
##$EXPNO= 1
##$NAME= <H-F>
##$PROCNO= 1
##$TYPE= <nmr>
##$USER= <she>
##$AMP= (0..31)
100 100 100 100 100 100 100 100 100 100 100 100 100 100 100 100 100 100 
100 100 100 100 100 100 100 100 100 100 100 100 100 100 
##$AQSEQ= 0
##$AQ_mod= 1
##$AUNM= <au_zg>
##$AUTOPOS= <>
##$BF1= 200.13
##$BF2= 200.13
##$BF3= 200.13
##$BF4= 200.13
##$BF5= 200.13
##$BF6= 200.13
##$BF7= 200.13
##$BF8= 200.13
##$BYTORDA= 1
##$CFDGTYP= 0
##$CFRGTYP= 5
##$CHEMSTR= <none>
##$CNST= (0..31)
1 1 145 1 1 1 1 1 1 1 1 1 1 1 1 1 1 1 1 1 1 1 1 1 1 1 1 1 1 1 1 1 
##$CPDPRG= <>
##$CPDPRG1= <>
##$CPDPRG2= <>
##$CPDPRG3= <>
##$CPDPRG4= <mlev>
##$CPDPRG5= <mlev>
##$CPDPRG6= <mlev>
##$CPDPRG7= <mlev>
##$CPDPRG8= <mlev>
##$CPDPRGB= <>
##$CPDPRGT= <>
##$D= (0..31)
0 1.2 0 0 0 0 0 0 0 0.06 0 0.03 0 0 0 0 0.0002 0 0 0 0 0 0 0 0 0 0 0 0 
0 0 0 
##$DATE= 1679653334
##$DBL= (0..7)
120 120 120 120 120 120 120 120 
##$DBP= (0..7)
150 150 150 150 150 150 150 150 
##$DBP07= 0
##$DBPNAM0= <>
##$DBPNAM1= <>
##$DBPNAM2= <>
##$DBPNAM3= <>
##$DBPNAM4= <>
##$DBPNAM5= <>
##$DBPNAM6= <>
##$DBPNAM7= <>
##$DBPOAL= (0..7)
0.5 0.5 0.5 0.5 0.5 0.5 0.5 0.5 
##$DBPOFFS= (0..7)
0 0 0 0 0 0 0 0 
##$DE= 6
##$DECBNUC= <off>
##$DECIM= 32
##$DECNUC= <off>
##$DECSTAT= 4
##$DIGMOD= 1
##$DIGTYP= 9
##$DL= (0..7)
0 120 120 120 120 120 120 120 
##$DP= (0..7)
150 150 150 150 150 150 150 150 
##$DP07= 0
##$DPNAME0= <>
##$DPNAME1= <>
##$DPNAME2= <>
##$DPNAME3= <>
##$DPNAME4= <>
##$DPNAME5= <>
##$DPNAME6= <>
##$DPNAME7= <>
##$DPOAL= (0..7)
0.5 0.5 0.5 0.5 0.5 0.5 0.5 0.5 
##$DPOFFS= (0..7)
0 0 0 0 0 0 0 0 
##$DQDMODE= 0
##$DR= 18
##$DS= 0
##$DSLIST= <SSSSSSSSSSSSSSS>
$$ [...]
##$SUBNAM2= <"">
##$SUBNAM3= <"">
##$SUBNAM4= <"">
##$SUBNAM5= <"">
##$SUBNAM6= <"">
##$SUBNAM7= <"">
##$SUBNAM8= <"">
##$SUBNAM9= <"">
##$SW= 18.05172834244
##$SWIBOX= (0..15)
0 0 2 0 0 0 0 0 0 0 0 0 0 0 0 0 
##$SW_h= 3612.71676300578
##$TD= 16384
##$TD0= 1
##$TE= 0
##$TE2= 300
##$TE3= 300
##$TEG= 300
##$TL= (0..7)
0 120 120 120 120 120 120 120 
##$TP= (0..7)
150 150 150 150 150 150 150 150 
##$TP07= 0
##$TPNAME0= <>
##$TPNAME1= <>
##$TPNAME2= <>
##$TPNAME3= <>
##$TPNAME4= <>
##$TPNAME5= <>
##$TPNAME6= <>
##$TPNAME7= <>
##$TPOAL= (0..7)
0.5 0.5 0.5 0.5 0.5 0.5 0.5 0.5 
##$TPOFFS= (0..7)
0 0 0 0 0 0 0 0 
##$TUNHIN= 0
##$TUNHOUT= 0
##$TUNXOUT= 0
##$USERA1= <user>
##$USERA2= <user>
##$USERA3= <user>
##$USERA4= <user>
##$USERA5= <user>
##$V9= 5
##$VALIST= <valist>
##$VCLIST= <CCCCCCCCCCCCCCC>
##$VD= 0
##$VDLIST= <DDDDDDDDDDDDDDD>
##$VPLIST= <PPPPPPPPPPPPPPP>
##$VTLIST= <TTTTTTTTTTTTTTT>
##$WBST= 1024
##$WBSW= 4
##$XGAIN= (0..3)
0 0 0 0 
##$XL= 0
##$YL= 0
##$YMAX_a= 223445
##$YMIN_a= -252954
##$ZGOPTNS= <>
##$ZL1= 120
##$ZL2= 120
##$ZL3= 120
##$ZL4= 120
##$ABSF1= 10
##$ABSF2= 0
##$ABSG= 5
##$ABSL= 3
##$ALPHA= 0
##$AQORDER= 0
##$ASSFAC= 0
##$ASSFACI= 0
##$ASSFACX= 0
##$ASSWID= 0
##$AUNMP= <proc_1d>
##$AZFE= 0.1
##$AZFW= 0.1
##$BCFW= 1
##$BC_mod= 2
##$BYTORDP= 1
##$COROFFS= 0
##$CY= 11.3945322036743
##$DATMOD= 1
##$DC= 2
##$DFILT= <>
##$DTYPP= 0
##$F1P= 2.36226072786647
##$F2P= -0.459571619588291
##$FCOR= 0.5
##$FTSIZE= 0
##$FT_mod= 4
##$GAMMA= 1
##$GB= 0.15
##$INTBC= 1
##$INTSCL= 1
##$ISEN= 128
##$LB= 0.24
##$LEV0= 0
##$LPBIN= 0
##$MAXI= 10000
##$MC2= 0
##$MEAN= 0
##$ME_mod= 0
##$MI= 1.114404
##$NCOEF= 0
##$NC_proc= 0
##$NLEV= 6
##$NOISF1= 3.799351
##$NOISF2= 2.8
##$NSP= 1
##$NTH_PI= 0
##$NZP= 0
##$OFFSET= 15.70392
##$PC= 1
##$PHC0= -19181.99
##$PHC1= 8.400782
##$PH_mod= 1
##$PKNL= yes
##$PPARMOD= 0
##$PSCAL= 0
##$PSIGN= 0
##$REVERSE= no
##$SF= 200.130013532006
##$SI= 16384
##$SIGF1= 3
##$SIGF2= 2
##$SINO= 400
##$SIOLD= 16384
##$SREGLST= <1H.CDCl3>
##$SSB= 0
##$STSI= 0
##$STSR= 0
##$SW_p= 3612.71676300578
##$SYMM= 0
##$S_DEV= 0
##$TDeff= 0
##$TDoff= 0
##$TI= <>
##$TILT= no
##$TM1= 0
##$TM2= 0
##$TOPLEV= 0
##$USERP1= <user>
##$USERP2= <user>
##$USERP3= <user>
##$USERP4= <user>
##$USERP5= <user>
##$WDW= 1
##$XDIM= 8192
##$YMAX_p= 0
##$YMIN_p= 0
$$ End of Bruker specific parameters
$$ ---------------------------------
##NTUPLES= NMR FID
##VAR_NAME=  TIME,          FID/REAL,        FID/IMAG
##SYMBOL=    X,             R,               I
##VAR_TYPE=  INDEPENDENT,   DEPENDENT,       DEPENDENT
##VAR_FORM=  AFFN,          ASDF,            ASDF
##VAR_DIM=   8192,          8192,            8192
##UNITS=     SECONDS,       ARBITRARY UNITS, ARBITRARY UNITS
##FACTOR=    0.0002768,     1,               1
##FIRST=     0,             0,               0
##LAST=      2.2672688,     0,               0
##MIN=       0,             -252954,         0
##MAX=       2.2672688,     223445,          0
$$ Real data points
##PAGE= N=1
##DATA TABLE= (X++(R..R)), XYDATA
$$ plain form
0 0 0 0 0 0 0 0 0 0 0 0 0 0 0 0 0 0 0 0 0 -3 5 -8 8 -8 8 -8 8 -12 15 -16 16 -20 21 -24 27 -28 33 -36 37 -44 48 -52
42 -52 57 -63 68 -76 84 -92 100 -108 120 -134 147 -163 181 -204 231 -264 303 -354 420 -508 630
63 630 -807 1083 -1543 2406 -4318 10146 -59400 -252954 63339 51688 -237234 -4149 156385
76 156385 -58020 -1913 115005 -42359 -43029 37258 -60097 -17862 102662 19296 -7984 82017
88 82017 24244 -85023 -74675 -18128 -23105 -82806 -10277 135982 30089 -78474 103503
99 103503 80808 -158581 -22856 127754 -79050 -48439 148072 -7661 -77567 70968 -51368
110 -51368 -124555 57948 -14112 -101757 121163 97821 -98825 54121 117716 -110729 -71146
121 -71146 88234 -22241 -71219 50850 47426 -23654 -23282 -5189 -96 -31908 -37690 35632
$$ packed form
0@%%%%%%%%%%%%%%%%%%%lQj3J6j6J6j6J6k0K7l1L2l6M1m5N1n5O1o9P3q1R2j00
42e2J09j20J31j44J60j76J92k08K28k54K81l10L44l85M35m95N67o57P74r28J138
63F30j437J890k626L949o724J4464o9546j93554L16293j1651k88922K33085J60534
76A56385k14405N6107J16918j57364o70Q0287r7355M2235J20524q3366k7280R0001
88H2017n7773j09267J0348N6547m977n9701P2529J46259j05893j08563J81977
99A03503k2695k39389J35725J50610k06804L0611J96511j55733o9906J48535j22336
110e1368p3187J82503p2060q7645K22920k3342j96646J52946O3595k28445L9583
121g1146J59380j10475m8978J22069l424p1080L72J8093N093l1812n782P3322
$$ plain form
133 35632 36862 -13006 34849 37061 -29724 3045 -870 -61221 19079 38264 -68682 18194
145 18194 93346 -71582 -55440 98188 -27448 -97224 79131 49111 -73851 32723 57824
156 57824 -54428 -11699 26051 -39391 -1967 32239 -24950 5246 40695 -26022 -24890 25836
168 25836 -5140 -23831 10103 20811 9456 -12500 -8859 24254 -13018 -48049 26863 33196
180 33196 -42647 11176 57050 -31714 -26338 35829 -24892 -32817 35005 -5067 -18420 46542
192 46542 -225 -40251 30625 4558 -56800 16243 38640 -28918 3949 44535 -10738 -23360
204 -23360 6635 -9891 -18446 -2182 3901 14690 12035 -1020 9823 2120 -21923 -6815 596
217 596 -11852 10931 17147 -4658 15074 13171 -30368 -8675 14559 -29883 -12944 39226 1866
$$ packed form
133C5632J230m9868M7855K212o6785L2769l915o0351Q0300J9185j06946Q6876
145A8194P5152j64928J6142J53628j25636o9776J76355l0020j22962J06574K5101
156E7824j12252M2729L7750o5442L7424L4206n7189L0196L5449o6717J132N0726
168B5836l0976j8691L3934J0708j1355k1956L641L3113l7272l5031P4912O333
180C3196p5843N3823M5874q8764N376O2167o0721p925O7822m0072j3353O4962
192D6542m6767m0026P0876k6067o1358P3043K2397o7558L2867M0586n5273j2622
204b3360K9995j6526q555J6264O083J0789k655j3055J0843p703k4043J5108P411
217E96j2448K2783O216k1805J9732j903m3539K1693K3234m4442J6939N2170l7360
$$ plain form
230 1866 -14046 32882 6736 -32322 2258 2041 -26047 4132 17823 -3790 12190 17368 -11541
243 -11541 -7157 1551 -17867 -11427 9266 5220 4963 12836 8337 256 -9281 -12554 -4062 -7968 -8887
258 -8887 14147 15722 -892 10894 10677 -16875 -11884 347 -15793 -5898 17455 4694 3278
271 3278 19289 -734 -16367 -426 -7690 -18901 4478 13394 1835 11480 15079 -3953 -9309
284 -9309 -6567 -13332 -10531 976 6516 10836 12478 7894 1707 -7202 -12842 -9936 -8108 -2701 10573
299 10573 12947 8019 10130 2031 -13481 -11782 -8123 -11773 -24 13873 10184 9792 11507 -2550
313 -2550 -12323 -9295 -11582 -9495 4458 10600 9892 12204 6810 -4809 -9828 -11527 -11346 -4505 4047
328 4047 10099 12876 9508 3156 -3542 -11194 -12934 -7613 -2862 4084 12515 11644 6287 3055 -5514
$$ packed form
230A866j5912M6928k6146l9058L4580k17k8088L0179J3691k1613J5980N178k8909
243a1541M384Q708j9418O440K0693m046k57P873m499q081r537l273Q492l906r19
258h887K3034J575j6614J1786k17k7552M991J2231j6140R895K3353j2761j416
271C278J6011k0023j5633J5941p264j1211K3379Q916j1559R645L599j9032n356
284i309K742o765K801J1507N540M320J642m584o187q909n640K906J828N407J3274
299A0573K374m928K111q099j5512J699L659l650J1749J3897l689l92J715j4057
313b550r773L028k287K087J3953O142p08K312n394j1619n019j699J81O841Q552
328D047O052K777l368o352o698p652j740N321M751O946Q431q71n357l232q569
$$ plain form
343 -5514 -13154 -9744 -5673 -2652 7201 12567 8229 5607 1090 -8465 -10802 -7561 -5588 1295 8785
358 8785 8625 7426 4719 -3695 -8081 -7218 -7380 -2568 5254 6679 7117 6986 -429 -5645 -5219 -7762 -5810
375 -5810 3121 5140 4554 7967 3498 -4527 -4282 -5174 -7045 -305 4451 3682 6621 5029 -2704 -3570
391 -3570 -3767 -7370 -2244 4331 3142 5034 6358 -665 -3919 -3871 -7299 -3641 2817 1869 5263 8867
407 8867 50 -3747 -301 -6785 -7751 3289 3502 1641 8754 4074 -5167 -2373 -5856 -11096 -276
422 -276 4622 756 9639 11639 -1678 -2613 -537 -10008 -8023 2089 1891 4297 8286 2121 -1516
437 -1516 -3644 -11161 -7719 594 -460 6180 15351 7692 2381 2922 -8060 -11934 -4673 -7059 -2300
452 -2300 10894 4253 -575 8563 -3221 -15749 -822 1406 -7178 9586 17951 3884 5428 5690
$$ packed form
343e514p640L410M071L021R853N366m338k622m517r555k337L241J973O883P490
358H785j60j199k707q414m386Q63j62M812P822J425M38j31p415n216M26k543J952
375e810Q931K019n86L413m469q025K45q92j871O740M756p69K939j592p733q66
391c570j97l603N126O575j189J892J324p023l254M8l428L658O458r48L394L604
407H867q817l797L446o484r66J1040K13j861P113m680r241K794l483n240J0820
422b76M898l866Q883K000j3317r35K076r471J985J0112j98K406L989o165l637
437a516k128p517L442Q313j054O640R171p659n311N41j0982l874P261k386M759
452b300J3194o641m828R138j1784j2528J4927K228q584J6764Q365j4067J544K62
$$ plain form
466 5690 -11335 -12072 -6745 -12959 -3242 9289 2243 5045 12217 -2050 -8209 390 -3489 -3804 7142
481 7142 8253 8037 7734 -3487 -6149 -5187 -17678 -13127 4795 -526 -135 17785 9928 -3318 5450
496 5450 -442 -10840 1725 2272 -4094 10461 7256 -10235 128 373 -20410 -8872 7498 -4732
510 -4732 1174 18275 7860 1648 6786 -2909 -6013 -936 -7418 -2341 8003 -2784 -3835 6893
524 6893 -4840 -11471 1163 -1084 -3080 8322 5896 4547 11414 -1519 -7222 5834 -6135 -15993
538 -15993 6141 4821 -11856 4719 10111 -8799 -1844 5925 -6068 504 7255 -3216 4819
551 4819 9926 -7535 -2587 7990 -9622 -9674 7530 -1628 -6482 6583 2542 -2145 3787 -2192
565 -2192 -1581 6298 -4422 -4232 10565 -1195 -9326 7847 2395 -10662 2860 3861 -6581 2935
$$ packed form
466E690j7025p37N327o214R717J2531p046K802P172j4267o159Q599l879l15J0946
481G142J111k16l03j1221k662R62j2491M551J7922n321L91J7920p857j3246Q768
496E450n892j0398J2565N47o366J4555l205j7491J0363K45k0783J1538J6370j2230
510d732N906J7101j0415o212N138r695l104N077o482N077J0344j0787j051J0728
524F893j1733o631J2634k247j996J1402k426j349O867j2933n703J3056j1969r858
538a5993K2134j320j6677J6575N392j8910O955P769j1993O572O751j0471Q035
551D819N107j7461M948J0577j7612n2J7204r158m854J3065m041m687N932n979
565b192O11P879j0720J90J4797j1760q131J7173n452j3057J3522J001j0442R516
$$ plain form
579 2935 2915 -5222 5622 2816 -9281 5265 6838 -11573 433 10795 -7998 -4686 9414 -2573
593 -2573 -4617 5485 -1467 -1543 4410 -4662 -1577 7236 -5302 -4853 9435 -1197 -7243 6686 1746
608 1746 -6217 3079 522 -3710 4313 -1407 -4669 7530 -84 -9011 6936 4558 -10409 2810
622 2810 8059 -6980 -682 6593 -4439 -1360 3529 -5561 -314 4774 -6429 -704 8747 -3972
636 -3972 -3402 9026 -297 -5157 4876 512 -4039 1819 -1950 -2748 3127 -3761 -4083 6002 -1525
651 -1525 -5919 6916 3342 -4832 5503 5207 -3588 2602 1694 -6064 438 -668 -8735 906 3357
666 3357 -7266 1119 8163 -3653 -995 8224 -371 -1745 5987 652 -1571 2806 -3070 -4639 69
681 69 -5712 -6217 2360 -714 -2480 6096 4473 165 4741 2779 -1155 2369 -360 -3040 2271 -1402
$$ packed form
579B935k0q137J0844k806j2097J4546J573j8411J2006J0362j8793L312J4100j1987
593b573k044J0102o952p6N953r072L085Q813j2538M49J4288j0632o046J3929m940
608A746p963R296k557m232Q023n720l262J2199p614q927J5947k378j4967J3219
622B810N249j5039O298P275j1032L079M889r090N247N088j1203N725R451j2719
636c972N70J2428r323m860J0033m364m551N858l769p98N875o888l22J0085p527
651a525m394J2835l574q174J0335k96q795O190r08p758O502j106q067R641K451
666C357j0623Q385P044j1816K658R219q595j374P732n335k223M377n876j569M708
681F9n781n05Q577l074j766Q576j623m308M576j962l934L524k729k680N311l673
$$ plain form
697 -1402 -6253 419 -1525 -8303 -669 2521 -3304 2941 7840 1705 3610 5939 -1460 -1246 1427
712 1427 -4875 -3638 1704 -3468 -3888 2059 -1916 -4251 1582 855 -651 4338 4387 2584 4502 1750
728 1750 -1633 -339 -3157 -5482 -1417 -1523 -3284 1192 1559 -1601 1285 1773 -1270 1873 3353 293
744 293 2690 3630 -1500 -1175 154 -4614 -4209 -114 -2075 -1622 2924 1564 67 2474 921 -1008
760 -1008 1083 585 -408 1677 888 -887 218 -1091 -2975 -1162 -964 -1608 1126 1786 465 2046 1638
777 1638 -998 179 412 -1942 -140 1460 -994 -161 1658 -1234 -1701 731 -853 -1475 1477 1063
793 1063 -259 1467 945 -1057 -225 -169 -1307 -196 535 -74 559 710 -130 -52 -312 -647 99 -154 -276
812 -276 1076 358 -807 710 215 -1751 183 1028 -1242 234 1991 -665 -590 1529 -738 -1563 1051
$$ packed form
697a402m851O672j944o778P634L190n825O245M899o135J905K329p399K14K673
712A427o302J237N342n172m20N947l975k335N833p27j506M989M9j803J918k752
728A750l383J294k818k325M065j06j761M476L67l160K886M88l043L143J480l060
744B93K397R40n130L25J329m768M05M095j961M53M546j360j497K407j553j929
760a008K091m98r93K085p89j775J105j309j884J813J98o44K734O60j321J581m08
777A638k636J177K33k354J802J600k454Q33J819k892m67K432j584o22K952m14
793A063j322J726n22k002Q32N6j138J111P31o09O33J51q40P8k60l35P46k53j22
812b76J352p18j165J517m95j966J934Q45k270J476J757k656P5K119k267q25K614
$$ plain form
829 1051 -67 -1423 1035 774 -1227 376 888 -1089 -326 935 -257 -352 766 391 -381 -159 239
846 239 -182 -782 79 658 -606 -214 1257 -368 -1021 1250 119 -1589 1079 1021 -1778 446 1653
863 1653 -1705 -552 1959 -1036 -1302 1900 -21 -1683 1259 758 -1631 312 1151 -1023 -467 1064
879 1064 -98 -852 406 697 -667 -526 1087 120 -1389 800 1166 -1803 -126 2124 -1427 -1268 2640
896 2640 -434 -2401 2294 769 -3078 1291 2033 -2840 57 2844 -1900 -1237 2696 -661 -2029 1861
912 1861 595 -1889 667 1262 -1150 -602 972 -28 -1208 149 1318 -735 -1037 1999 357 -2462
928 -2462 1442 1815 -3195 117 3402 -2692 -1644 4166 -1370 -3427 3752 455 -4354 2678 2465 -4123
944 -4123 976 3611 -3246 -1095 3571 -1664 -2356 2719 297 -2293 1129 1361 -1311 -653 1045 321
$$ packed form
829A051j118j356K458k61k001J603N12j977P63J261j192r5J118l75p72K22L98
846B39m21o00Q61N79j264L92J471j625o53K271j131j708K668n8k799K224J207
863A653l358J153K511k995k66L202j921j662K942n01k389J943Q39k174N56J531
879A064j162p54J258K91j364J41J613r67j509K189L66k969J677K250l551J59L908
896B640l074j967M695j525l847M369P42m873K897K787m744O63L933l357j368L890
912A861j266k484K556N95k412N48J574j000j180J357J169k053l02L036j642k819
928b462L904L73n010L312L285o094J048N810n536k057P179l297m809P032k13o588
944d123N099K635o857K151M666n235o92N075k422k590L422K32k672O58J698p24
$$ plain form
960 321 -1362 -114 1963 -795 -1847 2441 491 -3540 1842 2483 -4125 536 4557 -3623 -1748 5505
976 5505 -2295 -4336 5121 140 -5670 3731 2818 -5418 1414 4246 -4077 -861 4286 -2000 -2042 3324
992 3324 -154 -2299 1401 637 -1725 -423 786 162 -1146 66 2221 -884 -2012 3034 492 -4154
1008 -4154 2465 2958 -4992 549 5080 -4509 -2242 5953 -2664 -4353 5912 109 -5432 4615 2352
1023 2352 -6002 2026 3708 -5199 -343 4578 -2796 -1775 3982 -443 -2310 1850 801 -1317 -52
1038 -52 739 447 -1131 -950 1475 -1100 -2848 2288 841 -3477 2852 3538 -3884 1477 5085 -4519
1054 -4519 -1643 5667 -3726 -4588 5527 -1365 -6403 4156 1496 -6096 2745 4405 -3633 1728 5517
1069 5517 -1816 -433 3485 -1940 -2775 677 -1739 -2727 -499 -589 -563 -436 51 2263 794 -173 4250
$$ packed form
960C21j683J248K077k758j052M288j950m031N382O41o608M661M021q180J875P253
976E505p800k041R457m981n810R401r13q236O832K832q323L216N147o286m2N366
992C324l478k145L700p64k362J302J209o24j308J212K155l105j128N046k542m646
1008d154O619M93p950N541M531r589K267Q195q617j689J0265n803n541J0047k263
1023B352q354Q028J682q907M856M921p374J021N757m425j867M160j049k118J265
1038e2P91k92j578J81K425k575j748N136j447m318O329O86p422N361L608r604
1054d519K876P310r393q62J0115o892n038J0559k660p592Q841J660q038N361L789
1069E517p333J383L918n425q35L452k416r88K228r0K6J27M87K212j469r67M423
$$ plain form
1086 4250 2454 -2030 2984 2518 -5356 -1080 2074 -6550 -3614 3700 -3684 -3417 5971 332 -2952
1101 -2952 6446 3128 -3163 4671 3970 -4205 667 2311 -5524 -3343 427 -4291 -3269 1289 -178
1116 -178 225 2929 2454 2617 2454 1342 2331 659 -1819 579 -988 -5011 -1288 -876 -5808 -1031 2675
1133 2675 -2895 834 6833 313 371 7087 690 -3027 3870 -128 -5864 558 -169 -6259 -1088 1012
1149 1012 -4048 -351 3413 -224 1558 4750 1672 1310 2633 -36 -911 -721 -2380 -1731 -1677 -2975
1165 -2975 -550 -145 -2291 1117 2545 -994 2065 4560 -475 668 4039 -1710 -2619 1983 -2436
1180 -2436 -4467 1340 -806 -3817 1907 1568 -2426 1966 2955 -1350 1362 3041 -1003 44 1671
1195 1671 -1689 -1397 186 -1915 -1270 385 -969 70 1346 -329 680 1657 -718 331 1677 -1165
$$ packed form
1086D250j796m484N014m66p874M276L154q624K936P314p384K67R388n639l284
1101b952R398l318o291P834p01q175M872J644p835K181L770m718J022M558j467
1116a78M03K704m75J63j63j112R89j672k478K398j567m023L723M12m932M777L706
1133B675n570L729N999o520N8O716o397l717O897l998n736O422p27o090N171K100
1149A012n060L697L764l637J782L192l078l62J323k669q75J90j659O49N4j298
1165b975K425M05k146L408J428l539L059K495n035J143L371n749r09M602m419
1180b436k031N807k146l011N724l39l994M392R89m305K712J679m044J047J627
1195A671l360K92J583k101O45J655j354J039J276j675J009R77k375J049J346k842
$$ plain form
1211 -1165 -354 1691 -1482 -1284 1554 -1329 -1794 1877 -278 -1590 2191 662 -1743 1568 805 -2163
1227 -2163 711 968 -1950 397 1337 -1444 170 1388 -1160 -65 1319 -918 -140 1235 -905 -436
1243 -436 933 -1098 -705 961 -819 -446 1463 -295 -321 1618 -256 -738 1333 -376 -1225 1074 -287
1260 -287 -1539 893 -10 -1580 836 523 -1282 974 1103 -1005 808 1194 -1181 171 930 -1381
1276 -1381 -323 876 -1175 -448 1011 -780 -394 1135 -400 -267 1191 -209 -298 1035 -350 -576
1292 -576 762 -557 -784 760 -456 -787 987 -160 -804 1136 90 -1010 1045 279 -1242 800
1308 800 543 -1353 481 790 -1288 169 994 -1022 -77 1072 -707 -261 960 -532 -389 723 -443
1325 -443 -380 610 -339 -198 675 -315 -102 723 -465 -227 779 -593 -421 932 -518 -685 1034 -327
$$ packed form
1211a165Q11K045l173J98K838k883m65L671k155j312L781j529k405L311p63k968
1227b163K874K57k918K347R40k781J614J218k548J095J384k237P78J375k140M69
1243d36J369k031L93J666j780L73J909j758k6J939j874m82K071j709q49K299j361
1260b87j252K432r03j570K416l13j805K256J29k108J813L86k375J352P59k311
1276a381J058J199k051P27J459j791L86J529j535J33J458j400q9J333j385k26
1292e76J338j319k27J544j216l31J774j147o44J940j046j100K055p66j521K042
1308H00k57j896J834L09k078J457Q25k016R45J149j779M46J221j492J43J112j166
1325d43O3R90r49J41Q73r90K13Q25j188K38J006j372J72J353j450j67J719j361
$$ plain form
1343 -327 -962 1006 12 -1064 957 451 -1006 752 644 -1058 286 573 -1021 21 606 -748 32
1360 32 618 -554 62 507 -570 144 559 -553 254 683 -701 61 709 -935 -232 859 -795 -338
1378 -338 1159 -457 -536 1125 -308 -834 898 -98 -855 802 202 -736 590 155 -742 370 42 -609
1396 -609 508 87 -507 718 41 -768 731 49 -1065 798 398 -1198 763 814 -1371 370 1074
1413 1074 -1391 -76 1354 -1046 -407 1469 -622 -751 1199 -342 -923 882 -31 -730 674 94
1429 94 -490 470 -108 -348 457 -367 -262 761 -517 -403 1123 -549 -825 1382 -290 -1322 1477 183
1447 183 -1736 1254 775 -1967 805 1345 -1873 207 1689 -1534 -411 1746 -1012 -801 1566 -425
1463 -425 -901 1192 -109 -817 731 -90 -554 511 -224 -241 589 -554 -190 827 -848 -344 1349 -737
$$ packed form
1343c27o35J968r94j076K021n06j457J758j08j702J344K87j594J042N85j354P80
1360C2N86j172O16M45j077P14M15j112Q07M29j384P62O48j644P03J091j654M57
1378c38J497j616p9J661j433n26J732r96p57J657o00r38J326m35q97J112l28o51
1396f09J117m21n94J225o77q09J499o82j114J863m00j596J961N1k185J741P04
1413A074k465J315J430k400O39J876k091j29J950j541n81J805r13o99J404n80
1429I4n84R60n78k40Q05q24J05J023j278J14J526j672k76K207j672j032K799j294
1447A83j919K990m79k742K772N40l218K080J482l223J123K157k758K11K367j991
1463d25m76K093j301p08J548q21m64J065p35j7Q30j143L64J017j675N04J693k086
$$ plain form
1481 -737 -605 1882 -469 -1319 1824 -223 -2147 1472 461 -2380 1174 1407 -2169 587 1898 -1836
1497 -1836 -145 2076 -1192 -539 2002 -604 -932 1279 -610 -1297 558 -507 -829 682 -70 15 1039
1514 1039 -215 145 1137 -787 -219 1436 -1023 -776 1688 -1104 -1775 1565 -804 -2382 1808 564
1530 564 -2010 2155 1943 -1874 1256 2047 -2276 -257 1771 -2027 -1051 1693 -1246 -1348 1309 -625
1546 -625 -1160 1161 200 -190 1450 637 328 1040 -406 -421 223 -1593 -925 664 -1475 -739 1797 -854
1564 -854 -1023 2364 -209 -1538 2600 803 -1904 2162 1321 -2757 551 1109 -3254 -690 1622 -2101
1580 -2101 -565 2527 -535 -522 2265 -25 -887 1394 95 -796 765 -53 -687 109 -797 -730 70 -1032
1598 -1032 -146 1213 -521 269 2144 -533 -644 2007 -782 -1879 1810 -162 -2406 1615 772 -2643
$$ packed form
1481g37J32K487k351q50L143k047j924L619j011k841L554K33l576K756J311l734
1497a836J691K221l268O53K541k606l28K211j889o87J855j065l22J511p52Q5J024
1514A039j254L60R92j924N68J655k459K47K464k792o71L340k369j578M190j244
1530E64k574M165k12l817L130P91m323K019K028l798R76K744k939j02K657j934
1546f25n35K321r61l90J640q13l09P12j446j5O44j816O68J589k139P36K536k651
1564h54j69L387k573j329M138j797k707M066q41m078L308N58m363K564K312l723
1580b101J536L092l062J3K787k290q62K281j299q91J561q18o34P96r06O7Q00j102
1598a032Q86J359j734P90J875k677j11K651k789j097L689j972k244M021q43l415
$$ plain form
1614 -2643 899 1465 -2446 265 2210 -1556 -122 2470 -890 -886 1778 -688 -1463 1031 -231 -1128
1630 -1128 765 181 -530 553 -23 -206 487 -452 -97 853 -693 -258 1254 -799 -794 1474 -614 -1343
1648 -1343 1641 -60 -1722 1584 655 -2016 1093 1245 -2107 335 1652 -1777 -373 1842 -1071
1663 -1071 -742 1754 -425 -932 1256 -186 -1032 758 -54 -759 670 143 -355 619 -95 -394 465 -485
1681 -485 -460 794 -421 -448 1265 -288 -968 1172 -176 -1532 1068 542 -1378 1090 1208 -1371 355
1698 355 1026 -1724 -495 1016 -1234 -431 1579 -349 -413 1412 -200 -864 834 -32 -644 831 292
1715 292 -381 468 -308 -946 -107 -718 -825 604 213 62 1454 604 -288 868 -61 -1201 403 61
1733 61 -1186 556 511 -1328 8 390 -1560 -297 1053 -440 496 2015 359 172 1161 -611 -1211
$$ packed form
1614b643L542N66l911K711J945l766J434K592l360MK664k466p75K494j262q97
1630a128J893n84p11J083n76j83O93r39L55R50j546M35J512k053NK268k088p29
1648a343K984j701j662L306r29k671L109J52l352K442J317l429J404K215k913
1663a071L29K496k179n07K188j442q46J790q12p05J429n27m98R74p14k99Q59r50
1681d85K5J254j215k7J713j553o80K140j348j356K600n26j920K468J18k579J726
1698C55O71k750J229J511k250Q03K010j928o4J825j612o64J698q66o12J475n39
1715B92o73Q49p76o38Q39o11j07J429l91j51J392q50q92J156r29j140J604l42
1733F1j247J742m5j839J336L82j950J263J350j493R36J519j656j87R89j772o00
$$ plain form
1750 -1211 -36 -963 -1161 400 -72 -459 691 87 -559 437 159 -140 1051 854 341 1027 188 -907
1768 -907 -356 -984 -1735 -351 -111 -641 834 1055 -129 642 767 -640 96 776 -353 249 988 -427
1786 -427 -522 66 -1266 -1312 -85 -550 -256 1227 791 456 1189 326 -466 165 -334 -728 291 81 -425
1805 -425 338 -96 -923 -219 -248 -736 362 760 255 942 919 -155 2 -44 -975 -502 39 -507 30 572
1825 572 -190 -86 282 -473 -315 362 -59 188 819 164 2 382 -455 -675 43 -403 -472 525 206 -179
1845 -179 575 170 -516 208 90 -526 250 402 -332 191 343 -467 -140 209 -377 -116 355 -96 -19 268
1865 268 -138 -114 112 -174 -19 150 -170 7 166 -289 -1 307 -202 95 517 -194 -172 367 -408 -509 351
1886 351 -105 -338 631 292 -397 333 126 -708 -18 286 -335 228 664 -63 -62 174 -462 -555 -102 -161 25
$$ packed form
1750a211J175r27j98J561m72l87J150o04o46R96k78k99J191j97n13O86q39j095
1768i07N51o28p51J384K40n30J475K21j184P71J25j407P36O80j129O02P39j415
1786d27r5N88j332m6J227m65K94J483m36l35P33q63p92O31m99l94J019k10n06
1805d25P63m34q27P04k9m88J098L98n05O87k3j074J57m6r31M73N41n46N37N42
1825E72p62J04L68p55J58O77m21K47O31o55j62L80q37k20P18m46o9R97l19l85
1845a79P54m05o86P24j18o16P76J52p34N23J52q10L27L49n86K61M71m51P7K87
1865B68m06K4K26k86J55J69l20J77J59m55K88L08n09K97M22p11K2N39p75j01Q60
1886C51m56k33R69l39o89P30k07q34O90L04o21N63M36p27JK36o36r3M53n9J86
$$ plain form
1907 25 426 376 326 158 -223 -233 -357 -519 67 319 48 555 575 -362 -233 1 -857 -464 539 25 146
1928 146 1097 289 -492 174 -353 -1098 -62 316 -168 608 914 -32 -114 -27 -745 -694 -69 7 258 663 534
1949 534 264 -121 -481 -470 -592 -474 358 491 238 763 492 -618 -347 -143 -1006 -318 766 112 262 1147
1969 1147 65 -685 81 -484 -1076 185 503 -72 717 857 -225 -242 -100 -763 -588 101 163 337 606
1988 606 446 129 -302 -499 -325 -508 -339 542 471 61 691 362 -767 -249 26 -872 -150 849 -13 122
2008 122 1004 -143 -728 261 -338 -939 393 540 -266 546 758 -381 -283 95 -531 -453 187 183 198 351 252
2029 252 107 -227 -384 -106 -283 -280 407 264 -92 533 225 -666 45 196 -846 -14 842 -335 -105 993
2049 993 -179 -723 476 -83 -832 335 395 -381 362 514 -350 -5 234 -450 -188 283 -96 -62 318 133
$$ packed form
1907B5M01n0n0j68l81j0j24j62N86K52k71N07K0r37J29K34q58L93J003n14J21
1928A46R51q08p81O66n27p45J036L78m84P76L06r46q2Q7p18N1O25P6K51M05j29
1949E34k70l85l60J1j22J18Q32J33k53N25k71j110K71K04q63O88J084o54J50Q85
1969A147j082p50P66n65n92J261L18n75P89J40j082j7J42o63J75O89O2J74K69
1988F06j60l17m31j97J74j83J69Q81p1m10O30l29j129N18K75q98P22R99q62J35
2008A22Q82j147n85R89n99o01J332J47q06Q12K12j139R8L78o26P8O40mJ5J53r9
2029B52j45l34j57K78j77LO87j43l56O25l08q91P11J51j042Q32Q56j177K30J098
2049I93j172n44J199n59p49J167O0p76P43J52q64L45K39o84K62M71l79L4L80j85
$$ plain form
2069 133 -61 -79 -50 56 -263 -234 413 50 -408 454 357 -627 71 469 -600 -179 580 -364 -206 674 -193
2090 -193 -324 674 -130 -618 531 81 -776 276 424 -541 52 527 -153 -89 225 -66 -35 14 -82 232 114
2111 114 -208 171 57 -474 -135 -76 -436 119 290 -128 541 597 -374 132 513 -753 -455 611 -329 -544
2131 -544 653 72 -668 140 -49 -616 167 297 36 762 680 -10 344 111 -784 -501 -192 -558 -185 206
2151 206 93 267 74 -232 205 30 -373 567 824 -23 448 680 -579 -729 -309 -1021 -796 119 -132 208
2171 208 1001 277 -1 685 -76 -599 470 376 -242 454 419 -485 -469 -561 -965 -519 -244 -71 814 928 449
2192 449 813 583 -406 -222 -37 -535 -144 210 -210 -20 -48 -800 -473 -74 -620 51 1078 521 523 1146 277
2213 277 -460 -109 -558 -866 -171 -185 -222 420 59 -360 178 -66 -504 319 612 206 662 712 12 -71 -305
$$ packed form
2069A33j94j8K9J06l19K9O47l63m58Q62r7r84O98L98j069M21P59r44J58Q80q67
2090a93j31R98q04m88J149m50q57J052J48r65N93M75o80O4L14k91L1M9r6L14j18
2111A14l22L79j14n31L39N9l60N55J71m18O69N6r71N06L81j266K98J066r40k15
2131e44J197n81p40Q08j89n67P83J30k61P26q2o90L54k33q95K83L09l66L73L91
2151B06j13J74j93l06M37j75m03R40K57q47M71K32j259j50M20p12K25R15k51L40
2171B08P93p24k78O86p61n23J069r4o18O96l5r04J6r2m04M46K75J73Q85J14m79
2192D49L64k30r89J84J85m98L91L54m20J90k8p52L27L99n46O71J027n57KO23q69
2213B77p37L51m49l08O95j4l7O42l61m19N38k44m38Q23K93m06M56N0p00q3k34
$$ plain form
2234 -305 -826 -491 -335 -518 215 505 -85 263 499 -292 -166 343 -88 37 552 91 -12 188 -456 -562
2254 -562 -56 -438 -390 465 243 -49 540 282 -267 74 29 -271 114 125 -122 249 55 -368 35 11 -419
2275 -419 94 320 -139 164 351 -175 -34 112 -326 -45 208 -258 19 378 -238 -181 356 -151 -255 339
2295 339 38 -230 200 -32 -308 69 -76 -234 248 139 -130 285 172 -237 55 102 -203 61 140 -68 97
2316 97 3 -298 2 -38 -356 155 365 -86 235 448 -170 -136 127 -337 -253 192 -114 -68 343 -98 -246 176
2338 176 -173 -364 225 184 -67 338 305 -111 -4 -81 -340 -111 -66 -132 227 229 -43 149 71 -290 -73 28 -137
2361 -137 165 282 -1 174 141 -344 -156 37 -372 -83 378 13 14 378 -42 -274 46 -163 -272 154 100
2382 100 -35 290 95 -212 34 -53 -315 -1 112 -42 184 189 -42 54 -39 -264 -22 36 -160 172 283 -51
$$ packed form
2234c05n21L35J56j83P33K90n90L48K36p91J26N09m31J25N15m61j03K00o44j06
2254e62N06l82M8Q55k22k92N89k58n49L41m5l00L85J1k47L71j94m23M03k4m30
2275d19N13K26m59L03J87n26J41J46m38K81K53m66K77L59o16N7N37n07j04N94
2295C39l01k68M30k32k76L77j45j58M82j09k69M15j13m09K92M7l05K64P9k08J65
2316I7r4l01L00m0l18N11K10m51L21K13o18L4K63m64Q4M45l06M6M11m41j48M22
2338A76l49j91N89m1k51M05l3m16J07p7k59K29M5o6L59Kk72J92p8l61K17J01j65
2361a37L02J17k83J75l3m85J88J93m09K89M61l65JL64m20k32L20k09j09M26n4
2382A00j35L25j95l07K46q7k62L14J13j54K26Nk31R6r3k25K42N8j96L32J11l34
$$ plain form
2404 -51 84 171 -215 -134 64 -176 -42 233 -20 -1 229 -114 -207 96 -115 -199 178 89 -49 192 70 -136
2426 -136 27 -84 -214 53 16 -106 184 136 -117 81 53 -215 0 71 -126 110 189 -92 82 148 -211 -88
2448 -88 126 -181 -82 227 -4 -42 199 -9 -132 67 -78 -148 90 12 -60 150 41 -107 50 -36 -145 36
2470 36 -9 -71 154 65 -84 136 15 -225 66 59 -211 107 199 -134 57 206 -181 -81 152 -160 -91 220 -20
2493 -20 -73 210 -1 -164 82 -24 -153 64 45 -53 92 44 -70 33 -62 -115 30 -53 -60 143 6 -67 142 -31
2517 -31 -213 105 21 -225 140 188 -181 66 219 -215 -82 188 -166 -93 240 -25 -95 214 -1 -192 83 14
2539 14 -187 50 101 -43 22 50 -28 -30 -102 -65 55 -82 -27 189 -2 -83 157 -34 -198 97 -14 -200 162 103
2563 103 -208 114 170 -302 -44 258 -171 -84 345 40 -114 185 22 -204 -9 -16 -144 38 33 -51 67 38 -68
$$ packed form
2404e1J35Q7l86Q1J98k40J34K75k53J9K30l43r3L03k11q4L77q9j38K41j22k06
2426a36J63j11j30K67l7j22K90m8k53J98k8k68K15P1j97K36P9k81J74O6l59J23
2448h8K14l07R9L09k31l8K41k08j23J99j45p0K38p8p2K10j09j48J57q6j09J81
2470C6m5o2K25q9j49K20j21k40K91pk70L18R2l33J91J49l87J00K33l12O9L11k40
2493b0n3K83k11j63K46j06j29K17j9r8J45m8j14J03r5n3J45q3pK03j37p3K09j73
2517c1j82L18q4k46L65M8l69K47J53m34J33K70l54P3L33k65p0L09k15j91K75o9
2539A4k01K37N1j44O5K8p8kp2L7J20j37N5K16j91q1K40j91j64K95j11j86L62n9
2563A03l11L22N6m72K58L02m29Q7M29l05j54K99j63k26J95pj28J82nq4J18k9j06
$$ plain form
2586 -68 -3 13 -10 33 22 98 120 -125 -56 105 -247 -278 155 -38 -247 227 219 -184 117 228 -174 -2 200 -122
2610 -122 11 223 -151 -131 140 -175 -288 110 37 -144 142 242 39 39 95 52 -51 -110 17 64 -152 -65 86
2633 86 -150 -169 60 -87 -101 188 51 -4 305 70 -184 184 65 -372 6 189 -282 -93 252 -100 -162 167
2655 167 16 -70 148 81 34 149 31 -58 63 -66 -157 -12 -32 -66 -12 -17 54 58 -93 49 177 -128 -64 251 -46
2680 -46 -213 159 23 -274 54 90 -178 39 118 -132 70 140 -162 35 194 -128 -59 214 -49 -132 100 20
2702 20 -73 22 26 36 66 -56 23 94 -122 -80 130 -61 -95 138 -9 -86 89 -41 -97 102 -48 -114 179 39 -187
2727 -187 124 88 -240 0 115 -140 -12 144 -27 39 104 -73 10 69 -130 -7 161 -66 -9 188 -33 -80
2749 -80 58 -58 -71 53 -34 -5 154 -45 -78 115 -91 -193 83 17 -114 127 125 -28 90 10 -146 -6 -65
$$ packed form
2586f8O5J6k3M3j1P6K2k45O9J61l52l1M33j93k09M74qm03L01J11m02J72K02l22
2610a22J33K12l74K0K71l15j13L98p3j81K86J00k03%N6m3j03n9J27M7k16Q7J51
2633H6k36j9K29j47j4K89j37n5L09k35k54L68j19m37L78J83m71J89L45l52o2L29
2655A67j51q6K18o7m7J15j18q9J21j29r1J45k0l4N4nP1Mj51J42J28l05O4L15k97
2680d6j67L72j36k97L28L6k68K17P9k50K02P0l02J97J59l22O9K73k63q3K32q0
2702B0r3R5MJ0L0j22P9P1k16M2K10j91l4K33j47p7J75j30n6J99j50o6K93j40k26
2727a87L11l6l28K40J15k55J28J56j71O6O5j77Q3N9j99J23J68k27N7J97k21m7
2749h0J38j16j3J24q7K9J59j99l3J93k06j02K76o6j31K41kj53J18q0j56J40n9
$$ plain form
2772 -65 -179 69 74 -106 98 153 -125 -23 95 -109 20 171 36 107 185 -84 -82 21 -251 -211 66 -59 -39
2795 -39 242 133 -11 124 -4 -120 27 -27 -39 152 35 -96 29 -130 -329 -127 -85 -139 138 231 137 261
2817 261 170 -91 -8 -41 -244 -27 117 -77 31 126 -147 -180 -56 -174 -52 205 158 237 369 96 -45 11 -253
2840 -253 -329 -61 -65 -82 166 98 -49 19 -102 -199 25 62 34 295 269 26 57 -58 -336 -248 -140 -176 50 199
2864 199 103 171 124 -121 -63 20 -116 60 269 99 103 142 -146 -236 -126 -238 -138 166 103 110 299 81 -142 5
2888 5 -84 -207 52 122 29 143 82 -119 -110 -142 -220 -22 100 50 201 206 -7 -31 -68 -193 -88 15 -8 167 192 -32
2914 -32 16 28 -230 -128 101 -18 46 262 72 -74 30 -129 -226 11 4 -27 214 164 -54 16 -25 -239 -100 24
2938 24 -8 89 143 43 9 -84 -182 -80 -37 -45 171 229 62 99 42 -199 -153 -36 -126 59 235 65 76 161 -134 -239
$$ packed form
2772f5j14K48Nj80K04N5k78J02J18k04J29J51j35P1P8k69KJ03k72M0K77j25K0
2795c9K81j09j44J35j28j16J47n4j2J91j17j31J25j59j99K02M2n4K77R3r4J24
2817B61r1k61Q3l3k03K17J44j94J08R5k73l3J24j18J22K57m7P9J32k73j41N6k64
2840b53p6K68mj7K48o8j47O8j21r7K24L7k8K61k6k43L1j15k78Q8J08l6K26J49
2864A99r6O8m7k45N8Q3j36J76K09j70ML9k88r0J10j12J00L04o3PJ89k18k23J47
2888Eq9j23K59P0r3J14o1k01Rl2p8J98J22n0J51Nk13k4l7j25J05J03k3J75K5k24
2914c2M8J2k58J02K29j19O4K16j90j46J04j59r7K37pl1K41n0k18P0m1k14J39J24
2938B4l2R7N4j00l4r3r8J02M3qK16N8j67L7n7k41M6J17r0J85J76j70J1Q5k95j05
$$ plain form
2964 -239 0 -73 -86 232 222 50 118 8 -228 -181 -116 -139 54 176 131 152 67 -114 -150 -147 -145 21 107 131 224 120
2990 120 -87 -68 -143 -289 -62 132 34 184 312 8 -91 -7 -231 -240 68 54 63 279 166 -65 -28 -112 -273 -99
3014 -99 44 21 158 212 72 -11 -94 -179 -152 -104 -26 137 155 94 122 -12 -197 -95 -92 -145 88 198 50 152 165
3039 165 -119 -152 -12 -151 -103 176 99 31 187 54 -145 -47 -44 -156 24 105 33 93 115 -38 -64 -70 -120 -45 -7 26
3065 26 110 65 -20 43 -41 -141 -23 3 -89 81 137 -29 44 105 -113 -57 67 -90 -49 159 27 -42 131 36 -102
3090 -102 27 7 -91 22 47 -14 59 45 -40 14 -10 -84 -17 -4 -42 38 30 -25 36 10 -91 -2 -14 -115 31 89 -41
3117 -41 38 118 -72 -68 50 -74 -68 86 16 -4 122 15 -58 36 -50 -100 41 41 -22 90 65 -25 -14 -32 -90 -21 -7 -18
3145 -18 95 57 -56 22 -12 -145 -43 38 -51 42 112 -10 0 31 -96 -75 46 -31 17 163 39 -21 56 -75 -139
$$ packed form
2964b39K39p3j3L18j0j72O8j10k36M7O5k3J93J22m5K1q5j81l6LKJ66Q6K4R3j04
2990A20k07J9p5j46K27J94r8J50J28l04r9Q4k24rL08j4RK16j13k31L7q4j61J74
3014i9J43k3J37N4j40q3q3q5K7M8P8J63J8o1K8j34j85J02Ln3K33J10j48J02J3
3039A65k84l3J40j39M8K79p7o8J56j33j99R8Lj12J80Q1p2O0K2j53k6on0P5L8L3
3065B6Q4m5q5O3q4j00J18K6r2J70N6j66P3O1k18N6J24j57M1K08j32o9J73r5j38
3090a02J29k0r8J13K5o1P3j4q5N4k4p4O7J3l8Q0qn5O1k6j01Q9j2j01J46N8j30
3117d1P9Q0j90MJ18j24OJ54p0k0J26j07p3R4q6n0J41%o3J12k5r0J1j8n8O9J4j1
3145a8J13l8j13P8l4j33J02Q1q9R3P0j22J0L1j27K1J21p7M8J46j24o0P7j31o4
$$ plain form
3170 -139 -15 -3 -3 121 100 47 68 -23 -99 -3 -17 -38 115 98 2 32 -45 -181 -102 -74 -86 90 147 69 130 87 -108
3197 -108 -86 -26 -135 -28 115 41 23 66 -88 -148 -87 -102 -22 179 175 172 226 74 -77 -77 -149 -161 -12 37 53 117 31
3224 31 -88 -52 -134 -147 67 151 155 283 221 -13 -63 -141 -307 -207 -69 -66 77 186 32 -3 17 -136 -110 82 106
3249 106 156 271 174 18 -73 -215 -306 -208 -131 -17 171 198 158 145 10 -83 -23 -36 12 187 150 67 76 -107 -309 -233
3275 -233 -210 -209 52 223 144 217 213 -46 -97 -36 -130 -82 111 78 40 78 -69 -198 -172 -152 -104 86 192 227 257 138
3301 138 0 -67 -157 -159 -29 0 62 147 55 -63 -44 -145 -188 -4 67 57 232 207 -3 -13 -57 -246 -165 -4 -29 54
3327 54 191 64 -32 -5 -101 -147 -18 36 58 158 133 37 -6 -98 -139 -84 -34 36 135 114 99 82 -56 -139 -54 -92 -80 99
3355 99 114 27 78 25 -160 -88 -23 -97 29 178 45 39 81 -93 -175 -65 -107 -88 75 98 64 84 33 -37 -36 -36 0 61
$$ packed form
3170a39J24J2%J24k1n3K1r1p6R6j4k1J53j7r6L0p7j36P9K8j2J76N7p8O1m3j95
3197a08K2O0j09J07J43p4j8M3j54o0O1j5Q0K01mlN4j52j51%p2j2J49M9J6O4q6
3224C1j19L6q2j3K14Q4MJ28o2k34n0p8j66J00J38LJ43J09j54l5K0j53K6J92K4
3249A06N0J15r7j56r1j42r1R8P7J14J88K7m0j3j35r3O0j3M8J75l7q3Rj83k02P6
3275b33K3JK61J71p9P3mk59n1O1r4M8J93l3l8L8j47j29K6K0M8J90J06L5L0j19
3301A38j38o7r0kJ30K9O2Q5r2j18J9j01m3J84P1j0J75k5k10j0m4j89Q1J61k5Q3
3327E4J37j27r6K7r6m6J29N4K2J00k5r6m3r2m1N5N0P0R9k1j5j7j38q3Q5l8J2J79
3355I9J5q7N1n3j85P2O5p4J26J49j33oM2j74q2J10m2J9J63K3l4K0n1p0J%L6O1
$$ plain form
3383 61 69 77 93 -28 -69 -50 -116 -101 38 45 30 171 89 -56 45 -9 -149 -19 61 -46 17 99 -65 -103 -7 -97 -107
3410 -107 40 39 15 116 72 -18 8 -36 -73 -32 -4 5 48 14 14 31 -54 -31 29 -21 1 118 25 -32 81 11 -107 25
3438 25 10 -99 19 82 -69 -4 76 -79 -56 63 -44 -63 68 -14 -60 35 4 -59 3 3 -40 5 -8 -12 14 -10 7 48
3466 48 -12 -18 47 -30 -52 52 -8 -39 94 46 -53 69 23 -99 24 47 -78 30 95 -50 -16 54 -78 -78 29 -33
3492 -33 -30 83 38 -3 36 -32 -83 -37 -52 -27 43 16 12 56 -22 -55 11 -58 -47 90 52 5 109 24 -91 4 -30 -126 43
3521 43 83 -27 68 94 -64 -45 8 -116 -44 79 9 22 106 -21 -62 -28 -96 -81 23 17 51 117 12 -21 -12 -114 -98
3548 -98 26 -4 22 150 61 -24 51 -63 -137 13 10 -33 144 120 -20 51 15 -154 -58 29 -53 49 148 22 -1 30
3574 30 -103 -113 -26 -63 -1 105 54 35 34 -72 -110 -50 -84 -9 105 62 65 108 -55 -102 -13 -92 -84 115 87 22 142 32
$$ packed form
3383F1QQJ6j21m1J9o6J5J39Pj5J41q2j45J01n4j40J30Q0j07O3Q2j64l8R6r0j0
3410a07J47jk4J01m4r0K6m4l7M1K8RM3l4%J7q5K3O0n0K2J17r3n7J13p0j18J32
3438B5j5j09J18O3j51O5Q0j55K3J19j07j9J31q2m6R5l1o3O2%m3M5j3mK6k4J7M1
3466D8o0oO5p7k2J04o0l1J33m8r9J22m6j22J23K3j25J08O5j45L4P0j32%J07o2
3492c3LJ13m5m1L9o8n1M6j5K5P0k7mM4p8l3O6o9J1J37l8m7J04q5j15R5l4r6J69
3521D3M0j10R5K6j58J9N3j24P2J23p0J3Q4j27m1L4o8J5J04oL4O6j05l3Rj02J6
3548i8J24l0K6J28q9q5P5j14p4J50lm3J77k4j40P1l6j69R6Q7q2J02R9j26k3L1
3574C0j33j0Q7l7O2J06n1j9jj06l8O0l4P5J14m3LM3j63m7Q9p9QJ99k8o5J20j10
$$ plain form
3602 32 -134 -25 -51 -138 35 112 23 103 106 -71 -60 -22 -136 -48 69 30 62 101 -23 -60 -35 -130 -73 47 21 67 131
3629 131 11 -29 -10 -118 -116 25 -3 30 160 57 -13 54 -54 -132 13 24 -20 145 122 -29 18 -19 -160 -72 3
3654 3 -55 59 131 19 25 38 -97 -80 6 -51 18 104 27 0 15 -103 -111 -40 -76 -31 103 60 49 97 -9 -69 -11 -62 -58
3683 -58 76 58 9 80 6 -114 -39 -42 -98 53 110 42 98 112 -48 -37 -8 -109 -53 38 -28 3 67 -42 -74 -14 -86 -74
3711 -74 56 35 45 105 29 -31 7 -76 -88 -2 -17 -23 76 45 -22 38 -1 -65 19 38 -3 81 74 -30 13 2 -106 -42 11 -60
3741 -60 19 86 -7 -8 44 -58 -41 26 -30 -30 64 -2 -29 25 -31 -80 17 -13 -43 36 33 -19 33 11 -47 8 5 -48 39 44 -21 47
3773 47 42 -43 8 27 -37 9 48 -27 7 46 -47 -26 25 -46 -32 34 -16 -31 35 -18 -54 17 -18 -45 30 5 -53 35 10 -62 10
3804 10 26 -50 8 43 -30 16 32 -17 6 26 -32 14 44 -20 11 55 -25 -2 48 -39 -14 36 -33 -25 43 -37 -39 47 -20 -57 46
$$ packed form
3602C2j66J09k6q7J73P7q9Q0Lj77J1L8j14Q8J17l9L2L9j24l7K5r5N7J20k6M6O4
3629A31j20m0J9j08KJ41k8L3J30j03p0O7j08p8J45J1m4J65k3j51M7l7j41Q8P5
3654Cn8J14P2j12OJ3j35J7Q6n7O9Q6p7k7J5j18qP1l6M5J34m3j1M8j06o0N8n1M
3683e8J34j8m9P1p4j20P5ln6J51N7o8N6J4j60J1K9j01N6R1o6L1O4j09l2O0p2J2
3711g4J30k1J0O0p6o0L8q3j2Q6j5oR9l1o7O0l9o4Q4J9m1Q4pj04M3j1j08O4N3p1
3741f0P9O7r3jN2j02J7O7n6%R4o6k7N4n6m9R7l0l0P9ln2N2k2n8N5ln3Q7No5O8
3773D7nq5N1J9o4M6L9p5L4L9r3K1N1p1J4O6n0j5O6n3l6P1l5k7P5k5n8Q8k5p2P2
3804A0J6p6N8L5p3M6J6m9K3K0n8M6L0o4L1M4q0K3N0q7K5N0o9QO8q0kQ6o7l7J03
$$ plain form
3835 46 -2 -55 50 17 -56 18 24 -69 -7 9 -86 -7 32 -54 18 63 -8 17 73 0 8 64 -7 0 40 -29 -17 14 -58 -44 20
3866 20 -41 -2 97 14 19 113 5 -41 50 -26 -89 28 -9 -111 5 -6 -118 -5 28 -65 22 111 25 56 106 -2 -26
3893 -26 -1 -68 -73 -13 -50 -7 39 -20 13 50 -18 33 81 1 57 127 -8 -16 61 -92 -136 16 -65 -109 75 60 -66 65
3921 65 64 -90 13 61 -68 14 78 -30 -39 26 -84 -96 -26 -41 -12 46 31 70 60 11 48 25 -68 28 67 -65 24 99
3949 99 -77 -57 76 -73 -85 100 6 -64 132 54 -103 56 30 -149 -15 57 -81 -19 81 -46 -38 36 -32 -43 6
3974 6 -3 6 10 -9 28 -4 -73 26 14 -71 53 73 -60 37 107 -88 -20 122 -75 -72 124 -25 -106 106 18 -120 54 61
4002 61 -88 32 89 -61 -9 39 -65 -51 12 -35 -29 -2 -13 6 -22 -16 56 -1 -26 91 33 -70 66 45 -131 5 76
4029 76 -111 -10 136 -46 -32 131 -27 -91 113 6 -81 92 58 -77 25 46 -97 -38 15 -44 -18 25 10 16 -18
$$ packed form
3835D6m8n3J05l3p3P4Or3O2J6r5P9L9q6P2M5p1K5N6p3QN6p1PM0o9J2L1p2J4O4
3866B0o1L9R9q3NR4j08m6R1p6o3J17l7j02J16j1j12J13L3r3Q7Q9q6L1N0j08k4
3893b6K5o7nO0l7M3M6n9L3L7o8N1M8q0N6P0j35qP7j53m4J52q1m4J84j5j26J31
3921F5jj54J03M8j29Q2O4j08rO5j10j2P0j5K9N8j5L9j0m9L7k3r3R6L9j32Q9P5
3949I9j76K0J33j49j2J85r4p0J96p8j57J59k6j79J34P2j38O2J00j27QP4o8j1M9
3974FrRMj9L7l2o9R9j2q5J24K0j33R7P0j95O8J42j97LJ96j49q1K12q8j38J74P
4002F1j49J20N7j50N2M8j04J4O3m7OK7j1J9k8OP2n7k5J17n8j03J36k1j76J36P1
4029G6j87J01J46j82J4J63j58o4K04j07q7J73l4j35J02K1j43N9N3n9K6M3j5Ol4
$$ plain form
4054 -18 -7 19 -56 -41 53 -11 -41 90 12 -94 46 25 -127 46 95 -84 48 153 -52 -26 112 -58 -98 99
4078 99 7 -65 93 58 -65 17 17 -72 -11 31 -10 19 30 8 4 -32 -18 1 -66 -30 58 -29 -27 91 -16 -91 62 16 -121
4107 -121 64 84 -80 46 120 -88 -18 94 -63 -56 109 11 -48 101 22 -74 17 19 -55 -3 30 -8 7 12 3 -18 -39 -9
4135 -9 -6 -55 -7 52 -45 -24 52 -55 -85 70 -8 -92 71 46 -95 47 88 -96 -6 95 -74 -41 105 -16 -37 88
4161 88 6 -57 48 25 -47 18 32 -19 -7 24 -3 -23 -5 6 -5 -21 2 19 -50 -12 33 -39 -43 56 -25 -75 53 9 -82 51
4191 51 39 -85 24 73 -69 -25 81 -48 -37 88 -8 -47 63 19 -50 36 28 -45 15 29 -20 -6 24 -6 -12 -8 2 -7 -29
4220 -29 2 3 -32 -23 17 -36 -46 31 -17 -55 50 28 -52 35 48 -60 2 56 -61 -18 79 -26 -31 82 -10 -55 65 44 -34
4249 -34 62 70 -24 26 45 -29 -38 12 -38 -38 6 -6 -6 8 20 0 -21 -2 40 -1 -5 46 1 -56 7 -19 -101 -13 26 -61 16 94 -3
$$ packed form
4054a8J1K6p5J5R4o4l0J31p8j06J40k1j52J73M9j79J32J05k05K6J38j70m0J97
4078I9r2p2J58l5j23Q2%q9O1M2m1K9J1k2ml6J4J9o7L6Q8q7KJ18j07p5J53m6j37
4107a21J85K0j64J26P4k08P0J12j57PJ65r8n9J49p9r6R1Kp4N2L3l8J5Nrk1k1L0
4135iLm9M8N9r7K1P6j07l0J55p8q4J63k5j41J42M1j84R0J01j69L3J46j21k1J25
4161H8q2o3J05k3p2O5J4n1J2L1k7k0J8J1j1j6K3J7o9L8M5p2mR9q1n0J28m4r1J33
4191E1j2j24J09M9j42M4J06j29J1J25r6l9J10m4o9Q6qp3O0J4m9J4L0l0oMJ0rk2
4220b9L1Jl5RM0n3j0P7m8l8J05k2q0Q7J3j08O2N4j17M3R7j05nJ13r2m5J20k1p8
4249c4R6Qr4N0J9p4rN0n0%M4j2%J4J2k0k1J9M2m1mN1m5n7O3k6q2Q8L9q7P7P8r7
$$ plain form
4282 -3 14 105 -1 -26 90 19 -42 58 27 -78 16 1 -116 -34 31 -41 4 94 50 31 73 20 -25 -9 -20 -31 -23 -42 -27
4311 -27 -38 -62 -14 -17 -43 31 81 18 77 119 -13 -6 55 -65 -84 24 -34 -76 60 27 -61 49 61 -46 54 111 9
4338 9 54 85 -21 -28 3 -78 -81 -40 -55 -35 13 11 20 22 -4 14 27 -25 24 42 -38 -11 36 -64 -65 18 -64 -51 68 27 -3 98
4370 98 53 -41 63 23 -76 30 34 -41 16 34 -51 2 29 -41 -3 31 -14 19 52 -10 -3 28 -54 -25 8 -68 -28 30 -40 -15
4400 -15 51 -40 -17 53 -23 -42 49 -16 -47 50 5 -43 52 20 -27 49 21 -45 34 37 -31 26 34 -32 11 11 -66 -12 6 -50 17 59
4432 59 -26 21 48 -49 -28 15 -74 -36 27 -45 -26 41 -39 -49 32 -31 -43 51 35 18 102 43 -27 15 -37 -80 -6 -10 -20 66 47
4463 47 3 56 15 -59 9 9 -37 66 67 -15 40 19 -98 -62 -30 -101 -23 70 11 31 78 -24 -40 -7 -67 -57 36 5 36 82
4493 82 8 -31 -13 -60 -67 16 2 35 128 68 10 49 -36 -101 -2 -10 -39 84 87 1 56 20 -103 -60 -31 -77 3 83 21 49 42
$$ packed form
4282cJ7R1j06k5J16p1o1J00l1j05R4j5j17Q2O5p2M5R0m4j9M2n3m5J6j1j1Qj9J5
4311b7j1k4M8lk6P4N0o3N9M2j32PO1j20j9J08n8m2J36l3q8J10J2j07J00N7j02
4338IM5L1j06pL1q1lM1j5K0M8kRKk6J8J3n2M9J8q0K7M7j00jQ3q2J3J19m1l0J01
4370I8m5r4J04m0r9J06Mp5N7J8q5N3K7p0L8L4m5L3L3o2PL1q2K9L3p6M0N8p0K5
4400a5O6r1K3P0p6j9R1o5l1R7m5m8R5l2m7P6k8o6P9Lo8N7Qo6M3%p7N4J8n6O7M2
4432E9q5M7K7r7K1M3q9L8O3p2J9O7q0j0Q1o3j2R4j6j7Q4n9p0M2n2m3P4mj0Q6j9
4463D7m4N3m1p4O8%m6J03Jq2N5k1j17L6L2p1P8R3n9K0M7j02j6L3o0J0R3l1L1M6
4493H2p4l9J8m7pQ3j4L3R3o0n8L9q5o5R9qk9J23Lq6N5l6j23M3K9m6Q0Q0o2K8p
$$ plain form
4524 42 -53 -66 -43 -84 -30 32 21 59 79 -5 -18 -25 -89 -50 24 -12 54 106 31 -1 40 -69 -82 19 -20 -8 107 81 5
4553 5 51 1 -100 -44 -17 -65 20 66 10 36 30 -51 -50 -27 -55 -1 26 12 39 38 -30 -16 -17 -68 -23 26 -12 46 86 -15 7 52
4585 52 -50 -52 48 -20 -1 79 35 -9 55 6 -49 3 -1 -32 21 33 -17 26 21 -28 -18 -12 -49 3 3 -21 25 4 -23 8 9 -42
4617 -42 0 2 -51 11 40 -18 24 64 -13 8 41 -33 -41 37 -14 -13 60 35 -3 46 7 -41 -15 -13 -29 21 31 18 43 11 -29 -26 -51
4650 -51 -68 -18 -10 -1 52 39 -7 4 -37 -92 -47 -16 -20 36 85 28 36 26 -63 -69 -23 -40 -3 80 80 56 60 -2 -73 -59 -62 -41 24 60
4684 60 72 73 33 -44 -65 -89 -105 -31 -1 36 94 69 9 -21 -72 -122 -81 -40 6 85 101 41 21 -24 -95 -104 -48 -28 26 124 116 75
4716 75 51 -25 -100 -68 -57 -34 50 106 90 74 27 -57 -89 -95 -71 -16 51 78 94 67 -11 -72 -97 -128 -80 -3 32 69 96 60 -6
4747 -6 -38 -103 -97 -35 0 44 107 101 41 16 -46 -98 -76 -36 -4 68 98 89 62 23 -45 -62 -53 -48 4 62 50 44 36 -39 -77 -77 -79 -41 24
$$ packed form
4524D2r5j3K3m1N4O2j1L8K0q4j3po4L9P4l6O6N2p5l2M1j09j3J01l9J2J15k6p6
4553EM6n0j01N6K7m8Q5M6n6K6oq1JK3k8N4K7j4K7jo8J4jn1M5M9l8N8M0j01K2M5
4585E2j02kJ00o8J9Q0m4m4O4m9n5N2ml1N3J2n0M3nm9J0Ol7N2%k4M6k1k7L1Jn1
4617d2M2Kn3O2K9n8M2M0p7K1L3p4qP8n1JP3k5l8M9l9m8K6Kj6N0J0j3K5l2m0Lk5
4650e1j7N0QRN3j3m6J1m1n5M5L1mN6M9n7Qj0q9oM6j7L7Q3%k4Mo2p1J4lK1O5L6
4684F0J2Jm0p7k1k4j6P4L0L7N8k5o0l0n1n0M1M1M6P9J6o0k0m5p1rN6K0N4R8qm1
4716G5k4p6p5L2J1K3Q4N6j6j6m7q4l2oK4N5O7K7J6k7p8o1k5l1M8P7L5L7K7l6o6
4747fl2o5OO2L5M4O3oo0k5o2n2K2M0L2P2L0rk7l9o8j7RNN2N8j2oqp5l8%kL8O5
$$ plain form
4782 24 31 50 66 19 -43 -30 -57 -83 -20 19 11 46 49 10 -7 -20 -40 -15 12 14 42 69 19 4 13 -25 -12 -10 -20 4 24 4 18
4815 18 25 -29 -13 13 -26 -33 16 -27 -33 30 -9 -16 27 3 -33 7 -6 -59 -4 15 -23 18 59 5 -7 27 -18 -33 -6 -10 15 49 57
4848 57 57 36 -9 -18 -23 -47 -3 21 18 66 60 -9 -11 -24 -82 -58 24 -15 0 103 40 -36 -2 -43 -121 -46 -1 -17 65 95 29 18 -3
4881 -3 -81 -80 -16 -12 35 106 95 79 25 -19 -45 -79 -68 22 49 46 110 77 -26 -32 -44 -126 -66 39 5 61 136 35 -20 2 -90
4912 -90 -154 -29 2 -22 88 105 10 1 -17 -113 -90 -30 6 71 123 97 77 16 -42 -74 -92 -72 18 42 54 130 75 -22 3 -41
4942 -41 -122 -33 58 0 73 141 12 -58 -23 -130 -158 -33 -8 1 110 100 24 27 -19 -109 -80 -33 -12 40 71 66 37 -18 -54 -51
4972 -51 -76 -30 71 65 73 141 73 -46 -4 -40 -137 -16 39 -19 57 111 -31 -29 4 -99 -107 27 12 4 97 71 -19 -14 -49 -100
5002 -100 -72 -26 -4 40 50 41 50 -23 -34 -10 -45 -18 64 29 26 95 3 -62 16 -22 -97 35 66 -22 54 89 -38 -15 22 -63
$$ packed form
4782B4PJ9J6m7o2J3k7k6O3L9qL5Ll9j7j3k0K5K7KK8K7n0j5Rl8J3Kj0K4K0k0J4
4815A8Pn4J6K6l9pM9m3oO3l9pM3k4l6M0j3n3N5J9l8M1M1n4j2L4m5j5K7mK5L4Q
4848E7%k1m5rnk4M4K4lM8oo9kj3n8K4Q2l9J5J03o3p6L4m1p8P5M5j6Q2L0o6j1k1
4881cp8JO4MM7P1j1j6n4m4k6l4J1R0K7lO4l3j03oj2q2O0J05l4N6P5j01n5K2r2
4912i0o4J25L1k4J10J7r5rj8r6K3O0L6O5N2k6k0o1n8l2j8K0R0K4J2P6n5r7K5m4
4942d1q1Q9R1n8P3O8j29p0L5j07k8J25K5RJ09j0p6Lm6r0K9M7K1N2L1nk9n5l6L
4972e1k5M6J01oQO8o8j19M2l6r7J21N5n8P6N4j42KL3j03qJ34j5qR3k6r0Nl5n1
5002a00K8M6K2M4J0rRp3j1K4l5K7Q2l5lO9r2o5P8l8p5J32L1q8P6L5j27K3L7q5
$$ plain form
5032 -63 -57 39 -21 -17 49 -5 -50 5 -25 -43 -2 2 -6 6 -6 2 -10 -40 1 27 -19 3 50 -22 -19 55 -8 -28 77 29 -39 48 7
5065 7 -84 6 16 -77 22 77 -15 5 63 -38 -72 3 -34 -31 27 34 9 20 -18 -64 -57 -72 -34 11 24 70 77 8 2 -18 -108 -65 26
5098 26 -22 18 111 36 -20 35 -47 -123 -5 20 -19 93 125 19 18 0 -107 -114 -29 -38 2 108 67 26 24 -38 -109 -81 -64 -13
5128 -13 39 64 81 51 -23 -64 -81 -127 -70 27 30 68 122 32 -39 -8 -87 -113 10 42 22 116 105 -8 -19 -17 -121 -89 21
5157 21 14 46 112 60 -10 -14 -71 -114 -72 -33 7 47 70 52 -2 -61 -57 -74 -79 -16 45 41 60 59 -13 -60 -18 -64 -65 31 49 20 89 63
5191 63 -33 -11 1 -70 -33 47 21 22 71 18 -33 -6 -32 -62 -18 10 0 28 37 3 -23 -19 -32 -39 -32 0 8 0 24 27 -21 -27 4 -20 -31
5226 -31 26 22 -16 27 37 -19 5 35 -35 -8 29 -17 -26 45 13 -29 24 5 -46 1 13 -48 -17 12 -8 -7 -3 -13 -25 -23 -22 -19 -6 -15
5260 -15 -3 0 0 10 3 -27 0 0 -31 25 47 -17 8 49 -17 -17 35 -13 -27 46 22 -23 41 30 -35 3 0 -48 -8 26 -17 -11 17 -14
$$ packed form
5032f3OR6o0MO6n4m5N5l0j8M1MqJ2j2Qj2l0M1K6m6K2M7p2LP4o3k0J05m8o8Q7m1
5065Gr1R0J0r3R9N5r2K0N8j01l4P5l7LN8Pk5J1l8m6Pj5L8M5J3M6Po9ok0r0M3R1
5098B6m8M0R3p5n6N5q2p6J18K5l9J12L2j06jj8j07pQ5rM0J06m1m1ko2p1K8J7N1
5128a3N2K5J7l0p4m1j7m6N7R7LL8N4r0p1L1p9k6J23L2k0R4j1j13j1Kj04L2J10
5157B1pL2O6n2p0mn7m3M2L9M0M0K3j8n4n9Mj7nO3O1mJ9jp2m7M2m6jR6J8k9O9k6
5191F3r6K2J2p1L7Q0k6JM9n3n1K7k6l0M4K8j0K8Rl4k6Mj3pPL2QqK4Lm8oL1k4j1
5226c1N7ml8M3J0n6K4L0p0K7L7m6rP1l2m2N3j9n1M7J2o1L1K9k0JMj0j2KJLJ3r
5260a5J2L%J0pl0K7%l1N6K2o4K5M1o6%N2m8j4P3k4m5O4j1o5L8lm8M0L4m3OK8l1
$$ plain form
5294 -14 -22 -15 -26 -25 -32 -12 -3 -5 -10 16 13 -33 -5 10 -47 -13 27 -19 3 44 0 -9 33 -15 -30 31 7 -7 49 38 -22 25 15 -52 -27
5329 -27 -12 -42 -17 -4 1 6 20 -22 -21 -14 -51 -28 6 -5 17 12 -15 -1 -31 -60 -27 7 -26 14 71 28 3 44 -23 -44 13 2 -19
5362 -19 43 39 8 24 -10 -51 -26 -17 -23 19 68 36 45 32 -39 -47 -59 -58 -30 3 -3 34 16 -35 -36 -21 -65 -26 27 22 43 69 20 -12 -8
5397 -8 -57 -59 -12 2 18 77 57 15 16 -14 -30 -6 3 21 52 49 28 20 -34 -62 -48 -31 -31 14 47 17 36 -3 -51 -40 -28 -58 -5 42
5431 42 14 12 32 -31 -54 -10 -23 -17 31 44 35 39 25 5 -19 -28 -3 10 19 30 37 8 -5 -5 -42 -26 5 4 5 50 19 -25 -1 -28 -67
5466 -67 -21 8 -23 16 33 -13 -25 -15 -28 -32 -3 -4 -1 19 7 -5 -15 -1 1 -16 14 38 35 30 35 13 -29 -3 7 -22 10 40 -1 10
5500 10 36 -32 -39 -1 -10 -23 27 29 -10 7 0 -53 -47 -10 -22 -12 17 17 0 11 7 -9 -14 1 28 14 14 39 -3 -26 6 -23 -33 30 34
5535 34 1 46 50 -18 -6 22 -33 -25 31 -5 -16 30 2 -42 -11 -23 -45 -17 -6 -9 8 14 -15 -14 -23 -28 -23 -25 -1 19 -16 10 22 -19 -21
$$ packed form
5294a4qPj1JpK0RknK6lm6K8J5n7L4M0m6K2M1m4rM2m8j5O1k4j4N6j1o0M7j0o7K5
5329b7J5l0K5J3NNJ4m2JPl7K3L4j1K2nk7J4l0k9L3L4l3M0N7m3k5M1o7k1N7j1k1
5362a9O2ml1J6l4m1K5RoM2M9l2Rj3p1qj2JK8L3oL7j8n1jJ5m4L9N3nK1K6m9l2M
5397hm9kM7J4J6N9k0m2Jl0j6K4RJ8L1lk1qn4k8J4J7%M5L3l0J9l9m8J1J2l0N3M7
5431D2k8kK0o3k3M4j3OM8J3rMj4k0k4rK5J3RJ1Pk9j3%l7J6L1jJM5l1m4K4k7l9
5466f7M6K9l1L9J7m6j2J0j3mK9jLK0j2j2j0J4Kj7L0K4lnNk2m2K6J0k9L2L0m1J1
5500A0K6o8pL8rj3N0Kl9J7pn3OL7j2J0K9%j7J1mj6nJ5K7j4%K5m2k3L2k9j0O3M
5535C4l3M5Mo8J2K8n5QN6l6j1M6k8m4L1j2k2K8J1lJ7Ok9JrnNkK4K0l5K6J2m1k
$$ plain form
5570 -21 23 1 -20 34 14 -18 27 19 -26 -4 26 -22 -9 33 -9 -17 14 -4 -31 1 -9 -27 -6 1 -15 -13 -8 -9 -24 -25 0 -12 -21 -16 -6
5605 -6 -5 -6 19 -2 -8 27 12 -19 21 16 -10 36 34 -15 18 31 -17 -2 40 -11 1 26 -11 -14 13 3 -21 -2 -5 -7 -10 8 -6 -21 -5
5640 -5 -23 -19 -32 -17 -4 -14 4 8 0 -19 12 -17 -29 29 15 -16 28 19 -20 -1 20 -26 0 38 7 16 34 7 -22 6 -6 -33 1
5673 1 17 -25 1 23 -13 -9 -9 -21 -21 -1 -7 2 11 -14 -2 -14 -24 -8 -13 -11 15 19 6 20 2 -25 -6 11 -18 20 34 6 6 43 -3 -17
5709 -17 27 5 -4 34 30 -13 19 16 -35 -23 -7 -9 -8 21 5 -7 -8 -18 -28 -12 -18 2 3 5 11 7 -7 -10 -2 -21 -6 21 11 10 45 10 -7
5746 -7 21 -8 -18 38 25 4 41 25 -5 14 5 -25 7 19 -12 13 20 -13 -10 0 -24 -27 0 -12 4 16 -9 -17 -2 -13 -14 -2 -3 6 24
5781 24 13 4 30 -13 -22 16 5 -2 37 17 -8 31 17 -28 10 19 -14 11 17 -3 3 12 -26 -18 8 -16 -11 18 1 -13 -1 -18 -24 -14 -19 -22
5817 -22 1 -5 -23 16 -20 -15 5 -11 -7 16 15 4 30 11 -19 18 13 -12 13 23 1 22 30 -6 0 13 -17 -11 3 -17 -8 11 -16 -14 16
$$ packed form
5570b1M4k2k1N4k0l2M5qm5K2L0m8J3M2m2qL1j8k7L2j0j8K1Pj6KNjj5jK5j2rNJ0
5605fJjK5k1oL5j5l1M0nk6M6km9L3J3m8J5M2n1J2K5l7lK7j0k4J9lklJ8j4j5J6
5640ej8Mj3J5J3j0J8Mqj9L1k9j2N8j4l1M4rl9J9K1m6K6L8l1RJ8k7k9K8j2k7L4
5673AJ6m2K6K2l6M%j2%K0oRRk5J2j2j0J6nKK6Mj3J4j8k7J9J7k9L8J4k8%L7m6j4
5709a7M4k2rL8mm3L2ln1J2J6kJK9j6j2jj0j0J6oK0JKOmj4lQj9J5K7j0jL5l5j7
5746gK8k9j0N6j3k1L7j6l0J9rl0L2J2l1K5Pl3LJ0k4lK7j2J6J2k5qJ5j1jJ2jRJ8
5781B4j1rK6m3rL8j1pL9k0k5L9j4m5L8Rl3K5Ok0ORl8QK6k4NK9j7j4J2j7oJ0nl
5817b2K3oj8L9l6NK0j6MK3jj1K6j9l0L7nk5K5J0k2K1Ql6OJ3l0OJ4k0RJ9k7KL0
$$ plain form
5852 16 -18 -15 6 -12 -20 8 -11 -19 -2 -21 -25 -3 1 -9 21 10 -6 5 16 -10 12 12 -7 16 23 4 18 19 6 10 24 -15 4 23 -2
5887 -2 5 11 -11 -11 8 -16 -14 3 -12 -20 14 -6 -27 11 -7 -15 -3 -7 -19 6 8 -21 11 14 -2 5 13 0 21 15 6 16 19 13 16 4 6 23 13
5926 13 -1 14 27 -23 3 6 -13 -6 3 -12 -6 0 -8 -20 3 -14 -30 0 -4 -27 2 -1 -19 5 13 0 0 23 -1 12 13 11 12 8 10 15 7 10 3 10
5966 10 5 17 6 2 21 7 -9 3 9 -19 3 12 -13 -12 -7 -11 -20 6 -11 -27 5 1 -32 -12 0 -19 -19 14 -2 -11 12 15 12 13 29 8 -1 10
6004 10 7 -11 13 19 0 3 21 -1 -4 14 18 0 15 9 -18 -9 -16 -31 -17 3 -22 -20 1 2 -11 -7 -12 -22 -20 -7 7 -12 -3 17 1 -14 14
6041 14 -12 -9 21 14 -1 36 30 7 11 11 -12 4 24 11 16 32 9 -18 -4 -4 -28 -14 1 -7 -4 8 3 -12 -15 -15 -27 -13 0 -3 -9 9 -2
6078 -2 -33 -19 0 -7 -9 28 13 -8 18 12 -16 13 4 -4 13 34 16 12 26 4 -5 -8 -2 -12 13 22 -2 -3 -4 -19 -33 -9 -6 -17 8 13 -1 -8
6116 -8 -13 -11 -31 -12 3 -4 2 20 11 -8 5 0 -11 24 34 10 22 32 2 -8 10 -11 -9 26 23 10 40 21 -6 -6 4 -27 -6 7 -1 3
$$ packed form
5852A6l4LK1j8qK8j9qJ7j9mK2Mj0L0j1j6J1J1k6K2%j9K3Pj9J4Jj3MJ4l9J9J9k5
5887bPOk2%J9k4KJ7j5qL4k0k1L8j8qJ2mj2K5Kk9L2Lj6PQj3K1orJ0LoLj2KJ7j0
5926A3j4J5J3n0K6Lj9PRj5OOqj2K3j7j6L0mk3K9lj8K4Qj3%K3k4J3JkJmKNqLpP
5966A0nJ2j1mJ9j4j6J2Ok8K2Rk5JNmrK6j7j6L2ml3K0J2j9%L3j6rK3LlJJ6k1rJ1
6004A0lj8K4Oj9LJ8k2lJ8Mj8J5ok7Rpj5J4K0k5KK1Jj3Mnj0KJ3J4j9RK0j6j5K8
6041A4k6LL0pj5L7ok3M%k3J6K0j3NJ6k3k7J4%k4J4J5qLJ2nj5l%j2J4J3loJ8j1
6078bl1J4J9pkL7j5k1K6ok8K9rqJ7K1j8mJ4k2rlOj0K5Rk4jjj5j4K4Lj1K5Nj4p
6116hnKk0J9J5pOJ8rj9J3nj1L5J0k4J2J0l0j0J8k1KL5lj3L0j9k7%J0l1K1J3qM
$$ plain form
6152 3 4 -18 -30 -18 -28 -22 -7 17 12 12 10 1 -21 -20 -15 -6 12 23 25 7 2 7 -15 -14 12 11 16 36 37 5 15 7 -23 -12 5 0 11 26 9 -3
6192 -3 -8 -26 -32 -13 -4 -7 12 25 2 3 -9 -26 -31 -18 -4 8 18 14 17 -4 -9 -2 -10 5 30 22 17 46 16 -4 6 3 -15 12 24 10 23 34
6230 34 -1 -15 -5 -22 -25 4 9 -9 8 5 -23 -22 -19 -29 -16 -7 0 6 4 9 -11 -20 -12 -10 -5 -3 26 19 -2 14 10 -13 5 14 -7 14 35 11 5 24
6270 24 -1 -17 16 -1 -9 12 4 -2 8 -9 -28 -15 -7 -21 -11 1 -14 -18 -9 -12 -14 -8 -19 -9 -2 1 3 5 -7 10 17 7 13 17 9 11 23 10 1 26
6310 26 9 4 31 7 3 22 3 -10 23 12 -20 -1 3 -26 -15 1 -15 -7 -3 -3 -15 3 -14 1 -2 -11 -3 13 -8 -2 18 7 -4 13 3
6345 3 0 31 11 16 26 4 -3 17 2 -4 16 7 -9 18 9 -9 7 5 -3 -1 -1 -29 -8 0 -18 -13 6 -7 -1 2 -11 -2 -4 -15 -8 0 8 8 16 6 7 18
6387 18 8 -10 2 13 5 23 24 14 21 5 -18 -5 6 -7 15 18 14 12 8 -20 -14 -15 -19 -1 8 -6 6 21 -33 -23 -18 -38 -26 15 12 17 34
6424 34 4 -11 -1 -17 -29 9 30 30 41 46 10 11 -12 -33 -14 5 12 50 29 40 12 -17 -30 -26 -33 -7 25 26 2 7 -9 -52 -33 -13
$$ packed form
6152CJk2j2J2j0OJ5K4n%krk2JNRJ8J1Kj8nNk2JK6jNK0Jl2J0ql0J1J7nJ1J5j7j2
6192cnj8oJ9RlJ9J3k3Jj2j7nJ3J4J2J0mLk1nPqJ5K5qnK9l0k0J0lj8K7J2j4J3J1
6230C4l5j4J0j7lK9Nj8J7lk8JLj0J3RPOkNk0rQKNKK9pk1J6mk3J8Rk1K1K1k4oJ9
6270B4k5j6L3j7qK1qoJ0j7j9J3Qj4J0J2j5mRlkOj1J0PLKKj2J7Pj0OMqKJ2j3rK5
6310B6j7nK7k4mJ9j9j3L3j1l2J9Mk9J1J6j6QM%j2J8j7J5lrQJ6k1OK0j1j1J7j0
6345ClL1k0NJ0k2pK0j5oK0rj6K7rj8J6kqK%k8K1Qj8NJ9j3OLj3Rkj1PQQ%Qj0JJ1
6387A8j0j8J2J1qJ8Jj0Pj6k3J3J1j3K2Lmkmk8OjmJ8Rj4J2J5n4J0Nk0J2M1lNJ7
6424C4l0j5J0j6j2L8K1%J1Nl6Jk3k1J9J9PL8k1J1k8k9j3MpK6L2Jk4Nj6m3J9K0
$$ plain form
6458 -13 -27 -3 41 14 15 22 -7 -37 -23 -26 -20 19 44 15 39 20 -6 -24 -9 -17 3 34 49 29 25 4 -12 -21 -28 -12 4 10 44 27 -15
6493 -15 1 -29 -46 -28 -21 -13 9 27 9 -12 -5 -39 -32 -9 -6 4 16 25 6 3 4 -11 -19 8 13 12 33 24 12 1 4 -6 -9 18 29 1 24
6530 24 22 -3 -16 -10 -8 -11 9 11 -7 -1 -11 -30 -19 -4 -16 0 10 6 -6 -8 -14 -23 -14 12 5 19 34 28 -2 2 -4 -11 4 19 17 25 33 8 -16 -13
6570 -13 -10 -16 -10 22 20 27 32 0 -23 -24 -34 -46 -9 4 13 6 12 -16 -35 -35 -30 -21 5 40 33 35 22 0 -22 -26 -27 -15 13 48 50 39 39 7 -24 -24
6610 -24 -6 -11 20 46 30 19 23 -11 -41 -34 -25 -16 17 29 15 15 6 -31 -44 -36 -25 -11 -1 29 30 24 10 -20 -33 -34 -18 -9 33 55 35 29 14
6647 14 -3 -35 -13 8 11 42 53 31 19 13 -10 -29 -9 -11 -10 32 26 4 21 -9 -35 -28 -23 -31 -17 7 11 14 11 -5 -15 -23 -21 -2 2 16 21 16
6685 16 8 12 -3 -11 2 -4 1 17 37 10 30 33 2 -8 10 -12 -6 20 17 6 22 16 -15 -11 -8 -29 -14 6 -3 2 5 -3 -9 -11 -12 -18 -5 0 13 11 9
6726 9 8 0 -7 -1 9 -3 14 29 14 18 16 9 9 16 -4 -11 12 6 -8 10 26 -5 12 6 -26 -19 4 -7 -11 1 -12 -16 -5 -21 -16 -4 -11 -11 -3 0 4
$$ packed form
6458a3j4K4M4k7JPk9l0J4lOL9K5k9K4j9k6j8J5qK0L1J5k0mk1j6rpJ6J6OL4j7m2
6493a5J6l0j7J8PQK2J8j8k1Pl4PK3LJ0J2Rj9lJj5qK7NjK1rj2j1Lj0lK7J1k8K3
6530B4kk5j3OKlK0Kj8Oj0j9J1J5j2J6J0mj2korRK6pJ4J5ol0MopJ5J5kQQk5k4L
6570a3LoOL2kPNl2k3jj0j2L7J3RpOk8j9%NRK6L5pKj3k2k2mjJ2K8L5Kj1%l2l1%
6610b4J8nL1K6j6j1Ml4l0PRRL3J2j4%rl7j3QJ1J4J0L0Joj4l0j3jJ6RM2K2k0oj5
6647A4j7l2K2K1LL1J1k2j2ok3j9K0kJM2ok2J7l0k6PNqJ4K4MLlj6j0qKJ9MJ4Nn
6685A6qMj5qJ3oNJ6K0k7K0Ll1j0J8k2OK6lj1J6ol1MLk1J5K0rNLqokjoJ3NJ3kk
6726IjqpOJ0j2J7J5j5Mkp%Pk0pK3oj4J8J6l1J7ol2PK3j1mJ2j3mJ1j6NJ2p%QLM
$$ plain form
6767 4 17 3 9 1 0 -10 5 6 13 42 15 19 45 9 -2 10 -3 -7 20 32 11 24 21 -21 -10 1 -37 -20 12 2 9 16 4 -26 -20 -31
6803 -31 -30 -8 1 12 18 25 9 -4 -27 -29 -10 -15 12 43 36 40 42 4 -19 -16 -20 -13 26 45 22 24 23 -24 -21 -33 -36 -19 18 26 27 39 6 -30 -24 -55
6843 -55 -50 -20 4 20 34 21 -1 -21 -35 -48 -28 -6 12 44 48 18 23 -5 -36 -17 -7 0 38 58 37 33 15 -20 -31 -25 -29 -10 33 32
6877 32 19 21 -6 -28 -33 -37 -32 6 7 0 24 6 -14 -14 -40 -34 -15 -6 21 39 30 21 8 -16 -33 -6 4 5 31 45 39 22 14 -2 -10 -2 -6 2 35
6916 35 15 12 8 0 -12 -2 -12 -12 0 -3 -5 6 -8 -20 -21 -20 -15 -6 -10 -19 4 4 -2 -4 14 -6 4 13 11 8 17 12 7 26 13 13 25 12 4 16 4 7
6958 7 18 13 8 12 6 -19 -14 -15 -13 -4 -4 -2 8 18 -10 -10 -27 -39 -19 -4 -5 17 31 16 2 5 -11 -17 -9 0 21 36 41 19 24 10 -12 -3 -6 17 25
6999 25 36 30 27 10 -17 -19 -30 -14 -14 14 14 30 6 -8 -22 -44 -37 -19 -13 9 29 23 7 -10 -13 -25 -36 -15 4 13 37 51 22 6 0 -17
7035 -17 -17 -4 21 23 39 43 16 4 -4 -25 -27 -7 10 6 19 26 13 -9 -27 -24 -32 -22 -7 4 9 16 -3 -20 -25 -48 -26 -10 8 16 34 32 19
$$ packed form
6767DJ3j4Oqjj0J5JPK9k7MK6l6j1J2j3mK7J2k1J3lm2J1J1l8J7L2j0PPj2l0Oj1
6803c1JK2RJ1OPj6j3k3kJ9nK7L1pMKl8k3LmPL9J9k3Kjm7Lj2lJ7L7QJJ2l3l6Ol1
6843e5NL0K4J6J4j3k2k0j4j3K0K2J8L2Ml0Nk8l1J9J0PL8K0k1mj8l5j1OmJ9M3j
6877C2j3Kk7k2nmNL8JpK4j8k0%k6OJ9RK7J8rrj3k4j7K7J0JK6J4oj7qj6qQmQL3
6916C5k0lmqj2J0j0%J2lkJ1j4j2jJNRmrK3%okJ8k0J0RklRnnJ9j3%J2j3qJ2j2L
6958GJ1nnMok5NjKR%KJ0J0k8%j7j2K0J5jK2J4j5j4Lj6oQRK1J5Nk2Nj4k2RlK3Q
6999B5J1olj7k7kj1J6%K8%J6k4j4j4k2PJ8OK2K0oj6j7lj2j1K1J9RK4J4k9j6oj7
7035a7%J3K5KJ6Mk7j2qk1kK0J7mJ3Pj3k2j8LqJ0J5J1NPj9j7nk3K2J6J8QJ8kj3
$$ plain form
7072 19 6 -6 -28 -22 15 15 28 33 39 20 4 -2 -22 -14 -4 -4 17 27 19 -6 -14 -29 -29 -20 -10 -10 0 13 2 -7 -19 -19 -32 -30 -17 -2 10 15
7110 15 14 0 -8 0 -6 -2 9 12 11 35 26 13 8 19 1 -2 21 10 18 13 16 0 2 -8 -17 -4 0 -11 -7 -4 -2 -3 2 -20 -17 -26 -25 -11 -21 -3 -10 -6 -1 -1
7154 -1 -5 -4 -1 -1 -6 3 12 8 14 20 20 10 9 2 1 15 14 2 12 16 -3 1 -2 -19 -12 -22 -1 -2 13 14 -6 -12 -15 -20 -11 -24 -18 -7 7 12 -4 2 0 -17 -15 2
7200 2 11 14 27 29 32 16 0 -9 -6 5 8 8 22 39 10 18 1 -18 -7 -10 -8 1 20 1 -4 -5 -24 -35 -20 -7 -13 2 11 10 3 -4 -13 -24 -21 -14 1 10
7242 10 23 28 17 19 7 -5 -4 3 13 25 29 43 20 12 12 -20 -3 8 1 11 26 14 -6 -5 -15 -17 -12 -7 -2 8 -1 10 -1 -22 -27 -12 -14 -10 1
7281 1 15 8 22 13 8 -2 2 -2 14 16 13 30 19 12 3 7 -8 7 10 13 5 19 17 4 -2 -14 -21 -10 0 -10 6 4 -6 -6 -7 -29 -14 -13 -6 3 -1 3 -1
7324 -1 7 -3 1 5 -4 2 19 16 3 23 11 9 11 5 7 15 14 8 8 17 2 20 7 1 2 10 2 -2 -7 -12 0 -8 -23 -6 -8 -20 -7 -3 -15 -3 6 -13 3 -6
7368 -6 4 -6 10 0 2 17 7 -10 11 11 -6 17 6 -3 15 7 2 12 14 3 1 8 -17 -15 -2 -12 0 -10 -7 -11 -2 -21 -14 -10 -21 -2 0 -5 -9
$$ packed form
7072A9j3j2k2OL7%J3NOj9j6ok0QJ0%K1J0qk5qj5%RJ0%J0J3j1rj2%j3KJ3J5J2N
7110A5jj4qQoMJ1LjK4rj3nJ1j8lK3j1QnLj6Kj0rJ3Mj1MLKjNk2LrJJ4j0J8pMN%
7154amJL%nRRmOO%j0jpjJ4jj2J0Mj9Mlj7Pj0K1jJ5Jk0olnRj3OJ1J4Nj6Okj7KJ7
7200BRLJ3KLj6j6rLJ1L%J4J7k9Qj7j9J1lKRJ9j9njj9j1J5J3oJ5Rjpprj1LPJ5R
7242A0J3Nj1Kj2j2JPJ0J2MJ4k3q%l2J7J1pJ0J5j2k0Jj0kNNNJ0rJ1j1k1nJ5kMJ1
7281AJ4pJ4rnj0MmJ6KlJ7j1prMj5J5LLqJ4kj3oj2pJ1J0j0J6kj0%jk2J5JPRmMm
7324aQj0MMrOJ7lj3K0j2kKoKQjo%Rj5J8j3oJQqmnnJ2qj5J7kj2J3Mj2J2Rj9J6r
7368fJ0j0J6j0KJ5j0j7K1%j7K3j1rJ8qnJ0Kj1kPk5KJ3j0J2j0LmRj9PMj1J9Knm
$$ plain form
7407 -9 3 -18 -9 -6 -6 -12 16 6 -5 24 14 2 12 12 -12 8 22 2 7 20 0 2 9 -2 -1 1 3 4 5 -2 -9 -12 -12 -7 -20 -14 10 1 -12 8 5
7448 5 -14 -12 -3 -4 -21 9 11 0 11 10 1 8 9 1 10 26 17 15 27 8 4 21 -4 5 15 16 0 12 7 2 -4 -12 -9 -9 -8 0 -2 -4 7 -2 -21 -17 -1 -2 -10
7493 -10 12 -6 -8 8 7 -12 6 17 -6 11 28 6 10 17 2 -3 8 4 16 19 28 11 16 15 13 -2 -4 2 -11 -6 -6 -8 -17 -6 -5 -22 -14 -2 -17 -6
7533 -6 7 -4 -4 10 -7 -19 -5 5 -12 6 18 5 1 10 6 11 22 24 18 18 18 12 14 13 14 3 11 -3 1 2 17 -3 -6 -3 -1 -15 0 -1 -19 -7 -12
7574 -12 -11 -1 -1 -4 -22 -6 -3 -14 -7 5 -12 4 19 9 14 22 16 7 7 3 4 3 19 9 4 13 -1 -8 2 4 -4 -2 -1 3 -14 3 -4 -19 -8 6 -15
7615 -15 0 -5 -12 -24 -13 -7 -12 -1 -12 -13 -3 1 -7 9 10 15 4 15 21 6 27 12 -4 11 8 2 -6 20 17 7 11 6 2 -6 -3 -7 -16 -4 -2 -8 0 -2 -25
7658 -25 -25 -6 -27 -10 -3 -7 -7 -7 4 -14 -13 2 2 -13 -3 10 3 15 15 3 11 18 4 4 23 14 15 22 2 -2 3 7 -9 -9 4 6 -13 7 -14 -24
7698 -24 -11 -2 -20 -16 -4 -9 -9 8 -6 -15 -11 -9 -8 -5 2 -5 -4 11 14 5 10 1 10 13 17 14 8 16 14 8 8 12 -4 4 18 6 -5 12 1 -15 -2 -6 -11 -7 0 -16
$$ packed form
7407iJ2k1RL%oK8j0j1K9j0j2J0%k4K0J4k0NJ3k0KPj1JKKJJppl%Nj3OK4rj3K0l
7448Ej9KRjj7L0Kj1J1jrPJqRJ6rkJ2j9mJ7k5RJ0Jj6J2nnoqL%JQkkJ1rj9MJ6jq
7493a0K2j8kJ6jj9J8J1k3J7J7k2MPj5nJ1mJ2LRj7Njkj5kOj3N%krJ1Jj7QJ2j5J1
7533fJ3j1%J4j7j2J4J0j7J8J2j3mRmNJ1Ko%%oKjJj1Qj4MJJ5k0lLKj4J5jj8J2n
7574a2JJ0%lj8J6Lj1PJ2j7J6J5j0NQor%mJjJ6j0nRj4pJ0KqKJMj7J7pj5J1J4k1
7615a5J5npj2J1OnJ1j1jJ0MqJ6JNj1J1Oj5K1j5j6J5loqK6lj0MnmqLmrJ2KoQkk3
7658b5%J9k1J7Pm%%J1j8JJ5%j5J0J3pJ2%j2QPj4%J9rJPk0mNMj6%J3Kj9K0k1j0
7698b4J3Rj8MJ2n%J7j4rMKJLPpJJ5LrNrRLMloQko%Mj6QJ4j2j1J7j1j6J3mnMPj6
$$ plain form
7744 -16 -15 -1 -11 -13 -6 -11 -27 -7 -9 -5 8 -4 1 -2 1 16 8 10 9 5 18 15 18 9 4 7 -8 -5 5 3 2 2 4 -11 2 6 -8 -12 7 -13 -12 -5 -17 -20
7788 -20 -1 -3 -17 1 1 -6 -1 -2 -1 -1 6 12 -1 -8 7 4 8 22 10 13 18 18 9 11 24 8 -8 8 5 4 7 9 -11 -2 -4 -6 -10 2 -19 -13 -8 -11 -20 -12 -16 -9
7834 -9 -11 -17 -10 3 -2 -2 0 2 -6 -4 -1 8 10 17 8 22 9 3 20 6 1 27 13 5 17 18 3 2 8 -6 -8 1 -9 -7 -1 -5 2 -9 -23 -16 -16 -3 -9 -6 9 5
7880 5 10 -5 -15 -7 -6 -4 2 17 12 17 11 4 13 14 -2 8 21 13 16 4 0 4 1 -4 5 10 7 -9 11 1 0 -6 -13 -10 -13 -8 -16 3 3 0 3 -16 -24 -11 -10 -4 12
7927 12 8 -2 13 1 -7 7 9 10 21 21 17 19 18 15 1 7 12 12 13 9 5 13 4 -8 -8 -9 1 -4 -3 -7 4 -6 -19 1 -16 -13 -15 -7 -13 3 4 -11 4 -3
7971 -3 -11 -5 11 7 10 20 8 9 11 0 2 18 20 8 17 8 -6 4 7 -4 -5 1 3 -4 -12 -5 0 -9 -4 -4 -8 -12 -3 -7 -8 -9 -13 -7 -1 -10 -4 0 10 -12 3 9 3 -4 18
8020 18 18 23 15 9 9 4 -1 7 8 13 11 10 6 8 -2 -2 -1 -4 -5 -6 -2 -2 -9 -11 -24 -23 -5 -10 -1 -4 4 -9 -13 8 -7 -6 11 -6 -6 11 10 -9 15 20 -1 21 13
8067 13 10 11 26 10 5 5 7 -2 -1 -8 3 -1 -13 4 -11 -11 -7 -15 -18 -16 -5 -17 -10 -18 -20 -10 -7 -20 -12 9 0 4 1 9 3 3 8 5 6 14 13 14 11 9 5 8 6 10 -4
$$ packed form
7744a6JJ4j0kPnj6K0kMJ3j2NlLJ5qKjmJ3lLrnLj5LJ0kj%Kj5J3Mj4mJ9k0JPj2l
7788b0J9kj4J8%pNjJ%POj3pJ5lMJ4j2LN%rKJ3j6j6J6ljLKk0RkkmJ2k1ONlrQmP
7834ikoPJ3n%KKqKLRKPrJ4j3oJ7j4nK6j4qJ2Jj5jOj4kRj0KOmPj1j4P%J3oLJ5m
7880ENj5j0QJKOJ5nNopRJj6J0J3qLj2mMlnRNlj6K0j0jopLlNqJ9%lLj9qJ3JOJ6
7927A2mj0J5j2qJ4KJJ1%mKjlj4ON%JmmQrj2%jJ0nJmJ1j0j3K0j7LkQoJ6Jj5J5p
7971cqOJ6mLJ0j2JKj1KJ6Kj2Rrj4J0Lj1jOKpqPNrN%mmRmjjmOOrOMJ0k2J5OopK2
8020A8%Nqo%nnQJNkjmKj0%JljjM%pkj3JJ8nRlQj3mK1j5JJ7j7%J7jj9K4Nk1K2q
8067A3lJJ5j6n%KrJpJ1mj2J7j5%MqlKJ1j2PqkJ0Lj3QK1rMlQo%NlJQjJlkmLkMj4
$$ plain form
8116 -4 7 14 -1 11 -2 -3 1 -1 0 -18 -4 -11 -8 -9 -8 -15 -8 -12 -11 -4 9 -7 -10 4 -7 0 4 2 -3 13 12 4 5 12 16 27 18 12 14 10 9 -12 2 20 -5
8161 -5 3 4 3 -10 -15 -5 -20 -5 -2 -17 -2 -10 -22 -17 -19 -13 -26 -10 -2 -2 -7 -4 -5 -2 -7 -12 -3 10 16 17
$$ packed form
8116dJ1Pj5J2j3jMkJj8J4pLjJpPmJPJ3j6lJ4j1PMknJ6jqJPMJ1roKmjk1J4J8k5
8161eQJjj3nJ0j5J5Lj5J5qj2NkOj3J6Q%nLjLnnRJ3OJ
8191A7
$$ Imaginary data points
##PAGE= N=2
##DATA TABLE= (X++(I..I)), XYDATA
$$ plain form
0 0 0 0 0 0 0 0 0 0 0 0 0 -8 8 -8 8 -16 16 -24 24 -32 40 -46 56 -64 73 -88 98 -114 134 -153 175 -200 227
33 227 -256 291 -324 367 -411 458 -512 570 -635 702 -778 861 -950 1048 -1157 1273 -1402
50 -1402 1545 -1700 1876 -2070 2286 -2531 2810 -3129 3500 -3936 4460 -5100 5905 -6953 8375
65 8375 -10425 13654 -19486 33320 -133697 -21173 167963 -176624 757 223445 -5831
76 -5831 -71051 108592 -33083 -84636 42617 -4862 -25337 102303 22437 -59471 19286 -7823
88 -7823 -115936 -68893 18065 29281 -12485 29881 134736 45911 -103964 33498 76908 -146462
100 -146462 -64165 150570 -28818 -91004 122745 14178 -135020 31217 1623 -114643
110 -114643 63723 75164 -68945 91698 123369 -111374 -25788 105262 -102294 -109281 99393
$$ packed form
0@%%%%%%%%%%%qJ6j6J6k4L2m0M8n6P2q6J02j20J37j61J86k12K48k87L28l75M27
33B27m83N47o15O91p78Q69r70J082j205J337j480J639j811J998k205K430k675
50a402K947l245L576l946M356m817N341n939O629p436Q396r560J1005j2858J5328
65H375j8800K4079l3140N2806j67017J12524J89136l44587J77381K22688k29276
76e831o5220J79643j41675n1553J27253m7479k0475J27640p9866q1908P8757k7109
88g823j08113M7043Q6958J1216m1766M2366J04855q8825j49875J37462M3410k23370
100a46462Q2297K14735j79388o2186K13749j08567j49198J66237k9594j16266
110a14643J78366J1441j44109J60643L1671k34743Q5586J31050k07556o987K08674
$$ plain form
121 99393 19813 -80684 45155 58826 -42767 -37079 2589 6969 -8191 -12473 44342 51911
133 51911 -18293 830 24877 -43914 -28673 10368 -40146 6938 58380 -41957 -10914 88162
145 88162 -46791 -82294 88931 15938 -101192 62086 81131 -80078 -6343 67076 -54139
156 -54139 -39816 41492 -18636 -13355 43389 -10964 -13434 36213 -18946 -36617 27392 9132
168 9132 -24254 12412 23367 -620 -16094 -13465 14641 -1726 -37918 21301 47237 -33155
180 -33155 -10728 52931 -25604 -48351 33753 -1698 -37246 35950 18224 -27414 29665 9757
192 9757 -50004 13725 22674 -47059 8724 54299 -21518 -15747 38547 -12635 -39820 6108 2932
205 2932 -13020 8799 15444 12675 8315 -8575 -4225 -1453 -20800 -6927 13240 -588 8812
$$ packed form
121I9393p9580j00497J25839J3671j01593N688L9668M380j5160m282N6815P569
133E1911p0204J9123K4047o8791J5241L9041n0514M7084N1442j00337L1043R9076
145H8162j34953l5503J71225p2993j17130J63278J9045j61209P3735P3419j21215
156e4139J4323Q1308o0128N281N6744n4353k470M9647n5159j7671O4009j8260
168I132l3386L6666J0955k3987j5474K629K8106j6367l6192N9219K5936q0392
180c3155K2427O3659p8535k2747Q2104l5451l5548P3196j7726m5638N7079j9908
192I757n9761O3729Q949o9733N5783M5575p5817N771N4294n1182k7185M5928l176
205B932j5952K1819O645k769m360j6890M350K772j9347J3873K0167j3828R400
$$ plain form
218 8812 19653 -7553 -3400 6960 -28381 -16115 23101 -9412 -11435 41629 11867 -26876 15906
231 15906 7559 -39484 -5299 16650 -15027 4778 27720 -1855 -1473 10676 -16422 -16981 4216
244 4216 -7351 -5475 18147 12359 1108 5857 -138 -10175 -12799 -10555 1087 4397 848 15710
258 15710 17045 -6511 -4012 2934 -19331 -16013 7665 -1332 -418 22303 9344 -6038 7262
271 7262 -5076 -23273 -3108 3168 -8942 9975 21466 1859 649 5807 -12209 -17435 -5096
284 -5096 -4203 -868 11521 13538 9258 5266 -2777 -9274 -12398 -11745 -3116 3992 7385 14469 12223
299 12223 -146 -3285 -7081 -17509 -11234 1762 1833 8497 18786 9208 -1058 -1060 -10853 -17673 -7066
314 -7066 -608 1827 12839 15371 6064 1579 -3906 -13446 -13301 -6504 -1208 6336 12599 12069 7452
$$ packed form
218H812J0841k7206M153J0360l5341J2266L9216l2513k023N3064k9762l8743M2782
231A5906q347m7043L4185K1949l1677J9805K2942k9575L82J2149k7098n59K1197
244D216j1567J876K3622n788j1251M749n995j0037k624K244J1642L310l549J4862
258A5710J335k3556K499O946k2265L318K3678q997R14K2721j2959j5382J3300
271G262j2338j8197K0165O276j2110J8917J1491j9607j210N158j8016n226J2339
284e096Q93L335J2389K017m280l992q043o497l124O53Q629P108L393P084k246
299A2223j2369l139l796j0428O275J2996P1O664J0289r578j0266kr793o820J0607
314g066O458K435J1012K532r307m485n485r540J45O797N296P544O263n30m617
$$ plain form
329 7452 -251 -7977 -11283 -11784 -7467 2254 8335 10459 12149 6103 -4043 -7654 -10456 -12355 -3908
344 -3908 5003 6872 10927 11467 1730 -4942 -6926 -11412 -9260 -249 4198 7822 11287 6279 -379
359 -379 -3677 -8996 -10030 -3704 388 4251 9708 7619 2265 -225 -6042 -9593 -4795 -1950 422
374 422 8001 8451 2563 1981 -1628 -8915 -6367 -1664 -1553 4005 8338 3909 1998 323 -6673 -6641 -1947
391 -1947 -2417 1724 8160 4641 1353 1605 -4528 -7558 -3229 -2501 669 7329 5084 2715 4227 -3599
407 -3599 -8676 -2028 -2729 -4051 6645 7828 379 3287 476 -9621 -5607 -1611 -4773 4614 11381
422 11381 3407 4585 6224 -7600 -10312 -2121 -6037 -4415 7734 7024 2823 4412 -2023 -7371 -4980
437 -4980 -6409 -2005 8732 7529 6498 11002 1059 -9241 -6239 -9883 -11630 516 3409 3185 12414
$$ packed form
329G452p703p726l306n01M317R721O081K124J690o046j0146l611k802j899Q447
344c908Q911J869M055N40r737o672j984m486K152R011M447L624L465n008o658
359c79l298n319j034O326M092L863N457k089n354k490n817l551M798K845K372
374D22P579M50n888n82l609p287K548M703J11N558M333m429j911j675o996L2M694
391a947m70M141O436l519l288K52o133l030M329P28L170O660k245k369J512p826
407c599n077O648p01j322J0696J183p449K908k811j0097M014L996l162R387O767
422A1381p974J178J639j3824k712Q191l916J622J2149p10m201J589o435n348K391
437d980j429M404J0737j203j031M504r943j0300L002l644j747J2146K893k24R229
$$ plain form
452 12414 5868 -5700 1531 -2600 -14197 1398 11129 -419 7738 15755 -3307 -9165 -3271 -14534
466 -14534 -14050 542 -218 4377 16235 6838 190 6407 -4424 -12248 676 2531 -1144 7854
480 7854 7579 -261 -2231 -10074 -12708 -4800 -7869 -3870 15272 11870 2347 13839 7420 -11671 -3932
495 -3932 -636 -11110 198 7165 -3405 3918 5203 -13539 -6858 3528 -11993 -3970 18163
508 18163 6498 1381 16358 5072 -9363 -2241 -5898 -10575 -952 -2038 -1606 8663 132 -6762
522 -6762 4777 -1001 -9982 4483 7585 193 8385 7260 -1717 2388 -4993 -13488 723 -1409
536 -1409 -13102 6329 12095 -8509 1227 12759 -7024 -5862 8711 -2026 -2031 8706 -1509 -1565
550 -1565 6765 -7982 -8802 6691 -5115 -10177 9578 4940 -6446 6059 5591 -4562 1369 59
$$ packed form
452A2414o546j1568P231m131j1597J5595R731j1548Q157Q017j9062n858N894j1263
466a4534M84J4592p60M595J1858r397o648O217j0831p824J2924J855l675Q998
480G854k75p840j970p843k634P908l069L999J9142l402r523J1492o419j9091P739
495c932L296j0474J1308O967j0570P323J285j8742O681J0386j5521Q023K2133
508A8163j1665n117J4977j1286j4435P122l657m677R623j086M32J0269q531o894
522f762J1539n778q981J4465L102p392Q192j125q977M105p381q495J4211k132
536a409j1693J9431N766k0604R736J1532j9783J162J4573j0737nJ0737j0215n6
550a565Q330j4747q20J5493j1806n062J9755m638j1386J2505m68j0153N931j310
$$ plain form
564 59 -3620 4657 -1207 -6103 7841 1629 -11209 4399 5857 -10444 407 8075 -5157 156
578 156 5935 -4529 1479 4828 -8313 829 8736 -9203 -3680 12062 -4651 -8177 9676 852
592 852 -7516 4883 1430 -4236 3571 -1733 -3768 6590 -1744 -6614 8121 2112 -9031 4405
606 4405 4621 -7358 964 3668 -4132 2312 1720 -5125 4793 2870 -9031 3621 7470 -9317 -840
621 -840 10011 -5530 -4709 7289 -2720 -4683 4428 -2593 -2242 6227 -2763 -2605 8896 -1217 -6303
636 -6303 7157 1329 -8123 2490 2193 -5776 456 735 -3151 2924 -66 -3723 5921 2421 -5587
651 -5587 5501 5862 -5883 1468 5137 -5979 -2504 1575 -6496 -2000 2403 -5302 1097 7660 -3066
666 -3066 193 9809 -1408 -3993 7050 325 -5610 3033 75 -5675 -291 -2607 -5821 784 -800
$$ packed form
564E9l679Q277n864m896J3944o212j2838J5608J458j6301J0851P668j3232N313
578A56N779j0464O008L349j3141R142P907j7939N523J5742j6713l526J7853q824
592H52q368J2399l453n666P807n304k035J0358q334m870J4735o009j1143J3436
606D405K16j1979Q322K704p800O444n92o845R918j923j1901J2652L849j6787Q477
621h40J0851j5541Q21J1998j0009j963R111p021L51Q469q990J58J1501j0113n086
636f303J3460n828r452J0613k97p969O232K79l886O075k990l657R644l500q008
651e587J1088L61j1745P351L669j1116L475M079q071M496M403p705O399O563j0726
666c066L259R616j1217k585J1043o725n935Q643k958n750N384k316l214O605j584
$$ plain form
681 -800 -2998 5811 5026 -384 5918 5412 -2421 466 920 -4502 -1540 -1006 -4691 -125 -316 -5808 200
698 200 2528 -4165 1778 7858 910 2665 8064 338 -2198 1586 -4490 -6051 -454 -3813 -4168 2855
714 2855 -192 -2969 3499 1789 -2329 3438 4371 492 3576 3768 -836 -530 -1878 -5488 -3311 -2730
730 -2730 -4227 350 2397 -291 2595 3854 -403 897 2785 -648 704 3030 -794 -763 988 -3620
746 -3620 -4213 -642 -3084 -3005 2588 1883 342 4048 2850 -727 1039 596 -2032 -28 656 -1132 282
763 282 235 -2112 -1112 -790 -2257 -144 1445 404 2028 2774 295 481 678 -1956 -1245 368 -1476
780 -1476 -503 1803 -492 -984 1308 -759 -1954 1061 593 -880 1692 1746 -706 301 498 -1697 -930
797 -930 235 -740 45 1182 218 166 477 -483 -545 -188 -458 220 415 -119 720 427 -1066 68 481 -1385
$$ packed form
681h00k198Q809p85n410O302n06p833K887M54n422K962N34l685M566j91n492O008
698B00K328o693N943O080o948J755N399p726k536L784o076j561N597l359l55P023
714B855l047k777O468j710m118N767R33l879L084J92m604L06j348l610K177N81
730b730j497M577K047k688K886J259m257J300J888l433J352K326l824L1J751m608
746c620n93L571k442P9N593p05j541L706j198l577J766m43k628K004O84j788J414
763B82m7k347J000L22j467K113J589j041J624P46k479J86J97k634P11J613j844
780a476R73K306k295m92K292k067j195L015m68j473K572N4k452J007J97k195P67
797i30J165r75P85J137r64n2L11r60o2L57k70O78J95n34Q39k93j493J134M13j866
$$ plain form
817 -1385 -36 1614 -586 -302 1838 -482 -1492 1024 -272 -1820 919 809 -1290 710 1261 -1202
833 -1202 -181 1128 -805 -614 1138 59 -606 584 315 -667 -369 158 -94 -526 116 819 -239 -436
851 -436 1001 -16 -1245 816 638 -1508 487 1435 -1532 -343 1827 -1179 -1216 1961 -253 -1738
867 -1738 1616 690 -1907 707 1259 -1575 -200 1444 -750 -804 1092 155 -961 269 759 -520 -638
884 -638 873 382 -1283 290 1345 -1340 -751 2090 -636 -1841 2158 480 -2735 1424 1691 -2898
900 -2898 273 2770 -2198 -1031 3068 -1065 -2163 2470 224 -2539 1386 1334 -2018 99 1592 -1043
916 -1043 -938 1051 246 -1035 123 1331 -314 -1207 1371 799 -2372 426 2281 -2447 -1026 3527
932 3527 -1431 -2759 3648 182 -4108 2746 2135 -4315 1251 3720 -3647 -757 4127 -2378 -2550 3616
$$ packed form
817a385J349J650k200K84K140k320j010K516j296j548K739j10k099K000N51k463
833a202J021J309j933J91J752j079o65J190k69r82K98N27k52m32O42P03j058j97
851d36J437j017j229K061j78k146J995R48k967J189K170l006l7L177k214j485
867a738L354r26k597K614N52k834J375J644k194n4J896r37j116J230M90j279j18
884f38J511m91j665J573J055k685N89K841k726j205L999j678l215M159K67m589
900b898L171K497m968J167M099m133j098M633k246k763L925n2l352K117J493k635
916a043J05J989q05j281J158J208j645q93K578n72l171K798J855m728J421M553
932C527m958j328O407l466m290O854o11o450N566K469p367K890M884o505j72O166
$$ plain form
948 3616 -432 -3133 2427 1345 -2625 559 1830 -1349 -957 1156 449 -1123 -247 1682 -207 -2044
964 -2044 1575 1335 -3188 599 3328 -3091 -1103 4710 -2157 -3512 4803 -329 -5427 3923 2424
979 2424 -5790 2025 4645 -4883 -638 5235 -3009 -2655 4549 -730 -3351 2887 787 -3113 838
994 838 1317 -1771 -425 1279 353 -709 4 1766 -274 -2299 1902 1436 -3882 851 3869 -3963
1010 -3963 -1465 5386 -2695 -4042 5631 -159 -5520 4718 2498 -6097 2453 4126 -5871 -225 5151
1025 5151 -3962 -2047 5395 -1301 -3211 3794 583 -3338 1311 1399 -1823 -379 834 20 -961 -971
1041 -971 1182 89 -2203 1941 2487 -2662 1310 4125 -3484 -1349 4595 -3578 -4212 5027 -1483 -5881
1057 -5881 4815 1723 -6324 3302 4679 -5000 1422 6312 -2973 -992 4987 -2351 -3720 2064 -1944
$$ packed form
948C616m048k701N560j082l970L184J271l179L92K113p07j572Q76J929j889j837
964b044L619k40m523L787K729o419J988N813o867j355Q315n132n098R350j499
979B424q214P815K620r528M245N873q244L54P204n279k621O238k100l900L951
994H38M79l088J346J704r26j062P13J762k040k025M201m66n318M733L018p832
1010c963K498O851q081j347R673n790n361J0238k220q595Q550J673r997N646N376
1025E151r113J915P442o696j910P005l211l921M649Q8l222J444J213q14r81j0
1041i71K153j093k292M144N46n149L972K815p609K135N944q173o34R239o510m398
1057e881J0696l092q047R626J377r679O422M890r285J981N979p338j369N784m008
$$ plain form
1072 -1944 -4212 785 -55 -1954 1047 1532 700 1193 1216 2295 1410 -772 1975 1421 -3962 -837 1300
1089 1300 -5805 -3323 3084 -3414 -3142 6063 954 -2627 6633 3374 -3744 4148 3687 -5293 373
1104 373 2909 -6140 -3179 1987 -4785 -3919 2850 -462 -1121 4443 3148 1193 3391 2253 471 256
1120 256 -1269 -1135 -1562 -3838 -1769 -936 -4203 -1002 2198 -1942 862 6144 828 734 6808 828
1136 828 -3098 3497 -590 -6727 204 -68 -6795 -789 2263 -4084 -249 4623 -568 773 5638
1151 5638 1460 302 3602 179 -2243 -270 -2123 -3416 -1689 -2105 -1501 75 -684 969 2443 132
1167 132 1797 3876 -43 472 3486 -1365 -2645 1613 -2340 -4794 908 -764 -4046 1956 2255 -2266
1183 -2266 2258 3750 -1549 994 3508 -1513 -711 2267 -1757 -2173 811 -1731 -2292 642 -581 -788
$$ packed form
1072a944k268M997q40j899L001M85q32M93K3J079q85k182K747n54n383L125K137
1089A300p105K482O407o498K72R205n109l581R260l259p118P892m61q980N666
1104C73K536r049K961N166o772Q66O769l312o59N564j295j955K198j138j782k15
1120B56j525J34m27k276K069Q33l267L201L200m140K804N282n316r4O074n980
1136H28l926O595m087o137O931k72o727O006L052o347L835M872n191J341M865
1151E638m178j158L300l423k422J973j853j293J727m16O04J576p59J653J474k311
1167A32J665K079l919N15L014m851j280M258l953k454N702j672l282O002K99m521
1183b266M524J492n299K543K514n021Q02K978m024m16K984k542n61K934j223k07
$$ plain form
1199 -788 1607 564 315 1864 192 -109 1331 -725 -863 1181 -1038 -1440 1286 -875 -1891 1522
1215 1522 -47 -1784 1932 1069 -1690 1557 1366 -2144 454 1303 -2184 -130 1654 -1497 -253 1874
1231 1874 -980 -573 1609 -763 -793 1390 -546 -878 1147 -550 -1044 959 -428 -916 1250 83
1247 83 -621 1463 253 -899 1096 -16 -1446 719 29 -1612 647 421 -1525 631 892 -1277
1263 -1277 622 1361 -993 435 1476 -1039 -176 1140 -1273 -757 973 -1043 -817 1187 -492 -690
1279 -690 1313 -79 -639 1220 104 -686 963 32 -877 617 -149 -1042 511 -90 -970 705 217
1296 217 -818 890 467 -925 781 532 -1166 524 707 -1307 230 939 -1228 -58 1173 -980
1312 -980 -329 1257 -642 -560 1173 -377 -730 926 -185 -774 706 -58 -622 642 39 -439 626
$$ packed form
1199g88K395j043k49J549j672l01J440k056j38K044k219m02K726k161j016L413
1215A522j569j737L716q63k759L247j91l510K598Q49l487K054J784l151J244K127
1231A874k854M07K182k372l0K183j936l32K025j697m94K003j387m88K166j167
1247H3p04K084j210j152J995j112j430K165o90j641K259k26j946K156K61k169
1263a277J899P39k354J428J041k515Q63J316k413N16J730k016K26K004j679j98
1279f90K003j392n60J859j116p90J649r31r09J494p66q93J553o01q80J675m88
1296B17j035J708m23j392J706k49j698J690J83k014J537P09k167J170J231k153
1312i80O51J586j899Q2J733j550l53J656j111n89J480p64n64J264o03m78J065
$$ plain form
1329 626 -43 -449 571 -215 -597 650 -220 -719 814 -45 -908 844 208 -1076 785 594 -1085 593
1347 593 882 -1063 164 868 -1075 -266 833 -794 -326 921 -421 -265 799 -321 -281 648 -323
1364 -323 -195 668 -372 -200 687 -562 -428 743 -596 -570 999 -261 -632 1129 -27 -924 880
1381 880 105 -1118 650 413 -965 520 586 -859 237 465 -788 128 444 -566 311 455 -564
1398 -564 364 344 -856 343 463 -1010 395 854 -1073 194 1118 -1179 -281 1327 -967 -626 1539
1415 1539 -504 -939 1389 -148 -1226 1005 183 -1184 708 484 -881 453 451 -670 248 195 -522
1432 -522 348 11 -439 665 -91 -676 913 -30 -1104 1036 326 -1483 949 848 -1755 567 1392
1449 1392 -1755 6 1822 -1469 -630 1939 -969 -1136 1797 -333 -1364 1457 191 -1335 929
$$ packed form
1329F26o69m06J020p86l82J247q70m99J533q59q63J752o36j284J861j91j679J678
1347E93K89j945J227P04j943Q09J099j627M68J247j342J56J064j120M0R29r71
1364c23J28Q63j040J72Q87j249J34J171j339K6J569j260l71J761j156q97J804
1381H80p75j223J768k37j378J485O6j445J096K28j253R16L16j010Q77J44j019
1398e64R28k0j200J199J20j473J405M59j927J267R24k297Q98J608k294L41K165
1415A539k043m35K328j537j078K231q22j367J892k24j365J334kj121R18n3p17
1432e22Q70l37m50J104p56n85J589r43j074K140p10j809K432j01k603K322Q25
1449A392l147J761J816l291Q39K569k908j67K933k130j031K821j266j526K264
$$ plain form
1464 929 379 -1137 495 356 -752 393 180 -468 496 -159 -486 806 -283 -650 1263 -109 -1081
1481 -1081 1419 72 -1851 1125 522 -2264 863 1456 -2066 464 2168 -1741 -359 2287 -1293
1496 -1293 -1069 2162 -599 -1445 1702 -197 -1753 910 -22 -1542 666 460 -651 933 637 -192
1512 -192 846 -21 -550 721 -578 -954 1061 -570 -1440 1289 -292 -2045 1392 635 -1996 1691
1528 1691 1978 -1726 1154 2345 -2155 -478 1898 -2273 -1582 1925 -1241 -1679 1987 -142 -1577 1585
1544 1585 552 -1082 1363 1047 -468 963 484 -787 -2 -806 -1339 -40 -949 -889 1243 -119 -579
1561 -579 2097 319 -1264 2019 700 -1977 1616 1319 -2585 494 1421 -3113 -854 1743 -2328 -1011
1577 -1011 2800 -504 -777 2966 330 -1369 1728 242 -1792 680 302 -1434 204 110 -1096 -40
$$ packed form
1464I29n50j516J632j39j108J145k13o48R64o55l27J292j089l67J913j372r72
1481a081K500j347j923K976o03k786L127N93l522K530J704l909J382K646l580
1496a293K24L231k761q46L147j899j556K663r32j520K208k06j111J584k96q29
1512a92J038q67n29J271j299l76K015j631q70K729j581j753L437p57k631L687
1528A691K87l704K880J191m500J677K376m171O91L507l166m38L666k129j435L162
1544A585j033j634K445l16j515J431m79j271P85q04n33J299r09O0K132j362m60
1561e79K676j778j583L283j319k677L593k97l904L079R27m534K259K597m071J317
1577a011L811l304k73L743k636j699L097j486k034K472l78j736J638r4j206J056
$$ plain form
1593 -40 -219 -585 602 66 101 1592 175 -314 1583 -395 -1679 1160 -274 -2372 1202 827 -2376
1610 -2376 927 1756 -2303 130 2337 -1691 -468 2716 -861 -1150 2229 -523 -1945 1315 -123
1625 -123 -1916 905 596 -1177 692 777 -662 330 300 -461 349 -103 -376 758 -295 -681 1050 -284
1643 -284 -1197 1214 127 -1556 1231 774 -1810 904 1329 -1962 220 1770 -1777 -522 2041 -1159
1659 -1159 -1051 2024 -355 -1358 1593 135 -1496 923 328 -1297 558 530 -826 500 518 -577
1675 -577 301 120 -644 290 -44 -549 753 103 -681 942 139 -1275 739 451 -1471 710 1217 -1274
1693 -1274 334 1404 -1439 -612 1149 -1292 -892 1520 -320 -614 1744 190 -981 1026 84 -1292
1709 -1292 553 396 -858 469 420 -820 -49 -151 -964 61 206 -210 1060 943 3 915 388 -1082
$$ packed form
1593d0j79l66J187n36L5J491j417m89J897j978j284K839j434k098L574l75l203
1610b376L303Q29m059K433K207m028J223L184l577k89L379k752j422L260j438
1625a23j793K821l09j773J869Q5j439R92l0p61Q10m52k73J134j053l86J731j334
1643b84r13K411j087j683K787m57k584K714M25l291K182J550l547J255K563l200
1659a159J08L075k379j003K951j458j631K419n95j625J855k8j356J326J8j095
1675e77Q78j81p64R34l34n05J302o50p84J623q03j414K014k88j922K181N07k491
1693a274J608J070k843Q27J761k441M00K412j840k94K358j554j171K007r42j376
1709a292J845j57j254J327m9j240P71j02q13J025J45m16J270j17r40R12n27j470
$$ plain form
1727 -1082 -70 -131 -1433 19 551 -974 212 903 -1073 -286 1010 -712 -113 1787 299 43 1560
1744 1560 -90 -1229 67 -938 -1779 -40 -80 -652 901 813 -215 684 510 -512 403 616 -129 666
1762 666 615 -516 -189 -526 -1591 -803 -394 -934 433 1213 290 986 1341 -252 -110 523 -748 -454 692
1781 692 -348 -435 538 -677 -1173 -37 -628 -796 838 768 376 1476 981 -206 254 -228 -1185 -371 -188
1800 -188 -694 232 391 -458 71 116 -763 -40 515 -50 661 1156 184 227 337 -819 -814 -246 -806 -414 531
1821 531 51 111 712 -52 -335 289 -174 -258 582 263 8 542 -43 -587 -52 -446 -770 174 156 -204 646
1842 646 506 -303 259 204 -641 -21 322 -410 108 529 -323 -137 334 -406 -312 351 -117 -144 429 32 -192
1863 -192 208 -90 -227 129 -54 -85 198 -77 -86 202 -148 -66 372 -82 -112 395 -188 -446 241 -175 -501 440
$$ packed form
1727a082J012o1j302J452N32j525J186O91j976P87J296j722N99J900j488k56J517
1744A560j650j139J296j005q41J739m0n72J553q8j028Q99j74j022R15K13p45P95
1762F66n1j131L27l37j065P88M09n40J367P80r23O96L55j593J42O33j271K94J146
1781F92j040q7R73j215m96J136n91j68J634p0l92J100m95j187M60m82r57Q14J83
1800a88n06R26J59q49N29M5q79P23N55n65P11M95r72M3J10j156NN68n60L92R45
1821E31m80O0O01p64k83O24m63q4Q40l19k55N34n85n44N35l94l24R44j8l60Q50
1842F46j40q09N62n5q45O20L43p32N18M21q52J86M71p40R4O63m68k7N73l97k24
1863a92M00k98j37L56j83l1K83k75rK88l50Q2M38m54l0N07n83k58O87m16l26R41
$$ plain form
1885 440 282 -305 459 371 -563 -25 220 -596 -66 583 -124 22 563 -196 -493 25 -350 -454 232 279 208
1906 208 483 264 -55 -196 -452 -362 -129 -153 306 600 111 168 245 -617 -612 69 -391 -196 918 467 -64 651
1928 651 32 -1024 -256 -91 -767 218 906 115 321 652 -422 -714 -184 -505 -410 454 554 395 521 166
1948 166 -327 -527 -624 -355 -69 90 689 743 76 150 48 -937 -673 116 -367 15 1145 443 -149 584 -220
1969 -220 -1194 -181 -16 -630 505 1041 50 248 501 -653 -790 -120 -421 -260 602 583 313 366 24 -387
1989 -387 -572 -526 -125 29 121 741 626 -160 92 40 -962 -507 350 -321 10 1096 217 -324 524 -256
2009 -256 -1101 87 142 -611 513 938 -224 90 534 -617 -688 137 -218 -283 483 448 138 171 -6 -215
2029 -215 -355 -396 -9 77 -8 475 419 -219 123 119 -742 -199 440 -447 -57 1001 -84 -472 705 -104 -1011
$$ packed form
1885D40j58n87P64q8r34N38K45q16N30O49p07J46N41p59k97N18l75j04O86M7p1
1906B08K75k19l19j41k56R0K33k4M59K94m89N7P7q62NO81m60J95J114m51n31P15
1928F51o19j056P68J65o76R85O88p91K06L31j074k92N30l21R5Q64J00j59J26l55
1948A66m93k00r7K69K86J59N99N4o67P4j02r85K64P89m83L82J130p02n92P33q04
1969b20r74J013J65o14J135N36r91J98K53j154j37O70l01J61Q62j9k70N3l42m11
1989c87j85M6M01J54R2O20j15p86K52n2j002M55Q57o71L31J086q79n41Q48p80
2009b56q45J188N5p53J124M25j162L14M44j151p1Q25l55o5P66l5l10L3j77k09
2029b15j40m1L87Q6q5M83n6o38L42mq61N43O39q87L90J058j085l88J177q09r07
$$ plain form
2050 -1011 289 299 -696 297 737 -325 45 489 -425 -326 267 -293 -231 430 70 -129 276 87 -219 -125
2070 -125 -63 37 -86 -143 387 221 -406 195 409 -606 -197 556 -373 -354 670 -65 -399 598 21 -553
2090 -553 468 85 -752 341 360 -705 136 679 -400 -135 604 -128 -313 219 -21 -146 62 -50 107
2109 107 102 -287 -42 80 -418 -125 259 -102 224 555 -4 215 434 -537 -372 338 -602 -621 688 70 -617
2130 -617 550 324 -724 70 370 -330 295 693 92 372 390 -547 -400 -202 -907 -527 218 -34 128 585
2150 585 302 174 110 -212 124 254 -209 380 710 -337 -360 113 -901 -1094 -79 -275 -214 861 689 381
2170 381 910 226 -505 201 -136 -791 213 440 -485 -91 158 -781 -708 -205 -327 183 741 641 995 898
2190 898 -11 -62 -97 -930 -730 -50 -349 -173 346 -110 -201 61 -450 -202 569 203 402 1276 532 -185 284
$$ packed form
2050a011J300J0r95R93M40j062L70M44r14R9N93n60O2O61l60j99M05j89l06R4
2070a25O2J00j23n7N30j66o27O01K14j015M09P53r29J9J024p35l34R97n77n74
2090e53J021l83q37J093J9j065Q41N43j079K65P39p32j85N32k40j25K08j12J57
2109A07nl89K45J22m98K93L84l61L26L31n59K19K19r71J65P10r40j9J309o18o87
2130f17J167k26j048P94L00p00O25L98o01K80J8r37J47J98p05L80P45k52J62M57
2150E85k83j28o4l22L36J30m63N89L30j047k3M73j014j93J015j96O1J075j72l08
2170C81N29o84p31P06l37o55J004K27r25L94K49r39P3N03j22N10N58j00L54r7
2190H98r09n1l5q33K00O80k99J76N19m56r1K62n11K48P71l66J99Q74p44p17M69
$$ plain form
2211 284 -374 -1219 -567 -389 -627 156 427 66 458 278 -341 135 279 -232 375 778 58 82 188 -605
2231 -605 -731 -483 -684 -238 306 107 487 791 22 -15 382 -292 -369 353 57 -161 338 -59 -460 -101 -405
2252 -405 -554 165 118 -62 670 537 -129 243 183 -484 -165 93 -263 33 213 -155 44 72 -387 -41 220
2273 220 -225 105 490 -67 -50 281 -214 -246 116 -200 -102 308 -86 -89 362 -134 -312 321 7 -338 266 163
2295 163 -333 75 72 -318 63 149 -131 226 257 -168 96 155 -314 -83 164 -163 -21 178 -107 -60 19 -263
2317 -263 -23 177 -133 176 476 -70 -39 262 -285 -411 93 -171 -254 297 111 -110 268 -25 -346 129 59
2338 59 -240 275 379 -98 118 181 -331 -256 -69 -254 -29 192 44 232 255 -123 -51 37 -268 -91 199 -2
2360 -2 111 270 -87 -107 15 -351 -224 173 -90 -17 478 118 -158 197 -74 -409 2 33 -174 225 251 -67
$$ packed form
2211B84o58q45O52J78k38P83K71l61L92j80o19M76J44n11O07M03p20K4J06p93
2231f05j26K48k01M46N44j99L80L04p69l7L97o74p7P22k96k18M99l97m01L59l04
2252d05j49P19m7j80P32j33o66L72o0o67L19K58l56K96J80l68J99K8m59L46K61
2273B20m45L30L85n57J7L31m95l2L62l16R8M10l94lM51m96j78O33l14l45O04j03
2295A63m96M08ll90L81Q6k80L57L1m25K64N9m69K31K47l27J42J99k85M7P9k82
2317b63K40K00l10L09L00n46L1L01n47j26N04k64q3N51j86k21L78k93l21M75p0
2338E9k99N15J04m77K16O3n12P5J87j85K25K21j48J88K3l78P2Q8l05J77K90k01
2360bJ13J59l57k0J22l66J27L97k63P3M95l60k76L55k71l35M11L1k07L99K6l18
$$ plain form
2382 -67 121 73 -308 -78 45 -200 55 277 23 87 143 -148 -122 -42 -213 -4 202 -26 127 297 -87 -121
2404 -121 101 -213 -202 136 -21 -30 260 33 -120 125 -97 -271 101 44 -149 195 202 -98 67 39 -229 -63
2426 -63 1 -147 85 167 -52 117 154 -161 -41 89 -178 -38 160 -60 33 190 -111 -81 112 -187 -155 173
2448 173 -41 -90 259 79 -128 115 -2 -208 15 11 -120 108 96 -74 87 54 -165 -14 15 -131 38 98
2470 98 -41 105 86 -125 28 39 -211 12 156 -128 40 236 -113 -80 172 -148 -172 169 -44 -121 229 59
2492 59 -153 136 15 -229 42 52 -135 52 131 -58 41 46 -101 -17 -23 -100 52 41 -28 126 52 -129 55 11 -205
2517 -205 65 133 -156 75 242 -163 -75 207 -159 -178 203 -33 -132 249 47 -175 134 33 -241 39 103 -159
2539 -159 28 162 -48 -26 43 -47 -48 -41 -16 83 17 -27 162 20 -159 66 3 -214 36 99 -145 98 186 -206 -9
$$ packed form
2382f7J88m8l81K30J23k45K55K22k54O4N6k91K6Q0j71K09K06k28J53J70l84l4
2404a21K22l14J1L38j57rK90k27j53K45k22j74L72n7j93L44Pl00J65k8k68J66
2426f3O4j48K32Q2k19J69L7l15J20J30k67J40J98k20R3J57l01L0J93k99L2L28
2448A73k14m9L49j80k07K43j17k06K23mj31K28j2j70J61l3k19J51K9j46J69O0
2470I8j39J46j9k11J53J1k50K23J44k84J68J96l49L3K52l20k4L41k13p7L50j70
2492E9k12K89j21k44K71J0j87J87P9j89R9Nj47Q4op7J52j1o9J54p4j81J84m4k16
2517b05K70O8k89K31J67m05Q8K82l66j9L81k36r9L81k02k22L09j01k74K80O4k62
2539a59J87J34k10K2O9r0jPK5R9o6m4J89j42j79K25o3k17K50O3k44K43Q8l92J97
$$ plain form
2564 -9 198 -237 -102 307 -46 -160 305 65 -260 51 36 -260 -40 83 -81 49 117 -31 41 68 -70 -25
2586 -25 43 -4 9 20 15 31 -154 -163 63 -119 -222 223 165 -177 191 297 -185 -47 220 -168 -135 187 -101 -142
2610 -142 156 -121 -249 121 -41 -222 195 224 -67 137 260 -28 -93 2 -39 -114 -128 -21 48 -114 -86 103 -47
2633 -47 -129 130 89 -19 209 133 -80 144 26 -303 0 72 -353 -62 287 -156 -139 313 25 -188 185 123
2655 123 -84 111 93 -59 33 -39 -177 -21 -37 -160 32 72 -9 57 62 47 75 -60 -2 156 -85 -144 182 -14
2679 -14 -288 96 116 -247 14 200 -129 -2 184 -95 -9 172 -120 -55 197 -78 -148 174 2 -192 95 66
2701 66 -88 24 58 -3 24 -44 -43 71 -82 -97 140 17 -110 113 53 -121 41 18 -114 80 40 -118 122 86
2725 86 -202 32 141 -211 -55 194 -60 -54 188 -12 -58 69 -74 -64 75 -81 -41 176 -13 -88 134 -19
$$ packed form
2564iK07m35J35M09l53j14M65k40l25L11j5k96K20J23j64J30O8j48P2K7j38M5
2586b5O8m7J3J1nJ6j85rK26j82j03M45n8l42L68J06m82J38K67l88L3L22k88m1
2610a42K98k77j28L70j62j81M17K9k91K04J23k88o5R5m1p5j4J07O9j62K8J89j50
2633d7q2K59m1j08K28p6k13K24j18l29L03P2m25K91L49m43J7M52k88k13L73o2
2655A23k07J95j8j52R2p2j38J56j6j23J92M0q1O6Nj5K8j35N8J58k41n9L26j96
2679a4k74L84K0l63K61J86l29J27J86k79Q6J81k92O5K52k75p0L22j72j94K87k9
2701F6j54J12L4o1K7o8JJ14j53j5K37j23j27K23o0j74J62k3j32J94m0j58K40l6
2725H6k88K34J09l52J56K49k54OK42k00m6J27j43J0J39j56M0K17j89p5K22j53
$$ plain form
2747 -19 -162 47 -3 -86 70 27 -24 101 -24 -133 70 -13 -174 102 141 -81 92 149 -102 -28 -5 -173 -48
2770 -48 37 -106 84 172 -65 24 153 -121 -99 128 -34 -30 175 9 -52 53 -161 -208 4 -133 -115 222 156 18
2794 18 241 134 -112 -6 -39 -165 -1 34 -51 81 18 -179 -62 -66 -231 19 176 81 232 303 62 35 -5 -257
2818 -257 -180 -50 -189 -19 202 -31 -49 102 -117 -182 69 49 75 307 217 78 114 -129 -343 -170 -221 -257 74
2841 74 151 37 191 127 -110 -35 -25 -117 94 198 68 167 124 -190 -209 -168 -316 -164 110 94 195 301 97 18
2865 18 21 -175 -127 66 -16 41 224 20 -121 -51 -218 -286 -27 -1 45 305 221 40 141 -37 -285 -88 -13 -133
2889 -133 89 203 0 9 2 -208 -158 -33 -64 98 236 106 81 87 -135 -186 -81 -123 -14 148 77 106 132 -119 -129
2914 -129 -11 -159 -90 204 100 -1 172 9 -219 -70 -68 -160 92 165 26 139 104 -164 -127 -36 -162 -47 152
$$ packed form
2747a9j43K09n0q3J56m3n1J25j25j09K03q3j61K76L9k22J73N7k51P4K3j68J25
2770d8Q5j43J90Q8k37Q9J29k74K2K27j62MK05j66o1J05k14m7K12j37J8L37o6j38
2794A8K23j07k46J06l3j26J64L5q5J32o3j97J17mj65K50J57r5J51P1k41k7m0k52
2818b57P7J30j39J70K21k33j8J51k19o5K51k0K6K32r0j39L6k43k14J73n1l6L31
2841G4P7j14J54o4k37P5J0r2K11J04j30R9m3l14j9M1j48J52K74j6J01J06k04p9
2865A8Lj96M8J93q2N7J83k04j41P0j67o8K59K6M6K60q4j81J01j78k48J97P5j20
2889a33K22J14k03Rpk10N0J25l1J62J38j30k5Ok22n1J05m2J09J62p1K9K6k51j0
2914a29J18j48O9K94j04j01J73j63k28J49Kr2K52P3j39J13l5k68L7R1j26J15J99
$$ plain form
2937 152 85 86 105 -36 -97 -102 -140 -4 111 69 158 181 -65 -113 -66 -221 -138 85 44 100 261 39 -92 20 -152
2962 -152 -243 76 114 -1 226 197 -102 -81 -89 -263 -150 59 60 151 226 79 -7 -61 -207 -170 -38 13 137 199 119
2987 119 72 -36 -231 -176 -84 -138 69 286 130 78 158 -118 -276 -71 -124 -141 186 215 62 155 54 -233 -152 -80
3011 -80 -163 24 215 134 125 133 -70 -164 -152 -156 -55 78 107 192 142 -17 -38 -99 -227 -96 53 -3 139 251 20 -36
3037 -36 39 -191 -215 43 -15 -41 233 155 -50 39 -16 -229 -86 33 -56 77 199 49 16 33 -102 -128 -46 -33 15
3062 15 84 63 88 31 -77 -33 -28 -127 6 92 -1 55 149 -48 -48 58 -103 -93 98 3 -44 156 67 -97 57 34 -143
3089 -143 -11 56 -64 17 85 -27 10 28 -54 -37 -1 -66 9 50 -8 43 66 -31 -8 -1 -80 -6 41 -64 26 125 -26 -30
3117 -30 80 -76 -120 64 -3 -58 113 79 -35 63 8 -99 5 3 -82 63 86 -19 34 38 -85 -62 -17 -60 23 62
$$ packed form
2937A52o7JJ9j41o1nl8J36J15m2Q9K3k46m8M7j55Q3K23m1N6J61k22j31J12j72
2962a52r1L19L8j15K27k9k99K1qj74J13K09JR1P5j47q6n4j46L7J32N1J24O2q0
2987A19m7j08j95N5R2n4K07K17j56n2Q0k76j58K05n3j7L27K9j53R3j01k87Q1P2
3011h0q3J87J91q1rQk03r4J2mJ01J33K9Q5n0j59k1o1j28J31J49n6J42J12k31n6
3037c6P5k30k4K58n8k6K74p8k05Q9n5k13J43J19q9J33J22j50l3J7j35k6Q2J3M8
3062A5O9k1K5n7j08M4Nr9J33Q6r3N6R4j97%J06j61J0J91r5m7K00q9j64J54k3j77
3089a43J32O7j20Q1O8j12L7J8q2J7L6o5P5M1n8N1K3r7K3Pp9P4M7j05R0R9j51m
3117c0J10j56m4J84o7n5J71l4j14R8n5j07J04kq5J45K3j05N3Mj23K3M5m3Q3L9
$$ plain form
3143 62 11 72 44 -90 -41 -2 -111 -23 109 18 22 113 -35 -72 13 -71 -61 89 32 4 117 -1 -122 -14 -47 -119
3169 -119 51 97 44 106 71 -35 -22 -52 -122 2 42 -10 82 80 -79 -73 -58 -147 -39 74 46 139 183 8 -13 -11 -172
3196 -172 -144 10 -47 -1 139 49 -59 -9 -93 -136 13 67 85 233 175 34 12 -114 -258 -169 -96 -77 68 126 66
3221 66 80 1 -119 -53 -6 7 172 234 110 78 6 -232 -273 -187 -224 -59 137 132 153 202 22 -88 -5 -59 -44 162
3247 162 167 77 108 -41 -236 -238 -237 -208 -1 150 200 286 221 52 -19 -96 -157 -40 31 32 133 80 -101 -126 -187 -291 -102
3274 -102 65 90 245 350 147 51 28 -184 -233 -56 -67 -21 139 88 -55 -39 -124 -200 -65 68 103 247 266 147
3298 147 51 -64 -195 -190 -155 -89 65 109 75 105 -6 -142 -81 -58 -71 115 205 108 131 82 -162 -189 -101 -180 -74 146
3324 146 103 82 155 3 -137 -70 -79 -98 56 120 74 94 41 -93 -122 -118 -97 4 83 103 134 70 -29 -44 -125 -165 -27 28
$$ packed form
3143F2n1O1k8j34M9L9j09Q8J32r1MR1j48l7Q5q4J0J50n7k8J13j18j21J08l3p2
3169a19J70M6n3O2l5j06J3l0p0J24M0n2R2kj59OJ5q9J08J13k8R3M4j75k1Kj61
3196a72K8J54n7M6J40r0j08N0q4m3J49N4J8J48n8j41k2j26j44Q9P3J9J45N8o0
3221F6J4p9j20O6M7J3J65O2j24l2p2k38m1Q6l7J65J96nK1M9j80j10Q3n4J5K06
3247A62Nr0L1j49j95kJK9K07J51N0Q6o5j69p1p7o1J17P1JJ01n3j81k5o1j04J89
3274a02J67K5J55J05k03r6k3k12m9J77j1M6J60n1j43J6q5p6J35J33L5J44J9j19
3298A47r6j15j31NL5O6J54M4l4L0j11j36O1K3j3J86R0r7K3m9k44k7Q8p9J06K20
3324A46m3k1P3j52j40O7rj9J54O4m6K0n3j34k9MK1J01P9K0L1o4r9j5q1m0J38N5
$$ plain form
3352 28 12 142 146 -43 -30 -20 -161 -97 74 15 61 169 23 -85 -33 -129 -176 -3 39 31 142 144 24 4 -16 -95 -64
3379 -64 -7 17 71 42 6 1 -86 -130 -46 -27 -17 120 131 47 90 57 -125 -63 -17 -110 -15 119 -27 -19 76 -60 -129 20
3407 20 -4 -50 101 115 14 56 34 -88 -60 -39 -73 -12 37 16 42 5 -6 2 -32 -41 58 24 -14 85 23 -91 2 4 -131
3436 -131 -8 64 -61 2 105 -37 -36 80 -50 -75 68 -8 -61 62 29 -72 25 21 -63 -5 26 -36 7 21 -12 12
3462 12 9 -10 24 -2 -44 32 -7 -51 59 31 -38 52 44 -87 7 30 -113 -18 75 -49 -6 96 -37 -70 54 -45 -72 68
3490 68 38 -8 69 40 -68 -19 -45 -87 -3 11 8 64 30 -20 20 -39 -80 12 5 -9 105 69 -40 34 0 -133 -35 28 -69
3519 -69 51 127 -20 0 60 -99 -109 24 -49 -27 122 52 -17 50 -56 -117 -36 -33 -38 87 70 25 58 -26 -104 -54 -71 -65
3547 -65 81 70 21 98 10 -105 -35 -42 -117 40 101 -8 101 98 -97 -61 -14 -134 -57 107 22 44 125 -32 -94 -35 -99
$$ packed form
3352B8j6J30Mj89J3J0j41O4J71n9M6J08j46j08N2r6m7J73M2qJ11Kj20k0k0p9L1
3379f4N7K4N4k9l6nq7m4Q4J9J0J37J1q4M3l3j82O2M6r3R5J34j46QR5j36o9J49
3407B0k4m6J51J4j01M2k2j22K8K1l4O1M9k1K6l7j1Ql4rR9l4l8R9o2j14R3Kj35
3436a31J23P2j25O3J03j42JJ16j30k5J43p6n3J23l3j01R7mq4N8L1o2M3J4l3K4
3462A2lj9L4k6m2P6l9m4J10k8o9R0qj31R4K3j43R5R3j24M3J02j33l3J24r9k7J40
3490F8l0m6P7k9j08M9k6m2Q4J4lN6l4n0M0n9m1R2pj4J14l6j09P4l4j33R8O3r7
3519f9J20P6j47K0O0j59j0J33p3K2J49p0o9O7j06o1Q1LnJ25j7m5L3q4p8N0j7O
3547f5J46j1m9P7q8j15P0pp5J57O1j09J09lj95L6M7j20P7J64q5K2Q1j57o2N9o4
$$ plain form
3574 -99 -109 39 44 47 115 42 -49 -23 -91 -97 2 17 41 135 54 -33 17 -85 -154 2 -3 -29 128 118 -43 30 -16 -187 -58
3603 -58 38 -44 78 161 1 3 36 -133 -131 2 -44 -15 135 62 -3 47 -69 -127 -33 -56 -28 99 75 32 63 -50 -128
3630 -128 -48 -77 -66 86 87 39 109 22 -112 -28 -43 -114 48 113 2 71 75 -103 -87 -37 -129 -47 100 42 59 142 -21
3657 -21 -70 -14 -97 -92 50 28 16 93 4 -77 -34 -87 -94 29 40 33 135 87 -24 7 -49 -126 -15 14 -30 87 84 -21 4
3686 4 -14 -129 -34 36 -12 72 145 11 3 31 -108 -111 -15 -58 -25 100 13 -12 46 -38 -83 12 -6 -20 87 77 -3 41 -18
3715 -18 -102 -51 -45 -72 41 55 -1 63 43 -43 -5 4 -57 26 71 -12 32 51 -72 -57 -18 -86 -40 75 10 14 83 -13 -54 25
3745 25 -40 -67 36 16 -29 63 13 -54 9 -17 -68 12 32 -20 38 53 -29 -5 9 -55 -3 12 -30 18 53 -34 -4 34 -53 -24
3775 -24 39 -25 -13 48 -17 -31 18 -44 -43 36 -2 -31 61 14 -43 34 3 -76 11 13 -46 28 29 -48 13 26 -53 -7 39 -21 7 52
$$ packed form
3574i9j0J48NLO8p3r1K6o8oR9J5K4R4q1q7N0j02o9J56nk6J57j0j61P3m6j71J29
3603e8R6q2J22Q3j60KL3j69KJ33m6K9J50p3o5N0j16n8R4k3K8J27k4m3L1j13p8
3630a28Q0k9J1J52Jm8P0q7j34Q4j5p1J62O5j11O9Mj78J6N0r2Q2J47n8J7Q3j63
3657b1m9N6q3NJ42k2j2P7q9q1M3n3pJ23J1pJ02m8j11L1n6p7J11K9m4J17lj05K5
3686Dj8j15R5P0m8Q4P3j34qK8j39lR6m3L3J25q7k5N8q4m5R5j8j4J07j0q0M4n9
3715a8q4N1Ok7J13J4n6O4k0q6L8Ro1Q3M5q3M4J9j23J5L9o8M6J15o5MO9r6m1P9
3745B5o5k7J03k0m5R2n0o7O3k6n1Q0K0n2N8J5q2K4J4o4N2J5m2M8L5q7L0L8q7K9
3775b4O3o4J2O1o5j4M9o2JP9l8k9R2m7n7P7l1p9Q7Kn9P4Jp7O1J3p9M6M6o0K8M5
$$ plain form
3807 52 -10 -16 34 -33 -29 27 -12 -12 33 -14 -22 41 -24 -23 26 -10 -29 41 -1 -29 50 8 -55 37 6 -43 53 27 -57 28 32 -71 -16
3840 -16 30 -79 -19 34 -45 -10 68 6 10 74 6 -16 53 -13 -32 13 -21 -50 12 -35 -41 0 -12 -19 61 30 11 101 34 -33 49
3871 49 -13 -110 1 -10 -97 11 23 -83 6 72 -58 -8 98 -11 21 117 13 -24 32 -57 -100 -33 -52 -51 25 4 2 70
3899 70 18 -2 51 6 5 75 11 -18 53 -49 -128 -11 -73 -146 34 42 -50 97 115 -56 24 85 -87 -26 77 -58 -37
3926 -37 60 -50 -91 -2 -62 -88 29 22 11 81 49 28 20 -44 -33 -5 -69 -24 71 -48 -28 79 -62 -95 72 -28 -83 110
3954 110 66 -74 75 49 -134 -16 44 -126 -35 100 -37 -32 95 -11 -72 36 -5 -44 20 25 12 16 -23 0 -6 -65 2
3981 2 42 -45 25 84 -64 -20 88 -82 -84 104 -24 -104 117 31 -124 76 72 -112 37 102 -80 -3 90 -77 -51 49
4007 49 -37 -61 34 2 -17 23 0 17 6 -9 37 26 -39 53 36 -95 2 57 -115 -30 110 -62 -47 145 -12 -93 99
$$ packed form
3807E2o2oN0o7MN6l9%M5m7qO3o5JM9l6j9P0m2k8P9m2o3R2l1m9R6k6q4Q5Mj03N5
3840a6M6j09O0N3p9L5P8o2MO4o8k2O9o6j9M5l4k9O2m7oM1j2pQ0l1j9R0o7o7Q2
3871D9o2r7J11j1q7J08J2j06Q9O6j30N0J06j09L2R6j04l7N6q9m3O7j9JP6k1kO8
3899G0n2k0N3m5jP0o4k9P1j02p9J17o2p3J80Qr2J47J8j71Q0O1j72O1J03j35K1
3926c7R7j10m1Q9o0k6J17pj1P0l2k1qo4J1K8o4M5R5j19K0J07j41l3J67j00n5J93
3954A10m4j40J49k6j83J18O0j70R1J35j37NJ27j06o1J08m1l9O4Nj3Ml9K3on9O7
3981BM0q7P0N9j48M4J08j70kJ88j28q0K21q6j55K00mj84J49O5j82P7R3j67K6J00
4007D9q6k4R5l2j9M0k3J7j1j5M6j1o5R2j7j31R7N5j72Q5J40j72J5J92j57q1J92
$$ plain form
4034 99 15 -121 75 64 -103 39 73 -114 -29 49 -86 -47 59 2 -12 54 28 -4 -24 -29 4 -29 -40 47 16 -71 39
4061 39 27 -107 24 56 -92 16 133 -54 -9 118 -66 -103 90 -26 -114 95 62 -86 34 63 -97 -25 36
4084 36 -50 -11 62 10 -5 29 -11 -23 -34 -16 10 -23 -9 76 -3 -45 68 11 -118 34 53 -92 33 117 -77 -11 120
4111 120 -71 -84 99 -16 -81 112 38 -79 47 45 -89 -4 31 -64 -1 41 -7 -9 13 -10 -23 -33 -11 29 -14 1 48
4138 48 -17 -41 59 -13 -84 46 32 -93 40 85 -90 2 80 -88 -55 99 -43 -60 100 7 -77 54 22 -90 29
4163 29 53 -53 -3 43 -31 -21 26 -11 -18 -9 -3 -4 -25 -9 22 -29 -20 47 -7 -46 60 6 -67 50 43 -74 24 64 -85 -15 76
4194 76 -56 -48 79 -14 -71 73 12 -70 42 30 -71 8 45 -34 2 39 -22 -22 26 -6 -24 -7 2 -12 -13 -3 18 -21 -21 36
4224 36 -33 -48 38 26 -48 42 50 -57 5 55 -68 -32 66 -43 -38 77 -6 -55 56 24 -63 53 52 -60 25 57 -38 -38 28
$$ packed form
4034I9q4j36J96j1j67J42L4j87Q5P8j35L9J06n7j4O6k6l2k0nL3l3j1Q7l1q7J10
4061C9j2j34J31L2j48J08J17j87M5J27j84l7J93j16q8K09l3j48J20K9j60P2O1
4084C6q6L9P3n2j5L4m0j2j1J8K6l3J4Q5p9m2J13n7j29J52J9j45J25Q4j94O6J31
4111A20j91j3J83j15o5J93p4j17J26kj34Q5L5r5O3M2m8kK2k3j3j0K2M0m3J5M7
4138D8o5k4J00p2p1J30j4j25J33M5j75R2P8j68L3J54j42j7J60r3q4J31l2j12J19
4163B9K4j06N0M6p4J0M7l7pROjk1J6L1n1RO7n4l9J06n4p3J17pj17R8M0j49P0R1
4194G6j32QJ27r3n7J44o1q2J12j2j01P9L7p9L6L7o1%M8l2j8J7Rj4jJ0K1l9%N7
4224C6o9j5Q6j2p4R0Qj07O2N0j23L6R8j09NJ15q3m9J11l2q7J16jj12Q5L2r5%O6
$$ plain form
4253 28 -47 -41 12 0 -13 28 33 17 26 18 7 -3 8 21 -8 -23 2 -10 -74 -17 0 -77 5 89 -5 18 115 6 -31 68 1 -81
4285 -81 39 22 -84 14 27 -94 -24 40 -57 -9 96 30 20 88 29 -32 1 -21 -74 -38 -30 -25 -8 -14 -1 7 -9 13 49 18
4315 18 48 88 6 5 50 -64 -102 -8 -64 -100 47 35 -40 70 77 -30 31 82 -28 27 76 -27 -27 36 -77 -98 -16 -65
4343 -65 -56 23 17 14 61 29 11 27 -4 -14 18 -37 -20 27 -47 -51 21 -48 -58 44 8 -25 90 52 -26 63 40 -79 -6 22 -86
4374 -86 -10 41 -54 -9 53 -35 -21 51 -3 -10 51 -2 2 45 -24 -33 23 -32 -40 36 -22 -24 44 -12 -18 57 -9 -38 55 -2 -46 40 30
4407 30 -49 42 45 -33 47 45 -41 18 39 -48 12 40 -45 6 32 -50 -25 27 -47 -7 51 -1 33 80 -16 -12 35 -53 -64 19 -38 -42
4439 -42 63 5 -41 50 2 -52 30 26 -15 75 65 -13 45 13 -73 -28 -23 -74 19 41 8 61 59 -36 7 1 -64 3 41 -28 37 70
4471 70 -41 -37 8 -99 -71 37 -7 28 120 34 1 44 -54 -86 -8 -22 -27 62 49 -2 42 -13 -81 -21 -26 -28 74 73 34 90 16
$$ packed form
4253B8p5ON3j2j3M1Nj6Rqj1j0J1J3k9j5K5j2o4N7J7p7Q2Q4r4K3R7j09l7R9o7q2
4285h1J20j7j06R8J3j21P0O4r7M8J05o6j0O8n9o1L3k2n3L6QNJ7oJ3Qj6K2L6l1
4315A8L0M0q2jM5j14l8R4n6l6J47j2p5J10Pj07O1N1j10N5M9j03%O3j13k1Q2m9
4343f5RP9olM7l2j8J6l1j0L2n5J7M7p4mP2o9j0J02l6l3J15l8p8Q9k3j19P3K8j08
4374h6P6N1r5M5O2q8J4P2n4pO1n3MM3o9rN6n5qP6n8kO8n6oP5o6k9R3n7m4Q6j0
4407C0p9R1Lp8Q0kq6N9K1q7O0K8q5N1K6q2K5N2p4M0N8n2L4M7r6MM7q8j1Q3n7m
4439d2J05n8m6R1m8n4Q2mm1R0j0p8N8l2q6M5Nn1R3K2l3N3kr5M3oo5O7L8o9O5L3
4471G0j11MM5j07K8J08m4L5R2q6l3M3r8l2P8j4nQ9j3n1M4n5o8O0nkJ02jl9N6p4
$$ plain form
4502 16 -69 -22 -34 -95 8 56 -5 75 82 -37 -25 -11 -104 -53 45 -2 37 115 18 -28 11 -64 -80 -16 -8 13 106 62 26 33 -48
4533 -48 -74 -25 -55 -13 83 50 35 78 -3 -71 -3 -47 -63 54 63 -3 92 56 -62 -25 -16 -114 -23 56 16 49 90 8 -15 6
4563 6 -70 -58 10 -7 13 65 26 23 25 -46 -42 0 -36 5 75 21 27 76 -24 -37 21 -36 -52 53 19 -20 75 24 -48 16 4 -57
4595 -57 7 27 -22 34 52 -19 1 14 -38 -17 12 -7 8 27 -13 14 23 -30 10 17 -27 -8 20 -26 9 51 -5 1 57 0 -36 31
4627 31 -28 -44 30 15 -10 44 33 -32 -5 -3 -65 -14 16 -1 36 54 11 16 10 -44 -40 -27 -27 36 47 30 52 36 -38 -43 -27 -59 -17
4660 -17 55 34 50 84 -1 -33 -12 -61 -72 22 43 42 101 63 -11 -16 -49 -97 -41 12 22 82 88 45 6 -35 -90 -80 -41 -21 51 100
$$ packed form
4502A6q5M7j2o1J03M8o1Q0Pj19J2J4r3N1R8m7L9P8r7m6L9p5j6O4QK1R3m4l6Pq1
4533d8k6M9l0M2R6l3j5M3q1o8O8m4j6J17Ro6R5l6j18L7Rr8R1P9m0L3M1q2k3K1
4563Fp6J2O8j7K0N2l9lKp1MM2l6M1P0n4OM9j00j3N8n7j6J05l4l9R5n1p2O4j2o1
4595e7O4K0m9N6J8p1K0J3n2K1K9j9J5J9m0K7Rn3M0Pm4J9K8m6L5M2n6ON6n7l6O7
4627C1n9j6P4j5k5N4j1o5K7Ko2N1L0j7L7J8m3Non4MJ3%O3J1j7K2j6p4nJ6l2M2
4660a7P2k1J6L4q5l2K1m9j1R4K1jN9l8p4nl3m8N6N3J0O0Om3l9m1n5J0L9K0P2M9
$$ [...]
8191A
##END NTUPLES=NMR FID
##END=
