##TITLE=1H_AM_NVG4
 DMSO-d6
 8 sc, 
 8.9.2023
##JCAMPDX= 6.0         $$ Bruker NMR JCAMP-DX V2.0
##DATA TYPE= NMR FID
##DATA CLASS= NTUPLES
##ORIGIN= UXNMR, Bruker Analytische Messtechnik GmbH
##OWNER= root
$$ XWIN-NMR		Version 3.5
$$ Fri Sep  8 13:58:33 2023 Russian Standard Time (UT+4h)  she@DPX200
##.OBSERVE FREQUENCY= 200.13135
##.OBSERVE NUCLEUS= ^1H
##.DELAY= (6, 6)
##.ACQUISITION MODE= SIMULTANEOUS
##.ACQUISITION SCHEME= undefined
##.AVERAGES= 8
##.DIGITISER RES= 18
##SPECTROMETER/DATA SYSTEM= spect
##.PULSE SEQUENCE= zg30
##.SOLVENT NAME= DMSO
##.SHIFT REFERENCE= (INTERNAL, DMSO, 0, 15.7039)
##AUDIT TRAIL= $$ (NUMBER, WHEN, WHO, WHERE, WHAT)
$$ ##TITLE= Audit trail, XWIN-NMR		Version 3.5
$$ ##JCAMPDX= 5.01
$$ ##ORIGIN= Bruker BioSpin GmbH
$$ ##OWNER= she
$$ F:/spectra/data/she/nmr/H-F/1/audita.txt
$$ ##AUDIT TRAIL=  $$ (NUMBER, WHEN, WHO, WHERE, WHAT)
(   1,<2023-09-08 13:57:38.64 +0400>,<she>,<DPX200>,
      <created by zg, POWCHK disabled, PULCHK disabled
       configuration hash MD5:
       00 E9 B6 7A A2 85 ED C7 34 08 36 98 17 FE 4E 26
       data hash MD5: 16K
       86 1D F7 C6 58 86 3E 24 D0 C1 1B AC AF 30 E9 11>)
$$ ##END=
$$ 
$$ hash MD5
$$ 33 4C 72 CC 4B 96 5E 54 11 B0 B4 CE 8A 85 4C EC
##$RELAX= 
##$RELAX= 
##$RELAX= 
##$RELAX= 
##$RELAX= 
##$RELAX= 
$$ Bruker specific parameters
$$ --------------------------
##$DU= <F:/spectra>
##$EXPNO= 1
##$NAME= <H-F>
##$PROCNO= 1
##$TYPE= <nmr>
##$USER= <she>
##$AMP= (0..31)
100 100 100 100 100 100 100 100 100 100 100 100 100 100 100 100 100 100 
100 100 100 100 100 100 100 100 100 100 100 100 100 100 
##$AQSEQ= 0
##$AQ_mod= 1
##$AUNM= <au_zg>
##$AUTOPOS= <>
##$BF1= 200.13
##$BF2= 200.13
##$BF3= 200.13
##$BF4= 200.13
##$BF5= 200.13
##$BF6= 200.13
##$BF7= 200.13
##$BF8= 200.13
##$BYTORDA= 1
##$CFDGTYP= 0
##$CFRGTYP= 5
##$CHEMSTR= <none>
##$CNST= (0..31)
1 1 145 1 1 1 1 1 1 1 1 1 1 1 1 1 1 1 1 1 1 1 1 1 1 1 1 1 1 1 1 1 
##$CPDPRG= <>
##$CPDPRG1= <>
##$CPDPRG2= <>
##$CPDPRG3= <>
##$CPDPRG4= <mlev>
##$CPDPRG5= <mlev>
##$CPDPRG6= <mlev>
##$CPDPRG7= <mlev>
##$CPDPRG8= <mlev>
##$CPDPRGB= <>
##$CPDPRGT= <>
##$D= (0..31)
0 1.2 0 0 0 0 0 0 0 0.06 0 0.03 0 0 0 0 0.0002 0 0 0 0 0 0 0 0 0 0 0 0 
0 0 0 
##$DATE= 1694167058
##$DBL= (0..7)
120 120 120 120 120 120 120 120 
##$DBP= (0..7)
150 150 150 150 150 150 150 150 
##$DBP07= 0
##$DBPNAM0= <>
##$DBPNAM1= <>
##$DBPNAM2= <>
##$DBPNAM3= <>
##$DBPNAM4= <>
##$DBPNAM5= <>
##$DBPNAM6= <>
##$DBPNAM7= <>
##$DBPOAL= (0..7)
0.5 0.5 0.5 0.5 0.5 0.5 0.5 0.5 
##$DBPOFFS= (0..7)
0 0 0 0 0 0 0 0 
##$DE= 6
##$DECBNUC= <off>
##$DECIM= 32
##$DECNUC= <off>
##$DECSTAT= 4
##$DIGMOD= 1
##$DIGTYP= 9
##$DL= (0..7)
0 120 120 120 120 120 120 120 
##$DP= (0..7)
150 150 150 150 150 150 150 150 
##$DP07= 0
##$DPNAME0= <>
##$DPNAME1= <>
##$DPNAME2= <>
##$DPNAME3= <>
##$DPNAME4= <>
##$DPNAME5= <>
##$DPNAME6= <>
##$DPNAME7= <>
##$DPOAL= (0..7)
0.5 0.5 0.5 0.5 0.5 0.5 0.5 0.5 
##$DPOFFS= (0..7)
0 0 0 0 0 0 0 0 
##$DQDMODE= 0
##$DR= 18
##$DS= 0
##$DSLIST= <SSSSSSSSSSSSSSS>
$$ [...]
##$SUBNAM2= <"">
##$SUBNAM3= <"">
##$SUBNAM4= <"">
##$SUBNAM5= <"">
##$SUBNAM6= <"">
##$SUBNAM7= <"">
##$SUBNAM8= <"">
##$SUBNAM9= <"">
##$SW= 18.05172834244
##$SWIBOX= (0..15)
0 0 2 0 0 0 0 0 0 0 0 0 0 0 0 0 
##$SW_h= 3612.71676300578
##$TD= 16384
##$TD0= 1
##$TE= 0
##$TE2= 300
##$TE3= 300
##$TEG= 300
##$TL= (0..7)
0 120 120 120 120 120 120 120 
##$TP= (0..7)
150 150 150 150 150 150 150 150 
##$TP07= 0
##$TPNAME0= <>
##$TPNAME1= <>
##$TPNAME2= <>
##$TPNAME3= <>
##$TPNAME4= <>
##$TPNAME5= <>
##$TPNAME6= <>
##$TPNAME7= <>
##$TPOAL= (0..7)
0.5 0.5 0.5 0.5 0.5 0.5 0.5 0.5 
##$TPOFFS= (0..7)
0 0 0 0 0 0 0 0 
##$TUNHIN= 0
##$TUNHOUT= 0
##$TUNXOUT= 0
##$USERA1= <user>
##$USERA2= <user>
##$USERA3= <user>
##$USERA4= <user>
##$USERA5= <user>
##$V9= 5
##$VALIST= <valist>
##$VCLIST= <CCCCCCCCCCCCCCC>
##$VD= 0
##$VDLIST= <DDDDDDDDDDDDDDD>
##$VPLIST= <PPPPPPPPPPPPPPP>
##$VTLIST= <TTTTTTTTTTTTTTT>
##$WBST= 1024
##$WBSW= 4
##$XGAIN= (0..3)
0 0 0 0 
##$XL= 0
##$YL= 0
##$YMAX_a= 271074
##$YMIN_a= -255293
##$ZGOPTNS= <>
##$ZL1= 120
##$ZL2= 120
##$ZL3= 120
##$ZL4= 120
##$ABSF1= 10
##$ABSF2= 0
##$ABSG= 5
##$ABSL= 3
##$ALPHA= 0
##$AQORDER= 0
##$ASSFAC= 0
##$ASSFACI= 0
##$ASSFACX= 0
##$ASSWID= 0
##$AUNMP= <proc_1d>
##$AZFE= 0.1
##$AZFW= 0.1
##$BCFW= 1
##$BC_mod= 2
##$BYTORDP= 1
##$COROFFS= 0
##$CY= 11.3945322036743
##$DATMOD= 1
##$DC= 2
##$DFILT= <>
##$DTYPP= 0
##$F1P= 15.7292609196834
##$F2P= 12.9074282941183
##$FCOR= 0.5
##$FTSIZE= 0
##$FT_mod= 4
##$GAMMA= 1
##$GB= 0.15
##$INTBC= 1
##$INTSCL= 1
##$ISEN= 128
##$LB= 0.24
##$LEV0= 0
##$LPBIN= 0
##$MAXI= 10000
##$MC2= 0
##$MEAN= 0
##$ME_mod= 0
##$MI= 1.114404
##$NCOEF= 0
##$NC_proc= 0
##$NLEV= 6
##$NOISF1= 3.799351
##$NOISF2= 2.8
##$NSP= 1
##$NTH_PI= 0
##$NZP= 0
##$OFFSET= 15.70392
##$PC= 1
##$PHC0= -21559.71
##$PHC1= 10.25271
##$PH_mod= 1
##$PKNL= yes
##$PPARMOD= 0
##$PSCAL= 0
##$PSIGN= 0
##$REVERSE= no
##$SF= 200.130013532006
##$SI= 16384
##$SIGF1= 3
##$SIGF2= 2
##$SINO= 400
##$SIOLD= 16384
##$SREGLST= <1H.CDCl3>
##$SSB= 0
##$STSI= 0
##$STSR= 0
##$SW_p= 3612.71676300578
##$SYMM= 0
##$S_DEV= 0
##$TDeff= 0
##$TDoff= 0
##$TI= <>
##$TILT= no
##$TM1= 0
##$TM2= 0
##$TOPLEV= 0
##$USERP1= <user>
##$USERP2= <user>
##$USERP3= <user>
##$USERP4= <user>
##$USERP5= <user>
##$WDW= 1
##$XDIM= 8192
##$YMAX_p= 0
##$YMIN_p= 0
$$ End of Bruker specific parameters
$$ ---------------------------------
##NTUPLES= NMR FID
##VAR_NAME=  TIME,          FID/REAL,        FID/IMAG
##SYMBOL=    X,             R,               I
##VAR_TYPE=  INDEPENDENT,   DEPENDENT,       DEPENDENT
##VAR_FORM=  AFFN,          ASDF,            ASDF
##VAR_DIM=   8192,          8192,            8192
##UNITS=     SECONDS,       ARBITRARY UNITS, ARBITRARY UNITS
##FACTOR=    0.0002768,     1,               1
##FIRST=     0,             0,               0
##LAST=      2.2672688,     0,               0
##MIN=       0,             -255293,         0
##MAX=       2.2672688,     271074,          0
$$ Real data points
##PAGE= N=1
##DATA TABLE= (X++(R..R)), XYDATA
$$ [...]
$$ plain form
799 -97 -228 215 118 -189 -105 -12 58 -13 -142 113 10 -106 -3 194 -196 -55 76 94 -67 -214 62 111 -192
822 -192 50 68 -160 -111 92 -16 -122 -121 43 170 -111 12 44 36 8 104 124 -151 -34 154 101 -168 -41 117
846 117 99 -176 12 20 -81 -209 101 124 -80 -27 114 113 -197 -153 92 243 -50 -141 -38 84 -43 100 112 16
870 16 -174 233 190 -147 -76 191 127 -119 100 59 18 -175 47 157 -59 -136 40 151 -65 -107 -78 42 -63
893 -63 -65 89 26 -111 -17 22 5 -169 99 69 -8 -200 129 115 22 -73 20 65 -9 47 161 -150 -239 146 266 -80
919 -80 -287 -84 142 -57 -54 49 13 -117 10 131 -106 -134 50 53 36 48 32 48 -32 34 179 17 -102 27 188
944 188 -9 -64 114 147 -31 -183 62 161 -62 -50 71 -30 -59 47 88 -106 -106 153 161 -74 15 -23 -2 -42 110
969 110 179 -119 -164 122 189 -74 -307 17 133 -16 -66 38 82 -124 40 96 36 -136 -6 130 60 -49 43
$$ packed form
799i7j31M43r7l07Q4R3P0p1j29K55j03j16J03J97l90J41J31J8j61j47K76M9l03
822a92K42J8k28M9K03j08j06JJ64J27k81J23L2qk8R6K0k75J17J88n3k69J27J58
846A17j8k75J88Qj01j28L10K3k04N3J41jl10M4K45J51k93r1J03J22j27J43J2r6
870A6j90M07m3l37P1K67o4k46K19m1m1j93K22J10k16p7J76J11k16m2K9J20j05
893f3kJ54o3j37R4L9j7j74K68l0p7j92L29j4r3r5R3M5p4N6J14l11q9L85J20l46
919h0k07K03K26j99LJ03l6j30J27J21k37k8J84Lj7J2j6J6q0O6J45j62j19J29J61
944A88j97n5J78L3j78j52K45R9k23J2J21j01k9J06M1j94%K59Qk35Q9l8K1m0J52
969A10O9k98m5K86O7k63k33L24J16j49n0J04M4k06J64N6o0j72J30J36p0j09R2
$$ plain form
992 43 9 -91 -53 118 -40 -161 52 84 -5 -104 87 168 -93 -149 71 288 0 -173 124 43 -130 42 19 14
1016 14 -111 -4 6 11 -94 -92 54 -21 39 168 58 -49 131 204 57 -175 12 185 2 4 -9 174 -173 14
1040 14 -40 -41 -129 -66 105 130 -62 -14 162 -71 -28 -10 108 -201 43 74 -17 -78 57 163 -63 -223 84 84 -55
1065 -55 -90 93 153 -123 -42 135 122 -166 -41 105 145 -156 -73 140 31 -33 56 -75 -77 39 112 -90 -190 66
1089 66 127 -55 -86 26 190 -78 -143 162 80 7 -80 152 110 -109 -108 111 -9 -77 -27 31 81 44 53 117 -49 44
1115 44 129 -77 -162 76 99 18 -57 57 48 34 -54 92 74 -125 -110 115 76 -66 -190 37 159 -36 -90 70 19
1140 19 -97 105 44 -96 -133 206 -43 -77 58 236 -166 -137 83 104 -119 -136 78 41 -93 -133 159 84 -161
1163 -161 -2 49 55 -61 -69 -1 8 6 76 104 -164 4 143 15 -5 -47 53 49 -84 33 -82 -94 -53 79 171 -245
$$ packed form
992D3l4j00L8J71j58j21K13L2q9r9J91Q1k61n6K20K17k88j73K97q1j73J72k3n
1016A4j25J07J0Nj05KJ46p5O0J29j10j07J80P3j47k32J87J73j83Kj3J83l47J87
1040A4n4jq8O3J71K5j92M8J76k33M3J8J18l09K44L1r1o1J35J06k26j60L07%j39
1065e5l5J83O0k76Q1J77j3k88J25J46M0l01Q3K13j09o4Q9j31kJ16P3k02j00K56
1089F6O1j82l1J12J64k68o5L05q2p3q7K32m2k19JK19j20o8N0N8N0l7RO4j66R3
1115D4Q5k06q5K38K3q1p5J14rj4q8J46j8j99J5K25l9j42j24K27J22j95n4J60n1
1140A9j16K02o1j40l7L39k49l4J35J78m02K9K20K1k23j7K14l7j34m0K92p5k45
1163a61J59N1Oj16qO8RkP0K8k68J68J39j28k0m2J00mj33J17j15j2M1J32R2m16
$$ plain form
1189 -245 -201 56 68 33 -7 66 10 -56 19 -69 -10 38 10 167 -171 -64 45 79 -23 21 23 -61 -39 -69 39 -129
1215 -129 -136 139 19 -102 -107 169 24 -127 -58 51 23 -122 -7 60 -41 -85 17 52 -115 -37 -16 88 19 -75
1239 -75 -55 -101 -103 15 31 -120 -76 45 165 -39 -58 71 -17 -13 68 1 -46 -62 21 38 -69 68 84 50 -24 62 66 27
1267 27 -13 -7 76 -79 -37 91 86 -52 -153 67 116 -97 -85 8 32 -106 15 22 -7 -204 101 58 30 -121 46 134
1293 134 -178 -15 57 -3 -143 42 85 14 -91 -60 150 34 -71 54 72 -108 -156 110 78 -95 -14 40 19 -170
1317 -170 -18 86 -122 -110 6 38 30 -8 -8 0 23 -51 43 -62 -65 -36 143 17 -70 126 48 -127 28 92 26 -33 -14
1344 -14 100 18 -15 -21 95 -16 -74 68 -19 -41 -25 15 -32 -42 -15 115 -70 -17 47 93 -75 -17 23 -16 -12 -63 50
1371 50 -38 -45 31 127 73 -59 -77 74 14 -39 67 81 5 3 90 1 -27 -16 181 -6 -92 58 18 11 -73 -40 62 -181
$$ packed form
1189b45M4K57J2l5m0P3n6o6P5q8N9M8k8J57l38J07J09L4j02M4Kq4K2l0J08j68
1215a29pK75j20j21nK76j45j51O9J09k8j45J15O7j01m4J02L5j67P8K1J04o9r4
1239g5K0m6kJ18J6j51M4J21J20k04j9J29q8MQ1o7m7j6Q3J7j07J37J6l4p4Q6Ml9
1267B7m0OQ3j55M2J28nj38j01K20M9k13J2R3K4j38J21Pk9j97L05m3k8j51J67Q8
1293A34l12J63P2o0j40J85M3p1j05L1K10j16j05J25J8j80m8K66l2j73Q1N4k1j89
1317a70J52J04k08J2J16L2ql8%QK3p4R4j05lK9J79j26q7J96p8j75J55O4o6n9J9
1344a4J14q2l3oJ16j11n8J42q7k2J6M0m7j0K7J30j85N3O4M6j68N8M0l9Mn1J13
1371E0q8pP6R6n4j32j8J51o0n3J06J4p6kQ7q9k8J1J97j87q6J50m0pq4L3J02k43
$$ plain form
1399 -181 -4 124 98 -128 -11 167 11 -154 29 51 -29 62 74 -7 -29 -6 35 11 -145 4 99 -52 -48 -53 -33
1424 -33 37 69 11 40 -94 -58 158 -78 -68 85 83 -75 -34 53 62 -128 -95 -4 -103 -33 -96 -56 -101 -109 86 112 39 -105
1452 -105 88 18 -51 23 115 -53 -88 -2 193 87 -190 22 24 -63 -65 -65 -48 19 -117 86 8 -160 11 116 56 -62
1478 -62 47 88 -95 -130 -8 88 -82 -63 100 56 -123 35 59 -30 -150 -69 128 -40 -80 -83 128 -3 -42 78
1502 78 22 -1 -71 37 26 -11 28 93 6 39 51 -5 -170 4 67 57 -144 -85 37 133 -161 -149 153 -62 -68 -15 46
1529 46 -58 7 -104 47 -110 -41 58 -77 -68 -13 15 -5 -29 124 55 -79 7 137 43 -159 -59 143 62 -67 -79
1554 -79 62 3 -15 15 73 -57 17 34 2 -43 -14 -26 -11 55 -1 62 -65 -28 16 -36 -85 8 171 -9 -156 29 47
1581 47 -35 -81 -42 121 58 -106 8 62 7 -73 30 47 -19 30 -35 -74 37 70 -99 -44 50 23 122 -95 -22 186
$$ packed form
1399a81J77J28k6k26J17J78j56j65J83K2q0R1J2q1k2K3M1k4j56J49R5j51MnK0
1424c3P0L2n8K9j34L6K16k36J0J53kj58M1Q7Rj90L3R1r9P0o3M0m5qJ95K6p3j44
1452a05J93p0o9P4R2j68l5Q6J95j06k77K12Kq7k%J7O7j36K03p8j68J71J05o0j18
1478f2J09M1j83l5J22R6j70J9J63m4j79J58K4q9j20Q1J97j68m0lK11j31l9J20
1502G8n6k3p0J08j1l7L9O5q7L3J2n6j65J74O3j0k01N9J22R6k94J2L02k15oN3O1
1529D6j04O5j11J51j57O9R9j35RN5K8k0k4J53o9j34Q6J30r4k02J00K02q1j29j2
1554g9J41n9j8L0N8j30P4J7l2m5K9j2J5O6n6O3j27L7M4n2m9R3J63j80j47J85J8
1581D7q2m6L9J63o3j64J14N4n5q0J03J7o6M9o5l9J11L3j69N5R4k7R9k17P3K08
$$ plain form
1607 186 50 -175 15 62 -123 -133 -134 72 -70 -43 -47 91 89 -85 15 142 -22 -114 18 94 63 49 54 -136 16
1632 16 77 0 -89 19 187 7 -141 -51 88 133 -173 -40 183 55 -111 -96 77 -12 -37 -5 32 -6 -58 -37 10
1657 10 78 132 -65 -163 -17 142 47 -85 62 186 74 -209 -69 165 -27 -90 -6 188 33 -63 105 80 62
1680 62 -48 -66 16 103 -55 -51 -86 -75 110 4 -157 -37 79 40 -115 62 132 -98 -163 -42 129 2 -213 32
1704 32 217 52 -167 -32 163 57 14 2 71 200 121 -68 -3 120 3 -95 -160 -16 61 -82 -207 13 176
1727 176 -104 -183 -83 159 -7 -168 -42 184 39 -175 -64 218 111 -128 -108 90 132 -11 -102 -39 113 -92
1749 -92 -171 -33 4 54 -26 -66 88 158 -3 -214 -19 255 7 -171 55 244 -83 -243 -53 141 41 -90
1771 -90 -71 4 109 -127 -67 1 61 31 21 28 62 137 -17 -220 88 141 -98 -189 65 212 -48 -228 18 217 32
$$ packed form
1607A86j36k25J90M7j85j0jK06j42K7mJ38kj74J00J27j64r2J32P6l1j4Nj90J52
1632A6O1p7q9J08J68j80j48R0J39M5l06J33K23j28j66J5J73q9k5L2L7l8n2K1M7
1657A0O8N4j97r8J46J59r5j32J47J24j12k83J40K34j92o3Q4J94j55r6J68k5j8
1680F2j10j8Q2Q7j58Ml5J1J85j06j61J20J16l9j55J77P0k30o5J21J71j27k15K45
1704C2J85j65k19J35J95j06m3j2O9J29p9j89O5J23j17r8o5J44P7j43j25K20J63
1727A76k80p9J00K42j66j61J26K26j45k14J11K82j07k39K0J98M2j43r1O3J52k05
1749i2p9J38L7N0q0m0J54P0j61k11J95K74k48j78K26J89l27j60J90J94j00j31
1771i0J9P5J05k36O0O8O0l0j0PL4P5j54k03L08N3k39r1K54J47k60j80K46J99j85
$$ plain form
1796 32 -144 -41 157 -14 -68 26 18 143 -28 -103 41 178 73 -146 -127 68 121 -85 -40 113 154 -134 -149 -22
1820 -22 213 -79 -286 6 280 64 -192 14 145 82 -96 8 91 24 -80 -132 -63 62 -17 -38 -112 143 130
1843 130 -106 8 80 221 -182 -214 31 298 36 -292 -74 93 72 -135 -134 148 0 -126 -18 169 108 -74
1865 -74 -77 60 123 48 -158 14 150 159 -144 -205 166 201 -98 -183 95 203 -74 -156 -20 147 11 -195 -85 153
1889 153 93 -158 10 213 67 -90 -61 108 53 38 -199 -59 60 77 -173 -174 79 167 -67 -214 83 260 -42
1912 -42 -215 -6 245 53 -149 42 175 -56 -284 -75 222 119 -176 -112 28 82 -53 -183 13 184 90
1933 90 -76 -160 109 72 -173 -115 103 174 -46 -211 43 140 -34 -90 40 178 1 -253 -85 126 128 -99 -3
1956 -3 109 142 -10 -148 -78 220 -21 -150 -58 122 86 -14 -130 104 113 -117 -271 90 125 -2 -201 140 230
$$ packed form
1796C2j76J03J98j71n4R4qJ25j71p5J44J37j05k19J9J95N3k06M5J53M1k88j5J27
1820b2K35k92k07K92K74k16k56K06J31o3j78J04Q3o7j04n2O9J25p9k1p4K55j3
1843A30k36J14P2J41m03l2K45K67k62l28K18J67k1k07JK82j48j26J08J87o1j82
1865g4lJ37O3p5k06J72J36Rl03o1L71L5k99q5K78J08k77q2J36J67j36k06J10K38
1889A53o0k51J68K03j46j57K9J69n5j5k37J40J19J7k50jK53Q8k34j47K97J77l02
1912d2j73K09K51j92k02J91J33k31k28K09K97j03k95O4J40N4j35j30J96J71r4
1933I0j66q4K69l7k45N8K18P1k20j65K54R7j74n6J30J38j77k54J68K11Kk27R6
1956cJ12L3j52j38P0K98k41j29R2J80l6j00j16K34Rk30j54L61L5j27j99L41R0
$$ plain form
1979 230 -61 -91 21 178 34 -83 -75 85 24 -118 -202 -67 164 36 -120 -164 80 154 -97 -76 138 76 -143
2002 -143 -144 48 134 -90 -181 65 193 -19 -185 -102 71 69 -58 27 131 176 35 -118 -37 172 51 -101 -66 235
2026 235 86 -125 -113 179 208 -95 -189 61 153 -53 -80 80 167 -2 -303 -38 62 83 -133 -95 59 77 -72
2049 -72 -70 -20 29 16 -210 -23 82 157 -97 -171 40 156 -84 -116 48 172 -193 -219 55 189 1 -120 -6
2072 -6 152 62 -78 -20 50 96 1 -209 40 118 -20 -143 -60 71 3 -150 -146 42 236 -125 -220 120 150 -75 -205
2097 -205 37 145 -17 -55 71 105 0 -170 -127 53 121 -111 -125 21 160 44 -131 3 42 36 8 -111 18
2120 18 24 -174 -216 144 137 29 -143 59 74 23 -165 12 155 -66 -180 -24 38 16 -45 -84 61 121 130 -144 -32
2145 -32 151 84 -144 -175 108 109 -28 -202 20 113 -117 -58 36 105 -33 -97 35 124 -4 -83 -42 -5 100 -25 -20
$$ packed form
1979B30k91l0J12J57j44j17QJ60o1j42q4J35K31j28j56m4K44P4k51K1K14o2k19
2002a43jJ92Q6k24r1K46J28k12j66Q3J73kj27Q5J04M5j41j53Q1K09j21j52L5L01
2026B35j49k11J2K92K9l03r4K50R2k06k7J60Q7j69l01K65J00K1k16L8J54J8j49
2049g2KN0M9j3k26J87J05P5k54p4K11J16k40l2J64J24l65k6K74J34j88j21J14
2072fJ58r0j40N8P0M6r5k10K49P8j38j23Q3J31o8j53MJ88J94l61r5L40L0k25j30
2097b05K42J08j62l8J26L4j05j70M3J80O8k32j4J46J39j16j75J34L9ok8j19J29
2120A8Oj98m2L60pj08j72K02J5n1j88J77J43k21j14J56O2k2o1l9J45O0Rk74J12
2145c2J83o7k28l1K83Jj37j74K22R3k30N9R4O9j38o4J32Q9j28p9M1L7J05j25N
$$ plain form
2170 -20 76 85 -24 -113 -16 177 52 -70 -68 88 73 -15 -144 151 73 -105 -101 -33 137 -45 -136 23 122 -12 -80 -121
2196 -121 12 71 -83 -76 -12 20 25 -258 -15 138 117 -24 -38 84 125 -169 -79 75 85 -89 -118 48 43 -120 -63
2221 -63 162 148 -55 -174 86 53 25 -121 -13 -49 25 11 -82 -56 36 21 -97 -44 116 52 -82 -38 81 134 -84
2246 -84 -42 32 35 -13 -60 54 80 8 -58 123 128 55 15 72 -6 33 86 -66 70 77 126 -127 -110 106 92 10 -22 53 45
2275 45 -99 -61 -71 75 -128 -153 34 65 -80 -28 57 -41 5 9 -21 32 157 127 -65 92 127 112 -105 -72 140 111
2301 111 -122 -89 -11 80 -113 -59 25 136 -111 -55 2 73 6 -84 89 105 121 -37 2 -90 78 61 81 -25 -12 -6
2327 -6 -120 9 102 29 -134 37 12 -5 -168 -79 79 34 -13 -145 45 68 -18 9 19 134 30 -1 2 -26 34 -93
2353 -93 -71 88 -25 38 -16 34 121 -89 -54 13 12 36 -97 -66 97 90 -48 16 -53 36 -3 31 7 -2 1 58 22 47 14
$$ packed form
2170b0R6Rj09q9R7J93j25j22KJ56j5q8j29K95p8j78MO8J70j82r1J59R9j34o8m1
2196a21J33N9j54PO4L2Nk83K43J53k1j41j4J22M1k94R0J54J0j74k9J66nj63N7
2221f3K25j4k03j19K60l3k8j46J08l6P4j4r3K6R2j5j18N3J60o4j34M4J19N3k18
2246h4M2P4Lm8m7J14K6p2o6J81Np3m0N7p8L9N3j52J36PM9k53J7K16j4q2l2P5q
2275D5j44L8j0J46k03k5J87L1j45N2Q5r8M6Ml0N3J25l0j92J57L5j5k17L3K12k9
2301A11k33L3P8R1j93N4Q4J11k47N6N7P1o7r0J73J6J6j58L9r2J68j7K0j06J3O
2327fj14J29R3p3j63J71k5j7j63Q9J58m5m7j32J90K3q6K7J0J15j04l1Lk8O0j27
2353i3K2J59j13O3n4N0Q7k10L5O7jK4j33L1J63pj38O4o9Q9l9L4k4rLN7l6K5l3
$$ plain form
2382 14 -9 -57 0 35 88 -31 -57 -21 -32 -51 -18 17 -16 40 -9 37 88 -9 55 -17 48 -41 -1 2 -88 59 29 -21 7 -41
2412 -41 -30 -94 24 -19 -61 -32 -45 38 72 5 -46 135 -23 -92 22 96 14 59 -16 87 43 -74 121 53 14 -109
2438 -109 27 -12 48 37 51 108 -37 -32 -52 -86 52 -18 15 -124 -100 53 184 -28 -73 -27 56 -39 -101 60 -39 -54
2464 -54 -47 -27 37 78 51 35 30 31 101 39 -81 56 72 5 49 70 39 72 53 24 -68 -31 -18 40 12 -1 -18 75 -99 31
2494 31 40 9 13 -27 -15 24 18 -56 120 -63 34 33 32 4 -66 -75 -1 78 77 23 53 7 12 18 -38 -2 -46 31 15 -20 -90 7 94 -29
2528 -29 46 46 19 -28 5 44 -17 81 -30 -56 41 97 111 -82 0 172 75 18 -13 -17 104 -22 -34 81 -51 -50 -15 81
2556 81 -66 -57 -24 -6 -61 -18 -66 9 -13 -92 61 -21 77 -58 16 -77 -75 -81 38 -37 52 104 -45 -115 -40 -19 5 -71 10
2585 10 -50 18 13 -44 -106 -44 -70 25 114 -62 -35 95 -109 -9 64 -45 -60 20 29 -28 28 -23 31 -21 -62 -65 -30 29 -27
$$ packed form
2382A4k3m8N7L5N3j19k6L6j1j9L3L5l3N6m9M6N1r7O4p2O5q9M0Lr0J47l0n0K8m8
2412d1J1o4J18m3m2K9j3Q3L4o7n1J81j58o9J14P4q2M5p5J03m4j17J95o8l9j23
2438a09J36l9O0j1J4N7j45Nk0l4J38p0L3j39K4J53J31k12m5M6Q3r5o2J61r9j5
2464e4PK0O4M1k7j6nJP0o2j20J37J6o7M4K1l1L3j9k9r2L7J3N8k8j3j7R3j74J30
2494C1Rl1Mm0J2L9op4J76j83R7jjk8p0rP4P9jn4L0m6NOn6L6m4P7j6l5p0R7Q7j23
2528b9P5%k7m7L3L9o1R8j11k6R7N6J4j93Q2J72r7n7l1mJ21j26j2J15j32JL5R6
2556H1j47RL3J8n5M3m8P5k2p9J53q2R8j35P4r3KoJ19p5Q9N2j49p0P5K1K4p6Q1
2585A0o0O8nn7o2O2k6R5Q9j76K7J30k04J00P3j09j5Q0Rn7N6n1N4n2m1lL5N9n6
$$ plain form
2614 -27 4 69 -73 -40 -7 -93 13 0 58 -59 65 -97 2 71 2 -68 -10 -13 21 102 52 -79 -23 64 45 5 -11 -33
2642 -33 53 -13 -19 64 -12 -8 3 -60 78 11 46 -94 -42 7 33 -16 44 17 51 -63 -10 17 42 -3 36 153 16 -49 59
2671 59 63 40 36 48 -31 18 12 -16 -5 -86 41 79 -62 18 10 24 -87 91 19 17 -83 -69 51 -71 -22 -63 9 3 -9 74
2701 74 118 -6 -63 -87 -50 14 -90 2 25 -81 -44 18 20 -13 -31 39 -13 117 0 -61 28 -69 83 -13 34 -16 -41 -22
2729 -22 15 26 107 -15 -103 -63 43 -81 -58 62 24 -2 26 0 33 19 106 -48 -102 38 30 7 82 29 2 -39 -56 -2
2757 -2 -97 -3 -2 -26 88 42 58 165 -37 -20 49 49 54 21 -60 11 78 21 73 -41 117 -65 -10 63 -30 -86 6 -47 -9
2786 -9 4 4 -56 15 55 -41 40 37 -54 45 -64 27 -30 -75 85 -29 67 18 -18 -12 113 -56 -15 87 181 -55 -79 -21 70
2815 70 72 -109 -60 112 -4 35 16 -2 -40 -88 -25 -66 11 55 46 -45 37 -17 -1 -50 -8 57 45 -63 -67 19 -20 -24 106 -16
$$ packed form
2614b7L1O5j42L3L3q6J06j3N8j17J24j62R9O9o9p0N8lL4Q1n0j31N6Q7j9m0j6k2
2642c3Q6o6oQ3p6MJ1o3J38o7L5j40N2M9K6m9O0k7L4j14N3K7K5m5L9J17j37o5J08
2671E9Mk3mJ2p9M9ok8J1q1J27L8j41Q0qJ4j11J78p2kj00J4J20j22M9m1P2oj2Q3
2701G4M4j24n7k4L7O4j04R2K3j06L7O2Kl3j8P0n2J30j17o1Q9r7J52r6M7n0k5J9
2729b2L7J1Q1j22q8M0J06j24K3J20l8k6K8k6L3j4Q7j54n4J40qk3P5n3k7m1j7N4
2757br5R4Jk4J14m6J6J07k02J7O9%Nl3q1P1O7n7N2j14J58j82N5P3r3n6R2n3L8
2786iJ3%o0P1M0r6Q1lr1R9j09R1n7m5J60j14R6m9l6OJ25j69M1J02R4k36k4N8R1
2815G0Kj81M9J72j16L9j9j8l8m8O3m1P7M4rr1Q2n4J6m9M2O5j2j08mQ6l9mJ30j22
$$ plain form
2845 -16 -10 -9 84 8 13 71 41 34 -67 -7 -16 -81 2 -14 -66 -68 -13 61 64 -25 31 -113 -26 19 9 -19 -61 -73 79 33 -31 21
2877 21 -51 -47 -56 9 57 -1 5 92 -57 68 -33 33 42 -12 -2 27 -68 23 -21 23 -66 8 -80 -23 -66 5 102 -83 -11 72
2907 72 52 -63 -59 -44 -48 44 42 7 53 -15 -4 62 37 -9 -1 169 -20 15 21 35 106 78 13 -29 -8 41 52 -44 -115 18 62
2938 62 51 88 20 -35 -111 -36 -37 -25 -64 34 51 37 -67 -104 16 -72 -88 -69 -1 23 -10 -3 -59 -8 60 56 54 2 75 46 100
2969 100 -14 25 -13 -2 -16 39 -87 -22 86 91 9 30 -67 -4 1 -20 -11 -96 -106 20 88 9 59 -45 109 -35 -23 -47
2997 -47 -16 -35 118 1 -89 21 87 22 12 -16 -61 33 -13 26 19 22 -58 40 93 -25 29 -132 -22 41 -88 9 -69 -30
3025 -30 -13 -73 -131 -5 -17 59 -70 -27 -7 -81 -17 -4 13 -7 86 19 -22 12 -26 -42 -27 79 108 28 6 22 -83 52
3053 52 43 31 5 86 105 2 -24 -83 -10 34 -23 -112 7 6 39 128 37 -101 67 -22 45 7 -4 32 -7 1 -6 -82 -107 -18
$$ packed form
2845a6OJR3p6NN8l0pj01O0ro5Q3j6n2kN5P4Lq9N6j44Q7M5j0k8m2j2J52m6o4N2
2877B1p2MrO5M8n8OQ7j49J25j01O6Rn4J0K9r5R1m4M4q9P4q8N7m3P1R7j85P2Q3
2907G2k0j15MJ5mR2kl5M6o8J1O6k5m6QJ70j89L5OJ4P1k8o5m2K1M9J1r6p1J33M4
2938F2j1L7o8n5p6P5jJ2l9R8J7j4j04l7J20q8j6J9O8K4l3Pn6N1O8mkn2P3k9N4
2969A00j14L9l8J1j4N5j26O5J08Nq2K1r7O3Nk1Rq5j0J26O8p9N0j04J54j44J2k4
2997d7L1j9J53j17r0J10O6o5j0k8m5R4m6L9pLq0R8N3j18N4j61J10O3j29R7p8L9
3025c0J7o0n8J26j2P6j29M3K0p4O4J3J7k0R3o7m1L4l8j6J5J06K9q0k2J6j05J35
3053E2rj2k6Q1J9j03k6n9P3M4n7q9J19jL3Q9r1j38J68q9O7l8j1L6l9Qpp6k5Q9
$$ plain form
3083 -18 43 112 30 -28 25 55 -10 -47 29 -24 22 20 53 94 -39 30 -4 20 -27 91 44 -22 -12 60 -7 6 -3 -135 -10
3112 -10 -8 16 -34 -104 52 7 -33 -120 22 -23 -3 -166 66 138 5 25 127 64 61 29 49 16 -57 71 -11 -60 25 -29
3140 -29 103 -58 -82 86 -121 41 -44 131 63 -6 -79 -3 -95 -88 34 -1 -82 -23 87 28 6 -20 58 -45 -54 -72 14
3167 14 -132 56 -21 26 33 65 -26 -13 -59 18 30 -117 86 -14 28 23 -50 57 6 -8 1 22 -51 3 79 48 44 -32 20
3196 20 17 -93 135 32 7 2 -39 -1 105 -84 -55 -47 -81 2 -34 26 -53 -55 97 -22 -72 -17 80 -16 -6 61 64 28 -22
3225 -22 -17 37 -18 23 115 -60 -15 45 -80 30 -62 33 -22 -47 1 32 53 49 -64 31 -17 -76 -42 -16 38 -60 -67 11 -3 30
3255 30 20 -73 -10 -30 54 -5 23 125 125 -77 132 128 5 17 -60 -12 9 -8 -63 53 30 -2 57 -45 6 -42 52 45 -51
3284 -51 -82 87 45 -53 -80 -43 46 -48 -2 59 -6 -4 -20 -29 -34 -45 13 -14 15 -8 -9 -66 50 67 90 15 -72 28 7 7 -76
$$ packed form
3083a8O1O9q2n8N3L0o5l7P6n3M6kL3M1j33O9l4K4m7J18m7o6J0P2o7J3rj32J25
3112a0KK4n0p0J56m5m0q7J42m5K0j63K32P2j33K0J02o3ll2K0l3p3J28q2m9Q5n4
3140b9J32j61k4J68k07J62q5J75o8o9p3P6r2PJ22l5q1N9J10n9k2k6P8j03rj8Q6
3167A4j46J88p7M7PL2r1J3m6P7J2j47K03j00M2np3J07n1j4RK1p3N4P6l1mp6N2
3196B0lj10K28j03k5nm1L8J06j89K9Ql4Q3l6O0p9kJ52j19n0N5R7r6J0O7Ll6n0
3225b2NN4n5M1R2j75M5O0j25J10r2R5n5k5M8L1K1mj13R5m8n9L4K6N4r8pP8j4L3
3255C0j0r3O3k0Q4n9K8J02%k02K09mj23J2p7M8K1j7n5J16k3l2N9j02N1m8R4pr6
3284e1l1J69m2r8k7L7Q9r4M6O1o5Kj6rnj1N8k7K9k3jn7J16J7K3p5q7J00k1%q3
$$ plain form
3315 -76 -10 37 48 22 146 -8 -9 58 127 24 44 2 -12 -50 -45 -14 1 -58 -34 15 4 26 -15 39 16 1 -24 46 -4 -106
3345 -106 33 3 -17 1 44 -25 0 63 -41 -15 -84 3 20 65 -2 32 74 49 -65 85 39 -106 61 -47 -15 -74
3371 -74 16 91 37 26 -146 -51 8 70 38 -68 31 -52 32 -22 10 110 14 -31 -10 24 -9 -69 -9 36 -71 -30 -107 -68
3399 -68 -48 -18 77 -91 -16 -136 -52 8 1 25 22 -79 -82 16 89 -27 -20 54 -20 111 -11 -48 -15 -78 34 44 -106 -54
3427 -54 73 68 -1 -33 -104 -56 -66 25 72 14 45 63 -15 -82 20 -5 -25 -51 20 43 161 30 164 -109 74 51 29
3454 29 -31 71 26 -37 -69 23 -6 68 26 92 86 -35 109 19 42 87 19 -66 11 126 118 -19 -30 -29 -32 -22 29 111 -31
3483 -31 70 1 -76 26 -69 25 14 44 2 -67 -1 68 34 62 -7 48 104 -109 0 -14 41 -33 71 27 32 -37 53 102
3511 102 -37 -28 3 -45 61 -90 -129 63 75 55 156 56 -26 32 13 71 17 58 53 -36 5 32 -42 -10 -3 -85 -4 -63
$$ packed form
3315g6O6M7J1k6J24j54jO7O9j03K0m2j4l8NL1J5n9K4M9j1K2m1N4k3j5k5P0n0j02
3345a06J39l0k0J8M3o9K5O3j04K6o9Q7J7M5o7L4M2k5j14J50m6j45J67j08L2n9
3371g4R0P5n4j1j72R5N9O2l2j06R9q3Q4n4L2J00r6m5K1L4l3o0O0M5j07M1p7L9
3399f8K0L0R5j68P5j20Q4O0pK4lj01lR8P3j16PP4p4J31j22l7L3o3J12J0j50N2
3427e4J27no9l2p1M8j0R1M7n8L1J8p8o7J02k5k0k6P1K3J18j31J34k73J83k3k2
3454B9o0J02m5o3l2R2k9P4m2O6oj21J44r0K3M5o8q5P7J15qj37j1JlJ0N1Q2j42
3483c1J01o9p7J02r5R4j1L0m2o9O6O9l4K8o9N5N6k13J09j4N5p4J04m4No9R0M9
3511A02j39RL1m8J06j51l9J92J2k0J01j00q2N8j9N8n4M1nq9M1K7p4L2Pq2Q1n9
$$ plain form
3539 -63 88 -42 21 -39 -7 81 17 -65 -34 20 -150 5 -9 -47 -120 14 16 102 74 78 -18 40 123 -59 55 -89 -43
3566 -43 -54 -13 13 55 -45 -14 -55 5 -46 34 -38 -10 -16 105 -70 104 58 -136 5 -115 -12 -49 23 61 41 -71
3592 -71 27 -59 -63 -37 15 98 93 -102 95 20 -57 -87 79 6 29 34 71 52 -43 67 -36 13 -55 -40 -39 -25 89 45 -76
3621 -76 -25 47 46 -51 -67 35 48 61 -26 50 -66 -4 64 -76 -27 12 -21 33 10 -11 32 4 29 22 -7 -6 -11 -21 61 -39
3651 -39 88 89 34 -29 -61 52 75 -18 -18 58 -27 -74 58 -16 43 -59 -111 27 -18 4 70 -20 42 100 10 18 57 41 -11
3680 -11 15 15 1 -72 36 -39 68 -5 -42 -14 -73 15 -30 -46 -3 -114 85 8 57 152 -93 -23 18 8 -3 18 16 -55 -12
3709 -12 -24 -77 -14 93 54 -27 19 49 4 -30 13 -3 -21 -29 -9 -8 63 -51 47 -112 136 -106 60 -78 -11 -22 24 17
3737 17 44 -46 -50 -34 -45 34 41 -54 107 -1 -12 -25 10 62 -23 44 -115 -96 2 1 -29 -29 25 -62 19 -15 -32 11 -29 -74 16
$$ packed form
3539f3J51j30O3o0L2Q8o4q2L1N4j70J55j4l8p3J34KQ6k8Mr6N8Q3j82J14j44M6
3566d3j1M1K6M2j00L1m1O0n1Q0p2K8oJ21j75J74m6j94J41j20J03l7P2L8k0j12
3592g1R8q6mK6N2Q3nj95J97p5p7l0J66p3K3NL7j9r5J10j03M9o8J5JJ4J14m4j21
3621g6N1P2jr7j6J02J3J3q7P6j16O2O8j40M9L9l3N4k3k1M3k8K5pk9Jnj0Q2j00
3651c9J27Jn5o3l2J13K3r3%P6q5m7J32p4N9j02n2J38m5K2O6r0O2N8r0QL9j6n2
3680a1K6%j4p3J08p5J07p3l7K8n9Q8m5j6M3j11J99p7M9R5k45P0M1j0j1K1kp1M3
3709a2j2n3O3J07l9q1M6L0m5l4M3j6j8qK0JP1j14R8j59K48k42J66j38O7j1M6p
3737A7K7r0mJ6j1P9Pr5J61j08j1j3L5N2q5O7j59J9R8jl0%N4q7Q1l4j7M3m0m5R0
$$ plain form
3768 16 73 -75 -45 -31 121 -15 8 25 -16 -8 -93 44 37 -63 -70 2 22 34 31 -114 224 104 -33 -57 -94 -37 131
3795 131 57 -1 -74 -106 -1 87 21 -36 38 95 152 19 -6 -16 38 109 -88 -22 76 89 -22 28 -5 41 -63 -94 61
3822 61 -26 -59 -15 38 -29 26 -41 96 -4 -37 -101 -32 -129 0 -37 -50 -16 -6 55 -25 -21 -46 -29 23 -44 -22 54 16 -7
3851 -7 -82 -8 29 -3 73 -12 -45 -29 0 94 -1 -21 15 7 85 30 -61 -71 11 -61 49 28 -59 20 45 -96 54 66 11 3
3881 3 7 70 -28 3 10 104 -89 47 83 -98 72 -40 70 -31 -56 7 -73 50 -19 -29 -52 49 59 -5 -74 42 -21
3908 -21 121 66 -60 3 -31 29 38 32 57 72 -73 -117 -37 22 23 89 -20 -42 -57 -28 -49 -6 -37 -5 -6 32 4 -48 -7 -84
3938 -84 54 -29 55 34 44 50 -40 -141 25 86 106 -38 -46 -3 -1 -122 -93 34 -94 -110 -10 27 -36 -30 -46 -44 -42 101 -68
3967 -68 28 36 -38 -22 11 -59 -21 27 -37 38 62 54 36 -11 34 60 -58 48 13 24 48 -7 8 134 -30 -29 -94 94 -46
$$ packed form
3768A6N7j48L0J4J52j36K3J7m1Qq5J37pj00pP2K0J2lj45L38j20j37k4l7N7J68
3795A31p4n8p3l2J05Q8o6n7P4N7N7j33k5j0N4P1j97O6R8J3j11N0l3M6j04l1J55
3822F1q7l3M4N3o7N5o7J37j00l3o4O9r7J29l7j3L4J0O1q0Mk5J7N2o7K2P6l8k3
3851gp5P4L7l2P6q5l3J6K9R4r5k0L6qP8n5r1j0Q2p2J10k1q7P9K5j41J50J2n5q
3881CMO3r8L1PR4j93J36L6j81J70j12J10j01k5O3q0J23o9j0k3J01J0o4o9J16o3
3908b1J42n5j26O3l4O0RoK5J5j45m4Q0N9JO6j09k2j5K9k1M3l1L2jL8k8n2M1p7
3938h4J38q3Q4k1J0Or0j01J66O1K0j44qM3Kj21K9J27j28j6J00L7o3Oj6KKJ43j69
3967f8R6Qp4J6L3p0L8M8o4P5K4qj8m7M5K6j18J06l5J1K4n5J5J26j64Jo5J88j40
$$ plain form
3996 -46 88 -22 14 86 -21 22 -11 -27 -3 76 26 55 -9 61 -48 -111 76 -65 -83 -53 -36 -73 -5 48 19 -65 61
4023 61 32 -31 3 26 -36 -2 18 28 -12 -67 -33 -40 -87 62 -58 42 -58 -36 44 21 -24 -50 -28 -83 -57 -37 -71 -21 80
4052 80 -12 -109 84 31 49 32 69 -62 43 -10 78 32 30 47 93 93 -49 -23 -92 58 -37 22 25 33 68 -127 80 87 -66
4081 -66 6 -33 32 0 -8 4 -10 -53 53 -1 28 143 -18 -30 62 -15 48 -38 -129 45 51 -44 -6 13 -60 41 6 99 72
4110 72 56 28 69 55 -68 81 49 8 -6 -39 17 -11 3 40 20 -13 -39 -16 83 29 4 -34 -42 19 -6 -26 35 6 -67 114
4140 114 -33 -60 -19 -60 -27 -68 -67 -50 -33 13 -27 -19 -1 -27 23 -29 33 76 -55 -45 -58 4 -26 -75 39 20 -107 61
4168 61 -59 94 -141 -55 9 10 93 13 -68 -61 67 -6 4 39 -112 -35 54 -67 -5 23 19 67 68 110 102 -76 9 55 15
4197 15 -27 47 115 79 -92 9 -10 -26 62 1 57 -24 -50 24 -3 -13 -38 23 16 -78 -89 -3 102 7 73 -135 -43 -5 -65
$$ packed form
3996d6J34j10L6P2j07M3l3j6K4P9n0K9o4P0j09o3J87j41j8L0J7l7O8N3k9q4J26
4023F1k9o3L4K3o2L4K0J0m0n5L4pm7J49j20J00j00K2Q0k3m5k6K2n5K6K0l4N0J01
4052H0r2r7J93n3J8j7L7j31J05n3Q8m6kJ7M6%j42K6o9J50r5N9LQL5j95K07Pj53
4081f6P2l9O5l2qJ2j4m3J06n4K9J15j61j2R2p7O3q6r1J74Or5L8J9p3J01l5R3k7
4110G2j6k8M1j4j23J49l2m1j4l3N6k8J4L7k0l3k6K3R9n4k5l8qO1k5k0O1k9p3J81
4140A14j47k7M1m1L3m1JJ7J7M6m0QJ8k6N0n2O2M3j31J0j3O2l0m9J14j9j27J68
4168F1j20J53k35Q6O4JQ3q0q1PJ28p3J0L5j51P7Q9j21O2K8mM8JM2qj78Q5M6m0
4197A5m2P4O8l6j71J01j9j6Q8o1N6q1k6P4k7j0k5O1pr4j1Q6J05r5O6k08R2L8o0
$$ plain form
4226 -65 -49 -55 1 13 7 70 5 42 21 8 -31 43 0 23 -96 -42 -24 28 -24 50 -2 36 -88 60 77 -1 72 -13 26 -87
4256 -87 18 30 -18 -53 34 21 67 -22 84 -43 -65 26 64 -50 4 -64 -29 -3 133 76 18 2 43 -52 -202 8 25
4283 25 16 -82 -13 -38 53 -43 33 -10 -21 17 45 -26 -25 -97 31 17 -79 -92 10 92 -16 -22 12 -110 37 -40 22 108 10
4312 10 73 -74 -27 -40 79 96 -4 11 -44 77 5 -16 51 19 26 104 -23 -49 73 -9 -3 108 -80 22 -39 16 -46
4339 -46 26 54 -62 150 -16 13 -120 42 -35 45 14 -69 -23 19 -98 26 11 26 -35 78 28 -17 25 -47 -11 -53
4365 -53 36 36 67 4 21 6 -45 -43 35 -66 -3 -33 72 -28 -2 13 -31 -179 52 8 -15 -65 13 32 -38 -51 107 128
4393 128 43 48 -43 36 -25 -150 -134 18 -22 -3 -4 31 0 -20 -19 -45 35 59 56 31 26 2 -39 -69 -20 16 37 27 39 -4 97
4424 97 -53 74 10 103 -21 26 73 -24 -14 -6 43 -55 4 -36 64 -1 23 -26 -89 -31 71 33 56 28 14 102 -25 73
$$ packed form
4226f5J6oN6J2oO3o5L7k1j3l9P4m3K3j19N4J8N2n2P4n2L8j24J48J7p8P3q5L9j13
4256h7J05J2m8l5Q7j3M6q9J06j27k2R1L8j14N4o8L5K6J36n7n8j6M1r5j50K10J7
4283B5rr8O9k5R1r6P6m3j1L8K8p1Jp2J28j4r6j3J02Q2j08oL4j22J47p7O2Q6r8
4312A0O3j47M7j3J19J7j00J5n5J21p2k1O7l2PP8j27k6J22q2OJ11j88J02o1N5o2
4339d6P2K8j16K12j66K9j33J62p7Q0l1q3M6M2j17J24j5J5o1J13n0m5M2p2L6m2
4365e3Q9%L1o3J7j5n1KP8j01O3l0J05j00K6J5m4j48K31m4k3n0P8J9p0j3J58K1
4393A28q5Nr1P9o1j25J6J52m0J9jL5l1k0Jk6Q0K4lk5nk4m1l0M9L6K1j0J2m3J01
4424I7j50J27o4R3j24M7M7r7J0QM9r8N9m0J00o5K4m9o3N8J02l8K3k8j4Q8j27R8
$$ plain form
4452 73 48 -119 -138 -4 2 -65 -37 44 10 23 -53 -61 -68 84 32 -19 -64 6 44 48 76 45 6 -45 -52 -31 -92 -164 -39 65
4482 65 19 -14 -39 -18 147 -57 33 128 -81 85 -8 -37 -78 -49 -5 17 -34 -27 44 -58 -3 -13 26 23 -50 -37 -18 -43 -74
4511 -74 -101 -76 26 -60 -109 2 9 30 8 -39 -19 56 42 25 -94 -1 33 -42 74 89 -10 42 38 101 19 -42 62 56 -68
4540 -68 -31 -47 109 64 -37 -13 3 15 -9 16 -35 -27 -19 48 -205 -47 17 24 43 46 -125 -124 -22 -76 10 54 -24 30 24 14
4570 14 66 92 5 -11 9 -123 12 32 -54 -101 -23 17 32 36 -120 -98 117 3 -9 85 56 21 -69 45 26 10 94 -57
4598 -57 -24 -80 -41 -105 -19 36 12 -90 39 56 -12 77 -1 -43 -34 29 11 -23 -20 75 -108 22 1 -37 -70 -18 27 4 -48
4627 -48 -90 24 11 4 -58 16 -16 68 76 -93 -14 44 -2 11 31 -16 23 59 99 41 53 -34 -3 27 19 48 23 87 -13 -13 -66
4658 -66 19 -14 3 60 -19 -47 -12 -1 71 87 71 8 -73 -5 23 -6 -58 -15 139 -2 -4 -1 52 -20 -19 11 -132 -87 -39 -11
$$ packed form
4452G3k5j67j9J34Oo7K8Q1l4J3p6qpJ52n2n1m5P0L8MK8l1l9n1pK1o1p2J25J04
4482F5m6l3k5K1J65k04R0R5k09J66r3k9m1K9M4K2n1PP1j02N5j0L9lp3J3J9k5l1
4511g4k7K5J02q6m9J11PK1k2m7K0P5j4j7j19R3L4p5J16J5r9N2mO3q2o1J04oj24
4540f8L7j6J56m5j01K4J6J2k4K5n1QQO7k53J58O4PJ9Lj71JJ02n4Q6M4p8N4oj0
4570A4N2K6q7j6K0j32J35K0q6m7P8M0J5Mj56K2K15j14j2R4k9l5r0J14j9j6Q4j51
4598e7L3n6L9o4Q6N5k4j02J29J7o8Q9p8m2RO3j8l4LR5j83J30k1l8l3N2M5k3n2
4627d8m2J14j3po2P4l2Q4Qj69P9N8m6J3K0m7L9L6M0n8J2q7L1L0qK9k5O4j00%n3
4658f6Q5l3J7N7p9k8L5J1P2J6j6o3q1O8K8k9n2M3J54j41kLN3p2JL0j43M5M8K8
$$ plain form
4688 -11 8 51 44 13 -24 79 31 14 -24 22 -16 121 -13 -94 -64 -113 6 -31 79 2 -49 -76 -3 25 10 33 -24 -36
4716 -36 -62 -26 -107 -106 -11 41 136 -39 -27 93 4 121 -2 -53 10 13 48 91 78 16 -9 -21 90 -32 19 -120 15
4743 15 -25 -34 -22 -1 70 15 8 -26 -58 0 15 19 -85 48 47 -19 31 30 -6 -13 -63 121 -35 -154 -1 11 36 -16 9 25
4773 25 8 -23 -35 32 21 29 28 1 -61 36 18 -61 106 -8 66 -22 -72 -38 -40 -5 -18 74 36 -75 144 110 2 -53 -51 10
4803 10 -52 56 -90 -5 -51 47 -67 -24 2 -13 -107 32 46 -100 -28 0 48 15 -29 53 59 57 74 -44 -20 -87 -13 55
4831 55 -87 -38 17 59 -6 15 -66 -43 45 -130 -36 -58 -108 -20 -9 1 89 4 -6 16 -31 33 -8 38 -38 -24 3 -9 15
4860 15 -6 4 2 -34 -42 9 96 59 -46 -9 69 73 28 41 -38 103 67 -136 7 20 -21 -120 -32 13 -59 12 -36 122 -19
4889 -19 -22 -61 28 -76 -33 79 -27 129 -28 -36 -32 34 46 -23 -23 -94 41 44 -36 -3 -4 15 25 32 -11 -24 -86 23 39 7
$$ packed form
4688a1J9M3pl1l7J03m8j7l8M6l8J37j34q1L0m9J19l7J10p7n1k7P3K8j5K3n7j2
4716c6k6L6q1JR5N2R5j75J2J20q9J17j23n1O3LL5M3j3o2k5j2J11j22N1j39J35
4743A5m0rJ2K1P1n5pl4l2N8J5Mj04J33jo6N0jl6pn0J84j56j19J53J2K5n2K5J6
4773B5j7l1j2O7j1Qjk7o2R7j8p9J67j14P4q8n0L4kL5j3R2l8j11K19l4j08n5KO1
4803A0o2J08j46Q5m6R8j14M3K6j5r4J39J4j46P2K8M8l3m4Q2OkJ7j18K4o7P4O8
4831E5j42M9N5M2o5K1q1K3Q8j75R4k2n0Q8J1J0Q8q5j0K2m7O4m1M6p6J4K7j2K4
4860A5k1J0kl6qN1Q7l7j05L7P8Mm5J3p9J41l6k03J43J3m1r9Q8M5p2P1m8J58j41
4889a9ll9Q9j04M3J12j06J56j57qMO6J2o9%p1J35Lq0L3jJ9J0Pm3j3o2J09J6l2
$$ plain form
4919 7 -54 -35 -127 86 -30 -35 72 -138 3 56 26 71 -33 -2 -32 -58 -7 -16 -2 -29 6 102 -43 -62 -58 -19 24 7 -16
4948 -16 -85 -3 -61 -4 1 -74 27 40 -17 47 10 0 73 45 23 -22 -99 36 21 -35 25 -10 -99 7 28 27 -71 5 -19 62
4978 62 4 30 37 -26 37 79 -55 4 48 6 57 32 46 -65 -38 71 142 53 -26 38 28 -78 42 21 -81 -22 -185
5005 -185 -24 39 5 -39 2 -46 -16 19 43 -121 -47 -4 -64 -65 29 52 -3 -54 -14 12 -73 10 4 9 -87 45 23 -7 -48 3
5035 3 32 -55 8 19 -6 14 3 24 -36 82 17 -1 -1 53 48 8 76 -28 61 -56 -21 39 -21 -8 48 -58 49 -71 -41
5064 -41 -97 -21 46 20 -25 -83 4 -97 143 -54 -41 -46 51 52 16 -97 13 70 128 -48 14 -55 5 90 -48 -10 -70 74
5092 74 84 -26 47 5 41 -87 32 37 36 -105 72 27 45 -74 -25 43 -43 28 -74 -52 33 -60 68 83 13 -19 73
5119 73 63 -5 -15 -59 -2 -35 -5 72 9 -11 -38 -13 -18 31 -22 -67 -9 -46 -61 20 -50 53 31 111 -88 8 -111 66 42
$$ packed form
4919Go1J9r2K13j16nJ07k10J41N3l0M5j04L1l0k6N1rJ4k7L5R6j45j9ML9M3j7k3
4948a6o9Q2n8N7Np5J01J3n7O4l7j0P3k8k2m5p7J35j5n6O0l5q9J06K1jr8P6k4Q1
4978F2n8K6Po3O3M2j34N9M4m2N1k5J4j11K7J09P1q9p9O4j0j06J20k1j02N9j63
5005a85J61O3l4m4M1m8L0L5K4j64P4M3o0jR4K3n5n1M0K6q5Q3oNr6J32k2l0m1N1
5035CK9q7O3J1k5K0j1K1o0J18o5j8%N4nm0O8j04Q9j17L5O0o0J3N6j06J07j20L0
5064d1n6P6O7k6m5n8Q7j01K40j97J3nR7Jl6j13J10N7N8j76O2o9O0Q5j38L8o0J44
5092G4J0j10P3m2L6j28J19Njj41J77m5J8j19M9O8q6P1j02K2Q5r3J28J5p0l2R2
5119G3j0o8j0m4N7l3L0P7o3k0k7K5nM9n3m5N8l7j5Q1p0J03k2Q0j99R6j19J77k4
$$ plain form
5148 42 -72 58 31 14 27 -82 15 23 -34 -21 -126 -8 8 28 72 19 11 17 -89 -39 17 61 -114 117 -51 -50 -12 24
5176 24 -60 50 11 73 -71 -76 -32 -74 19 -16 -7 45 56 108 -85 -98 105 -5 14 12 -59 -52 4 22 17 -78 -69 -5 5 -50 -47
5207 -47 70 -118 1 -75 -150 8 46 -86 -50 -7 -16 -25 61 46 -53 -48 28 36 6 -36 -11 38 -32 21 -40 9 24 28 -7 -7 18
5238 18 93 12 -94 -38 56 43 1 -21 -1 28 -30 -23 -16 -116 47 -137 -89 61 8 36 19 -115 -2 14 60 -74 -43
5265 -43 -10 -54 -35 -51 72 -68 -140 92 49 -74 8 21 2 -74 48 -42 29 105 78 -76 38 16 -38 70 -29 1
5291 1 -7 -109 9 79 -2 5 -94 16 -30 22 8 -16 -15 116 18 -16 -19 -55 -14 55 -75 -71 -12 -32 42 -47 -18 3 -26 1 -34
5322 -34 3 -66 53 48 4 -66 5 30 -12 12 -44 -27 33 -63 30 27 95 -53 32 66 -22 -83 -39 33 64 0 29 -2 -21 6
5352 6 79 40 -44 45 -50 24 -34 -46 -25 -17 52 -29 -2 -17 -4 -66 65 82 -57 43 -47 34 69 -8 -8 120 86 62 -29 11
$$ packed form
5148D2j14J30k7j7J3j09R7Qn7J3j05J18J6K0M4n3qOj06N0N6M4j75K31j68JL8L6
5176B4q4J10l9O2j44nM4m2R3l5RN2J1N2j93j3K03j10J9kp1PN6J8nr5RO4J0n5L
5207d7J17j88J19p6p5J58L8j32L6M3rrQ6j5r9NP6Ql0m2K5M9p0N3o1M9J5Ml5%K5
5238A8P5q1j06N6R4j3m2k2K0K9n8PPj00J63j84M8J50n3K8j7j34J13J6M6j34L1
5265d3L3m4J9j6J23j40p2K32m3j23Q2J3j9p6J22r0P1P6k7j54J14k2n4J08r9L0
5291Aqj02J18P0q1Pr9J10m6N2j4k4JJ31r8l4ll6M1O9j30MN9k0P4q9K9K1k9K7l5
5322c4L7o9J19nm4p0P1K5m2K4n6J7O0r6R3lO8j48Q5L4q8o1M4P2L1o4K9l1j9K7
5352FP3l9q4Q9r5P4n8j2K1QO9q1K7j5J3o2J31J7j39J00r0Q1L5p7%J28l4k4r1M0
$$ plain form
5382 11 -48 -48 -48 -41 -63 100 -10 21 -5 -16 61 -52 105 17 31 -48 -83 58 29 25 13 69 -21 -31 -18 25 30 68 7 -1 36
5413 36 -35 -79 55 51 63 75 105 41 -47 -33 -95 13 40 -94 -4 98 -17 -37 -89 -71 -5 52 5 -44 68 -15 -9 -57
5441 -57 21 61 16 26 59 52 -18 166 -53 -118 54 20 -71 -30 21 25 -10 -105 -45 -68 -9 24 -89 -25 51 29 4 -39 -97
5470 -97 78 -32 13 28 28 -12 -34 54 1 53 42 27 -48 -25 -74 42 -60 -25 74 -21 65 66 82 16 61 -63 -141 167
5498 167 64 -57 119 19 -46 66 -113 24 -22 -23 -59 -32 1 21 -41 -62 -57 -23 -27 -26 26 26 -16 -7 17 -56 47 -7 -48
5527 -48 47 28 -20 -56 -17 15 -34 42 -89 -55 -46 -2 -14 92 14 28 59 1 -12 -25 43 139 -69 97 1 -9 -23 -46 46
5556 46 -21 -105 -16 53 -54 -50 -15 -71 33 -61 -6 2 -4 -27 -17 -31 -34 62 -14 26 -50 -2 5 90 -23 29 -5 -4 1 -66 -74 18 -59
5589 -59 -17 -106 -86 -73 -5 7 -55 -34 88 46 2 -127 13 56 -64 -25 -3 -116 -29 19 -58 -19 -65 -108 -63 -1 31 -39
$$ packed form
5382A1n9%%Pk2J63j10L1k6j1P7j13J57q8J4p9l5J41k9mj2N6r0j0J3M3NL8o1qL7
5413C6p1m4J34mJ2J2L0o4q8J4o2J08K7j34R0J02j15k0n2J8O6N7m7m9J12q3Om8
5441e7P8M0m5J0L3pp0J84k19o5J72l4r1M1N1Ml5r5O0k3N9L3j13O4P6k2k5m3n8
5470i7J75j10M5J5%m0k2Q8n3N2j1j5p5K3m9J16j02L5R9r5Q6JJ6o6M5j24p8L08
5498A67j03j21J76j00o5J12j79J37m6jl6K7L3K0o2k1NL4mJN2%m2RK4p3J03n4m1
5527d8R5j9m8l6L9L2m9P6j31L4RM4j2J06p8J4L1n8j3j3O8R6k08J66r6j0j4k3R2
5556D6o7q4Q9O9j07ML5n6J04r4N5Qok3J0j4lR6p6M0p6M8PQ5j13N2l4JNo7qR2p7
5589e9M2q9K0J3O8J2o2K1J22m2m4j29J40M3j20L9K2j13Q7M8p7L9m6m3M5O2L2p0
$$ plain form
5617 -39 -82 -37 79 11 59 38 -20 8 -10 -28 46 -114 12 141 60 -60 57 43 -80 64 55 -110 60 -38 -44 6
5643 6 54 -27 6 -2 -17 13 -10 -17 63 90 -79 -61 -31 2 166 18 9 -47 0 -46 18 -57 23 0 -22 -10 83 -49 5 -107
5673 -107 10 -83 52 70 -6 6 48 -40 -3 4 -64 50 -12 43 -22 7 30 -4 22 78 9 58 1 3 3 38 -45 33 37 -39
5703 -39 12 7 24 -17 -111 29 -45 2 -22 -67 -38 27 -60 5 -26 24 20 41 18 -52 -8 62 108 -42 24 -50 -14 -80 -65 70
5733 70 72 -2 46 -61 -9 49 19 -38 -2 28 -25 -108 72 -54 91 79 40 3 17 21 16 17 -75 -43 -87 -30 100 75 -8 -96
5763 -96 39 -91 -13 -1 5 17 -57 -6 49 93 -11 57 39 -11 5 -23 -1 88 34 -46 -14 -31 17 37 -19 -85 15 12 -43
5792 -43 23 -1 115 -12 74 -19 -97 12 -31 -51 -78 11 -31 145 -24 -9 -2 -17 19 -15 -66 44 -41 8 31 -9 -55 -23
5820 -23 -51 -6 -24 102 -19 -45 -31 26 -23 11 0 8 21 60 44 -4 -72 -40 -21 -115 57 -11 -51 -19 85 -46 48 18
$$ packed form
5617c9m3M5J16o8M8k1n8K8j8j8P4j60J26J29q1j20J17j4j23J44rj65J70r8oN0
5643FM8q1L3qj5L0k3pQ0K7j69J8L0L3J64j48rn6M7m6O4p5Q0k3k2J2R3j32N4j12
5673a07J17r3J35J8p6J2M2q8L7Po8J14o2N5o5K9K3l4K6N6o9M9n7K%L5q3P8Mp6
5703c9N1nJ7m1r4J40p4M7k4m5K9O5q7O5l1N0mK1k3p0M4P0M6j50O6p4L6o6J5J35
5733G0Kp4M8j07N2N8l0n7L6L0n3q3J80j26J45j2l9l7J4MnJr2L2m4N7J30k5q3q8
5763i6J35j30P8J2OJ2p4N1N5M4j04O8j8n0J6k8K2Q9n4q0L2j7M8K0n6o6J00ln5
5792d3O6k4J16j27Q6r3p8J09m3k0k7Q9m2J76j69J5Pj5L6l4n1J10q5M9K3m0m6L2
5820b3k8M5j8J26j21k6J4N7m9L4j1QJ3L9j6m8o8L2J9r4J72o8m0L2J04j31R4l0
$$ plain form
5848 18 5 -106 -70 97 17 -88 -25 -26 -17 -67 -57 10 2 29 -69 30 6 -29 -19 -50 -40 26 56 69 -64 29 63 30 22 18 113
5879 113 47 -75 -108 -30 80 -35 60 10 -49 22 24 120 -63 47 13 7 -27 -75 19 -7 -49 -120 -1 -53 -32 59 -16 -128
5907 -128 -92 -18 88 60 -61 31 97 44 7 -59 -29 41 27 -83 40 32 -80 -30 97 -19 -77 37 70 -90 -52 89
5933 89 65 -30 -67 -46 -9 30 9 28 -14 -74 13 21 43 2 -44 27 -59 -106 42 -34 -81 -22 -40 41 27 -50 -39 75 -59
5962 -59 85 68 7 -16 -18 6 15 -22 17 -46 -78 8 -26 -51 -101 -19 -3 -27 31 -39 11 -36 9 -10 -62 31 -72 -21 -16 -73 -36
5993 -36 -79 -98 41 43 -19 -45 62 119 -4 135 76 -1 -20 15 105 -30 -36 10 33 -24 -65 58 5 -97 32 81 -56
6020 -56 -11 -128 32 56 69 41 34 58 39 5 1 -88 -32 20 -75 16 71 -64 -55 7 36 -67 -7 28 -38 -68 -118 -12 -16 -53
6050 -53 -20 -79 32 -64 5 -119 -49 -72 22 -50 31 -163 -34 -23 -79 56 -74 -54 -17 74 -21 -46 -105 -27 21 16 71 -15
$$ packed form
5848A8j3j11L6J67q0j05O3jRn0J0O7qK7r8R9k4l5J0l1J0O6L0J3j33R3L4l3qmR5
5879A13o6j22l3P8J10j15R5n0n9P1KR6j83J10l4ol4m8R4k6m2p1J19n2K1R1p5j12
5907a28L6P4J06k8j21R2O6n3l7o6L0P0j4j10J23qj12N0J27j16n8J14L3j60L8J41
5933H9k4r5l7K1L7L9k1J9m2o0Q7QK2m1m6P1q6m7J48p6m7N9j8Q1j4p7J1J14j34
5962e9J44j7o1k3kK4Rl7L9o3l2Q6l4k5n0Q2J6k4N8p0N0m7M5j9n2R3j03N1Nn7L7
5993c6m3j9J39Ko2k6J07N7j23J39n9p7j9L5R0j35oM6K3n7m1J23n3j02J29M9j37
6020e6M5j17J60K4J3k8pK4j9l4mq9N6N2r5R1N5j35RO2K9j03O0L5o6l0n0J06ml7
6050e3L3n9J11r6O9j24P0k3R4p2Q1j94J29J1n6J35j30K0L7R1r5k5n9P8M8nN5q6
$$ plain form
6078 -15 43 114 23 36 19 7 8 -54 45 132 -59 1 -9 -73 7 -105 42 71 6 -122 -75 25 -24 53 -46 18 20 45 -98
6107 -98 -66 -26 -118 5 -2 66 -33 -68 -102 114 32 43 -28 -22 42 -66 -28 -98 10 41 -46 -39 -52 -55 9 19 -69 20 -88 -94
6137 -94 -46 -28 -16 -117 -4 15 -102 -29 -7 -74 -72 -72 36 -14 -16 -45 22 44 56 -11 -42 -49 -7 47 -31 51 -3 -4 -58 -91 43
6168 43 67 -22 -38 -101 -8 63 -15 -69 44 -6 -11 -24 110 -126 -118 -23 -17 -18 -131 -31 7 31 3 2 -32 -84 -30 -49 22 -56
6198 -56 25 56 102 147 13 51 17 108 -57 16 9 -38 52 24 -53 -31 -53 -69 40 -29 -38 -40 44 -30 -17 -7 -22 -60 -114 -15
6228 -15 -3 -36 84 9 23 -78 -38 87 -40 -32 -28 16 -17 77 23 60 -23 -52 26 -52 -179 -28 11 64 -21 31 70 77 -53
6257 -53 -47 -1 79 -90 -106 25 38 124 -123 4 2 -84 88 -8 -36 51 58 -58 -85 -73 28 10 -100 -14 -1 -114 -103
6284 -103 -57 53 54 29 -42 59 15 18 7 -71 111 -71 -94 -76 46 92 -8 17 22 95 61 -84 -139 -70 -36 -6 14 63
$$ packed form
6078a5N8P1r1J3j7j2Jo2R9Q7j91O0j0o4Q0j12J47K9o5j28M7J00m9P7r9O4KK5j43
6107i8L2M0r2J23pO8r9l5l4K16q2J1p1OO4j08L8p0J08L1q7Pj3lO4J0q8Q9j08o
6137i4M8J8J2j01J13J9j17P3K2o7K%J08n0kk9O7K2J2o7l1pM2N4p8Q2n4jn4l3J34
6168D3K4q9j6o3R3P1p8n4J13n0nj3J34k36QR5Ojj13J00L8K4k8jl4n2N4j9P1p8
6198e6Q1L1M6M5j34L8l4R1j65P3pm7R0k8p7K2k2j6J09o9rkQ4p4J3J0j5l8n4R9
6228a5J2l3J20p5J4j01M0J25j27QMM4l3R4n4L7q3k9P8p8j27J51L9N3q5N2L9Pj30
6257e3OM6Q0j69j6J31J3Q6k47J27kq6J72r6k8Q7Pj16k7J2J01j8j10Q6J3j13J1
6284a03M6J10Jk5p1J01m4Lj1p8J82j82k3J8J22M6j00K5NP3l4j45n5O9L4L0K0M9
$$ plain form
6312 63 19 -24 -59 -32 -23 57 21 16 51 -24 20 -6 -53 22 -87 -12 -51 36 -28 51 -16 -26 23 29 28 6 -66 -146 61 -42 -25
6343 -25 -22 48 -114 13 -58 23 -3 -41 23 14 -128 33 -21 -37 58 -68 110 -47 -33 54 2 -5 39 28 5 26 17 -33 -21
6372 -21 79 43 -18 26 113 -33 47 -56 -107 -15 36 -33 -100 -36 -62 -39 42 -61 -91 36 -28 -73 -101 62 -13 10 -37
6399 -37 -23 -86 -103 150 -19 46 -33 19 -80 -10 -15 -49 55 -30 28 39 18 -18 24 -1 46 20 -36 -16 -24 -48 34 -8 -71 -81
6429 -81 104 73 41 36 49 56 -35 5 -37 22 14 -39 -74 -9 2 -1 -28 -40 43 -31 12 -39 20 -46 -8 -70 -75 -83 8 19 8 -56 36
6462 36 -41 -40 -50 -33 14 -69 1 18 -33 -30 22 52 0 -19 28 -28 18 -74 -65 -19 21 -43 57 45 14 68 24 -6 4 24 -10
6493 -10 35 55 -57 -144 73 -7 20 105 -18 48 26 -5 82 35 27 -47 -8 0 49 -38 83 -13 -15 -56 24 -59 22 10 -14 -43
6523 -43 49 8 -28 -86 -18 -21 83 -73 33 -74 108 10 -39 -7 -137 -24 -35 100 26 -51 9 -12 76 92 89 104 63
$$ packed form
6312F3m4m3l5K7RQ0l6nL5p5M4k6m7P5j09P5l9Q7o4P9o7j0M9Ojk2p2q0K07j03J7
6343b5LP0j62J27p1Q1k6l8O4rj42J61n4j6R5j26J78j57J4Q7n2pM4j1k3K1rn0J2
6372b1J00l6o1M4Q7j46Q0j03n1R2N1o9o7O4k6K3Q1j03l0J27o4m5k8J63p5K3m7
6399c7J4o3j7K53j69O5p9N2r9P0nl4J04q5N8J1k1l6M2k5M7k6n6K0qk4Q2m2o3j0
6429h1J85l1l2nJ3Pr1M0m2N9qn3l5O5J1lk7j2Q3p4M3n1N9o6L8o2nqR1J1j1o4R2
6462C6p7Jj0J7M7q3P0J7n1LN2L0n2j9M7n6M6r2RM6M0o4J00j2l1N4m4l0J0K0l4
6493a0M5K0j12q7K17q0K7Q5j23O6k2l1Q7m7qp4L9QM9q7J21r6km1Q0q3Q1j2k4k9
6523d3R2m1l6n8O8lJ04j56J06j07J82r8m9L2j30J13j1J35p4p7O0k1Q8J6lJ5m1
$$ plain form
6550 63 25 12 29 32 -25 30 -56 17 25 31 -6 -53 34 -10 48 46 -84 -65 1 -34 -33 60 11 -64 -6 -20 -62 82 -124 -65 -56 12
6582 12 -23 18 -66 -21 -15 -1 54 55 -25 -40 123 48 28 50 78 -24 28 24 24 -12 1 16 -5 -42 3 92 63 -5 -34 -18 -107
6613 -107 36 -16 -49 80 -148 -75 -8 47 146 -59 31 10 -9 1 -90 136 -59 36 -74 -99 9 27 -2 -109 34
6638 34 -61 23 33 -38 -24 -9 46 29 -15 -31 7 16 32 -11 -8 -1 -14 108 1 -1 -116 -1 25 74 -5 -3 13 22 84 45 -1
6669 -1 3 -32 -9 -41 -147 -45 47 -27 1 75 31 -14 -30 -64 -9 62 55 1 -5 5 65 6 20 62 -32 55 21 37 97 33 91
6700 91 -34 10 28 54 -20 52 -5 46 -60 1 53 18 -10 32 60 -8 19 3 -24 13 -23 -67 58 -15 21 88 48 106 8
6729 8 7 43 -33 -35 -13 18 14 7 -14 12 13 32 81 46 -39 -8 -16 -46 22 23 -2 -4 -75 -38 34 12 -15 92 56 -23 62 62 3 -19 -64
6764 -64 106 -59 58 -57 -24 25 -119 51 -95 21 -36 58 10 -18 64 -50 1 -61 9 14 -78 -71 96 49 -57 2
$$ packed form
6550F3l8j3J7Ln7N5q6P3QOl7m7Q7m4N8kj30J9O6l5JR3m9p5N8j4m2J44k06N9RO8
6582A2l5M1q4M5OJ4N5Jq0j5J63p5k0K2K8j02N2m%l6J3J5k1l7M5Q9k9o8k9J6q9
6613a07J43n2l3J29k28P3O7N5R9k05R0k1j9J0r1K26j95R5j10k5J08J8k9j07J43
6638C4r5Q4J0p1J4J5N5j7m4j6L8RJ6m3LPj3J22j07kj15J15K6M9p9KJ6RO2l9m6
6669aMl5K3l2j06J02R2p4K8P4m4m5j6l4N5P1pn4oJ0O0n9J4M2r4Q7l4J6O0o4N8
6700I1j25M4J8K6p4P2n7N1j06O1N2l5k8M2K8o8K7j6k7L7l6m4J25p3L6O7m0N8r8
6729HjL6p6kK2L1mpk1K6JJ9M9l5q5L1ql0O8Jk5kp1L7P2k2k7J07l6p9Q5%n9k2m5
6764f4J70j65J17j15L3M9j44J70j46J16n7R4m8k8Q2j14N1o2P0Nr2PJ67m7j06N9
$$ plain form
6790 2 -37 58 33 -15 -17 75 -75 21 -83 55 23 64 -82 41 -8 -4 25 31 46 45 13 75 -51 -51 60 5 46 -79 54
6819 54 -36 48 -5 -5 -80 -111 -6 2 -59 -43 -73 8 12 88 -62 3 62 -75 82 -38 -82 16 21 -80 128 -44 26 67
6847 67 9 -53 -71 -11 -80 96 -36 67 53 -32 75 -35 -54 1 34 57 -111 -9 21 -33 73 -33 -98 -52 -39 21
6873 21 -29 6 53 16 41 6 -39 50 -97 63 -33 55 -118 -20 73 15 48 -59 -101 10 36 64 -27 -51 12 -89 10
6900 10 -67 -5 -54 27 2 -92 77 17 -18 67 45 -33 58 11 -34 44 -116 92 -80 -44 28 -218 -64 -29 19 -101 37
6927 37 52 -76 -54 -61 151 -24 -10 -89 -112 -35 106 -65 -27 5 6 2 17 83 27 -45 -9 19 -1 43 -29 -86 -2 -148 -27
6956 -27 30 106 53 -73 14 -53 61 18 -25 7 -21 141 -70 2 127 -38 -91 33 -32 -126 -31 12 -4 12 -16 19 59
6983 59 4 -57 -56 -26 -3 -59 14 -27 10 32 0 -22 41 -17 -51 0 -35 21 -20 34 -31 -98 -35 -136 -19 105 91 33 -24
$$ packed form
6790Bl9R5k5m8kR2j50R6j04J38l2M1j46J23m9MK9OJ5jl2O2j26%J11n5M1j25J33
6819E4r0Q4n3%p5l1J05Qo1J6l0Q1MP6j50O5N9j37J57j20m4R8Nj01K08j72P0M1
6847F7n8o2j8O0o9J76j32J03j4q5J07j10j9N5L3K3j68J02L0n4J06j06o5M6J3O0
6873B1n0L5M7l7K5l5m5Q9j47J60r6Q8j73R8R3n8L3j07m2J11K6K8r1k4O3j01R9
6900A0p7O2m9Q1k5r4J69o0l5Q5k2p8R1m7m5P8j60K08j72L6P2k46J54L5M8j20J38
6927C7J5j28K2pK12j75J4p9k3P7J41j71L8L2JmJ5O6n6p2L6K8k0M4p2n7Q4j46J21
6956b7N7P6n3j26Q7o7J14m3m3L2k8J62k11P2J25j65n3J24o5r4R5M3j6J6k8L5M0
6983E9n5o1JL0K3n6P3m1L7K2l2k2O3n8l4N1l5N6m1N4o5o7O3j01J17J24j4n8n7
$$ plain form
7012 -24 27 -35 36 -13 -24 69 -28 23 -29 -26 -4 -9 -6 -82 7 -32 12 13 56 -4 40 70 -49 -42 74 41 -51 -42 17 60 -31 16
7044 16 59 -88 -57 53 3 35 15 16 -1 -16 -46 39 111 -23 -42 6 15 -101 -24 -44 -12 -19 16 -52 -96 11 12 7 -2 -36 -49
7075 -49 -49 -25 -4 37 -33 -18 23 103 14 -72 -95 -9 34 7 40 -24 -10 29 66 -23 51 7 13 68 50 4 97 43 4 42 -3
7106 -3 11 -75 -56 -91 65 -24 38 5 -10 10 -51 34 -60 -22 -107 -44 -47 -59 5 -30 -20 20 144 106 27 -41 6 -29 -22 -18 -24 97
7138 97 90 -45 -55 107 -37 79 -42 12 -171 13 33 31 5 32 -26 -1 -14 -10 -44 -12 -1 -37 -50 -52 -117 54 -68 -47
7166 -47 66 5 149 60 -20 -101 -68 -6 115 -77 -4 -109 29 73 35 -1 -14 -13 -88 15 -42 72 17 61 22 -7 -46
7193 -46 -50 9 64 20 -30 -8 -8 40 85 -62 41 -2 -8 22 -4 -19 -45 81 32 1 68 30 38 48 -9 28 -132 -10 47 23
7223 23 -8 68 -9 -69 -119 126 9 24 56 -27 -112 2 -78 80 89 -6 -54 72 52 42 -107 -82 -30 -35 -14 -20 -28 -46 -18
$$ packed form
7012b4N1o2P1m9j1R3r7N1n2LK2nLp6Q9l9M4JM3o0M4L0j19PJ16l3r2RN9M3r1M7
7044A6M3j47L1J10n0L2k0Jj7j5l0Q5P2j34j9M8Rj16P7k0L2pL5o8m4J07Jnrl4j3
7075d9%K4K1M1p0J5M1Q0q9q6k3Q6M3k7L3o4J4L9L7q9P4m4ON5j8m6R3n4l9L8m5
7106cJ4q6J9l5J56q9O2l3j5K0o1Q5r4L8q5O3lj2O4l5J0M0J24l8p9o8M7l5PMoJ21
7138I7pj35j0J62j44J16j21N4j83J84K0kk6K7n8K5j3Ml4L2J1l6j3ko5J71j22K1
7166d7J13o1J44q9q0q1L3O2J21j92P3j05J38M4l8l6j3Jp5J03n7J14n5M4l9k9l9
7193d6mN9N5m4n0K2%M8M5j47J03m3oL0k6j5k6J26m9l1O7l8QJ0n7L7j60J22N7k4
7223B3l1P6p7o0n0K45j17J5L2q3q5J14q0J58Rr5m8J26k0j0j49K5N2nK1oqj8K8
$$ plain form
7252 -18 8 -55 -37 50 36 -39 -34 86 78 -52 -88 -32 10 -5 -7 12 -64 -33 -13 -2 29 46 -9 -8 -59 -73 157 74 -6 -11 -122
7283 -122 85 45 53 0 61 162 -26 -3 -57 -12 47 -68 55 -91 23 -29 -66 40 16 22 32 60 51 -59 68 -14
7309 -14 -63 -82 -48 -25 -49 29 29 -104 -45 -8 -43 9 0 -10 -121 -60 45 -33 61 26 -58 -119 -14 36 -81 -42 44 -22 -45
7338 -45 -12 49 43 -12 73 58 11 -42 -20 12 92 -62 28 -65 -60 -24 93 -25 -58 101 28 -24 -41 -8 8 -47 32 -74 -108
7367 -108 -28 2 -48 -34 -104 5 8 6 -1 61 -68 -46 -21 -32 26 -57 35 96 19 22 57 -58 -52 -60 1 7 -18 3 54 -31 -25 82
7399 82 -32 -47 -41 -70 -117 13 -117 90 -38 133 96 35 -72 -7 -8 -30 36 -25 51 15 -65 37 24 -50 43 19 9
7426 9 -4 46 31 -24 -53 -38 105 53 -76 -2 -16 -18 -79 -37 -35 -78 -56 33 8 70 54 29 -61 -10 23 -51 -23 3 119 -13
7456 -13 -28 -11 5 -6 -28 60 -58 -17 27 32 72 -35 -157 -98 -6 53 -62 43 24 -61 -45 -6 49 -147 -16 52 -8
$$ packed form
7252a8K6o3J8Q7j4p5NJ20qj30l6N6M2j5kJ9p6L1K0J1L1J7n5Jn1j4K30q3q0nj11
7283a22K07m0Qn3O1J01j88K3n4M5N9j15J23j46J14n2l7J06k4OJ0K8rj10J27q2
7309a4m9j9L4K3k4P8%j33N9L7l5N2rj0j11O1J05p8R4l5q4o1J05N0j17L9Q6o6k3
7338d5L3O1on5Q5j5m7n3K2L2Q0j54R0r3NL6J17j18l3J59p3n2j7L3J6n5P9j06l4
7367a08Q0L0n0J4p0J09LkpO2j29K2K5j1N8q3R2O1p7LL5j15OqO1Ok5K1N1q5OJ07
7399H2j14j5Ok9m7J30j30K07j28J71l7o1j07O5jk2O6o1P6l6q0J02j3p4R3k4j0
7426Ij3N0j5n5k9J5J43n2j29P4j4ko1M2Km3K2Q9k5O2j6k5r0N1L3p4K8K6J16j32
7456a3j5J7J6j1k2Q8j18M1M4NM0j07j22N9R2N9j15J05j9q5J6L9N5j96J31O8o0
$$ plain form
7483 -8 15 -4 -11 -34 -72 60 -32 19 -29 -108 76 -63 -28 -124 -105 -107 -58 14 37 -45 23 25 -51 33 44 19 -77 -57 -42 -89 -43
7514 -43 131 34 35 54 -36 0 -49 -13 77 80 -3 -64 -44 -7 88 -18 -74 -51 112 -45 -6 40 -67 125 -80 4 105
7541 105 30 47 79 71 77 -47 -20 14 -17 -12 7 13 -26 -31 38 -7 -74 11 16 -35 -10 -58 -115 1 12 23 49 -33 -29 -73 -10 10
7573 10 -14 19 34 -36 -77 14 -67 72 -81 -108 -22 11 66 95 -18 48 16 33 -2 30 14 71 78 -15 -22 -14 -18 5 -60 63
7603 63 68 10 -45 71 -105 44 -68 -8 -46 -51 87 -39 42 -76 -8 39 -17 -38 74 15 3 20 -8 -27 31 41 4
7630 4 -24 55 49 11 42 -16 -16 -81 42 -46 -23 -112 -7 60 -24 28 -9 6 18 9 -22 -7 76 -3 -76 -33 60 8 104 -11 -17
7661 -17 32 -14 130 -4 6 67 -10 -111 -63 -62 100 -125 16 0 58 18 77 -9 -24 75 41 -12 18 50 2 75 -50
7688 -50 -49 6 44 -29 1 44 51 62 48 16 -72 18 2 -40 -30 41 64 -25 4 64 10 -116 -4 23 -80 41 -20 1 78
$$ packed form
7483hK3j9pk3l8J32r2N1m8p9J84j39L5r6J9kM9P2K3q2O8Kp6Q4J1k5r6K0J5m7M6
7514d3J74r7JJ9r0L6m9L6R0Lq3o1K0L7R5j06n6K3J63j57L9M6j07J92k05Q4J01
7541A05p5J7L2qOj24K7L4l1NJ9Ol9nO9m5o7Q5Nn1K5m8n7J16J1J1K6q2Mm4O3K0
7573A0k4L3J5p0m1R1q1J39j53k7Q6L3N5K9j13O6l2J7l5L2j6N7Pr3pQmK3o5J23
7603F3Nn8n5J16j76J49j12O0l8nJ38j26Q1j18O8M7n6k1J12n9j2J7k8j9N8J0l7
7630Dk8P9ol8L1n8%o5J23q8K3q9J05O7q4N2l7J5J2rl1J5Q3p9p3M3R3n2R6j15o
7661a7M9m6J44j34J0O1p7j01M8JJ62k25J41j6N8m0N9q6j5R9l4n3L0L2m8P3j25
7688e0JN5L8p3L0M3PJ1j4l2q8R0j6m2J0P1K3q9K9O0n4j26J12K7j03J21o1K1P7
$$ plain form
7717 78 64 17 -5 -29 -11 23 -1 21 74 -40 32 -99 -6 -34 48 16 31 -5 -99 -61 32 70 36 -54 11 -32 -44 101 28
7746 28 63 -68 -34 -35 -46 -90 -47 15 11 45 -37 32 -28 28 -6 24 -22 -20 11 31 27 50 -43 -8 -25 41 -105 25 94 25 19
7777 19 8 14 8 41 -34 -70 8 -24 -8 -3 35 3 -48 -24 4 -15 -8 18 -15 -5 108 -100 57 42 -64 18 -58 -73 38 -77
7807 -77 21 13 27 -65 -21 -57 -158 18 19 -32 -11 36 33 30 32 54 58 33 7 12 56 -32 54 -45 -11 39 -27 34 -55 91 -14 118
7839 118 69 36 0 93 42 26 43 -54 39 -18 -34 -8 1 -64 49 2 63 -9 22 -18 31 68 4 0 -7 -103 11 16 41 -118
7869 -118 -20 -15 -2 104 -68 -46 -34 -17 -5 -1 -18 9 -85 17 -4 -4 23 -53 47 -18 -9 81 25 -17 -19 26 -92 33 18
7898 18 25 38 57 28 -49 -57 14 -52 26 -51 -37 -46 -1 48 -43 40 -37 -3 13 -42 -47 103 29 55 56 -37 -30 -18 25 48 -17 -7 7
7931 7 -63 48 -22 -52 -106 -138 -85 24 56 -47 -14 -170 -10 -15 -13 -2 58 -58 -96 -18 -65 1 29 153 62 -4 -4 -33 181
$$ packed form
7717G8j4m7k2k4J8L4k4K2N3j14P2j31R3k8Q2l2J5l6r4L8R3L8l4r0O5m3j2J45p3
7746B8L5j31L4jj1m4M3O2mL4q2O9o0N6l4L0m6KL1K0mK3r3L5j7O6j46J30O9o9o
7777A9j1OoL3p5l6P8l2J6NL8l2n1K4K8j9PK6l3J0J13k08J57j5j06Q2p6j5J11j15
7807g7R8qJ4r2M4l6j01J76Jn1K1M7llKK2Mk5k6NM4q8Q6r9L4N0o6O1q9J46j05J32
7839A18m9l3l6R3n1j6J7r7R3n7j6K6Ro5J13m7O1p2L1m0M9L7o4mpr6J14NK5j59
7869a18R8NJ3J06j72K2J2J7J2Mj7K7r4J02k1%K7p6J00o5RR0n6m2kM5j18J25j5
7898A8PJ3J9k9p7qP1o6P8p7J4rM5M9r1Q3p7L4J6n5nJ50p4K6Jr3PJ2M3K3o5J0J4
7931Gp0J11p0l0n4l2N3J09L2j03L3j56J60nKJ1O0j16l8P8m7O6K8J24r1o6%k9K14
$$ plain form
7960 181 -5 70 -8 -32 16 72 -1 -56 91 58 -57 137 -2 -3 43 -41 89 -45 38 -47 46 53 96 -17 -87 20
7986 20 17 -34 17 -7 39 21 -13 -21 24 -20 -81 -90 -4 53 -43 61 28 4 20 39 -33 -45 59 41 -30 -23 -33 2 33 17 18 -39
8018 -39 -67 54 119 -29 82 38 -10 -114 -8 -8 97 7 -17 -101 -19 -28 -23 32 -33 109 -20 -84 16 39 -84 -35 -15
8045 -15 -33 -3 60 33 -57 10 8 41 30 86 10 112 73 44 48 -102 1 -64 -27 -44 2 59 -37 -52 -50 40 -115 58 36
8074 36 31 -34 -35 -33 -71 -62 8 4 38 -12 -33 -48 -114 23 -73 26 -11 80 49 14 86 -22 -16 47 -14 -27 57 60 -17 -14 -94 55 -53
8107 -53 94 -38 28 20 -30 27 24 -133 -52 -47 -120 10 103 12 61 -41 18 -19 25 40 30 60 17 -19 -48 -32 25 -126 47
8136 47 2 2 -139 -44 159 -27 -9 108 -56 -70 -32 -17 60 5 -63 -26 -22 3 -134 -10 -52 30 44 88 -54 -96 23
8163 23 17 22 -60 88 -34 57 30 -63 -22 85 -30 87 17 75 72 33 -52 63 -49 30 33 -69 -52 -8 -77 85 61 8
$$ packed form
7960A81j86P5p8k4M8N6p3n5J47l3j15J94j39jM6q4J30j34Q3q5R3PM3j13p0J07
7986B0ln1N1k4M6j8l4qM5m4o1rQ6N7r6J04l3k4J6J9p2j2J04j8p1Pj0L5L1j6Jn7
8018c9k8J21O5j48J11m4m8j04J06%J05r0k4q4Q2rNN5o5J42j29o4J00K3j23M9K0
8045a5j8L0O3k7r0O7kL3j1N6p6J02l9k9Mj50J03o5L7j7M6N7r6j5KR0j55J73k2
8074C6no5jKl8RP0mL4n0k1j5o6J37r6R9l7R1l1l5P2j08OO3o1j3Q4Lp7Lq0J49j08
8107e3J47j32O6qn0N7lj57Q1Np3J30R3r1M9j02N9l7M4J5j0L0m3l6k9J6N7j51J73
8136D7m5%j41R5K03j86J8J17j64j4L8J5P7n5o8L7MK5j37J24m2Q2J4M4j42m2J19
8163B3oNq2J48j22R1k7r3M1J07j15J17p0N8ll9q5J15j12P9Lj02J7M4o9J62k4n3
8191H
$$ Imaginary data points
##PAGE= N=2
##DATA TABLE= (X++(I..I)), XYDATA
$$ plain form
0 0 0 0 0 0 0 0 0 0 0 0 0 0 -8 8 -8 8 -16 16 -24 24 -32 40 -48 56 -64 72 -86 97 -113 131 -150 171 -195 221
34 221 -249 281 -316 354 -396 441 -492 547 -607 672 -744 823 -909 999 -1102 1217 -1339
51 -1339 1474 -1625 1792 -1979 2189 -2428 2700 -3017 3389 -3828 4366 -5037 5902 -7058 8699
66 8699 -11224 15626 -25489 94730 -135890 -255293 76685 46525 43442 110971 -51204 -174026
78 -174026 8330 75637 62451 64542 -68385 -156472 23486 119942 46331 -6807 -69005 -104560
90 -104560 38851 127996 22130 -68009 -52362 -25039 31768 73870 24792 -54511 -64396 -10610
102 -10610 56625 62118 -5966 -64654 -44047 20956 56093 28272 -23465 -46391 -22267 23433
114 23433 43103 16120 -23453 -39670 -16991 30644 44317 304 -37892 -27576 6388 31785
$$ packed form
0@%%%%%%%%%%%%qJ6j6J6k4L2m0M8n6P2q8J04j20J36j58J83k10K44k81L21l66M16
34B21m70N30n97O70p50Q37r33J039j154J279j416J567j732J908k101K319k556
51a339K813l099L417l771M168m617N128n717O406p217Q194r403J0939j2960J5757
66H699j9923K6850m1115J20219k30620j19403L31978l0160l083O7529j62175j22822
78a74026J82356O7307j3186K091j32927q8087J79958R6456p3611n3138o2198l5555
90a04560J43411Q9145j05866r0139J5647K7323N6807M2102m9078p9303r885N3786
102a0610O7235N493o8084n8688K0607O5003L5137k7821n1737k2926K4124M5700
114B3433J9670k6983l9573j6217K2679M7635J3673m4013l8196J0316L3964K5397
$$ plain form
126 31785 22977 -13609 -27502 -9393 6936 19226 19123 -9859 -28725 -8589 15341 21174 9111
139 9111 -18795 -25947 4708 23605 8952 -6986 -11934 -9505 2890 13515 9046 -3751 -13814
152 -13814 -10530 6898 17983 6270 -14081 -16201 3439 15608 5389 -6153 -6481 -4115 816
165 816 7380 5532 -1515 -7140 -8171 2736 14294 4289 -12270 -8753 4096 8122 3988 -4177
179 -4177 -6643 195 3228 598 2317 2105 -4732 -5929 1865 7842 4034 -6317 -8452 2400 8790
194 8790 1271 -5283 -2463 1348 1097 263 1074 1432 -1713 -4389 -253 5842 3710 -4443 -6221 1122
210 1122 6327 1855 -4247 -2923 1597 2200 -791 -736 2034 613 -3995 -1775 4749 3628 -3463 -4812
226 -4812 968 4581 1359 -3403 -1949 2204 1286 -1807 -709 1942 1019 -2384 -2567 1989 3995 -1015
$$ packed form
126C1785q808l6586j3893J8109J6329J2290j03k8982j8866K0136K3930N833j2063
139I111k7906p152L0655J8897j4653j5938m948K429J2395J0625m469j2797j0063
152a3814L284J7428J1085j1713k0351k120J9640J2169j0219j1542l28K366M931
165H16O564j848p047n625j031J0907J1558j0005j6559L517J2849M026m134q165
179d177k466O838L033k630J719k12o837j197P794N977l808j0351k135J0852O390
194H790p519o554K820L811k51q34Q11L58l145k676M136O095k132q153j778P343
210A122N205m472o102J324M520O03k991N5K770j421m608K220O524j121p091j349
226d812N780L613l222m762J454M153r18l093J098K651r23l403j83M556K006n010
$$ plain form
242 -1015 -4345 -266 3582 1306 -2379 -1768 1942 1812 -2271 -2000 2951 2582 -2893 -3255 1811 3408
258 3408 -337 -2894 -693 2321 1020 -1805 -912 1893 1222 -1996 -2255 1777 3504 -968 -3943 -209
274 -209 3208 1153 -2011 -1477 1130 1360 -1535 -1342 2595 1796 -3502 -2773 2909 3373 -1032 -3349 -1069
291 -1069 2297 2326 -1098 -2177 525 999 -1030 -425 1957 850 -2187 -2441 1381 3508 374 -3649
307 -3649 -2303 2661 2932 -1225 -2153 659 808 -996 -192 2007 850 -2226 -2523 1143 3632 624
323 624 -3412 -2305 1969 2689 -229 -1852 -721 538 107 -243 1048 1092 -1702 -2592 864 3740 896
340 896 -3480 -2697 2099 3330 -426 -2309 -373 678 91 -12 919 531 -1464 -1900 682 2995 916
357 916 -2648 -2430 1287 2943 450 -2063 -1315 769 889 -301 139 937 -738 -2292 146 3102 1147
$$ packed form
242a015l330M079L848k276l685O11L710j30m083K71M951l69n475l62N066J597
258C408l745k557K201L014j301k825Q93K805o71l218k59M032J727m472k975L734
274b09L417k055l164N34K607K30k895J93L937p99n298P29N682M64m405k317K280
291a069L366K9l424j079K702M74k029O05K382j107l037k54L822K127l134m023
307c649J346M964K71m157r28K812J49j804Q04K199j157l076k97L666K489l008
323F24m036J107M274P20k918j623J131J259m31l50J291M4k794q90L456K876k844
340H96m376P83M796J231l756j883J936J051n87j03R31l88j995m36K582K313k079
357I16l564K18L717J656k493k513P48K084J20j190M40P98j675j554K438K956j955
$$ plain form
374 1147 -2742 -2386 1311 2790 191 -1938 -1016 751 707 -67 173 283 -826 -1233 323 1800 843
391 843 -1735 -2207 688 2692 618 -2385 -1287 1273 1140 -434 -450 498 134 -990 -346 1604 998
408 998 -1562 -1696 861 1874 -75 -1464 -740 726 872 -195 -663 168 512 -482 -407 686 948 -678
426 -678 -1513 218 1672 412 -1634 -1008 1151 1180 -738 -996 501 488 -401 -358 520 392 -690 -643 339
445 339 945 -27 -1133 -546 803 1046 -512 -1272 4 1118 231 -907 -364 739 127 -744 -25 1015
463 1015 138 -1165 -486 1167 857 -874 -976 338 803 21 -431 -151 253 157 -57 -79 430 211 -628
482 -628 -589 608 1102 -243 -1190 -215 1089 715 -739 -827 232 413 -340 -17 732 -31 -942 -201 972
501 972 627 -522 -918 -69 789 470 -342 -616 46 387 89 -125 74 109 -422 -460 418 826 0 -1079
$$ packed form
374A147l889L56L697J479k599k129R22J767m4p74K40J10j109m07J556J477r57
391H43k578m72K895K004k074l003J098K560j33j574j6R48l64j124O44J950o06
408I98k560j34K557J013j949j389P24J466J46j067m68Q31L44r94P5J093K62j626
426f78q35J731J454j260k046O26K159K9j918k58J497j3q89M3Q78j28j082M7R82
445C39O06r72j106N87J349K43j558p60J276J114q87j138N43J103o12q71P19J040
463A015q77j303O79J653l10j731j02J314M65p82m52K80M04r6k14k2N09k19q39
482f28L9J197M94j345r47R75J304l74j454q8J059J81p53L23P49p63r11P41J173
501I72l45j149l96Q49Q58l19q12k74O62L41k98k14J99L5n31l8Q78M08q26j079
$$ plain form
521 -1079 -423 845 723 -607 -496 276 217 -245 8 441 -208 -563 -207 340 638 -151 -780 -346 466 665
541 665 -102 -565 -214 250 346 -185 -16 160 -164 -403 292 862 -122 -849 -239 704 394 -367 -375 53 100 145
563 145 -82 107 -40 -292 -121 204 219 28 -309 -378 44 502 252 -486 -266 270 166 -286 52 226 -130
584 -130 -565 142 521 -7 -463 -206 402 388 -107 -199 82 30 45 167 76 -186 -141 172 98 55 281 -139 -297
607 -297 -77 406 4 -421 -82 239 -24 -253 55 365 -55 -269 -93 210 194 -206 -181 40 88 26 131 -68
629 -68 -249 101 214 -77 -102 199 -82 -106 124 245 -74 -318 25 283 91 -276 -116 258 40 -164 47
650 47 173 -120 -132 166 -34 -155 -74 140 58 -134 1 71 -108 -111 186 2 -225 9 187 47 -155 14 423
673 423 199 -328 -19 162 81 -195 -56 139 -91 -168 222 206 -243 -20 253 32 -108 134 93 -83 -60 -6
$$ packed form
521a079O56J268j22j330J11P72n9m62K53M33o49l55L56N47K98p89o29M34Q12J99
541F65p67m63L51M64R6n31J69J76l24k39O95N70r84p27O10R43l10p61qM28M7M5
563A45k27J89j47k52J71L25J5j91l37o9M22M58k50p38K20N36j04m52L38J74l56
584a30m35P07L79n28m56K57O08j4m95r2K81n2J5J22r1k62M5L13p4m3K26m20j58
607b97K20M83m02m25L39L21k63k29L08L10m20k14J76L03j6m00K5K21M8o2J05j99
629f8j81L50J13k91k5L01k81k4K30J21l19k44L43K58j92l67J60L74k18k04K11
650D7J26k93j2K98k00j21Q1K14q2j92J35P0j79lK97j84k27K34J78j40k02J69M09
673D23k24n27L09J81q1k76J39J95k30p7L90j6m49K23K73k21j40K42m1j76K3N4
$$ plain form
695 -6 28 -156 15 221 79 -133 -116 214 -24 -198 -43 163 -93 -98 27 81 -183 -75 98 14 -219 0 126
718 126 107 -126 -103 7 -145 51 163 19 -242 -53 257 96 -96 -174 176 34 -55 -23 -1 -134 -113 191 7
741 7 -227 -74 160 80 -104 -61 191 98 16 24 22 -37 -90 174 43 -166 -80 162 68 -255 -51 182 -12 -140 -12
766 -12 60 59 -21 185 98 -217 -178 242 -1 -237 -50 18 -37 -87 75 -17 -14 -86 140 204 -160 -110 108 179 -169 -53
792 -53 -2 -46 -197 108 106 -255 -205 160 195 -102 -86 72 72 -85 -10 118 -27 -104 -3 88 -50 -163 182 222 -192
817 -192 -57 95 72 -149 68 109 -65 -151 12 142 -152 -181 138 101 -218 -149 37 37 -34 -50 68 6 -156 80
841 80 76 -128 -154 127 49 -177 -171 43 27 -122 59 63 -23 -62 76 92 -239 -97 102 96 -46 -198 117 94 -110 34
867 34 111 -87 -12 147 140 -32 -180 193 93 -57 10 31 -99 -121 182 191 -224 -106 80 229 9 -165 96 127
$$ packed form
695fL4j84J71K06j42k12J7L30k38j74J55K06k56nJ25N4k64J08J73q4k33K19J26
718A26j9k33K3J10j52J96J12j44k61J89L10j61j92p8L50j42q9L2K2j33K1L04j84
741Gk34J53K34q0j84M3K52r3q2Qkn9n3K64j31k09Q6K42r4l23K04K33j94j28J28
766a2P2jq0K06q7l15L9M20k43k36J87O8n5n0J62r2Lp2K26O4l64N0K18P1l48J16
792e3N1m4j51L05kl61N0L65L5k97J6J58%j57P5J28j45p7J01R1j38j13L45M0m14
817a92J35J52k3k21K17M1j74q6J63J30k94k9L19l7l19O9J86%p1j6J18o2j62K36
841H0mk04k6K81p8k26OK14j6j49J81Mq6l9J38J6l31J42J99oj42j52L15k3k04J44
867C4P7j98P5J59pj72j48L73j00j50O7K1j30k2L03Rm15J18J86J49k20j74K61L1
$$ plain form
891 127 -127 -99 98 112 -92 -38 128 -25 -62 66 20 -214 -172 118 9 -157 -69 61 -141 -56 123 35 -151
914 -151 -151 160 117 -25 -304 54 201 22 -112 -16 -14 -65 106 142 -92 -167 67 56 -8 5 115 -101 -29 109 78
939 78 18 -99 164 161 6 -304 2 21 -4 -118 -23 115 -172 -138 94 -22 -129 20 146 -82 -68 3 113 -56
963 -56 -144 -2 -96 -21 141 104 -119 -225 140 230 30 -245 97 201 -45 -245 95 53 -129 -59 112 39 -277
986 -277 47 65 61 -114 -48 -22 -37 -46 57 26 -168 -28 63 -81 -146 -86 124 -30 -164 56 176 -25 -54 89 36
1011 36 10 -24 70 42 -103 -10 115 121 -34 -11 60 28 2 67 30 -143 129 100 -49 -244 62 187 -94 -222 14
1036 14 101 -28 -87 85 20 -84 -125 67 153 -141 18 64 126 -70 72 24 -61 114 29 -48 -183 56 138 -24
1060 -24 -140 128 264 -135 -128 114 66 -107 -1 67 -27 -103 -101 81 32 -223 -57 38 2 -26 31 102 -154 -43 111
$$ packed form
891A27k54K8J97J4k04N4J66j53l7J28m6k34M2K90j09j66Q8J30k02Q5J79q8j86
914a51%L11m3j42k79L58J47j79j34R6Kn1J71L6k34p5K34j1o4J3J10k16P2J38l1
939G8o0j17K63lj55l10L06J9k5j14R5J38k87L4K32j16j07J49J26k28J4P1J10j69
963e6q8J42r4P5J62l7k23j06L65R0k00k75L42J04k46k00L40m2j82P0J71p3l16
986b77L24J8mj75O6K6j5rJ03l1j94J40R1j44o5O0K10j54j34K20J20k01k9J43n3
1011C6k6l4R4k8j45R3J25Oj55K3P1l2k6O5l7j73K72k9j49j95L06J25k81j28K36
1036A4Q7j29n9J72o5j04m1J92Q6k94J59M6O2j96J42m8q5J75q5p7j35K39Q2j62
1060b4j16K68J36l99PK42m8j73J06O8r4p6KJ82m9k55J66R5l6k8N7P1k56J11J54
$$ plain form
1085 111 -22 -139 -13 149 76 -214 72 126 -125 -192 40 66 -57 -10 91 120 -132 -108 51 43 -139 -69 91
1108 91 -13 -71 -30 -40 -62 -22 143 -63 -102 -62 121 68 -124 -23 82 37 46 27 26 -59 -191 95 69 -139 -148 115
1134 115 -75 -97 -36 143 -81 -16 136 -4 -158 29 15 93 -134 6 102 -45 -38 60 -22 -142 -133 82 74 -120 0
1159 0 151 130 -244 17 42 121 -37 5 11 -45 -44 59 81 -116 -40 165 45 -80 34 40 -39 -166 -2 51 -105 -121
1185 -121 98 80 -74 -89 142 84 -66 -69 93 99 -39 -8 133 -166 -31 15 50 -45 -14 -40 -15 14 -25 62 -3 -34
1211 -34 55 210 -93 -28 142 95 -86 -78 145 137 -174 -72 -2 61 -58 -3 14 -118 -31 185 70 -38 -1 152 101
1236 101 -4 -125 133 -91 -103 123 88 -159 -76 177 82 -145 -136 74 -27 -33 16 129 -236 93 17 109 -93 -38
1260 -38 96 116 -54 -31 82 9 -74 -85 108 -86 -121 43 80 -134 -168 -35 108 -83 -114 -8 18 -81 6 80 -3
$$ packed form
1085A11j33j17J26J62p3k90K86N4k51o7K32K6j23M7J01K9k52K4J59qj82P0J60
1108I1j04n8M1j0k2M0J65k06l9M0J83n3j92J01J05m5Rj9jq5j32K86k6k08rK63
1134A15j90k2O1J79k24O5J52j40j54J87j4P8k27J40R6j47PR8q2j20RK15qj94J20
1159@J51k1l74K61K5P9j58M2On6JJ03K2j97P6K05j20j25J14Op9j27J64N3j56j6
1185a21K19j8j54j5K31n8j50lJ62Oj38L1J41k99J35M6L5r5L1k6K5K9l9Q7o5l1
1211c4Q9J55l03O5J70m7j81QK23ql11J02P0O3j19N5J7j32Q7K16j15j08L7J53n1
1236A01j05j21K58k24j2K26l5k47Q3K53r5k27RK10j01oM9J13l65L29p6R2k02N5
1260c8J34K0j70K3J13p3q3j1J93j94l5J64L7k14l4J33J43j91l1J06K6r9Q7P4q3
$$ plain form
1285 -3 -52 60 105 -60 -67 36 157 -142 -34 76 -44 -46 -103 198 -135 -44 95 150 -109 -69 70 113 -88 -59 -32
1310 -32 19 -51 -15 105 -23 -91 81 136 -53 -24 85 95 -31 -65 -19 23 -148 42 51 -37 -135 8 144 -82 -70
1335 -70 8 101 -25 1 20 39 -113 33 82 -1 -49 109 234 -61 -96 55 2 -81 21 163 71 -150 145 78 -50
1360 -50 -170 202 116 -6 -71 191 110 -7 -43 1 -19 -58 -38 28 -55 9 51 38 29 -144 -30 32 32 -76 39 -85
1386 -85 -57 -3 26 -27 -20 61 161 -80 -34 17 -4 -60 -1 4 -62 -123 13 160 -26 -30 -15 21 21 -58 14 -35 2 -26 119
1415 119 63 -57 -125 13 8 -67 85 -14 24 -37 36 109 37 -9 63 38 -159 -11 100 78 -56 -9 57 -46 -92 -17
1441 -17 -38 -36 -62 6 25 -54 4 59 12 -188 30 65 -81 36 43 33 -55 -38 77 19 -87 -184 114 10 -102 36
1467 36 42 10 -19 31 72 -93 92 106 21 -100 107 60 46 -6 27 61 -1 72 79 -11 -55 -20 115 127 -122 -45 20 34
$$ packed form
1285cm9J12M5j65pJ03J21k99J08J10j20kn7L01l33R1J39N5k59M0J39M3k01K9K7
1310c2N1p0L6J20j28o8J72N5j89K9J09J0j26l4M6M2j71J90Rq8r8J43J36k26J2
1335g0P8R3j26K6J9J9j52J46M9q3m8J58J25k95l5J51n3q3J02J42r2k21K95o7j28
1360e0j20L72q6j22o5K62q1j17l6M4k0l9K0O6q3O4M2j3rj73J14O2%j08J15j24
1386h5K8N4K9n3PQ1J00k41M6N1k1n6N9No6o1J36J47j86mJ5L6%p9P2m9L7k8J45
1415A19n6j20o8J38np5J52r9L8o1P3P3p2m6P2k5j97J48J11k2j34M7O6j03m6P5
1441a7k1Kk6O8J9p9N8N5m7k00K18L5j46J17Pj0q8J7J15n8j06r7K98j04j12J38
1467C6Ol2k9N0M1j65J85J4q5j21K07m7j4n2L3L4o2P3Pr0m4L5J35J2k49P7O5J4
$$ plain form
1495 34 14 -56 85 -38 -30 53 -40 -34 11 86 59 -15 -71 68 -42 -102 180 -55 -36 -5 59 106 -111 29 117 101 -157
1522 -157 -5 79 99 -135 63 86 8 46 0 62 22 -39 -35 28 -77 -34 89 -66 -118 59 -113 -101 -89 184 -10
1547 -10 -30 -143 173 14 -139 -42 58 47 -86 -13 64 -31 -99 -60 45 -24 16 22 -86 31 45 8 -6 42 99 33
1573 33 -169 -66 116 37 -80 -47 215 72 -78 32 145 14 -106 12 179 -63 -21 39 41 -107 26 -105
1595 -105 31 23 41 -15 -157 70 134 -5 -84 -97 18 117 -182 -18 81 -109 -153 26 116 -15 -188 20 48 99
1619 99 -156 -86 3 -5 -50 -18 -21 -37 27 -78 -118 16 183 30 -45 -86 117 53 -192 14 175 -44 -224 -76 169
1644 169 35 -126 -42 142 25 -9 -45 -41 51 -45 37 -48 53 24 -142 -71 31 97 -20 -45 -45 129 -13 -217 -19
1669 -19 54 55 -117 43 139 37 -168 -57 152 -25 -126 -16 118 66 26 -150 -52 104 59 23 -113 0 72 54
$$ packed form
1495C4k0p0J41j23QQ3r3OM5P5k7p4n6J39j10o0K82k35J9L1O4M7k17J40Q8j6k58
1522a57J52Q4K0k34J98K3p8L8m6O2m0o1MO3j05M3J23j55n2J77j72J2J2K73j94
1547a0k0j13L16j59j53R7J00j1j33P3P7r5o8L9J05o9M0Oj08J17J4l7j4M8N7o6
1573C3k02J03J82p9j17L3K62j43j50J10J13j31j20J18J67k42M2O0Kj48J33j31
1595a05J36qJ8n6j42K27O4j39p9j3J15R9k99J64R9j90m4J79R0j31j73K08K8N1
1619I9k55P0Q9qm5L2lj6O4j05m0J34J67j53p5m1K03o4k45K06J61k19j80J48K45
1644A69j34j61Q4J84j17l4l6MR2r6Q2q5J01k9j66P1J02O6j17k5%J74j42k04J98
1669a9P3Jj72J60R6j02k05J11K09j77j01J10J34n2m0j76R8J56m5l6j36J13P2j8
$$ plain form
1693 54 -58 59 139 -66 -195 -4 145 -78 -179 -75 194 9 -111 -25 125 36 -141 -74 28 148 -69 -117
1715 -117 86 41 62 -75 -97 68 83 -117 -200 -30 183 -32 -188 100 125 -156 -171 24 86 39 -151 -38 66
1738 66 -26 -12 -119 4 187 -38 -120 -50 48 20 -65 -179 190 78 -133 -172 41 135 -92 -219 80 175 -33 -162
1762 -162 66 140 28 -197 -36 57 124 -124 -31 161 77 -42 -39 -22 114 18 -84 -48 62 89 -180 -141 14 94
1786 94 -144 -218 16 187 27 -188 86 261 -66 -157 -121 219 -30 -182 -75 151 147 -67 -132 -24 152 62 -87
1809 -87 55 159 -31 -45 -157 128 108 -51 -101 64 292 4 -124 51 170 52 -252 -31 233 27 -130
1830 -130 -121 61 101 -121 -77 -34 135 -16 -234 -35 105 87 -218 -42 53 202 -115 -276 80 223 -1 -224
1852 -224 -36 196 53 -224 -48 82 67 -92 61 32 127 -135 -67 187 243 -71 -82 -12 132 34 -230 -80 85
$$ packed form
1693E4j12J17Q0k05j29J91J49k23j01J04K69j85j20Q6J50q9j77O7J02J20k17m8
1715a17K03m5K1j37k2J65J5k00q3J70K13k15j56K88K5k81j5J95O2m7j90J13J04
1738F6r2J4j07J23J83k25q2P0R8k8q5j14L69j12k11l9K13R4k27j27K99R5k08j29
1762a62K28P4j12k25J61R3O7k48R3J92q4j19LJ7J36r6j02L6J10K7k69L9J55Q0
1786I4k38p4K34J71j60k15K74J75l27r1L6L40k49j52J07K26mk14o5J08J76r0j49
1809h7J42J04j90j4j12K85k0j59n0J65K28k88j28J75J19j18l04K21K64k06j57
1830a30RJ82M0k22M4M3J69j51k18J99J40j8l05J76R5J49l17j61L56J43k24k23
1852b24J88K32j43k77J76J30j5j59J53k9R5k62O8K54N6l14j1P0J44r8k64J50J65
$$ plain form
1875 85 228 -185 -181 82 260 -41 -309 96 221 97 -187 16 234 88 -111 -134 132 33 -69 -141 2 101
1897 101 -38 -106 -19 251 76 -157 -117 151 173 -147 -299 88 266 -96 -201 66 226 -76 -254 145 101 -37
1919 -37 -212 -70 271 49 -148 -174 46 202 -61 -251 -23 104 -62 -187 -136 154 230 -220 -219 71 149 -114
1941 -114 -175 36 157 -86 -149 47 16 150 -112 7 177 74 0 -62 173 74 -19 -160 -41 191 22 -149
1963 -149 -91 90 204 -105 -62 107 147 -72 -260 144 75 -108 -142 60 223 -85 -85 -9 131 110 -108 -146 199
1986 199 89 -50 -218 -105 121 128 -111 -136 192 105 -113 -109 121 189 -133 -218 94 246 -139 -167 109 264 48
2009 48 -202 33 176 177 -202 -10 109 86 -113 -131 7 48 55 -119 -67 132 112 -80 -172 73 94 -124 -143 96
2033 96 137 -125 -108 18 154 45 -185 -61 170 99 -121 -109 28 58 -32 -19 27 139 119 -172 -48 78 131 -156
$$ packed form
1875H5J43m13MK63J78l01k68M05J25j24k84K03K18j46j99k3K66r9j02p2J43R9
1897A01j39o8Q7K70j75k33M0K68K2l20j52L87J78l62j05K67J60l02j78L99m4j38
1919c7j75J42L41k22j97k6K20J56k63j90K28J27j66j25N1K90P6m50JK90P8k63
1941a14o1K11J21k43o3J96l1J34k62J19J70j03p4o2K35r9r3j41J19K32j69j71
1963a49N8J81J14l09M3J69M0k19j88M04o9j83l4K02J63l08%P6J40k1k18l8L45
1986A99j10j39j68J13K26Pk39k5L28q7k18MK30O8l22q5L12J52l85k8K76J55k16
2009D8k50K35J43Jl79J92J19k3j99j8J38M1Pj74N2J99k0j92r2K45K1k18j9K39
2033I6M1k62J7J26J36j09k30J24K31p1k20J2J37L0r0J3M6J12k0k91J24J26N3k87
$$ plain form
2057 -156 -144 184 201 -101 -161 163 133 -97 -161 69 201 -60 -140 30 127 155 -43 -19 53 64 -87 -125 115 92
2081 92 -16 -122 -46 162 75 -144 -128 157 59 -98 -269 61 213 -120 -165 7 109 18 -160 6 166 -5
2103 -5 -179 -101 71 78 -20 -16 47 220 -39 -129 -13 82 95 -79 -132 49 0 -114 -105 8 190 -88 -228 23 179
2128 179 -48 -247 -67 99 -17 -147 -72 78 32 -72 -59 52 58 21 -136 -1 91 35 -125 7 62 96 -46
2151 -46 -111 157 194 -59 -164 -2 36 -126 -29 -6 104 -2 -111 -162 34 103 -105 -83 -69 65 -106 -205 -53 154
2175 154 -5 -73 -71 146 48 -181 -111 41 96 -78 -22 80 147 -58 -101 9 15 -11 -90 -15 84 33 -52 -33 66 115 85
2202 85 -78 -2 67 58 -11 -41 134 113 14 -52 28 127 -80 -62 49 106 -81 -93 -5 69 27 -93 44 74 -3 -101 -24
2229 -24 48 60 -65 -43 36 114 -84 -149 -67 151 68 -106 -65 15 -9 -55 -155 -45 113 -22 -72 -31 108 -119 -100
$$ packed form
2057a56J2L28J7l02o0L24l0k30o4K30J32k61q0J70R7K8j98K4P2J1j51l8K40k3
2081I2j08j06P6K08q7k19J6K85r8j57j71L30J52l33m5J72J02r1j78J66J60j71
2103ej74P8J72Pr8MO3J73k59r0J16R5J3j74n3J81m9j14RJ13J82k78j40K51J56
2128A79k27j99J80J66j16j30P5J50m6j04J3J11Ol7j57J35R2n6j60J32N5L4j42
2151d6o5K68L7k53j05J62L8j62R7K3J10j06j09n1J96O9k08K2J4J34j71r9J52K07
2175A54j59o8KK17r8k29P0J52N5j74N6J02O7k05m3J10Ok6p9P5R9n1q5J9R9M9l0
2202H5j63P6O9ro9l0J75k1r9o6Q0R9k07J8J11N7j87j2Q8P4m2j20J37L0p7r8P7
2229b4P2J2j25K2P9P8j98o5Q2K18q3j74M1Q0k4m6j00J10J58j35n0M1J39k27J9
$$ plain form
2254 -100 -27 68 63 -43 -15 -62 110 -41 -126 -46 -49 -19 -25 -110 159 70 -61 -159 -5 127 -82 -31 71 119 -151 -20
2280 -20 77 98 -38 -100 52 79 97 -66 -19 -18 78 19 -69 -83 67 15 -45 43 88 -11 -44 -65 58 84 -104 -91 5 38
2308 38 -69 -46 56 106 -25 -178 -79 15 102 59 -59 83 -19 88 -25 5 66 -31 -45 25 78 149 23 -34 65
2333 65 44 -115 22 123 98 14 55 26 -6 -16 63 24 58 17 -77 17 40 79 42 29 -59 27 -80 -82 -52 61 4 -122
2361 -122 -67 40 19 -112 50 121 22 -174 -117 40 -27 -62 -31 65 51 -17 42 38 -88 49 -79 -16 -23 26 9 -55 -26
2388 -26 91 164 50 -92 -104 -77 -88 -33 197 9 -53 31 38 -52 23 -73 52 -37 29 -7 49 17 -14 -86 -17 36 -74
2415 -74 -93 -57 -3 -29 3 -102 59 -46 56 67 -113 -83 61 18 1 8 13 -141 16 35 80 -56 59 -30 -72 69
2441 69 -28 -25 -73 50 -24 -11 -76 -30 -35 -106 -109 8 135 -22 -34 1 68 -118 109 -79 8 39 28 45 -4 -15 -57 74
$$ packed form
2254a00P3R5nj06K8m7J72j51q5Q0lL0oq5K69q9j31r8J54J32k09N1J02M8k70J31
2280b0R7K1j36o2J52K7J8j63M7JR6n9q8j4J50n2o0Q8M5r9l3k1J23K6j88J3R6L3
2308C8j07K3J02N0j31j53R9R4Q7m3j18J42j02J07j13L0O1r7j4P0N3P1j26n7R9
2333F5k1j59J37J01k5q4M1k9l2j0P9l9L4m1r4R4K3L9l7j3q8Q6j07kL0J13n7j26
2361a22N5J07k1j31J62P1r9j96N7J57o7l5L1R6j4o8N9mj26J37j28O3pM9j7o4K9
2388b6J17P3j14j42j2K7j1N5K30j88o2Q4Pr0P5r6J25q9O6l6N6l2l1p2O9N3j10
2415g4j9L6N4k6L2j05J61j05J02J1j80L0J44m3j7PNj54J57J9M5j36J15q9m2J41
2441F9r7Lm8J23p4J3o5M6np1lJ17J27j57j2L5O7j86K27j88Q7L1j1J7m9j1m2J31
$$ plain form
2469 74 15 -64 40 -91 9 -98 62 -24 12 9 19 84 -63 7 -51 28 -66 52 50 -64 15 81 70 -5 49 77 11
2496 11 -42 16 22 37 -31 39 -70 -53 1 116 -62 -76 19 69 -36 45 -24 66 -38 4 55 -15 34 -92 83 -37 -48
2523 -48 -61 18 -47 -17 60 36 -54 90 -48 2 1 -48 -20 30 -36 -2 -3 53 -13 32 41 -71 -39 -31 -25 -78 36 88 0 -98 28
2554 28 139 128 -12 10 16 -26 46 -23 -71 -70 -33 -49 70 -12 12 66 78 -44 85 -42 -14 -42 161 17 -43 -21 7
2581 7 45 -42 -84 54 -20 -74 3 80 -76 -67 58 86 31 146 40 61 -135 -63 -19 -65 -16 5 -20 -23 85 1 52 41
2609 41 -28 50 0 -11 -29 2 134 -15 4 15 -67 -58 -29 75 20 22 40 37 4 -8 51 -14 92 -62 63 -65 8 89
2637 89 27 4 61 -19 -124 -71 5 -6 -3 -89 -48 33 26 -117 29 -20 -55 36 45 -65 -56 80 26 24 -77 40 -2 -86 66
2666 66 60 33 -2 -11 81 -55 6 89 69 -67 8 96 12 -24 1 -4 -110 46 -49 56 41 40 -17 -73 -9 -43 -2 35 77 23
$$ packed form
2469G4n9p9J04j31J00j07J60q6L6lJ0O5j47P0n8P9r4J18kj14P9O6j1p5N4K8o6
2496A1n3N8OJ5o8P0j09J7N4J15j78j4R5N0j05Q1o9R0j04M2N1p0M9j26J75j20j1
2523d8j3P9o5L0P7k4r0J44j38N0jm9K8N0o6L4jN6o6M5Rj12L2QOn3J14N2q8r8J26
2554B8J11j1j40K2Om2P2o9m8JL7j6J19q2K4N4J2j22J29j27K8k8K03j44o0K2K8
2581GL8q7m2J38p4n4P7P7j56RJ25K8n5J15j06K1j96P2M4m6M9K1k5lJ08q4N1j1
2609D1o9P8n0j1j8L1J32j49J9J1q2RK9J04n5KJ8ll3j2N9o5J06j54J25j28P3Q1
2637H9o2k3N7q0j05N3P6j1Lq6M1Q1pj43J46m9l5R1Rj10RJ36n4kj01J17m2q4J52
2666F6ok7l5rR2j36O1Q3k0j36P5Q8q4l6K5nj06J56r5J05j5jn7n6O4l4M1L7M2n4
$$ plain form
2696 23 -20 -24 -29 -18 12 -61 107 -4 -58 -36 -13 -2 42 77 35 -29 21 -47 72 143 81 -55 23 90 -113 -53 -5 -56 -1
2725 -1 -21 130 17 -23 -94 5 53 6 63 -68 -82 68 -17 0 -21 -46 44 24 -23 -49 36 16 -22 54 -8 -92 -29 112
2753 112 53 6 -113 97 -83 -39 119 -66 32 -35 74 -5 -79 -43 -71 24 -23 -91 43 -119 -35 18 22 5 21 37
2779 37 -21 -67 -16 91 56 75 54 26 10 43 -26 -63 -72 94 -50 58 3 -15 90 -33 -58 1 106 -65 76 64
2805 64 24 -46 -52 22 37 -7 -118 -8 -16 -39 38 30 -33 -65 86 89 2 -27 -29 -37 -37 -45 73 1 -16 4 -57 -47 69 -84 -55
2836 -55 17 -34 -52 -73 -10 107 -53 39 -45 47 11 -39 -85 28 146 27 14 -6 84 23 -90 0 -34 -19 -93 -6 -28
2863 -28 15 -70 29 37 22 -39 145 39 33 -68 22 -1 -26 12 -88 48 22 33 -27 18 4 -32 -34 -84 1 -9 -67 79 71
2892 71 -83 -17 32 -7 36 -36 -87 37 83 -50 -35 -92 -2 -81 20 46 -11 -51 49 30 18 -14 26 54 -67 49 -103
$$ packed form
2696B3m3mnJ1L0p3J68j11n4K2K3J1M4L5m2o4N0o8J19P1o2j36P8O7k03O0M8n1N5
2725ak0J51j13m0p1R9M8m7N7j31j4J50q5J7k1k5R0k0m7k6Q5k0l8P6o2q4O3J41
2753A12n9m7j19K10j80M4J58j85R8o7J09p9p4L6k8R5m7o8J34j62Q4N3Mj7J6J6
2779C7n8m6N1J07l5J9k1k8j6L3o9l7rJ66j44J08n5j8J05j23k5N9J05j71J41j2
2805F4m0p0oP4J5m4j11J10qk3P7qo3l2J51Lq7k9kq%qJ18p2j7K0o1J0J16j53K9
2836e5P2n1j8k1O3J17j60R2q4R2l6n0m6J13J18j19j3k0R0o1j13R0l4J5p4Q7k2
2863b8M3q5R9Qj5o1J84j06oj01R0k3k5L8j00J36k6J1o0M5j4l6kn0Q5j0n8J46q
2892G1j54O6M9l9M3p2n1J24M6j33J5n7R0p9J01K6n7m0J00j9j2l2M0K8j21J16j52
$$ plain form
2919 -103 -14 7 -92 39 26 4 29 12 74 -19 -53 -27 -108 -68 -38 -27 -31 -10 14 18 39 9 12 55 73 87 -16 6 -15 33
2949 33 -11 35 -6 -70 27 -92 -15 37 -48 47 7 -3 -8 -4 12 27 43 -45 43 -5 -34 89 50 -12 14 -12 -18 -18 51 -15 -25
2980 -25 21 -8 94 -83 -37 1 -37 -97 -45 2 -52 76 12 88 28 58 134 73 -28 23 108 31 15 -91 107 32 29 91
3008 91 -17 1 7 39 -10 -57 34 40 -9 -89 19 20 25 -73 19 -17 -57 8 -44 -33 47 -23 -15 -105 24 82 26 -122 -33 -5 -77
3039 -77 93 -5 39 -48 114 -50 25 -31 -45 1 19 -60 -28 75 -118 -48 -19 -91 13 -3 -44 -83 8 26 -97 -71 36
3066 36 110 77 86 -50 -167 35 -6 77 -15 -2 21 -30 37 4 -26 -112 24 -50 -22 -5 1 -38 10 -28 -80 -39 73 75 81 29
3096 29 -67 -53 -50 27 25 109 18 6 -94 -48 -56 -59 -24 18 13 62 81 70 -27 67 -4 22 -3 26 -35 -60 37 67 35 -84 -30 99
3128 99 -18 -35 32 78 -29 32 -35 -20 87 -58 11 31 -8 -110 20 50 -80 -45 43 0 14 -100 -31 25 17 -81 49
$$ packed form
2919a03Q9K1r9J31j3k2K5j7O2r3l4K6q1M0L0J1mK1K4MK1l0LM3J8J4j03K2k1M8
2949C3m4M6m1o4R7j19P7N2q5R5m0j0nMJ6J5J6q8Q8m8k9J23l9o2K6k6o%O9o6j0
2980b5M6k9J02j77M6L8l8o0N2M7n4J28o4P6o0L0P6o1j01N1Q5p7j6j06J98p5lO2
3008I1j08J8OL2m9m7R1Om9q0J08JNr8R2l6m0O5n2J1Q0p0Qr0J29N8n6j48Q9K8p2
3039g7J70r8M4q7J62j64P5n6j4M6J8p9L2J03j93P0K9p2J04j6m1l9R1J8j23K6J07
3066C6P4l3Rj36j17K02m1Q3r2J3K3n1O7l3l0q6J36p4K8J7Ol9M8l8n2M1J12KOn2
3096B9r6J4LP7kQ4r1j2j00M6qlL5M2nM9J9j1r7R4p1K6k5K9o1k5R7L0l2j19N4J29
3128I9j17j7O7M6j07O1o7J5J07j45O9K0l9j02J30L0j30L5Q8m3J4j14O9N6qr8J30
$$ plain form
3155 49 -45 -71 -6 100 -22 -7 -36 -56 -42 28 -37 -29 61 70 23 -54 -91 68 78 17 -28 -33 -26 -122 29 77 -61 -47 73
3184 73 -18 -51 25 61 61 -67 28 53 29 11 38 100 50 -2 34 18 -7 -96 20 31 29 -72 -25 74 49 11 -12 -80 11 -22
3214 -22 74 -40 34 102 -7 -26 107 -45 -1 55 -9 87 -70 -85 43 -60 -93 -13 67 -55 -51 -23 15 -7 3 30 105
3241 105 -56 -19 -62 25 -77 -41 36 25 70 6 46 -16 -36 41 -122 -15 49 78 -77 -14 -29 3 -7 -61 17 54 1
3268 1 40 -12 68 86 29 15 -55 -48 -55 -15 -80 -70 26 -2 55 -76 -34 43 -90 0 76 35 -22 -33 51 87 -35 -21 84 -108
3298 -108 -37 -16 -20 20 10 11 -24 -10 -6 -24 10 42 -26 14 -121 -11 36 56 -120 47 43 49 -17 9 45 -55 -47 -57 120 43
3328 43 8 45 67 -28 20 8 22 -74 48 9 36 -79 -54 -10 32 22 25 133 31 24 20 -30 23 -13 -13 -30 62 -1 59 43
3358 43 -29 28 49 -24 7 43 63 53 32 108 32 2 22 32 8 -71 16 76 30 13 -20 -46 34 136 12 37 -56 -9 -20
$$ packed form
3155D9r4k6O5J06j22J5k9k0J4P0o5QR0Rm7p7l7J59J0o1m5nPr6J51M8j38J4J20
3184G3r1l3P6L6%j28R5K5k4j8K7O2n0n2L6j6k5q9J16J1kj01M7R9k5l8k3o8R1l3
3214b2R6j14P4O8j09j9J33j52M4N6o4R6j57j5J28j03l3Q0Q0j22MK8L8k2J0K7P5
3241A05j61L7m3Q7j02L6P7j1M5o4M0o2k0P7j63J07O4K9j55O3j5L2j0n4P8L7n3
3268AL9n2Q0J8n7j4p0PpM0o5J0R6k8N7j31M2P7j33R0P6m1n7j1Q4L6j22J4J05j92
3298a08P1K1mM0j0Jl5J4Mj8L4L2o8M0j35J10M7K0j76J67mOo6K6L6j00Qj0J77p7
3328D3l5L7K2r5M8j2J4r6J22l9K7j15K5M4M2j0LJ08j02pmn0N3l6%j7R2o3O0j6
3358D3p2N7K1p3L1L6K0j0k1P6p6l0K0J0k4p9Q7O0m6j7l3k6Q0J02j24K5r3M7j1
$$ plain form
3387 -20 29 40 37 -54 -34 23 -43 25 -13 -40 -4 63 -10 9 -69 -8 -50 19 26 -17 -18 1 83 -28 60 46 12 37 -71 -12 -14
3418 -14 43 9 -45 -27 -16 -107 -40 -21 11 25 -25 61 22 -43 72 2 29 20 -43 -69 -57 67 27 -14 -7 35 -58 -24 -1 32
3448 32 45 -24 69 7 -29 50 71 41 -15 -97 49 -54 94 56 -15 88 16 -4 13 108 -59 -10 58 -38 18 -4 -73 140
3476 140 18 -33 90 94 27 41 30 -26 26 45 -79 -11 -61 -86 -54 -61 14 -11 71 -9 -38 4 -40 73 -39 89 -4 -137
3504 -137 50 -35 -23 -36 -3 52 61 -26 39 81 5 -25 -46 -32 -21 55 41 -68 -37 84 47 -3 -94 31 -4 -3 -10 27 14
3533 14 5 72 -61 100 28 36 27 -16 -1 -72 -35 129 24 -48 -41 112 6 -139 27 56 92 -5 16 30 -52 5 57 -17
3561 -17 29 26 -100 -26 -4 -29 -82 69 116 80 -32 49 27 34 -29 -1 9 -55 -48 -13 34 -33 33 -74 -6 -45 47 -56 7
3590 7 20 48 -37 -79 76 108 -75 4 -87 -60 1 50 -53 92 -57 -45 20 -13 -17 14 -17 12 -10 -52 -31 -20 58 36 -34
$$ packed form
3387b0M9J1lr1K0N7o6O8l8k7L6O7p3J9p8O1m2O9Pm3jJ9Q2j11Q8j4l4K5j08N9k
3418a4N7l4n4J8J1r1O7J9L2J4n0Q6l9o5J15p0K7ro3k6J2J24m0m1PM2r3L4K3L3
3448C2J3o9R3o2l6P9K1l0n6q2J46j03J48l8p1J03p2k0J7R5j67M9O8r6N6k2o9K13
3476A40j22n1J23Mo7J4j1n6N2J9j24O8n0k5L2pP5k5Q2q0k9M2m4J13j12J28r3j33
3504a37J87q5J2j3L3N5Rq7O5M2p6l0k1J4J1P6j4j09L1J21l7n0r1J25l5JpL7j3
3533A4rO7j33J61p2Qrm3J5p1L7J64j05p2PJ53j06j45J66K9L6r7K1J4q2N7N2p4
3561a7M6lj26P4K2k5n3J51M7l6j12Q1k2Po3K8J0o4PL5M7o7O6j07O8l9R2j03O3
3590GJ3K8q5m2J55L2j83P9r1K7O1M9j03J45j49J2O5l3mL1l1K9k2m2K1J1P8k2p0
$$ plain form
3619 -34 -21 -163 -50 -36 -40 170 38 9 -35 38 -8 70 -38 2 -32 -57 -47 -53 28 -121 -14 24 -28 80 29 -26 -14
3646 -14 -6 36 -93 -40 65 19 -47 -87 20 39 -27 -47 -44 6 82 -4 -61 31 -6 -4 -42 -23 -97 -114 64 -14 113 -97 -25
3675 -25 2 56 5 -40 23 -83 36 -45 -6 -31 48 -51 -61 -91 27 -72 -52 10 -120 16 -53 -10 39 81 -99 -21 -16 -2
3703 -2 36 -20 -10 43 -77 -15 56 18 74 23 -16 40 27 -3 20 72 71 56 64 -38 91 16 -38 -1 54 -27 31 -80 2 35
3733 35 0 -66 -9 -47 25 37 47 -17 40 12 -21 -27 -6 79 -37 -43 -47 5 108 -28 19 -22 -13 39 -31 -70 -94 24 18 -62 96
3764 96 -22 -9 -27 -105 -38 12 -6 81 -34 38 -30 27 3 -55 0 22 -133 -77 -113 47 -32 55 -73 12 -39 80 47
3791 47 51 18 -5 -56 -73 -2 26 77 86 -8 24 59 -98 -82 12 -33 -1 -46 6 -79 -99 -34 41 7 -104 -24 -8 -2 -21 -78 66
3822 66 87 -23 -47 17 58 26 -21 -26 -41 15 -6 -104 32 3 -9 -32 -14 4 84 -88 -14 12 104 -40 135 82 -31 21
$$ packed form
3619c4J3j42J13J4mK10j32k9m4P3m6P8j08M0l4k5J0oQ1j49J07L8n2J08n1n5J2
3646a4QM2j29N3J05m6o6m0J07J9o6k0LN0P6q6n7R2l7Kl8J9p4j7J78p8J27k10P2
3675b5K7N4n1m5O3j06J19q1L9k5P9r9j0l0J18r9K0O2j30J36o9M3M9M2j80P8NJ4
3703bL8n6J0N3j20O2P1l8N6n1l9N6j3l0K3N2jj5Qj02J29p5n4L7N5q1N8j11Q2L3
3733C5l5o6N7l8P2J2J0o4N7k8l3oK1Q5j16omN2J03j36M7m1RN2p0l9k4J18oq0J58
3764I6j18J3j8p8O7N0j8Q7j15P2o8N7k4n8N5K2j55N6l6J60p9Q7j28Q5n1J19l3
3791D7Ml3k3n1j7P1K8N1Rr4L2L5j57J6R4m5L2m5N2q5k0O5P5l4j11Q0J6Oj9n7J44
3822F6K1j10k4O4M1l2m7nj5N6k1r8J36k9j2k3J8J8Q0j72P4K6R2j44J75n3j13N2
$$ plain form
3850 21 18 78 21 -11 0 -7 -33 -74 -23 -53 61 -57 -39 -48 -32 -33 2 -64 50 2 -40 2 3 -14 -71 35 -110 65 88 -19
3880 -19 23 52 12 20 7 51 -41 -13 5 -68 11 -4 -12 32 -16 85 46 66 -36 26 -14 -21 -41 69 -82 -61 119 -28 4
3909 4 10 -45 39 -59 -79 -103 -26 55 17 -72 -29 68 6 -114 -49 -49 -13 34 26 31 -54 2 -45 13 -75 -56 -89 74 -14 -37 -17 53
3941 53 -22 -29 52 0 -20 61 -53 -36 65 -40 -16 22 -66 -15 -43 0 37 -49 24 -41 -56 5 -26 18 -7 -26 -66 -12 28
3970 28 40 -60 -41 -56 -25 94 -20 -123 -56 -9 14 -51 37 -69 -29 54 -45 -9 -22 3 52 -18 39 56 0 13 -116
3997 -116 90 -48 -29 39 32 19 -12 -73 108 39 30 53 39 -21 -100 -11 25 -68 41 40 42 -32 103 -75 -92 -15 -7 -5 56 46
4027 46 -10 -26 62 -43 -17 -25 -58 -48 28 6 13 0 -10 -35 -29 13 101 -23 205 -25 36 -65 54 -26 -102 2 -82 32
4055 32 30 16 69 11 42 20 -88 -79 29 7 -130 -18 44 -26 19 29 84 -46 -19 41 -23 11 20 -50 37 116 -99 -22 82
$$ packed form
3850B1lO0n7l2J1pk6m1N1l0J14j18J8rJ6jL5o6J14m8m2M2Jj7n7J06j45J75K3j07
3880a9M2K9m0Qj3M4r2K8J8p3P9j5qM4m8J01l9K0j02O2m0pk0J10j51K1J80j47L2
3909DOn5Q4r8k0k4P7Q1l8q9M3R7o2j20O5%L6M7qNq5N6m7N8q8J9l3J63q8k3K0P0
3941E3p5pQ1n2k0Q1j14J7J01j05K4L8q8N1k8M3L7q6P3o5j5O1l1M4k5j9m0N4M0
3970B8J2j00J9j5L1J19j14j03O7M7K3o5Q8j06M0Q3r9L6j3K5M9p0N7J7n6J3j29
3997a16K06j38J9O8pj3l1o1J81o9rK3j4o0p9Q9L6r3J09jKp4J35j78j7P7QKO1j0
4027D6n6j6Q8j05K6ql3J0P6k2Pj3j0k5OM2Q8j24K28k30O1j01J19q0p6J04q4J14
4055C2kj4N3n8L1k2j08RJ08k2j37J12O2p0M5J0N5j30K7O0o4L4Rp0Q7P9k15P7J04
$$ plain form
4084 82 -6 -103 -61 -28 -28 5 43 40 -32 -95 1 27 72 -10 1 -97 -15 32 7 74 5 6 26 -66 119 9 60 -38 -101 14
4114 14 -37 -43 -67 13 92 -47 -88 -22 -37 -28 -59 -120 5 39 -15 120 62 -89 139 -91 88 -28 52 -41 -4 60 -4
4141 -4 -88 -37 21 -44 -12 69 46 -20 80 51 -64 -5 -63 40 31 42 -6 13 78 -21 2 17 -73 -56 -11 -108 -26 62 -45
4170 -45 -115 -36 68 51 -11 -10 34 33 68 33 79 20 46 -5 26 -41 -88 1 -93 70 -15 -98 67 60 49 -49 11 14 65 11 -6
4201 -6 -30 55 65 -4 -97 -55 14 -47 -61 43 70 20 12 21 -63 89 116 6 -83 -15 -52 31 -36 -52 -8 -4 16 18 50 18 -4
4232 -4 62 -37 -96 -18 90 -98 -49 65 39 -26 26 -10 -62 -46 7 -164 5 98 -34 42 24 -77 3 -10 -20 -56 -92
4259 -92 44 89 -29 30 84 -28 10 22 115 -9 60 -49 95 -73 32 94 -43 33 -75 -116 -27 42 -35 1 -68
4284 -68 36 20 85 -94 -19 39 56 16 27 -27 4 34 -12 35 32 44 59 -39 -28 -23 -5 90 19 63 8 11 9 -34 -63 -10 -18 46
$$ packed form
4084H2q8r7M2L3%L3L8lp2o3R6K6M5q2J1r8Q2M7k5O7o9JK0r2J85j10N1r8o3J15
4114A4n1ok4Q0P9j39m1O6j5Rl1o1J25L4n4J35n8j51K28k30J79j16Q0r3L7O4o4
4141dq4N1N8o5L2Q1k3o6J00k9j15N9n8J03rJ1m8J9O5r9K3J5r0J7M5r7Q2Q8j07
4170d5p0P9J04j7o2JM4jL5l5M6n9K6n1L1o7m7Q9r4J63q5q3J65pj1r8O0LN1n4j7
4201fk4Q5J0o9r3M2O9o1j4J04K7n0qRq4J52K7j10q9O8l7Q3o7j6M4MK0KL2l2k2
4232dO6r9n9P8J08j88M9J14k6o5N2l6n2J6N3j71J69R3j32P6j8j01Q0j3j0l6l6
4259i2J36M5j18N9N4j12L8J2R3j24O9j09J44j68J05O2j37P6j08m1Q9O9p7L6o9
4284f8J04j6O5j79P5N8J7m0J1n4L1L0m6M7lJ2J5r8J1NJ8R5p1M4n5Lkm3k9N3qO4
$$ plain form
4316 46 91 -46 -3 43 1 34 -76 74 -49 -58 138 39 25 -14 -2 -15 -55 -10 -40 -35 -19 -56 -7 -31 -87 63 41 -93
4344 -93 -65 5 68 -62 -34 31 -21 12 -11 40 17 -50 -115 -128 31 -56 75 -46 15 21 -13 -40 89 29 -78 -10 -53 -76
4372 -76 -16 50 -8 7 41 -12 19 -34 40 4 66 89 44 -2 -40 -59 101 -40 -26 86 1 -34 52 44 47 -13 143 2 -37
4401 -37 -60 -65 3 -56 -39 0 -2 69 -37 -67 -10 62 90 23 -49 -19 19 20 12 -19 96 13 10 24 -34 -142 26 17 66 -20 -6
4432 -6 -18 -10 48 -1 -90 -35 -28 -44 -9 -107 -80 57 72 -37 18 6 -74 -5 -30 -54 -5 -29 -14 33 -39 -1 -103 -84 -6 102
4462 102 84 2 -59 32 21 -12 35 65 44 24 45 31 8 -67 55 -47 -83 -59 10 -31 -14 86 -40 52 -64 -49 57
4489 57 -130 -54 -12 -74 131 -69 84 -32 78 22 -9 -41 -72 -52 35 30 -7 15 38 127 57 19 -40 -56 17 76 -77
4516 -77 -46 16 -93 38 -45 -18 69 5 -36 -26 64 -23 -71 90 85 10 0 -50 -52 22 -40 -29 -104 -13 -37 86 -57 -49 4
$$ packed form
4316D6M5j37M3M6m2L3j10J50j23rJ96r9j4l9J2j3m0M5l0NJ6l7M9k4n6J50k2j34
4344i3K8P0O3j30K8O5n2L3k3N1k3o7o5j3J59q7J31j21O1Ol4k7J29o0j07O8m3k3
4372g6O0O6n8J5L4n3L1n3P4l6O2K3m5m6l8j9J60j41J4J12q5l5Q6qLo0J56j41l9
4401c7k3nO8n9J7L9kP1j06l0N7P2K8o7p2L0L8Jql1J15q3lJ4n8j08J68rM9q6J4
4432fj2QN8m9q9N5Pj6L5r8K7J37J5j09N5j2q0O9k5k4M9k4J5M7p2L8j02J9P8J08
4462A02j8q2o1R1j1l3M7L0k1k0K1j4k3p5J22j02l6K4O9m1J7J00j26R2j16J5J06
4489E7j87P6M2o2K05k00J53j16J10n6l1l2l1K0Q7nl7K2K3Q9p0l8n9j6P3N9j53
4516g7L1O2j09J31q3K7Q7o4m1J0R0q7m8J61np5j0n0kP4o2J1p5R1k4J23j43QN3
$$ plain form
4545 4 19 -33 92 2 131 52 133 41 3 -136 -93 4 -26 38 -17 -14 70 -57 61 -22 71 71 53 18 8 14 -55 -21 27 -12
4575 -12 -63 15 57 -25 32 -54 95 43 -69 -46 -24 3 -23 -109 24 9 57 30 26 -7 -40 -13 -5 -59 173 19 -138 1
4603 1 9 13 -19 -2 -69 -42 -42 -24 28 18 -110 90 8 47 -10 -32 -114 -18 -54 -37 34 -3 20 -71 74 -46 -12 -156 -4
4632 -4 78 -53 -25 24 59 19 0 -59 7 -40 16 71 -29 50 -42 6 -51 -50 -59 46 60 -111 16 -49 -42 15 65 15 75 -62
4662 -62 -17 60 5 -3 -96 -55 15 -9 -12 -13 9 0 -91 -56 32 36 -68 12 21 -22 -26 -97 2 -10 -81 -88 30 88 22 116 -5 31 -49
4695 -49 50 54 19 22 -68 49 17 17 -1 31 -42 71 -46 -69 115 46 -82 -10 -33 34 13 -38 -43 -63 121 33 3 31 -55
4724 -55 -98 37 -163 11 -37 -76 -64 69 -10 -44 -77 -4 45 29 -13 -23 20 24 -39 75 -21 -26 -33 8 46 25 -14 -16 74 -3
4754 -3 37 -51 32 -6 -6 67 -6 19 34 -111 5 -96 103 44 -79 18 26 -27 23 -69 -86 -24 -40 3 -16 57 27 -24 -76
$$ packed form
4545DJ5n2J25r0J29p9Q1r2l8j39M3R7l0O4n5LQ4j27J18q3R3%j8l5j0Oo9L4M8l9
4575a2n1P8M2q2N7q6J49n2j12K3K2K7k6q6J33j5M8k7ml3l3K7Qn4K32j54j57J39
4603AQMl2J7o7K7%J8N2j0j28K00q2L9n7k2q2R6l6J7P1l7K3r1J45j20L4j44J52
4632dQ2j31K8M9L5m0j9n9O6m7N6N5j00P9r2M8n7JrJ05J4j71J27o5PN7N0n0O0j37
4662f2M5P7n5qr3M1P0k4ljK2rr1L5Q8Mj04Q0Rm3mp1R9j2p1pJ18N8o6R4j21L6q0
4695d9R9Ml5Lr0J17l2%j8L2p3J13j17k3J84o9j28P2k3O7k1n1nk0J84q8l0K8q6
4724e5m3J35k00J74m8l9J2J33p9l4l3P3M9j6m2j0M3Mo3J14r6npM1L8k1l9kR0p7
4754cM0q8Q3l8%P3p3K5J5j45J16j01J99n9j23R7Qn3N0r2j7O2j6M3j9P3l0n1n2
$$ plain form
4783 -76 13 1 -7 35 -23 -9 -7 -14 124 24 41 44 -2 -66 125 -22 -16 -63 1 56 -40 -112 82 0 -60 95 43 -49 19 -31
4813 -31 -16 15 16 11 14 7 -10 -39 53 -17 -63 8 66 78 -80 37 95 -53 -63 -9 11 -9 -15 7 -51 -52 -45 51 -8 -118 -25 -84
4845 -84 -74 25 -51 -3 -5 -39 39 6 -3 86 25 -69 54 34 -30 52 45 14 37 -26 88 87 2 60 7 -32 34 -34 32 68 -101
4876 -101 -21 15 92 -39 -33 -65 -76 -8 44 26 -18 43 -97 46 7 35 43 -86 -51 -21 2 49 11 26 -66 -34 18 40 28
4905 28 72 -76 9 -59 -28 15 85 -16 49 48 54 30 -37 7 -58 47 16 -61 -15 156 43 -26 -57 -90 28 -38 -36 10 -26
4934 -26 -18 8 -8 31 -1 -29 -28 -58 -23 -30 -88 -5 21 -1 -28 -33 -1 2 2 54 13 -45 26 46 -71 72 70 -13 82 -92 25 98
4966 98 12 50 -29 85 51 -64 40 -46 -35 29 -47 -13 54 -102 51 114 63 19 55 60 -49 -4 44 -10 6 64 9 1
4994 1 -77 14 -24 27 -15 1 -5 -32 26 81 -28 85 -44 -51 107 67 -28 -73 -16 -64 -12 -43 56 -13 44 -4 -59 37 -13 58
$$ packed form
4783g6Q9j2qM2n8J4KpJ38j00J7Lm6o4J91j47Om7O4N5r6p2J94q2o0J55n2r2O8n0
4813c1J5L1JnLpj7k9R2p0m6P1N8J2j58J17N8j48j0N4K0k0oK2n8jPR6n9j10R3n9
4845h4J0R9p6M8kl4P8l3rQ9o1r4J23k0o4Q2pl1K3o3J14jq5N8n3l9O6o8O6L6j69
4876a01Q0L6P7j31Ol2j1O8N2j8m4O1j40J43l9K8Qj29L5L0K3M7l8J5r2L2N2K2j2
4905B8M4j48Q5o8L1M3P0j01O5jOk4o7M4o5J05l1p7M6J71j13o9l1l3J18o6KM6l6
4934b6QK6j6L9l2k8Jl0L5pn8Q3K6k2k7nL2L%N2m1n8P1K0j17J43kq3R5j74J17P3
4966I8q6L8p9J14l4j15J04q6J1O4p6L4O7j56J53O3n1m4L6Nj09M5M8n4J6N8n5q
4994Ap8R1l8N1m2J6ok7N8N5j09J13j29pJ58m0r5m5N7m8N2l1R9o9N7m8n5R6n0P1
$$ plain form
5024 58 74 -17 -32 -114 -11 10 74 61 -109 -53 -56 49 11 -20 12 45 -25 -15 17 -9 -45 -9 -14 -31 -35 -20 88 73 19 103
5054 103 127 55 -33 35 28 -39 79 -25 72 44 77 -74 -97 72 39 -10 -62 42 22 -15 -107 -2 113 35 -24 13 -85
5081 -85 -126 -30 30 46 -58 -33 25 23 28 62 1 103 24 -28 -40 -75 36 -26 19 19 24 33 82 16 142 75 16 -23 -16 101 -10
5112 -10 -16 -4 27 42 -28 -64 39 -38 -20 24 58 -34 -42 2 -12 48 36 -35 54 13 -4 48 -7 -40 -31 40 5 -78 102 -33
5142 -33 3 50 56 -39 -13 74 126 102 -28 103 3 47 -20 -64 35 -70 -54 -26 111 1 -13 -28 15 2 -43 -94 71
5169 71 23 -35 -40 17 18 34 -35 -118 70 13 -19 74 57 -1 66 115 50 -37 16 -83 -73 6 56 -135 46 -73 -2 -9 -14 -114
5199 -114 67 -48 97 -39 -83 87 7 7 -102 -18 23 -61 65 -27 -59 23 16 -92 31 2 7 75 -1 47 -122 -29
5225 -29 5 79 6 30 86 26 -88 43 22 95 18 -24 -3 -42 -51 -11 51 -15 -143 -46 -52 -15 42 91 47 -6 -37 -134 52
$$ packed form
5024E8J6r1j5q2J03K1O4j3j70N6lJ05l8l1L2L3p0J0L2k6l6L6nj7mJ5J08j5n4Q4
5054A03K4p2q8O8po7J18j04R7k8L3j51k3J69l3m9n2J04k0l7r2J05J15p8n9L7r8
5081h5m1R6O0J6j04K5N8kNL4o1J02p9n2j2l5J11o2M5%NRM9o6J26o7n9l9PJ17j11
5112a0oJ2L1J5p0l6J03p7J8M4L4r2qM4j4O0j2p1Q9m1j7N2n5l3RP1l5q3J80j35
5142c3L6M7Or5K6Q7N2k4j30J31j00M4o7m4R9j05J6K8J37j10j4j5M3j3m5n1J65
5169G1m8n8nN7JJ6o9q3J88n7l2R3j7n8O7M9o5q7N3r9J0P9N0j91J81j19P1pnj00
5199a14J81j15J45j36m4J70q0%j09Q4M1q4J26r2l2Q2pj08J23k9NO8p6M8j69R3
5225b9L4P4p3K4N6o0j14J31k1P3p7m2K1l9rM0O2o6j28R7oL7N7M9m4n3l1r7J86
$$ plain form
5254 52 76 4 43 -41 5 182 94 12 45 24 8 -7 21 106 -51 98 -8 78 -1 -76 44 -25 -100 -124 -25 56 -94
5281 -94 9 -5 22 53 11 61 -43 -101 -11 -6 -1 -107 -46 95 6 -70 126 -34 50 9 -14 26 -80 31 7 -11 83
5308 83 49 31 9 -76 2 -27 69 21 79 -50 37 -1 54 46 -10 110 31 -36 -53 -103 -64 -50 15 68 62 -14 -83 20 27 4
5338 4 13 -27 55 42 -10 36 -11 -57 81 -64 62 51 93 -16 -20 13 28 4 -124 -24 5 61 -10 -57 41 55 61 53 -90
5367 -90 47 -106 37 -57 -8 113 -82 28 -51 79 -114 19 -65 25 91 11 3 -36 -58 10 92 -18 -20 129 22
5392 22 5 50 -6 28 47 -15 -41 -58 72 4 -20 -49 33 -74 17 1 3 -2 -16 33 65 40 43 -31 -14 44 29 -84 -19 35
5422 35 22 49 -36 -39 -28 -88 48 -112 48 4 -65 -32 -20 -53 -117 -34 -47 122 12 34 -99 -68 -21 16 29 -25 -53 -163
5450 -163 22 90 0 -32 71 9 -14 7 -46 -1 11 105 -63 -11 36 37 -36 21 -57 -90 27 -47 -46 -28 90 5 32 44
$$ packed form
5254E2K4p2L9q4M6J77q8q2L3k1j6j5K8Q5j57J49j06Q6p9p5J20o9p5k4R9Q1j50
5281i4J03j4K7L1m2N0j04n8R0NNj06O1J41q9p6J96j60Q4m1k3M0j06J11k4j8R4
5308H3l4j8k2q5P8k9R6m8N8j29Q7l8N5qn6J20p9o7j7n0L9J4O5N3op6o9J03Pk3
5338DRm0Q2j3n2M6m7m6J38j45J26j1M2j09mL3J5k4j28J00K9N6p1m7R8J4Oqj43
5367i0J37j53J43r4M9J21j95J10p9J30j93J33q4R0O6q0ql9k2O8Q2j10kJ49j07
5392B2j7M5n6L4J9o2k6j7J30o8k4k9Q2j07R1j6Knj4M9L2k5Lp4J7N8j5j13O5N4
5422C5j3K7q5lJ1o0J36j60J60m4o9L3J2l3o4Q3j3J69j10K2j33L1M7L7J3n4k8j10
5450a63J85O8r0l2J03o2k3K1n3M5J2R4j68N2M7Jp3N7p8l3J17p4JJ8J18q5K7J2
$$ plain form
5478 44 -6 31 51 32 -9 53 -122 25 1 -45 60 1 -96 -68 3 -127 -13 -11 -135 -32 -46 -53 -11 115 27 116 -46
5505 -46 75 6 -38 0 46 74 25 16 -82 139 32 79 -32 70 -53 -23 28 29 1 -91 -46 116 -9 -51 -25 -35 61
5532 61 -36 53 54 82 -25 75 21 -65 123 -33 -21 -44 -18 111 26 -41 -53 135 -17 41 37 25 72 14 4 5 44 -2
5560 -2 19 -67 -23 -52 -42 -13 -33 -51 53 4 -83 -71 14 29 -40 -14 16 146 -63 75 -22 -66 -33 -58 -39 -19 -39 1 2
5589 2 -111 120 -81 14 8 0 0 121 47 -98 42 -60 15 -16 33 135 -11 103 56 -22 -33 -42 -43 28 28 -76 -13 8
5617 8 6 -46 1 -78 -105 -31 38 5 89 -101 -35 -82 -46 0 -28 -90 -123 -8 -27 22 104 39 37 12 -28 5 -46 72 -81 45
5647 45 -36 7 28 -31 -123 18 100 50 38 12 -5 -89 -48 24 -67 -15 26 -3 34 -61 -2 -3 18 10 22 -2 -42 -56 -14 56 -37
5678 -37 32 8 12 20 -18 -49 19 29 -27 -45 17 -12 42 5 -4 -58 26 -53 -8 -41 15 -31 -54 4 -3 -9 -70 16 89 11 63 -91
$$ packed form
5478D4n0L7K0j9m1O2j75J47k4m6J05n9r7K8P1j30J14Kj24J03j4pM2J26q8Q9j62
5505d6J21o9m4L8M6K8m9rr8K21j07M7j11J02j23L0N1Jk8r2M5J62j25m2K6j0R6
5532F1r7Q9JK8j07J00n4q6J88j56J2k3K6J29q5o7j2J88j52N8mj2M7n8j0JL9m6
5560bK1q6M4k9J0K9k0j8J04m9q7J2Q5J5o9K6L0J30k09J38r7m4L3k5J9K0k0M0J
5589Bj13K31k01R5oq%J21p4j45J40j02P5l1M9J02j46J14m7p8j1rjP1%j04O3K1
5617Hkn2M7p9k7P4O9l3Q4j90O6m7L6M6k8o2l3J15j9M9Q2o5kk5m0L3n1J18j53J26
5647D5q1M3K1n9r2J41Q2n0j2k6j7q4M1P2r1N2M1k9L7r5N9jK1qJ2k4m0j4M2P0r3
5678c7O9k4MQl8l1O8J0n6j8O2k9N4l7rn4Q4p9M5l3N6m6k3N8poo1Q6P3p8N2j54
$$ plain form
5710 -91 20 -85 45 1 24 -22 69 30 46 8 45 -86 -71 -12 0 -8 36 10 -143 46 -34 -84 -38 40 -83 63 -11
5737 -11 -11 -24 -37 -19 10 -18 147 -25 0 -60 6 -63 -45 29 -10 -26 2 65 39 18 6 -77 2 56 18 38 42 -68 -37 -32
5767 -32 131 -37 45 -3 15 11 -17 82 -65 -50 -54 -38 8 -59 5 19 -22 -54 -9 -44 -10 -10 9 -57 -49 17 116 38 -9 5 -29
5798 -29 40 5 -49 -87 -41 16 -29 -85 -25 39 8 96 74 35 48 -19 17 -4 2 29 -50 -10 -9 -79 71 -57 -44 19 -31 -74
5828 -74 29 -31 42 20 -13 76 -90 -19 67 -75 19 -81 -21 -10 39 -64 -62 64 -36 50 49 -41 -9 77 -66 87 -52
5855 -52 -12 -6 20 -12 -77 56 -50 16 -15 38 25 -17 93 89 -84 24 -50 11 50 -43 -20 48 33 -42 -87 -61 -31 15 -7
5884 -7 4 91 65 13 42 82 22 50 48 -11 -17 61 -31 -2 61 5 22 47 22 -17 73 16 -48 9 -1 79 16 -18 15 47 116 -62
5916 -62 61 88 48 3 -40 -9 -49 18 -34 -82 -53 -16 40 1 -56 6 76 70 63 -53 102 95 -32 -6 10 -16 96 74 15
$$ packed form
5710i1J11j05J30m4K3m6R1l9J6l8L7j31J5N9J2qM4k6j53J89q0n0M6P8j23J46p4
5737a1%j3j3J8K9k8J65j72K5o0O6o9J8P4l9j6K8O3k6k1j2q3P9N4l8K0Mj10L1N
5767c2J63j68Q2m8J8mk8R9j47J5mJ6M6o7O4J4m1l2M5l5L4%J9o6QO6R9p8m7J4l4
5798b9O9l5n4l8M6N7m5n6O0O4l1Q8k2l9J3o7L6k1OK7p9M0Jp0J50j28J3O3n0m3
5828g4J03o0P3k2l3Q9j66P1Q6j42R4j00O0J1M9j03KJ26j00Q6jr0L2Q6j43J53j39
5855e2M0OK6l2o5J33j06O6l1N3j3m2J10mj73J08p4O1L9r3K3O8j5p5m5K6L0M6k2
5884gJ1Q7k6n2K9M0o0K8kn9oP8r2K9O3n6J7K5k5l9R0n7o4N7j0Q0o3l4L3L2O9j78
5916f2J23K7m0m5m3L1m0O7n2m8K9L7N6l9n7O2P0opj16J55pj27K6J6k6J12k2n9
$$ plain form
5945 15 2 67 79 -29 37 0 -67 34 68 -69 53 53 3 -40 -31 58 -37 -70 64 -36 -11 27 7 20 -35 -4 11 17 -81
5974 -81 -109 78 56 -56 -12 -7 -49 -63 -12 106 -36 18 -54 -40 -73 -11 21 14 -105 72 65 -44 -14 2 35 -55 -33 -72
6002 -72 94 -77 113 -79 66 28 -49 -16 16 -39 -38 1 35 62 -24 52 -35 11 -3 43 21 -38 66 -4 -108 -26 -84
6029 -84 118 129 -23 -38 -71 -88 -8 -37 27 -41 -26 6 1 -14 -46 18 -50 -32 35 8 -18 -37 59 24 -16 32 -24 -62 12 -23
6059 -23 8 -41 86 -5 -42 -89 -1 -59 27 10 -35 -35 -28 -75 -181 -27 11 -22 13 -25 -36 7 50 -8 99 34 -9 23 -18
6088 -18 47 12 -4 22 -44 1 129 -64 -11 39 -86 -70 49 -69 -14 -74 -28 18 34 43 -92 -117 0 -19 56 -4 -15
6115 -15 50 15 -17 20 7 -106 61 27 -23 46 -26 21 91 -41 54 28 37 -57 12 -73 -78 -7 -52 -40 36 12 -51 -50 9 10 89
6146 89 -72 -7 -108 19 21 -77 23 31 33 5 81 35 8 -6 14 36 68 21 50 -27 -25 14 -46 -39 -78 -29 91 47 1 57
$$ packed form
5945A5j3O5J2j08O6l7o7J01L4j37J22%n0m3RQ9r5l3J34j00K5L8k0J3n5L1J5Or8
5974h1k8J87k2j12M4Nm2j4N1J18j42N4p2J4l3O2L2pj19J77pj09L0J6L3r0K2l9
6002g2J66j71J90j92J45l8p7L3L2n5JL9L4K7q6P6q7M6j4M6k2n9J04p0j04Q2n8
6029h4K02J1j52j5l3j7Q0k9O4o8J5L2nj5l2O4o8J8O7k7k6j9R6l5m0M8n6l8P4l5
6059b3L1m9J27r1l7m7Q8n8Q6j7m5%Pm7j06J54L8l3L5l8j1M3M3n8J07o5m3L2m1
6088a8O5l5j6K6o6M5J28j93N3N0j25J6J19j18N5o0M6M6J6Rj35k5J17j9P5o0j1
6115a5O5l5l2L7j3j13J67l4n0O9p2M7P0j32R5k6Rr4O9q5nP1m5J2P6k4o3JN9JP9
6146H9j61O5j01J27Kr8J00QKk8P6m6k7j4K0K2L2m7K9p7KL9o0Pl9M9J20m4m6N6
$$ plain form
6176 57 11 11 -9 -50 65 -4 15 70 -80 127 -18 -49 22 -2 39 71 -5 -5 -55 -26 16 70 -62 82 72 -35 -13 -77
6204 -77 -1 -76 -124 -33 -34 9 78 -34 30 20 -163 84 -3 -40 33 23 32 -46 9 -40 78 -108 6 -64 20 60 -3 -74
6232 -74 -29 6 5 -113 25 58 -42 -5 64 -46 -22 -8 -1 -82 -15 -50 -33 29 -40 27 31 14 -52 26 -32 37 -78 -19 48
6261 48 -38 28 -25 -42 10 36 -81 -18 -68 20 98 36 -32 -26 -114 -15 67 36 -21 -14 -104 -112 58 24 29 63 9 -27 -33 -58 55
6292 55 -6 -29 -25 -49 -19 -10 41 25 -48 -47 123 37 30 -42 18 -50 -53 37 3 17 3 -15 -3 57 69 -34 -79 96 -42 -20 -23
6323 -23 -39 -45 -41 -17 -26 -31 -24 -42 3 -70 70 -9 18 17 -88 23 33 -90 -48 55 78 -41 22 -42 74 -51 -27 96 -85
6352 -85 -8 -15 -24 -45 -8 -25 64 -113 -72 -30 70 34 20 47 -99 -33 -39 -36 30 6 -63 47 -124 -46 -60 -74 22 -28 -51 -11
6382 -11 -58 -24 -30 -17 20 -45 -7 -16 -19 85 -32 93 -22 -30 -41 51 42 -28 68 73 -32 -30 18 -22 -9 126 0 -43 -27 -67
$$ packed form
6176E7m6%k0m1J15o9J9N5j50K07j45l1P1k4M1L2p6%n0K9M2N4j32J44j0j07K2o4
6204g7P6p5m8R1jM3O9j12O4j0j83K47q7l7P3j0Rp8N5m9J18j86J14p0Q4M0o3p1
6232g4M5L5jj18J38L3j00L7O9j10K4J4Pq1O7l5J7O2o9O7Mj7o6P8n8O9j15N9O7
6261D8q6O6n3j7N2K6j17O3n0Q8P8o2o8Oq8R9Q2l1n7Pr0qJ70l4NL4n4l6ok5J13
6292E5o1k3Mk4L0RN1j6p3JJ70q6pp2O0o8lR0l4J4j4j8J2O0J2j03m5J75j38K2l
6323b3j6oMK4rnPj8M5p3J40p9K7jj05J11J0j23M2J03K3j19O3o4J16j25K4J23j81
6352h5P7prk1L7j7Q9j77M1M2J00l6j4K7j46O6oLO6k4o9J10j71P8j4j4R6n0k3M0
6382a1m7L4oJ3L7o5L8rlJ04j17J25j15qj1R2rp0R6Nj05KM8m0J3J35j26m3J6m0
$$ plain form
6412 -67 36 28 39 -29 45 4 -73 -21 4 -33 -14 -81 -20 -84 -135 -25 -59 62 2 -33 -49 3 89 101 71 -35 -61 -83 76
6441 76 62 125 -21 27 18 84 -58 -7 60 -108 24 -40 48 -22 20 -11 -55 -58 19 2 -64 57 -29 97 38 -111 -27 -76
6469 -76 -55 -105 -43 13 43 26 -73 16 5 21 -64 -105 34 -14 31 -58 36 -102 13 -31 22 -14 14 11 -7 -54 -39 -29 135
6498 135 46 9 -19 9 106 12 -91 -80 8 -25 47 -44 88 -65 -22 -62 -22 73 -9 93 -13 -7 -5 -76 -91 44 39 28
6526 28 -8 -123 63 73 -37 33 10 8 -2 -14 -9 -24 -117 -80 59 -51 40 -71 -31 -44 -23 -80 64 -27 -38 -42 13 135
6554 135 23 -16 34 70 16 -42 -48 30 -11 -5 15 25 -56 14 -43 33 77 -15 -37 -1 -48 5 -45 -15 69 -59 -6 -18 -62 -24
6584 -24 48 53 -44 -31 28 27 -42 -60 -74 39 -91 -37 -25 -87 52 -40 -48 44 11 62 -13 64 -16 -6 -3 8 -64 17 17 6 81
6615 81 41 17 -13 45 -35 -52 -48 -26 45 -8 34 48 41 -118 -38 -9 -23 62 -30 -20 113 -24 7 19 -80 -10 -15 32 -79 43
$$ packed form
6412f7J03qJ1o8P4m1p7N2K5l7J9o7O1o4n1J10l4J21o0l5j6N2Q6J2l0j06k6k2J59
6441G6j4O3j46M8rO6j42N1O7j68J32o4Q8p0M2l1m4lP7j7o6J21q6J26n9j49Q4m9
6469g6K1n0O2N6L0j7r9Q9j1J6q5m1J39m8M5q9R4j38J15m4N3l6K8lj8m7J5J0J64
6498A35q9l7k8K8R7r4j03J1Q8l3P2r1J32j53M3m0M0R5q2J02j06OKp1j5J35nj1
6526B8l6j15J86J0j10P0k3kj0j2Nj5r3L7J39j10R1j11M0j3K1n7J44r1j1mN5J22
6554A35j12l9N0L6n4n8oP8m1OK0J0q1P0n7P6M4r2k2L6m7N3n0L0Q4j28N3j2m4L8
6584b4P2Nr7J3N9jo9j8j4J13j30N4J2o2J39r2qR2l3N1p5P7q0J0LJ1p2Q1%j1P5
6615H1m0k4l0N8q0j7MK2P1n3M2J4pj59Q0K9j4Q5r2J0J33j37L1J2r9P0nM7j11J22
$$ plain form
6645 43 105 -87 -96 10 -31 21 27 -13 23 -92 89 26 8 -16 -4 -71 -81 -13 30 26 -50 -52 -84 6 46 15 30 -23 -11 -27
6675 -27 -105 -37 -25 -46 -62 -16 -20 -25 -74 -8 -134 35 -41 -16 -35 -2 -3 -42 -40 -27 58 -18 -66 -102 -109 28 -11 -92 -77 -19 -30
6706 -30 15 57 77 -56 -45 -84 -18 58 16 -60 -68 -47 -38 -46 -94 54 137 17 29 -71 40 66 30 -73 1 64 -114 -10
6734 -10 53 44 89 -74 18 -114 -62 66 50 119 34 -9 86 24 121 28 -15 77 -49 -6 48 -49 -5 -36 109 6 17 -4
6762 -4 -22 -39 -85 -8 53 -14 86 27 -20 -9 -12 -2 -55 22 -59 33 71 39 -25 139 -35 28 -4 -18 8 -95 -127 79 0
6791 0 42 57 108 -1 -12 64 -16 29 -10 105 16 -59 39 11 48 75 -82 -46 -26 79 5 -48 29 71 48 -20 37 -49 46
6820 46 -11 76 -60 50 27 8 4 -33 -37 82 -42 35 -10 -50 -51 -35 -25 -64 46 19 66 -75 -17 2 108 64 -60 23
6848 23 -47 46 6 140 10 -38 49 66 -2 9 -52 -26 -25 -10 -51 -84 42 26 -93 47 61 9 87 2 -13 20 3 47
$$ packed form
6645D3O2j92rJ06m1N2Om0L6j15J81o3j8k4J2o7j0O8M3mp6kl2R0M0l1J5n3J2j6
6675b7p8O8J2k1j6M6mnm9O6j26J69p6K5j9L3jl9KJ3Q5p6m8l6pJ37l9q1J5N8j1
6706c0M5M2K0j33J1l9O6P6m2p6qK1Rqm8J48Q3j20J2j00J11K6l6j03P4O3j78J04
6734a0O3rM5j63R2j32N2J28j6O9q5m3R5o2R7r3m3R2j26M3N4r7M4l1J45j03J1k1
6762dj8j7m6P7O1o7J00n9m7J1lJ0n3P7q1R2L8l2o4J64j74O3l2j4K6j03l2K06p9
6791@M2J5N1j09j1P6q0M5l9J15q9p5R8k8L7K7j57L6K0J05p4n3P7M2k3o8N7q6R5
6820D6n7Q7j36J10k3j9ml7mJ19j24P7m5m0jJ6J0l9J10k7M7j41N8J9J06m4j24Q3
6848B3p0R3m0J34j30m8Q7J7o8J1o1K6JJ5m1l3J26j6j19J40J4n2P8q5j5L3j7M4
$$ plain form
6876 47 77 -42 34 37 36 -70 -94 -42 22 -57 67 -57 -9 -52 -48 -49 -115 -59 3 -22 -35 54 14 25 9 -26 2 -24 66 -3
6906 -3 -30 64 -56 -6 -63 21 53 38 13 27 -63 -49 35 6 3 43 2 -63 -49 -16 10 44 -77 -25 55 69 -78 -47 17 3
6936 3 37 60 -15 -54 -13 -61 79 43 -31 59 92 71 -75 -88 33 -75 23 -24 17 35 5 -37 -7 15 -105 -42 49 -26
6964 -26 61 -27 -38 -65 40 -15 -71 56 34 42 -74 100 20 -77 -2 -22 -129 14 24 -70 84 -63 -19 -67 28 -50 92
6991 92 13 -63 -134 59 -21 -57 -8 31 65 -67 0 -91 66 -37 35 -56 -32 28 82 22 89 -42 -101 21 -66 -15 -3
7018 -3 2 24 -26 56 -78 -28 -73 -28 29 -77 -10 -53 -63 -62 -18 14 -21 35 56 -80 18 81 21 -3 3 -29 12 45 -14 -16 -23 3
7050 3 23 43 6 5 -27 14 -43 -65 -5 -59 10 44 -41 43 37 41 -38 -39 -18 62 -151 -27 49 -25 -41 -45 29 -77 -14 -1 -47 7
7082 7 -4 -33 35 3 82 -15 65 10 102 126 -10 -16 -35 24 50 -68 19 39 30 6 -7 81 -66 -50 14 -32 -30 41 15 1 -25
$$ packed form
6876D7L0j19P6Ljj06k4N2O4p9J24j24M8m3Mjo6N6O2k5j3Q9m0J1j6l5K8k6R0o9
6906ck7R4j20N0n7Q4L2j5k5J4r0J4Q4k9lM0m1o5J4L3K6L4j21N2Q0J4j47L1O4j4
6936CL4K3p5l9M1m8J40l6p4R0L3k1j46j3J21j08R8m7M1J8l0m2L0K2j20O3R1p5
6964b6Q7q8j1k7J05n5n6J27k2Qj16J74q0r7P5k0j07J43J0r4J54j47M4m8R5p8J42
6991I2p9p6p1J93q0l6M9L9L4j32O7r1J57j03P2r1K4O0N4o0O7j31n9J22q7N1J2
7018cNK2n0Q2j34N0m5M5N7j06O7m3j0JM4L2l5N6K1j36R8O3o0k4Ol2M1L3n9kpK6
7050CK0K0l7jl2M1n7k2O0n4O9L4q5Q4oMp9jK1Q0k13J24P6p4j6mP4j06O3J3m6N4
7082Gj1k9O8l2P9r7Q0n5R2K4j36oj9N9K6j18Q7K0rk4j3Q8j47J6O4m6KP1k6j4k6
$$ plain form
7113 -25 -11 66 91 -23 -39 0 17 36 97 -82 0 15 -129 -31 11 -76 -33 60 74 -10 -32 51 -38 -84 70 -13 6 33
7141 33 26 -51 11 20 42 -23 90 35 -73 73 -52 4 -28 21 -11 47 14 -112 -57 -25 10 63 45 118 -39 40 -35 -74
7169 -74 70 -53 -83 76 -51 22 27 58 -28 -66 -91 -104 -5 2 15 -45 70 21 -10 -49 -53 -11 -30 75 86 15 -40 -79 29
7198 29 -15 -93 -47 -110 -19 -6 28 32 -12 -58 42 102 -68 -35 -89 86 -85 -46 14 32 -75 -83 28 -34 -27 -5 29 -47 59
7227 59 17 39 63 -11 78 -89 -44 -2 -7 -79 -21 46 -102 61 13 -5 13 56 -87 9 59 16 -32 40 -25 -41 -9 46 58
7256 58 -28 43 -43 36 6 49 16 38 87 23 -64 70 -21 -19 35 -61 -123 69 -51 33 8 -5 111 -51 -44 -9 -29 -82 -55
$$ packed form
7113b5J4P7K5j14j6L9J7J9O1j79Q2J5j44R8M2q7M3R3J4q4k2Q3q9m6J54q3J9K7
7141C3pp7O2RK2o5J13n5j08J46j25N6l2M9l2N8l3j26N5L2L5N3j8P3j57P9p5l9
7169g4J44j23l0J59j27P3NL1q6l8k5j3R9PJ3o0J15m9l1l9mM2j9J05J1p1n5l9J08
7198B9m4p8M6o3R1J3L4Mm4m6J00O0j70L3n4J75j71L9O0J8j07qJ11o2PK2L4p6J06
7227E9m2K2K4p4Q9j67M5M2np2N8O7j48J63m8j8J8M3j43R6N0m3m8P2o5j6L2N5J2
7256E8q6P1q6P9l0M3l3K2M9o4q7J34r1KN4r6o2J92j20Q4k5j3J16j62PL5k0n3K7
$$ [...]
8191c6
##END NTUPLES=NMR FID
##END=
