##TITLE=1H_AM_NVG3
 DMSO
 8 sc, 
 8.9.2023
##JCAMPDX= 6.0         $$ Bruker NMR JCAMP-DX V2.0
##DATA TYPE= NMR FID
##DATA CLASS= NTUPLES
##ORIGIN= UXNMR, Bruker Analytische Messtechnik GmbH
##OWNER= root
$$ XWIN-NMR		Version 3.5
$$ Fri Sep  8 13:49:32 2023 Russian Standard Time (UT+4h)  she@DPX200
##.OBSERVE FREQUENCY= 200.13135
##.OBSERVE NUCLEUS= ^1H
##.DELAY= (6, 6)
##.ACQUISITION MODE= SIMULTANEOUS
##.ACQUISITION SCHEME= undefined
##.AVERAGES= 8
##.DIGITISER RES= 18
##SPECTROMETER/DATA SYSTEM= spect
##.PULSE SEQUENCE= zg30
##.SOLVENT NAME= DMSO
##.SHIFT REFERENCE= (INTERNAL, DMSO, 0, 15.7039)
##AUDIT TRAIL= $$ (NUMBER, WHEN, WHO, WHERE, WHAT)
$$ ##TITLE= Audit trail, XWIN-NMR		Version 3.5
$$ ##JCAMPDX= 5.01
$$ ##ORIGIN= Bruker BioSpin GmbH
$$ ##OWNER= she
$$ F:/spectra/data/she/nmr/H-F/1/audita.txt
$$ ##AUDIT TRAIL=  $$ (NUMBER, WHEN, WHO, WHERE, WHAT)
(   1,<2023-09-08 13:48:39.64 +0400>,<she>,<DPX200>,
      <created by zg, POWCHK disabled, PULCHK disabled
       configuration hash MD5:
       00 E9 B6 7A A2 85 ED C7 34 08 36 98 17 FE 4E 26
       data hash MD5: 16K
       1C ED E1 E4 50 CF A6 62 3E C5 99 95 58 1D 39 00>)
$$ ##END=
$$ 
$$ hash MD5
$$ 60 04 EA C0 F9 E9 ED 87 F9 DB 6A 1F CC 2D 66 ED
##$RELAX= 
##$RELAX= 
##$RELAX= 
##$RELAX= 
##$RELAX= 
##$RELAX= 
$$ Bruker specific parameters
$$ --------------------------
##$DU= <F:/spectra>
##$EXPNO= 1
##$NAME= <H-F>
##$PROCNO= 1
##$TYPE= <nmr>
##$USER= <she>
##$AMP= (0..31)
100 100 100 100 100 100 100 100 100 100 100 100 100 100 100 100 100 100 
100 100 100 100 100 100 100 100 100 100 100 100 100 100 
##$AQSEQ= 0
##$AQ_mod= 1
##$AUNM= <au_zg>
##$AUTOPOS= <>
##$BF1= 200.13
##$BF2= 200.13
##$BF3= 200.13
##$BF4= 200.13
##$BF5= 200.13
##$BF6= 200.13
##$BF7= 200.13
##$BF8= 200.13
##$BYTORDA= 1
##$CFDGTYP= 0
##$CFRGTYP= 5
##$CHEMSTR= <none>
##$CNST= (0..31)
1 1 145 1 1 1 1 1 1 1 1 1 1 1 1 1 1 1 1 1 1 1 1 1 1 1 1 1 1 1 1 1 
##$CPDPRG= <>
##$CPDPRG1= <>
##$CPDPRG2= <>
##$CPDPRG3= <>
##$CPDPRG4= <mlev>
##$CPDPRG5= <mlev>
##$CPDPRG6= <mlev>
##$CPDPRG7= <mlev>
##$CPDPRG8= <mlev>
##$CPDPRGB= <>
##$CPDPRGT= <>
##$D= (0..31)
0 1.2 0 0 0 0 0 0 0 0.06 0 0.03 0 0 0 0 0.0002 0 0 0 0 0 0 0 0 0 0 0 0 
0 0 0 
##$DATE= 1694166519
##$DBL= (0..7)
120 120 120 120 120 120 120 120 
##$DBP= (0..7)
150 150 150 150 150 150 150 150 
##$DBP07= 0
##$DBPNAM0= <>
##$DBPNAM1= <>
##$DBPNAM2= <>
##$DBPNAM3= <>
##$DBPNAM4= <>
##$DBPNAM5= <>
##$DBPNAM6= <>
##$DBPNAM7= <>
##$DBPOAL= (0..7)
0.5 0.5 0.5 0.5 0.5 0.5 0.5 0.5 
##$DBPOFFS= (0..7)
0 0 0 0 0 0 0 0 
##$DE= 6
##$DECBNUC= <off>
##$DECIM= 32
##$DECNUC= <off>
##$DECSTAT= 4
##$DIGMOD= 1
##$DIGTYP= 9
##$DL= (0..7)
0 120 120 120 120 120 120 120 
##$DP= (0..7)
150 150 150 150 150 150 150 150 
##$DP07= 0
##$DPNAME0= <>
##$DPNAME1= <>
##$DPNAME2= <>
##$DPNAME3= <>
##$DPNAME4= <>
##$DPNAME5= <>
##$DPNAME6= <>
##$DPNAME7= <>
##$DPOAL= (0..7)
0.5 0.5 0.5 0.5 0.5 0.5 0.5 0.5 
##$DPOFFS= (0..7)
0 0 0 0 0 0 0 0 
##$DQDMODE= 0
##$DR= 18
##$DS= 0
##$DSLIST= <SSSSSSSSSSSSSSS>
##$DSPFIRM= 0
$$ [...]
##$SUBNAM2= <"">
##$SUBNAM3= <"">
##$SUBNAM4= <"">
##$SUBNAM5= <"">
##$SUBNAM6= <"">
##$SUBNAM7= <"">
##$SUBNAM8= <"">
##$SUBNAM9= <"">
##$SW= 18.05172834244
##$SWIBOX= (0..15)
0 0 2 0 0 0 0 0 0 0 0 0 0 0 0 0 
##$SW_h= 3612.71676300578
##$TD= 16384
##$TD0= 1
##$TE= 0
##$TE2= 300
##$TE3= 300
##$TEG= 300
##$TL= (0..7)
0 120 120 120 120 120 120 120 
##$TP= (0..7)
150 150 150 150 150 150 150 150 
##$TP07= 0
##$TPNAME0= <>
##$TPNAME1= <>
##$TPNAME2= <>
##$TPNAME3= <>
##$TPNAME4= <>
##$TPNAME5= <>
##$TPNAME6= <>
##$TPNAME7= <>
##$TPOAL= (0..7)
0.5 0.5 0.5 0.5 0.5 0.5 0.5 0.5 
##$TPOFFS= (0..7)
0 0 0 0 0 0 0 0 
##$TUNHIN= 0
##$TUNHOUT= 0
##$TUNXOUT= 0
##$USERA1= <user>
##$USERA2= <user>
##$USERA3= <user>
##$USERA4= <user>
##$USERA5= <user>
##$V9= 5
##$VALIST= <valist>
##$VCLIST= <CCCCCCCCCCCCCCC>
##$VD= 0
##$VDLIST= <DDDDDDDDDDDDDDD>
##$VPLIST= <PPPPPPPPPPPPPPP>
##$VTLIST= <TTTTTTTTTTTTTTT>
##$WBST= 1024
##$WBSW= 4
##$XGAIN= (0..3)
0 0 0 0 
##$XL= 0
##$YL= 0
##$YMAX_a= 259091
##$YMIN_a= -43564
##$ZGOPTNS= <>
##$ZL1= 120
##$ZL2= 120
##$ZL3= 120
##$ZL4= 120
##$ABSF1= 10
##$ABSF2= 0
##$ABSG= 5
##$ABSL= 3
##$ALPHA= 0
##$AQORDER= 0
##$ASSFAC= 0
##$ASSFACI= 0
##$ASSFACX= 0
##$ASSWID= 0
##$AUNMP= <proc_1d>
##$AZFE= 0.1
##$AZFW= 0.1
##$BCFW= 1
##$BC_mod= 2
##$BYTORDP= 1
##$COROFFS= 0
##$CY= 11.3945322036743
##$DATMOD= 1
##$DC= 2
##$DFILT= <>
##$DTYPP= 0
##$F1P= 15.7292609196834
##$F2P= 12.9074282941183
##$FCOR= 0.5
##$FTSIZE= 0
##$FT_mod= 4
##$GAMMA= 1
##$GB= 0.15
##$INTBC= 1
##$INTSCL= 1
##$ISEN= 128
##$LB= 0.24
##$LEV0= 0
##$LPBIN= 0
##$MAXI= 10000
##$MC2= 0
##$MEAN= 0
##$ME_mod= 0
##$MI= 1.114404
##$NCOEF= 0
##$NC_proc= 0
##$NLEV= 6
##$NOISF1= 3.799351
##$NOISF2= 2.8
##$NSP= 1
##$NTH_PI= 0
##$NZP= 0
##$OFFSET= 15.70392
##$PC= 1
##$PHC0= -21557.34
##$PHC1= 8.65271
##$PH_mod= 1
##$PKNL= yes
##$PPARMOD= 0
##$PSCAL= 0
##$PSIGN= 0
##$REVERSE= no
##$SF= 200.130013532006
##$SI= 16384
##$SIGF1= 3
##$SIGF2= 2
##$SINO= 400
##$SIOLD= 16384
##$SREGLST= <1H.CDCl3>
##$SSB= 0
##$STSI= 0
##$STSR= 0
##$SW_p= 3612.71676300578
##$SYMM= 0
##$S_DEV= 0
##$TDeff= 0
##$TDoff= 0
##$TI= <>
##$TILT= no
##$TM1= 0
##$TM2= 0
##$TOPLEV= 0
##$USERP1= <user>
##$USERP2= <user>
##$USERP3= <user>
##$USERP4= <user>
##$USERP5= <user>
##$WDW= 1
##$XDIM= 8192
##$YMAX_p= 0
##$YMIN_p= 0
$$ End of Bruker specific parameters
$$ ---------------------------------
##NTUPLES= NMR FID
##VAR_NAME=  TIME,          FID/REAL,        FID/IMAG
##SYMBOL=    X,             R,               I
##VAR_TYPE=  INDEPENDENT,   DEPENDENT,       DEPENDENT
##VAR_FORM=  AFFN,          ASDF,            ASDF
##VAR_DIM=   8192,          8192,            8192
##UNITS=     SECONDS,       ARBITRARY UNITS, ARBITRARY UNITS
##FACTOR=    0.0002768,     1,               1
##FIRST=     0,             0,               0
##LAST=      2.2672688,     0,               0
##MIN=       0,             -43564,          0
##MAX=       2.2672688,     259091,          0
$$ Real data points
##PAGE= N=1
##DATA TABLE= (X++(R..R)), XYDATA
0 0 0 0 0 0 0 0 0 0 0 0 0 0 -8 8 -8 8 -16 16 -16 24 -24 32 -40 42 -50 60 -72 80 -93 105 -120 137 -156 177
34 177 -200 225 -252 282 -315 350 -390 433 -479 532 -588 648 -717 790 -870 957 -1054 1162
52 1162 -1282 1414 -1564 1732 -1926 2149 -2407 2716 -3089 3549 -4135 4907 -5982 7572 -10175
67 -10175 15153 -28088 132112 259091 -34668 48063 181478 77396 4938 110829 115178
78 115178 56490 50305 73126 51427 57323 60473 29226 25771 60651 33398 4991 24140 35470
91 35470 15900 5024 6204 21402 13537 -8284 611 18632 2750 -9353 2075 11031 296
104 296 -8912 2363 11586 -4118 -10215 6913 9307 -8027 -9438 4608 6578 -8924 -14700 1028
118 1028 7257 -13313 -21661 169 7312 -16341 -23713 -1758 6233 -12730 -22837 -4680 10228
131 10228 -7337 -23965 -3042 15206 -5614 -21423 -780 14046 -2034 -14956 -3288 10634
143 10634 3415 -11574 -5981 10554 5672 -10034 -5146 8981 6197 -5143 -4616 5123 7583 -895
157 -895 -5494 2726 7725 -967 -5419 2062 4558 -1884 -4120 -22 1592 -1847 -3198 -966 -693 -2256
173 -2256 -1123 433 -1242 -3184 11 3475 -857 -4945 1480 6155 -1883 -6387 3190 7363 -2928
188 -2928 -6748 2499 6853 -1028 -6910 -454 7580 1360 -7895 -795 8556 1166 -6798 -105 6763
203 6763 2223 -3709 -2321 3602 4917 -2217 -5323 2222 4795 -2496 -4817 515 2943 -433 -4360
218 -4360 -2389 3322 2085 -4452 -3213 3651 2765 -2902 -1946 2334 2171 -464 -1262 452 2233 747
234 747 -1279 -384 1019 1332 337 -2112 -1049 2720 1760 -2796 -2306 2739 3105 -2358 -3354 2478 4166
251 4166 -2204 -4372 2343 4963 -2247 -4950 1429 4212 -1037 -4263 -386 3273 282 -3756 -1052
266 -1052 2807 923 -2584 -1651 1746 2194 -950 -2347 235 2812 565 -2313 -782 2301 1284 -1808
282 -1808 -1405 1921 1929 -1735 -1884 1841 2031 -1192 -1596 496 1281 260 -639 -776 197 982 356 -1080
300 -1080 -669 1285 1148 -1491 -1701 1965 2528 -2186 -3030 2163 3477 -1856 -3536 1547 3767 -1296
316 -1296 -3660 1139 3698 -867 -3502 370 3567 223 -3280 -542 2837 1034 -2155 -1480 1639
331 1639 1539 -1163 -1755 623 1856 -232 -2500 -428 2564 608 -2684 -1161 2409 1365 -2197 -1269
347 -1269 1884 1232 -1410 -990 1614 1414 -974 -957 1157 1107 -292 -529 185 188 118 300 -270 -1170 153
366 153 1151 -783 -1652 708 1404 -1217 -1683 928 1836 -806 -2099 471 2085 -102 -2107 -160 1716
383 1716 45 -1674 -212 929 226 -898 -976 363 1210 -13 -1548 -284 1996 1065 -1444 -586 2037
400 2037 1713 -1326 -1228 1989 2009 -1725 -1936 1695 1995 -1855 -2450 921 1509 -1456 -2099 481 1045 -816
418 -816 -1350 106 1008 28 -888 -374 830 753 -239 -678 -17 794 445 -843 -834 767 725 -1080 -991 1138
438 1138 782 -1136 -586 1372 1230 -514 -446 1067 920 73 218 510 57 -65 342 152 -651 -216 478
457 478 -780 -1379 147 684 -1039 -1734 294 1323 -573 -1719 384 1461 -127 -1370 512 1571
473 1571 -211 -1255 181 1197 42 -853 -421 507 630 -139 -697 -41 1091 467 -825 36 1439
490 1439 821 -698 -446 1715 1332 -1221 -1216 1472 1170 -1549 -1454 887 551 -1795 -1389 759 430 -1549
508 -1549 -1264 491 523 -854 -634 521 233 -387 213 523 -98 -138 603 243 -270 233 570 -442 -475 596
528 596 532 -485 -455 412 490 22 -60 385 345 135 244 521 312 -30 300 166 -564 -164 406 -573 -1391 -158
550 -158 733 -926 -1666 51 799 -698 -1333 320 1120 -489 -1127 659 1422 -162 -940 555 1165 -30
568 -30 -462 262 489 -120 -233 175 262 73 -52 -156 70 498 304 -370 -294 688 717 -314 -432 690 513
589 513 -646 -616 712 269 -1371 -673 700 -42 -1335 -532 476 -362 -846 126 647 -375 -725 456
607 456 796 25 -187 640 643 -311 66 818 282 -566 -38 667 151 -491 -135 370 -68 -299 211 270 -223
628 -223 -106 299 71 -66 329 1 -540 -185 588 -170 -936 -268 570 -328 -1075 -19 565 -543 -1084 258
648 258 817 -250 -952 259 1088 -145 -555 563 745 -327 -396 657 581 -519 -238 540 233 -304 -150
667 -150 55 -85 -120 171 160 -254 -137 313 43 -134 291 205 -385 -267 550 154 -608 -165 490 -214 -646
688 -646 164 419 -482 -772 260 554 -337 -740 368 800 -365 -555 744 749 -688 -391 1035 587 -657
707 -657 -280 665 277 -465 -33 424 -97 -423 48 210 43 -349 -115 209 -15 -26 122 -256 -228 246 335
728 335 -323 -166 366 -21 -557 156 638 -284 -645 144 720 -254 -513 379 539 -410 -419 700 501 -664
748 -664 -323 854 474 -694 -142 636 31 -475 69 676 -60 -624 64 533 -28 -440 -48 234 -202 -236
768 -236 74 -18 -233 -28 116 -91 9 196 -146 -330 167 540 -184 -559 239 449 -292 -369 376 402 -642
789 -642 -330 697 410 -681 -533 678 293 -485 -155 592 45 -580 128 605 -38 -566 122 340 -99
808 -99 -427 78 334 -328 -284 378 56 -428 17 313 -25 -10 164 48 -280 79 425 -52 -223 219 288 -148
830 -148 -214 272 263 -483 -446 501 377 -612 -456 536 95 -760 -94 774 -121 -818 53 764 103 -595 126 611
852 611 71 -251 185 443 -243 -410 275 359 -235 -208 189 -108 -163 165 282 -154 1 224 76 -175 150
873 150 280 -164 -220 267 253 -265 -404 211 246 -324 -350 264 52 -630 -123 581 -168 -712 107 549 -174 -371
895 -371 315 461 -208 -330 469 473 -259 -331 210 525 -254 -241 217 93 -251 3 305 -1 -160 70 1 52
917 52 118 157 -129 -239 253 386 -308 -340 256 293 -515 -185 387 88 -739 -239 544 -99 -673 -75 504 54
939 54 -314 203 482 -130 -306 369 496 -253 -234 337 262 -148 -131 471 -55 -444 77 364 -7 -375 30 159
961 159 -25 -102 223 26 -207 -18 262 97 -241 -48 27 -256 -39 209 -140 -543 13 417 -217 -641 92
982 92 386 -279 -246 370 565 -203 -420 397 620 -135 -462 382 462 -238 -176 532 282 -533 -174 356 -30 -269
1004 -269 -33 119 -154 -8 150 4 -234 152 198 -69 -59 131 168 -191 -236 304 68 -471 -216 211 92
1025 92 -475 -41 243 -214 -381 287 313 -216 -298 269 330 -190 -125 387 174 -445 -45 615 2 -564 -5 533
1047 533 7 -402 86 306 -258 -270 183 244 -154 -246 23 199 -26 -39 16 -155 -108 128 69 -261 -95 153
1069 153 -102 -350 56 350 -191 -401 245 464 -294 -379 297 368 -243 -248 524 306 -321 -180 453 225 -306
1090 -306 -185 318 74 -315 44 150 -148 -376 197 271 -201 -117 123 63 -121 -12 269 -64 -397 165 284
1111 284 -133 -178 88 40 -199 59 294 -88 -320 86 252 -110 -7 232 169 -208 3 429 49 -449 -52
1132 -52 501 166 -386 67 409 -110 -374 148 313 -273 -399 70 278 -175 -277 89 115 -117 -188 250 57
1153 57 -287 -41 210 -49 -120 227 65 -266 84 351 -81 -295 71 255 -234 -156 151 191 -278 -150 328
1174 328 243 -309 -183 274 235 -382 -60 436 -73 -476 68 459 -203 -306 179 236 -183 -220 227 117 -341
1195 -341 -214 335 112 -325 -91 265 39 -109 47 17 -188 -59 217 -1 -214 90 223 -90 -101 160 141
1216 141 -197 -141 207 175 -314 -264 318 118 -247 -50 289 -84 -432 187 433 -156 -332 135 203 -123 -223
1237 -223 259 143 -245 -99 282 208 -236 -55 155 -75 -196 173 167 -204 -27 200 105 -95 -91 90 -44 -147
1259 -147 41 234 -293 -111 105 169 -173 -167 266 -79 -397 114 446 -154 -468 103 500 -53 -279 128 274
1280 274 -222 -246 230 307 -222 -276 266 187 -234 -84 312 44 -312 130 210 -129 -116 188 137 -96 58 193
1302 193 25 -41 67 72 -30 -235 18 52 -230 -202 70 15 -361 -88 177 22 -273 36 131 -32 -121 163 205
1325 205 -110 -214 292 190 -150 -165 141 118 -299 55 376 26 -363 -114 261 -31 -245 -16 128 -116 -55
1346 -55 59 28 -76 58 162 -129 -73 17 -46 -111 -41 228 -39 -329 -93 310 32 -290 23 341 -136 -300
1368 -300 189 290 -107 -173 192 147 -110 -138 212 65 -178 -107 189 -21 -363 -57 319 -105 -155 69 155 -147
1390 -147 -125 97 124 -150 -121 124 47 -131 -14 127 -32 -93 -36 134 -188 -150 137 23 -82 -3 181 -112 -139
1413 -139 266 326 -211 -173 314 132 -158 -68 277 195 -272 -99 329 60 -414 -119 199 -93 -224 131 130 -197
1435 -197 -134 18 21 -5 -70 174 155 -82 -35 135 -122 -144 170 159 -211 -119 69 23 -198 -3 234 -38 -251 216
1459 216 261 -64 -7 55 102 -245 25 240 -46 -322 -62 353 78 -283 -28 264 -50 -368 87 222 -179
1480 -179 -218 141 132 -181 -127 131 132 -98 -35 162 -36 -120 112 111 -108 -185 38 99 -131 78 166 -122 -142 81 218
1505 218 -236 -105 136 228 -176 8 230 176 -118 -203 117 88 -145 -101 103 4 -180 -7 145 -181 -184 155 136
1528 136 -246 -15 88 29 -136 -39 274 -176 -173 20 222 36 -149 103 279 -190 -195 206 -95 -115 -12 107
1550 107 62 -107 -25 47 -128 120 188 112 -162 3 220 66 -213 -22 192 -153 -299 137 189 -151 -287 107
1572 107 174 -225 -216 32 110 -139 -143 160 61 -124 93 165 21 -29 140 48 -121 57 174 86 -133 36 128 -123
1596 -123 -141 196 64 -219 -129 199 188 -183 -140 127 90 -64 -25 138 19 -265 3 110 -102 -175 39 23 -176
1619 -176 37 194 -84 -93 45 213 42 -224 -64 321 -87 -191 65 244 -234 -183 186 135 -80 -180 183
1640 183 7 -24 -73 131 -19 -46 7 -18 -72 -32 86 -55 -121 9 214 -70 -273 150 236 -59 -321 117 231
1663 231 -294 -161 240 164 -163 -211 79 190 -98 -127 96 74 -111 20 79 -77 -144 3 27 -91 44 128 -37
1686 -37 -124 68 142 -151 -233 93 149 -101 -193 101 213 -98 -176 143 152 -109 -34 126 77 -92 72 122 -80 -44
1710 -44 72 67 -94 -93 121 -77 -174 139 106 -85 -230 115 291 -105 -314 133 291 -218 -171 238 59 -69 -168
1733 -168 42 76 -108 -18 47 165 82 -74 -42 -70 -13 149 -92 -80 60 157 -152 -240 223 178 -148 -178 199 213
1757 213 -146 -185 154 163 -121 -114 100 120 -87 -129 6 33 -73 33 77 35 64 126 -174 -108 104 192 -69 -139 21
1782 21 66 -141 -104 121 170 -202 -197 147 201 -142 -101 159 109 0 14 125 -45 19 1 -3 -47 32 2 -93 -89 206 125
1809 125 -173 -267 185 229 -137 -214 136 148 -296 -236 252 210 -106 -245 184 265 -48 -139 19 175 -135 -77 -114
1832 -114 69 -32 104 -78 -94 188 137 -137 -75 199 258 -166 -204 186 194 -142 -119 156 142 -180 -223 194 266 -234
1856 -234 -289 137 118 -178 -13 40 -3 30 -49 -43 -87 78 65 -188 -105 180 162 -101 -109 189 215 -165 -174 202 178 -119
1882 -119 -212 6 171 -96 -87 144 77 -67 -105 3 84 159 5 -77 -163 100 103 -185 -165 124 99 -201 -144 159 234
1907 234 -158 -315 141 283 -140 -234 133 239 -38 -88 116 131 49 -117 62 94 109 74 -46 -91 86 9 -61
1930 -61 -206 221 189 -215 -209 207 235 -138 -164 169 162 -168 -256 116 203 -175 -167 103 105 -100 -91 127 -36 -17 86 -66
1956 -66 -45 47 76 -78 -42 239 250 -213 -226 115 228 -86 -217 68 191 -227 -199 124 143 -80 -127 99 137 88
1980 88 -42 77 41 25 -46 -135 -21 20 -36 -241 -38 164 47 -178 -241 208 196 -86 -230 161 167 -201 -195 139
2004 139 190 -86 -86 114 201 -101 -115 13 139 68 -40 -70 11 19 233 -86 -263 47 77 -120 -189 168 66 -107
2028 -107 -160 92 102 -43 -147 86 164 -118 -201 6 214 -107 -79 115 89 -57 39 90 61 87 162 -155 -101 106
2052 106 161 -178 -138 46 77 -232 -119 159 159 -181 -260 110 219 -83 -210 69 116 -16 -111 44 24 0 -130
2075 -130 12 99 57 74 -69 -57 101 38 -10 -113 90 165 -21 -76 66 148 -102 -154 163 170 -184 -66 36 174
2099 174 -156 -8 28 54 -94 -33 22 -81 35 -7 -47 -146 122 37 -165 -74 131 170 -54 -174 104 186 -113 -65
2123 -65 132 159 -125 -113 107 173 -13 -89 33 83 0 85 68 -41 55 57 -77 6 36 103 -83 -76 113 78 -81 -172
2149 -172 72 116 -154 -135 122 61 -135 -157 99 65 -144 -17 59 116 -97 10 42 31 38 17 38 -57 119 77 -48
2174 -48 -125 76 161 -50 2 188 122 -202 -104 100 129 -58 -59 135 91 -197 -68 117 28 -98 -141 61 27 8 -87
2199 -87 11 -147 -13 112 31 -149 -15 62 14 -51 152 88 -115 -122 68 86 -87 -169 144 115 -129 -126 10 44 -96
2224 -96 -44 129 34 -83 -5 -23 46 85 97 -56 -18 80 70 -86 -173 45 156 -93 -39 110 112 -169 -150 190 44
2249 44 -106 -134 -10 33 -66 -5 119 93 -19 46 178 25 48 73 3 -126 -37 73 61 -128 155 118 21 -57 68
2274 68 60 -47 -99 178 51 -113 -155 89 -2 -87 -111 96 29 -13 -53 -32 2 -60 28 -20 -5 73 89 -87 -13 26 85
2301 85 -118 -131 -11 113 -36 -125 123 84 -192 -58 110 131 -54 -109 29 25 -63 51 117 66 -33 20 16 -133 19
2326 19 26 -17 -95 75 48 -1 -129 1 168 -114 -146 24 182 -102 23 105 9 -21 -24 45 45 -109 41 49 2 -43 37
2353 37 72 -41 49 77 3 -122 -31 -8 -143 -126 37 72 -163 -156 -20 116 -103 -31 4 100 46 -26 92 65 -83 9
2379 9 101 -26 -43 -47 60 -64 17 163 54 -52 85 132 -22 -24 39 138 -57 -81 -15 25 -43 -44 102 -6 -52 -148 -24
2406 -24 39 -119 -67 -56 -25 -10 71 -35 -41 -15 78 -51 -64 60 25 -99 -18 101 136 -16 -140 -51 22 -106 -95 110
2432 110 64 -77 -93 27 15 -24 3 69 -32 -64 86 123 -23 -18 85 49 -54 -75 26 -49 -135 94 116 10 -36
2457 -36 0 38 72 -77 89 79 -18 -10 101 37 -62 -64 82 9 -30 69 -33 -134 -154 105 -64 -142 -74 68 -84 -105
2483 -105 56 79 33 24 3 156 27 -50 100 91 -110 -8 67 -40 -153 -65 54 70 -67 31 11 46 -128 121 87
2508 87 -190 -3 29 22 -39 22 48 69 51 38 124 -42 -90 22 114 35 -90 33 -32 1 92 -1 -150 -57 99 -41
2534 -41 43 -44 -67 42 -76 66 83 -5 -67 -26 75 29 -95 -17 -18 -101 -21 43 -24 31 -5 103 46 -21 28 80 56 21
2562 21 68 194 -107 -96 -21 23 -26 -42 17 -33 -124 9 69 -64 -108 13 88 -2 22 62 -49 -21 -95 77 59 -118
2588 -118 -46 90 -5 -128 -10 -4 -106 -20 59 94 -52 -60 121 83 -103 -9 114 64 -154 50 115 -11 -76 53 -14
2613 -14 -72 -74 73 29 -33 -156 -11 -1 -92 5 63 79 -33 134 44 -23 -35 17 66 -130 -32 31 -37 -10 -24 -43 9 -49
2641 -49 -33 12 -31 -23 -41 -52 -46 -41 21 -33 -71 -33 127 -8 -89 39 -71 64 -41 22 1 -27 6 53 57 -123 11 67
2669 67 -41 -110 74 25 -12 -50 100 61 -85 -56 97 10 51 -10 67 -23 -13 125 116 52 34 -31 33 15 -27 124 91
2696 91 -3 -32 -45 -20 29 22 132 -85 -42 33 -12 -43 -43 44 134 -100 4 81 -9 33 127 127 -40 -121 79 96 -73 -28
2724 -28 170 78 -175 -1 70 -57 -107 100 0 39 59 108 11 -37 -33 28 45 -13 -61 91 -30 -24 29 -1 9 -78 11
2751 11 7 -33 -41 -28 22 3 39 21 -27 -11 -36 25 -13 20 29 -1 -78 -14 -6 -7 -102 42 87 -18 15 74 61 11 2 33 21 -33
2783 -33 -130 37 35 -38 51 53 47 -91 -7 51 -110 -31 97 32 -134 22 92 -38 -106 100 57 61 -89 -107 47 -39 16
2810 16 113 -20 -82 26 -8 29 -51 1 15 -36 5 -77 -3 -123 -36 31 -12 -8 -51 59 15 -65 -103 18 -44 55 42 64
2838 64 -14 -121 -120 45 -51 16 -2 9 -89 -6 -68 73 -85 -41 -55 -77 78 -19 130 -105 39 13 -3 -75 -67 139 -28
2865 -28 -66 -14 173 -98 -2 56 43 -23 -99 16 -18 -31 -6 21 -81 -32 -9 51 1 -109 62 82 -52 -19 71 74 -111
2892 -111 7 108 43 -134 1 52 -101 -108 29 -39 -59 -7 41 -3 -14 -63 -67 -46 -90 42 67 -4 29 -17 20 -31 -51
2919 -51 -24 50 44 54 3 -8 25 -21 65 99 -143 -9 -45 -9 -4 78 29 -29 12 -44 66 35 -26 134 32 -64 -132 65
2947 65 -44 -65 -72 -2 -42 63 115 -14 -49 -61 85 -32 -32 34 128 62 9 -11 1 -32 -43 18 4 73 -54 75 29 -22
2975 -22 -30 122 -70 -21 41 -96 -55 19 34 -16 -109 66 81 38 -78 -105 23 -76 30 52 19 4 38 -14 12 -8 39
3002 39 81 4 0 22 -20 83 -67 39 98 -45 -47 33 69 78 -20 135 -23 -83 55 13 50 -21 54 89 -36 -66 198
3029 198 6 -63 -9 85 36 -52 -31 117 -73 -66 -78 97 -30 -27 -3 63 -39 -101 142 -16 -77 -17 -4 11 -34 63 17
3056 17 -29 -41 132 72 -75 107 28 -56 -89 55 26 -5 -83 -22 11 30 19 25 -80 31 -16 18 41 -110 11 -83 -59
3083 -59 -30 -83 -71 -18 -153 90 14 -111 -67 133 -17 42 18 4 77 19 11 -6 -68 -50 9 33 3 57 104 -3 -54 -3
3111 -3 -13 55 29 49 49 -64 -34 46 30 -44 -103 -58 -8 -85 37 -8 106 -55 11 19 -136 -77 -6 21 -92 -106 30 -5
3139 -5 -13 55 116 21 -121 -100 -8 43 43 11 -20 -75 2 34 121 -34 -34 64 -4 -29 -99 -61 1 -17 8 -107 114 -15 22 1
3169 1 25 -41 23 -25 29 -67 -8 19 -61 18 52 78 3 51 -5 -56 46 41 44 37 73 33 39 -8 -3 2 -74 -22 18 -3 -74 -30 88
3202 88 -23 3 67 33 -24 -22 25 77 -102 -66 150 -8 -7 38 33 -34 -24 -25 90 35 1 37 -14 -31 75 7 3 -40 90
3231 90 52 79 -20 -4 33 50 42 -79 101 -16 -101 -2 -61 -4 -27 20 72 -33 5 31 -103 -31 16 73 54 -96 33
3258 33 -61 -34 76 100 -89 18 51 103 -3 -10 -64 -89 30 3 86 -11 9 -21 -62 110 -81 15 30 -36 0 17 130
3285 130 -69 19 -82 32 -83 35 21 -66 52 27 17 -36 -7 8 -23 -21 -61 -1 41 32 70 139 14 -27 64 14 12 -90
3313 -90 60 62 -35 -76 -2 86 -29 0 26 -20 -14 -40 -12 -17 -50 67 -51 -73 55 -64 -33 32 22 -60 -86 46 19 46
3341 46 -85 -38 17 60 -51 5 35 -21 -20 46 78 66 -44 28 20 -15 -16 43 96 -30 23 49 7 -58 -82 30 -84 35
3369 35 27 -15 62 -67 55 -22 -8 -27 -13 35 116 -84 29 66 48 -98 -22 58 -78 -38 14 82 -95 122 4 43
3395 43 -33 40 56 7 -6 49 95 -112 11 -58 12 109 -61 45 -3 42 59 28 22 -117 -1 -57 -98 2 -46 -5 -24
3422 -24 120 2 -81 -49 101 -35 -64 33 -8 -37 -2 -51 -13 35 -29 -8 -10 59 -31 57 47 -26 -15 -33 60 -14 58 -40 -58
3451 -58 -101 -119 53 69 -185 32 -56 -37 -40 51 -46 -119 -51 33 -67 26 -45 -96 -55 -26 23 -12 -7 -162 -10 -99 -45 -14
3479 -14 7 -93 57 45 65 -99 -29 23 -20 10 -35 22 3 -117 55 67 -53 -82 40 7 -18 72 18 -7 -139 21
3505 21 34 -3 -12 50 -30 54 21 9 69 -12 -3 18 126 -19 18 35 -1 58 -46 -56 16 -29 51 80 -130 15 -35 -12 -5
3534 -5 -58 23 -89 -77 -18 -47 14 41 -65 39 89 -62 -40 102 -26 -43 53 20 -77 -38 62 -6 69 -74 58 -15
3560 -15 -39 41 28 16 58 56 -50 -7 9 -78 -25 -43 48 15 -19 -2 -67 -6 77 27 84 -1 -33 -82 96 -15 -14 -25 18 -100
3590 -100 -109 -41 -91 -46 -74 20 90 -27 105 43 -71 -26 -99 56 -19 -44 21 68 -31 -34 -26 68 -48 89 76 -33 -67 -34
3618 -34 -24 -4 -38 13 -33 -22 10 -32 49 -43 58 70 31 -67 -51 0 1 -60 8 30 -117 -8 -27 -57 27 7 79 -44 67
3647 67 25 1 10 -163 -78 16 -47 -14 -118 -47 13 -1 35 -12 -43 -34 -87 39 92 16 -91 -103 65 64 -46 -21 -1 -33 79
3676 79 -100 -23 -120 33 -3 7 90 37 -41 9 -25 -89 -14 58 150 12 -47 112 88 17 29 44 -28 10 -14 -22 22 -119
3704 -119 -14 60 43 37 33 130 -23 20 122 -8 20 -10 51 -56 -109 -13 125 -3 79 76 -13 -97 12 -17 24 -41 -99
3731 -99 -64 -63 6 74 101 31 72 -72 1 24 21 -34 40 11 86 -21 12 -45 40 -58 61 26 -150 -71 77 19 29 -43 6
3760 6 -50 -48 -58 -50 -73 25 72 60 23 3 40 53 66 -136 9 -13 10 17 53 -91 118 -63 -33 -71 -53 15 -58 -5 -52 17
3790 17 -58 73 5 -16 -7 22 17 -17 -28 20 76 39 -14 -47 -19 -7 49 -8 62 63 75 -28 6 46 86 -17 25 37 -118 55
3820 55 18 53 68 -78 25 94 -37 -30 -61 21 -6 -44 -12 -53 -31 40 26 -99 29 90 -26 -4 71 27 25 -94 14
3847 14 61 -30 39 -9 -67 -49 10 52 29 -26 97 16 -66 16 2 -32 -93 -46 135 11 80 19 19 15 -35 -5 -19 8 -43 9
3877 9 53 -112 10 58 16 -13 47 -79 -5 20 60 65 58 -20 53 -21 -10 70 -8 -1 46 7 -34 76 -12 25 34 83 41 15 8
3908 8 38 -74 65 95 -19 50 14 -38 -57 -15 65 -62 17 3 81 -3 -50 -98 47 10 -40 75 -105 -83 -16 -84 108
3935 108 46 -84 108 -24 65 39 59 14 103 91 -7 60 89 65 -81 143 67 6 1 -122 13 -52 16 -63 72 -50
3961 -50 -35 -52 22 31 5 38 78 23 -62 20 46 -94 -54 102 -29 -6 68 -56 -12 9 -74 71 -6 63 -7 44 107 31
3989 31 47 -73 -52 -17 63 -53 -154 -101 28 15 79 15 -10 15 1 -12 -53 48 -1 -38 43 10 -12 -78 90 9 38
4016 38 57 -15 0 -14 11 -34 33 28 -12 82 -9 40 -38 -39 -8 -79 -42 -3 15 30 84 51 -5 20 14 42 27 -30 70 -24 -15 73
4048 73 -224 -59 -20 -149 115 -5 -71 -93 -24 45 34 17 0 -6 78 12 -63 3 -35 59 -50 74 140 -70 86 -4
4074 -4 12 26 49 69 -100 52 -5 -24 17 53 -3 -30 -15 -99 -21 -99 -56 126 70 -25 24 -41 17 -18 60 63 -43 -43 85
4103 85 44 -73 -48 3 18 35 -25 -17 4 -72 -42 10 -47 21 -24 -8 65 -66 29 -36 6 -21 30 -100 -83 -1 -58 -7 86
4132 86 -9 56 -47 -11 29 -4 -143 106 84 76 -105 54 58 6 -89 -18 -79 -16 10 103 10 85 43 50 13 -43 -26 -43 -122
4161 -122 -4 34 57 73 32 32 -26 18 -36 6 43 -158 -12 -30 4 -7 -11 70 0 -67 8 -12 -37 8 -52 -37 -37 66 -39
4190 -39 62 -29 9 -67 -1 4 35 98 -32 46 -89 -38 22 -12 160 -2 -46 -23 -5 -39 -39 -66 -24 -80 -58 -22 -12 -3 31
4219 31 -51 -45 35 7 -77 -39 -9 55 19 -56 24 -23 -9 -31 31 0 5 69 64 60 -51 21 -64 -2 -35 -63 -30 -5 52 61 24 33 -21
4252 -21 60 -46 -47 -39 52 109 -43 -56 23 40 -22 -84 7 34 -53 -57 16 31 181 -13 -104 48 -52 -85 -28 -90 25 47
4280 47 -83 -40 82 89 -37 13 58 -10 12 -2 73 92 -61 -24 -25 -21 -76 22 13 -14 26 8 -49 -1 -51 37 70 -30 23 87
4310 87 -24 104 12 41 -68 -36 16 -10 20 -45 -16 72 -125 -7 7 -8 -4 0 66 15 50 44 12 -70 -48 -29 68 -103 -44
4339 -44 64 46 -48 61 9 92 -18 -100 100 61 -71 -100 5 -88 -31 -138 36 18 -2 118 5 33 -16 -86 17
4364 17 -64 35 18 -16 -95 -65 13 15 51 12 -22 -3 24 -42 133 -16 48 -41 27 87 75 -28 12 46 -44 46 -34 -43 68
4393 68 73 -47 67 15 -47 100 -26 -124 -18 -10 -24 83 -22 71 -151 21 50 -37 1 0 -19 13 -19 -71 15 19 -41 -86
4421 -86 20 -38 -56 -56 21 26 61 76 22 -83 -53 61 -50 34 35 15 18 1 109 -2 5 -42 -54 52 -11 76 6 -28 -3
4450 -3 -42 41 115 -5 5 47 103 -14 24 12 2 -12 -10 14 -74 -17 86 -101 -24 33 15 -104 -104 47 -15 -78 -35 19 44
4479 44 43 116 6 31 6 -65 26 -21 106 33 11 38 38 -4 -8 32 25 -60 -20 -54 -125 78 -56 -33 64 14 33 -38 -71 1
4509 1 -40 24 19 5 3 131 -33 34 -43 -51 68 -53 -18 -44 -8 97 80 2 -44 20 -35 -10 -30 -73 -147 110 -25 69 18
4538 18 70 25 -2 -49 44 23 75 1 111 -12 -127 92 48 -41 -57 -86 26 61 -10 75 -5 46 -13 -65 11 -11 -20 105
4566 105 -16 -40 6 -48 -20 59 147 -16 25 25 43 44 -131 59 59 82 -45 -13 -45 -22 -34 6 -100 -93 -15 19 -47 -81 -139
4595 -139 -87 -25 17 9 -17 13 11 11 8 86 126 -65 22 101 64 -62 68 -39 9 34 39 -12 -8 -37 62 10 33 -119 5 34
4625 34 -38 63 2 -19 -36 -23 -54 -49 81 35 29 18 -16 -33 -37 -66 -99 -98 -12 -19 28 55 83 -10 -21 4 -50 -15 1 -10 83 -32
4657 -32 -7 -30 51 74 -22 30 -74 6 -68 -47 4 -107 -29 46 9 -60 -85 3 83 -10 -31 -75 -111 1 46 -38 -19 -74 -30
4686 -30 41 -15 30 -45 42 -29 52 31 32 3 -28 24 73 -15 10 51 60 132 17 34 27 94 50 -111 -82 18 24 -11 -90 -4 31
4717 31 39 -39 62 8 -46 -26 -78 -64 39 -98 -47 -31 52 -33 -73 -75 -6 -19 20 30 115 -71 7 97 -17 -29 -3 8 59
4746 59 14 54 -33 68 21 13 5 -72 21 2 3 28 -7 -15 81 -111 5 -60 -43 -87 -63 39 72 13 -158 64 -57 40 38
4775 38 -75 -10 -54 -33 -67 16 37 -63 -59 -131 -38 90 -42 24 -27 -32 -6 52 -45 27 8 47 14 -34 -9 -42 -68 6 -11
4804 -11 -42 14 77 -39 -66 0 16 -48 -26 -59 -89 -77 90 -56 -56 64 -9 13 -16 112 34 -16 -19 -67 53 -33 -52 36
4832 36 -33 -30 -45 -15 68 25 18 43 15 91 33 39 -125 -9 -6 20 -54 70 -5 4 23 30 -22 3 46 9 -31 -59 29 69 -11 -35
4864 -35 -1 -11 29 -55 -83 -9 16 2 22 18 49 45 -13 14 -44 -51 37 -19 -59 111 -30 -18 40 10 -40 35 28 -67 28 -18 -81
4895 -81 -45 -71 -31 -22 -7 29 12 11 147 -14 27 -19 31 -75 61 50 49 32 25 -7 -15 -9 -16 31 -29 -71 -37 -23 -27 -60 -79 50
4927 50 -85 17 56 -60 40 -38 -39 6 -69 -96 54 -67 69 -4 -57 53 -124 27 -34 14 -30 8 8 71 -96 -30
4953 -30 62 -18 4 40 10 19 5 59 9 -87 -65 23 2 -29 102 -30 28 -11 104 59 13 57 -62 -5 -27 -10 22 -39 43
4982 43 120 -11 -36 7 64 40 76 56 81 -43 -36 -13 -51 41 6 26 9 -36 -13 43 1 79 7 -9 -83 69 19 54 37
5011 37 54 -79 79 -69 -5 122 -4 28 -40 35 76 -21 41 43 -52 15 -51 -103 -18 -57 -28 28 -82 24 5 -6 62
5038 62 15 18 -32 82 77 21 -69 -63 71 -47 9 4 -48 -31 -17 -29 -1 -11 -22 -8 54 51 -13 94 -51 -29 -14 -48 -98 -24
5068 -24 57 -30 -34 34 -27 57 -8 24 5 -14 -11 46 61 17 -10 28 -36 -54 19 -62 -34 -48 -47 28 -25 25 20 -30 -40 -50 93 -54
5100 -54 -82 -72 -14 -74 42 15 64 11 43 69 -11 -69 -90 -34 57 67 43 63 45 26 75 40 8 3 9 60 -21 -31 85 4
5130 4 -89 -8 -99 21 -66 51 -39 -3 -8 -1 33 36 -40 -31 94 -66 71 10 11 -3 90 39 -30 -44 -18 -8 -73 4 11 -21 -50
5161 -50 31 36 10 -12 10 29 -10 24 -3 25 44 40 -22 19 82 -24 -116 21 -79 -47 -84 -108 -7 -50 -3 61 19 -53 -8
5190 -8 -8 -64 -34 62 41 -88 -12 74 46 -74 -12 -5 -58 -23 -70 82 1 0 0 -66 -26 -8 40 -76 -84 20 25 -3 47 57 -71
5221 -71 31 -41 -38 -3 -5 6 -67 -35 3 -54 -17 -56 67 27 54 29 -25 -17 22 8 35 -3 32 -68 -68 40 -8 4 -50 -51 36
5252 36 -42 43 45 44 -33 17 -89 -35 143 -70 -24 31 16 -47 56 -12 24 -116 -63 61 20 -12 12 -34 33 -35 -8 -45
5280 -45 -63 20 50 -73 21 7 -69 -1 -76 -89 11 24 -11 33 -80 2 -88 68 21 50 60 21 7 59 11 -21 -49 58
5308 58 27 0 -84 -84 53 114 18 46 -50 -6 -18 -42 -3 2 -24 -7 0 -12 2 -55 -26 76 -37 -5 -65 2 -68 81 -27
5337 -27 25 54 -46 -15 15 -69 12 -55 46 -57 -48 121 -14 -69 -58 -106 -74 72 -91 -13 -27 -41 -32 15 11 -67 13 5 -57
5366 -57 66 54 7 -25 21 -10 -43 64 -25 -57 -34 -54 91 -88 57 -17 28 24 -23 -47 21 63 -19 60 -84 14 -20 -69
5394 -69 -43 10 96 35 14 -6 16 -53 -19 -8 18 37 -45 -4 -130 -112 -126 19 -15 -86 -73 71 76 -20 -77 2 35 -35 -4
5423 -4 -60 -23 -24 31 -21 47 -83 13 -31 4 12 -28 41 -5 -47 68 66 -1 66 18 -56 70 10 -137 -59 -23 10 109 20 -14
5453 -14 -61 -28 58 14 22 28 103 43 -78 18 -43 -18 -96 117 -20 -11 2 -15 31 -54 -46 5 -100 -111 -99 -3 -25 0 -32 -1
5483 -1 -97 36 7 48 -25 97 87 61 27 63 -49 -9 -50 114 96 28 51 -6 18 -67 -24 11 43 104 -51 11 42 -101
5511 -101 -70 -26 83 -44 29 146 -18 -5 72 -75 -15 121 -9 22 50 4 56 -7 -3 2 -71 -27 51 66 9 25 -21
5538 -21 134 52 -136 -5 -3 60 17 -10 51 3 -93 41 9 5 3 20 -33 30 44 0 48 -11 67 115 53 -49 15 -100 -38
5567 -38 45 24 -43 -25 -2 -3 -87 56 51 -41 -6 -159 -68 65 19 89 80 12 -71 4 -24 63 110 23 -15 -41 2 -46 84 -15
5597 -15 -31 -6 14 -9 -20 -96 20 -42 60 -13 -10 51 56 21 -146 -56 -16 42 -38 19 -73 75 -33 51 -21 -43 91 -39
5625 -39 -70 -29 -113 64 100 36 1 10 7 42 69 -103 65 14 34 -109 1 115 -22 51 -3 -50 21 52 -7 -13 -22 57 18
5654 18 -10 -23 -83 -3 62 -77 62 78 3 -27 -32 0 32 -23 -2 6 -18 64 73 -6 24 18 1 84 -21 -112 -50 44 42 -3 8
5685 8 -100 -53 -78 65 -5 -62 -38 -23 -96 -43 -62 84 -26 20 -74 -77 21 -38 30 104 17 49 4 3 -15 34 -54 11 65 83
5715 83 19 -57 -16 -18 -19 -21 1 72 13 -6 -26 -72 7 -38 35 -46 -64 71 -19 10 25 60 44 -60 20 53 20 -26 -7 -29 38
5746 38 -62 30 -48 -68 74 40 -56 -28 -28 18 -49 21 -37 44 -12 10 28 -18 48 22 -47 15 8 40 -37 114 -69 33 -12
5775 -12 87 7 -83 16 -4 8 -8 44 46 4 -30 37 20 -3 -5 -65 -72 -10 4 -65 -56 -1 -79 -49 104 -50 91 -27 74 94
5805 94 -7 21 -20 75 -66 10 26 19 -5 40 20 3 37 -63 -24 83 38 -17 -48 -23 7 -5 1 -55 -46 3 -97 77 32
5834 32 31 17 7 5 -27 -6 -5 -18 35 -9 -76 16 17 8 -39 36 14 -126 -2 3 -7 17 17 31 18 8 1 -45 66 89 -15 -34
5866 -34 15 37 2 -50 80 5 71 -36 -9 31 -13 73 52 62 -49 -19 -73 22 114 51 47 83 15 -48 -23 42 66 -30 21
5895 21 -37 36 -27 44 5 53 -32 119 -1 45 46 18 31 0 48 62 27 -13 -34 6 34 -2 61 57 75 -79 10 -33 72
5924 72 -64 32 -32 41 83 -59 40 -21 56 -57 -24 22 -9 -25 -29 -66 -33 41 42 -83 -24 35 107 25 12 -34 -112 30 -36
5953 -36 62 73 -1 34 -93 -49 54 50 0 62 42 -65 65 -2 -61 -22 79 100 85 38 35 103 81 -16 28 50 -6 10 13
5982 13 -9 2 7 -18 -73 -43 -73 -57 34 -24 -23 25 -119 -39 76 71 -19 92 -39 -17 -34 -27 -52 11 100 -21 95 11 114
6011 114 -14 72 51 38 44 4 81 6 -86 -69 23 -28 30 17 120 -23 -135 -4 84 -26 -55 -66 78 17 -79 -43 18
6038 18 18 -30 27 62 -24 -83 15 70 93 -3 -7 -58 -4 -90 -41 37 -76 84 -76 18 -90 -118 21 -3 43 -32 13 44 28
6067 28 27 -7 -48 78 -87 -23 74 2 15 -8 43 31 28 36 122 -3 40 -21 -122 82 -40 81 -8 -22 41 46 4 -6 -15
6096 -15 70 -22 -38 -62 -109 -50 -44 16 139 64 44 4 -17 111 -63 -37 -33 -117 67 -128 -11 115 -42 -13 6 25 -58
6123 -58 23 2 -22 -47 11 -89 -11 70 -47 15 -38 -46 51 -41 28 0 50 54 47 -29 17 17 -56 -14 -18 -14 -92 66 37 -24 3 6
6155 6 -56 73 -16 -16 22 9 1 23 22 -33 33 2 -15 37 12 -71 -30 59 16 35 36 49 78 60 -70 86 10 -25 -84 57 15
6186 15 -21 -47 10 54 12 72 -29 24 11 9 -25 -77 6 33 46 -47 72 56 -3 -18 -59 17 -23 -9 -41 6 6 -87 12 26
6216 26 13 10 69 -18 -60 31 22 11 2 -11 0 -22 54 73 -7 0 -81 26 43 35 2 -1 19 66 58 -1 22 22 42 -13 -8 -22 -54 56
6250 56 -14 -51 -44 -57 -36 23 8 -4 11 -64 71 -30 -31 -69 36 97 -16 -118 -1 -61 -32 -9 -44 23 15 10 -17 9 -67
6279 -67 -118 -51 -38 20 -15 -46 -56 7 42 15 -60 -94 -35 -21 -18 41 9 22 13 28 -15 -16 52 34 -17 -42 52 -14 -68 -88 27
6310 27 -65 31 74 1 32 -1 -29 -16 57 16 116 -52 26 40 10 -5 -19 5 -2 154 15 -50 -38 57 -99 -30 -53 31
6338 31 35 45 -43 -40 0 -12 -29 95 -40 65 -60 11 -4 0 16 22 46 9 -74 62 79 33 9 -11 2 -18 -67 -27 48 48
6368 48 14 79 10 94 61 8 73 -42 -78 18 24 16 -66 -77 15 11 -27 3 11 -38 -41 0 15 0 76 78 -51 -14 -25 -120 -10 -66
6400 -66 13 24 -38 -17 39 47 -84 -37 -35 31 -196 78 38 -16 -22 -75 -21 -28 32 29 47 19 38 31 -85 -40 53 81 34 -72 -9
6431 -9 -51 31 -11 1 -100 -53 39 -75 29 -61 35 51 40 -48 -74 -57 54 -9 -6 6 37 -33 -63 42 84 71 75 -116 -66
6460 -66 3 -64 -35 -128 -27 -13 71 -56 -46 -26 -71 -16 -11 -11 13 110 58 -59 -18 -8 -14 -62 2 39 -10 -117 83 -76 147
6489 147 35 -38 34 -6 -64 -50 -17 -117 8 18 10 -52 30 -20 -47 50 -128 -3 11 23 153 23 45 36 13 15 5 77
6517 77 19 39 -41 55 54 -52 61 -70 1 14 -71 22 3 69 -47 61 -65 24 -8 12 -121 -107 -13 23 -31 -52 -66
6544 -66 49 77 5 -17 -8 -86 -29 77 31 29 -20 -10 -29 32 12 -35 -114 2 -83 54 -5 -145 0 18 52 -88 49
6571 49 7 -4 -30 -10 -21 -17 13 -6 10 -112 61 35 -36 -16 -112 28 -30 -65 79 57 67 40 27 -51 -63 84 44 18
6599 18 -46 -8 -40 -38 12 57 -59 -79 55 -35 4 -13 62 -8 -14 22 -172 33 60 9 24 -1 -59 38 -27 -64 -70 -29 51 72
6629 72 22 22 30 -5 101 -31 -61 15 -71 64 34 76 26 -13 49 -46 -81 -47 19 40 37 -34 48 -20 -42 -1 -44 12 -6 50
6659 50 48 -25 -32 16 -98 -1 129 -2 22 -3 48 -17 64 -127 30 25 -26 27 -45 14 8 21 17 31 31 13 60 33 62 8 -67
6690 -67 -24 26 -40 -43 40 -55 25 34 74 55 58 70 19 -35 -30 136 -35 24 -7 14 14 161 -83 26 -91 27 -26 -12 9
6719 9 7 15 -12 -2 43 52 -5 53 27 -35 11 49 6 29 -85 -37 105 -9 68 34 66 -78 -31 10 -38 40 -59 49 -30 29
6749 29 20 -67 1 10 -10 -71 -81 7 -14 -27 -11 73 29 38 90 16 34 -15 -23 -46 -29 -43 -73 -16 115 14 14 50 14 45 -6 -59
6781 -59 41 25 -21 16 -55 32 -48 24 46 -29 -18 -14 53 142 31 55 86 -39 -83 -9 29 -24 52 45 22 -24 -51 -12 33 -16
6811 -16 -109 -23 17 -51 -65 -3 12 34 -81 -35 -36 47 54 -45 -134 -14 -8 -21 54 -1 102 1 -35 37 -17 54 -25 -8 -2 -68
6841 -68 -4 25 2 43 -71 -36 -14 -61 65 -48 -33 -51 -2 -121 -49 -5 -25 -6 -48 -52 12 2 87 31 -46 -14 -26 50 -6
6870 -6 -9 -58 5 65 -128 12 3 72 -62 -111 93 -27 70 -45 37 -61 -2 16 -26 12 70 64 1 -63 -43 11 -9 10 95
6899 95 -49 -8 -31 -54 -8 -44 -23 11 -20 1 -40 -107 -14 30 28 -55 -6 -74 -43 -90 72 -103 51 17 5 -69 64 37
6927 37 -52 41 -53 75 -22 -6 4 -127 -14 8 73 -51 -111 89 37 -3 -50 24 -34 -117 -7 122 -65 16 25 -58 -4
6954 -4 48 -97 -32 -39 -5 -42 19 -51 12 -65 86 61 -38 83 -54 75 85 44 -54 39 -63 -60 -31 58 -10 -72 11 -35 -16
6983 -16 -107 -103 84 82 -139 -29 80 -68 61 5 50 -30 -92 -16 -32 27 -6 -30 -30 -8 -1 -60 28 49 -17 57 -29 -29 -60 -36
7013 -36 -5 -70 -9 8 23 122 -25 58 74 92 14 13 -26 28 0 28 -25 60 -69 6 80 13 -9 84 72 31 132 -6 15
7042 15 -50 33 -28 93 -61 -119 49 8 -12 -78 -58 33 59 18 80 63 52 -29 65 -25 -83 8 -18 16 -25 6 45 -29 17
7071 17 -39 -21 -23 -38 -182 12 -79 -13 -35 70 49 -6 -42 66 -21 12 -29 -15 89 -100 23 31 -13 15 34 -7 -27 -134
7099 -134 -21 -27 53 -72 61 49 8 19 -78 19 -54 -75 61 26 7 -100 -9 75 9 -51 96 43 -39 -48 -4 -31 10 55
7127 55 -8 -3 2 136 -3 13 -24 -15 -36 93 -4 -94 -17 -42 128 33 -71 39 98 -58 -40 28 -4 -34 -88 80 29 -38
7155 -38 44 58 54 11 -94 -24 28 3 29 33 63 15 -153 -39 -29 -41 -45 32 -25 97 -33 30 15 11 68 57 -53 59 38
7184 38 26 103 62 -70 -6 -35 27 -83 2 -62 65 -26 9 18 34 33 -44 -21 -100 19 -12 -64 4 -3 -26 -45 55 31 127
7213 127 5 -104 -31 -65 33 -58 8 54 -87 55 -5 83 -17 -1 -53 95 -28 -157 76 -10 0 -13 49 61 4
7238 4 -27 39 3 0 29 -20 -67 4 38 13 -117 34 -3 -38 47 26 -14 -77 -18 21 -32 40 10 -46 4 87 -7 91 39 -41
7268 -41 -29 89 -60 -32 88 32 -4 13 3 -77 17 63 31 50 11 -44 62 -12 -80 100 62 -33 -67 -43 -35 -8 -65 33
7296 33 44 -45 40 -73 31 -115 66 -64 -11 -32 -86 0 -22 19 -89 0 9 41 61 62 0 -23 74 -96 -47 -68 -24 -17
7324 -17 -15 41 -7 -68 0 30 -38 -31 -78 -26 -24 6 28 -79 81 -41 58 31 -95 -9 48 72 43 27 -47 70 -62 -21 8
7353 8 34 4 -46 -9 -46 -27 33 43 30 -4 52 26 61 25 -72 -6 -128 51 35 -74 4 -119 -13 -52 60 64 -38 -54
7381 -54 -67 23 48 -71 35 -18 36 -16 -25 -24 68 129 -46 -17 -15 60 73 43 -38 6 -11 8 -69 -36 -13 5 -121 -15 27
7410 27 -80 40 33 113 8 -72 9 51 108 30 49 22 -27 -9 -81 50 -39 17 64 29 77 -12 -78 1 6 -85 11 -9 62
7439 62 20 2 -45 -56 12 11 61 -4 -17 -54 -69 37 11 -115 -51 74 -135 0 6 -93 -6 40 18 11 39 19 -91 7 -14
7468 -14 -31 -13 -61 45 -79 -44 4 21 52 -30 -22 36 -30 -15 42 -4 43 14 -18 169 82 14 68 50 -102 -62 22 9 25
7497 25 -28 -21 -45 -24 1 15 -42 90 63 38 26 -93 31 -114 39 -9 52 43 -13 95 -1 18 25 62 -34 50 20 20 121
7526 121 25 -12 -77 -136 -38 16 27 63 -20 9 45 -14 4 43 0 -30 12 3 -36 -75 -6 -87 -53 60 40 29 107 -28 -17
7555 -17 31 2 72 36 9 -107 -85 -64 -110 74 70 -20 28 42 16 -50 60 -49 -34 44 -147 7 46 20 -45 -57 40 42
7583 42 87 116 -15 51 -35 20 -27 -86 14 8 -44 -48 -4 2 58 -62 41 53 21 -83 -18 113 62 -32 64 -33 -71 21 7
7612 7 112 45 52 -66 -11 34 23 -3 1 -58 51 -15 -11 -76 -84 -9 -13 -56 -2 -46 12 -68 -3 -37 50 89 51 30 -76 59 -5
7643 -5 27 92 18 -42 24 14 36 -54 20 15 -2 32 -15 69 -88 -9 43 25 29 60 44 -53 -128 -59 -14 -14 9 126 -10 -5 54
7674 54 -4 73 -53 -62 32 19 58 20 28 23 -22 56 11 -7 -94 2 14 -1 94 27 85 61 -23 -85 -103 71 -154 51 -5 -77
7704 -77 -53 61 -33 -25 -32 14 27 -15 -116 49 32 -34 30 -77 24 -49 -10 -78 7 0 21 -84 43 -13 -40 -3 29 47
7732 47 113 -5 19 -38 38 65 -39 43 -89 -27 -26 63 -18 -82 89 -23 -9 80 92 -93 -45 -70 75 -5 -50 13 18 -10
7760 -10 -47 113 -90 35 41 31 -46 5 -6 20 56 35 -11 -87 77 -120 19 34 81 13 24 -27 -23 35 31 15 -37 55 -22
7789 -22 0 -30 62 11 10 26 -20 28 -15 -56 97 21 -9 -45 -5 -20 -29 -62 31 24 33 100 -5 -1 29 -74 -33 -49 -14 13 68
7820 68 -10 28 54 -41 -73 77 -101 -19 12 2 28 -35 56 21 79 105 -26 -5 15 -29 -38 10 55 25 -3 -84 13 -78 -40
7849 -40 9 36 53 -25 -102 33 74 -10 -9 4 48 -52 -11 86 13 -25 -68 43 -4 25 46 19 5 -161 -114 44 53 80 15
7878 15 -8 -17 -16 -96 -51 -3 -29 0 77 -26 -14 -9 -20 1 -3 64 -17 24 48 -28 -4 -63 35 -16 -13 36 -50 -27 -3 -26 -81 -76 -41
7911 -41 -49 -30 -6 -22 -9 -29 -34 -8 26 -27 -9 36 48 59 46 -16 -8 45 5 12 -97 25 77 -5 -27 -18 120 -37 54 38 97
7942 97 -16 -20 -10 11 -25 -19 -1 -12 11 -63 -37 63 40 -62 54 -90 61 -5 41 -43 53 -66 -37 26 9 53 -3 -64
7970 -64 -10 8 25 43 -63 0 129 47 25 -55 51 93 -28 2 31 18 -55 -52 0 75 -120 55 22 -12 -62 -47 82
7997 82 5 36 21 26 -50 50 30 -68 -18 -54 3 53 -31 -50 -1 -13 71 -20 -67 77 -78 18 -84 -12 56 20 35 53 -124
8026 -124 14 29 -27 -10 67 -8 -29 -66 -63 85 71 -2 23 -40 -34 -7 -52 -34 -3 -48 -15 21 46 34 -33 -31 18 14 60 -26 12
8057 12 113 -68 34 0 64 80 108 -43 0 46 62 39 -60 -8 -24 27 -70 -15 48 13 38 -43 36 38 -59 48 43 -140
8085 -140 4 -18 -5 42 112 124 36 -54 -5 12 -17 43 -40 -66 37 -14 52 -63 30 -12 -93 18 3 14 3 30 -18 9
8113 9 48 40 0 42 -8 -47 16 132 29 -31 -64 -65 -30 76 33 -49 -40 -28 -2 -3 -112 59 -2 -80 -27 31 -75 25 11
8142 11 21 22 -62 13 37 53 58 -13 78 -60 62 16 50 2 69 -39 9 -15 -9 -60 -17 -71 -1 -34 19 100 -39 -2 -27 27
8172 27 76 -17 112 77 -30 -23 -13 116 -13 -22 -49 -35 30 14 69 -3 34 11 -46
8191d6
$$ Imaginary data points
##PAGE= N=2
##DATA TABLE= (X++(I..I)), XYDATA
0 0 0 0 0 0 0 0 0 0 0 0 0 0 -8 8 -8 8 -16 16 -23 24 -32 32 -40 48 -56 70 -80 94 -104 120 -141 159 -182 206
34 206 -230 262 -294 329 -368 412 -457 509 -564 626 -693 766 -845 931 -1026 1131 -1245 1372
52 1372 -1513 1668 -1842 2038 -2262 2517 -2813 3160 -3574 4081 -4713 5533 -6640 8225 -10694
67 -10694 15137 -25667 107123 35961 -3896 218526 88568 -2756 91207 129174 30918 27312
79 27312 52362 40946 19665 31046 -146 -7423 18462 3413 -37693 -14205 -1459 -23094
91 -23094 -37134 -28244 -18796 -21946 -43564 -34716 -15066 -27083 -42654 -26959 -16679 -25611 -33517
104 -33517 -21029 -10301 -21687 -28046 -8899 -3158 -18578 -18444 -1060 1851 -11090 -13923 2625
117 2625 9469 -8099 -15149 6338 14024 -9144 -16679 5819 12886 -8152 -17378 559 12731
130 12731 -4944 -21121 -2063 15782 -5057 -22113 -730 14765 -3674 -16953 -2771 10542
142 10542 1594 -12736 -6495 9513 4401 -11855 -6566 8457 4536 -7972 -5995 4733 6211
155 6211 -2470 -5812 2971 8122 56 -4521 3847 7388 378 -1931 3233 4943 1049 -885 1600
170 1600 2113 -97 5 1218 -498 -2325 -109 2662 -994 -4868 533 5248 -2084 -6318 2607 7013
186 7013 -2810 -6788 3136 7080 -1514 -6632 274 7124 929 -8050 -1465 7989 650 -8002 -631
201 -631 6735 1063 -4973 -1805 4165 4342 -1973 -4376 3138 6066 -1615 -4232 2216 4289 -368 -3527
217 -3527 -1143 3432 1745 -4533 -3482 3305 2167 -4213 -3260 1900 1416 -1918 -2110 104 1558 64
233 64 -1888 -430 1248 883 -291 -1719 -714 2261 1316 -3066 -2216 2517 2515 -2657 -3253 2354 3769
250 3769 -2253 -4297 2487 5038 -2118 -4626 2243 4960 -1094 -3919 408 3920 423 -3555 -821
265 -821 3017 646 -2872 -1457 1814 1662 -1590 -2533 269 2448 48 -2623 -702 2327 965 -2024
281 -2024 -1198 1946 1745 -1756 -1942 1797 2111 -1451 -1765 882 1551 -2 -980 -464 468 989 86 -932
299 -932 -387 1320 885 -1407 -1526 1779 2162 -2117 -2748 2241 3203 -2049 -3468 1727 3695 -1277 -3690
316 -3690 1163 3677 -998 -3621 556 3500 -147 -3354 -335 3009 799 -2557 -1419 1804 1472
331 1472 -1470 -1599 989 1800 -378 -2198 -118 2466 359 -2780 -1021 2439 1067 -2528 -1571 1851
347 1851 1054 -1897 -1317 1359 1096 -1340 -1183 1180 1215 -662 -499 498 611 356 435 93 -554 402 1428
366 1428 -603 -1464 728 1469 -1070 -1651 894 1659 -1127 -2119 577 2025 -323 -2046 -9 1930
382 1930 71 -1572 -140 1304 257 -1149 -767 459 815 -523 -1731 -348 1528 382 -2060 -943
398 -943 1676 1160 -1553 -1244 1912 1990 -1366 -1495 2282 2527 -1329 -1874 1847 2407 -1053 -1755 972 1397
416 1397 -824 -1376 123 801 -395 -1286 -345 652 352 -574 -884 -11 809 310 -889 -673 814 669
434 669 -1036 -946 863 572 -1419 -1063 934 629 -1086 -997 639 691 -435 -68 606 320 271 782 633
453 633 107 408 1010 172 -503 734 1109 -639 -1410 477 1167 -767 -1900 -6 1135 -619 -1607 -3
471 -3 1270 -539 -1607 374 1343 -75 -955 -289 709 500 -448 -776 -125 636 -9 -1103 -398 992 381
490 381 -1141 -420 1407 1318 -1085 -777 1922 1784 -932 -769 1698 1434 -994 -737 1235 776 -1231 -1010
508 -1010 655 492 -1207 -1115 200 75 -859 -450 68 -329 -424 244 328 -440 111 556 -224 -359 465 525
528 525 -611 -617 359 349 -458 -503 79 189 -161 -41 302 281 -16 394 662 136 322 1000 282 -552 494
549 494 1231 -290 -1242 223 921 -669 -1460 27 744 -980 -1559 136 837 -756 -1467 177 953 -293
567 -293 -810 212 681 -160 -283 321 334 -71 -177 -208 71 280 43 -424 -300 515 475 -403 -403 752 800 -340
589 -340 -178 1077 729 -751 -233 1281 436 -867 -361 722 -62 -883 -174 390 -484 -1005 28 384
607 384 -603 -758 259 418 -484 -208 704 238 -539 16 755 215 -478 18 556 85 -296 247 293 -85
627 -85 -91 275 113 -44 275 282 -232 137 856 136 -612 62 902 79 -839 184 747 -308 -978 153 784
648 784 -579 -1378 117 839 -598 -1110 176 620 -534 -537 590 613 -425 -363 604 364 -282 -71 297
667 297 110 -155 60 115 -172 -226 186 -6 -149 89 142 -286 -141 610 242 -415 -135 562 102 -542 220
688 220 519 -414 -680 302 603 -434 -842 127 531 -550 -751 322 534 -794 -608 755 458 -760
706 -760 -371 689 263 -537 49 535 -2 -346 129 311 -111 -367 66 284 -12 -117 148 -149 -186 221
726 221 309 -200 -167 345 74 -390 157 650 -221 -758 373 563 -236 -652 209 532 -478 -479 612 476 -641
747 -641 -535 757 388 -788 -167 684 161 -700 50 638 -67 -461 78 643 65 -418 100 298 -67 -129
767 -129 155 66 -265 -31 235 90 -114 82 -47 -245 250 426 -273 -549 168 384 -205 -400 307 360 -441
788 -441 -382 607 467 -595 -393 599 332 -575 -266 559 1 -644 -14 511 -179 -598 -12 629 15 -381
808 -381 148 210 -282 -123 393 186 -282 -121 288 5 -164 100 54 -363 -26 429 42 -368 188 285 -84
829 -84 -158 358 287 -449 -274 515 343 -519 -352 567 210 -585 -237 597 -88 -838 -77 714 -138 -664 -6
850 -6 577 -23 -465 208 417 -231 -316 335 412 -291 -193 226 143 -109 155 105 -286 -128 179 -31 -341 87 249
873 249 19 -99 230 266 -107 -236 376 426 -279 -230 351 219 -455 -77 537 -118 -817 53 566 -231 -667
894 -667 131 379 -267 -461 423 506 -395 -411 347 457 -235 -257 311 208 -250 -12 162 2 -180 22 214
915 214 -9 -13 49 -168 -177 286 362 -145 -94 403 313 -254 -120 470 103 -575 -54 637 -59 -805 -93 495 -126
938 -126 -595 -57 369 -268 -375 299 272 -286 -331 270 399 -275 -158 451 140 -354 57 470 -70 -372 116
959 116 361 -159 -214 137 179 -256 -83 291 199 -157 43 296 43 -10 275 -39 -490 22 384 -129 -553 52
981 52 347 -353 -602 230 282 -360 -614 202 515 -289 -557 280 443 -279 -132 466 382 -391 -182 484 133
1002 133 -317 19 144 6 -14 38 -23 -263 130 194 -1 -164 131 198 -118 -199 318 150 -367 -163 398 137
1024 137 -364 -130 299 -130 -459 134 289 -354 -441 235 258 -178 -228 350 238 -360 -30 558 126 -459 26
1045 26 641 -15 -464 75 411 -175 -313 160 291 -19 -307 136 256 -34 -65 2 -46 -173 153 -9 -141
1066 -141 -123 292 -5 -321 134 227 -265 -371 180 322 -398 -478 135 366 -452 -342 230 306 -386 -175 402
1087 402 262 -431 -194 434 218 -269 -85 311 -12 -232 121 303 -139 -237 57 152 -155 35 122 -98 -191
1108 -191 167 314 22 -237 140 118 -195 -63 265 -83 -308 45 248 -259 -229 78 80 -202 -72 243 88
1129 88 -464 -67 513 83 -408 -23 520 -9 -331 207 484 -149 -346 262 356 -50 -304 47 242 -176 -81
1150 -81 177 8 -276 -23 219 29 -129 55 114 -216 -33 293 -194 -400 28 297 -145 -277 68 207 -219
1171 -219 -114 337 282 -318 -258 297 227 -234 -135 358 -45 -318 88 480 -161 -411 259 404 -160 -279 175
1192 175 152 -228 -124 226 81 -147 -77 363 130 -158 -76 125 -145 0 232 -65 -153 -67 131 -118 61 194
1214 194 143 -234 -101 274 148 -261 -225 284 130 -348 25 347 -135 -364 73 409 -236 -373 96 219 -199
1235 -199 -226 111 171 -215 -106 256 215 -273 -131 221 4 -258 4 177 -123 -178 158 108 -101 -116 141 153
1257 153 -140 108 62 -101 -92 157 119 -187 -121 268 139 -310 93 271 -138 -386 119 352 -185 -341 132 312
1279 312 -359 -253 226 245 -195 -181 345 164 -185 -198 177 62 -293 69 214 -46 -262 13 109 -119 -104 112
1301 112 66 -118 83 256 -48 -192 106 212 -53 -17 167 31 -257 -92 344 -159 -356 5 220 -23 -267
1322 -267 0 177 -90 -88 292 216 -262 -178 305 315 -241 -129 215 80 -236 23 394 -85 -238 -29 165 -123
1344 -123 -133 67 -19 -98 8 231 -135 -171 54 50 -65 39 85 14 -222 -5 248 -14 -306 -68 207 -102 -288
1367 -288 72 263 -195 -312 242 268 -219 -240 232 205 -116 -49 362 33 -250 106 276 -38 -305 196 171 -143
1389 -143 -108 126 17 -163 -136 225 116 -100 -74 169 10 -90 18 144 -98 -50 213 90 -212 -63 93
1410 93 -152 -107 155 263 -224 -218 114 253 -139 -109 200 139 -256 -70 348 0 -349 -86 326 16 -146 -37
1432 -37 78 -85 -103 152 93 -118 -70 61 18 -38 -30 56 10 -50 134 132 -42 -218 129 191 -105 -39 132 -74 -232
1457 -232 61 238 -84 -122 72 98 -168 -125 205 23 -206 -23 306 78 -290 -61 307 -89 -293 89 212
1478 212 -123 -282 139 127 -243 -256 115 146 -161 -74 131 -31 -155 19 144 3 -62 100 -5 -181 65 136
1500 136 -139 -155 9 184 -178 -110 107 75 -102 -73 217 128 -261 -187 192 236 -152 -62 143 -11 -128 12 209
1523 209 -163 -236 270 144 -227 -48 33 -41 -129 -12 134 -7 -185 60 224 51 -118 9 159 -113 -124 82
1545 82 14 -163 -90 41 53 -75 33 -41 -180 -78 144 -7 -200 -38 162 24 -211 -26 200 -5 -150 248
1567 248 313 -145 -221 113 130 -233 -228 184 -24 -126 -42 96 101 -47 5 152 138 -91 86 38 -203 11 65 150
1591 150 -262 -35 138 -7 -191 11 101 -106 -52 224 159 -53 -202 206 215 -105 20 124 29 -211 -30 194
1613 194 -139 -258 83 56 -96 -80 160 6 -107 11 202 69 -276 -7 269 -23 -193 122 226 -78 -156
1634 -156 111 242 -201 -162 36 203 -117 -6 25 4 -79 41 -37 -32 10 -78 -26 -134 168 211 -78 -312 193 289
1658 289 -125 -143 77 218 -135 -63 178 217 -260 -108 248 151 -148 -175 57 46 -40 -96 47 45 49 63 80 -74 23
1683 23 90 -149 -87 165 168 -127 -263 139 217 -102 -54 134 82 -219 -78 168 213 -138 -143 169 99 -101 -62 58
1707 58 -4 5 102 17 -194 -63 118 -26 -40 45 56 -103 -216 152 242 -68 -281 161 245 -96 -189 158 148 -156
1731 -156 -131 206 172 -40 -206 119 38 -122 13 -26 -60 -9 88 2 -110 37 198 -57 -178 177 194 -237 -159
1754 -159 230 268 -219 -237 105 231 -91 -190 191 38 -164 -80 87 17 -192 -146 14 -132 -12 28 -165 -155 89
1777 89 235 -117 -151 93 174 -156 -95 178 280 -176 -241 144 295 -223 -161 175 69 -133 -77 73 46 -34 -26 -44
1801 -44 -12 65 -41 -159 -17 64 154 19 -223 60 115 -88 -264 117 110 -158 -267 303 241 -186 -271 157 209 -84
1825 -84 -159 53 84 24 -62 -85 120 95 24 -73 66 104 16 -124 -216 251 199 -253 -210 189 186 -259 -199 78 153 -116
1851 -116 -158 221 39 -166 -219 116 123 -107 -110 88 87 -79 47 -175 -97 62 56 -112 -63 221 138 -164 -78 171 258
1876 258 -145 -213 135 257 -162 -275 99 133 -186 -110 15 36 16 -87 -47 113 105 -20 -131 -51 125 76 -168
1899 -168 -170 130 168 -264 -226 135 238 -257 -241 231 211 -110 -215 69 198 -44 -165 81 160 -86 -155 59 174
1922 174 -37 7 -169 -71 72 36 -201 -125 162 193 -185 -115 249 38 -149 -212 204 239 -124 -205 83 208 -58
1945 -58 -225 41 141 -13 -128 -59 38 -32 -106 -100 2 60 78 -138 -44 188 148 -191 -84 42 136 -103 -215 174
1969 174 135 -157 -307 218 166 -123 -227 83 92 8 -202 14 99 -30 -96 -115 -12 66 -2 -76 51 75 165 -114
1993 -114 -200 162 230 -117 -116 47 204 -141 -142 73 278 -7 -133 107 90 -75 -186 -42 192 -21 -67 -115 -146
2016 -146 101 48 -49 -46 119 121 -225 -200 84 141 -137 -179 140 240 -36 -188 193 122 -90 -106 106 145 -113 -111 96
2041 96 242 -56 -94 -3 43 82 129 -51 -171 137 173 -59 -55 84 125 -7 -209 163 141 -102 -153 101 228 -8
2065 -8 -226 76 48 -77 -46 79 31 -119 -81 -63 58 -48 2 -41 -2 88 72 -79 -213 127 146 -111 -157 98 111
2090 111 -176 -106 88 205 -174 -126 72 106 -30 -198 59 150 10 -54 79 40 -118 24 1 17 168 70 -102
2113 -102 -43 181 84 -26 -66 93 225 -131 -100 133 94 -121 -142 159 153 -136 -153 27 111 35 -44 9 67 -100 7
2138 7 -61 -163 81 9 -91 -101 81 47 -193 -193 93 114 -111 -170 10 87 -48 -167 8 167 -140 -65 54 48 25
2163 25 -31 34 94 58 -4 -35 1 -65 -12 -5 -36 -4 22 -82 -157 74 181 -162 -166 115 196 -50 -185 89 189 -134
2189 -134 -108 105 71 -121 -137 3 -50 -39 -38 -13 -5 49 30 12 -22 9 130 -54 -67 63 56 -40 -144 125 131 -185 -85
2216 -85 20 70 -137 -120 5 45 -92 -78 135 56 -61 -52 41 -75 -55 41 25 -74 67 110 10 -48 -8 70 -126 -99
2242 -99 89 155 -80 -33 197 97 -11 -95 161 104 -95 -39 110 2 -78 -14 37 -9 -63 -39 -19 -87 -24 -22 26 -110
2268 -110 -54 118 -47 -165 25 95 -203 1 114 85 -138 -140 107 -42 -34 -97 141 67 26 84 85 35 20 -48 17 3
2294 3 -77 27 -31 -56 40 60 1 -128 69 15 -94 -72 87 55 -24 -40 104 80 -57 -142 71 131 -74 5 54 -29
2320 -29 -27 102 -65 -106 -38 0 -4 -122 38 59 -85 -121 100 30 -21 -148 129 -1 -86 -91 93 44 -55 71 114 21
2346 21 40 128 35 -32 -62 -148 -9 -9 3 45 -47 -5 -10 42 -110 -141 72 174 -235 -205 192 -8 -136 72 62 44 -60
2373 -60 -108 173 133 -97 -7 1 26 -77 15 -70 -143 19 1 39 -88 30 127 -89 -120 85 70 13 -127 66 -83
2398 -83 -179 -99 9 83 -123 18 18 51 -106 -5 14 -20 -121 -130 20 60 -69 3 103 25 -35 135 4 32 -16 183
2424 183 -83 -116 32 100 -91 -62 133 65 -130 -16 67 110 -24 -16 80 19 -92 -27 85 -23 -119 28 53 -43 17
2449 17 69 35 -21 71 148 1 -95 71 191 1 -48 105 6 -10 18 -3 51 -44 17 122 -79 -101 -40 87 -7 -55
2475 -55 60 35 -78 -58 53 144 -71 -22 75 16 -95 43 143 -65 -40 26 113 -86 -95 23 107 -54 8 89 65
2500 65 -27 36 15 20 29 16 -100 -118 -11 44 39 -89 -68 45 -23 -21 109 74 -91 -39 45 108 -75 -108 -132 -3 -91 3
2528 3 34 15 -45 139 38 -111 -62 -52 60 -77 -42 73 -25 -64 22 24 -69 -35 -63 55 73 4 135 35 -37 -95 71
2555 71 61 16 -8 58 63 -53 3 -6 -45 -85 13 10 -44 -99 10 26 -75 20 102 -15 56 -12 109 42 -59 51 61 33
2583 33 -96 -49 97 -43 -6 38 34 -66 -33 34 69 -102 -5 122 -17 -38 38 -18 -104 -56 122 -1 -132 -22 26
2608 26 32 -116 8 77 -49 -44 -17 -12 -124 -47 60 39 -68 7 9 -112 -153 -78 108 -34 -114 -6 -13 -93 6 125 -58
2635 -58 -33 -37 14 -75 -13 50 9 54 -75 38 19 -58 -31 68 107 -38 -11 154 32 -42 -35 64 -82 -88 67 95 -124 -98
2663 -98 76 -37 -89 -18 19 -8 -62 8 -102 -25 34 18 44 -1 -33 105 -6 10 -21 144 34 -77 -1 -26 -27 -83 7
2690 7 46 -32 44 -8 58 -31 -63 33 -46 -141 -12 109 -41 -117 101 60 -80 -19 10 -53 13 -15 -9 2 -31 94 110 20
2718 20 -68 -36 69 -83 -106 14 55 66 69 42 -19 -46 6 48 -24 56 -48 -49 -101 40 -108 -18 -28 -114 -28 -42 -19 11
2746 11 29 -20 -36 27 95 -49 -47 -21 28 35 78 128 -113 53 57 47 -13 -87 32 -27 10 -83 33 -63 29 29 76 -26 -52
2775 -52 11 -39 36 73 -89 12 0 -93 -80 50 -32 19 3 12 21 -55 -26 -4 -90 100 -3 -74 -87 -67 24 -90 59 168
2803 168 58 -56 -34 45 -5 -98 6 -28 -54 -150 83 93 -100 -7 -19 2 -44 -116 91 -25 -51 -17 42 -107 -60 -3
2829 -3 -3 47 -124 81 105 -1 57 53 36 -8 -42 62 -55 -30 29 58 -108 -22 27 31 -85 -39 15 -5 -71 110 29 4
2857 4 -16 -38 79 -86 -34 -29 -21 -138 -48 -21 -2 -123 1 70 44 -48 30 61 5 23 30 58 -16 73 104 -64 -29 77 13
2886 13 -127 7 40 79 -51 -70 43 42 -46 -65 53 46 -52 -10 -40 -16 -29 65 27 -70 1 6 -16 -120 85 13 5 -78 50
2915 50 46 -20 -51 84 102 -10 -125 34 -13 -28 -102 88 -46 -44 1 19 -4 -89 73 -78 -109 -46 -80 -4 0 -28 14 18
2943 18 -3 25 49 -42 9 34 12 -67 -7 92 -38 -130 -41 -3 19 -123 100 50 20 63 22 8 54 -75 32 21 0 42
2971 42 86 -33 -70 154 23 45 -53 -47 41 -96 -73 27 36 -32 -49 43 6 -48 -10 -101 31 23 106 140 -123 36 35 -79
2999 -79 -107 29 102 13 -148 -71 -6 100 -20 -29 -56 17 39 -45 69 10 -93 55 51 -58 100 2 -67 124 114 -52
3025 -52 8 9 -45 1 -63 -31 28 -57 -104 -56 50 -71 -22 -98 20 16 51 -40 -29 14 -33 97 -46 -86 -24 -59 -59 -75 28
3054 28 -27 106 -74 28 53 -9 52 -29 4 -37 -80 49 -20 -92 44 -67 50 -153 -11 85 -17 -24 -55 -33 -15 -63
3080 -63 33 -13 -92 45 117 31 45 84 66 -49 -78 -45 -57 -5 28 24 -137 -34 -1 -8 -29 -19 76 30 26 -29 35 52 -83
3109 -83 74 -31 49 -116 -67 65 -14 -134 -37 50 21 -10 67 4 -83 -29 55 -89 -106 13 64 -29 -10 112 1 -48
3135 -48 -6 -8 28 -67 36 41 -164 -92 52 102 -95 -117 47 51 -7 -15 101 49 -93 31 14 47 -149 67 51 -68 -19
3162 -19 -47 58 23 -41 -22 -3 -21 -42 -23 52 -26 66 -38 20 151 34 75 -47 -50 -34 3 -6 -9 -41 -43 -58 95 -19 -34
3191 -34 -70 110 -19 4 -11 -44 -80 72 -41 22 115 38 56 -32 -107 -1 26 -32 -48 -56 -30 12 -23 -60 98 43 -46 -110
3219 -110 22 -95 -14 -23 36 -37 -39 33 25 51 64 -56 74 -65 -60 88 -6 -16 111 7 15 56 115 -21 65 -52 56
3246 56 37 -70 -103 -23 -89 -22 -4 16 21 -49 52 5 6 47 -69 33 154 -32 51 -19 -20 36 -27 50 10 -99 115 -87
3274 -87 -13 -32 29 69 -15 32 10 -82 -18 38 -83 14 -31 33 5 -12 44 30 3 -13 29 -26 18 -32 -2 -82 -73 52 5 -113
3304 -113 85 12 -16 41 82 76 56 -88 48 -25 16 -31 -43 1 -52 -69 63 62 -15 49 -38 9 -33 -111 67 -16 -90 -42
3332 -42 -53 -1 2 57 32 -81 -27 1 102 11 16 22 9 -9 8 29 -93 -69 100 73 51 46 2 93 -19 -54 -7 35 31 63
3362 63 37 -110 -38 104 -83 -69 6 -23 -20 -27 -20 -21 1 -46 -5 -27 0 25 -147 1 -99 -48 30 14 -7 -21 113 39 6
3391 6 35 -33 31 40 96 5 48 -15 1 -63 -12 -42 91 -42 75 94 -48 30 -19 66 43 -53 9 31 77 -16 -32 36 -7
3420 -7 -30 0 19 -68 22 -163 10 62 11 -73 -56 -107 2 121 80 1 18 -22 -79 91 29 -10 49 -55 -17 52 33 -88
3448 -88 -41 -45 -45 -25 98 -52 -61 -32 66 -52 -45 -21 27 -23 -24 66 -9 -17 -60 21 -4 33 103 9 -16 57 -1 104 -121 13
3478 13 69 16 -96 12 -56 48 -15 -18 5 -56 -88 147 -41 -23 -35 28 55 -43 -90 -44 -20 -59 -40 -20 17 -31 65 17
3506 17 17 86 52 14 16 90 31 -70 -30 -34 -138 -46 14 59 14 55 -112 79 -39 -103 -5 -17 -75 -97 -50 73 -11 -80 29
3535 29 66 -39 109 -123 -51 -79 -31 -41 -5 9 76 44 -69 67 -86 47 -33 90 18 -8 35 51 16 41 -34 40
3561 40 29 -8 -4 9 -1 -69 -73 1 -19 -53 -72 -25 -22 -138 -121 65 33 -28 64 -61 -51 -141 -10 -42 -82 2 -15 -3 -10 24
3591 24 79 -32 -155 18 -1 52 -29 3 -29 61 0 -28 107 -115 93 -18 5 -98 -6 -83 -100 -48 -78 -17 -50 -2
3617 -2 10 -7 7 -35 4 29 59 -51 -56 -99 -67 69 52 -26 6 90 11 -28 65 -30 -38 18 39 12 20 -17 50 44 30 24 -41 13
3649 13 18 38 8 -110 -53 36 -32 17 49 16 66 -168 6 0 62 37 -136 16 -38 70 90 37 -38 78 -25 -22 -48 13
3677 13 6 -98 -5 14 0 1 -57 2 -33 -56 -84 27 95 -64 -25 -1 -50 9 75 -68 5 -11 -55 80 43 32 48 4 117
3706 117 -105 21 17 21 -54 -42 16 -98 16 30 -106 -104 32 64 -72 75 -13 -51 47 -45 89 4 8 75 -24 9 46
3733 46 -58 -25 -61 -49 29 -45 17 39 34 21 -44 25 31 20 49 -4 68 60 -147 -110 -24 -20 102 -98 -21 16 -11 65 -56 93
3763 93 -60 50 -96 -69 20 -32 67 -27 -20 52 136 -40 -29 -50 -19 23 -121 2 1 1 -19 -68 -25 37 -39 -18 59 -44
3791 -44 -45 25 -61 -15 33 46 59 23 39 5 106 -50 -126 -93 -83 -31 -34 20 83 35 47 6 -15 -74 20 62 72 -13 -12 -86 126
3822 126 61 93 -64 -38 -61 76 -124 -55 -18 1 -12 -58 32 18 -44 -32 -3 -84 -42 -48 26 37 -27 82 -54 5 13 47
3850 47 -19 11 40 80 -10 -64 -76 94 -93 -50 6 -2 -54 -12 107 2 -48 -104 41 -52 1 -83 56 38 -37 -58 -30 7
3878 7 -19 33 22 3 -88 -18 110 34 -2 -31 117 -123 -67 82 71 -115 86 44 162 -19 72 55 19 36 42 24 16 43
3906 43 -4 45 -8 -74 0 -16 11 48 -26 -15 -21 -68 29 -80 -21 40 -64 81 97 -17 27 53 -27 107 14 -77 -80 15 30
3935 30 31 -12 67 7 -6 76 -68 -58 -23 -54 -41 15 -41 -52 26 -86 4 -51 -134 60 29 -45 -15 -72 52 -115 38 -12
3963 -12 -2 -14 -10 21 43 -107 -10 -13 -38 -43 -10 103 14 109 61 -77 24 80 13 -82 58 -17 62 -97 -39 -46 -15 23 19 -3
3993 -3 -26 -55 -102 -44 -5 -68 9 10 51 -47 -120 51 -26 -93 17 38 -2 -4 -54 -92 -41 39 5 82 65 -4 -2 -28 -45 54 2
4024 2 13 -1 -37 -111 5 -9 16 -1 -69 55 -29 77 40 -18 -30 -29 -34 -39 28 72 -23 -100 -76 45 -80 78 -12 -2 27
4053 27 156 99 -46 12 -19 -26 6 84 -114 9 -52 -51 -96 -5 65 83 18 26 -95 58 -29 -117 -23 -78 -71 82 -30 -41
4081 -41 -33 -10 -73 -65 82 6 57 -78 -74 79 -91 22 75 -3 -14 -73 21 -69 -44 -15 7 -80 -5 -42 53 49 -19 -31 38 21
4111 21 82 -17 -1 -58 47 -64 -58 35 -26 0 -17 -15 -41 55 -108 -12 55 -7 -11 -20 -59 -23 -74 -58 -28 -79 -25 -76 -8 100
4141 100 -14 -1 23 -67 63 33 -104 -10 66 30 60 -21 90 19 -22 79 -58 71 -70 19 -19 51 4 -30 52 -19
4167 -19 -31 -19 47 -124 -6 -32 56 -53 -94 -103 -88 -7 -40 -6 -2 0 -8 -8 -17 -8 -36 4 -8 -63 83 -70 79 -9 19 37 45
4198 45 61 -64 53 -5 116 39 -66 -24 47 61 -22 7 66 -5 -5 25 22 -14 -24 -29 -68 -79 29 90 34 49 69 68 15 -11
4228 -11 -91 4 -11 -42 67 -10 -18 42 47 32 -101 -15 101 -100 36 -43 12 -44 9 23 -16 -34 43 52 -25 34 -33 15 -59
4257 -59 -39 -120 -11 -51 -101 -16 -8 62 -189 -64 135 -17 -45 -12 17 -26 3 8 86 65 13 -28 -51 98 -93 -39 -34 -56
4285 -56 129 39 -14 -23 -47 -41 -16 20 37 61 -36 25 -42 23 -24 -24 -40 -7 24 0 63 22 20 62 -40 30 -78 -17 113 54
4315 54 -50 -111 -34 60 0 44 -29 6 32 -49 -76 -5 -87 -74 25 -207 38 87 2 39 -35 -71 -77 -9 65 17 68 -25 -13
4344 -13 23 52 -19 46 -68 103 32 -30 92 -2 42 52 14 38 -3 -44 99 -42 -23 -86 -14 -45 42 -41 35 35 -22 32
4372 32 126 -6 32 16 -50 75 -49 -3 -50 -41 -156 -6 59 -55 4 55 -75 -111 -65 4 -68 -25 -26 85 44 3 60
4399 60 10 37 73 58 4 -78 46 24 93 27 46 -43 -22 -19 35 -7 -47 107 29 -46 -51 18 8 -18 105 19 -27 -57 -98 69
4429 69 -16 52 29 -5 59 -23 -88 27 -56 34 30 -43 2 47 50 -50 23 2 -23 -22 16 26 -68 -35 17 74 3 42 41 -22 5
4460 5 87 44 101 44 -86 59 -36 66 5 -15 10 -64 -134 1 16 31 2 63 26 12 -22 -49 -44 30 21 -20 -40 22 63 5
4490 5 -27 -71 28 116 29 -8 -65 -7 36 4 -17 -45 10 40 -130 86 83 13 -82 -5 -27 -93 10 -36 13 -25 -46 -73 -35 -38
4520 -38 -36 -92 58 62 -8 -130 16 -182 -98 -61 5 -9 8 45 66 40 6 5 -10 15 7 94 -10 25 -27 30 8 36 26 42
4550 42 82 3 58 -55 -127 12 48 -26 62 -11 17 -58 -63 30 -66 -81 -42 54 12 49 9 24 20 -22 -26 30 -12 7 3 -32 97
4581 97 39 -27 53 45 -1 -64 -71 7 31 -84 71 12 -53 -21 -50 23 10 -86 4 -42 -50 -8 -23 -84 23 -105 91 95 -31
4610 -31 19 56 16 69 -49 131 24 41 8 -108 -47 53 37 -9 -69 -61 -25 -30 16 -24 125 -6 103 -6 44 -7 23
4637 23 69 -3 -5 -22 -41 57 59 -84 61 9 23 15 40 18 -24 15 29 72 -16 54 27 7 66 47 21 -3 -26 -13 -17 46 -2
4668 -2 -41 71 49 -54 -54 77 -10 43 -28 -87 -77 39 18 114 -44 58 33 -33 94 -131 67 -11 -58 62 -34 -55
4694 -55 -5 -46 -32 44 6 15 -9 5 26 16 -107 -19 -11 -1 6 -24 -92 72 -27 106 -12 -19 3 28 -122 -59 1 7 -47 13
4724 13 0 59 -80 -20 -68 36 23 34 -9 35 20 -41 -23 -19 83 -8 49 -121 1 -109 105 38 -49 1 0 46 -13 65
4752 65 1 -68 6 34 39 -63 -40 -58 -140 -15 13 -25 7 20 7 -17 22 22 -37 45 59 26 3 -10 35 47 -18 34 9 42
4782 42 -21 21 -51 -49 67 15 -47 40 -60 -22 -55 -13 27 -2 4 -96 118 34 -114 43 56 10 40 -89 -8 20 -84
4809 -84 -10 -66 -70 39 23 78 103 139 32 166 16 24 54 -31 71 -28 47 7 -23 20 -40 -71 29 18 58 -71 -67 -47
4837 -47 -25 -5 -28 64 -28 -4 17 44 17 3 71 -43 -30 24 11 13 75 42 -1 87 -25 19 -68 16 16 92 -9 -82 -10 -52
4867 -52 101 72 -87 -49 -26 12 -93 -40 8 1 -68 47 -19 85 56 6 39 28 1 45 -24 -29 23 -65 57 -48 88
4894 88 -92 -30 17 11 -12 48 14 -94 -15 93 -51 -7 66 60 47 54 31 -62 22 50 -15 -23 5 -18 -26 22 -89 -46 17 19 91
4925 91 17 -53 71 -93 30 4 96 21 34 49 -31 -82 -13 50 91 -20 75 48 22 -85 -61 35 32 -92 -8 11 -2 14
4953 14 55 -68 -58 70 81 4 70 -51 -54 -87 -37 81 17 86 -7 65 99 -8 -44 24 0 -33 -59 40 -56 8 25 12
4981 12 87 16 52 61 74 25 33 22 -68 -40 -31 -75 -64 -31 -97 -50 5 40 -8 -48 21 -53 -55 2 6 1 -61 4 -19 -14 -6 -23 -56 -80
5015 -80 40 24 -47 -10 -184 -38 74 -61 17 27 15 48 124 -20 -39 16 -51 55 36 58 33 136 -2 35 33 23
5041 23 105 -41 -31 42 36 83 2 35 -38 -74 -7 -46 4 -67 -46 95 -8 105 -96 -122 -69 -9 -51 78 -2 -28 -40 38
5069 38 14 40 7 91 -113 -66 92 -17 60 -51 69 6 -18 -90 37 -7 32 -68 -27 -71 3 -2 -69 -42 104 74 -14
5096 -14 -3 -21 75 -73 24 -25 21 87 17 -3 8 -81 -30 -24 16 24 -24 -74 -19 -5 -40 -3 -36 21 -32 -40 -20 109 -82 68
5126 68 -54 57 64 -114 -30 -10 5 32 -40 58 -36 -20 -6 31 16 -41 36 67 -99 28 0 38 -32 -12 21 -68 -20 -27 -13
5155 -13 55 43 -17 117 35 53 15 -33 73 26 -30 -117 35 74 1 -47 -48 63 -17 -157 26 50 -1 70 -102 43 -33
5182 -33 1 -52 -14 88 87 11 -36 23 -9 14 -47 3 2 53 78 75 134 11 7 15 3 26 24 9 -115 37 -11 -17 -38 7 45 -42
5214 -42 -38 -14 -4 67 5 -29 -11 -89 7 57 -87 -34 39 32 -6 -42 25 28 -98 82 63 -72 14 70 39 -13 128 -33 36
5243 36 -1 72 -52 2 27 -19 108 -61 -12 37 56 31 -59 -32 -45 -45 -12 -10 -48 41 -35 66 -68 32 40 -10 25 -89
5271 -89 -2 95 -16 -91 -32 39 -48 22 -12 -129 -38 21 -39 -24 -52 68 106 -38 -19 34 -55 37 44 101 46 23 60 -40
5299 -40 7 -24 71 -49 23 -4 -19 -23 19 19 -17 -69 13 -106 -62 26 20 11 -72 39 -36 13 27 -11 31 92 31 -48 -74 52
5329 52 -58 -52 29 -47 8 -21 -37 -58 -37 -25 4 26 -70 -45 -11 70 -37 -18 -64 -81 -86 -5 -45 -34 -69 16 24 -78 -52 1
5359 1 42 -25 -14 6 80 -58 19 -48 44 31 60 12 60 35 -26 -76 100 -19 63 -35 6 49 -69 22 24 23 18 12 -25 -4 -10
5390 -10 47 -86 12 19 63 77 39 -11 -32 69 -26 68 101 -87 -18 7 -16 2 -48 65 31 -41 12 6 98 26 -58 -3 36
5419 36 -16 -63 19 79 -73 -58 125 24 -60 -23 -45 56 71 -51 -50 -50 -23 -21 -1 18 -4 2 -96 20 -9 22 16 -2 -27 39
5449 39 24 -16 51 7 5 74 36 105 89 -21 9 104 23 19 10 15 -31 -7 -37 39 3 56 -65 -45 3 23 -14 4 34 -41 17
5480 17 -34 -2 30 98 -65 66 -90 28 16 -17 48 34 52 -29 -48 89 -87 -96 27 16 55 -1 2 41 22 -92 50
5507 50 16 -10 -69 -22 -1 -9 -102 25 -85 -54 28 -105 11 44 -34 18 -60 -13 -53 -11 -60 -97 24 -69 208 -62 -20
5534 -20 17 -25 41 52 -60 52 -8 -22 53 -65 107 -80 -58 -20 -36 -62 2 98 68 -48 -92 -3 -24 -23 -73 25 11 1
5562 1 -43 -25 -136 29 100 107 -9 35 56 -4 13 -77 56 -76 -37 -8 22 112 -41 -60 49 -87 23 -19 64 64 77
5589 77 -15 20 12 45 -78 1 105 -54 1 1 54 -33 28 37 -28 14 -32 -24 -37 -38 -23 13 23 2 -22 -2 -25 -39 21 -14 -29
5620 -29 11 49 41 48 54 17 42 48 -38 -109 -30 101 2 -11 9 25 19 -51 60 -57 -55 32 17 104 -40 -102 95 -67 -27 9
5650 9 25 36 31 -19 -21 -122 124 -50 -46 -14 51 -3 7 25 17 -31 -103 33 -76 60 37 11 24 -24 -3 -83 39 -52 56
5679 56 -3 -111 59 -29 -29 101 23 -93 -7 -11 2 27 79 -32 -2 84 -16 41 124 12 -42 42 93 -34 67 -35
5705 -35 -18 4 -87 -106 18 64 12 -32 108 -34 -147 32 73 -33 -34 -80 -86 -151 80 -41 33 13 11 70 35 -24 26 -36
5733 -36 -16 7 -68 -33 -86 -47 -91 26 -76 -66 69 31 -29 74 100 8 0 70 27 70 -136 74 -11 -7 50 46 71 15 52
5762 52 -31 21 -62 -20 -34 23 64 22 -39 -73 -30 63 85 -16 13 35 -6 77 119 27 -42 -98 -123 -15 -13 -46 -16 -17 111 67
5792 67 -29 11 58 45 64 11 37 -32 33 -26 16 -91 63 -1 47 -14 83 -2 -31 -47 -1 -41 47 -20 -76 -48 -3 -26 -57
5821 -57 71 -126 20 32 29 10 -6 -83 52 -44 2 35 -26 -11 72 4 -48 -49 19 42 -27 -78 2 -47 8 -12 69 -13 -24
5850 -24 39 24 38 42 29 -79 17 42 -87 37 100 7 59 8 0 43 57 68 -7 -213 71 20 6 41 -13 49 -19 -19 1
5879 1 -17 -11 62 -38 -15 47 29 24 -22 57 -70 10 63 -58 -1 -59 -26 -44 -95 -36 -7 33 76 -10 8 -106 -23 -12 18 -26
5909 -26 12 -66 10 58 -17 37 36 1 77 -33 14 42 -7 -28 -40 -18 6 -34 167 -33 -27 41 -85 23 -36 31 35 -29 -7
5938 -7 -56 -65 0 -52 -38 25 24 -67 -26 71 84 -111 26 92 40 -18 49 -43 37 -35 -56 -9 -175 14 33 3 35 79 11 -33
5968 -33 50 44 49 -1 62 -50 0 61 -35 -84 -12 27 37 -49 -55 70 25 -11 -33 41 -131 -1 -4 65 48 23 39 -35 -20 -13 -80
5999 -80 -49 -100 18 -22 26 28 45 18 -43 68 33 13 22 77 -51 -83 -32 -28 -11 -52 76 53 -39 36 33 -57 0 -25 61 24
6029 24 -31 49 23 -28 48 29 29 73 -9 -70 48 16 51 -4 -31 35 5 121 56 1 67 -42 -20 -112 22 29 -37 -68 -56
6058 -56 -2 38 39 -24 -38 -61 -48 2 36 -12 33 -58 13 52 42 -56 15 -90 1 -3 29 -65 -21 -112 12 181 -97 4 -51
6087 -51 5 -49 -63 10 1 9 35 -28 -71 -5 30 65 50 23 -66 -91 33 74 38 7 32 -18 -48 -64 -34 -50 1 -93 76 9
6117 9 -68 -61 -14 -23 55 140 82 65 13 50 -19 59 71 71 28 0 -69 58 12 89 -58 35 46 58 -48 22 -86 65 18 -27
6147 -27 50 -15 -15 -14 -12 4 -8 -17 28 49 65 -1 22 -24 -45 -36 0 18 -55 7 25 -22 11 -32 -2 36 -61 9 -71 22 72 -43
6179 -43 6 46 60 -21 -67 -10 -106 37 11 -61 -4 44 -67 -28 80 72 76 129 1 81 40 -41 29 -38 8 -1 -53 52 -27
6208 -27 8 27 41 28 69 49 16 17 -5 5 46 -74 -26 95 73 39 62 77 -28 17 24 -78 26 3 21 4 -3 -46 -25
6237 -25 -64 21 -98 -38 -105 18 46 -37 20 29 61 -91 46 -9 20 -28 -9 80 -25 55 30 72 14 2 -114 35 10
6264 10 33 1 41 43 -101 6 18 34 -70 69 -74 -54 86 67 73 -32 -34 -25 -62 52 -52 22 -52 -40 41 -11 -9 0 -26
6293 -26 -50 -20 109 41 -13 -39 1 4 -107 -82 119 167 22 80 37 -45 -16 86 -35 89 -31 -11 26 39 27 -2 37
6320 37 -107 -35 47 -12 12 32 -45 -69 -37 52 -23 31 -79 93 -71 -45 56 -143 74 26 -83 50 -15 -1 66 12
6346 12 -53 -19 55 -87 -36 -16 -19 -64 -14 42 -3 -19 -29 -38 37 32 -14 61 -103 -32 -3 59 -2 8 -51 -59 -12 -56 -5 19 0
6377 0 41 21 10 -4 28 -49 13 1 -20 5 -45 -31 -76 7 44 12 99 -131 -111 -24 -45 41 8 26 10 -59 -31 -17 61 34
6407 34 -68 -62 0 5 42 57 -69 -81 9 -10 48 20 -59 0 -15 -72 76 -24 105 -100 31 -57 -15 -98 25 55 -1
6434 -1 -52 -13 -45 -72 67 -28 127 26 11 44 114 -39 34 -26 -79 -26 -62 -18 73 -15 -50 109 46 21 -95 116 -91
6461 -91 -81 -11 69 -5 -41 61 -53 22 48 14 30 86 -68 21 85 37 -91 7 28 -6 -50 -81 -47 -30 -82 -3 12 96
6489 96 -6 47 -44 48 -40 -46 12 -18 3 17 66 -5 46 18 99 102 9 -4 80 15 2 -77 -5 11 116 13 4 24 -33 66
6519 66 -50 43 34 -24 -1 -69 4 -1 -4 71 0 -45 -31 3 -63 -75 -54 -2 103 -9 19 35 -82 19 66 -28 39 -112 24
6548 24 41 18 -57 -11 52 -84 -49 -37 111 -49 29 24 -12 37 34 -18 -23 3 21 -5 60 40 71 -3 -22 -64 -32 -20 -53 -29
6578 -29 129 -72 22 6 -66 -58 85 91 -23 44 13 11 -55 -6 1 -6 -17 87 86 18 -36 -9 23 16 -30 -41 -54 113 -8 21
6608 21 -19 -18 -3 21 -5 -34 -19 -53 -10 3 -4 -89 -61 29 100 -14 22 2 81 4 -6 50 44 80 -4 -34 -38 105 51 21 45
6639 45 -38 -5 -47 59 -46 61 -39 -97 -36 -43 -63 -29 31 -20 -21 -21 -23 -30 59 -8 47 -42 -36 -58 51 54 -72 77 58 -79
6669 -79 -7 28 3 -61 11 -5 13 69 18 27 -31 -32 -40 4 -25 65 -35 29 48 5 -50 38 5 22 84 1 -59 1 -16 61 -13
6700 -13 96 -29 0 61 -22 38 30 -62 -37 69 -23 113 41 69 30 113 53 -8 82 -29 -15 3 24 114 -12 -46 72
6727 72 30 -105 -90 -1 -58 15 -20 49 -12 -23 30 14 -48 -63 -15 50 10 10 -102 -48 -2 -8 32 -41 107 18 -91 61 -37
6756 -37 -40 -18 34 14 52 20 -53 12 17 -35 16 19 -23 -26 71 -29 24 16 -68 -64 -67 46 -70 16 -87 -15 -7 4 -18 -71 51 -51
6788 -51 75 -33 112 23 84 11 64 -62 -44 47 63 8 -22 73 -57 -25 -29 146 13 37 -48 22 -22 87 45 -11 1
6815 1 23 15 31 69 -9 -44 15 -50 18 80 -37 -19 21 -68 -67 108 16 1 77 -75 -1 124 151 -33 -25 31 0 -60 19 -5
6845 -5 -48 74 -37 19 -33 73 24 -55 -15 -4 -26 -48 32 -29 -19 -1 -32 5 100 14 -17 69 -98 -46 -98 -21 -7 45 57
6874 57 32 1 -3 -87 21 71 -86 70 30 -2 7 0 76 -12 21 -8 6 -63 0 -14 -47 -59 -4 13 -41 1 -37 45 52 20 -21
6905 -21 -92 -16 -25 4 113 -7 -10 73 127 -91 -38 5 63 75 -10 47 76 -23 141 49 -120 27 4 -5 -27 75 -19 95
6933 95 -20 -2 -87 58 -59 -8 -42 -32 24 -16 -94 -2 -77 -93 13 7 -47 -60 5 -56 -45 70 -17 18 20 -2 144 17
6961 17 -74 -9 -46 52 -6 -17 10 -21 -66 28 -8 -29 -45 1 -22 49 -10 39 -8 9 52 -54 89 25 -40 -31 -73 27 20 -53
6991 -53 67 -35 -2 2 -11 77 -104 9 75 -15 56 -52 -10 12 -87 -2 -22 -46 -2 -5 55 118 29 -74 -32 85 1 6
7019 6 3 62 51 -77 74 0 -8 -12 8 36 11 -26 -27 -19 -45 12 19 37 61 54 -76 58 46 -29 -5 82 69 54 -3 -61 51 -73
7051 -73 -19 -36 -29 -26 -15 -37 -36 -6 69 63 -84 78 -31 -39 -91 -56 6 52 -115 19 -62 -4 27 30 15 5 -121 -26 -22 -13 -41
7082 -41 -76 -65 3 20 59 54 -49 -3 -65 -69 -23 47 -37 29 -51 -47 18 19 69 8 22 -12 -41 55 -38 -66 -5 45 45 -3 -84 31
7114 31 -55 65 28 -52 70 21 -16 -49 -36 9 -150 43 72 4 -18 -48 -39 -13 22 -10 6 -67 -25 31 -100 111 -20
7141 -20 8 17 76 -45 26 -28 13 22 44 53 -2 45 30 70 -4 112 7 2 -4 117 6 85 -51 114 -29 16 70 65 -3
7170 -3 -44 9 32 53 -11 40 111 -74 76 105 21 -4 52 -15 59 72 40 38 16 -34 -57 -8 -16 42 2 18 3 -1 57 42 85
7201 85 -74 -9 -49 -28 -14 -40 -15 -10 79 -11 24 14 23 4 -57 -49 -9 56 -60 -6 -51 -1 37 70 -114 3 68 -45 48
7230 48 -8 9 -24 -59 -72 96 45 45 -8 -35 32 28 19 -73 32 12 169 21 -24 17 30 -97 3 -28 -4 -38 -4 32 49
7259 49 92 10 -14 -22 47 -86 -16 -4 -38 123 85 72 2 80 -72 24 122 138 33 113 27 70 -10 -102 73 18 -30 -11
7287 -11 19 -20 35 28 45 17 90 26 43 107 -29 73 56 -14 54 -57 7 2 96 -39 32 -25 -10 -2 10 15 53 92 23 51
7317 51 -39 27 6 59 -22 -31 -8 15 -57 -43 -49 -31 80 70 63 36 -17 -32 -60 -33 49 1 -37 30 -49 43 5 125 52 31 39
7348 39 -57 -75 -50 -36 88 -30 -41 29 -29 -61 -20 47 -24 -46 -103 -30 2 41 -78 -41 -49 -24 14 -43 -8 -12 -13 62 -93 29
7378 29 -1 -24 47 -20 -45 20 10 -3 -6 -24 1 -37 -38 -31 -20 40 35 -18 -5 -42 68 -11 -137 17 -67 -74 55 70 110 53 7
7409 7 -44 -74 43 32 -23 15 71 -91 -35 22 -51 -50 -119 69 53 -2 47 92 54 30 38 -40 57 -42 3 86 24 25 53 -23 -9
7440 -9 29 2 24 -8 62 -42 14 -73 -35 18 -89 78 -49 -40 20 92 -40 -159 -8 9 35 14 8 -65 40 -6 75 86
7468 86 -61 52 59 -41 7 -26 16 -89 -16 8 42 67 6 35 29 -24 -53 -5 65 54 -22 58 -19 63 -4 61 -9 -54 -33
7497 -33 51 -31 11 -81 -110 2 33 73 -26 -43 -15 -113 41 43 45 85 -30 19 37 35 -10 81 -49 -47 -14 30 32 62 53 8 40
7528 40 -2 19 42 89 48 7 -23 6 -15 41 -9 -42 -36 -12 -28 35 43 86 -6 -72 -61 47 23 44 37 -40 65 17 39 71 -31
7559 -31 60 -60 -57 27 7 49 -3 41 11 16 9 -53 -2 -31 2 16 35 -11 -19 106 -102 44 63 44 -56 -23 -51 54 73
7588 73 122 -34 34 -11 -18 30 -31 -25 -52 74 23 9 56 12 -74 117 -3 44 121 20 -14 27 -52 -38 10 6 -4 71 -37
7617 -37 143 -80 -16 -40 -23 27 -7 22 -54 74 63 20 51 -8 92 48 -44 9 -37 27 28 8 53 -63 67 61 64 -33 15
7646 15 60 -13 -3 -22 18 -11 24 -31 71 -6 34 -26 -50 -63 66 -92 9 73 -126 120 106 -13 15 -7 48 -46 -15
7673 -15 22 18 60 -15 23 1 -31 94 -33 -31 11 20 50 -25 -28 115 72 -108 6 -103 -83 -41 145 11 52 15 67 -75
7701 -75 59 28 -91 49 -7 -3 76 3 -132 -37 16 -83 67 -112 72 9 -73 54 47 -22 16 27 49 -1 -45 21 -9
7728 -9 7 49 18 -30 -63 118 34 -31 -52 -13 37 53 5 -61 12 -10 -2 -14 -41 11 6 -12 -8 23 10 -82 3 -39 -13 9 49 75
7760 75 27 -11 62 -16 -58 -115 37 -23 7 -7 85 48 -32 -57 56 82 -56 -29 15 -78 1 -47 -98 -25 -111 -92 1 46 -30
7789 -30 -2 176 -31 -82 -64 -67 10 55 -101 37 -25 -27 10 -113 -124 56 63 88 18 88 28 6 20 35 3 71 -49 3
7817 3 79 57 -34 52 35 37 -6 4 -18 -29 -53 -18 -24 -14 47 -15 97 -28 -31 6 58 -22 -120 -14 -63 6 -46 -5 -6 43 -18
7848 -18 90 18 -13 -8 -2 43 75 41 41 -62 0 2 -59 -65 78 21 -35 46 -19 -84 70 -8 -47 4 32 -50 -40 -60 -11 -19 -47
7879 -47 -4 76 -38 4 33 15 -15 52 4 -11 27 72 -8 19 -8 5 15 -109 23 32 64 29 27 -17 53 -13 -34 -60 -89 -134
7909 -134 -15 80 15 72 37 -2 -19 -133 -82 -7 63 -46 -18 -29 -10 -26 -22 2 -15 -69 -22 21 -37 -37 58 14 -14 38 -66
7938 -66 30 -58 -85 35 5 99 -23 46 -20 60 34 13 -28 -8 -64 -18 -106 3 58 4 -3 -4 108 -15 50 10 -42 66
7966 66 -4 0 34 3 -23 -5 5 112 -29 36 14 28 64 -114 30 72 -35 -49 -31 21 -16 44 -15 79 51 -2 27 -109
7994 -109 51 -96 27 -57 62 4 -52 15 -67 23 -10 65 21 -20 28 -15 65 22 -16 47 -99 61 -64 13 -28 -76
8020 -76 -9 -13 3 25 -103 4 63 136 -58 32 62 -13 -40 72 -39 -8 -79 14 44 -9 19 -116 63 113 3 -11 40
8047 40 57 -35 9 25 -90 4 31 81 66 35 4 8 13 82 -72 -43 -50 -40 55 28 -137 -18 19 16 33 -19 -36 6 2 66 7
8078 7 71 -123 -58 -61 -22 76 54 -61 -83 -34 39 13 -38 -33 29 -20 18 -16 -19 -19 12 -14 -3 33 34 75 -83 78 -28 49 59
8109 59 -8 -2 -23 22 8 -81 -87 -40 -6 69 -12 9 3 -13 61 -25 -18 -63 32 -103 -36 -6 -70 8 45 73 -10 -25 -22 -40 32 24 -3
8142 -3 44 13 -11 -32 -10 7 19 -50 -17 9 -44 -30 51 103 19 49 -28 52 -20 -25 -28 24 -27 9 -17 -25 -78 25 -12 -48 -4 5
8174 5 56 -44 19 112 34 -78 12 69 65 146 -64 17 48 47 62 -13 -9
8191i
##END NTUPLES=NMR FID
##END=
