##TITLE=1H_AM_NVG2
 DMSO
 8 sc, 
 8.9.2023
##JCAMPDX= 6.0         $$ Bruker NMR JCAMP-DX V2.0
##DATA TYPE= NMR FID
##DATA CLASS= NTUPLES
##ORIGIN= UXNMR, Bruker Analytische Messtechnik GmbH
##OWNER= root
$$ XWIN-NMR		Version 3.5
$$ Fri Sep  8 13:44:29 2023 Russian Standard Time (UT+4h)  she@DPX200
##.OBSERVE FREQUENCY= 200.13135
##.OBSERVE NUCLEUS= ^1H
##.DELAY= (6, 6)
##.ACQUISITION MODE= SIMULTANEOUS
##.ACQUISITION SCHEME= undefined
##.AVERAGES= 8
##.DIGITISER RES= 18
##SPECTROMETER/DATA SYSTEM= spect
##.PULSE SEQUENCE= zg30
##.SOLVENT NAME= DMSO
##.SHIFT REFERENCE= (INTERNAL, DMSO, 0, 15.7039)
##AUDIT TRAIL= $$ (NUMBER, WHEN, WHO, WHERE, WHAT)
$$ ##TITLE= Audit trail, XWIN-NMR		Version 3.5
$$ ##JCAMPDX= 5.01
$$ ##ORIGIN= Bruker BioSpin GmbH
$$ ##OWNER= she
$$ F:/spectra/data/she/nmr/H-F/1/audita.txt
$$ ##AUDIT TRAIL=  $$ (NUMBER, WHEN, WHO, WHERE, WHAT)
(   1,<2023-09-08 13:43:24.06 +0400>,<she>,<DPX200>,
      <created by zg, POWCHK disabled, PULCHK disabled
       configuration hash MD5:
       00 E9 B6 7A A2 85 ED C7 34 08 36 98 17 FE 4E 26
       data hash MD5: 16K
       18 26 75 12 9E 11 F4 49 2B F6 43 F4 C5 5C DF 08>)
$$ ##END=
$$ 
$$ hash MD5
$$ A4 58 A1 C3 5F 0D 5E 99 BF BB 6D F2 D7 4A B4 AD
##$RELAX= 
##$RELAX= 
##$RELAX= 
##$RELAX= 
##$RELAX= 
##$RELAX= 
$$ Bruker specific parameters
$$ --------------------------
##$DU= <F:/spectra>
##$EXPNO= 1
##$NAME= <H-F>
##$PROCNO= 1
##$TYPE= <nmr>
##$USER= <she>
##$AMP= (0..31)
100 100 100 100 100 100 100 100 100 100 100 100 100 100 100 100 100 100 
100 100 100 100 100 100 100 100 100 100 100 100 100 100 
##$AQSEQ= 0
##$AQ_mod= 1
##$AUNM= <au_zg>
##$AUTOPOS= <>
##$BF1= 200.13
##$BF2= 200.13
##$BF3= 200.13
##$BF4= 200.13
##$BF5= 200.13
##$BF6= 200.13
##$BF7= 200.13
##$BF8= 200.13
##$BYTORDA= 1
##$CFDGTYP= 0
##$CFRGTYP= 5
##$CHEMSTR= <none>
##$CNST= (0..31)
1 1 145 1 1 1 1 1 1 1 1 1 1 1 1 1 1 1 1 1 1 1 1 1 1 1 1 1 1 1 1 1 
##$CPDPRG= <>
##$CPDPRG1= <>
##$CPDPRG2= <>
##$CPDPRG3= <>
##$CPDPRG4= <mlev>
##$CPDPRG5= <mlev>
##$CPDPRG6= <mlev>
##$CPDPRG7= <mlev>
##$CPDPRG8= <mlev>
##$CPDPRGB= <>
##$CPDPRGT= <>
##$D= (0..31)
0 1.2 0 0 0 0 0 0 0 0.06 0 0.03 0 0 0 0 0.0002 0 0 0 0 0 0 0 0 0 0 0 0 
0 0 0 
##$DATE= 1694166203
##$DBL= (0..7)
120 120 120 120 120 120 120 120 
##$DBP= (0..7)
150 150 150 150 150 150 150 150 
##$DBP07= 0
##$DBPNAM0= <>
##$DBPNAM1= <>
##$DBPNAM2= <>
##$DBPNAM3= <>
##$DBPNAM4= <>
##$DBPNAM5= <>
##$DBPNAM6= <>
##$DBPNAM7= <>
##$DBPOAL= (0..7)
0.5 0.5 0.5 0.5 0.5 0.5 0.5 0.5 
##$DBPOFFS= (0..7)
0 0 0 0 0 0 0 0 
##$DE= 6
##$DECBNUC= <off>
##$DECIM= 32
##$DECNUC= <off>
##$DECSTAT= 4
##$DIGMOD= 1
##$DIGTYP= 9
##$DL= (0..7)
0 120 120 120 120 120 120 120 
##$DP= (0..7)
150 150 150 150 150 150 150 150 
##$DP07= 0
##$DPNAME0= <>
##$DPNAME1= <>
##$DPNAME2= <>
##$DPNAME3= <>
##$DPNAME4= <>
##$DPNAME5= <>
##$DPNAME6= <>
##$DPNAME7= <>
##$DPOAL= (0..7)
0.5 0.5 0.5 0.5 0.5 0.5 0.5 0.5 
##$DPOFFS= (0..7)
0 0 0 0 0 0 0 0 
##$DQDMODE= 0
##$DR= 18
##$DS= 0
##$DSLIST= <SSSSSSSSSSSSSSS>
##$DSPFIRM= 0
$$ [...]
##$SUBNAM2= <"">
##$SUBNAM3= <"">
##$SUBNAM4= <"">
##$SUBNAM5= <"">
##$SUBNAM6= <"">
##$SUBNAM7= <"">
##$SUBNAM8= <"">
##$SUBNAM9= <"">
##$SW= 18.05172834244
##$SWIBOX= (0..15)
0 0 2 0 0 0 0 0 0 0 0 0 0 0 0 0 
##$SW_h= 3612.71676300578
##$TD= 16384
##$TD0= 1
##$TE= 0
##$TE2= 300
##$TE3= 300
##$TEG= 300
##$TL= (0..7)
0 120 120 120 120 120 120 120 
##$TP= (0..7)
150 150 150 150 150 150 150 150 
##$TP07= 0
##$TPNAME0= <>
##$TPNAME1= <>
##$TPNAME2= <>
##$TPNAME3= <>
##$TPNAME4= <>
##$TPNAME5= <>
##$TPNAME6= <>
##$TPNAME7= <>
##$TPOAL= (0..7)
0.5 0.5 0.5 0.5 0.5 0.5 0.5 0.5 
##$TPOFFS= (0..7)
0 0 0 0 0 0 0 0 
##$TUNHIN= 0
##$TUNHOUT= 0
##$TUNXOUT= 0
##$USERA1= <user>
##$USERA2= <user>
##$USERA3= <user>
##$USERA4= <user>
##$USERA5= <user>
##$V9= 5
##$VALIST= <valist>
##$VCLIST= <CCCCCCCCCCCCCCC>
##$VD= 0
##$VDLIST= <DDDDDDDDDDDDDDD>
##$VPLIST= <PPPPPPPPPPPPPPP>
##$VTLIST= <TTTTTTTTTTTTTTT>
##$WBST= 1024
##$WBSW= 4
##$XGAIN= (0..3)
0 0 0 0 
##$XL= 0
##$YL= 0
##$YMAX_a= 267374
##$YMIN_a= -121108
##$ZGOPTNS= <>
##$ZL1= 120
##$ZL2= 120
##$ZL3= 120
##$ZL4= 120
##$ABSF1= 10
##$ABSF2= 0
##$ABSG= 5
##$ABSL= 3
##$ALPHA= 0
##$AQORDER= 0
##$ASSFAC= 0
##$ASSFACI= 0
##$ASSFACX= 0
##$ASSWID= 0
##$AUNMP= <proc_1d>
##$AZFE= 0.1
##$AZFW= 0.1
##$BCFW= 1
##$BC_mod= 2
##$BYTORDP= 1
##$COROFFS= 0
##$CY= 11.3945322036743
##$DATMOD= 1
##$DC= 2
##$DFILT= <>
##$DTYPP= 0
##$F1P= 15.7292609196834
##$F2P= 12.9074282941183
##$FCOR= 0.5
##$FTSIZE= 0
##$FT_mod= 4
##$GAMMA= 1
##$GB= 0.15
##$INTBC= 1
##$INTSCL= 1
##$ISEN= 128
##$LB= 0.24
##$LEV0= 0
##$LPBIN= 0
##$MAXI= 10000
##$MC2= 0
##$MEAN= 0
##$ME_mod= 0
##$MI= 1.114404
##$NCOEF= 0
##$NC_proc= 0
##$NLEV= 6
##$NOISF1= 3.799351
##$NOISF2= 2.8
##$NSP= 1
##$NTH_PI= 0
##$NZP= 0
##$OFFSET= 15.70392
##$PC= 1
##$PHC0= -21559.32
##$PHC1= 8.65271
##$PH_mod= 1
##$PKNL= yes
##$PPARMOD= 0
##$PSCAL= 0
##$PSIGN= 0
##$REVERSE= no
##$SF= 200.130013532006
##$SI= 16384
##$SIGF1= 3
##$SIGF2= 2
##$SINO= 400
##$SIOLD= 16384
##$SREGLST= <1H.CDCl3>
##$SSB= 0
##$STSI= 0
##$STSR= 0
##$SW_p= 3612.71676300578
##$SYMM= 0
##$S_DEV= 0
##$TDeff= 0
##$TDoff= 0
##$TI= <>
##$TILT= no
##$TM1= 0
##$TM2= 0
##$TOPLEV= 0
##$USERP1= <user>
##$USERP2= <user>
##$USERP3= <user>
##$USERP4= <user>
##$USERP5= <user>
##$WDW= 1
##$XDIM= 8192
##$YMAX_p= 0
##$YMIN_p= 0
$$ End of Bruker specific parameters
$$ ---------------------------------
##NTUPLES= NMR FID
##VAR_NAME=  TIME,          FID/REAL,        FID/IMAG
##SYMBOL=    X,             R,               I
##VAR_TYPE=  INDEPENDENT,   DEPENDENT,       DEPENDENT
##VAR_FORM=  AFFN,          ASDF,            ASDF
##VAR_DIM=   8192,          8192,            8192
##UNITS=     SECONDS,       ARBITRARY UNITS, ARBITRARY UNITS
##FACTOR=    0.0002768,     1,               1
##FIRST=     0,             0,               0
##LAST=      2.2672688,     0,               0
##MIN=       0,             -121108,         0
##MAX=       2.2672688,     267374,          0
$$ Real data points
##PAGE= N=1
##DATA TABLE= (X++(R..R)), XYDATA
0@%%%%%%%%%%%Qj6J6j6J6k4L2l2M0m8N6p2Q8j04J20j36J56j80K08k40K72l07L47
34A84l92M42m96N55o20O92p70Q56r50J052j163J283j417J564j723J897k090K304
52A208k539K801l095L427l805M236m739N333o042O912q009R436j1375J4179j8602
67a0674K6603m5463J66447J09801l67822J21880J92358j35594r8669J05494J326
78F5687m3343r405o779R565M6548o3096o6225Q7623N4456j08105k5014P4937N276
91B2125m1287n559J5018K2007k3003l2995M3330L9874o5018l5073P1807L0851
103D2077o4645k2091N0148J6415l8268q884L4188O150l8610o815M7655J1914n4282
116b5048j8248N4126K4705m8240k7280M3165K4714m0836j5506M1835R153m1953
$$ plain form
0 0 0 0 0 0 0 0 0 0 0 0 0 8 -8 8 -8 8 -16 16 -16 24 -24 32 -40 48 -56 64 -72 84 -96 112 -128 144 -163 184
34 184 -208 234 -262 293 -327 365 -405 451 -499 553 -610 673 -744 820 -903 994 -1096 1208
52 1208 -1331 1470 -1625 1802 -2003 2233 -2506 2827 -3215 3697 -4312 5124 -6251 7928 -10674
67 -10674 15929 -29534 136913 246714 -121108 772 193130 57536 -41133 64361 65687
78 65687 22344 12939 6160 15725 62273 -823 -67048 20575 75031 -33074 -58088 16849 22125
91 22125 -19162 -24721 -9703 12304 -10699 -43694 -364 39510 -25508 -60581 11226 42077
103 42077 -22568 -44659 5489 21904 -16364 -25248 8940 15090 -23520 -30335 17320 29234 -25048
116 -25048 -43296 10830 35535 -12705 -39985 3180 27894 -12942 -28448 13387 22540 -19413
128a9413r954M4984K0002m5963k9730M5130L7041l8950l6454L3151L1480k9087
140B237k2806K8391J7791k9765j8302L0888K3947k9904l0520K4364L4055j7778
152A2598l2799J2082K5880j1290j7829J3261J2225j7749j2709K1261J5395k1242
164i16j8350J5746J8844q396j7592M634J3444o956q280J3161N201j9685o478K3178
178G555J1006k2444j5366J7990J7116j2840j5191J0497J0870j2195o966J5940
190E972O744j9219j1394K0358J8200j8383k2854J3908K3060r041j8951O435J2734
203G569o047q909P926R738r759j4361R881J9752p641k1783L489J9057O30j2675
217c133k581O056J992l005R90M335m277q317N724J1810m504j1616Q85P981K076
$$ plain form
128 -19413 -29367 15617 35619 -10344 -40074 5056 42097 3147 -33307 -156 31324 2237
140 2237 -20569 7822 25613 -4152 -22454 8434 32381 2477 -28043 -3679 30376 12598
152 12598 -20201 -8119 17761 6471 -11358 1903 14128 -3621 -16330 4931 20326 -916
164 -916 -19266 -3520 15324 6928 -10664 -6030 7414 458 -7822 5339 10540 -9145 -15623 7555
178 7555 18561 -3883 -19249 -1259 15857 3017 -12174 -1677 9193 -3002 -9968 5972
190 5972 12716 -6503 -17897 2461 20661 2278 -20576 -6668 16392 7351 -11600 -5165 7569
203 7569 1522 -7387 539 10277 518 -13843 -3962 15790 8149 -13634 -10145 8912 9542 -3133
217 -3133 -5714 342 2334 -671 319 4654 377 -7940 -2216 9594 5090 -6526 -5641 2340 4416
232D416k453k618j543l12K170N385N23r787m793J1075P751q817p721M365N297
247B938j222k258J466M84m633j704R134N228j1979r186J0974J1724o734j1381
261g149J662Q640J467n340j259L368j452l950M370O758n202j0022L150J1198J091
276G330r537m897N570O152j094m408j733J347J254J542J360k107m490N36N456
291B281K179l582l925m48L301M219m25n727l257M141N762m35n847l022L624M515
307C354j094l142k88P9o83K372L471k585o371Q5P589L640o127o538K547P422P80
324D511n409k474K306J632k19J039J40l340k201L796M799j679o195j951N380N141
340E276k372o144r20M358L015j211k600j862P31K493J772r86k447j910R59L999
$$ plain form
232 4416 1963 -655 -2198 -2510 -340 5045 5568 -4219 -9012 2063 9814 997 -6724 -2359 2938
247 2938 1716 -542 924 1408 -3225 -4929 4205 9433 -2546 -11732 -758 10966 4232 -7149
261 -7149 -5487 3153 4620 -720 -1979 1389 -63 -4013 357 7115 1913 -8109 -4959 6239 7330
276 7330 -2207 -7104 -1534 4618 3524 -884 -2617 -1270 -16 1526 2886 779 -3711 -3175 2281
291 2281 4460 878 -3047 -3495 -194 4025 3600 -2127 -5384 -1243 4519 4084 -1763 -4785 -1161 3354
307 3354 2260 -882 -1170 -1091 -1774 598 4069 1484 -4887 -4802 2787 6427 300 -6238 -3691 3731 4511
324 4511 -898 -3372 -1066 566 347 1386 1526 -1814 -4015 -219 4580 2901 -3294 -5245 135 5276
340 5276 2904 -3240 -4160 198 3213 2002 -598 -2460 -1729 764 2536 1550 -897 -2807 -1848 2151
356B151K026l851m756J414N794J876m207m316R48M881J804l129k933O18J532R36
372G88J284m94l284j885L505M218j183n422k131M361M800j737n491q62L468K450
388B385o69j729j557k15J625K257Kk502k870J055M597J703m148l952J681M396
404B059J565l115l563M77L639J535j639j870p01L83J795J964j015l440j321L169
420g8L669j093m673j771L776L601j269l809j036K084K073N3q99j676j210J515
436g43K855M92k911k825J001M210J559l622l558J388L733J223k099k574l82K287
452C4J965m55j819j404j7K197K204j150l532j064K964L125p46l748j905K768L319
469B736n73k961j408J130J880P68l98j929j483J222K865Q89k757k985Q41M081
$$ plain form
356 2151 4177 326 -4430 -3016 2778 4654 447 -3869 -2921 1960 3764 635 -2298 -1680 -148 788
372 788 2072 1578 -1706 -3591 -86 4132 2949 -2473 -4604 -243 4557 2820 -2671 -3533 -65 2385
388 2385 1716 -13 -1570 -1785 -160 2097 2099 -403 -3273 -2218 2379 4082 -66 -4018 -2337 2059
404 2059 3624 509 -3054 -2577 1062 2597 958 -912 -1613 -1230 565 2529 1514 -1926 -3247 -78
420 -78 3591 2498 -2175 -3946 -170 3431 2162 -1647 -2683 -599 1474 1527 628 -1048 -2258 -743
436 -743 2112 2604 -307 -3132 -2131 2079 3638 16 -3542 -2154 1579 2802 703 -1871 -2253 34
452 34 1999 1544 -275 -1679 -1696 501 2705 1555 -1977 -3041 -77 3048 2302 -1446 -3351 -583 2736
469 2736 2163 -798 -2206 -1076 804 1572 1174 -755 -2238 -1016 1849 2738 -19 -3004 -2163 1918
485A918J472l269k909J105K744J041j085k097r01J348J986N58j395k397l95L004
501G28K146j490l224p47K336K760m66k990j781J833K579L53j878k065K51K246
517E91J431p78k127j284J203K432R11k190k824N07L438J558k385k821M95K314
533D71J460o21k164j013J033J807Q36j061k344q10K560K617j335l056p47K243
549a24K201k79k387j347J115J798Q50j167k004m87J696K018j82k421j609J468
565h61K418M37j852k033K45K287J713j420k514k12J683J702J27k145j512J087
581h50J759P64q89j961r03K000K253p85k461j070J418K409K48k222j526Q17J641
598F42Q54n95j776r60J387K127O9k081j820Q90K581O95j770j899J77J802J324
$$ plain form
485 1918 3390 121 -2788 -1683 1061 2102 1017 -1080 -1981 -633 1353 1911 516 -1881 -2276 728
501 728 2874 1384 -1840 -2587 -251 2509 2043 -947 -2728 -895 1684 2037 159 -1906 -1655 591
517 591 2022 1244 -883 -2167 -964 1468 2379 189 -2635 -2128 1310 2868 483 -2338 -1843 471
533 471 1931 1310 -854 -1867 -834 973 1809 748 -1596 -2406 154 2771 1436 -1620 -2367 -124
549 -124 2077 1798 -589 -1936 -821 977 1827 660 -1344 -1831 -135 1883 1701 -720 -2329 -861
565 -861 1557 1994 142 -1891 -1646 641 2354 934 -1580 -1792 -109 1593 1720 -425 -1937 -850
581 -850 909 1673 784 -1177 -2080 -80 2173 1388 -1073 -2143 -725 1684 1932 -290 -1816 -999 642
598 642 1496 901 -875 -1835 -448 1679 1748 -333 -2153 -1263 1318 2013 243 -1656 -1479 323 1647
615A647n78j917j038J162J944N14j675j883N96J945J046r99j944p17J843J852
631A798m89j880j168Q05J993Q57j750j981M37J856J016m86j795j001J289J801
647A302L03j624j597L07K082J037j207k091J8J628J580o53j749q22Q18J603P77
664A712j338j840J6J952J265q45j851p86J549J706k69j574j226M74J805R57j244
681D63j762j02J438J468l32k020r24J269J646N6j082j409Q3J577J230q52j689
698i42n38J195J748l05j544j046O74J472P48j113j585j16J480J347l28j834r14
715a601J231J564J48j426j226J95J607J070q56j680k95J084J266R9j511j228O89
732h70J713N41j210j263o1J345J152m77j536o96R15J497K52j337j287L96J451
$$ plain form
615 1647 1069 -848 -1886 -724 1220 1734 59 -1824 -1228 717 1763 764 -1180 -1897 -54 1798
631 1798 1309 -571 -1739 -934 1059 1916 166 -1815 -1378 478 1494 1008 -787 -1788 -499 1302
647 1302 1605 -19 -1616 -1309 773 1810 603 -1488 -1470 158 1738 1085 -664 -1486 -668 935 1712
664 1712 374 -1466 -1450 502 1767 922 -929 -1715 -166 1540 1271 -303 -1529 -1055 750 1707 463
681 463 -1299 -1401 37 1505 1173 -847 -1771 -502 1144 1200 118 -1291 -1208 369 1599 747 -942
698 -942 -1480 -285 1463 1158 -386 -1432 -758 714 1462 349 -1236 -1352 128 1475 1147 -687 -1601
715 -1601 -370 1194 1342 -84 -1310 -1115 492 1562 706 -974 -1269 -185 1081 1180 -331 -1559 -870
732 -870 843 1384 174 -1089 -1150 195 1347 870 -666 -1362 -447 1050 1302 -35 -1322 -926 525
749E25R23q07j573k82J234J070o8j302j257P84J743L05j278j115O2J369R99n83
767G49j626l32Q03J404L04j353j288M21J655M93q72j291j47J108J248l08j367
784c99p86O80J226N77j154j308O8J509R68p86j339m70J054J234Jj235j040M91
802g09J314N94r17j231l05J417J095n80j345m88P80J092M34j195j091K25J291
819C81P81o48j188n93J160J236k25j246o82M08J190N60q29j160j04J030J129m40
837G60j257o03P70J148K36j166r38L86J026O54n51j064m30Q41J129p9j271p54
855a163O06J201K92p19j196R5J081P36l25j117n30P48J016J30r34q92L73R94O61
874A057p16r81k73Q09R74o8j077q23O46J100L78q83j102J82J068O24m69j024m00
$$ plain form
749 525 1448 641 -932 -1214 20 1090 1022 -280 -1537 -753 990 1295 17 -1098 -1036 333 1332 749
767 749 -877 -1209 -406 998 1302 -51 -1339 -918 737 1230 358 -933 -1080 28 1276 968 -399
784 -399 -1185 -505 721 1298 144 -1164 -1096 413 1381 595 -744 -1214 -160 1074 1075 -160 -1200 -709
802 -709 605 1199 282 -949 -1254 163 1258 678 -667 -1155 -375 717 1151 -44 -1135 -910 381
819 381 1162 514 -674 -1267 -107 1129 904 -342 -1024 -616 574 1134 305 -855 -959 71 1200 760
837 760 -497 -1100 -330 818 1054 -112 -1050 -664 362 1016 465 -599 -1029 -188 941 862 -409 -1163
855 -1163 -557 644 936 217 -979 -884 197 933 608 -509 -1039 -291 725 855 -79 -971 -598 396 1057
874 1057 341 -640 -913 -104 870 802 -275 -1098 -452 648 1026 143 -959 -777 291 915 446 -578 -978
893i78O72J062M2r14q42L05J156N51o67j223j02J026Q32k36r53o60N33J104J32
912H40p94q23J20J003O53n05j183l03R07Q17Oj097n90M46J048L80o53j059P4Q36
932A23O27j62r47o20O04J059K35q96q18R4R79O60n15j067k77J044O08j16p91p40
952i16M29J092K55o76q73m9Q92P53k77j087o10Q54R33K1r32o06K98Q25M89o06
972B09p67k53Q47O42j41o69p41M04R94L07p08r30N7J009N00l86r75j34O07O49
992E21J77p75p31K30R35M72n79p15k73O43R14k12q31n70M22R88N3o05p80K01P32
1013B17M38m26n62l53M46P25J71o40q04K31R04M20o15o99j43P06O63l44o59m68
1033g92O18O31J92n45p79Q0Q09M73m01o97l42N79Q89k1r56n24N46P55J38m59p20
$$ plain form
893 -978 -306 756 798 -116 -958 -653 503 1054 387 -836 -938 88 920 684 -269 -929 -396 708 840
912 840 46 -777 -657 346 999 494 -689 -992 -85 732 738 -359 -949 -503 545 925 272 -787 -713 123
932 123 750 588 -359 -979 -375 684 919 23 -795 -701 278 938 423 -644 -921 123 731 615 -176 -916
952 -916 -487 605 860 184 -689 -738 154 907 630 -457 -1067 -213 720 741 -191 -797 -499 326 815 209
972 209 -558 -811 36 678 537 -132 -873 -469 525 832 124 -806 -749 260 760 374 -601 -735 -128 521
992 521 698 -77 -808 -578 357 829 250 -465 -738 -95 819 607 -224 -794 -372 616 669 64 -716 -515 217
1013 217 655 229 -333 -686 -240 485 656 16 -788 -557 347 767 152 -547 -690 16 679 335 -324 -792
1033 -792 -174 457 649 104 -675 -595 214 687 286 -411 -753 -174 715 694 -262 -786 -240 515 653 194 -526
1054e26q8O48N99k19o40m81L73Q22J63p52n76J95P71L82n16o97k4N24O09m0p57
1075b30m43L20Q33J06m75o46j64Q16N09k25p42l08N09P24j9o60n56L85O27K76
1095F37m12p32q9N23O54o8p29m28K91P89L02o88o00MO91N30m18p45j38N72O61
1116F07j20n84m20J42O22L62l83o96j49P48M95k05o49l52L00P92R1p17l93J84
1136c25M88L54r4p31l56O13M75N3n32n61K32O93L06m82o09O1N03M54j60o59k23
1157e00L74M40J40m83l96N7N15L72l26n43k21N33N58o7n95l60K76O16N1m31l56
1178c46n4M96L80j37o08k47L20N12R6k95o28R3P08K29m01m67j44M45M80po15l51
1200e41K32M98K79l92o24J94N65K63k53n54j22L09N69L4m67n85L19M47L63k91
$$ plain form
1054 -526 -614 34 633 414 -226 -707 -334 488 651 -101 -677 -482 289 671 155 -542 -566 -42 567 527 -230
1075 -230 -673 -353 480 586 111 -535 -699 117 626 401 -341 -649 -140 584 565 -95 -651 -266 361 637
1095 637 225 -507 -596 -73 581 513 -216 -644 -353 436 738 50 -550 -546 145 675 257 -488 -626 -54 607
1116 607 487 -97 -517 -375 247 609 226 -470 -619 129 624 419 -230 -582 -282 510 601 -116 -509 -325
1136 -325 163 517 423 -308 -664 -51 424 477 -55 -616 -384 309 615 133 -476 -415 88 542 382 -277 -500
1157 -500 -126 314 454 -29 -425 -368 147 519 193 -350 -571 -38 520 453 -142 -502 -226 390 441 10 -346
1178 -346 -400 96 476 339 -269 -516 -196 316 412 117 -511 -418 290 519 118 -349 -493 -48 432 425 -190 -541
1200 -541 -309 189 468 76 -548 -354 211 474 221 -333 -455 -146 423 457 -10 -595 -276 171 534 243
1220B43n38j54M03K95J36o17k43K47M92K21m44n64R6O41K51j87o00r3L02N08j2
1241C83m46l55J14N54J77l28m91L3M82K91qo24l12M56L54R9l12m79J40M68L05
1262E01l84l01k53K63N33O4n28l69J96O59J03m83m39M7M40M29k86m35j94K29N70
1283C62Nl45l48J82K68L62l91m14r6M15K94R8m73k76R1N28J16l74l21l7M25L33
1305D04j22n00k22K51M63J91n16l76J82M01K14j96m76KK90L37j32l16k57N2O16
1326B90J24l59m22L4L67K24n2m51q3K52L47P7l51l46L4M84K56k80m72L2K62M73
1348D40j78m12k59K35M81R9l78l91P4L70L34k32m23j41L03M20O8m43m26J90M48
1369A79K50l61l64o8M41K44k2l78k33J52L83Nk76k71%M30K00k23k74j47L04L55
$$ plain form
1220 243 -295 -449 -46 249 385 -232 -475 -228 264 485 41 -523 -427 214 465 278 -322 -415 -113 395 383
1241 383 -63 -418 -304 250 427 99 -392 -359 123 414 406 -218 -530 -74 280 379 67 -412 -272 196 501
1262 501 117 -184 -437 -174 359 423 -105 -474 -278 381 484 1 -438 -391 49 478 192 -243 -437 -208 362
1283 362 367 22 -326 -144 124 486 95 -319 -415 0 294 392 -81 -357 -266 262 378 4 -317 -354 71 404
1305 404 282 -218 -440 -189 274 465 -51 -427 -245 156 370 174 -302 -300 -10 327 195 -121 -378 -326 290
1326 290 414 55 -367 -333 34 258 206 -245 -328 -76 271 348 -3 -349 -315 169 425 145 -327 -295 -33 440
1348 440 262 -150 -409 -174 307 406 28 -363 -289 81 415 183 -240 -381 -78 342 410 -33 -459 -269 179
1369 179 429 68 -296 -364 77 321 299 -79 -312 -160 223 228 -48 -319 -319 111 311 88 -186 -333 -29 326
1391C26Mm04l55K95K88N5j39l50j04M28L59j95l20k59K91L37M5k81l55pN32K36
1413D27m03l26NK73K27J41l61k67J70M29%k81k80o3M13K04j28l86r5J42L47R2
1435B80l86k60O6M22K46l21l00j35M30K47j61k23j95J74L88lj77m23L6L35K60
1456C00k08k07l8J04L77j06k90k97K08J86K70k12k99q8L33J96l7l55p1j9M16L7
1478B00j70l37%M46K07k11l31n9K14J80J00k75j81J89J56J23k04j94k10M33J56
1499B32l1l32j63J54M55K3l79k54J68K74O6o4j77k03Q7L72j05j62j45O6K40J83
1521C05k27l55O7K92J98j74k20j26K04K47L1l24j39J11J29J62o9k41j70K29L38
1542B68j08l12j25J69L30O9k64j79qJ96J71k6l57j44J34L10O9k11j97j09M75J33
$$ plain form
1391 326 330 -74 -429 -134 154 209 70 -280 -384 44 403 208 -112 -371 -80 257 302 21 -334 -341 191 427
1413 427 24 -302 -297 -24 203 344 -17 -284 -114 315 315 34 -246 -309 104 308 180 -206 -301 -159 188 280
1435 280 -106 -366 -300 122 368 47 -253 -388 42 289 128 -95 -290 -116 272 269 92 -331 -295 40 300
1456 300 92 -115 -153 -49 328 222 -68 -365 -157 29 299 87 -212 -300 33 229 192 -163 -234 -253 163 200
1478 200 30 -307 -307 139 346 135 -196 -255 -41 139 239 -36 -217 -28 128 251 47 -147 -357 76 232
1499 232 201 -131 -294 -140 315 338 -41 -295 -127 147 213 149 -28 -231 -144 228 123 -39 -184 -118 122 305
1521 305 78 -277 -210 82 280 106 -114 -240 -36 211 242 -82 -221 -110 19 181 112 -129 -299 -70 268
1542 268 160 -152 -277 -108 222 291 27 -152 -160 36 207 181 -176 -320 -186 124 193 -18 -215 -324 151 284
1564B84k45k72K8K87K43k64k96J8K26J24o2o2j13QJ27J82nm87j3K85K44o0j79
1587bk37J98K29L3j83k36L9J76j0K59l07j88J08K43J57k90k74oL10K36j18l57
1609b20MK40J43m8k09q9P8J06P2l0j90j63K55K94L0m71j73L38K15K2k37k37K81
1632A1R2ko5j28k7J57R4R0j54k95J7L42Q1q0m29j03M29K19k01k27k4L21Q9q7j51
1657c1n7j5Q5K45O1l24k82K01L79ml93j13J24M22n4l65j21K49J01Pj0j59j0n1
1681a15J88J06M9m31k7L56J44j26m62J04L64J41k55k85J49J82n9Jl9o1k5lL57
1704B53r5j59l15K17M30r1m83k2K59K37p2m10J88K13q8q4K0m0o3K0P8K35j09l28
1728b09j06N16J10k10l54N7K89J04r3k55J43P8j36M0M2Nk58J36K83N5k86m37M19
$$ plain form
1564 284 39 -233 -205 82 325 61 -235 -217 9 133 71 9 -104 -96 31 213 208 -279 -292 -7 237 177 -2
1587 -2 -239 -41 188 221 38 -198 -159 17 7 266 -41 -229 -121 122 279 -11 -285 -291 19 255 137 -220
1609 -220 -216 24 167 119 -90 -179 -101 5 77 47 -143 -306 -51 243 273 -198 -371 -33 182 204 -33 -270 11
1632 11 103 101 36 -92 -119 38 132 222 68 -227 -210 132 213 133 -296 -399 30 249 48 -179 -203 118 207 120 -31
1657 -31 -88 -103 -18 227 288 -36 -318 -117 262 258 -135 -248 -124 298 244 -121 -242 7 108 115 105 -54 -64 -115
1681 -115 73 179 228 -203 -230 126 270 144 -318 -214 150 291 36 -249 -100 82 23 24 -15 -76 -101 -104 253
1704 253 158 -1 -316 -99 331 240 -243 -265 -6 231 159 -251 -63 150 62 -22 -2 -42 -105 -85 -7 228 119 -209
1728 -209 -315 201 311 101 -253 -196 93 197 104 -151 -8 70 -66 -26 16 21 -237 -101 182 237 -49 -486 -67
1751f7M08n1l50j70K50J30Nk83K6J31l9J8Q1N1l00o5K06L33j77l89r7M26K41l67
1775d9j84J20J99l0j25n3J76Q1j78M4J76q5l71J23L72Q3l33k76K24L16%m02lK00
1799B5O2j46lM0l1j62J71J73O6m26o7L05L36l02l94O6M44R7k00k72K09K12n6j25
1823B2o2J33k64J1K06J88k00l34J38L86J52m43l11K97M22k48k26M0J46J4j14K8
1845a9M7k4j91J33K53K3m12j24L73K15k20l75J05L97k9j23k37K34k2q1L7J13R9
1868A72k27j11K78J61k64k54R8M49q6l38j65K90K18j04l56J91J61k04R8K4J13
1889A44j08k47J25L68j34l96k6L73K19k41l45K11O7J66k34o3J97m5j18M3K66r7
1911A25k93o4L05K01l26k80L28L41k29k36r1K76J86k38n2J15J2j35OJ69J8j72
$$ plain form
1751 -67 341 290 -60 -230 20 150 155 -128 -102 29 -10 8 89 140 -160 -225 -19 314 137 -252 -349 77 318 -49
1775 -49 -233 -113 86 56 -69 -122 54 135 -43 1 177 92 -279 -156 216 299 -34 -310 -86 230 230 -172 -175 25
1799 25 87 -59 -62 -22 -53 -215 -44 129 195 -231 -298 7 343 41 -353 -287 157 254 54 -218 -9 203 147 22
1823 22 -40 93 -171 -160 46 234 34 -300 -162 224 376 -67 -378 -81 341 93 -133 -93 53 67 -47 -19
1845 -19 28 4 -187 -54 199 222 -190 -314 59 274 54 -321 -216 181 152 29 -208 26 4 -77 -40 73 172
1868 172 -55 -166 112 273 9 -245 -147 302 216 -122 -287 3 221 117 -239 -48 113 -91 7 31 144
1889 144 36 -211 -86 282 148 -248 -274 99 318 77 -268 -57 10 176 -58 -121 76 31 -87 -44 222 125
1911 125 -168 -232 73 274 -52 -332 -4 337 108 -128 -219 57 243 5 -47 68 80 -55 -49 120 138 -34
1933c4l30L32L06j14l48r2M23K22m54j92J86K10p8j59K7J70j43j42J41L18k79
1954c0k88J66K69J29l88k90L59K79j33k03l4K81J7j57o1K09m7j53O1J66J9k66
1976i5j79L05K55j11m02R9K67J87l87q6K14pl2j33J13R8r2j82K50J00j53l65K22
1999a14L69q7k59q4J65J91j18j98O3J53m5j43J73j3l2k82J55L67j42j88j59K98
2021G0K58k64k79J43L06j33j61j16K05P9k17J5K88j25j98j33L62J42k37k68J40
2042a23L95j33l33lK09K47k25j85J99P3j43o9J81M1j25j87J56K27n6l05KK12J61
2065B16l57q4K29R7m7j72J24Q0j25l1K6K18j15k61O6L99Q5l92k43K89J53j17j62
2088a24O2J45J16k62n8K29J1k50Q3P5J35l19J4J42L32j80l82KK57K33l23r1O3
$$ plain form
1933 -34 -364 -32 274 160 -188 -280 143 365 -89 -281 -95 115 37 -122 -95 75 -68 -210 -69 249 -30
1954 -30 -318 -152 117 246 -142 -432 -73 206 73 -130 -164 117 134 -23 -84 125 78 -75 -14 152 171 -95
1976 -95 -274 31 286 175 -227 -128 139 326 -61 -147 67 60 28 -105 8 106 14 -168 82 182 29 -336 -114
1999 -114 255 168 -91 -175 -10 181 63 -135 -72 81 36 -107 66 53 21 -261 -106 261 119 -69 -228 70
2021 70 328 64 -215 -72 234 101 -60 -176 29 108 -109 -94 194 69 -129 -262 100 242 5 -263 -123
2042 -123 272 139 -194 -197 12 259 34 -151 48 121 -22 -91 90 131 6 -181 -25 202 146 -159 -157 55 216
2065 216 -141 -225 4 101 54 -118 6 86 -39 -70 -44 174 59 -202 -136 263 348 -44 -287 2 155 38 -124
2088 -124 -62 83 199 -63 -121 108 119 -131 -48 27 162 -157 -143 -1 331 151 -231 -229 28 261 -62 -153 -90
2111i0J83r7q7J66l1j20n8J33K83k15k70J59J70M7j49l22K90J59n2k89J21J15
2133D6N8k18J9J74nj54j3K33K4k92k6J28J99j1m19K89P2j7r9k2Q9J27r9j52J70
2158A01n7k30L7K21K3j71q6M9L19Jl09m1J58J55j39j96J88O2j27m3J66O4p1j46
2182g2j8K50K8m60J14K76N9k04j35J41L7J02j47l3J16m7j62J73R6j1k42J2J62
2205C5J21j25j07l6K28m4j13oJ44M1k20N2R2q3m2LN5K4n8j20J77J33o6k59J21
2230e3O8Q1q3j20Q8Q7p0o3K4J10j17L3J0J08l8j78M5J57K4j82j96J40K72p6j78
2255a07J01K8r1L2J9P2j08n1N6O9R0k21j4J59J02j20k74J29K65K4j17j80J32o2
2279f7Q7j7K4m2q6p8J95N9m2k44K58J32j40j54q6J82K26j26j18O9M7Pr7L1o9L0
$$ plain form
2111 -90 93 -4 -91 75 44 -76 -134 -1 282 67 -203 -44 126 173 24 -298 -8 151 99 -190 -69 46
2133 46 104 -114 -95 79 74 -80 -93 140 164 -128 -154 -26 173 162 -257 32 104 87 -12 -34 55 182 83 -69 101
2158 101 44 -186 -149 72 95 -76 -162 -113 206 207 -102 -143 15 170 31 -165 23 85 -42 -85 81 145 74 -72
2182 -72 -90 160 188 -272 -158 118 177 -27 -162 -21 16 118 -29 -62 54 7 -155 18 114 103 -139 -127 35
2205 35 156 31 -76 -112 116 72 -41 -47 97 138 -82 -30 62 -21 -63 -60 -5 19 -39 -159 18 151 85 -174 -53
2230 -53 15 96 13 -107 -19 68 -2 -65 -41 69 -48 -15 -5 103 65 -113 -68 89 113 -69 -265 -125 147 71 -107
2255 -107 -6 22 -69 -37 -18 54 -54 -105 -49 20 110 -111 -125 34 136 16 -258 -129 136 160 43 -137 -5 -67
2279 -67 20 3 27 -15 -101 -179 16 75 33 -211 47 179 39 -115 -201 -19 207 81 -37 32 79 86 -11 20 -49 -19
2305a9j06J24L5J40j82j26K82pj69l2n2P9M5K2o0Q2q0j33J67NK3k4r3O9J87j98
2331b1r0R9K14n7q5j73J74N6k12O5J7L9p7kOJ44j06k7o3K62j14j15rJ48O4j24
2357A3j10L9P9m6N7j19J12p5j8R7J64k43%J6J16o6L4jN6o2j4N0r4MN9n5Q4L3o9
2386D1m6K9L8p7k6p9J52Q0m0j35n8K43n8p4j01N7R5o1O8n6N9j33N5l6O4L2q3P9
2414B9k2R8j56q8J04O9P3p6p5R0n5R8j00Nj10RJ39N6j65J27j11K1O1Lj43R1M6
2441A8O4p5mo2NK6j8M0N3j00qP6M4j17L9L3m8J75k29k2J81k7j0K8o2J2Pn4L3P
2471EJm4J2M9Mj01L4J8j1O7mr6M9M5K5p1k1j1N1M4n6J2q6P5OM7j4q8MQ5P6q1j7
2504Hj21L6Q8L6L3k05N8N9j2J9q0k3J33j8L6j27r8J55M8O2r4k1m3Q4k0oQ5j63
$$ plain form
2305 -19 -125 -1 34 174 -8 -134 148 141 -28 -60 -112 -33 12 34 -26 56 -24 -157 10 15 38 14 -79 -10 177 -21
2331 -21 -111 -12 202 145 60 -113 61 117 -95 -30 -13 26 -51 -53 -47 97 -9 -36 -99 163 49 -66 -75 73 137 13
2357 13 -97 -58 21 -25 32 -87 25 -50 -68 29 193 -50 -50 -34 82 16 50 49 105 43 29 79 -15 -11 48 -7 77 110 41
2386 41 -5 24 62 -15 -41 -120 32 112 72 -63 -121 122 64 -10 -111 -54 41 -20 48 -8 51 -82 -27 -63 1 33 -50 29
2414 29 7 105 -51 -139 -35 34 107 31 -44 46 -9 89 -11 -6 -116 -107 32 88 -77 50 -61 -40 21 24 -119 -28 18
2441 18 82 7 3 -59 -54 -28 -46 -6 47 -53 -61 15 59 -58 -19 14 -34 141 -88 -110 71 44 34 62 0 12 19 -35 -2 5
2471 5 6 -38 -26 23 27 -74 -40 -22 -33 34 30 -66 -17 28 53 -18 -39 -50 1 45 -11 1 -85 -10 -4 43 29 -59 -55 30 106 25 8
2504 8 -113 -77 11 47 80 -125 -67 -8 -20 -1 -81 -104 29 11 47 -80 -178 -23 25 87 -7 -28 -71 13 -7 -13 72 -91
2532i1J49n3Q4j09m3L5k7K9N4n1jM1P3m7j21j4Q9J00%r2o9J1K2J39m9m8p2O4J45
2561A48j49m0jK7LK2L8j4l8j4K8j17J68r3k9J34q7Qq5J48n0Q3N5k38L9J14q3N8
2589C5n2o7O2O3J9r0M1P0r1l4K2m3O2K2J2J5n3j5q1R7R1j0p4j1M2J6m3m3OPM2
2620A7l0k1j01J93m9J55k11j23J00J10l7L5n1l8P1M9o6Q6l1r0j4L1J25j67M5l
2646a5P3QM6j78J9K1j1MJ8p1J77k4k2m1j06O8J27m0p7M4n3n5N2RRJ20r8lO8j13
2676d4K4l4m9J14n7J6j9K9l3P3l7o8j1R3JP0j7M3r5o8J11l2o9R7o5J10o5Jr5J51
2706G5q9q9N0Q9O8k9j6r5P3o2L7P5p5r1M3J9K4J0l5M6n6n8J60K3j90O0K5O9p8
2735a7k6M2J59n5j28lLj8O4r1J24k3p8J17q5J0k5nN0K7m8rr1P3J02k6J0o3n6N8
$$ plain form
2532 -91 58 5 89 -20 -63 -28 -55 -26 28 -23 -24 17 90 43 -78 -92 -3 97 97 5 -64 -53 -31 108 59 11 -61 3 148
2561 148 -1 -41 -42 -15 -12 10 48 34 -4 -18 10 -107 61 -32 -61 73 -14 -6 -91 57 7 90 145 -93 -54 60 -23 35
2589 35 -17 -84 -22 41 60 -30 11 81 -10 -44 -22 -65 -3 19 31 46 -7 -22 -103 -6 85 75 1 -10 32 48 5 -38 -32 -25 17
2620 17 -13 -34 -135 58 9 164 -47 -170 -70 40 3 38 -13 -51 20 69 3 89 58 -32 -46 -15 110 -57 -12 -15
2646 -15 58 66 112 -66 -47 -26 -37 -33 -15 -86 91 67 45 4 -102 -34 93 53 -24 20 -33 -88 -36 -27 -18 102 4 1 69 -44
2676 -44 -20 -54 -103 11 -46 -30 -49 -20 -53 20 -17 -85 -96 -3 -2 68 51 94 -1 -69 42 10 -59 38 -27 83 18 19 -76 75
2706 75 -14 -103 -53 36 104 75 59 -36 37 -25 12 87 12 -79 -36 -17 7 17 -18 28 -28 -86 74 97 -93 -33 -8 61 -17
2735 -17 -43 -1 158 103 -25 -28 -25 -43 21 -70 54 31 -47 70 -15 -5 -30 -35 15 42 -6 -15 -106 -33 69 43 53 -10 -66 -8
2765hn8J05j0m7n1J19M7l8j00l9J3M1M7n2L3j9L2j4k2NJ0L4k5M2j40kM9Q6m7l
2795a2Qj4P3n2n0m5M2L6J38p5m6L3rO6q3p9J48j32j3LR2p1n5J18Q5j26km2K3K8
2825a3K7Qr9M0j0M4q3J38j3r9k5J14m5m6L2O2l7K1k7nq1O7K1qp0J77j50J4L4r
2855b1J19j42P0p0lLoO8n2J9J5p7J51m8M5j26J40j11O4j5j29R1Q1O8j02J0K7j35
2883f6R2l2N3J8Rp4K1kJr8J30l8n5P0m5o4KJ8M9l0K3K1J7j4N7j58K0N6N7jn6j3
2915c2J6j7M1l2Jl6P1N3j24K3PN8o7R9r0Pj2m5M6n4M9Pj2K9M5q5R5N3k9n3j04
2946i2J20j03N5j11J15P4j25R1Mj3j9M5L6j73Q8r2J48n9q0N0Pq1Q1L8J09p7j79
2973a43J68j19kJ19j7n9K0l2J13m9M0J6p5%K5m2L1l7J33n1l6j1J1k6NJ8n5K4Q5
$$ plain form
2765 -8 -66 39 29 -18 -69 50 97 59 -41 -80 -67 -26 21 -31 2 -17 15 1 -21 -16 -6 28 3 45 -95 -97 -48 38 -9 -12
2795 -12 -4 -18 55 3 -47 -92 -50 -14 124 49 3 36 27 93 10 -69 79 -53 -66 -63 29 -42 -97 21 106 -20 -22 -64 -41 -13
2825 -13 14 22 -77 -37 -47 -3 -86 52 39 -60 -85 29 -16 -62 -30 32 -5 16 -11 -16 -97 -30 -9 -17 -87 90 -60 -46 -12 -21
2855 -21 98 -44 26 -44 -47 -44 -50 18 -34 -15 0 -77 74 26 71 -55 85 -26 38 23 -106 -15 66 134 32 42 69 -66
2883 -66 26 -6 47 65 74 0 21 19 20 -78 52 14 -41 29 -16 -80 -78 -60 -11 -41 -18 3 20 6 63 -95 -75 -19 38 37 -19 -32
2915 -32 -16 -33 8 -24 -23 -59 12 65 -59 -36 -29 29 -38 61 -29 -22 -34 -79 -33 -87 -38 -31 -43 -14 31 -54 41 94 65 12 -92
2946 -92 28 -75 -20 -131 -16 58 -67 24 28 15 -4 41 77 -96 -8 -100 48 -11 -91 -41 -34 -115 -34 4 113 36 -143
2973 -143 25 -94 -96 23 6 -53 -33 -65 48 -1 39 55 -20 -20 5 -37 -6 -43 90 39 3 -8 3 -23 -18 0 -55 -31 54
3002E4l0k2J9nJl4J08k9j5Mp2R5kq7k3P7RJ8m1l2o1oJ36p1j1Pqo4J41q6oL5Oo6
3036f1n1N9J04o4K8j6N4o3J00r9J2R3j16J8L7j5j4L7r9P4Q6K7j40K8MMl9Pl6K4
3066a7N0n0O8Kj02mJ00Qn5m1p9J45j10M0%N0K1n0O5Q9j30QJ1Qo6pJ04p8O3N4n8
3097C9k3k6Mk6J6J05j77O3R2P0j71p3J14p4N7l5J1j5P3on1R4k3l4%Mj9lk2Mj6
3128d8Q2r4O9J36j40j06J03O5p7%J4L5m4o3J00l6K7m7o3J24K7j01O8l8J3j1L8
3155C3k1n6l0MN7M0Lq3n4M0J20o5K0O9j57R5j2q6M6K8K2K4q4K1L5J9J0o9O9j09
3185g1J11J5l4p0M0OJ2l8N0l4JK5l7k5Q6j7J6nl6n7L2q3J41P2n7m6L5l0K0J1J0
3216D3N1k1n2O7r0oJ24q9m4mJ5N6j5n4O2j19J89j12m0j2M1RP1p2l4mmON8R9j33
$$ plain form
3002 54 24 2 21 16 17 -17 91 62 47 51 -21 74 72 -15 -38 39 48 66 25 -7 -68 -74 62 -9 -20 -13 -21 -85 56 -30 -36 -1 5 -61
3036 -61 -112 -53 51 -13 15 -1 53 -10 90 -9 3 96 -20 -2 35 20 6 43 -56 18 104 131 -9 19 23 27 -12 -5 -41 -17
3066 -17 33 -17 51 53 -49 -53 47 55 0 -41 -120 25 -85 -45 -45 5 26 -24 41 130 0 8 19 27 -39 -46 58 -20 43 97 39
3097 39 16 -10 -6 -32 -16 89 -88 -25 67 137 -34 -107 7 -67 -10 -45 -34 -49 24 18 -33 61 38 4 4 8 -11 -14 -36 -32 -48
3128 -48 34 -60 9 145 5 -101 2 67 -10 -10 4 39 -5 -68 32 -4 23 -24 -87 37 64 -37 31 -7 6 -5 33
3155 33 12 -44 -74 -70 -13 27 30 -53 -107 -67 53 -12 8 77 -80 15 3 -83 -37 -9 13 37 -47 -26 9 28 38 -31 38 -71
3185 -71 40 55 21 -49 -9 -3 9 -29 21 -13 -12 13 -24 -49 37 20 36 31 -5 -62 -30 -113 28 100 43 -3 32 2 22 33 43
3216 43 94 73 21 88 -2 -8 116 27 -17 -21 -6 50 35 -19 43 -76 113 1 -39 -51 -10 -1 70 -2 -36 -40 -44 -38 20 119 -14
3247a4J1m5K4LkP2j23L9rP1N5q3Q7j61J04n6R5nQp5j4L8L5j12Q8n0o1R7J6M7O5
3278A45j61Q9q2p6K05r9j9j9O4j27J20m2N4n0J25m7n7q0j5N6J5L6K3j54PJ25j29
3305i3J2J21n8n9P2O9o3J4j3P6j22kM8Qj1q3J09m9QMR7p4pJ1o2M1M7Kjl6j6M2
3337C2m4k2M0o6Q0K5l0q4N7N7n8Pj5M6l1N9m6r7J60j38J64j05J4J4k8j8J9M2n8
3366b4N1m1J7m6O3L0q7j1M1k6N2n5K3Lo5J1M8K5r2N9M8J0J3j2P2j43M0K5j1n1
3396c3mL8m7n0J26O1j27k5J20p2n0j2J35j11RJ33o7q8KJ8R1m9p4R9l2K7k5J05
3424I8j17j33J50p2M5M7O2q5Q0m1m0j9p4P8JK3L3m4p1O2Kp0O7J6l5J03l1nm8o8
3454h6Q7N3q1L8L3k7K8l0n2O3m7J07j01P4m4qk2J64j76J3j11J61j5l9J5l1k7O1
$$ plain form
3247 -14 -3 -48 -24 -21 -23 49 -74 -35 -44 27 82 -1 86 -75 29 -27 68 63 71 -4 -18 20 55 -57 31 -19 -80 17 33 80 145
3278 145 -16 73 -9 -85 120 21 2 -17 47 -80 40 -2 52 2 127 80 23 -57 -72 -16 -1 35 58 -96 -89 36 -93
3305 -93 -81 40 -18 -77 -5 64 1 15 2 78 -44 -46 2 10 -1 -84 25 -24 -16 -12 85 11 4 15 -47 -6 41 43 42 6 -10 32
3337 32 -12 -34 6 -60 20 45 15 -69 -12 45 -13 -6 -21 25 -6 53 7 -90 70 -68 96 -9 5 19 -9 -27 -8 34 -24
3366 -24 27 -14 3 -43 20 50 -37 -48 -7 -33 19 -36 -13 -10 -75 -64 -16 9 -83 -24 24 34 47 35 107 -36 4 29 18 -33
3396 -33 -37 1 -46 -96 30 91 -36 -61 59 -13 -63 -75 60 -51 -42 91 24 -64 -62 -44 47 -2 -76 23 -9 18 -7 98
3424 98 -19 -152 -2 -74 -29 18 80 -5 75 34 -6 -25 -99 -21 -20 3 36 -8 -79 -17 -15 -85 -18 -2 -37 66 35 30 -18 -86
3454 -86 1 54 -27 11 44 17 45 15 -37 26 -21 86 -15 59 15 7 -15 149 -27 -14 -125 36 21 -18 -3 -34 -61 0
3482@R7j67Q4L2k1L3J9r7M1m4pK0J9l6R6k3j0j03R5j29J59l3L2p8K4Om7P1o6j7
3512e0j7P5j6j9k9J26l6o1m0O7J1l2J8j03J12J0m5n4J45np1n3n0K04p7k4j14J28
3540@k0K5M5J4l4o4M1l4o2R9Rj33J28J9j61J62p4J9P6l8oL5p1M0rm0Q7j7n3L5
3570A8o7N2Ol0QJ5q5P6N8j06K62k21n1j5J24j47R6J7K2n7K2K0rNj0P7l8M6o0k7
3600AL6n0L5R2j13j3p8J08m8L3k5k3N4O0r5m5N9J1j01J64j10OJ5%p4P8J9n5J23
3629F4j36J1L4k0j7J16j21KkJ34j05O7p3J3J77r5q0Q3j20Q3R0j69J3K3Q5j25P1
3656CK6r6n7J16J8l8k4j9Q1K5j5M3o2o3N4n1J45Jm8o5l2P0rRr6K6J13m5k0R3o4
3687A9n0J5K7P6r8K1nOJ6mn0km9P6m4J03j30L6N9r6P1Pnn8M8j2r6J83M3o0k7p5
$$ plain form
3482 0 97 -70 14 46 25 58 77 -20 21 -23 -30 -10 9 -27 69 46 36 -67 28 -101 58 25 57 -21 3 9 -38 33 -33 -50
3512 -50 -67 8 -8 -27 -56 70 34 -27 -67 0 11 -21 -3 -106 6 16 -29 -83 62 57 -14 -67 -117 87 10 -14 -128 0
3540 0 -20 5 50 64 30 -34 7 -27 -89 10 19 -114 14 33 -128 34 -40 -21 55 17 11 46 -25 15 6 -34 53 36 -17 18
3570 18 -49 3 9 -21 -13 2 -83 -7 51 -55 207 -14 -65 -80 44 -103 -7 10 32 -25 -3 17 8 13 3 80 42 88 28 1
3600 1 37 -13 22 114 1 -12 -90 18 -30 3 -22 -45 9 69 -26 -71 -12 -1 -102 62 -48 -42 -27 -27 -101 -23 -4 -59 64
3629 64 -72 -61 -27 -47 -64 52 -69 -67 -69 65 -40 27 -46 -33 144 49 -31 52 -68 15 105 -64 -51 -28 57 -68 3
3656 3 29 -67 -124 -8 10 -28 -52 -71 10 35 20 63 1 -62 -8 -59 86 87 39 -26 -58 12 3 12 -84 -58 55 10 -10 83 19
3687 19 -31 -16 11 87 -11 10 5 11 27 23 -27 -29 -78 -2 -46 57 -73 -37 22 -74 -3 4 -1 -59 -11 -23 -119 64 107 47 20 -55
3719e5J07m0N4k2ro5K0j03J39k4K6J5j09M0pM8m7O9j31J56j6l2m8oO6o3R9p3L1
3748B0j2L0k2q2R6l6J3o2LJ02o0Q5j12OP1o2j4j3Q1j06P4K6J4M3r1pmK1L8l6r2
3779h8J04q4Q2L0j07J53j45J2l8J06m4r1J7M4N8l5ook8J39M5o0j39J52j75J36
3805C2K5q4n9R1m0%q9O9J07r5k4L3J3R5l0j01Lm2N6M3Jp9R1o6O3L6o4lK5nQ9m8
3837D3l1P0j28k5qM3M5P5j03n8J30m1k6r8J08m2J10q2l4J26p7JK4Po4j2M8Pjl1
3867b4P0j00m4R9n6J34n1K7q3NJJL0l7n8R5%ppm7N6l3Q9p4K4N6n8n9R1l5nn9N7
3900bQ4o8o3P2j7j8l1N7qJ8j53J72Q7j67j1M5M1r3J4L3k4l5J26n3L7j1M2j83J78
3929F9l0q2J04j08J50j33OJ31r9M1o1P5n3J16j42L3j0J1o6O5p3N2Ol2N6q7J13
$$ plain form
3719 -55 52 12 66 44 35 -30 -10 -113 26 2 28 43 -66 -26 -33 15 -32 37 -94 62 46 14 -34 -40 26 -37 62 -11 20
3748 20 8 38 16 -66 30 -6 7 -55 -52 50 -10 75 -37 -31 40 -22 -36 -49 32 -74 0 26 40 83 -8 -15 -19 2 40 4 -88
3779 -88 16 -68 14 44 -63 90 -55 -43 -81 25 -19 -110 -93 -49 9 -26 -32 -38 -66 73 118 58 -81 71 -104 32
3805 32 57 -27 -86 5 -35 -35 -124 -55 52 -43 -67 -34 -21 74 44 -57 -54 -96 -40 3 4 -75 16 -50 13 49 -15 -18 7 2 91 43
3837 43 12 82 -46 -71 -79 -36 9 84 -19 -77 53 12 -14 -112 -4 -46 64 -18 -52 74 -3 -2 22 29 -35 -47 1 8 7 -24
3867 -24 46 -54 -98 1 -55 79 28 55 -28 -23 -22 -21 9 -28 -86 9 9 2 -5 -52 4 -29 60 -14 10 66 8 -51 40 5 0 -59 -2
3900 -2 82 14 -49 23 6 -12 -43 14 6 24 -129 43 130 -37 -48 -3 38 -55 -41 -8 -32 -67 59 6 43 32 74 -109 69
3929 69 39 -43 61 -47 103 -30 -24 107 8 49 -12 63 10 126 -16 17 7 18 -48 17 -56 -4 2 -30 26 -61 52
3956E2q1j52J95pmJ08n8pn0k8L3m5O7n4q0l1J02J12j6k4LJ4j10j1P4n7M0k7L9
3985cJ3j1p9J03j1j6n5r5J79l7J5l5j0RP3o3j1K0L0r3%J59n9j9j25J12K5n6O4
4014B4m2K2L4m0M4j30L1j4J05N8p7q6L1KM7J1l5j54J02J9oO6q8O0R5j41N9N6L
4043E6j81J68n9lp4R4L6j7r4Q5O3j25n9R7o2J16K6j02M8p5j0N4M4m2K1n9O6Kk0
4072fK5j29R2R9n3j6N3j30O5O7j6p1l5N8P8pn1M5n3pl8J5oL9k9K7l9P1J01j92
4102d3KJ25n0r0k1J36p5Q0j41N3J1NM2p9j4P2m3n0M1m0R2k8K3Lqj6j9Q1k5j6o2
4133e4O1j4M4J9K5q9k8L6lJ1l6K0K8q0Q7j13M5jN6j01J34rq6R6po6q8J38lk5J7
4164A4o9J11m6l9Kl2Q5N9r3jR9m9o0L9o9L4L6Rm3QL9j3Q5p7M0m9M3p4j0k9P3l6
$$ plain form
3956 52 -29 -181 14 7 3 111 53 46 -4 -32 1 -44 23 -31 -111 -142 -40 72 56 32 35 49 -61 -72 2 -55 -15 -42 -3
3985 -3 10 -1 -80 23 12 -4 -59 -154 25 -12 3 -32 -42 -33 40 -23 -34 -14 16 -77 -77 82 23 4 -121 -9 16 -40 24
4014 24 -18 4 38 -2 42 -88 -57 -71 34 92 15 -71 -40 -38 9 20 -15 -169 -67 -48 -54 12 -76 -16 79 -62 -3 53 56
4043 56 -125 43 -16 -19 -93 1 37 20 -74 11 74 -51 -110 -13 -75 41 67 -35 13 -62 -72 -18 26 -16 5 -54 12 14 -6
4072 -6 19 -110 -18 81 28 12 65 -65 0 67 51 -20 -55 3 81 74 23 68 15 8 -30 -15 -21 18 -11 16 -23 48 149 -43
4102 -43 -41 84 34 -56 -77 59 -16 64 -77 -24 -13 -8 34 -45 -59 13 -30 -80 -39 -79 13 -15 8 11 3 -13 -32 49 24 8 -54
4133 -54 7 -7 37 56 81 -8 -36 0 -3 8 -28 -8 20 -60 27 -86 -41 -42 14 -87 47 38 -48 48 41 -25 -113 25 22 -3 14
4164 14 -55 56 10 -29 -27 -59 26 85 -8 -9 90 41 -19 20 -49 -15 21 30 -13 -5 34 21 106 29 69 20 63 -11 -21 -50 23 -13
4196a3k2R0k9Jm8j2j81K46m8q1R9q8K08j90R6o9K9j3Lj9O4J52j10o1KK0k3k4R8
4225G7l3Nj3L0p0m0J01q8O8%j2J16j13q0L2kL4j04J02l4l3j4N5R5p8lK5Q9no0
4255D7j26M7k5M6Q2j2j28P1k6rJ1ljP2n8n0k1J20q0Q4J7k1J7j53N8R6K6J2o7o7
4285d1J9o3J58o6J6p3k0Q9pn7N0Ll3M3K1j49P0L7l3M0jj5M8p6Q6n2k7M3J8j41
4315a13P7J2M2j8PO7j51P8m4N0j25J72k3n0O0p0k0O9l4q1P7J68r2r9J03r3j4J26
4343H1o4R9m0L3j07k9J22j08J6J0j08J74q9K6j4M2K2j23O2n4O7o7M6M4o6K5O9
4370F9o4K0O7j58Q9l3L9mj2k3K2q6M8m8KP0n4L3N0o0MJ07n9m6m5J03Kl2o8J46
4400G9k8n2l0P3jP0o8j6Pk2Q2j07Q5m2j01J1L3MOp4L1N1Po0J3O7o8P2nj5l3J14
$$ plain form
4196 -13 -35 55 26 27 -21 -33 -214 32 -16 -97 2 -86 122 -68 28 -41 -12 -25 -22 -41 23 175 65 4 6 26 3 -21 77
4225 77 44 49 36 66 -4 -44 57 -31 37 37 25 141 28 -52 -20 -22 12 -92 10 -24 -57 -71 -16 79 1 -2 23 112 107 47
4255 47 -79 -32 -57 -11 71 59 -69 2 -24 -33 -22 -25 -26 46 -12 -62 -83 37 -43 41 58 37 54 -99 -41 55 81 93 26 -41
4285 -41 -22 -85 73 7 23 -50 -70 19 12 -45 5 8 -25 18 39 -110 -40 -3 -36 4 3 -12 36 -40 46 -6 -33 10 28 -113
4315 -113 -36 -24 18 0 7 74 -77 1 -43 7 -118 54 31 -19 41 -29 -49 20 -14 -95 -18 150 58 -41 62 -31 -45 81
4343 81 17 116 76 109 2 -27 95 -13 3 13 -95 79 -10 16 2 44 66 -57 5 -49 18 -49 -3 41 -25 0 69
4370 69 5 25 92 -66 23 -10 29 25 13 -10 12 -74 -26 -74 -72 -2 -56 -23 27 -33 -29 78 19 -27 -72 31 33 1 -67 79
4400 79 51 -1 -31 42 41 111 43 27 34 12 94 -13 72 30 -71 -60 -27 -23 -17 -91 -60 -9 -2 -62 -49 18 -50 22 17 2 -31 83
4432H3j23kL0MJ25k15R3k4N3k8J6j2o5J25j14PJ12m0l3j0O3j18M1N1j1L6k9J21
4460A36j76j9k2M4q4Q3M2Rqk3qj4NQ3p5Oj8J0M2j08j1J28M2j02J23k4k5m6k8P
4490c1J02m1l2%j3n1N1qP0K6N3j68j2N6n3J4M1p2J14j71J14Nl0J07P0j69Mj3N5
4519A8p3J5J12p3l6RjNK8J01j51J4K3l4J43m3j1l4l8j3k8Q6K1rk5o5L3P1j01J9
4549c7n5J42K7n9L0r5k3N2L7J3M8p5j09N2P3o9J00J8n8J2l1N6j6o3N5k9Ko5QR9
4579D0j21K05r5j46K2N1N3l4j12P8k4O0j0J16j19L4L0j8M9m8M4K4j14M1m0o5J82
4606H3Qj58Q1n3l6L9Q2o6K7p4K5L8j0l1M3m5M3J7r3L7J1O6j0Ro3j9N0J28r2j04
4636f7R1j0q1J36o1k0L4J4K1n7jR9j32K1k1Q7j8n2k3J32j18Mk6P9M6m5q3J52j
$$ plain form
4432 83 -40 -42 -12 -8 117 -98 -5 -29 24 -4 12 0 -65 60 -54 -47 65 25 -8 -18 45 -73 -32 19 8 44 15 136
4460 136 -40 -59 -81 -37 -121 -38 4 13 5 -18 -26 -40 -35 48 -27 -21 -39 -29 13 -95 -106 22 64 -38 85 61 36 -10 -38 -31
4490 -31 71 30 -2 -2 -15 -66 -15 -23 47 73 126 -42 -54 2 -51 -37 4 -68 46 -125 -11 -6 -36 71 141 -28 -24 -37 18
4519 18 -55 -40 72 -1 -37 -28 -29 -24 4 105 -46 -32 -9 -43 100 57 46 12 -26 -39 -67 19 40 31 6 -59 -26 45 -56 -37
4549 -37 -92 50 77 18 48 -47 -70 -18 19 32 80 5 -104 -52 21 -48 52 70 12 24 -7 49 33 -30 25 -4 -2 -67 -59 40
4579 40 -81 124 29 -117 -95 -44 9 -25 -137 -59 -83 -23 -33 83 -36 -2 28 10 59 11 55 79 -35 6 -34 -99 83
4606 83 91 -67 14 -39 -75 -36 46 -20 7 -67 -42 -4 -14 -45 -2 -47 -4 13 -80 -43 -32 34 24 33 -30 -49 1 129 37 -67
4636 -67 24 14 -67 69 8 -12 22 36 57 0 -1 98 -34 -13 -34 53 35 -17 -40 92 -26 -22 -48 31 77 32 -51 101 100
4665A00q2M8j01M1N6j29N1l6J10K7j00M9K1j17K0m7J8M6m0Q5l3K3O1oj25O7O3
4692G0j05M1r1O4P9l2J9l3Oql4N5p0j0J5o8P6J91j94j9K9K4l8J11l2o1O4q7k2
4721f0N4K1m9r5J90n3o2J04K1M8j05j0KN7r6O5j06L8P3k4nM7p1q1O5L6q8N0L0
4750dR2j7j25L0P8j25Q9L9j07O2n3J69k17K8LJ30o3knP7r3R2n0j54L8Q8%K0pj
4780A2J1N4j16J55q1j1L6M2j44L8k8K9Nl9lk9L5j6J00p3Q5r7PL0QL%p8J9R8M7
4811I9k1m1J8o7pP8n5K7n1L5j4n3k6O9j8J02k8J5r2J34j05RP7o0rL8qj10P6k9
4841a7N3j47J70j06P3k5L9K1q2Q8j27O8M6r5O6j2M0Qo5q8Q6P6r4l2L5Q9j22M8
4869fM3p8L9QO4j85R9Kk6O2k7o3R0j03J57n8m5L2n2M1p8K22j93N5J9K8q2N6m8
$$ plain form
4665 100 18 66 -35 6 62 -67 -16 -52 58 85 -15 34 55 -62 -42 -89 -71 -25 -65 20 -13 10 71 65 -60 7 70
4692 70 -35 6 -85 -21 58 26 45 12 18 10 -24 31 -39 -49 -34 -102 -26 165 -29 -48 -19 5 -33 78 46 -15 49 -38 -60
4721 -60 -6 15 -34 -129 61 8 -54 50 71 119 14 4 6 63 -33 32 -74 -36 37 13 8 55 -16 -97 -32 4 -84 -34 -4
4750 -4 88 71 -54 -24 54 -71 18 57 -50 12 -41 128 -89 -61 -58 72 9 7 2 79 -14 78 28 -126 -88 0 0 20 13 12
4780 12 23 77 -39 116 35 24 60 102 -42 -4 -32 -3 2 -37 -40 -69 -34 -50 50 -23 62 -35 -28 2 10 13 13 -65 -46 52 99
4811 99 78 37 55 -12 -19 59 4 31 -20 15 1 -52 -78 -9 -27 75 47 62 -30 104 -1 8 85 25 16 54 46 -64 12 -17
4841 -17 36 -111 59 -47 26 1 40 61 -21 67 -60 8 54 -41 25 13 53 61 -4 -92 -6 70 -24 -56 -21 68 -54 -6
4869 -6 37 -41 -2 6 70 -115 -16 -14 -40 22 -5 -68 22 -81 76 18 -27 5 -47 -6 -84 138 -55 0 19 47 -35 21 -27
4898b7Q9j01N9m1LP4lno1p8J10j6L8Rj51N4M4L8L1Kj17P5R3j45L3pp3N4l0O4l6
4929b1P1p1L2k6R4r7R8o1n3P4l4n8L2N2L8o8Nm3oM0o9M1P6j21J40p2j4n0J52n2
4959B9m3kK7K3K2m4or9J87j94PQ9OM8o4l1O9J3n6n3J55l5K6n5p2o3N2J08oj17
4989g9J15Q2k02Q5k5k0Q3MO1o9q1M5RK6RPk5j5k6OK3M6l5l2j8O5J6n5O6p6j8K9
5021Al7L1K6L1q7O8j2p0K24j93Q4k4q0M2J2O8r8n3N5M2%o7Q3o1R3j52N6O8J6M6
5051A12j41M1N2k0J6o6mk4MK0pJ32j41nj09J74j06O5N5no0j5m7L8L9Q7j4j28J65
5080A08j14n5N5n6m1J80j52J33k8q8J18K8j33L6N7r5N0j00N5j1M0P0q5L0j4q2
5106i4J7J4M5J5k4J6qj3J09j29O8L6k6k7O8q2pm7LJ02j00J42p1j0N7j7K2k8K3
$$ plain form
4898 -27 62 -39 20 -21 -18 56 53 48 -13 -91 19 3 41 50 -101 -47 -3 35 66 68 -49 26 119 -26 7 0 -73 -19 -49 15 -21
4929 -21 50 -21 11 -15 79 -18 80 19 -34 40 6 -52 -20 32 70 2 7 -36 -42 -2 -71 -30 46 -75 65 -7 -21 -71 81 29
4959 29 -14 -16 11 34 56 12 6 -93 94 -100 -93 -4 2 50 -14 -45 24 37 -19 -72 83 48 74 19 -53 -116 -64 44 38 -79
4989 -79 36 118 -84 1 -24 -44 39 43 104 35 -46 -1 8 34 43 50 25 10 -16 -10 13 59 24 -8 -26 39 55 0 66 -10 -28 1
5021 1 -36 -5 21 52 -35 33 21 -49 175 -18 66 42 -38 4 16 84 -14 -67 -12 30 30 -37 46 -15 78 -74 -18 50 66 112
5051 112 -29 12 64 44 60 -6 -10 -34 -30 -10 -17 115 -26 -31 -140 34 -72 -7 48 43 -17 -32 -79 -41 -2 85 71 -57 108
5080 108 -6 -61 -6 -62 -103 77 -75 58 30 -58 60 88 -45 -9 48 -47 3 -97 -42 -53 -13 57 -28 2 -12 -94
5106 -94 -77 -63 -18 -3 -27 -11 -19 -32 77 -52 16 52 26 -1 67 -15 -22 -69 -66 36 -64 78 7 -3 54 37 59 31 54
5135E4j42J60q3R9m4mo1L6j4j3qN5J0k6K8j41J83Kj63J9k7J57k6j31L2O4l7O6
5163D5o1k5J08j32N6k5L2Q3o7J7J7j29J69l1j2l3l8O8j62J11O1O5j66l5J55n7
5189A4M0j36J73l8r7R1p5L5L8l9o1l5O0L7K9j30R4r8J03q4K01j87nO0P8r2O8K2
5217F6r1K4K7J0J4n2l1N3k6R4j65J11L5ll5m9J5J3MJ2m6J15p8Po9L3nL2k9j2K4
5248bj71J17O1O5n5N3o2m5pJ37m8q5J18q9K2Qnp9L4N7L3m5M1ml9l2M5oj5L7M1
5279H0p7l0l0Q1O5n3j52J41Kk8L2q7J53j12m9K9J03j27O9qKl5l5J38j97N9N4p1
5307h3P6n8RK4Q8o0O0q2kL8L8j31Q6jPl8p1J20n2l2p8J84m7n1M5K2n3J23j21P9
5337C9J3k7l7J4No9O1M4rn1j23J25lj4L7OKo2k3J49j03k7pR7n2J6n2J40j12l1
$$ plain form
5135 54 -88 72 -11 88 44 40 -21 15 1 -12 -20 35 45 19 47 -94 89 91 -72 -53 -80 77 51 -80 -48 16 -21 45
5163 45 -16 -41 67 -65 -9 -34 -2 81 14 31 48 -81 88 57 45 12 -26 42 -120 -9 52 117 -49 -84 71 14
5189 14 54 -82 91 53 -44 47 -28 7 45 6 -55 -90 -30 7 36 -94 0 -98 5 -79 122 -65 -70 -10 68 -24 44 66
5217 66 -25 -1 26 36 50 -2 -33 20 -6 88 -77 34 69 66 31 -18 -3 10 14 26 -20 95 17 24 -45 -12 -17 15 -14 -26 -2
5248 -2 -173 -56 5 70 15 68 6 -39 -46 91 43 -42 76 -13 9 17 12 -67 -33 24 57 12 53 49 10 -22 23 17 2 39 80
5279 80 3 -27 -57 24 89 36 -116 25 27 -1 31 -56 97 -15 -64 -35 68 -59 10 2 4 -31 -66 72 -125 -66 -12 -83
5307 -83 -7 -65 -56 -32 56 -4 56 -26 -28 10 48 -83 3 2 9 -29 -100 20 -32 -64 -142 42 -5 -56 -11 11 -42 81 -40 39
5337 39 52 25 -12 2 7 -62 -1 43 34 -17 -140 -15 -18 -32 5 11 13 -49 -72 77 -26 -53 -60 37 -15 1 -51 89 -23 -54
5367e4O4o4M9K7l2l2L8m5M4Q6n9MJ5l1mJn8pL0j31K46l4k4k3k3M9m6L0l8OJ8O4
5399F6j6l2mJ12k10K9l3N3o4J80j27P5Koj22K6J91j65n8K7L7K0M7k3Nj07J25k8
5427@P7j23mL2MM1p0r3J12K9m3Q0L6p4o5J26j58O3q5J96j04Q6k1k6L2pm9r5L2
5456g1N7M3o4k1j9L9J16j5o8o4J18n5p8L7N8L2j42M6L6j1lP8J9o9J25q9l5P1j19
5485d8Q6m5p6Q8O0p6K4L3o4O9j05M1M0J1j42P5J32r4O5p9q4N2N5k9n8Q3k0K2P
5514B3p3l0K1K8NM5l6k9k5J26J9j63J43j13R3l2M7k2n6N0J3Nk8l0m5K9J13j7j2
5543D9l8o9O8k3j5m4K5J4J42j16Ll4J61j60R8q5J6L6q3K8O9p4OL4L7q5PM5n0J4
5573b4q0O7Q3l2r9M7M0k3M4K8j44J02K6j3l6J0Jk5O0k2m0J34j44O8m9J3m3J35
$$ plain form
5367 -54 10 -54 -5 22 -10 -42 -4 -49 -5 81 22 26 41 10 6 7 -51 -58 -28 -159 87 53 29 6 -17 32 -14 16 -22 -16 2 66
5399 66 50 18 14 126 -84 -55 -88 -35 -99 81 -46 29 31 25 -97 -71 120 -45 -103 -76 -39 -19 28 5 10 -97 28 0
5427 0 77 -46 -50 -18 -14 27 -43 -136 -24 5 -38 42 78 4 -61 65 -93 -30 -115 81 -23 63 42 16 48 41 -8 -103 -71
5456 -71 -14 29 -35 -56 -75 -36 80 65 -3 -67 51 -4 -82 -45 13 45 -97 -51 -15 -26 -29 49 68 -1 124 35 0 71 -48
5485 -48 38 -7 -83 5 65 -11 13 46 -18 51 -54 -13 27 38 -104 -29 103 9 74 -5 -89 -37 18 -11 -69 14 -6 16 23
5514 23 -50 -80 -59 -31 -26 19 -17 -46 -71 55 74 -89 54 -59 34 2 49 27 -29 21 34 39 11 -19 -64 -35 78 61 49
5543 49 11 -58 10 -13 -28 -72 -47 -33 109 -7 -4 -38 123 -37 61 -24 -8 28 -55 -27 42 -32 -26 8 45 -40 -33 12 -38 -24
5573 -24 -104 -37 46 14 -85 -38 2 -21 23 51 -93 9 35 22 -14 -4 -3 -28 32 10 -30 104 -40 28 -21 -8 -51 84
5601H4o8l0J2J8p3K6Q4nl6K7o3O3k2k8ON9o3m3P5l0K3j5k4p4K5M2K9j07L9N8Q9
5632G8j75J23l6p1J20j20J26m1P0r1J07j60N0M6n3K6K2l9J2K2l1J00j63P0l8J5
5658c1K6%j09Q5Mo4Q4O1j30j0N9p6J06m7J31j45J7n5O4P0j49P7J03l4r4Q5K7k5
5686C0n6J1k6L1J6pK6J00j04j6j2%N7r6N4L9m4k6R7Qm3j16K2O1K0mnJ0k7M3n6
5717a3q7P7NL8l3ML6O0o1n2M3l2m4L7O1j7o9M8N2q1L2j4KOn9J26M2n2r8J01p2
5748a4J8n6P7mn6j5P5k7N1j18O6L2k9J8kr8K0P1Po0j6R9p8J01Kj7m5k1J4%L9m7
5780a3k4o0J22r3J06j6j6K0k1l0k1K1M8Op0o9J51l3k2n2n0J10p2Q6n9N1m6J48
5808A02j03N8L8o2rL9Q4j87K9K4j17P8L8k8M6m7ML8K8PJ19k43N6l8L9L1k5j0J18
$$ plain form
5601 84 16 -14 -2 16 -57 -31 53 48 12 39 -24 39 17 -11 -5 54 -9 -52 23 -7 16 1 -23 -97 -72 -30 -1 -108 -69 -11 78
5632 78 -97 26 -10 -81 39 -81 45 4 74 -17 90 -70 -20 26 -27 -1 21 -18 -6 16 -15 85 -78 -8 -46 -31
5658 -31 -5 -5 -114 -29 -25 -89 -5 56 -74 -84 -25 -101 5 -42 89 -56 -39 -94 -30 40 -109 -32 71 37 -57 28 55 30
5686 30 -26 -15 -41 -10 6 -1 25 125 21 5 -7 -7 50 -46 8 47 3 -23 74 82 39 -77 -55 6 26 22 17 27 0 43 -13
5717 -13 -100 -23 -18 20 -13 -9 27 87 26 -26 17 -15 -59 -22 39 22 -47 1 53 -28 4 -10 -8 -2 -61 65 107 55 -43 58 -14
5748 -14 4 -52 25 21 -35 -50 25 -2 49 -69 -3 29 0 18 16 -82 -62 9 16 -44 -60 39 -39 62 64 47 2 -19 -5 -5 34 -13
5780 -13 -37 -97 25 -68 38 22 6 26 5 -25 -46 -25 23 29 -41 -110 41 8 -14 -66 -116 -6 -78 8 -51 0 -46 102
5808 102 -1 57 95 33 24 63 147 -40 -11 13 -104 -26 12 -16 30 -17 -13 25 53 60 179 -64 -8 -46 -7 24 -1 -11 107
5837A07j70L6k8O0J6k7K4q7NN5j19J18L4m3O1l5J0j31J01L3m9O7q1K6j0M4k0n5
5865e8Q0J7Pj19J34ll1o0P2m0J4l2j6P5o5pN9j6k6M2n2l3Q7l5j4j2M6MJ5j1J4
5896C6q8M2k3K1P6o9L5J9l8o9R7J4m1o3K5n1J10j9P5j04L1j7n5J12N8j01L4q5
5924c8oj0kJ05l0mkk8J9L3k1k9L7Ok3J8l1j2KN7o5oKO5m8k0m4N4K0O3PL1j54J05
5958E1j36Q3m9k8J31j19l9R3J24j13L3m9q5J8J08p4J01j5m3nn1J3R3k3rM5q1R
5986a7k3J01NM8j23o9J38m0M3K3q5Rjk6o5Q7J6n2Onl1J25q1P8r4rM6N7j80P0N2
6017Cl5P6m8OR1L7j99K8P6l7O1p6M9m7J87j45Lj33Q0M8J24j46p3M6J41j70K7J5
6045a1p1N9p1J64p7M0q4O3r4N5p0N7J3K3P5n5p0P9o1L9m2L1P5j08R2l5J4j18m4
$$ plain form
5837 107 -63 -27 -55 5 21 -6 18 -69 -64 -9 -128 -10 24 -19 42 7 17 -114 -13 20 -29 38 -43 -17 -27 17 -3 -58
5865 -58 22 39 46 -73 61 58 27 -33 39 -1 13 -19 -35 40 -25 -32 27 11 -15 27 -25 -58 29 -6 -20 -32 14 18 33 22 36
5896 36 -52 -10 -33 -12 64 -5 30 49 11 -58 39 53 12 -51 -26 -77 33 14 89 -15 16 -1 -56 56 114 13 47 -38
5924 -38 -44 -54 -56 49 19 15 13 -15 4 37 16 -13 24 30 7 25 -6 -18 -16 41 -24 -30 -28 37 -11 -31 -75 -21 -1 62 69 100 -54 51
5958 51 -85 -2 -51 -79 52 -67 -106 -13 111 -2 31 -18 -103 -85 23 -51 50 35 -8 -13 -64 -51 42 19 10 55 -26 -17
5986 -17 -40 61 66 114 -9 -78 60 20 63 86 1 10 9 -17 -82 5 21 -31 -25 -30 -61 64 -17 61 -33 -42 4 61 -119 -49 3
6017 3 -32 44 -4 2 93 130 -69 -41 35 -2 59 -17 32 -15 172 27 30 -103 -23 25 149 3 -70 -24 117 -53 -26 -11
6045 -11 -82 -23 -94 70 -7 33 -51 12 -82 -27 -97 -40 -27 -4 71 16 -54 25 -36 3 -39 -8 67 -41 51 16 30 -88 -132
6074a32J26Q9K1l1j3j42R4j1k9M4p3P5K3l2l1Q8m2j5k2K7l1m1L8n4N0n3J37r7
6102c7L3jN4o0L0r0J25n0P0r0O4o8M4m8P0l0j6J1r6J63j08Q8j00L2L7Qq1LL3K0
6132A0k6l3J66j45l7Q9Kj02J2L2J2o1J03p9J50j08K8J2J8p9kK0J25j52N9Lm9P6
6160D4l1j6P9q3J01j03o4J58r1p8P2R0j44J5R5j2K6q7N5l9J5K5p9N1J4j5k9J9
6188a2l0k4J05J2j9M1j34l2J17RJ08j36MJ16j20m0K6L1k4j9N9m4o0O4oj6J09j6
6216F9j52J25%j34P0K1o0P6q0n4K3J14L0l0L4r1J5q9J28Omr2J05p7J12j38N1L9
6244A7J1qk8L0p9P1l1M8j08J27p6k9M7J09j85J25o2p0Q5rJ32p3p1j03J38j19J20
6271Ik8k9O9o4J5M9J2L0r5Lj8jQ8j7k3%M0o0LJ9k1J01j16N4j8p7R2rqp7M8K2l7
$$ plain form
6074 -132 -6 83 104 73 60 -82 12 1 -28 16 -57 18 41 9 -22 66 24 9 -13 14 -17 -58 -20 -74 -24 -77 60 -37
6102 -37 -4 -5 49 -11 19 -71 54 4 74 -16 48 -20 24 -24 46 16 0 11 -85 78 -30 58 -42 -10 27 35 -46 -43 -10 10
6132 10 -16 -49 117 -28 -65 24 26 -76 -64 -32 -20 -81 22 -57 93 -15 13 25 43 -36 -38 -18 107 -45 14 17 -32 44
6160 44 13 -3 76 -7 94 -9 -73 85 -6 -84 -12 78 -66 -51 44 32 58 -29 26 -13 2 27 -52 -1 13 -2 -31 -12
6188 -12 -42 -66 39 51 32 73 -61 -93 24 33 141 5 9 125 5 -35 -9 22 -2 -21 38 -6 -66 -2 -8 -24 85 69
6216 69 -83 42 42 -92 -22 -1 -61 15 -65 -119 -96 18 48 18 52 -39 -24 -113 15 21 17 -75 30 -47 65 -73 -22 17
6244 17 28 20 -8 22 -57 14 -17 31 -77 50 -26 -55 -8 101 -84 41 -21 -91 -6 -15 117 44 -27 -130 8 -111 9
6271 9 -19 -48 21 -43 -28 21 33 63 -32 -29 -47 -48 40 23 0 0 40 -20 -17 2 -19 82 -34 20 2 -75 17 8 0 -77 -29 -7 -44
6304d4R9q8K6M1m4L4k2Jr6M7M2j1K8q2Q8nj31J38j4p2MJ7M9LM9r9P5q1MJ03jq5
6336b7J4K8p5k7P3p0O7rN1o6k7N9j55R2R7m4KQ7q6m3R7n1O6j48j1J11o4o4J88
6365F5r1M5p8R7K4l7q6J77j56J4L9q8LL9L7j1J7p6R9r6R8N7q4l2O4o7O3j28PJ40
6395E5k2n7n0R5K0j46Q3k4K7%O0J8j10R5J3n5jR1o7m7m9J81j08j18Q2Q2n7JM7
6424C9m0n0K8L2O4j63J03r5Q8Rj6p4P3N8j09k4J6O4K9n3L6n0QK5O3m2Ll5j5J38
6454A10j42K5J1M8n6M0j0jk6j8M7Pj17J7J02m4L9j87J89m2j3K8O9r0L4M3k1r5
6482e3P8K9m5K3K1j33R5J08j03oq2L5k3K2L2L8L3p1l9K6K2O4J7q3j8j0m6oR1m1
6512b5J23j07j7K2M6j1Q0j17K1L9J9p8n1O0J9Pl5K8j7Nr6O1nJ35j21n2o0J45j0
$$ plain form
6304 -44 55 -33 -7 34 -10 24 2 3 -93 -46 -4 -15 13 -69 19 14 -117 21 7 -65 -61 -44 5 8 57 -42 33 -48 -44 59 58 -27
6336 -27 -13 15 -60 -87 -14 -84 -17 -26 25 -41 -68 -9 -164 -72 25 -19 -17 70 -16 -59 38 -13 53 -95 -106 5 -59 -123 65
6365 65 -26 19 -59 38 62 25 -61 116 -40 -26 13 -75 -72 -33 4 -7 10 -66 33 -63 35 92 8 -24 40 -27 36 -92 -85 55
6395 55 33 -24 -74 21 41 -105 -22 -46 -19 -19 41 59 -51 44 57 2 1 92 25 -22 -71 110 2 -116 -34 48 -9 -8 39
6424 39 -1 -51 -23 9 73 -90 13 -82 6 15 -1 -75 -2 56 -53 -77 -61 3 32 -21 15 -35 -27 -2 61 19 22 -13 -28 110
6454 110 -32 -7 4 52 -4 36 26 25 -1 -19 28 35 -82 -65 37 -7 32 -155 34 -8 -21 7 76 -14 20 63 42 -53
6482 -53 25 54 9 32 53 -80 15 123 20 14 -68 -33 -56 -34 -2 36 69 -2 -41 -15 7 71 88 5 -13 -23 -69 -75 16 -25
6512 -25 98 -9 -26 -4 42 31 111 -6 15 54 73 -5 -56 4 23 30 -5 23 6 11 -85 -24 -29 106 -15 -67 -127 18 8
6541HN2j55J48m9j07R7j6J3k3J05j7r3J33j27L3K6J9n5k3kRK0Kk9n9%J57j37L4
6570c6J73j44K2J1n6O5pJ8m1j32J64r0R8n2N9r0J04q8K1pO4o3NJJ9p5K2L9o6L9
6600b3J3J9P6J3k08J44o4N0m5kj9J06j03r3L9J66o2n5O6N9j13Q9j3j56J35M4J3
6627G6j44J36r4J8k7J4j5O6r0K0M6L1l9M5N0j81Q0J5q0M7N7%r2Q7K0j7K7k1L5
6656G0pkj10oM1P5q2J6K0J1o6Q6q3P4k5k3p5R1j4m9R9J5j1K3p7lo7J05l3o6J46
6687G3j14J1l0l6Q1J11j01J9J2J1n9kmqJ27p1l0N8k7r0J54p1o7O1j18K00Oj01
6715el5o6J71m2o4J41j18Q0o3M0j3K1n6l0Q9n2l5j7k0Q2K8n3J0m5O3M8J2n2M0
6744E9l6j43J08O3Mj3L0j18R6o2o8J63l9j6j1nj1j12J23o5N5k6m1K8K3j3M0J3
$$ plain form
6541 8 60 -95 53 4 -103 -6 -22 -9 -32 73 56 -37 96 -31 2 28 47 -8 -31 -33 -24 -4 -2 -31 -90 -90 67 -70 -36
6570 -36 137 -7 15 26 -30 35 28 46 5 -127 37 -53 45 -7 52 -38 66 -22 -1 -8 56 -7 -2 -1 18 -57 -35 4 -62 -23
6600 -23 -10 9 85 98 -110 34 -30 20 -25 -27 -46 60 -43 -136 -97 69 7 -48 18 77 -36 53 40 -116 19 63 76
6627 76 -68 68 -26 -8 -35 -21 -36 30 -60 -40 6 37 -2 43 93 -88 -8 7 -73 -26 31 31 -61 26 46 29 56 35 70
6656 70 63 61 -49 -55 -14 61 -21 -5 15 26 -40 46 -37 37 12 -11 -86 5 -9 -58 41 56 45 68 -9 -12 -79 26 -7 -73 73
6687 73 -41 -30 -60 -96 -15 96 -5 14 26 37 -22 -24 -28 -36 91 20 -10 48 21 -69 85 14 -53 8 -110 90 96 -5
6715 -5 -40 -106 65 23 -41 100 -18 62 -1 39 26 47 -9 -39 50 -2 -37 -54 -74 8 36 -17 -7 -52 11 59 71 19 59
6744 59 23 -120 -12 51 55 42 72 -46 50 -12 -80 83 44 28 17 12 1 -111 12 -53 2 -24 -65 -37 -14 -27 13 26
6772B6L7m8j7O5j79J72q9N7k1P3m4O1j64O2P2r7R1J8Mo1Q0j36QL1o7J30j43Q6
6800Gp1N7o0O3j1l5J39j65L9K9k8N7k2j4OQ5n9o2J01m2n1N9K4p8m0J31j66J25
6828A8k1j3K2K0k3l0m8N6j00J66j25M4L3L9p4J14j05lpN6k4P4p5J2Kl1J03o4P
6857B3m1M6j7j3n9M7j4N5J7nQ0j35L8m6r1J74j71J56J06k62J74k2p1J4Q8j53M5
6884c7N9poK0k2R2j48O4m3K4K8p2O9p1K6n6J19j6p4J06o4j3K3mJ8j1j9J8L7L3
6914G3j33J7Nm3L2q2P7P6l7p0O3k5l2J25o1L3M2j42N2M9MM4n3p1R1P8p7N2k7n6
6944Dp9J40m4NM3n9K0j5n5J3K8%J12j16L5n1N6P0j71R1j80J06k4k5q3J46m4J11
6972C4QQm5j1o4rP2O7o7N5K6l5p0O4q2p9O4L5R2j8k0j22J15q6K5M4j1K2N5j9j28
$$ plain form
6772 26 63 15 -2 63 -116 56 -33 24 3 76 32 93 -71 -9 63 -34 57 75 79 18 98 -38 -30 1 -66 64 -79 7
6800 7 -64 -7 -67 -4 -15 -50 89 -76 -37 -8 -36 21 -1 -15 -9 76 17 -45 56 14 -37 22 46 -32 -72 59 -107 18
6828 18 -3 -16 6 26 3 -27 -75 -19 -119 47 -78 -34 -1 38 -36 78 -27 -30 -37 19 -5 69 -6 6 8 -23 80 16 23
6857 23 -18 28 11 -2 -61 -14 -28 27 44 39 119 -16 22 -24 -115 59 -112 44 150 -112 62 40 -31 -17 71 -82 -37
6884 -37 22 15 9 29 7 99 -49 15 -28 -4 24 -48 21 -50 -24 -80 39 23 -51 55 -9 -22 1 -3 15 4 -15 3 40 73
6914 73 -60 -43 -38 -81 -49 -131 -54 22 -15 -85 -22 -47 -79 46 -15 18 60 -82 -30 19 23 67 14 -57 34 112 35 87 60 4
6944 4 -75 65 21 26 69 10 30 15 -40 -27 1 1 113 -3 32 -19 37 107 -64 27 -153 -47 -71 -96 -179 -33 -77 34
6972 34 42 50 5 -6 -70 -79 -7 60 -7 48 74 39 -31 33 -49 -128 -64 -29 63 45 25 -97 18 -68 -43 1 -10 12 67 48 -80
7003h0J15r4k3J28Nj47R3r7P9N0r0O3p4j1L1JN5J3K0j23J15O0j34J13k2j00R4
7030D0j18R5Qj2m4Q7J3j64J41k8N7j7q2J4L3q4J5J27j00J1Lj6O1j29R2N1n5n6
7058e7nM0k3p3J23n4l0l7J58o9L5J9l1J6k0k1O9N5j4q4n7R5l6P3q9m4J02j00M5
7087a4m0jK9L4k2j6l6K1j2O8m9k3K5M7L0l6N5M8p5m7J3q0j2Q2O2j30J8J42Rr2
7117bl7J7L9M0l4l1O7j12J00r0J70n8o4n0R3l8L4K2j27K0O7K7j8ol7KJ3m9l3P3
7147bokR2r5r1J51p2J4Mr6J16k0L9n3R7l9P9j17%KJ0l2N7l6n3K9J12o6o2L0J9
7178Ip3m6Q7J08j25Nl1R8k3k1lRj01R0J60j69n6R3N7n6n3M5m3j0N8P5r4q4J24
7207C0kJ34j51m3Q5j23L6O4j8n7O2M5p1p8K5R4%l1j0n1N6p2P4k3L6J3m5k5L7m5
$$ plain form
7003 -80 35 -59 -82 46 51 -96 -3 -100 -21 29 -61 2 -72 -83 -52 -51 4 17 37 -86 29 89 -45 68 46 -54 40
7030 40 -78 17 25 13 -31 56 69 -95 46 18 75 58 -24 -10 23 -61 -46 81 -19 -8 -5 -21 40 -89 3 54 -1 -57
7058 -57 -62 -22 -45 -118 5 -49 -79 -116 42 -27 8 27 -4 12 -8 -29 40 95 81 -3 -60 35 -1 72 -17 -61 41 -59 -14
7087 -14 -54 -55 -26 8 -14 -30 -66 -45 -57 11 -38 -61 -36 11 41 5 60 108 33 -14 -1 -81 -93 -11 51 -79 -61 81 90 -2
7117 -2 -39 -22 17 57 23 -8 59 -53 47 -43 127 69 5 -45 48 10 44 66 -61 -41 26 53 35 29 -8 -6 7 -42 -75 -2
7147 -2 -8 -10 82 -13 -104 47 -25 -11 -7 -103 13 -7 32 -21 76 37 116 -1 -1 1 11 -21 36 0 -53 -24 88 22 -40 -10 9
7178 9 -64 -110 -23 85 -40 -35 -66 32 9 -12 -15 -6 -107 -17 143 -26 -82 11 68 12 -41 4 -39 -49 9 84 -10 -94 30
7207 30 28 162 11 -32 53 -70 -34 30 12 -45 17 62 -9 -87 -62 32 32 1 -9 -60 -4 -76 -2 -25 11 24 -21 -46 -9 -54
7237e4J8J38j63J04k1K9p8N2o1MN2Jq2qJ81j50j9J15j32L9K2P1m7m9L1m3Q1r7
7265f6l4J26Lo6M1M9j51Q9J4j02O7nK0O5m9j5l6R3o9j8J24j48K3j5MO1O0j06L7
7294dk0R1j3n9%k9k3L7J0j3K9k0k2J9o3Q7Ql1k3N7J9n1J7M8j09M0j6RN1q6L8n4
7326g6O8k3M9l7PN1J4n7k1O8j20M1Q1p8J05j30P5j1K5oj17Q2l3q1J27l8J16o0
7354B1n6J3ll0J9J22j18K4pol2%J05Pk8q0L5Q5r6L4RP0j41M8mQ2j46P8J7r5L3
7385d0K7k8J1J04m9r6J00p2J3J8K1J7j10R4M8n7j2Q2r9J9Nnj6KO1pl2m1N5N5q4
7416a6m5M3k0n2R5j26K25j00QLL5n1n8O8Om0L0j7M5Kl0m2Ll2O5L9o8OQ4j23N3
7447a0L8r6J20p9j4K8n3K8J1O5p7Q3n2l8L0J4l3j8PJ3k5P9p2P7o4k7L4%K6j7n
$$ plain form
7237 -54 -36 102 -61 43 22 51 -27 25 -36 -32 20 21 -61 -69 112 -38 -57 58 -74 -35 -13 58 11 -38 -7 -50 31 -66
7265 -66 -100 26 29 -37 4 53 -98 -9 5 -97 -30 -35 -15 50 1 -14 -50 43 -26 -44 80 -68 -45 -60 -56 5 65 -41 -4
7294 -4 -24 67 54 -5 -5 -34 -57 -20 -10 -23 6 -14 -36 -17 -80 7 15 -16 -39 18 37 -14 3 51 -58 -18 -34 -25 26 -60 -22 -76
7326 -76 -8 -31 18 -19 -12 39 53 -4 -25 43 -77 -36 45 -33 72 -58 17 6 31 25 -92 -10 -43 -124 3 -35 81 21
7354 21 -35 -22 -25 -55 -36 86 -32 -8 -15 -21 -53 -53 52 59 31 -49 -14 71 -25 9 18 88 -53 -5 -9 73 -73 5 22 -73 -40
7385 -40 -13 -41 -30 74 25 -71 29 -43 -30 -12 9 26 -84 10 58 1 -11 71 -28 -9 -4 -9 -25 -23 38 31 -1 -42 13 68 -16
7416 -16 -61 -18 -38 -90 5 -121 104 4 12 15 50 -1 -59 9 15 -25 5 -12 33 35 5 -37 -34 -66 -1 38 -30 -24 60 -63 -10
7447 -10 28 -68 52 -27 -41 -13 -66 -38 -27 38 -39 44 -8 -46 -16 -2 -35 -53 -46 -33 -58 21 -51 26 -38 -65 -31 -31 -5 -22 -27
7478b7j4k1K3N4N3q2m5L4K2J15j00o4R4l9L3j19N1M0j5J3m8J1L6m3J9m8k7k8R4
7507b8K5k1L2j8k4J03n9o2p5J24l5j0J46r8M7q7m3Q8J0j3Jk4lO6n4Q7r4k2N5q
7537FK9j45J37r1M6Q1n4N1m1m9O9n3n8K5O1k1J8j18J38Oo6M9k6o7K03q1r2o2P8
7566b7Q9L9q3j7m7O6L2l1No7Q3nk5j08K17n4o3P1j88R3QL0k0lr0J13j4j7Q8n4
7596B1m9N5j20P9N9j2j11M3RR5Jq4R4j27J16j8m4N7n2J7j1M8p2L9j7j7r5J23k5
7625BK6j63J73n6O2j42O8n2J01N1j67Q6l1Q5jn5J01j03o3M3J1rM8Lp8O5L5j48
7653a08J55o0J0jOo1j10J85M0K3j33P4m9K7Qm8K7J2R4k0q6j8K9m9M3l8N8Q3j52
7682e9J08O0p6k6n4N3ro8J62j42M6L0o7M5jq5lP6N0o7R5j31K2J35j49L6j4K6N7
$$ plain form
7478 -27 -41 -62 -39 15 68 -14 -59 -25 -3 112 12 -52 42 3 36 -83 -32 8 -7 6 -42 -31 5 -38 -19 -67 -94 -122 -28
7507 -28 -3 -24 8 -10 -34 69 10 -52 -127 -3 -38 -48 98 0 47 -40 -83 5 15 2 3 -21 -24 42 -12 75 -19 -41 14 6
7537 6 35 -110 27 -64 -18 63 9 60 19 -30 39 -14 -72 -47 14 -7 11 -107 31 37 -29 20 -6 -73 130 49 -43 -105 -27
7566 -27 62 101 18 1 -46 20 52 21 26 -41 42 37 12 -96 121 67 4 75 -113 -20 -12 18 -2 -5 -95 18 4 -13 75 21
7596 21 -28 27 -93 -14 45 33 -78 -35 -26 69 70 -14 80 -47 69 51 7 64 12 29 18 66 -6 33 16 -1 -96 27 2
7625 2 28 -135 38 -18 44 -98 -30 -82 19 70 -97 -11 -42 43 42 -13 88 -15 -78 -35 -24 -33 15 18 -60 5 40 -108
7653 -108 47 -13 -3 -4 2 -59 -169 16 56 79 -54 20 -29 -2 6 -42 -15 -3 91 71 -15 -33 -4 -53 -10 -48 10 93 -59
7682 -59 49 109 33 7 -47 6 -3 -71 91 -51 -5 25 -42 3 2 -83 -86 -10 40 -27 68 -63 -41 94 -55 -19 -33 -7 50
7711E0n3Rl0M8l2M9l5j45P4N8Q1j12j7P6m6PL6k4k4P1l6q2J60n7n9n5K9O8k8J13
7741I4q0n9k0R3j0m8R3j05J02K9r1J1q2LJ23p9l8L7L5n1N4L1Jo1O4n0n4n9R1Q9
7771F3l0k3rk7m6J01rj2qn9O6m8O2k8Q0m3o3M2N0l7k6j7K2jl8J48r2m1%L6j7k7
7803c1K4o4J00r2JQ5kk9m4nQ6rl0r9J30nm1MMR9l6n6Q3p2q4J21K7J7o8O0j05Q8
7835E7m1k5l7J43r0j4l4jK0op1P3R5j3m1m6j7Q4p8j00J47Q3j12N6O1j22J4l1L7
7864io3R6J45j44K7m0k3k0J08k7j30J68nm2o3j06J28k1k5J13n4l3M7M5j33L2k6
7891e5M3O1j30J23j7q5Q7k7k7j6J9J4k4o2N8J7p5O1O3n7m0RP9J2o9J3Q1mj5K2
7921E9Km7j22L6J14j29Q9Mk9P9r5qN9J5j4J6j50J40p8P1M2qj10Kl0R4KM4j0m6
$$ plain form
7711 50 -3 6 -24 24 -8 41 6 -139 -65 -7 74 -38 -55 21 -25 -18 18 -6 -30 41 5 -77 83 26 -33 -88 -59 9 -19 94
7741 94 14 -45 -65 28 18 -30 63 -42 60 89 -2 9 -73 -70 53 -26 -64 -27 8 -43 11 42 43 -18 46 -4 -58 -117 -26 63
7771 63 33 10 1 -26 -72 29 20 8 0 -59 7 -41 21 -7 73 30 -33 9 59 22 -4 -21 1 0 -38 110 18 -23 -23 13 -4 -31
7803 -31 -7 -71 29 -63 -62 23 21 -8 -52 -57 29 20 -10 -109 21 16 -25 -21 -17 82 46 -10 73 1 -83 38 65 82 14 74 -31 57
7835 57 16 -9 -46 97 7 -7 -41 -42 -22 -28 -99 -26 69 56 15 -31 -48 36 -42 -142 5 88 -24 32 93 -29 -15 -46 -9
7864 -9 -72 24 169 25 52 12 -11 -31 77 50 -80 88 83 41 -22 -128 0 -21 -46 67 13 -20 27 72 -61 -29 -55
7891 -55 -12 49 -81 42 25 -60 27 0 -27 -43 -24 -10 -34 -96 -38 -21 -96 -35 28 -29 -69 -60 19 31 -38 -25 56 52 37 59
7921 59 61 14 -108 -72 42 -87 2 6 -23 56 -39 -47 12 27 13 29 -121 19 -59 12 54 46 -64 -62 -92 2 4 48 38 -8
7951hl4O1r9J08m3j1k3j3Q0oqk8L2n5N5n1Q4K6j97J14J23k25J27n2J76j98O5M1
7979D1n4L6k4%m8J22n5rn9k9J6J3J12m3r8J7P6N4n2L0j1p5l7Q5J01p8j01J00J7
8008D7j8o8J0Q0r4m1l8J86J3q3J8L2o8M0r8K3Q5L6Km3q0MrQ4lJ2j08N3K1R9j8
8039G6j54J39l6PM5k1j06M5J5o2Q6j23J18j0p9J23n6q5K9M9n4rN2M5J7k6n2k2
8067d9K6M9m9P8j40P2P2j21L3O2l3J7M3p2L2j1j1Mj4J2Qm4M7n8O5j40Q1O7k9j6
8097a9l2Q6l1%j18O8M5N1q0m2kO2r8Q5K2R2j57P9k4k3J09j17qL5M3M6j40nP5p4
8127g2J64p1k8p7J17j15P1q6J20J9k2K0R5j37q2Q8PQ8r5nj19J10o2J12k9r0J29
8154E0j22K0L6K1o0R6j2k5q2P2M9j21J52k7J4n4J9Oj1j4n9O1J24o5pQM4q1m0J5
$$ plain form
7951 -8 -42 19 -80 28 -15 -26 -49 -62 18 12 4 -24 8 -47 8 -43 41 67 -130 -16 107 -118 9 -43 133 -65 0 41
7979 41 -13 23 -1 -1 -49 73 18 9 -50 -79 -63 -50 62 19 -79 -62 14 68 16 46 35 -40 -77 8 109 31 -70 30 47
8008 47 29 -39 -29 51 -43 -84 -122 64 77 -6 12 44 -24 16 -82 -59 26 62 64 21 -59 -55 -64 20 17 29 -79 -26 -5 94 76
8039 76 -78 61 25 32 77 56 -50 -5 10 -52 34 -89 29 19 -60 63 7 -78 -49 0 -54 -63 -11 34 51 25 -27 -49
8067 -49 -23 26 -23 55 -85 -13 59 -62 -29 33 0 17 60 -12 20 9 -2 2 -12 0 8 -36 11 -47 18 -122 -41 26 -3 -19
8097 -19 -51 35 4 4 -114 -46 -1 50 -30 -72 -74 -12 -110 -25 -3 89 -68 11 -13 -36 73 -44 -52 -17 26 72 -68 -73 2 -72
8127 -72 92 21 -7 -84 33 -82 -11 -97 23 42 20 40 135 -2 -84 4 11 99 4 -1 -120 -10 -72 40 11 -79 50
8154 50 -72 -52 -16 5 -55 41 29 4 -78 -6 43 -78 74 47 61 7 26 32 21 7 -52 9 133 68 61 69 113 32 -8 7
8184Gq4M2J0M4k0oJ0
$$ plain form
8184 7 -77 -35 -25 19 -1 -7 3
8191C
$$ Imaginary data points
##PAGE= N=2
##DATA TABLE= (X++(I..I)), XYDATA
0@%%%%%%%%%%%%qJ6j6J6k4L2m0M8n6O4p2Q8j04J24j48J72j96K24k59K99l41L86
34B05m37M93n54O23o99P81q70R69j078J192j319J460j611J778j962K163k382K623
52A375k890L186l517L887m306M782n328N970o728P639q764J0193j2074J4683j8573
67a0465K5072l8662J17409j42551M883L11688j58655j27043J12838M9825q5728
78E8611M392O625Q144J8551l5003o9166P5899N5506j04576m8120R2986N649o0009
91I489q921K2920Q040j7575l2342L0940L4291n6124m0616O9958L1486p0040k7679
104d6173N7770J8556m3267j3141L5299O842l5330o105M3023Q922n1626j5285N5222
117A4707K1490n1656k6911M5250K6690m1825k0566M1050J1522m1680q525M3444
$$ plain form
0 0 0 0 0 0 0 0 0 0 0 0 0 0 -8 8 -8 8 -16 16 -24 24 -32 32 -40 48 -56 68 -80 92 -104 120 -139 160 -181 205
34 205 -232 261 -293 330 -369 412 -458 511 -567 625 -694 766 -845 933 -1029 1134 -1248 1375
52 1375 -1515 1671 -1846 2041 -2265 2517 -2811 3159 -3569 4070 -4694 5499 -6575 8108 -10465
67 -10465 14607 -24055 93354 -49197 -44314 267374 108719 -18324 94514 144339 58611
78 58611 63003 69628 77772 96323 61320 -7846 68053 123559 18983 -29137 63849 69498 9489
91 9489 568 23488 31528 13953 -18389 12551 46842 -9282 -49898 20060 51546 -18494 -46173
104 -46173 11597 30153 -13114 -26255 9044 15886 -19444 -25549 17474 26396 -25230 -40515 14707
117 14707 36197 -15459 -42370 2880 29570 -12255 -32821 8229 19751 -21929 -30454 12990
129A2990J4396m5547k4868M6323L4246m2170l7131L6333L4973l0343k6541K8709
141A370K0036k8459j6868L0808K1149l0526k7021K7786L3072k0818l3945J4603
153h813K9823j1058k1640J1811J4431j5493j1946J9670J3748k2041j7202J8813
165A03J8759j1971j8823N564J5779n224j1015R719O202j6686n463K1926Q387k3450
179f193j3433K0480J6706j5292j6585J1178J3144j0953q492J3977O136j7676q582
192a5585K0007J4769j9659k0958J6298K3778j1569k1251P382J5760n898j0502
204g428O854Q864q975j1838J0186J7161r075k1215N580K1010j185j6278j921R196
218I36K707m034p19L253k843o116N471J0252n526j2114K859J0160Q46n296k751
$$ plain form
129 12990 27386 -18161 -43029 3294 37540 -4630 -41761 -5428 29545 -798 -27339 1370
141 1370 21406 -7053 -23921 6887 28036 -2490 -29511 -1725 31347 10529 -23416 -8813
153 -8813 21010 9952 -11688 123 14554 -939 -12885 6785 20533 -1508 -18710 103
165 103 18862 6891 -11932 -6368 9411 4187 -6828 2891 9093 -7593 -13056 8870 17257 -6193
179 -6193 -19626 854 17560 2268 -14317 -3139 10005 -948 -9440 4537 10673 -7003 -15585
192 -15585 4422 19191 -468 -21426 -5128 18650 7081 -14170 -6788 8972 3074 -7428
204 -7428 -574 8290 -685 -12523 -2337 14824 5749 -15466 -9886 11124 9939 -6339 -8260 936
218 936 3643 -391 -1110 2143 -700 -6816 -1345 8907 3381 -8733 -5874 4286 5132 -164 -2915
233b915J81J458K326K817j042p883k744J1019O516j0383q106O822O762k592l659
248a423P01J106k697o90O916L370j1001p341J1885J0791r046j1792M019J0184
262D982L13o832j852L985J65l346L127N084n124q430M544J0785j070j0800l138
277g607P889N824l217n634n99K958J933J80j01k094l108J417N449P25m659l460
293d104J774L978K570k061n537j454N403M736k420o164j374M883M200k260m301
308b131J19J719K31J321J851k828n073J655P381J623p156n306M485P226p60o753
324b396j751L828K348j068m01k58k314q75L930L425l024n733p2O085L690l997
340A417n885N85N550K195k825l069m72J747K414N90j831k365n56K104L097L68
$$ plain form
233 -2915 -2734 -1276 1050 3867 2825 -5058 -7802 3217 9733 -650 -8756 -1934 4828 2236 -1423
248 -1423 -722 384 -2313 -3003 3913 7283 -3718 -11059 826 11617 2571 -9221 -5202 4982
262 4982 5295 -1537 -3389 596 761 -2585 542 5626 502 -7928 -3384 7401 6331 -4469 -7607
277 -7607 282 6106 2889 -2745 -3344 -386 1547 1727 1626 -468 -3576 -2159 3290 4015 -644 -4104
293 -4104 -2330 1648 4218 2157 -3380 -4834 569 5305 2885 -3279 -4653 230 4430 2170 -2131
308 -2131 -2012 -293 -62 1259 3110 282 -4791 -3136 4245 5868 -1288 -6594 -2109 5117 4357 -2396
324 -2396 -4147 -319 2029 961 560 302 -2012 -2887 1043 4468 1444 -4289 -4361 1724 5414 1417
340 1417 -4468 -3883 1667 3862 1037 -2032 -2504 -757 1657 2247 416 -1949 -2505 -401 2696 3064
356C064m112l572K798N566L27n185l516K695M978N32m057k726J826K458M17k55
372A238q99k473n51L833K962k657m922m12N137L643l213n468N13M711J749k080
388A111k318o11Q10J841J302r18k560j552K052L986J07m525k963L059M529m6m054
405g50k767J775L972O28k838j941M36J179J702O75j788k743N6L515K679k324m679
422c213k98M625K894k729l960q2L279J873j062j774j063r6J876K136p64l044j662
439c064K158L755K92m174k772K627L810k9k934k123P23K635J463j523k163n04
455a823J065K042J083j793l161K03L426K246j985l739n72L411K767j606l442n38
471b416K237J730k6j330j600n64J844K430l44k951k046J816L807L58l896k357
$$ plain form
356 3064 -1048 -4620 -1822 3744 4071 -1114 -4630 -1935 3043 3575 -482 -3208 -1382 1076 1493 1238
372 1238 339 -2134 -2685 1148 4110 1453 -3469 -3881 1256 4899 1686 -3782 -3269 1442 3191 1111
388 1111 -1207 -1818 -1008 833 2135 1217 -1343 -2895 -843 3143 3250 -1275 -4238 -1179 3350 3304 -750
405 -750 -3517 -1742 2230 2858 20 -1921 -1485 -306 1396 2071 283 -2460 -2404 1111 3790 1466 -3213
422 -3213 -3511 1114 4008 1279 -2681 -2763 516 2389 1327 -447 -1510 -1606 270 2406 1642 -1402 -3064
439 -3064 -906 2849 3141 -1033 -3805 -1178 2632 2603 -331 -2454 -1731 904 2367 844 -1319 -1823
455 -1823 -758 1284 2367 574 -2587 -2384 1042 3288 1303 -2436 -3008 403 3170 1564 -1878 -2416
471 -2416 -179 1551 1525 195 -1405 -1969 -125 2305 1961 -990 -3036 -1220 2587 2945 -951 -3308
487c308K272L128J2k053j870O2K124J491m18j968j519O05K845J469k439l080P36
504a911K830J852j539l120n83K548K348p46k518j374J234K362O96j551j949l25
520a746J706K061j29k653j845J385L245P51l123k414J403K925M43j561j944j76
536a672J699J515n2j683j727J78K695J773k062l068L28K787J798j573k416n67
552b047J810J796M5j825j529L91K010J321r66k345q20K004K264m86k405j288J087
569i83K307Q64j964k261M56K297J287j031k049q71J635J967k45j500j421L2K118
586F38J722j434k638l17K231J947o71k645r47J723J803o5j195j505k45J828J744
603A974q52k222j006J585K345k26k178j386R88K170O61j419j949K5J618J461k40
$$ plain form
487 -3308 -1036 2092 2104 51 -1819 -1757 367 1858 1440 -528 -2047 -1442 1403 2872 433 -2647 -1911
504 -1911 919 2771 1232 -1888 -2471 77 2425 1679 -839 -2213 -979 1383 2079 528 -1421 -1746
520 -1746 -40 2021 1892 -761 -2606 -1221 2024 2775 -348 -2762 -1359 1566 2009 448 -1496 -1672
536 -1672 27 1542 1490 -193 -1920 -1742 953 2726 664 -2404 -2076 711 2509 936 -1480 -2047
552 -2047 -237 1559 1604 -221 -1750 -1359 651 1972 1006 -1339 -2159 -155 2109 1623 -782 -2070 -983
569 -983 1324 2188 224 -2037 -1581 716 2003 972 -1077 -1948 -313 1654 1409 -91 -1512 -1480 638
586 638 2360 926 -1712 -2029 202 2149 1478 -1167 -2114 -391 1412 1347 152 -1353 -1598 230 1974
603 1974 1122 -1100 -2106 -521 1824 1598 -580 -1966 -978 1192 1853 434 -1515 -1490 128 1589 1349
620A349k004j232J183K138J63j549j700J75K003J443j121k032l70J241J795J55
636A637k085j585J218J928M21j200j585l14J732J523n89j847j001J011K091L57
652A712j905j553M10K144R77j231j804j36J409J242N1j619j376P86K086N37j409
669C21j879J44J829J342r57j765m81J115J529K06j463j638O50J733R64j052j868
686a270l70J736J475n67j570q36N47J771P20j476j564K42J569J138p01j749n68
703a473J358J361K2j480j301O01J585Q17j006j522m19J533J501o25j699o32Q14
720e65J395O12j374j432L70J494Q85o63j560n53J160J607k81j464r23N79J453
737G40O34j002j429j75J305J264l42j658p75R92J459J66j243j190K30J585P71
$$ plain form
620 1349 -655 -1887 -704 1434 1597 48 -1652 -1477 526 1969 848 -1184 -1554 -313 1482 1637
636 1637 -448 -2033 -815 1113 1534 334 -1251 -1565 167 1690 1101 -746 -1747 -736 1355 1712
652 1712 -193 -1746 -1336 808 1785 554 -1250 -1386 23 1265 1316 -303 -1679 -893 1193 1730 321
669 321 -1558 -1414 415 1757 800 -965 -1446 -331 1198 1404 -59 -1697 -1047 686 1650 598 -1270
686 -1270 -1640 96 1571 1004 -566 -1402 -855 916 1636 160 -1404 -1162 407 1545 844 -905 -1473
703 -1473 -115 1246 1268 -212 -1513 -912 673 1490 484 -1038 -1457 76 1577 952 -747 -1379 -565
720 -565 830 1442 68 -1364 -994 500 1385 722 -838 -1391 -231 1376 1095 -369 -1292 -713 740
737 740 1374 372 -1057 -1232 73 1337 995 -663 -1438 -446 1013 1179 -64 -1254 -1024 561 1332
754A332q14j261o01J051J565j94j548q27N62J389O23j026j461J73J342Q62l78
771G89j305r42J039J624L5j367j101L55J409Q05q47j495j30J052J104j7j419r45
789a356Q05J376L29r93j389K52J386P73n06j334n46Q66J372k5j164r50K81J359
807E36P31r73j349o0J114J010j70j361p56Q11J364J45r85j140J05J300Q75n97
825F00j361l10J126Q37J13j117j049N18J208N22o87j329p2J044R77k73j148p32
843a133P82J124J26q56q26k6J086Q62n46j336l22R99R54o3j088q46M83J271M01
862A046q00j096q3J021R94m55j101n86P34J100J51r38r89L95J001O67n77j230
880g46l26J001R44j53j088p07N77J026M54q75q59j75J028R19l90j114m81O88J095
$$ plain form
754 1332 518 -743 -1344 -293 1272 1078 -470 -1297 -735 654 1277 251 -1210 -1037 305 1167 789
771 789 -516 -1458 -419 1205 1240 -127 -1228 -873 536 1341 494 -1001 -1131 -79 1025 1008 -411 -1356
789 -1356 -551 825 1154 161 -1228 -976 410 1183 677 -657 -1203 -337 1035 1010 -154 -1104 -823 536
807 536 1267 294 -1055 -1115 -1 1009 839 -522 -1278 -467 897 1042 57 -1083 -978 322 1197 600
825 600 -761 -1071 55 892 1005 -112 -1161 -643 565 1087 400 -929 -1001 43 1020 747 -401 -1133
843 -1133 -351 773 899 43 -783 -809 277 1139 593 -743 -1065 -66 888 825 -263 -1109 -626 645 1046
862 1046 246 -850 -933 88 1082 627 -474 -1060 -326 774 925 -13 -1002 -607 394 1061 484 -746
880 -746 -1072 -71 873 720 -368 -1075 -498 528 982 107 -752 -927 101 1020 630 -484 -965 -277 818
899H18J20j075j004M80J224L88p07q92j66Q37Q78j55j059m90L87J020M55q87j042
918h70K3J221O08n60j001l55Q73Q83m1j005p40M80J026M12o74q94j87Q82P67k85
938E63q78n48M97R32K84p98j030K05J133N45o18p99l07O87Q52Jr24o22L19J033
958E27L57o28j000m1Q83P86m28r13l54O19Q13J38q24p27K50P84N39m72p66l86
978h43O97Q84L2r09q82P14Q07L91p11q13RQ36N39l42p78m17N77Q06J12p48n80
999f19K6Q40O36o22q12k43Q95N93j34p86n55M16J045k4n66o56lP02N39j96r18
1020d42l67N69P80J73p63p27L28P49M56n41q92P9O52N37k08o11m78L31Q46K65
1040G36n95q03Q3P01O03k47r53l38P69O98j18o77l65L8P20M00m66p26n6N56P51
$$ plain form
899 818 938 -137 -1141 -661 563 951 244 -648 -814 23 901 746 -313 -803 -416 604 1059 172 -870
918 -870 -847 374 982 422 -579 -934 -61 822 781 -224 -964 -484 542 954 280 -614 -801 81 848 563
938 563 -315 -863 -366 566 850 52 -978 -773 360 905 287 -512 -819 -132 720 721 -203 -825 -506 527
958 527 884 256 -744 -785 98 884 456 -457 -811 -192 621 759 -65 -792 -542 242 781 309 -457 -843
978 -843 -146 738 770 -139 -1021 -307 500 891 180 -633 -624 212 751 409 -369 -786 -209 597 709 -39 -619
999 -619 -593 247 883 261 -551 -794 101 694 560 -226 -781 -365 680 656 90 -566 -569 133 672 476 -442
1020 -442 -809 -240 540 713 -50 -777 -449 300 756 215 -677 -598 54 591 383 -228 -706 -375 471 736
1040 736 141 -662 -579 122 725 478 -475 -813 -44 654 536 -141 -506 -468 252 652 186 -540 -596 -40 711
1061G11j62r15m07M76Q59Q4p23n43J24Q23L80m15p96k09O68O58j30o44l82K03
1081c40P58L47n04q89J7O37P24j96q95m00O09O48J63p23n27N6Q27L02l78o59j57
1102e80N14N66K9o85m87L18P86J81o08o49M4P79L68k94n68k74M37N48R3m13n84
1123d79M7P86L96n81o54KM81O29j94o65l30M40N14Q5l68n52j9N46M18j41p25j02
1145d66J08Q16R5o85n03K68O34K77l25p54M1N99M25j87m69m23K15P30J72n54n18
1166e04M9N42M90k99o72r2M18N91j31n84l75K95N41J83l75n33L0M16N26k06o04
1187b94l54L45O33K12n58n48N8P03L61l32n78k32N68M46lm54m66K78M86K36l98
1208A09o02J15N14L85j69n88l45L85N54P4m83m94K75M75L16l22n43j66M06M67
$$ plain form
1061 711 549 -366 -773 -297 562 646 -77 -620 -496 327 707 292 -504 -713 -45 613 483 -161 -543 -340
1081 -340 418 765 261 -628 -611 26 750 554 -341 -741 -132 516 679 -44 -571 -515 312 614 236 -423 -580
1102 -580 -66 500 529 -156 -643 -325 461 642 34 -615 -571 208 576 282 -286 -560 -123 425 518 105 -479
1123 -479 -432 354 750 169 -485 -483 -2 627 433 -232 -562 -122 392 477 109 -443 -462 84 502 361 -364 -466
1145 -466 -358 458 553 -132 -635 -367 267 544 219 -535 -494 105 530 343 -126 -549 -334 396 568 14 -504
1166 -504 -455 87 577 278 -394 -486 -68 523 392 -192 -567 -272 269 452 77 -456 -426 -10 516 310 -294
1187 -294 -648 -303 330 542 -16 -564 -506 197 558 226 -352 -584 -16 430 427 -27 -493 -215 271 507 109
1208 109 -493 -378 136 521 352 -236 -581 -196 358 432 -51 -545 -270 205 521 199 -344 -510 -104 363
1228C63K4m46l90J73O12J89n76l17j9M58K71q9n71j50K75O34n3m40m19K01N19
1249B49J87l28m70j00M07N24j01o16k34K74M67K04m00n21J25M70K22o7n42k06
1269d56M13N27j98m08l34K21M05J64l15l55N2K90K83J23n71l68L62M83j6k96l61
1290c55J3M41K87k61m60r5L95L35L0m71k26J35M54O4j85l47r7L75L46j49m07k41
1312d19L14L78pk88l94J17M20K91k54m18j52L19M80q7l47m13K28N77O0l40l47
1333b82j68M69L55j16l34k93J68M51Q9k73m80J75M77J72k03m28j51M32L45j03
1353C02m04l23J72M66Oj42m29Q2L54K63k47k74j27K44L60j5l00l76K92J87L21
1374D12k92l82j1L30K93j11k89k55J10M17J06l16l67J34L52J93j53l38j64K87
$$ plain form
1228 363 387 -59 -449 -276 336 525 -51 -368 -387 71 342 253 -318 -468 -193 441 388 -52 -471 -270 249
1249 249 436 108 -362 -462 -55 469 368 -248 -482 -208 259 463 63 -458 -333 137 359 292 -250 -456
1269 -456 -43 484 286 -122 -456 -235 170 334 19 -336 -284 6 289 412 -159 -527 -165 318 302 6 -355
1290 -355 -342 99 386 125 -335 -430 -35 300 330 -141 -367 -232 222 286 101 -246 -343 32 378 229 -178 -419
1312 -419 -105 273 266 -22 -416 -299 121 412 158 -260 -412 -93 387 300 -47 -460 -232 345 405 65 -282
1333 -282 -450 19 374 258 -76 -369 -201 250 339 66 -414 -239 238 410 207 -221 -372 60 405 302
1353 302 -102 -425 -253 213 219 77 -352 -270 84 347 100 -174 -301 -57 303 288 -12 -388 -96 91 412
1374 412 120 -262 -273 57 350 239 -50 -305 -195 222 328 12 -355 -221 131 324 171 -167 -331 -44
1394d4L28Ll62k23Q9M76P0k43m25J0L47L12j41l46j74J47M52Q2l98l36J19L76
1416A19K11j87m01p6L25K80ml48k15J14M42N3l29l25M4L61J16Q6m23j42K74J31
1438A06J65k58k85P3L42K38k29m45j2K20L70r5l16j73J69K57J81j93m82O7L60
1459F0K01j29k71j48K79K60Pj80l91rM78J34k38k29r0K08K80l4l17j27J09L75
1481B28n4j12l07n7K73J57K7l35p2J28K94O7k58l57J72K32K44k30k95rK92L69
1503C97k57l37j35L35J50J0j73j73L6J76K93j87k86OO1L73K6m28l02J90L43J80
1525B98j94l26q2M91Q4k80j03o5R9L01j5k38k54J58K63J64k68k35j50K52L61o3
1547A98k07l01K63K71J2j74k54k0K08J58J7k52p7k4N25j82j77k21L5L28R3j61
$$ plain form
1394 -44 284 287 -75 -298 -209 267 337 94 -331 -321 26 338 197 -149 -323 -176 276 358 -40 -376 -257 119
1416 119 330 143 -258 -334 -9 271 267 -81 -296 -182 260 313 -16 -341 -297 64 180 266 -157 -299 -25 106
1438 106 271 13 -272 -199 143 381 152 -293 -305 -85 285 190 -126 -299 -130 127 308 115 -367 -300 60
1459 60 261 132 -139 -287 -8 252 259 79 -312 -321 157 291 53 -176 -266 -58 222 188 -129 -256 -147 228
1481 228 174 62 -245 -302 -29 128 155 -180 -252 -124 170 237 -21 -378 -206 26 270 40 -255 -264 28 397
1503 397 140 -197 -332 3 153 163 -10 -183 -147 29 322 135 -151 -145 -84 289 315 -113 -415 -225 118 298
1525 298 104 -222 -304 187 271 -9 -112 -177 -78 223 208 -30 -284 -126 137 301 33 -202 -352 -100 261 198
1547 198 -9 -310 -47 224 236 62 -192 -212 -4 154 171 -81 -158 -182 343 161 -16 -237 -202 126 219 58
1569E8k41K8J18K89j84j7j92J14P9J72r7l52J05K35K15j69l23j14K20K45l4k03
1591d8p8J9K55j6q7l40L9K65K04J8k64j67P0K79J87l61k22O8K72J11j60j33pJ21
1615B5N3M3p9k70O4J76J67pl09j71L01L18j87k66q0K85K11j09k00o8j0K13l0P9
1639A49r0k61J53J83J52k87k85J09K50J13k06k60K09K94o2k17N4l8j7J39KO9k61
1662a08j09K49K17p2m49l2L63J55o3l57o1K61J44m7j00n0p4J51R0J19k16l42K17
1685a14L36O4l62k22J30M32N3l60k54J82K31j5j56K7j6j08K02Q3j7k67j7J57L25
1708C14p5l72j86M39Q6j14k73j41L75P8j82o7J97j91P3J07R7j33k79M0L41K21
1730C55l46l34J21M42n0k90L9o8J77P2k36J34q2l0MK99J5k90k44K98K45j1m64
$$ plain form
1569 58 -183 -155 -37 252 68 51 -141 -27 52 224 127 -225 -120 115 330 161 -162 -276 -56 189 155 -48
1591 -48 -126 -107 148 132 45 -295 -256 9 213 231 -33 -200 -130 149 336 -25 -247 -179 93 204 44 -89 -96 25
1615 25 78 121 42 -228 -164 12 179 172 -137 -308 -7 311 124 -142 -222 63 274 165 -35 -103 -113 100 70 149
1639 149 59 -202 -49 134 286 -1 -286 -177 73 186 -20 -280 -71 223 161 -56 -2 -40 -57 82 84 153 -108
1662 -108 -217 32 249 177 -272 -304 59 214 151 -206 -267 -6 138 91 -9 -59 -133 18 108 227 11 -331 -114
1685 -114 222 286 -76 -298 -168 264 317 -43 -297 -115 116 101 -55 -28 -44 -152 50 133 116 -151 -168 -11 314
1708 314 239 -133 -319 120 206 92 -181 -322 53 131 -51 -118 79 -112 -39 68 165 32 -247 -207 134 355
1730 355 9 -325 -204 238 188 -102 -63 -131 46 118 -118 16 -66 -96 -92 207 222 -68 -312 -14 231 220 -244
1753b44P4K27J89k03k14P2K25n3p4J33M0l37m9L02J20n5m24O3L41J26k04m01L35
1776a1J61J7k51q3K65j05m7Q1J69k10j78J46L30n3l20k10K25L47j56l73R4K97
1798A35L3j48k5M9j28%R1K03q0k56j41L51K74l71k11K8L57J66m89j84J77L75j42
1821F4k59J02J73l1j18J97J16l08k13J90M14j48l41m8J84L55k32l81J74K74o7
1842I7o6j2Q9j5k12N9K53m8l17q3M39N4k93k72R3L80J09m21MK04R1l05J73P6r1
1867a4m5p1L42Ol07k66L43L48j13m32J0K42K13k38j36J08P8l4j16R3J34j65j00
1890a20J09J60m9l98J06L87J12k58m33K18L04O2m01J1K94j3j44qJ76r5j50r2L80
1913A58J23l89j40K47K81j01l35j61M12N9k42o9J42K01k50l9K08j4j59r6K31J77
$$ plain form
1753 -244 -170 57 246 43 -171 -99 126 73 -1 132 172 -165 -214 88 208 153 -271 -208 133 259 55 -346 -11
1776 -11 150 167 -84 -167 98 -7 -54 27 196 -14 -192 -46 284 231 -89 -299 -74 273 117 -256 -162 135
1798 135 168 20 -5 44 -84 -84 7 210 130 -126 -267 84 358 -13 -224 -196 161 327 -162 -346 -169 206 64
1821 64 -195 -93 80 49 -69 128 244 -64 -277 -87 327 179 -162 -210 -26 329 97 -284 -110 164 97
1842 97 31 19 108 93 -119 -60 193 145 -172 -255 184 238 -55 -327 -234 146 255 -166 -162 42 133 -172 1 77 -14
1867 -14 -59 -130 212 218 -89 -355 -12 336 223 -209 -199 43 256 18 -118 -10 68 34 -82 11 145 -20 -120
1890 -120 -11 149 100 -298 -192 195 307 49 -384 -166 138 200 -201 -190 104 91 -53 -61 115 20 -130 -222 158
1913 158 281 -108 -248 -1 280 179 -156 -317 95 154 -88 -157 -15 186 -64 -103 105 91 -68 -164 67 244
1935B44j22m59J40K84J33l15j55K75K32k50j31P7J44j17j01K44O3k28j67J07K61
1956A59O4l80k07M37K69j94l93J8M19j66o7j00K53nj90K7K04K4l04m5K59K52l64
1979c0l48K86L34n8k80r2J36J27r0o5J97p1j71qK00P5j17l14J57L99j67k53r6
2002b49K22L71k72k96J89J63k5j45P5Q2j78j26J36K69j46k80R1K21J14j95l18
2023b97K77R6R5l05M6P9P6j25NJ44L3k41n0L23J67m26j34J82J84R4l12p6K61J33
2047B29k30k79K22J63j75n4J74O0j19p8J7L81k81k15l7L47L7k39j44P0L13j66
2069dp1Q7L3p7r9O6K53j18j22q4L26Mk82k00J69L62k57j96Q3K31L5j55j8J54o0
2094F0k02Q0K11rj67k48L02K80k21k90L6L42Pk82k8J73J50k78M4L6P9k13k5K45
$$ plain form
1935 244 122 -337 -197 87 220 -95 -250 25 257 7 -124 -47 97 -20 -121 123 186 -42 -209 -102 159
1956 159 223 -157 -364 73 342 148 -245 -227 192 26 -41 -141 112 107 -83 -56 148 172 -132 -177 82 334 -30
1979 -30 -378 -92 242 184 -96 -188 -52 75 -15 -80 117 46 -125 -133 67 142 25 -289 -132 267 100 -153 -249
2002 -249 -27 344 72 -224 -35 128 103 -42 33 115 -63 -189 -53 216 70 -210 -119 102 216 21 -297
2023 -297 -20 76 171 -134 -88 -9 67 -58 -53 91 124 -117 -167 156 323 -103 -237 -55 129 223 -89 -165 96 229
2047 229 -1 -280 -58 105 -70 -124 50 110 -9 -87 -70 311 30 -185 -222 125 162 -77 -221 -151 162 -4
2069 -4 -75 12 45 -32 -131 -65 188 70 -52 -136 190 194 -88 -288 -119 243 -14 -210 -127 104 139 -16 -34 120 60
2094 60 -142 -62 149 140 -27 -275 27 307 86 -204 -168 174 181 -101 -129 44 194 -84 -40 -4 75 -138 -163 82
2118H2L7j10k48J39K78j5k57j19K89J22j46k70N8K89r1r9J4J58n5k47K45J20r5
2141G9k17r4L04J57j99k40P1L84j32k52L5J19J28j92lR3q1L7j38K63k7j50n6J25
2165A4J66q1k83oK79M9j68OK8Q0j08L1l2J25p1j40Q5K31q5k48M3J48J09k37p8
2190a43J27J21n1o7mP9K2j94N0P4M2j10r7L49m8j68j76Q8K25lk04Q9P2L7r5o9
2216e4L0N3j07M5J04J8j32j67K52J15j19k51J34J36O1j18k00K07M4n5N%l1k6l0
2241h6J17N4m8k17J17K29m1j42q8J33J17k23j0Q0m4n5J28k8k4Qr4P3O1J19j87
2266e1r4J90O4j5k89J69J02n7M0j44M3P4j25J8O4J1p7L6J08M6l6j01n4K67n4k01
2292f6j19K42Q2j66M6J7K6j59J57n9m3M8l2oJ26j19n5J08N1J24k16n2m7K15l7
$$ plain form
2118 82 119 9 -239 -100 178 163 -94 -213 76 198 52 -218 -160 129 38 -61 -47 111 56 -191 54 174 79
2141 79 -138 -232 72 229 30 -210 -139 245 113 -139 -104 15 143 -49 -52 41 -40 -3 -141 122 95 -55 -111 14
2165 14 180 99 -184 -190 89 138 -30 -24 4 84 -24 7 -25 100 29 -111 -26 205 120 -128 -85 63 172 -65 -143
2190 -143 -16 105 54 -13 -17 62 84 -110 -60 14 56 -54 -151 198 150 -18 -194 -106 119 116 -88 1 73 110 15 -54
2216 -54 -24 29 -78 -33 71 89 -43 -210 42 157 38 -213 -79 57 118 0 -200 7 51 -4 1 1 -30 -56 -86
2241 -86 31 85 37 -180 -63 166 125 -17 -105 28 145 -78 -88 -8 -52 -107 21 -7 -31 -23 -117 -44 17 136 -51
2266 -51 -145 45 109 94 -195 -26 76 19 59 -85 -42 32 -93 -75 -11 0 -77 -41 67 113 77 -24 -78 189 135 -66
2292 -66 -185 57 139 -27 19 36 62 -97 60 1 -42 6 -26 -32 94 -25 -80 28 79 203 -13 -65 -112 103 66
2317F6j12K3l3K9N1j15R1m4q7J13J10j23K0m8PJ73j17j08o2K61l0l7j55J20K1
2342A4j30j6Q4K6J8M5j30J38p7j33PJ91O1k7j61K6Q0k0j8RPn7Q7L3q0l4j44K51
2370E0P9j24n1L2M6Q5k8q8o7JN9L8M6j52J72p6M0N1j59m1n1J89P0m9j72P3J2L5
2398B0j06J07m2K2N%o4R7Qj02J25j3q8n9j4J36nm1o9J4J65j07qm1kJ15J5j69J79
2427G8k07N6Q7M5j01o6J0J63M7j72N3j7Q4L2n5L8o4M2k8pm3l8J48j51J57N1j22
2454B0j10q0J61O3j31LJ27m4J7j8n5K3M8KL9l3j33L4O7O9o7n8O2L2n1M3m1po1
2483g9J23o7J7J2l1L2L2j30Ml8J15O0%j32%l6K17k2r2M7q1pM3NL0j4K4o9J23j32
2513d6PJ38k0K1p5r9p3K27R3j32l2j60J46j0P5q0J5L8J1q9J30p6j27J16P3l3k1
$$ plain form
2317 66 -46 -23 -56 -27 24 -91 0 -44 -131 -18 92 -31 -11 -59 -52 121 4 -104 -166 95 65 28 -127 -7 14
2342 14 -116 -132 -48 -22 -4 41 -89 49 -28 -161 -154 37 98 71 -90 -64 16 -4 -22 -13 -6 -63 24 57 -23 -57 -201 50
2370 50 129 5 -46 -14 32 117 89 1 -66 -65 -6 32 78 -74 98 22 62 113 -46 -87 -138 51 121 72 -100 -27 -15 20
2398 20 -86 21 -21 1 6 6 -58 39 47 -55 70 57 -31 -90 -104 32 27 -14 -83 -69 96 -11 -19 -60 -62 53 68 -101 78
2427 78 -129 -73 14 59 -42 -108 -98 65 112 -60 -7 -24 60 92 37 75 11 53 25 18 -25 -63 85 -66 91 142 20
2454 20 -90 -170 -9 54 -77 -74 53 9 26 8 -47 -24 24 26 65 32 -101 -67 0 69 2 -56 6 38 -13 30 -11 -18 -79
2483 -79 44 -23 -6 6 -25 7 39 -91 -87 -125 -10 50 50 -82 -82 -118 99 77 -15 32 -49 -56 -13 -8 22 8 32 -37 86 -46
2513 -46 -39 99 79 100 25 -74 -147 80 173 41 9 -151 -5 -15 60 -20 -5 33 44 -45 85 9 -118 -2 71 38 17
2540A7j5rO4J8p5J02j20N0J2p6k7j9R1J5qn8QQ1j5MJ6j08M2j3Q9j00%K6n4R9j09
2571g2Q5l4j40J15R5k5n8r0Q8P8rp2NJ9J72k19O6J9j18L6J49n0p1jm3J19LK4j38
2600f7L9nQ3Pj26J15p6lJ47j74P8r3J3J00j1M2m4l7n5J05r4M7J0o0J08k8k7N7
2628E1j1q2R2l0j55J00J27j31P2k5k7l4J46j62J5j2O3P0p9K0k9J1P6j65J28o9
2654d0QJ38m7p3ok7J22j0m7n9N0P1j17R4k9JJ6J4k6Pj9q6j7K8R9J27k15M6o6J84
2684A21n8o8p6J03k4L9q9QRj8R1M8j19R4l6j16J24J0q5L4O5j4j04K4Q2J6K3r2
2712hk6M1q2J86n5p4p8J42l7k9J19j34L2R0j31l1J33j27k9J09j1j1l4qL9l2L0
2739a6jj3J7Q9n1l0r8J43k4l0N1j4o6M3PL5j21P9N5n1M5j6m2J01q4j6p9Q3K1o7
$$ plain form
2540 17 2 -7 57 75 0 102 -18 32 44 -32 -59 -78 13 28 20 -38 -30 51 36 40 56 -52 -10 -23 66 -34 -34 -8 -62 37 -72
2571 -72 13 -21 -161 -46 49 24 -34 -124 -36 42 33 -39 -34 -15 157 -62 4 23 -95 -59 90 40 -31 -32 -75 44 47 71 -67
2600 -67 -28 -33 50 57 -69 46 -30 -33 114 -60 18 -75 -62 38 27 69 25 -12 -67 38 -56 -9 1 -59 49 21 -6 51
2628 51 40 -42 50 20 -135 -35 92 -39 33 8 -19 -53 93 -69 -54 -66 -3 67 -12 8 -21 -10 66 -99 29 -40
2654 -40 -32 106 59 -14 -20 -47 75 65 18 -41 9 80 -37 57 28 29 45 59 33 40 21 -65 -82 -54 45 172 -43 3 -63 121
2684 121 63 -5 -81 22 -2 37 -52 -44 -35 -53 38 86 -33 61 25 -91 33 43 -42 -8 57 43 -61 -37 45 61 84 -8
2712 -8 -34 7 -75 111 56 -18 -96 46 9 -20 99 -35 -3 87 -44 -75 58 -69 -98 11 0 -11 -45 -53 -14 -46 -16
2739 -16 -17 -30 -13 76 25 -5 -103 40 16 -14 37 23 -43 0 7 42 -79 0 55 4 49 33 -9 92 8 -8 -87 -4 17 -50
2769e0J75j06n5L8M8m9P2o2MM1j17K9Kp3K3J80l4p5l6J19m3o9P2n4RK2m8L2j2
2798a7J42j21K7k3O2j33O6Qk5JL0L0j93P1J32m3k5n4K6R3k2j3j09L9P7j9q4J16
2826C9Qk1nL7o1O2q2O8Lr0J21j04K8J04o5j1j24J63l2L3J4j13ol1J35l6l9k0J62
2855A37n7l1j18J25q3M2P9q4q0J5NO1J7p9L7O6n9Q6j21J5j0j8M3J07mj57pP9M6
2884E2o0k8J31k9o0m9kQL5J5L7j9j02Q0o8R3m3M7l1k0j9kk3MR6o7J35j13O9r0
2914b3J9K9q2Oj1N8Oo0J23j34O0nm0J25o2lq3J23l0n1J8N0j08J82k57J26j8k4
2942f6N3j5k4M1oK8j49M6J08n6K6O8p1O7o6n2J53r8lK9K1p5N8L1n5M5mop7K0N4
2973B5K0k4rPL1j34O4M2k4qJ0K6jj9%K2p8N4j6m2k5J8R9J0l8m1Q8n0K0j2l0Q1
$$ plain form
2769 -50 125 19 -36 2 50 1 73 11 15 56 -61 -32 -30 -103 -80 100 66 -9 -45 74 31 -38 34 -20 -11 11 -37 -5 -17
2798 -17 125 4 31 8 70 -63 3 11 -14 -13 17 47 -146 -75 57 14 -11 -65 -39 54 32 19 -90 -51 26 7 -77 39
2826 39 47 26 21 58 -3 59 -23 45 48 -42 79 -25 3 107 42 31 -93 70 38 71 85 -28 -34 -65 70 34 -5 -25 137
2855 137 80 49 -69 56 -27 15 94 10 -70 -55 -50 11 28 -51 -14 52 -7 79 -42 -27 -37 -55 -12 95 91 -66 -73 6 52
2884 52 -8 -36 95 66 6 -43 -45 -37 -2 13 50 31 -71 9 -59 34 -9 38 7 -13 -32 -34 -57 -53 43 -24 111 -2 67 -23
2914 -23 -4 25 -57 -51 -62 -4 2 -58 65 -69 -9 -14 -54 71 9 6 -77 46 16 -35 -17 33 -75 107 -150 -24 -42 -66
2942 -66 -13 -28 -52 -11 -17 11 -138 -92 16 -40 -14 54 -17 50 -16 -68 85 -13 -16 13 34 -41 17 48 -7 38 34 28 -49 -29 25
2973 25 45 21 12 19 50 -84 -20 22 -2 -10 0 26 25 6 6 28 -50 4 -12 -54 -79 -61 38 48 10 -31 57 7 27 15 -15 66
3005F6nj54l5J06K2m3J11P3j38n3J19p5R2m3n4j7L2O5%j03J5ln0J10O5j49J16
3032G0m9O9j72M6J7J3N7k0%r9OP9m0N4J02j47L5Pl5Pn1K1J01p7L2l8L2o6P8j2
3062B0Pj29J62n8Q7n6m6q8J90q2lk5j24J84Lj3r3Q0j33L6R6Pm8j3M7m4O2l0qL
3092iN5Np3P0k36K09K7k4jO8l8qo3j0n5J65m0j05M2oJO0q5J08lo6m3P2r1l1J07
3123Bpo0J37q9j5j1J49m7o2J8Jk3k2J3K2M3r2L7L7k6q5k4J21K3k0J4n4On0R9p6
3154d1l6J00q1N1P2j46O8K4Mk7n1J7OQ3j5r6M8rl0N1O9lj56PP4L6P6r5l2J22j9
3185G1o2L2j1m0J7O2o7J8o8N2L9o4M3o1N2rl1K2k3L9j11R7o4J13j88P7J6K2O8
3214D1o8P2q6M1k9M3L4J6m6J5j1P4j05Q0J2o4om4R9k5j19R6j01N2Q2n7n2n4J53
$$ plain form
3005 66 61 -93 -128 -22 0 -43 68 141 3 -50 69 -6 86 43 -11 -28 4 69 69 -34 -19 -22 -72 38 103 -46 70
3032 70 21 90 -82 -36 -19 -6 51 31 31 -68 -62 17 -23 31 133 -14 21 28 -7 0 -51 -30 71 -6 26 -12 20 -46 32 20
3062 20 27 -102 60 2 89 33 -13 -101 89 7 4 -21 -145 39 42 29 -64 16 -117 -81 15 22 -26 -39 8 -36 26 -4 -12 -9
3092 -9 46 51 -22 48 -188 21 48 24 23 91 53 45 -18 -28 -83 82 42 -63 -21 -27 -26 34 -51 57 54 -12 -55 17 -74 -105 2
3123 2 -5 -65 72 -17 -32 -43 106 59 -3 15 16 -7 -29 -16 6 49 -43 -6 31 5 -80 -104 17 40 20 34 -20 -14 -64 35 -41
3154 -41 -77 23 -58 -7 65 -81 -13 11 15 -12 -63 -46 -40 43 28 -68 -20 -29 -59 -8 61 58 -98 -91 -17 19 95 0 -32 90 71
3185 71 9 41 30 -10 7 69 2 20 -48 4 43 -21 22 -39 13 4 -27 -5 -28 11 -100 -3 -67 46 -142 -65 -49 -27 41
3214 41 -27 45 -41 0 -29 14 48 64 18 33 22 96 -9 71 83 19 13 -31 68 43 -76 20 -81 -29 53 -4 -56 -110 43
3243D3J9j14J14j51J57r3N6m2O4r1L2j3J8j5j6K1KO7O6j97O5J5K1l0M2J06j51
3270eJ1N6j4lp9R1jj48O2rJ12Jj22K1P8l3j09J22m2morN7q5J34o9o2J30k7j40
3300i2Q2n1l6P6J5k7M9J0L6o2O7j33J50j90Q9o0lJ16Pn2J6J4k6l9J0J29j32M2
3328El4N3k1OJ8n9M1j5j7J05j03mL0l7M0Oo1L3k1Q9j39N3o9J83j14n5J15Pp6M4
3358CO5j01N5O9r3K2p1K6J11q0r1J02Kr9J04l7M5r0K3J8J04o7M0j01O3p1Q8o5
3386b6L8n1J9N0L2j08j9J4N3m3N0n4m9R0J3%n9M0K0Qr5R4q%m8J4J2Rj1J43r1o6
3418b9K0O3N0n6m6j00JQ5O8N3r6j9m9N7O0j12M7j2N3mp5j9P9j4M8j1j20N6J1M5
3448C4n7m8J02j25R7m2P5q6N5ol5P1k9J4k4r6J56j00N0pK5K1m2J1O0j38J09n4
$$ plain form
3243 43 62 -52 62 -89 68 -25 31 -11 53 -38 -6 -19 -1 -16 -32 -11 -9 58 124 -73 -8 7 28 -2 40 146 -5
3270 -5 6 62 48 45 -34 57 56 -92 -30 -39 73 74 -48 -27 51 18 -91 31 -11 -15 -21 -30 27 -58 76 7 -55 75 48 -92
3300 -92 -10 -61 -97 -21 -6 -33 16 26 62 0 67 -66 84 -106 -17 -77 -80 36 43 -9 7 21 -5 -44 -34 95 -37 5
3328 5 -29 24 3 9 27 -32 9 -6 -23 82 -21 -25 5 -32 8 14 -47 -14 -35 54 -85 -32 -101 82 -32 -87 28 35 -41 3
3358 3 68 -33 22 91 -2 20 -51 -25 86 6 -85 17 19 -80 24 -13 32 -58 -35 -17 87 20 60 -41 22 -49 39 -26
3386 -26 12 -39 -20 30 62 -46 -65 -51 2 -41 9 -45 -94 -4 9 9 -50 -10 10 18 -77 17 9 9 -39 -25 -13 -4 -15 128 37 -29
3418 -29 -9 54 104 48 2 -98 -97 -12 56 109 13 -6 -55 2 62 -50 -3 -15 38 34 -41 -60 19 5 53 42 -78 -22 -11 34
3448 34 -23 -71 31 -94 3 -39 36 -50 5 -1 -36 35 6 20 -4 -100 56 -44 6 -1 24 45 3 14 74 -64 45 -9
3476iL1O2l4%o1Q1n6M4r0j07J82n5N0m4n1K5L0J5j10M4OJ12q1NK8M9J9l3n0M8
3506E0j01Q1l5m6P9m5QN6r8N2L6pK7o4l0N7k9j4Q6m1n7roORk9J29n0n3PK6J7m5
3539c3Kn1P0l5J07j46K6j8O4L2o7M1J3K9l7J43q3l0m1J2q0O2j0K1o5Q0P9Kr6J8
3569IK1j14J03m5k9N8m7R6j59Q1Pj9pK1NJ07q8J1m0L7l9Q4J04j16l8k9QK8l8K0
3599hJ6L7j18J04n9m4J17j29J7Q2J0k8j02J80l4j89J71r2J99k58K55j50M5M2p
3624E7l1m3K9n4L5m1mj3j3L2M5O1n7m7M5p8N0M3po6N2n3N4l7k9J03O9j21K0K4
3654B5lJ11j40J0L5l9j8L1k9L0l1o2Q3k3L5l0N5k9M5p8q8J26K7mo6O3p6M8n5O8
3684B1Kn3Q0k9n5N0L1m7Q1p0j75Q9Q3M6r9LP1r1P2m8J02p0M4m0j2M2M1j04J31
$$ plain form
3476 -9 22 84 50 50 -11 70 14 58 -32 -139 43 -12 38 -6 -57 -32 -2 13 -97 -53 -47 65 -16 -11 17 66 85 52 2 50
3506 50 -51 30 -5 -51 28 -17 -9 47 -51 1 37 30 57 -7 -37 20 -9 -23 63 22 -35 -44 -50 -44 -35 -64 65 15 -38 -31 -5 12 -33
3539 -33 -31 -82 -12 -47 60 -86 -60 -78 -14 18 -49 -8 5 34 -3 140 57 27 -14 -2 -82 -20 -30 -9 -74 6 85 87 -9 9
3569 9 30 -84 19 -26 -55 3 -44 52 -107 -26 -19 -38 -45 -24 -19 88 0 11 -29 8 -31 53 157 41 3 -26 -18 10 -28 -8
3599 -8 8 45 -73 31 -28 -72 45 -84 -67 15 25 -3 -105 75 41 -148 23 -69 130 -128 127 -23 22 64 57
3624 57 26 -17 12 -42 -7 -48 -52 -65 -78 -46 -1 60 3 -44 1 -77 -27 16 9 -57 -5 -58 -4 -41 -70 33 102 -19 1 25
3654 25 22 133 -7 3 38 -1 -19 12 -17 13 -18 -80 3 -20 15 -15 40 11 56 -22 -110 16 43 39 -27 36 -40 8 -47 21
3684 21 23 -30 50 21 -34 16 47 0 81 11 -164 -75 8 54 -45 -42 29 -62 10 -38 64 -6 38 -2 -14 28 69 -35 96
3713I6j33N0r3K4K7M3j1O1jp2mk2l9O5M3J1j6KL6n8m9M9K6l9k6L3m5J40m7n0j3
3744a2l8J33r1n6J13j6r2Q1p5Q2p3%n3J06j6J2j03J37L2J0p0p5J27j11R0j01J16
3771E7r5oJ03j6po4mQ4j16m8J38qJ0ll7j4J06j16l6J10p5oR1nL0l8K0q6J14j3
3801G0m5j7l6J2K9Ql2J18q4j7L8j8J75p4k23J78j38jjk0R6J2q1N5K2pl6k6m3O7
3831a9M8l9j0N2k5o6N0JO3l8r9J68n7o7J08j73O1R1j4JRj3%l1K8q3J3l2K0k0K3
3862e0L2M8m7j6m1L4M5M4pK4M2k08J02Ll0L7K6l9k4M4n0J06j43R4%L6q9P5o5m9
3892f6R5n2K7N4n0k0l1K4L8L1N7j49J9l2O8J2q8J9k0N8M3q6L1k6N0K1n6L2M4p9
3922c2J13j29Q9q4J32j08N7j09P9k8L7M8q2N5l9J9j02N7K5r6J67j55lJ12m0oJ3
$$ plain form
3713 96 -37 13 -80 -56 -29 14 3 64 63 -9 -13 -35 -74 -9 34 45 29 31 67 9 -40 9 35 -4 -30 3 -42 98 51 1 -12
3744 -12 -50 83 -8 -64 49 33 -59 22 -53 29 -44 -44 -97 9 -7 5 -98 39 71 81 11 -64 63 -48 42 -59 57
3771 57 -38 -44 59 43 36 -28 -32 52 -64 -112 26 18 28 25 -12 -26 80 -36 -72 38 -37 -43 48 43 73 35 55 -31 83 70
3801 70 25 8 -28 -16 13 21 -11 107 23 6 44 26 201 127 -96 82 -56 -57 -58 -78 18 30 -51 4 26 19 -17 -43 -86 -19
3831 -19 29 -10 -20 32 7 -59 -9 -8 55 17 -82 86 29 -38 70 -103 -42 49 35 36 45 32 32 1 29 -54 -41 -73 -53 -73 -50
3862 -50 -18 30 -17 -33 -74 -40 5 49 42 66 108 -100 2 5 -25 12 38 -1 -25 19 -31 75 -68 26 26 62 -27 48 -17 -66
3892 -66 29 -23 4 58 8 -12 -43 -19 19 50 107 -42 -23 -55 13 25 -63 -44 -64 -6 37 -49 -18 -44 6 27 -29 3 47 -32
3922 -32 81 -48 41 -43 89 -19 38 -71 8 -20 17 65 -17 38 -1 18 -84 -27 -2 -98 69 -86 -89 23 -17 -23 -10
3949a0q1J29m0m9M2N3j46L3m3O1J19m2J5j04J37j02O4l1M6m6MN1m6L9q1Pl4L8
3977a7P7K9m7P4j19J4K8J01j45M2J2ppp2l2P2J6m2J14p4L4J6j7p9P8j26M6NO8
4006D2p2N5N0j8M4n3ql5J4L2j13K9mM5j52K03j20R0J5n3Q0p0m1Q1j35J38J0j33
4034g9R4j1Q0r1J3j1no1J38j55J59j15NK3O9On6o4L2k9Q0r0J5N8j8m4O1RJ35j62
4064a4jj1K6N4l4L0k8m0n3J21p1P4r1k0N7m2lM5K3L1m7l1J1R8q6RRj2o4P3j9p1
4096g7P9K4j4j2O2j00j1M7j4j4R7n1N8o5m1K7O3k1j20J57k9l7kl6JN1pm8Q9M3
4126I9k04Q1J5K1J7j24L4J01km3K3k8L4n3M7j0J1O5rj33l3Q2OJ5m4L5p8J7M8J7
4156GP1q4Po1Ol2R1L5k4l4ML5n7K0qM6k9j0O0l7p1L6R4n8j2m3M6k5O9%k7N0j76
$$ plain form
3949 -10 -91 38 -2 -51 -9 44 -102 -69 -112 -51 68 26 41 -63 74 -28 36 5 51 5 9 60 14 53 -28 -21 -55 -17
3977 -17 60 89 42 116 -3 11 39 140 -5 37 49 42 35 -37 -69 3 19 -23 91 17 51 67 50 -29 49 -77 -31 -26 42
4006 42 -30 25 75 57 101 48 40 5 19 51 -62 -33 -37 8 -144 59 -61 29 44 -9 71 1 -40 41 -94 44 54 -79
4034 -79 15 4 84 -7 6 -5 -10 -71 67 -88 71 -44 -39 -16 53 59 3 -61 -29 -58 22 -68 -53 5 -13 -57 4 13 148 -14
4064 -14 -15 -26 0 54 20 50 22 -18 -71 50 -21 53 -38 -58 -1 -43 -46 -1 22 53 6 -25 -14 84 -2 7 16 4 -60 13 -6 -77
4096 -77 2 26 12 0 62 -38 -49 -2 -16 -30 67 16 74 9 -32 -5 58 37 -83 74 45 8 6 -30 -29 22 15 -33 56 99
4126 99 -105 -24 -9 12 29 -95 -61 40 38 -5 18 -10 24 -29 18 8 19 84 75 -58 -91 -9 -3 12 -32 3 -75 -58 -10 7
4156 7 78 -6 1 -60 -54 -86 5 40 16 -18 -14 21 -36 -16 -24 22 -7 -17 43 6 -65 -29 65 7 -5 -48 -2 -27 42 42 15 65 -111
4189a11J71p8l8J16j4m2JM3l3l5R8l2l8l6J27j63O1K5N4o8Mo1L0m3N5J22j11p8
4217g4NP6M4rq5M4J5Njn0J10l5l4QQ0l9p4l9M6N3p2O2n1r8J03L6N8j62J92j40
4247b6k4J7J8m3j0K14j65N7n8R1j9j03Q8nk8qN0m9JJ1j8k7P6o7J2R1N0q6J5jO2
4278A16j11J4K2n6OL6Mj05J09l6l7L1N1n6K1ol1O9m4J9N4o6lM0p0j8J68j00j2
4307Ik7ok6Q4o3J16j73J28n5j8P2p2J28j42M7k7R8j1K5qr5Q8j3o9J9L5p6j2Q8
4336D4np3j03J65p3m5P6K6q9R4j7j2Q6j3q0M6n6m2lR9r3J3O1p0O5M1n1l5J27q1
4366Bj09R8n7J28j04L3M7K8Qq3J03m6o0L1p1P0pl5M0K1m3M0j9j1N8j4l0p1J45
4395I2p3j1lL6j4o3L8M5p6l7O0Nj8m5K4P9M3r9RP1n8qR5k5q5R5k2j9l6m1L8J04
$$ plain form
4189 -111 60 -18 -56 60 46 4 5 48 15 -20 78 46 8 -28 99 -64 -3 22 76 8 12 -49 -19 -62 -7 115 4 -74
4217 -74 -69 7 51 42 -43 1 16 21 20 -30 80 45 11 19 99 60 -14 -53 -7 46 -26 36 -15 -113 -10 26 84 -78 114 -26
4247 -26 -50 -33 -15 -58 -68 146 -19 38 -20 71 52 -51 37 32 4 -4 46 -3 -2 9 -9 -36 40 -27 -15 76 126 40 55 54 116
4278 116 5 19 41 -15 -9 27 31 -74 35 -1 -38 -7 44 -12 9 3 -28 41 -3 16 70 4 1 41 -29 -47 121 21 9
4307 9 -18 -24 -50 34 -29 87 -86 42 -13 -31 41 -31 97 -45 2 -25 73 62 87 79 -16 72 59 -10 9 44 -32 -44 44
4336 44 39 -34 -137 28 -45 -90 -14 12 -77 17 0 -12 74 61 -19 27 -29 -71 -74 25 -68 -55 6 -64 1 42 -9 -44 83 2
4366 2 -107 -9 -66 62 -42 -9 38 66 74 -9 94 48 -12 19 -52 18 11 -24 16 37 -6 34 15 4 62 48 18 -53 92
4395 92 19 8 5 41 27 -36 2 47 -29 -66 -6 -1 -19 -64 -40 39 82 -17 -8 63 5 -3 92 67 -18 77 55 36 0 -41 -3 101
4427A01j59%Q5K2q0R9q0nL5K8L0j22n4M7K7m5R9K0n3k1O3o9K8J5k1O6rJ0q4qM9
4458A4m9QrQ1r2k2K26j34l4O1N3j26M4n7J8j4M7N6o8p4J32K5j78J85j71J0J53
4485H5j42L1j8Q7l5n2J28m5j8k2M9j0q0n0J12Mq2L2KNj5P4K5q1J8j4j1R0j32R4
4515B9Lj01N7M2M2j60Q4M2R5r3r9RP3k0N7o5O9q1k3M2m5J16j00N1r0O0ok8N3N5
4545F8j17k7M0N2l5M0o4J30j01m5J08j8p5oM6o2J73j28Q2j10j5J40j02%Q1q8L4
4572Aj61J05M1M9%n2m9J66j46J3J20q6o1J98r4j04M0n5J30n5n2N4Qok6mPp6K07
4601A12q0o2J6P5q1J31j38PQ4p9O2n8N7o0O4rK8j23J54j35O3P3j10Q1j09Q7OJ4
4629G0r8m3mQ5N1k6j18k3J42j22L0m6J2R6P1k4n6ql4nP9m7P4o8P4J0K5j19L2k
$$ plain form
4427 101 -58 -58 27 49 -31 68 -12 -17 18 46 76 -46 -100 -53 -26 -71 28 48 -5 -26 37 -32 -4 11 -10 56 47 57 -27 -35 14
4458 14 -35 -27 -36 45 -47 -69 157 23 -11 50 103 -23 21 -36 -18 -32 15 71 3 -71 61 86 -92 93 -78 -68 85
4485 85 -57 -26 -44 43 8 -44 84 39 21 -1 48 38 -42 -92 20 24 -58 -26 -24 -19 -34 40 65 -16 2 -12 -23 67 -65 29
4515 29 32 -69 -12 30 72 -88 -4 38 133 40 -59 -50 23 3 60 -5 64 -17 -40 2 -43 73 -27 24 -66 -6 -12 -40 13 68
4545 68 -49 -76 -36 16 -19 21 -43 87 -14 -59 49 31 -44 -50 -4 -66 107 -21 61 -49 -64 76 -26 -26 55 -33 1
4572 1 -160 -55 -14 35 35 -17 -66 100 -46 -33 87 1 -60 138 44 -60 -20 -75 55 0 -52 2 10 4 -22 -26 -19 -95 112
4601 112 32 -30 -14 61 -20 111 -27 -20 64 -15 47 -11 46 -14 50 41 69 -54 100 -35 28 101 -9 72 -37 50 56 70
4629 70 -28 -71 -75 10 61 35 -83 -106 36 -86 -56 -102 -90 6 77 53 -3 -11 -45 -50 29 -18 56 -12 62 72 97 -22 10 8
4659HK7o9k1J15P5k34Q1K2p5J04j0j07J60n7n7k8N4L5KJ3J3k4j35J23R5m9r4r6
4687a29K06k6l7k9QJ0n7J28j08PK2K2O6q1L0Nn7r2J59j11P2l0P0l3Qn5J5K0p0
4716f7J18q7N5n2n8J13n9J08n2M7r4J32k8o2l2j1l6P6jn4K9J0J6N1j9l8O2o9j1
4745a3JNl6M8k2j5k1J19K8q8j3l3Q1p2qM2J9l5L9M1j12L9j0j43Q2R5Ko4m0R1k0
4776a3K7K9j0q6P6r1N0P4m9m4p7L5J30r9N9N1p5n6lR1O9l7l7O6m5o0L7qj6Kll9
4808e2MJ48j93P5O5q5m3M3k6J53j05j5n3RN8n3M1P8Pn7J4P0p4n1O5Nj23K06r9
4837A2k0P6m6NJ3n3lO4j26J0M5K2M0P2k7l9Pp4M3joRJ1mp8oJ44k6l5m6K7O3j15
4870d2K3J1n1L8RJ08p0m7L1Mr4O7P4o2L8m6M9m6J7mPo0k3L3O6j31J47rO3n2m7
$$ plain form
4659 8 35 -34 -55 60 135 -99 -18 4 -71 33 23 -84 76 19 -38 -66 -12 23 25 38 51 27 -108 15 110 61 -33 -129
4687 -129 77 51 14 -15 -7 3 -54 74 -34 -27 -5 17 83 2 32 37 -20 -112 47 -64 8 -22 48 15 23 -32 -17 3 -67
4716 -67 51 -36 19 -33 -91 22 -37 71 19 66 -28 104 76 14 -18 -29 -65 11 10 -44 -15 -5 11 62 43 5 67 -2 -13
4745 -13 -12 -7 -43 5 -17 -32 -53 66 94 6 -7 -40 41 -31 -39 3 22 -13 26 67 -45 -6 -16 -159 -77 18 20 -44 -84 7 -13
4776 -13 14 43 33 -53 23 -68 -18 56 7 -37 -114 -79 51 -48 11 62 -13 -69 -72 19 88 51 14 80 35 -25 12 4 -12 -10 -13 -52
4808 -52 -48 100 -93 -18 47 -38 -81 -38 -64 89 -16 -31 -84 -75 -17 -70 -29 49 56 -1 13 83 9 -42 23 28 -95 111 12
4837 12 -8 68 22 27 40 -13 -16 48 -78 -68 -23 -1 39 111 84 45 52 -22 21 20 14 23 34 30 -48 -54 90 64 29 -17 10 73 -42
4870 -42 -19 -8 -59 -21 -12 96 26 -21 10 14 -80 -13 61 -1 37 -9 40 -6 11 7 14 -46 -69 -36 30 -101 46 37 100 48 1
4901ALj5k7J02r2M8J04l2j34j1K9L4q9Q3Jj3m3L6N3q2J30k1j22N6l8O8o5R2K5
4930H1j50O9j05j9J24Qk1P4m9J8m0R7q6KK4L9j53M5L8lL9k8J6k1rj44K43p5n9
4959d5O4P3j35Rk9k9M7j2R5o7PP9M2p6O4Q3j18k1m0N3J7q0O7k1J9L7n6n1K6j5
4989a3m6J14j16N3l2M4jk3L4K1j5J5k9j04k0J57J4r7NK8O4q6O8K4m2k3Q2j18P5
5018C3J8j04P6No5J04K6j09n7N0L7k9l4J9O6k1j9K9j0J33j92N7m4O4m0nk6ML7
5047CN5j62R5lm5J3R9J4r2O3n0l2M5J0j07J12k9J06j17K3j9Q2k7k1l3P4k7j1r9
5076h0L7N2o9L5%L6q6J60j12l8RK4k0N9M9rr3Pnl3J04q5jJ8R1l4r2J05j8k4n4
5107f7P5n5R5J3J5pn6rL4l0K8m5k7k7M2kL2J0l1L4j4J9Lp1O5l5k7L2l4n7J18k
$$ plain form
4901 1 4 -11 -38 64 -28 20 124 92 -42 -53 -24 10 -79 4 5 -8 -51 -15 38 -44 86 65 -57 -1 -39 29 -36 56 81
4930 81 -69 0 -105 -124 0 8 -13 61 12 30 -10 87 1 3 27 66 -87 -42 -4 -7 32 4 20 -1 -10 -154 89 14 -45
4959 -45 19 92 -43 -34 -63 -92 -45 -57 38 -29 -22 57 99 23 87 170 52 31 -9 44 61 -19 48 27 46 83 27 -24 2 -13
4989 -13 -59 55 -61 -8 -40 4 3 -20 14 35 20 35 6 -98 -118 39 53 -44 -39 -11 53 -33 35 59 17 -6 76 -42 33
5018 33 51 -53 23 28 -37 67 93 -16 -73 -23 14 -15 -49 -30 36 15 -4 25 15 148 -44 13 -31 33 -7 -12 -38 -34 3
5047 3 58 -104 -9 -12 -57 -44 55 69 -23 40 -10 -42 3 13 -94 18 -11 95 -22 1 -18 64 37 16 -17 57 30 19 -80
5076 -80 -43 9 -60 -25 -25 11 -75 85 -27 -65 -56 -32 -52 7 56 47 -46 -39 -44 -77 27 -58 -59 -41 50 16 -76 29 11 -13 -67
5107 -67 8 -47 48 61 76 69 13 4 38 8 36 -9 -36 -63 -21 -23 9 19 -12 22 8 27 30 -41 24 -11 -38 -6 -40 -97 21 19
5139A9j21N7J20k8o3m4O7l1J10j4p4K5J8M5q1l7O7j1m7P7r0R2j13O8LK0l7m8J03
5168E2p4J3rQ2q1R4n6q4M4j4m7m2J04m4O6m6L0j1kQ4r5J36k7m2K5j7r2J11j30
5197g2KJ66j02n4J61j22m1J54j06K9J9n4j2M4Om3kj3O0o0Q9n8Q1j55O3o9O7Pm5
5226f0M4m6J00n9j3J46j50qM1P0p9j4N3Ok3R5Jq9l8N6j2p5P6o9k4qK0L1O5p6K0
5257a9J9k7l9J19r7P2k6l1j1P0j4n8J8K0L3j00L8r8J34n4N3m4J37m7k7o7oM1o3
5286g4K7P0k1lp2L4P8j72R4J10r4L4L5k9N9n3j6j09J52o1J20n4j00L9L3j6p8Q1
5314A4n8L5j0no%M5l6nO7L4r9Q2k5l6qn7J28q1L5n6K1p5N2O0L6p9K5P9k6p1ok7
5347e3L7J1J5o1J05j20O2n9m7P9RJ5l2P0l0L9n6qP5o9J28j81J21q8k8N1J51j11
$$ plain form
5139 19 -102 -45 75 47 -16 -60 7 -24 86 72 -2 23 41 86 5 -32 35 24 -23 54 -36 56 -57 11 14 34 -3 -51 52
5168 52 -22 -9 -18 64 -17 77 21 -63 -19 -33 -80 -122 -18 -62 4 -42 -12 -23 -25 59 -36 100 73 31 56 39 -53 58 -72
5197 -72 -70 96 -6 -60 101 -21 -62 92 -14 15 34 -20 -32 12 18 -25 -27 -40 20 -40 49 -9 72 -83 -20 -89 -22 -15 -60
5226 -60 -16 -62 38 -21 -34 112 -38 -46 -5 65 -14 -28 25 31 8 103 104 15 -23 33 21 -54 22 -47 -71 -79 -59 -28 37 -39 -19
5257 -19 0 -27 -66 53 -44 28 2 -29 -40 30 16 -42 -24 -4 29 -71 -33 -131 3 -51 2 -42 95 48 21 -46 -52 -11 -74
5286 -74 -47 23 2 -1 -73 -39 39 -133 -39 71 -23 11 46 17 76 23 7 -102 50 -11 109 55 -45 -6 27 11 -67 14
5314 14 -44 -9 -19 -24 -30 -30 15 -21 -26 41 75 -24 58 33 -3 -11 -68 60 -21 14 -42 -21 -96 -44 16 52 -27 -2 77 51 -20 -26 -53
5347 -53 -16 -5 10 -51 54 -66 -4 -63 -110 -31 -22 -7 -39 31 1 40 -16 -24 51 -18 110 -71 50 -38 -66 -15 136 25
5375B5j32J07l7J3J7rp1J8J1M9j15J30M5o0L6o1K4o7J1N7m1nJ43n3n0P6r7j5R
5404d2L2P0j5m7L4q9K4J09m7K4r6J10N1k8j40R6o1K3J9m9qP1k8p2N3k0k5lJ31
5433G7k36J66k3o6M4O7l8n0j0O5M8l7%N4k6l5P7j44J44o1O9p1m2J02j04N3J9L4
5461G6j46J01jJ4l9J7l2r0Q6Om9O9K7n0P1n1O3j20K4R7p0J3L6J7r3Q3p1J8k0q9
$$ plain form
5375 25 -107 0 -37 -24 -7 -16 -87 -69 -58 -9 -124 6 51 -9 27 -34 -10 -77 -66 -9 -50 -55 88 35 -15 61 -36 -51 -42
5404 -42 -10 60 45 -2 32 -57 -33 76 29 53 -43 67 118 90 -50 46 -15 8 27 -22 -30 41 13 -59 -6 -26 -51 -54 77
5433 77 -159 7 -16 -82 -38 29 -9 -59 -69 -4 44 7 7 61 35 0 77 -67 77 16 85 14 -28 74 -30 23 42 76
5461 76 -70 31 30 44 5 22 -10 -100 -14 -8 -57 12 39 -11 60 9 72 -48 -24 73 3 16 52 69 -24 59 -12 6 -14 -103
$$ [...]
8191d
##END NTUPLES=NMR FID
##END=
