##TITLE=1H_AM_NVG1
 DMSO-d6
 8 sc, 
 8.9.2023
##JCAMPDX= 6.0         $$ Bruker NMR JCAMP-DX V2.0
##DATA TYPE= NMR FID
##DATA CLASS= NTUPLES
##ORIGIN= UXNMR, Bruker Analytische Messtechnik GmbH
##OWNER= root
$$ XWIN-NMR		Version 3.5
$$ Fri Sep  8 13:54:04 2023 Russian Standard Time (UT+4h)  she@DPX200
##.OBSERVE FREQUENCY= 200.13135
##.OBSERVE NUCLEUS= ^1H
##.DELAY= (6, 6)
##.ACQUISITION MODE= SIMULTANEOUS
##.ACQUISITION SCHEME= undefined
##.AVERAGES= 8
##.DIGITISER RES= 18
##SPECTROMETER/DATA SYSTEM= spect
##.PULSE SEQUENCE= zg30
##.SOLVENT NAME= DMSO
##.SHIFT REFERENCE= (INTERNAL, DMSO, 0, 15.7039)
##AUDIT TRAIL= $$ (NUMBER, WHEN, WHO, WHERE, WHAT)
$$ ##TITLE= Audit trail, XWIN-NMR		Version 3.5
$$ ##JCAMPDX= 5.01
$$ ##ORIGIN= Bruker BioSpin GmbH
$$ ##OWNER= she
$$ F:/spectra/data/she/nmr/H-F/1/audita.txt
$$ ##AUDIT TRAIL=  $$ (NUMBER, WHEN, WHO, WHERE, WHAT)
(   1,<2023-09-08 13:53:05.20 +0400>,<she>,<DPX200>,
      <created by zg, POWCHK disabled, PULCHK disabled
       configuration hash MD5:
       00 E9 B6 7A A2 85 ED C7 34 08 36 98 17 FE 4E 26
       data hash MD5: 16K
       B6 10 27 F7 A5 EE 2F F4 52 45 B7 DB 17 70 2F 67>)
$$ ##END=
$$ 
$$ hash MD5
$$ 52 99 03 EA 5B 65 D4 2D A1 12 C2 16 3A 63 AE C8
##$RELAX= 
##$RELAX= 
##$RELAX= 
##$RELAX= 
##$RELAX= 
##$RELAX= 
$$ Bruker specific parameters
$$ --------------------------
##$DU= <F:/spectra>
##$EXPNO= 1
##$NAME= <H-F>
##$PROCNO= 1
##$TYPE= <nmr>
##$USER= <she>
##$AMP= (0..31)
100 100 100 100 100 100 100 100 100 100 100 100 100 100 100 100 100 100 
100 100 100 100 100 100 100 100 100 100 100 100 100 100 
##$AQSEQ= 0
##$AQ_mod= 1
##$AUNM= <au_zg>
##$AUTOPOS= <>
##$BF1= 200.13
##$BF2= 200.13
##$BF3= 200.13
##$BF4= 200.13
##$BF5= 200.13
##$BF6= 200.13
##$BF7= 200.13
##$BF8= 200.13
##$BYTORDA= 1
##$CFDGTYP= 0
##$CFRGTYP= 5
##$CHEMSTR= <none>
##$CNST= (0..31)
1 1 145 1 1 1 1 1 1 1 1 1 1 1 1 1 1 1 1 1 1 1 1 1 1 1 1 1 1 1 1 1 
##$CPDPRG= <>
##$CPDPRG1= <>
##$CPDPRG2= <>
##$CPDPRG3= <>
##$CPDPRG4= <mlev>
##$CPDPRG5= <mlev>
##$CPDPRG6= <mlev>
##$CPDPRG7= <mlev>
##$CPDPRG8= <mlev>
##$CPDPRGB= <>
##$CPDPRGT= <>
##$D= (0..31)
0 1.2 0 0 0 0 0 0 0 0.06 0 0.03 0 0 0 0 0.0002 0 0 0 0 0 0 0 0 0 0 0 0 
0 0 0 
##$DATE= 1694166784
##$DBL= (0..7)
120 120 120 120 120 120 120 120 
##$DBP= (0..7)
150 150 150 150 150 150 150 150 
##$DBP07= 0
##$DBPNAM0= <>
##$DBPNAM1= <>
##$DBPNAM2= <>
##$DBPNAM3= <>
##$DBPNAM4= <>
##$DBPNAM5= <>
##$DBPNAM6= <>
##$DBPNAM7= <>
##$DBPOAL= (0..7)
0.5 0.5 0.5 0.5 0.5 0.5 0.5 0.5 
##$DBPOFFS= (0..7)
0 0 0 0 0 0 0 0 
##$DE= 6
##$DECBNUC= <off>
##$DECIM= 32
##$DECNUC= <off>
##$DECSTAT= 4
##$DIGMOD= 1
##$DIGTYP= 9
##$DL= (0..7)
0 120 120 120 120 120 120 120 
##$DP= (0..7)
150 150 150 150 150 150 150 150 
##$DP07= 0
##$DPNAME0= <>
##$DPNAME1= <>
##$DPNAME2= <>
##$DPNAME3= <>
##$DPNAME4= <>
##$DPNAME5= <>
##$DPNAME6= <>
##$DPNAME7= <>
##$DPOAL= (0..7)
0.5 0.5 0.5 0.5 0.5 0.5 0.5 0.5 
##$DPOFFS= (0..7)
0 0 0 0 0 0 0 0 
##$DQDMODE= 0
##$DR= 18
##$DS= 0
##$DSLIST= <SSSSSSSSSSSSSSS>
$$ [...]
##$SUBNAM2= <"">
##$SUBNAM3= <"">
##$SUBNAM4= <"">
##$SUBNAM5= <"">
##$SUBNAM6= <"">
##$SUBNAM7= <"">
##$SUBNAM8= <"">
##$SUBNAM9= <"">
##$SW= 18.05172834244
##$SWIBOX= (0..15)
0 0 2 0 0 0 0 0 0 0 0 0 0 0 0 0 
##$SW_h= 3612.71676300578
##$TD= 16384
##$TD0= 1
##$TE= 0
##$TE2= 300
##$TE3= 300
##$TEG= 300
##$TL= (0..7)
0 120 120 120 120 120 120 120 
##$TP= (0..7)
150 150 150 150 150 150 150 150 
##$TP07= 0
##$TPNAME0= <>
##$TPNAME1= <>
##$TPNAME2= <>
##$TPNAME3= <>
##$TPNAME4= <>
##$TPNAME5= <>
##$TPNAME6= <>
##$TPNAME7= <>
##$TPOAL= (0..7)
0.5 0.5 0.5 0.5 0.5 0.5 0.5 0.5 
##$TPOFFS= (0..7)
0 0 0 0 0 0 0 0 
##$TUNHIN= 0
##$TUNHOUT= 0
##$TUNXOUT= 0
##$USERA1= <user>
##$USERA2= <user>
##$USERA3= <user>
##$USERA4= <user>
##$USERA5= <user>
##$V9= 5
##$VALIST= <valist>
##$VCLIST= <CCCCCCCCCCCCCCC>
##$VD= 0
##$VDLIST= <DDDDDDDDDDDDDDD>
##$VPLIST= <PPPPPPPPPPPPPPP>
##$VTLIST= <TTTTTTTTTTTTTTT>
##$WBST= 1024
##$WBSW= 4
##$XGAIN= (0..3)
0 0 0 0 
##$XL= 0
##$YL= 0
##$YMAX_a= 251933
##$YMIN_a= -70856
##$ZGOPTNS= <>
##$ZL1= 120
##$ZL2= 120
##$ZL3= 120
##$ZL4= 120
##$ABSF1= 10
##$ABSF2= 0
##$ABSG= 5
##$ABSL= 3
##$ALPHA= 0
##$AQORDER= 0
##$ASSFAC= 0
##$ASSFACI= 0
##$ASSFACX= 0
##$ASSWID= 0
##$AUNMP= <proc_1d>
##$AZFE= 0.1
##$AZFW= 0.1
##$BCFW= 1
##$BC_mod= 2
##$BYTORDP= 1
##$COROFFS= 0
##$CY= 11.3945322036743
##$DATMOD= 1
##$DC= 2
##$DFILT= <>
##$DTYPP= 0
##$F1P= 15.7292609196834
##$F2P= 12.9074282941183
##$FCOR= 0.5
##$FTSIZE= 0
##$FT_mod= 4
##$GAMMA= 1
##$GB= 0.15
##$INTBC= 1
##$INTSCL= 1
##$ISEN= 128
##$LB= 0.24
##$LEV0= 0
##$LPBIN= 0
##$MAXI= 10000
##$MC2= 0
##$MEAN= 0
##$ME_mod= 0
##$MI= 1.114404
##$NCOEF= 0
##$NC_proc= 0
##$NLEV= 6
##$NOISF1= 3.799351
##$NOISF2= 2.8
##$NSP= 1
##$NTH_PI= 0
##$NZP= 0
##$OFFSET= 15.70392
##$PC= 1
##$PHC0= -21557.29
##$PHC1= 8.05271
##$PH_mod= 1
##$PKNL= yes
##$PPARMOD= 0
##$PSCAL= 0
##$PSIGN= 0
##$REVERSE= no
##$SF= 200.130013532006
##$SI= 16384
##$SIGF1= 3
##$SIGF2= 2
##$SINO= 400
##$SIOLD= 16384
##$SREGLST= <1H.CDCl3>
##$SSB= 0
##$STSI= 0
##$STSR= 0
##$SW_p= 3612.71676300578
##$SYMM= 0
##$S_DEV= 0
##$TDeff= 0
##$TDoff= 0
##$TI= <>
##$TILT= no
##$TM1= 0
##$TM2= 0
##$TOPLEV= 0
##$USERP1= <user>
##$USERP2= <user>
##$USERP3= <user>
##$USERP4= <user>
##$USERP5= <user>
##$WDW= 1
##$XDIM= 8192
##$YMAX_p= 0
##$YMIN_p= 0
$$ End of Bruker specific parameters
$$ ---------------------------------
##NTUPLES= NMR FID
##VAR_NAME=  TIME,          FID/REAL,        FID/IMAG
##SYMBOL=    X,             R,               I
##VAR_TYPE=  INDEPENDENT,   DEPENDENT,       DEPENDENT
##VAR_FORM=  AFFN,          ASDF,            ASDF
##VAR_DIM=   8192,          8192,            8192
##UNITS=     SECONDS,       ARBITRARY UNITS, ARBITRARY UNITS
##FACTOR=    0.0002768,     1,               1
##FIRST=     0,             0,               0
##LAST=      2.2672688,     0,               0
##MIN=       0,             -70856,          0
##MAX=       2.2672688,     251933,          0
$$ Real data points
##PAGE= N=1
##DATA TABLE= (X++(R..R)), XYDATA
0@%%%%%%%%%%%%qJ6j6J6k4L2l2M0m8N6p2Q4r3J09j32J52j73J98k25K57k94L34
34A77l77M25m77N34n98O68p42Q26r17J014j122J241j369J509j664J832k018K222
52A164k448K704k988L305l668M085m568N139n823O659p710R077j0934J3612j7833
67a0227K5467m3494J61198J18989l22789Q3100J70067r1671r3333R8152J4462
78A09921o4934k5722K4935P045J4050k7891m3789K5231M7661m9826l7806L8127
90A7002J9272l5353j4035K1724K0141k9754k9863L2449L2361l6679k6080L1449
102B634J9273k9900j4657K9696J3578l4649j2341L5911J1067l5019j1867L0365
114D091J2271k9856j2977L0025J2364l4225j3443L7041J4384l7504j5194L4490
$$ y = [0, 0, 0, 0, 0, 0, 0, 0, 0, 0, 0, 0, 0, -8, 8, -8, 8, -16, 16, -16, 24, -24, 32, -40, 44, -49, 60, -72, 80, -93, 105, -120, 137, -157, 177, -200, 225, -252, 282, -316, 352, -390, 436, -481, 533, -589, 652, -717, 792, -872, 960, -1058, 1164, -1284, 1420, -1568, 1737, -1931, 2154, -2414, 2725, -3098, 3561, -4149, 4928, -6006, 7606, -10227, 15240, -28254, 132944, 251933, -70856, 12244, 182311, 90640, -2693, 95459, 109921, 44987, 19265, 44200, 51245, 65295, 37404, -6385, 18846, 66507, 16681, -21125, 17002, 36274, 921, -13114, 8610, 28751, -1003, -30866, 1583, 33944, -2735, -28815, 2634, 21907, -7993, -22650, 7046, 20624, -14025, -26366, 9545, 20612, -14407, -26274, 4091, 16362, -13494, -26471, 3554, 15918, -18307, -31750, 5291, 19675, -17829, -33023, 1467]
126A467J6522k8497j7712K5825K2172k5299k3832K9301K6650k9922k6282K9671
138F4K6586k4658k4222J9586K3457j4820k3048J3406K4212j3760k4701J3474K4252
151A9828j1548k2526Q024J9530m963j6791L165J4705l572j4544M375J4434n341
164D776j3992M510J2171l655j0123L579P981n091o851P269O675q378p953Q667
178d15R535q243j0177Q737R897j0275q855J2042Q563j3604q945J2621J0454j0364
192I71j2309P753J3745o694j4137P295J3927q361j3490Q820J3198o976j2776L229
206e805J2779M74j2722k376J2668J751j2223j07J0987m51r734p10Q284K986o728
221i27m623N251N282m404l616L800J616l675k2L244j36k553l70J436M07o75Q68
$$ y = [1467, 17989, -10508, -28220, -2395, 19777, -5522, -29354, -53, 26597, -3325, -29607, 64, 26650, 1992, -22230, -2644, 20813, 5993, -17055, -3649, 20563, 6803, -17898, -4424, 19828, 8280, -14246, -6222, 13308, 8345, -8446, -5281, 9424, 5852, -8692, -4317, 10117, 4776, -9216, -4706, 7465, 3810, -6313, -2734, 5247, 156, -6695, 574, 7249, -1129, -9082, -415, 9120, 877, -9300, -563, 9334, -941, -9796, 2246, 10809, -2795, -11740, 881, 11335, 971, -11338, -3585, 10160, 3466, -10671, -3376, 10551, 2190, -11300, -2480, 10718, 3742, -9034, -5805, 6974, 7448, -5274, -7650, 5018, 6769, -5454, -5561, 5426, 4975, -4759, -5469, 2815, 5801, -927, -5550, -299, 4983, 579, -3037, 763, 2379, -1296, -1318, 1926, 1790, -763, -1133, 303, 710, 35, 903]
238I03J14k660p49M413J704n139k685M712L200l854l567L949L699m766m231O125
254A168N025o652n906N754O661l937o809K066O654j465o232J674O133j898o591
269d355J510O904n4o610j802N611L022m350l224L290K647k905j991K886J968k776
285b29k849K119L666j086l397n0K205P12n40n99o38K2R37N67r49k00P71k60j319
304a117M17K692l30l791q40M266K060l836k832L074K852k583k452K657K414l069
320d18k980L081M164k632m895J268N141L2m478p89L681O76l136l97L199N36l293
337a240j560L242K773k790l520J703L653p74k949L47K016m03j453N79J800n33
353H91j913o93K213J686j707j972N87J575M16o34q88l62R10N24q89L3J219q22
$$ y = [903, 1017, -1643, -2392, 2021, 3725, -1414, -4099, 613, 3813, -41, -3608, 341, 4040, -726, -4957, 1168, 6193, -459, -6365, -611, 6050, 2113, -4696, -2630, 4024, 2559, -3673, -1999, 4134, 2236, -4355, -2845, 4059, 4005, -2605, -4407, 1204, 4226, -124, -3348, -58, 2589, -316, -2307, 579, 2547, -229, -3078, -959, 2707, 1621, -1776, -1826, 379, 1091, 551, -48, -686, -664, 273, 840, -109, -309, 462, 202, -1117, -700, 1992, 1662, -2129, -2969, 1297, 3357, -479, -3311, -237, 2615, 32, -2420, 237, 2651, -418, -3398, -317, 3847, 1215, -3680, -2412, 2729, 2761, -1717, -2506, 1175, 1851, -1285, -1682, 1517, 2053, -1240, -2800, 442, 3215, 425, -3095, -1392, 2261, 1487, -1462, -1115, 901, 498, -955, -376, 1424, 891, -1022, -1715, 498, 2184, 477, -1495, -908, 667, 1083, 449, -439, -801, 109, 633, -256, -223, 996, 174]
371A74j772P86K532m7k611r60J915J908j134k182N71J882q08j279J078J223j456
388a80j551R81K058L22k354j623J993K329j239k133P22J503m84j007O96J290o57
405F66k106Q2K977Q10l219j577K541J472j378j251O20O77m81n63O98J148p71j967
423a622L46K533M03k271j140J311J600m05j374j78J093j98j014O85J558j046k001
440a720O83K264K91j845j005J047J265l33q00K32P8l58J92N45J92n70q32j64J014
459A76J060p12j556j62J309Q75q12r19K66O25n3m50O89M41j242q98J406J440q64
478F19j663j40J189J141q04j129L67Q21m61m17J041M51j144j230J200J879l48
495A372k248n44K216O47j362o65J081j04j127L83J294j50j606o75J311J404q19
$$ y = [174, -1598, -812, 1720, 1673, -938, -1898, 17, 1925, 791, -1391, -820, 1062, 254, -1025, 53, 1276, -180, -1731, -750, 1308, 1630, -724, -2347, -354, 1975, 736, -1397, -675, 828, 344, -663, 33, 1323, 666, -1440, -1358, 1619, 2429, -790, -2367, 174, 1646, 268, -983, -363, 314, -167, -730, -32, 1116, 345, -1622, -1276, 1257, 1660, -611, -1751, -440, 1160, 755, -619, -797, 296, 98, -916, -231, 1327, 281, -1720, -1037, 1227, 1518, -327, -1332, -285, 980, 647, -153, 79, 157, -201, -9, 536, 728, 158, -674, -838, 176, 1236, 524, -1032, -1194, 115, 990, 178, -741, -475, 150, 97, -353, 336, 777, -465, -1363, 43, 1483, 619, -1044, -1184, 5, 1146, 342, -787, -420, 401, -60, -477, 564, 1015, -129, -1359, -159, 1720, 1372, -876, -1420, 796, 1443, 81, -584, 497, 393, -734, -351, 943, 793, -813, -1488, -177, 1227, 408]
512D08j490J10J063J22j10L9l08l10J64N24K75J34q03r29P23J472l19j276l04
531h15O86N08J77k62l80j32J71K39M70J77q61o12M58O65L08m00j089j69J099P11
551I49j059n59M01J51j83J95M00k40j002o4J275P96q61j225M67R79J64m71j01
570A2k3k80L69L82K75m63p30q6Q63P49p05j051N6O62O20m08n22l7J72j65K82P72
592G44l30j357r0J375N38q58o98P1N26K77J36m3m54l25J69Q53K31o28m97OM45
613I1O60j10p55m77M34N22N7j20n17k69J15M99M35m54o51r4O09L94Pl76l91k70
635f61N25J067m43j030m4O56L69k34K35m29n98J96O98O49n98j107L0J058M46p29
655E6k17M7k44J33O88mo07m97J56Q40L75o95o87M6O83K20k2k74m52n5N55M63m7
$$ y = [408, -1082, -972, 91, 213, 103, 142, -166, -476, -312, 212, 487, 621, -182, -1111, -388, 1084, 765, -511, -815, -129, 379, 556, 294, -86, -218, -47, 192, 662, 839, -22, -634, -176, 489, 797, 397, -692, -861, 238, 949, -110, -669, -268, -117, -300, -105, 295, 55, -947, -1011, 264, 1060, 199, -1026, -559, 420, 584, 113, 12, -11, -291, 78, 460, 735, 272, -458, -544, 319, 1068, 363, -688, -632, 30, 650, 242, -280, -317, -145, -310, -28, 744, 414, -943, -1033, 342, 880, 22, -676, -605, -79, 198, 334, 291, -163, -488, -319, 534, 765, 137, -360, -354, 91, 751, 641, -114, -591, -157, 365, 422, 302, -215, -484, -369, 130, 565, 111, -540, -634, -25, 369, 376, 0, -391, -661, -136, 931, 488, -542, -586, 70, 439, 205, 440, 11, -587, -391, 307, 956, 358, -749, -719, 339, 785, 56, -161, -114, -358, -225, 463, 459, -148, -645, -489, 351, 726, 31, -656, -610, 73, 293, 271, -3, -455, -510, 45, 508, 461]
678D61m76n85J33R45L51q71k74K45K9J96N02k57q31j52N48N66r1p74l04M88L25
699A74l7R0j59p74Q1J003K73o88m38P6L68M21o9l46l40L6K91M02K47n51n45J22
721c63O37L72k61p43j13M59M44j73j59l9m43J9P83L96q88o59L49O26K48l64m69
742c41LJ40J78M72m6q13l69P55N44k79k61k22j00J81O57l5m54m47Q5M91N05l41
764C03n56q4J27L64K33j46o10kM21L51k9j71o58r3P93M01l91o77R2K39K67R8L8
787C10l39m82J13P59L56o02p68M11N22j6n1j96l53K6L98K77q5m74l28L24N49Q1
809D32l27l23l09L83M74l2m57k91J93J03N58Q6n43n24K67O58J36k98k96k88K64
830a34M01K42k98n49r3N21M84l95m20L5K13j50L54K65n75n09K65N81J63l59m71
$$ y = [461, -15, -600, -467, 478, 829, -42, -316, -71, -42, 154, 656, 399, -432, -584, -36, 530, 439, -335, -639, -151, 174, 137, 227, 68, -706, -625, 378, 651, -37, -475, -399, -31, 390, 321, -25, -365, -329, -38, 364, 611, 60, -485, -363, 274, 646, 385, -358, -471, -12, 432, 259, 100, 61, -382, -363, 420, 816, -72, -731, -382, 244, 492, 128, -341, -338, -198, -20, 452, 406, -407, -776, -21, 523, 244, -17, -239, -339, -158, 499, 464, 10, -437, -352, 139, 644, 303, -253, -337, -210, 154, 387, 241, -369, -371, 50, 401, 372, 201, -457, -550, 243, 644, 253, -424, -332, -93, 174, 272, 310, -29, -511, -398, 361, 717, 115, -653, -242, 280, 264, 213, 17, -336, -310, 88, 365, 280, -194, -522, -198, 351, 432, 105, -218, -527, -144, 330, 298, -159, -450, -257, -154, 404, 490, -53, -577, -310, 348, 484, 186, -110, -398, -134, 267, 509, 211, -338, -431, 90, 574, 179, -241, -206, 7, -143, 211, 476, -99, -608, -343, 238, 401, 42, -429]
851d29N1M42J15j3m3k82k65M73M75j95l97k81O0L46M81m36m73RM50J27J0q9k70
874a34l62L86N24j3l29n25J14N17K71l25k55q7j23L97M51k87o88j5N24L0K31k11
896I1l86q9L01N01j22l07m24K31M99R2k69j24k55J05M08O8j71l10j50O6M88K33
918D76m96m18J37M95K18k00l77qJ66mK14R1l65n33K35P90Q2o92k28K59J22J96
940A60n0j61j66p3K95L75O0o33q9J36K47L26l21l23j79M17L93k86j62j69k3K39
962A3K85Q0m45l31Q8M97K73l42l98lJ10L66J96k03m91M6K90K92q6n6m27j08L07
985d7M68j71m12k95K95M59O3m18k25O0J37K77J63j39n35r9M50L41j69k27l90J6
1007c98O25J07k37k54j51J98K89P1j33k34k05K03M60K45o11n09N05K53n0k0j46
$$ y = [-429, -378, 64, 179, 166, 123, -159, -424, 49, 524, 329, -68, -349, -289, 57, 538, 102, -371, -362, 88, 215, 225, 136, -134, -496, -110, 414, 401, 72, -453, -339, 178, 449, 124, -131, -218, -341, 56, 507, 220, -468, -483, 41, 71, 302, 91, -295, -384, -83, 418, 296, -11, -435, -204, 295, 387, 118, -6, -261, -156, 252, 320, 149, -161, -311, -245, 243, 476, -20, -438, -301, 194, 412, 212, -165, -173, -7, -11, 203, 294, -71, -604, -369, 421, 503, -189, -417, -158, -36, 160, 110, -51, -217, -290, 5, 380, 440, -193, -282, -146, 101, 427, 106, -217, -396, 21, 414, 128, -34, -203, -226, 13, 298, 378, -67, -398, -310, 187, 460, 118, -280, -283, -173, 193, 389, 186, -305, -259, 31, 323, 237, 181, -246, -354, -47, 421, 250, -162, -457, -162, 297, 360, -58, -283, -223, -86, 191, 354, 215, -320, -419, 31, 372, 203, -24, -414, -398, 227, 334, 97, -157, -308, -110, 179, 250, 117, -117, -322, -119, 341, 586, -25, -534, -29, 224, 174, 154, 8]
1028Hk92k7L93K50j07m53j28K92L86p9k33j91j11K33M54n7m89j87K98J04O3K26
1050C53l03l99J04N61P4k50l35k19L86L08j8k76k72J2L18L24j54l14r1N3J19L24
1072C05O5o31k82M67L13j2l89j61J34K05K02K8l6m95j67M82M12l44l24l2P5L26
1094A41K23l19l03J2K14K00%p3m03k6L74K93o7k83l94K01N83k0l44j69Q2j44L78
1117A56K30j96m68j14M24L48j61k69j20k1J72K35l4l54k96L56L05l7j20p8l46
1138c88K16M36O8k77l92J08K71K55j78k06q1l4J79L23p3m72n5K85K24n8M8l09
1160a10m15M69N08k31m09m1J00J34J12M8j06l74K0L92L18l06l77j13L11J35lJ18
1182A80l71j39L23K88o7k95j25j7K72K69n8l88j52K74K00Q8j78k52m4K95j7J43
$$ y = [8, -284, -311, 82, 332, 225, -228, -356, -64, 322, 243, 10, -181, -292, -59, 395, 338, -151, -338, -40, 64, 127, 353, 50, -349, -245, 316, 390, 140, -195, -414, -28, 280, 262, -14, -286, -274, 44, 368, 214, -100, -191, -138, -19, 305, 370, -261, -543, -76, 237, 225, -164, -325, -191, 14, 216, 244, 208, -287, -454, 28, 440, 96, -228, -260, -185, 141, 364, 45, -258, -246, -32, 168, 168, 95, -308, -334, 40, 333, 266, -17, -411, -210, 373, 353, 9, -160, -78, -222, 156, 386, 190, -278, -392, 32, 380, 219, -50, -170, -191, -19, 216, 182, -172, -468, -112, 193, 156, 36, -42, -388, -172, 264, 332, 55, -337, -229, 42, 297, 119, -87, -168, -202, -23, 300, 227, -245, -300, -15, 209, 151, 199, -110, -525, -56, 452, 221, -188, -229, -129, 5, 117, 165, 59, -315, -295, 97, 415, 109, -268, -381, -70, 65, 62, 180, -191, -330, -7, 281, 214, -81, -206, -223, 49, 318, 260, -128, -280, -6, 194, 282, 104, -148, -192, 103, 86, 229]
1204B29j41l44J8L81P7l4j08k82l8L58J35j01l53j27J13L60K30m84j35J58P7Q0
1226F9K03k00l91J26L44Q5j03k63p4QL02J46j38k01j85L04K19j3k00k2k25P3L80
1249B44N8m05l33L36K82p7l3o7l05J64K33K02j32l09j58K73K22l4n4j73j95J84
1271g7L47p9m02j63L80N2P6L3k69j77J10K92Q4j51l49O9J91K73j47j2l20K7L38
1294A26J79p2m35J00q3J76K27k3l79j67K70L75k4j20m70J40K52k9J19j65k08j6
1316b27L94J20l18j82L4R1K17Q9k61j92M3K19R4P5j64l62J43K47J6J07k13l11
1338c41K75K85j6j76j45o5J72J37P4j72l14J45J89K35j19k89NK7J13J75L0l06
1360h1k74L17L09j56j37j23j1P3L22Kk50k46R0L26J18j51j65j02Q7P8K47l3m64
$$ y = [229, 88, -256, -238, 143, 220, 186, 78, -204, -242, 116, 251, 150, -203, -330, -217, 143, 373, -111, -246, -88, -11, 69, 272, 72, -319, -193, 151, 236, 133, -130, -204, -196, 106, 252, 114, -87, -272, 32, 251, 238, 38, 16, -209, -136, 244, 302, -103, -436, -100, 182, 105, 72, 5, -300, -136, 97, 299, 167, -142, -300, -27, 195, 161, 107, -66, -261, -77, 270, 191, -211, -374, 6, 58, 134, 167, -102, -279, -169, 123, 207, 56, -293, -224, -33, 240, 93, 81, -239, -212, 126, 305, 233, -202, -102, -185, -9, 218, 195, -184, -351, -81, 294, 270, 150, -320, -180, 72, 43, 162, -3, -211, -227, 167, 287, -31, -213, -179, -88, 129, 218, -43, -235, -192, 27, 121, 196, 32, -330, -187, 60, 76, 183, -30, -341, -66, 219, 203, 27, -118, -183, -11, 126, 200, 28, -286, -141, 48, 283, 164, -125, -120, -93, 20, 195, 225, -81, -355, -38, 271, 115, -22, -145, -156, -83, 239, 241, -9, -255, -165, 161, 279, 128, -37, -139, -52, 26, 273, 240, -224]
1383b24O9K48O7K0Pk63j76K75K65k18j81j41J75K01N8j39j88K7n6K74J93j16l33
1406a56O5M9K34j31Q7l77j07L69K80j72k23j61J58J69O0m0j39k99K23L97j00k32
1428d6j83lK69Q9Jo4k75JM21m0p1j25j63n7L25K41k99k14m2K24L21r2k92%K0P
1454d7K21J54l55k47J35K72J33j42j99k30J86K43j5j75k8j10J57J82r2j75Rj07
1476b30J47K93j3k93j71J97J64N7j03r6r8O3K12J6rl66L6K63O5K3k25n9jJ43K68
1501B83j30k67m0K45q3Q9r1p1j16J17K20P6k82j94L9K48J44k19j4l3o9K27P3p7
1525G5k24j0J07O6K24m9m33o9M38J74j62j48j22J19J20r7O9j96j88J54K83J0j53
1548a2j04J3kK07k1j14j91J26J75J03K8j93j96K4J97O7r0j57j36K84K24m7k13
$$ y = [-224, -155, 93, 160, 180, 187, -76, -252, 23, 288, 70, -111, -252, -77, 124, 182, 43, -145, -118, -174, 100, 293, 177, -156, -91, -42, 192, 61, 148, -229, -336, 33, 313, 141, -82, -243, -85, 84, 144, 104, -35, -334, -111, 286, 186, -46, -229, -232, 37, 126, 127, 63, -212, -211, 210, 170, 99, -26, -189, -246, 79, 320, 21, -193, -235, -11, 310, 218, -74, -74, -54, -47, 174, 328, -27, -274, -139, 133, 266, 124, -75, -305, -119, 124, 109, -66, -94, -204, -47, 135, 43, -132, -123, -230, -83, 210, 197, -96, -267, -70, 94, 151, 48, -48, -146, -83, 129, 145, 136, -230, -194, 69, 134, 157, -68, -127, -128, 15, 283, 153, -114, -154, 91, 8, 97, 6, -65, -181, -64, 156, 232, -50, -244, -205, 43, 187, -32, -46, -79, -148, 79, 152, 75, -149, -159, -52, 14, 238, 189, -244, -313, 125, 299, 137, -11, -133, -14, 106, 9, 78, -118, -306, -152, 131, 141, -12, -116, -103, -105, 102, 81, -33, -224, -98, 77, 180, 208, 15, -181, -157, 40, 107, 17, -140, -276, 8, 232, 185, -28]
1571b8m2nl7J74K20j77l14R0K04J2O2j93j91J98K12j03J04k57j06K03J69m0j11
1594D4j76K8n7M12j1l89k3J4K44P5j58l1j15Q0k2K34P8l72k04L99J43K3k77j23
1618a84N3K31J20k34Jk08J94KJ54n3j33j77J45K60Q4k47k77J71K72ok37P3j05
1641a01n7J69Q1O5k62k22J95L20k5j64j15J1P7K04j6j95k8O1N5L8J18p1m08J54
1665a16L07K9j72l14J87O0J46Oq7m8k13J88J43L8k43j23J60R2J52o3l09m9J70
1688e9K23k1k02rn6J4J40J30n3k21j07K80K25k27l01K30Pj5J30p8M1q0l6O7K44
1713B66j03k99j18K47K73n6l17j24J77J60K8j72J16m4l29K76K71j22l22m4J51
1734h5K69K7j94j61K07kj4Q8o3j56o0J34J50Q7k93k49J54M01L1l56k11L68K9j29
$$ y = [-28, -70, -75, -112, 62, 282, 105, -209, -119, 85, 97, 159, -34, -225, -27, 185, 82, 186, -71, -177, 26, 195, 155, 44, -132, -104, -161, 251, 240, -149, -172, -158, 86, 161, 3, -28, -143, -63, -85, 149, 227, -145, -349, 50, 193, 216, -61, -184, -131, 100, 220, -14, -13, -221, -27, -25, 129, 76, -57, -234, -89, 171, 255, 8, -269, -98, 174, 168, -69, 4, -101, -158, 11, 92, 157, -105, -327, -132, 188, 163, -1, -116, -105, -28, 176, 160, -35, -63, -2, 53, 91, 209, 138, -270, -116, 191, 220, 48, -266, -79, -19, 127, 133, 46, -2, -215, -27, 116, 154, -89, -212, -52, 40, 192, 129, -180, -229, -59, 164, 143, -59, -68, -124, -110, 30, 160, 107, -114, -221, 59, 284, 57, -244, -14, -7, -22, 108, 30, 71, -9, -45, 22, 266, 163, -136, -254, -7, 266, 210, -107, -231, -54, 106, 134, -38, 78, 34, -295, -19, 252, 130, -192, -236, -85, 184, 211, 17, -144, 63, 61, 47, 135, 72, -84, -144, -10, 140, 227, -66, -315, -161, 240, 271, -85, -296, 72, 101, -28]
1758b8R3J0j02j99J34J98J92l78k19J90K03R6j72k45J57k0J86j2l0o0j14rK24
1781I5J63k98j88R8J81J48j11l02J20J78m8j08J75n0j92q0L71P4j99k63L6K57
1803E7K12j36l05J08L3L8m3J03R1k40j04J87K57q4m55m8M62J77l68k25K37J12
1825F6ok06K23l4j09k11K50K14m4l02mL11J05o5k85j69L42j4q7L1J99k17j68J06
1849g4L86j12l71o9K48K63q4l15PQ1l9J7K29q5k13q3J21L13J4k76k59J98L11K4
1873B32l17j7J38M9o8j38J59K1k99O7L29J76m26j53P1K70o0q7o2J44k1o3J14R9
1897A58p2k62o4L15J77k58k90J41L16R6l51p3O1K08L4l13K55Lj88j61L14K69j41
1920A74m29N1L15J69l19j40J47O8j26J06M3P9r0l03K33K86j87l30L7L44Q0k09
$$ y = [-28, 65, 75, -27, -226, -92, 106, 298, -80, -299, -109, 94, 190, 18, -227, -70, -90, 96, 84, 54, -6, -120, -129, 95, 258, -40, -228, -130, 51, 199, 88, -214, -94, 84, 36, -72, 103, 53, -139, -219, 152, 226, 27, -236, -200, 57, 269, 133, -172, -64, -31, 7, -36, 67, 158, -82, -186, 1, 258, 174, -281, -329, 133, 310, -58, -283, -46, 66, 60, -146, 77, 43, -66, -277, -27, 187, 143, -159, -163, 148, 253, 188, -97, -266, 76, 62, -25, 6, 205, -12, -180, -74, 312, 200, -171, -240, 8, 271, 187, -128, -121, -40, -79, -62, 167, 82, -131, -214, -93, 220, 234, -42, -301, -103, 208, 232, -85, -102, 36, 85, 17, -121, 38, 59, -240, -173, 156, 332, -94, -247, -176, 94, 34, -53, -115, 29, 8, -55, 59, 158, 86, -176, -240, 75, 252, -6, -296, -155, 161, 257, -94, -167, -106, 102, 136, -177, 78, 81, -107, -268, 46, 315, 174, -255, -204, 111, 280, -39, -179, -32, 36, -90, 16, 59, 138, 48, -255, -22, 264, 77, -253, -216, 128, 208, -1]
1942am3l9J28l4r5Q6J99k73j20K07K05j28l36N2K33K6l8j42k0K55n7j28J57K0
1966A14p8l08J50K87R2l04l70L93K39j78j78L1J00l4k3J35J11k62j23P0L50r4
1988A20k35j46K65K11j02j92rK05j0j88R5J11j0l37L7M60p2k60k16J52L19p0k60
2011a32N8J14j4m4M1J07j20j89J83J16Nl4k99L8M01K2l13n7K36p8j51N9J32n0
2035C1j76J9J91K78l23j67N0K16o7n4Jqpl7M8J34L5l03L3R4K07L3l10j48K96J39
2061B05j82j46m5K05j51Q7J63o9k00r0L51Q7j02k74MK22J17m9k04O0Q7j13M1J19
2085A23L3k17l2J39J47k3k51j11J67J60q6j13Q7O2r8J1J17N7k70j18P3L29n6k35
2109a05JL0K69j07pl6j42J02m3Q1R4mk67o2L83M2k24k65J40K21k3j67J15K4r4
$$ y = [-1, -44, -83, 45, 11, -84, 2, 201, -72, -192, 15, 220, 92, -244, -192, 41, 67, 29, -113, -133, 122, 65, -63, 94, 114, 36, -272, -122, 165, 257, -47, -417, -24, 215, 37, -141, -110, -10, -44, -67, 68, 179, -83, -206, -136, 214, 120, -115, -261, 4, 215, 113, -79, -88, 117, 107, -81, 14, 125, 115, -222, -185, 275, 203, -57, -273, -121, 198, 128, -132, -74, 40, 26, -18, 23, 130, 10, -179, 4, 120, 125, 91, -208, -170, 231, 253, -60, -117, 119, 41, -110, -51, 81, 31, -145, -126, 65, 343, 20, -147, -97, 119, 52, -2, -1, -9, -16, -53, -5, 129, 164, -139, -106, -12, 195, 228, -82, -230, 66, 205, 23, -123, -168, 37, -114, -27, 136, 67, -133, -223, 128, 215, 113, -161, -157, 65, 182, 133, -71, -11, 76, -37, 4, 123, 156, -61, -93, 46, 193, 170, -81, -192, -25, 135, 49, -64, 23, 85, -13, -2, 115, 172, -98, -216, -143, 186, 130, -105, -104, -74, 195, 88, 81, 45, -97, 5, -38, 43, 137, 133, -134, -196, 187, 229, 5, -260, -120, 101, 78, -89, 26, 50, -44]
2134d4k6J82P9k25j42R0R0J37r3k32P8K02l3o1j76J20j7J2Q2P8kl29M8L65J2j74
2160B1k78L01P0j12k6K6Q0k15M9J25O9o9j44k9J72J35p3k25O9R1P6j70J6Nl0o0
2186a26K01nkj36n3J84J04Kk72K2O5P3j19R7J2j05M3q5K29n7l26R6R9K10q0j77
2212a06M2P7RJ7kO6j92k1M2J36K8j86r3K03K5l0j11j7R5M2K8m6l2r5l4J86J13
2239A44n0j68j31J40Q8J18p5k23O8K32j12OK4n6j01j4J85k1j22J03L7r6J84j06
2263E4j22K4L0P6n3jQ4j72o1K71k3j01k59N1K82L3l8k44N8J91q7J69j57N8k19
2288a56K9L73j15k63P9m8Q1K43j79j10LL5J41j14k8J39j85m3J55N9m2k20N6J69
2312E9P9j03j82J06NO1J7R3j16o9p4J61j3P3k01p0J59P6mm4o4NR1K0j03N1o6q8
$$ y = [-44, -70, 112, 191, -34, -176, -86, 4, 141, 48, -184, -106, 96, 63, 2, -174, -54, -71, -59, 23, 101, 99, -230, -182, 183, 195, 21, -257, 44, 114, 2, -24, 2, 82, -133, -84, 41, 110, 41, -103, -132, 40, 175, 102, -123, -54, 37, 113, -57, -41, -36, -66, -126, 75, 70, 68, -68, -121, 63, 167, 169, -103, -81, -16, 57, -62, 35, 47, -58, -15, -100, 129, 72, -254, -158, -59, 151, 71, -106, -64, 13, 22, 39, 37, 103, -89, -110, -68, 68, 96, -90, -183, 20, 45, 15, -96, -113, -18, 24, 52, 6, -26, -121, -155, 31, 144, 94, -74, -205, -65, 23, 141, 66, -157, -89, 143, 31, 37, 61, 5, -96, -110, 75, 54, -68, 35, 72, -24, 160, 54, -68, -44, -14, 62, 9, 8, 92, -80, -141, 130, 107, 6, -253, -202, 80, 113, 75, -169, -111, 80, -7, 162, 5, 63, -156, -127, 246, 131, -132, -53, -101, -20, 223, 44, -66, -63, -28, 113, -1, -29, 110, -75, -118, 37, 96, 54, -166, -110, 59, 138, 35, -147, -41, -36, 25, 42, 135, 19, -50, -124, 37, 24, 97, -104, -174, -15, 61, 57, 13, -51, -46, 45, 65, -38, 13, -53, -141]
2340a41J18J18M0l06j7K79O9n7o6k7O2m1K3k5l1l7m5P3L9Q1r4m5JO7J32k43k6
2367i9P0Q9j49J22On8k1k7J35j4r4j14J64J10k9j61o0N8J13Knm6j4l1N4P0J30
2394B01j05k11q7K17N2L4j21p1M6O8rJ0J2k11J19J79n3j73P0l1L2J26j23m3m4
2419a16J16kL0po5L3PLJ03P1k63j37K42J22p6m5j47J16j9L9Nl0k3J7n4J66l6j48
2447i8RJ34M3q2Mn4j9Q8O1o6m9J8m9J71o5Q4j26j37J27J58n2j30mn2J13K3k3N
2475C2j23lM5N8K0n7m3k0N7O9l7l7l0P7N6o1j2l6On0J72m4p0K0k6J1J23m8J3j23
2505f1L7J27J2p8K0r3nJ23o7j8l0k2K6J42j26n1J7N9o4J05q0Pn1J29n4M0j77J86
2533E3j65J34J1n0J28j39K0N3M8p3p2Q6Q0J0k2k6k01J7J12K3J4l5q7L3J16rqp
$$ y = [-141, -23, 95, 135, -171, -188, 91, 160, 103, 37, 10, 72, 31, 54, 29, -2, -39, -84, -11, 28, 109, 15, -30, -29, 38, 170, -73, -99, -29, 60, -89, 33, 39, -19, -40, -67, 68, 54, -40, -154, 10, 120, 91, -70, -130, -72, 41, 43, 38, -8, -22, -53, 1, 71, 201, 96, -115, -202, 15, 67, 101, -20, -91, -45, 23, 14, 24, 36, -175, -56, 123, 70, -103, -33, -64, -32, 94, -29, -72, -116, 0, -2, 28, 21, -44, -11, -4, -1, 102, 173, -90, -227, 15, 137, 61, 16, -131, -15, -34, 5, 10, -20, -43, -26, -80, 86, 50, -98, -89, 45, 88, 6, 10, -44, -63, 25, 86, 20, -29, -11, -60, 111, 46, 130, 4, -133, -6, 152, 100, -30, -34, -86, 27, 50, 27, 32, -91, -94, -49, 9, 29, -28, -71, -91, -34, 35, -2, -39, -69, 8, 64, 3, -9, -45, -39, -89, 83, 39, -31, -11, -37, -26, 97, 49, 62, -61, -24, 103, 115, 37, 57, -36, -41, 82, 15, -3, -33, -55, -29, 113, -13, -64, -47, 12, -52, 53, -27, -20, -71, 58, 4, 44, -133, 53, -112, 22, 33, -17, 111, -28, -8, 45, 93, 20, -52, 34, 114, 124, 102, 76, -125, -108, 4, 27, 41, 6, -81, -48, 68, 59, 51, 44]
2561D4j25qJ31Q8q5k6k8n4R1O0j17q4Q3j03K24k3m4o3N0J0KR2j23k4n3J06M3j75
2589a11J62r4J0R8K9q3m4O8L5JMl6n1m8J3K48j22j32j33J62K9L7k9l8l1oP1N1
2617F0q1n4P9q0j2K51k18O9m2O7N0j00J3p8J17l5j1K9oj21J10N3k3l8J0l2O0M4
2645H1n3j10L8o3J52p1J3j7K6PO2k2l0L3j36P2J18j11l0k2P5j4J3J08r6m8k3M3
2673eJ17j26j46J09K6P2K5m4J3p3k8J63j32q8q5K23qk2Q7o5j38J43j1Nk9n1J07
2700C9j99J85j1j33K3j9J61pk8J4r5M3Q5M2o0j32NM4P8N1j60kMQ7L2K5j25%n7
2729a10J53n3k7k3Mj2O3J45o9j16l5N7M6K2q2P1no2O9j9r5l1J13J6M0J1l7j39
2757a05J63j2O6J2j12j15K03L1o7j49L2K7R1K9j36o0k5P0L4J12o6l2k06J50J40
$$ y = [44, -81, -89, 42, 130, 45, 19, -9, -63, 28, 88, -29, -113, -30, -133, 91, 68, 24, -39, 11, 21, 23, 115, -8, -32, -85, 21, 64, -111, 51, -43, -33, 65, 94, 11, -33, 35, 70, 71, 75, 39, -12, -60, -47, 201, 79, -53, -186, -24, 5, 42, 13, -25, -56, -62, 9, 60, -21, -75, 4, -76, -88, 163, -55, 14, -28, 39, 89, -11, 2, -76, 41, 6, -5, 24, 18, -103, 7, 60, 37, -1, 9, -23, 37, 81, 28, -82, -44, -107, 45, -26, -13, -30, -4, 3, 65, 43, 13, 46, -90, -18, 100, -11, -41, -63, 12, -2, 11, 119, 23, -25, -48, -5, 112, -14, -160, -51, -25, 47, 72, 28, 41, -32, -60, 103, -29, -117, -202, 21, 13, -9, 78, 13, -125, 18, 7, 12, -17, -68, 39, -160, 25, 14, -119, -96, -115, 46, 39, 11, 25, -70, -27, 58, 100, 40, -92, -87, -43, 35, 86, -74, -76, -72, 15, 47, 72, -53, -53, -110, 43, -10, -37, -60, -56, -68, -5, 140, 71, -45, -80, -23, 23, 45, -37, 34, 29, -33, 36, 17, -78, -109, 4, 20, 60, 71, 34, -105, 58, 46, 112, 124, 12, -103, 100, 131, 64, -85, -53, -26, 65, 94, -42, -102, -127, -57, -23, 89, 23, -9, -215, -65, 75]
2782G5n4m1L2l2L0oR3j06n2O4O9Q0j71No7kJ76L1q8j21k3Q0J6J74r5k42J56M8
2810B9prn1q1N5J40l9p3m1P1n4qN0J18k73J73K4M3r0j08J16j3L4O5K7j60q5K65
2838A18%q1p8Q0j01J06qm6p5J32r7j2P2O0q0n9P8k2J73j53n0R2j27J11L6j11J10
2865F8j93Q1J02n2k3Q2j27O2R5j57J1K3O9j09J64j61j3M2K5l%J21j09j31J16M4
2891B7K8j19p1J65n8Q9l2Ll6q7M8N0k6j22K21p9RM2%j23l9K09q0J07j85J33j76
2918a02M3k0N9K4j09O1R9L5j56O3p1K0J68j55J1q4Q9K2qJ08q2Lrk1K7q6O0m3j8
2947g2Q0M4j18k7O6M5QL8n4Jj8L6R1q4n7m0J51k4qj4o2k5Q6n9n4N5l3M2n0J10
2977E4pl2o8J7N9m9M0n2N4l3Q2l8p7K7r9J74j1o4OL8n3J12k2L0m9n4L0Q1j13N6
$$ y = [75, 21, -20, 12, -20, 10, 4, 97, -9, -61, 3, 72, 152, -19, -14, -81, -83, 93, 124, 36, -85, -108, -28, -12, 162, 67, -175, -19, 29, 22, 13, -38, -119, -64, 76, 37, -36, -77, -6, -60, -68, -18, 100, -173, 0, 24, 67, -23, -131, -15, -28, 6, 71, 98, -62, -147, 118, 118, 37, -41, 39, -62, 44, 36, -10, -85, 47, -50, -62, 10, 70, -10, -69, 9, -13, 160, 7, -43, 49, -78, 33, 69, -42, 68, -125, -44, 58, 6, -17, 65, -62, 0, 95, -62, -51, -28, 41, -68, 96, -65, -78, -36, -11, -14, -14, 107, -2, -133, -17, 27, 55, -64, -135, 30, -28, 61, 29, 32, -4, -91, -43, 7, -19, -141, 80, 1, 10, 52, 52, -71, -110, 99, 19, 126, -59, 74, -102, -59, -79, -20, 4, -105, -44, 55, 90, -66, -3, -74, -54, 114, -41, -30, -114, -25, -3, -11, 97, 15, 18, 9, -12, 15, -71, -11, -54, -72, 8, 52, -66, -93, -27, 18, 26, 64, 10, 11, -7, 29, 120, 36, -21, -61, 90, 66, 58, 44, -18, -43, 43, -16, -70, -15, -48, -6, -56, 54, 47, 15, -53, -36, 23, -26, 14, -38, 16, -17, 65, 27, -50, -23, -122, 52, 41, -23, -17, 21, -32, 80, 58, 88, 39, -15, 15, 96, -17, 39]
3007C9q2J8O1M8p4K8j62J61q4J60q9nr4KK66j12j47j7O2KQ7r3Rp4P5P8k0o0r2
3036a09Q3L1j4K6l1lK0K7K0kl1j8J3J8J4P7q2q7P7J1K9l0p9Q6j38J79ol0n1j38
3066a38K86j63N9q3O8o4P1N4j01j7J13l9o6M8K1q4J41o2j9J0Rn2l7Q5qO7j56R0
3094C3q1L7P7o2M8j28J27q0M4l4Q9j65J06n9J37j18o4M7J44n7M4j52k1j1M3P9
3120B3Q1q7r6P2Jk9kM5j71K08o0M2j27l3K7M4J21M5q0j6p6J04J13j76M9j18L8
3147e8rJ03n2m8L5N8q7R5l3p0R8j3n6%R5j52K7Q6j6J29j97M5P0j22J07M2j39J1
3175e1J32L8j38Ml5L6k1J06ll9K4p3OP6l6J7n3jl0LM3%j13J51J0j31K9l8k6rJ84
3206F2o8l1L1m5R7k1m6k1N4j2MQ8j61l4J84lrNj80J33r6P1K8n6pN7j20N9N0o2
$$ y = [39, -43, -25, 36, 84, 10, 38, -124, 37, -47, 113, 24, 19, -75, -73, 193, 81, -66, -83, -21, -19, 68, -25, -16, -90, -15, 63, 43, -17, -109, -26, 5, -9, 17, -14, -17, 3, 30, 50, 48, 17, -1, 12, 30, 44, 121, 39, -48, 29, 40, 69, 39, -40, 46, -92, 87, 81, 51, 0, -138, 148, -15, 44, -39, 29, -35, 36, 90, -11, -28, 85, 46, -20, 28, 49, -35, 106, 44, 25, 35, 44, -8, -45, 40, 32, 99, -57, 33, -48, -11, 66, 4, 52, -76, 51, -29, 15, -19, 70, -95, 11, -48, 89, -29, -93, -46, 98, 41, 85, -67, -88, -99, -56, 23, 104, 17, -79, -7, -6, -35, -37, 8, -163, 45, -15, 27, -100, -133, -106, -62, 59, 104, 24, 8, -68, 36, 149, -27, 22, -96, -58, -67, 36, -16, -64, -29, 29, -58, 37, 4, -66, 32, 19, -37, -37, 58, -94, -67, 19, 3, 132, -65, -20, 50, -72, 35, 77, -62, -51, 81, 119, -19, -15, -50, -14, -35, 71, 68, 29, 53, -20, -14, 62, 26, 43, -10, -11, -41, -38, 5, 5, -108, 43, 53, -78, -49, -87, -113, -122, 62, -6, -37, -6, -51, 46, 25, -21, -42, 12, 0, 4, 92, -69, -103, 81, 78, 69, 74, -106, 27, -69, 2, 30, -26, -33, 24, -96, -37, 13, -49]
3236d9k3R4n5M6L3j25K%N1LM8r5l6Q8N3L8p0K9M7j18J16q1L2l2m8K3O0m2mn3O2
3267fJ4R2m7K8j13l9L9j7L0j41J36M6L9N5m5j12nR0M5j04k5o3J45k1jL3Pj31N5
3296a6J32j67OQ4p4L6j03J03J3n1k7K8J7P2o2r2J9L3J08L4j21P2Nk2J5k4r4n1
3324a27K02j91J03M2k1M6k8J6o9kL3mNQ2p8K1n5N7j07J03M9j02M6P7J4j60j7P0
3352EK1J6k4o8J75o6j39K29o1k8p3k2n0K03j20j00O8L6o8Q4k9jm1m9J46J4j13
3379e5NN8J49j19j8m5M8K0r7N4m3J15j60J72n6rn5j7jL6qn6O0R6j49OK2K18k73
3408a02P0K3NN9p2N2r4J03M8j45K9k6Q0L3r9J01rj44J48m9l1lP3p6P3m0Jo3p8
3437a33P3J33q0N0p4p4J44O2j68J38j61J37j00Q6p9M6l4N9q4L1M6r0O2j16J40
$$ y = [-49, -72, 22, -33, 13, 46, -79, -77, -77, -26, -23, 25, -70, -106, -18, 35, 73, 3, 32, 79, -39, 77, -4, 28, -4, -52, -29, 31, -11, -15, -68, -6, 8, 100, 53, 81, -32, -71, -32, -49, -19, -160, -24, 22, 61, 116, 71, -41, -46, 44, 89, -15, -40, -103, 42, 21, 20, 53, 60, -71, -16, 116, -51, -45, 39, -35, 1, -102, 1, 14, -37, -64, -36, -19, 53, -9, -101, -82, -49, 59, 93, -28, 44, 49, 27, 42, 18, -76, -127, 75, -116, -13, 29, 8, 54, 26, 42, -27, -29, 4, 0, 5, 87, 9, 30, -25, 32, -75, 28, 77, -25, 21, 98, 112, -48, -65, 5, 26, 42, 18, -50, 125, 59, -80, 149, 88, 60, -13, -35, -85, 118, -2, -102, -34, 2, -66, 18, -11, -12, -53, -102, 44, 58, -55, -50, 8, 157, 38, 20, -25, 23, 43, -54, 0, -43, 72, -88, 84, 28, 19, -36, -53, -54, -18, -26, -82, -22, 74, -75, -69, -47, 171, -102, -32, -9, -4, 55, -17, 35, -59, 44, 92, -53, -24, -50, 30, 63, -36, 65, 56, -88, 60, 11, -20, -23, 50, -26, 47, 7, 8, -55, -133, -60, 73, -7, 43, -31, -105, 39, 101, -67, 71, -90, 47, -53, 33, -46, 0, -34, 25, -59, -28, 18, -72, -10, -126, 14]
3462A4O6j03Qk5J11o1M6M4p9p3J25ql8O3r0Ql8%o3P0j2lLQ0Ko8ml7Q1J26k11j6
3494h2L0lO9j49R7O8j21J25n2L2N0q9J0PqK2Om9J55o4O7j08m6m4M9P4l2n5l8N4
3524b5pN7L0j16J1O5jl4N9j1j35M0kO7q7N4R5rk12K45q3N1r2P4m5J1p0N8Qln0
3555e7Q9J22j67oN2qj7j9l9J22n7j51R6l3J84j24m7M1N7q6O4K1Nlr0L5q0J09M6
3584E9j24M5m5L1O8L9r7m5J34j80J29p3J05r1K5O2K5p1L9m9j1MK7mk2NL9P1j08
3613a3n9M1l5J45op8m0R4j8p0J21K2p2l1K8J0k8N6j6l4j4J5N2l9P9j1n3Mn5no6
3644g6M0O7k8n5L4M9nj3Mop5o8Q8Q0N3p0k9j4J9QJ05j42m9P1O2l7l2k6J48j20
3674a7RN5o3o0J3J85J1j58J83m3k5j4o5O7j27j4M7J47j41k6j2J50k30J63M2r8
$$ y = [14, 80, -23, -15, -40, 71, 10, 56, 100, 21, -52, 73, 65, 27, 90, 0, 8, -30, -30, -93, -23, -35, -38, -35, 45, 47, -21, -25, -62, 19, 145, -66, -82, -52, -55, 14, -135, -38, 30, -91, 34, -18, 14, 64, -25, -15, -8, -16, 6, 12, -37, 118, 54, 121, 13, -33, -77, -28, 46, 14, -41, -79, -25, -32, 25, 55, -61, -50, 15, 14, -20, 39, 28, -107, -67, -69, -2, -89, -35, 60, 51, -161, 84, 1, 52, -40, 34, -11, 0, -70, -12, -4, -7, -57, 32, 154, -13, -19, 33, 25, 8, -11, -50, 72, 15, -136, -40, -73, 111, -13, -60, -19, 38, -48, 16, 37, 42, 39, -51, -16, -96, 13, 59, -65, -20, -65, -34, 34, 73, -24, -69, 65, -115, 14, -59, 46, -45, -20, 42, 67, -4, 35, -14, -25, -21, 6, 2, -20, -15, 24, 95, -13, -72, -31, -66, 79, 73, -5, -45, 49, 31, -39, 82, 104, 32, 1, 29, 39, 11, 67, 51, 17, 3, 18, 70, 31, 110, 99, 46, 50, -5, -10, -76, -36, 31, 3, -52, -18, 31, 26, 13, 17, 11, -64, -132, -44, 36, 89, 19, -10, -24, -5, 3, 108, -34, -83, -12, 50, 13, -19, -45, 103, -17, -8, 47, -16, -76, -63, 122, 133, -25, 158, 115, 90, 76, 11, 78, -49, -63, -16, 131, -10, -36, -48, 102, -128, 35, 77, -21]
3700b1J32p9M8p6ok8l3l9J48j39jQ5l0J9m0O1m0K8j35J66nn0jM4n9PJ03k8k2k5
3730a6j5Q1j2k9K1n0PJ11j04k9p3M4J36j3j23J19p6kk5K6J02j14l7J04q2J07p7
3757a9QM3n5k3K3L9L4q9K8O1o6M3r1M5J58j05rj11O9k0O7OJ7Mq8RK4L7j13J2R
3788e3J36p7p8J37j71J14Q5r0l1J86j93P8m3lmOl4j7J32kj37N4pj02RJ60k4J9
3816E0j22J94p7n0k3j0n6J94j13j4k3K3NL5l9O4P5j35%L8M3j24J16ql6K1j04J06
3844C0n5j9KQ2j7L5K9P1p5q6m0qN2M0j7QL9j07Q7q3J6j8M6L9o8k2q2J4P5o4J53
3875E7M2j61M1J5OM0k8M2o5L7j8J4K6Qj25L4M8n6N5J5Qm0J18j77O1R3j12L3K3
3904C4J2J8j08O7r6J0M8jp4N4J7NJ33j63k8R8j6M2Rj33N2J5N8o2o1N2j9P2p7O8
$$ y = [-21, 111, 32, 80, 4, -2, -30, -63, -102, 46, -93, -94, -9, -39, -20, -60, 1, -39, -11, -146, 20, 15, -35, -36, 8, -51, -44, 59, 31, 9, -16, -31, 50, 38, 9, 30, -20, -13, 98, -6, -35, -108, -64, 72, 59, -64, 55, -21, -23, -48, -22, 80, -34, -71, 33, -49, 58, -19, -11, 32, -23, -46, -23, 16, 50, -39, -11, 50, -16, 27, -64, -19, 139, 34, 25, -86, -17, -37, 30, 36, 53, 57, -31, -22, 2, 39, -74, -62, -53, 83, 6, -72, 65, -106, 8, 93, 3, -28, 158, -35, 43, 0, -3, -7, -1, -35, -52, 80, 78, -59, -5, -12, -114, -105, 55, 31, 50, -72, 122, 45, -5, -28, -38, -94, 100, -13, -27, -50, -27, -22, 13, -26, 38, 113, -22, -22, 16, 59, -65, 51, 43, 7, 28, -76, 30, -25, -44, -42, 40, 23, 58, 87, 158, 83, -3, -43, -51, 1, 41, 24, 32, 71, -36, 51, -32, -16, -34, 12, 51, -17, -39, -121, -107, -32, -96, 57, 99, -62, -21, -6, 0, 40, 12, 54, -11, 26, 8, 22, 48, 56, -69, -35, 13, -43, 12, 27, 35, -5, 113, -64, -3, 90, -22, 11, 34, 46, 64, -44, 23, -73, -63, -15, -16, -90, -36, -19, -14, 119, -44, -72, 26, 10, 52, 61, -72, -20, -5, 53, -9, -70, -18, -37, 35, -42, 26]
3934B6r5N7J9K4N5o7J1rN7q8L2o0N7j2l2K2Q7j83N7mR7K2j08J6J4l0Jj9j4L2O0
3965B5M6q0K4m9j9R2m3%J8nK3m3M8r0J19j7p3K4N7j45J6l8J9J49n9q1J24q6J9
3994b5jk7M3Nj9RJ8L1o6jJ0j7P6r2O8p9MQ5R6j72K7o2N7JJ2J07q7m6k6M9N1K9
4026E8r8R0pJ6j05K4Nol5O6r4R4j9O4k1p8R2k2l7O3j7k4P9j40J04N4Pj33N5Po7
4057b5Q2r0J2Nm2R1ll0nmo9J46qm7o1O5j9J09r6p7OQ5j07J39PRk0o9l9k4Q1m2
4089d0jq9K11m3l5k4J4J7l3J22j49N6R9j26N3j08J17Lj0N8n1p1N1n0K3JL5j0k5
4118ek0j44J90rj6j0L3%o3P8m3rj2N2K6r7N4L0l4J1j4l0J8N1L7j27N3J01j02J00
4148I9j53M7J68k80J31j23J22o1O7j02R0N8o1j7j0J4q8J43k5m3j8n6L7N1J5L7
$$ y = [26, -69, -12, 7, 31, 86, 19, 30, 21, 78, -10, 22, -38, 19, 7, -25, -3, 84, -99, -42, -46, 51, 73, -35, -19, -5, -35, -34, -53, -67, -35, 25, 71, -9, 15, -34, -53, 39, -4, -4, 14, 9, 32, -11, 37, -53, 66, 49, -24, 0, 57, -88, -72, -110, -91, 58, -1, -82, 42, -44, -25, -26, -53, -10, -5, -24, -15, 3, 34, -32, -33, -23, -40, 36, -56, 12, -67, -63, 22, 118, -54, -27, -89, -32, -31, -19, 88, 1, -45, -71, -22, 29, 58, -40, 50, 43, 59, -46, -22, -17, -23, -58, 8, -86, 8, -11, 53, 32, -46, 46, 24, -13, 50, 33, 9, 88, -52, 52, 106, 113, -20, 35, 42, -25, 57, -33, -21, -16, -58, 33, 30, 0, -5, -9, -78, 68, 60, 13, -48, 17, -2, 107, 11, -66, -60, 25, -82, 57, 64, 73, 53, -16, -55, -79, 2, -40, -41, -130, 81, 38, 3, -21, -7, 10, -23, 99, -50, 6, 105, -21, 32, -76, 41, 44, 34, 92, 41, -30, 21, -29, -6, -5, 30, 20, -5, -25, -169, 21, 12, -4, -14, 19, 19, -44, 34, -9, -18, -30, 22, 48, -49, 5, 35, 1, 12, -2, -32, -14, 37, 74, -53, 0, 101, -1, 99, -54, -7, 161, -119, 12, -111, 11, -50, 17, -85, 5, 63, 2, -15, -25, -11, -99, 44, 19, -24, -42, -98, -61, -10, 5, 42]
4174D2rn9O6p2M6j2L4l8jR1j23nP8o4L4L4j3l7j2n2PJ11K1j67Q0R2k7j83J20N5
4204C7j08N4K1k2J3k3J04j17k2N4JL2j8k4J0K5N7o6On2P0m5qM6m1R1qp6N8r6O5
4235A8O7j22J2J02j50P2l9PJ9M8N4l9mp1L8N2l9k5n7J15m5p0JM5o6J13k0J4O3
4264I3p5n4l0Q4n2j4O5o6J6nL9j1j3PM4m5M6p4J34l4j83J84j15J07l1k9l0P7k9
4293Fl2M4p0N6L0o5O4q1Q6p5m0K9Q6j30R4R9j01O0j07oN9j8M8j07N1Q3Rm5n1Q1
4323E7k7j04J17j31J8J3j3j9Q9k9k5lk8J90j27n2R2o4O2M7p7o1J76q3M3j07L2
4350a4j4NK7j12K10kl3r0L9j0N5rj08Q5q1j4R3m4q5J00m3K6o0J42j22j23R5J17
4378C0k3l0J05j59N1P7K8p9M1Kq6J55n8j05J35j47P5LK7Lj3j25J18j04OO7O3K3
$$ y = [42, 33, -26, 40, -32, 14, 2, 36, -2, -3, 88, -35, -40, 38, -26, 8, 42, 29, -8, -20, -72, -65, 46, 67, -100, -20, 72, 45, -138, -18, 37, -71, -17, 4, -18, -5, -28, 76, -41, -63, -9, -8, 24, 6, -18, -8, 17, 74, 8, 14, -38, 32, -13, -21, 25, -16, 75, 67, -9, 49, -47, 18, 85, -37, -25, 77, -73, -1, -40, -33, -14, 34, 88, 49, 45, -26, 12, 64, 25, 0, -57, 58, 13, -57, -56, -11, -77, 36, 16, 30, 93, 18, -36, -66, 18, -34, -48, 17, -49, -33, -38, 1, -10, -23, -16, 28, -17, 29, -45, 89, 55, -128, 56, -59, 48, 17, -12, -42, 35, 6, -26, 18, -52, 4, 34, -31, 33, -48, 38, -37, -77, -48, 38, -92, 2, 101, 0, 60, -47, -53, 6, -12, 36, -71, -20, 63, 72, 27, -24, 57, 30, -74, 43, -88, -70, -57, -70, -89, 0, -29, -54, -57, -85, 105, -22, -74, 18, -46, 16, 63, -14, -75, 101, 18, 61, -46, -14, -28, -23, 4, -108, 102, 100, 67, -23, 16, 6, 61, 52, -56, 29, -52, -66, 27, -17, -102, -2, -45, -19, -79, 63, -59, -182, -87, 30, 7, -23, 82, -77, -26, 51, 79, 0, 41, 43, -43, 112, 54, -51, 84, -63, 12, 15, 42, 45, 32, -93, 25, -79, -73, -6, 57, 80]
4406H0o1J3j02l7O6%j5K5P4q6J13k01J57m2M2l6L1jNo6K4J8M6q3N5M1n0K2M6q4
4436fLOP7j58O6O8l1o5N8K1j52J77K0m9r7J14m0j7K1k5k0k9K2J04n7j68J38O3
4464D4j03lK0K8lN4k5Q7q1j23R2M5n8L2k4J9J24j51Q7p3O2k5j34M3N2l9k9Q2n1
4493e1J23O4j45K0J5L8j14J17p5mN9Q5j43J1k3K4J8q4J20j6n6N7n4N2j05N4M8
4520C5n5l5qJ50j47k6J22n5R4r6KN2p2J35j25L8Jj2J1p5M9m0O4j05M2R6l5l0j4
4549c9M9M3j68J62n4pq7J57q6L1rK0J9p5O0L5j02O2M5N1j83M9J2m9K2M9P6j44
4577f1R8Ok8o2M2K1qN9j0q9J16j72J62r1m6N5j7m2P4K1M8o1j07O1J2M0m4N9kN2
4607H6j85J50r3N6p2L9K8j1J22j77Q0q2M4Q7J2m6j23O6K7Q3j18K0M5r1N8j2Lj2
$$ y = [80, 19, 32, -70, -107, -41, -41, -56, -31, 43, -43, 70, -131, 26, -16, 26, -10, 21, 20, 25, -41, -17, 1, 47, -36, 19, 60, 10, 32, 78, -6, -3, 3, 80, -78, -12, 56, 25, -40, 18, 39, -113, 64, 84, 35, -62, 52, 12, -5, 16, -9, -29, -58, -36, 68, 11, -157, -19, 44, -59, -62, -42, -14, -17, 37, 12, 99, 18, -105, -13, 32, -26, 6, -18, 1, 125, -26, 61, -12, 50, 25, -109, -66, -14, -53, -82, 0, -51, 72, 136, -9, 11, 26, 64, -50, 67, -8, -12, 47, 132, -11, 0, -23, 1, 19, -65, 55, 39, -17, 40, -14, 38, -67, -13, 35, -20, -55, -63, 87, -60, -86, 36, -19, 75, -21, -19, 33, -39, 96, -29, 9, 10, -2, 9, -66, -17, -57, 7, -98, -56, 40, 5, -25, -39, 10, 53, -115, 47, -7, -14, -101, 56, -30, 1, -8, 12, 31, -44, 16, 51, -51, 11, 56, 107, -76, -27, -15, -64, -42, 7, 83, -61, 37, 43, 15, -47, -5, 16, 8, 67, 57, -32, 84, -88, 74, -17, -63, -8, -25, -67, 7, 28, 76, 15, -92, -31, -19, 21, -23, 36, 34, 86, -99, 51, -42, 14, -58, -19, 9, -2, 120, -57, 23, -59, -15, 72, 84, 38, -85, -19, 8, 91, -27, -7, 38, -53, 5, -7, -4, -16]
4635a6l9K1r3J53k8o4Q6j17J66k3n2n1R1O2r9j84Q4J15k8k9l3J43r8N0n5J17j22
4662d3P1j3k0j3k4j1M1O0j17L5Q5j49J55p9O9q2K9l7l9Q9m3J1J33j27n5JO8O3
4690E8j7Rm5K8m6k9K8r0M1P0K4n6P5k3j01K0P1rj2Q0q4J2M0r3J03m7MO8k9l2o8
4721e0K2K4J1k8J7K8m7K5M2q1N9q7J43n6L6m5Pn9J13j03J38k4j94R9M2j6K4Jq0
4750c9J29n2r4p5K20r2K7k9oK8M4j71J62j08J4K4j0M4L4j03j8K1m8Q4O5o6pJ37
4778A15j23J5k8Kk4P6J19j94K0P5j14R3m9N0k2k7J1k7J8P8r6N1q7Q4J2m8J2j4
4806b2K7l7Q5j25Q7K1m0R8j11l1R1p0L1r4P3J10Lm2j91K10r7L8j01J11r7P4l2
4833c1N2m4J32j52nK9k2L4j8P2j1M1o3n6J6O7m3K0l0k9J0Q3n0R5p5j2mN3j16J09
$$ y = [-16, -55, -34, -127, 26, -2, -66, 20, -97, 69, 46, -6, -57, 34, 96, -3, -187, -103, 12, -16, -45, -78, 65, -33, 17, -38, 79, -43, 28, 15, -5, -18, -42, -53, -12, 48, -69, -34, 51, -98, 57, -22, 47, -35, -6, -43, -82, 7, -36, -25, 108, -19, -74, -73, -5, 58, 41, 50, 5, 33, -13, -42, -14, -104, -63, 7, 31, -25, 50, 27, -74, -54, 17, 8, -4, 76, -8, 4, 44, -49, 54, 7, 11, 79, 50, 18, -50, -28, -4, 7, -21, -4, 24, -23, 2, 44, -37, 22, -65, 78, 22, 58, 13, 20, -39, 74, -29, 109, 85, -109, -10, 32, 16, 40, 41, -39, 90, 38, -56, -131, 89, -3, 24, -5, -11, 17, 61, -110, 52, -56, -42, -18, -28, 16, 50, -53, -71, -50, -98, -14, 51, -15, -22, 115, -8, 7, -21, -19, -43, 33, 152, -42, -22, 53, -61, 32, -17, 33, 11, -16, -5, -32, -14, 64, -32, 19, -68, 16, 28, -20, -8, -22, 5, -32, 53, -72, 15, 36, -4, 94, -17, -48, 43, -27, 4, -90, -17, 93, 96, 54, -137, 73, -24, 14, -87, 24, -73, 1, -31, 21, -23, 109, -43, -48, -19, -41, -7, -25, 47, 36, 77, 14, -42, -26, 41, -2, 18, -12, -41, -31, 52, 2, 97, 22, 10, 6, 59, -57, 52]
4863E2j43R2O0m4m9l8P7L7n9l1q4J66j44N4J47j13L5o8Km0k5N3kJ5N9ml0N7j64
4892a32J37R2k9rK7q8R1p1K9j18J6KJ26k4P5n2j61P9L9j8j1k7L4Q7j66m4J40n9
4920c5m7M3k6L0q3J21j01Q7%l0O4p6M7Rm9J1L2l4Q5k4n3K33j67L3j46K09r9L4
4948F8m5rN6j30J9jK8k9J28j46K4R3j07l3O7R9r0l2kJ4j9OO8j95K07J9q0q9L4
4977g7k4R4J1%j0o1N4J5j1n4J09q8J3J08j52L0O8l4L4L0n0K1J6l9K7j9j11P8m6
5006f8P9k9N2mNj8K1k7m4k0J3J2J7moPL3j3l7J02n2O4j09l1K9j9O0M5j16N7J17
5037A16r4m9j8J3P3j11K6m0R9n7J58j77J7L2J08j60J1J13m8j04R2N7l9n3P3J3
5063E1n5O9j05J3R1Q4j57l0oO9k0k6j9Q2p4K4L0r0P6l5j8Q1nj17J35j2r8J13k32
$$ y = [52, -91, 1, 61, 17, -32, -70, 7, 44, -15, -46, -130, 36, -108, -54, 93, -20, 15, -53, -51, -91, -116, -63, -65, -50, 9, 5, -25, 32, -132, 5, 97, 68, 59, 86, -2, 89, 18, 47, -71, -55, -53, 73, 49, 124, 72, -89, -10, 29, 11, 0, -27, 7, 94, -72, -116, 24, -35, -82, -39, -65, -35, -118, 3, -98, -11, -11, -41, 23, -53, -6, 3, -46, -35, -3, -37, 48, 24, -29, 204, 37, 70, -76, 133, 34, 68, 23, 14, 70, -60, -41, -42, -14, -43, 85, -61, -37, 56, -51, -84, -17, 82, -8, -40, -42, -28, -47, -41, 27, -168, 39, 58, -22, -111, -77, -101, -7, 4, 4, -6, -67, -13, 2, -9, -63, 46, -42, -29, 79, -73, -43, 25, -9, 25, 55, 5, 26, 42, 3, 30, 11, -100, -22, -68, 11, -18, 34, 30, 35, 17, 38, 11, -33, -53, -40, -28, -11, -15, -21, -14, 19, 6, -31, 71, 19, 83, -26, -57, -28, -47, 13, 58, -58, -1, 116, 22, -27, -45, -32, 41, -70, -44, -84, 15, -42, 116, -61, -44, -12, 96, -64, -53, 60, 12, -92, 0, 57, 18, -35, 38, 51, -4, 65, -40, -27, 64, 148, -9, -39, -45, 24, 4, -22, -41, 41, -33, -9, 21, -69, 7, -28, -46, 35, 30, -87, 48, 36, -62, 51, -181]
5092a81J01R4k3j11J35N8j50N4q1K9M2R8j48P9J03j19L8j02J34m7L7J8q1J58j13
5117B2m8l4M7L9j33J8j0O3M1m6J36oj33Q0rln2qOJ3o5J0Q1k2LM9l5qo1nJ8N4M4
5150D6pn6R9j41P1q1nP2n7P6l4l7R7l9K1O3r8J2N6p3K9%n3Q7o5k6j3J14j08J5
5180c5j29J95N6Qr7l0K1k7R9n7m6J15lp9p7P6NM4q8k7Q5p5O6r9J50o0j2K7Pn3
5210d0mj6R1q3J06n5n9R8m4mm1N5M8q2N6k1K5n0J2mPM2N9j13NQ6p5j8K8o1K5l
5242c0R7M9j19k8pJ13m3k6p5R4Oj9j16K8J08r9k4N9R1q5l3L9O5mlj0N9k16R5l
5272c7L4oN4k5m5J31Ko6j41M3M9LK0k0K7m4oQ7j33M3kK7mqJ8j3l3jO5k6Q4p6J1
5305A2q0J0k2j0P5R0n4L1r5P1n2J9o0Q0O8q1o7J26o5n0P1K5n2Jl5O2N8j29OL0
$$ y = [-181, -80, 14, -9, -120, 15, 73, -77, -23, -104, -75, -33, 65, -83, -4, 99, -20, 18, -84, 50, 3, 40, 58, -23, 135, 22, -26, -60, -13, 26, -107, -89, -99, -36, 5, -41, 95, 89, -44, 36, 27, 24, -28, -36, -30, -17, -82, -72, 9, -13, -10, 39, 4, -4, -65, -70, -52, 2, 46, 39, -17, 82, -59, 12, -69, -74, -2, -59, 17, -17, -54, 43, 4, 25, 88, -10, 2, 58, -15, 14, 14, -39, 48, -17, -43, -56, 58, -50, -35, -164, 31, 87, 95, -2, -32, -11, -38, 61, 4, -42, 73, 70, -9, -86, -10, -5, 39, -49, -76, 9, -66, 0, -99, 51, -9, -21, 6, 13, -40, -44, -60, 31, -52, 54, -1, -60, 38, -6, -10, -51, 4, 52, -30, 26, 5, 30, -20, -8, -12, -5, 37, 96, -17, -12, 74, -1, -19, 9, -52, -27, -30, 67, 116, -3, -31, -38, 75, 32, 6, -69, 25, 31, 12, -104, -76, 32, -67, -91, -32, 59, -26, -59, -20, 45, 41, 38, 28, 87, -129, -34, -37, -3, -9, 45, 20, -25, 106, 108, 42, -99, -56, -7, -4, 16, -4, 23, -21, -27, 60, -73, -30, -32, -5, -9, -17, 1, -12, -45, -46, 19, -7, 77, 1, 12, -68, -58, -80, -90, -15, 75, 21, 52, -43, 28, -24, -5, -65, 15, 83, 2, -65, 61, -4, -54, 17, 42, -10, -9, -44, 18, 76, -53, -47, -17]
5335a7q9L6l4O8J04j26k1O2j3O6KP8p4l9j70J82m6n9J34q7O2N3j34mN9RJO1J3
5364G7q5M9k0O3k1r0jJ7j2L1p0J16n6m3Q8r0M4J7o4L3J3N0j4n7Nk2R3o7L1N4j27
5395e8N3K0q8O3l5m0J18n6O6q9J69r4n1q3KP7J13j36L1l4R3M7n9R6j87L1M1j24
5423a14O4J25m6m6j9L4m9P4J8q6O5j5l5m1K7J11q4j9M0Q5p1K1j09J13o8l6J20
5450E9l5K1j11J51p3J9n0j9K4M6N7j68J60l0j15oL1L5Pm0P6p0Q8Po0k9%k3K5P5
5480E2p6M6K8K3m3R6j57q7L0J64j5m1P4p9J0j07O0n7O7Q9j10kJ04q8J9Om5N8k9
5509a0n2M3l3J14k6n2P1Lj17qJ09n2M9j57O9K7N0m9j1OP0K9k8j53K31r1J3k9j2
5538Do3Q9j1j25J15j8O8m1L7j45N6l6J12J7n9Lm3J9l7N7k4P0Lj10R5n1L2j3n7
$$ y = [-17, -106, -70, -104, -36, 68, -58, -79, -17, -30, 36, 38, 116, 42, 3, -167, 15, -31, -90, 44, -43, 19, 72, -62, -66, -7, 2, 3, 64, 77, -8, 41, 21, 84, 63, -27, -28, -11, -23, 8, -62, 54, -2, -45, 43, -47, -3, 14, -50, -17, -4, 46, 32, -25, -20, -42, 51, -16, 15, 69, -58, -5, 15, -73, -10, -45, -85, 33, -23, 43, -46, 123, 29, -22, -105, -103, -26, 87, -49, -18, -52, 41, 88, 29, 125, -62, -31, 10, -114, -50, 75, 29, -17, -36, -2, -51, 23, 41, -45, 20, 5, -30, -71, -44, 67, -17, -36, 4, 89, 18, 39, -70, 43, -25, -61, 59, 24, 45, -66, 85, 12, 31, -19, -38, -14, 32, 89, -79, 81, 51, -64, -70, -39, -4, 3, -37, 39, -31, 57, 64, 4, -25, -25, -48, -23, 52, -24, 22, 50, 73, 30, 126, -31, -118, -88, 76, 61, 20, 94, 15, 25, -82, -22, -79, -12, 77, -33, -35, 69, -19, 0, 6, -39, 19, -10, -62, -19, -52, 62, 36, -16, 55, 58, -59, -67, 42, -10, 39, -118, -49, -22, 28, -21, -32, -26, 44, 73, 45, -108, 123, 32, 45, 16, 4, -59, 30, 19, -106, 9, -9, 59, 18, 55, -90, -34, -70, 42, 59, 0, 3, -40, -21, -58, -1, -25, 45, 48, -62, 33, -18, 14, 1, -56]
5567e6J70L7k18L8L6K0k2L1pJ03j35k3o6P0L4q4L5L4J5L2j3km0P8j23K7kN5m1
5596a7m9R6n3P9o1n1K7O8qK4j09L9N2l4j30J10J16o6j7k4k7l9K3N8m7J20r3J7
5624Dn0R9m6QP3j97J46j4p9R9q6Q8m3J6N1j8j30K09r5o3J24r0o6J22l4p7l6J39
5652E4Om1o6J36j15MK5l3N8K0n3M3j30L7m9J44K2j02j0N9j4j02J57j18k1P3N2
5679C6r4K6k1R0n4K0m3O0q5R7r5J03o7n4J61j13L5M9j36lJ22j17J29j7J3J3r9
5706d4J29r9J3R8j69M4nR3n4L9n5J2rrJq4M0J04r0K5K7M2p6j9Q5N9j33R9n7K0
5736B7q8O2M8o9n7M4N6j1M2j04M9n0M8R5l5k6n2j7L8om8q1K62k05K2M2j6J38o9
5765C9q3M0o7J63j68J02j27J60o6n2J01j6k1k1P1p7L4j9N5l7L9j04J09l6N6K0
$$ y = [-56, 114, 151, -67, -29, 7, 27, 5, 36, 29, 132, -3, -26, -92, -22, 12, -72, -37, -3, 12, 44, 31, 29, -11, 67, -56, -29, -31, 24, -17, -66, 30, -23, 56, -5, -56, -29, 39, 31, 55, -54, -15, 37, 3, -127, -17, 99, 33, 16, -8, -35, -74, -51, 7, -40, 80, -13, 4, -46, 53, 7, 15, 88, -109, 37, 23, -56, 43, -43, 45, 2, 18, 69, 51, -79, 130, 35, -28, 96, 6, -60, 62, 28, -49, -85, 54, 60, 19, -47, 89, -26, -22, 3, -30, 28, 48, -5, 38, -92, -55, -104, 40, 62, -40, -50, 9, -5, -107, 50, -68, -89, -16, 36, -58, -32, -53, 37, -17, 3, -40, 20, -65, 32, -63, 40, -27, -81, 80, -33, 2, 51, -85, -88, 34, -83, 46, 29, 42, 55, -44, 85, -14, -1, 97, -72, -28, -33, 60, 6, 45, -10, 2, -7, -16, -15, -99, -59, 45, -45, -20, 7, 49, -27, -46, 39, 98, -35, 64, 7, 27, -61, 1, 49, -20, -77, -33, 23, 12, 54, -50, -1, -51, -3, 92, 57, 31, -21, -38, 0, -6, -54, -135, 127, -78, -56, -14, -30, 108, 39, -44, -4, -71, 92, -76, 26, -101, 59, -7, -59, 42, 26, 5, -16, 55, -22, 12, -7, 48, 11, 50, -54, 55, 19, 75, 95]
5791I5j60j0Q8p8M2pJ2oJ2M5m0l2K4M5P5j6j32m0J30k7QJq3R7k1P8n3q4O0J7J0
5822E0m0plq6L2O4k9j1P8o1l6K4m7P7K1%k3N1q4L2RQ3q8r0J28m3k6J18j58J09
5852D4r8L1j0K1J5p6N0J4J3o4rJ88o0m1j36P3J36j33J14j09L4K9L6l6n7J1J6k9
5880c3R1k2o2O4l1j06J21j06M5M6L0n6O4p3J47k10J03K3m4Q9o7JK3m2n1OJ1O0
5908B1K6j20p8J99q5Q9o6L7J0kj6r6J24p5Q5j8k9J0l4Qo2RN8J46j62q4J03k1o
5937b9Q4m6J9o4O0l4rn3N0m4K4k4L5k4O8J17p3q3K9pj00J47n4ro6M1L3o4M0k9
5967f5M2K3J5O4l4M5j04P6n6j9OL3l3J8Qm2r3O7R8n9K1Pn8N7Kj06J90o7l9O6o2
5998AK8k1k3j3k3P7j32K9k9J42j17M0N7o9M8pK7K4ll2J31k09J33j06j3Q3m6M0
$$ y = [95, -65, -75, 13, -65, -23, -30, -18, -24, -12, 33, -7, -39, -15, 30, 105, 89, -43, -83, 47, 20, 28, 29, -54, 43, 22, 100, 47, -37, 23, 40, 50, 10, 3, 0, -86, -54, 10, -19, -30, 48, -13, -49, -25, -72, 5, 26, 26, 3, 54, -30, 2, 11, 94, 6, -84, 44, 1, -25, 93, -65, 44, -54, -23, -33, -12, 3, -73, -23, -9, 4, -60, -69, 119, 59, 18, -118, -45, 91, -42, 72, -37, -3, 26, 62, 26, -31, -20, -4, -33, 58, 36, -26, 38, 7, -99, 22, -84, -39, 7, 37, -19, 45, -28, 119, -91, 12, 35, -9, 80, 13, 14, 37, -5, -56, -50, -39, 21, 47, -73, -151, 48, -37, 52, -14, 23, 33, 31, 15, -81, 43, -32, 53, 35, 6, 16, -18, -10, -72, -63, -5, 141, -21, -105, -2, -23, -29, 55, 9, 28, -36, 24, -10, -19, -72, -22, -66, -42, -66, -31, -55, 13, 130, 57, -26, 3, -4, -104, 43, -11, -20, -86, -45, -12, -76, -36, -65, -23, 0, 15, 79, 45, 90, -14, 62, 6, -13, -7, 26, -7, 11, 19, -23, -116, -49, 49, -10, 11, 18, -40, 17, 19, -87, 103, 36, -3, 63, 1, 29, 8, -15, -28, -51, 26, -106, -77, -106, 36, -81, -41, 16, -53, -5, -12, 15, 39, 36, 4, 135, -74, 59, -47, -60, 23, -23, 17]
6026A7l8o0j2L2O5P4k4m5pj6L9j13J94p5J6j46J40J8n7J9m5k1J15n1l3O4r5K0
6054b5L3Pj21J09j2k5O1m9o2L6j0J8R7o1o6K5j5O7p2J23p1j1M6j6p6J58r2J8n4
6083d0P9k0l8Q4j08J25j08K4N0j23P5j7MQ8j29mJ02p6NJ1p0J77r1Lqn9J7O2j61
6112a46J74K1J1n3k2L6KM1j08O5l7M2R2j40Q9j02J62j30m7R6nR8j15M6j08l6K4
6139e0kM6P3j10Q7n3M1k0l0M2o4Q6n1R2j06j0L1pO4n8j0l4J21j07qJ23o7N9n6
6168B2j2K1j5k3k2K4Qm1J21j18J05j56J53r2n6O8o1N6n4N9k6j6oJ4M2j4l3J09
6196E7o1M3j9R5n6j88J23k5j0L4N2Jq3R5K2q7L5L2ql6k2Q5l3K9m0p4J06p3j12
6225a18J79r9q6J14LNK3p9J42m8L6o8p5J04oRJ6j6l3J3j33J94p9L2k3k7k5P0j05
$$ y = [17, -21, -81, -93, -61, 4, 78, 54, 9, 2, -14, 25, -88, 106, 31, 47, -99, 41, 59, 2, 21, -24, -45, 70, 19, -14, 50, -45, -25, 8, 15, -106, 3, -9, -34, 27, -22, -84, -48, -58, -40, 57, -4, -70, -45, -60, 7, -65, 58, -13, -24, 22, 6, -70, 88, -4, 14, -40, 39, 19, -19, 65, -43, 82, -26, -2, 48, -75, 0, -17, -13, 75, -54, -58, 44, -32, -27, -16, -86, 91, 0, 3, -5, -64, -47, 15, -146, 28, 49, 60, 7, -15, 21, 23, 64, -44, 21, -16, 26, 118, -22, 67, -35, 127, -3, -50, 46, 41, 139, 24, 70, -38, -74, -50, -52, -6, 67, -43, 44, -9, 32, 12, -18, 24, -40, 46, -5, 87, -19, -29, 2, -5, 59, 1, -9, -43, 78, -29, -37, 86, 19, 78, 22, 10, 31, 16, -7, -29, -5, 3, -38, 83, -35, 70, -86, 67, -25, -81, -13, -74, -18, -72, -13, -39, -55, -61, -47, -5, -19, -52, 57, -4, 39, 20, 115, 59, -129, -6, -31, -41, -7, 45, 46, -37, 58, 80, -7, 28, 60, 52, 16, -6, 79, 46, 75, 35, -39, 67, -6, -118, 61, -38, -124, -10, -7, -2, 21, -58, 84, 36, 72, 4, -71, 33, 27, 36, 52, 36, 3, 16, -117, 77, -2, 30, 7, -20, -45, 25, -80]
6254h0J57k9m5o5K8N1M9%m7o8N7M5q3M7j06P7J9m2N7k1j06J24L6j6o0pM0q7R0
6283A5O1Krj27L8m9%N2M5o5J9r8Q7K8Q5p1L7M5k1r5R8j10k8QM4j8K6M0l7j5L2
6314A9O0j25pP1j09J90r4j19J60K5n1k3rML1j8n4N5m0m0J04j55J49J03r8po1N
6342c4l5J32m7Q1j06P7K0n8p2N6j8M8l8L9j31j2J24J30k73J39j8L6n5Q1n3J5%
6369B8Lj14L6Q0lo3R7k4M8l7j02m0J23j09J26o2J0P5l7j4n9mK9k9P1r9J47j30
6397e3m2R7L8j27K8N1r0%P1O4m1R0j48J2j7J30k3l9k1Q9oj33O9o6O7R5k5j0K3
6426H3KJ7j50N3J5q1J35j04n1J18Jj10j0J07j07J34j27J01M5p5j5m2J7J15o4J4
6452B1pk5n8P1J09n4o7rkN2P2p2K2q1M4r0R5P6n5l5LP5j09m0P4J5P6j24N5r6R7
$$ y = [-80, 77, 48, 3, -62, -34, 17, 66, 66, 19, -49, 8, 53, -30, 17, -89, -12, 7, -35, 22, 1, -105, 19, 55, 39, -21, -28, 12, -75, 15, 76, 78, 69, -58, -20, -69, -69, -17, 28, -37, -18, -116, -29, -1, 84, 13, 50, 95, 74, -21, 77, -33, -61, -53, -9, -27, -1, 39, 2, -13, 19, 79, -46, -53, 18, -91, 99, 5, -114, 46, 71, 20, -3, -12, -8, 23, 5, -49, 6, -34, -74, 30, -125, 24, 127, 29, 22, -39, -34, -69, 63, 16, 97, -9, 68, 88, 30, -42, 14, -4, 44, 6, 45, -86, -98, 26, 156, -117, 22, 4, 40, -15, 66, 13, 28, 28, 31, -83, -47, 33, 30, -33, 64, 40, 88, 51, -51, -91, 32, -77, 49, -13, -3, 72, 35, 21, -38, -42, -13, -42, 29, -70, 77, -53, -95, 2, 40, -87, -59, -8, -98, -98, -27, 37, -4, 86, -62, -50, -67, 63, 40, 1, -20, 69, 63, -70, -1, -67, 0, 95, 70, 60, 83, 85, 102, -48, 5, 20, -61, 74, -30, -81, 37, 38, -72, -82, 25, -82, 52, -75, 26, 71, -4, -19, -61, -44, 71, 7, 21, 14, -11, -69, 2, 111, 57, -10, -19, -21, 31, 103, 31, 53, -28, 16, -74, 21, 97, 42, 7, 10, 85, -24, -64, 10, 25, 101, -23, 32, -64, 33]
6483C3j2j7J6N8k5n0Mk4L0p8J26q5O9p0J04k1K3j1J4j0j05J13Mj30M1O4j1n4J6
6512A2j6K7K0J6m5p1l0J36m8l7O6L1j1j79J49o6O2p1J24r7N9Q7j9j12J10q8K6
6539C5j03J0K8L7J04j01n1J33j24M1m4J15j17J12p2k2N2m2N2j07J31j4o9L1qo3
6565e6JN4O0m6q0J30j11M2P2Q9k00K3M7j61J45p2R6j6kl3Ol7K6R9k6j45J02q5
6593g8J46k2j07J19j14PP4J5n4P3n8O9p1o6O3Kq0Q0J00j17Ol8Q4k0j7k2J2j07
6621a21J78L1n4n1J55j07j34J56q6K5Nj1O7l2nM8j27Kl1J10q7J09K5l5k4K8p1
6648c7M2N4j19N6j2JP9n8J8j88J79q7O6q9j1J16j7O3J8j8m9p0P0N0q5P9n3r9J96
6677I5nq5l5k2J14n3m4J24Ol9J6pl1k2j43K09j21J7j6J2P0l7n4J62o8moj8R6j09
$$ y = [33, 21, 4, 20, 78, 53, 3, 7, -17, 13, -65, 61, -24, 45, -25, 79, 58, 81, 70, 84, 74, -31, 82, 86, -44, -3, 61, 50, -4, 12, -4, 23, 43, 59, 14, -57, -87, 49, 1, -36, 30, 61, 50, -129, 20, -46, 16, -55, 69, -28, 31, 118, 99, -13, 97, 9, 35, -68, -58, -30, 7, 111, 10, -41, 92, -32, 9, -35, 80, -37, 75, 3, -19, 33, -9, 43, -64, 67, 53, -16, 15, 7, -56, -55, -1, 59, 13, -67, 63, -48, -6, 66, 155, -45, -22, 25, -136, 9, -63, 33, 17, 15, -18, -12, -49, -23, 76, 50, -95, 7, -78, 68, 46, -61, 58, -56, -49, 25, 40, -14, 59, 1, 70, -1, -67, -4, -2, -82, -2, 98, -19, -13, -51, 33, 13, -4, -26, -14, -121, 57, 88, 34, -17, 138, 31, -103, 53, -33, -8, -3, -14, 53, 21, 16, 64, -63, -61, -92, 18, -69, 40, 65, 30, 6, 34, -37, 5, 59, -60, -4, -16, -15, 64, 6, 24, -164, 15, -72, -6, -95, -106, 10, -7, 56, 74, 56, 7, -63, 7, 57, -28, 51, -2, -101, 95, 90, 5, -30, -52, 62, 9, -35, 89, 95, 56, 72, 65, 34, 12, -131, 78, -43, -26, -42, -30, 40, 3, -51, 111, 43, 39, 33, 15, 111, 2]
6707Bm1lP9l1LM1q4L2O5K3k1j07J22q3l0J04p4j9R9p9l1%O3j7j3J5r8J1Q9k8l8
6738d9N6K0j05Q2l7k2L1L1m0Q2j02RO2Q7j10k5mJ34j69jJ8K5J53mj13l4J6K2j3
6767@L0m6n9N2o8J45N7j37J06j0p8L6l1j3m3j2L7J09jq0R8j36P4n7p2k7J11Q9
6795G4j40J34o3m%P8j05q6O6K3M4N4j24R1q0N6J7Rm9mM9o5N4l3k5N6l6M1p2J53
6825A13j38mj1PJ06j09L3L4P5k3o5o7Q1r5J06K8M0j69O8J0J68j66lR2j77P8k6
6852a4j7J6Nj1k6J06L5r5L8r1R4j2j42R3l7K2K8M6r7P0o0J20j11N8o3j0R0k6J0
6881A9p8PM9L5k9j5nN5o4J03q4n3rO1p0RJ31K9q2M7l1k6LJ5P8j82J81q8p1N0K2
6912Gj1m5mR2j4m9n2J27n6k9J0nM4K5j53R7MJ28j04o0J6P5m1j6KN2R4j00o8M4
$$ y = [2, -39, -42, 37, 6, 9, 50, -34, -2, 63, 86, 65, -42, 80, -3, -33, 71, -3, -22, 77, -2, -33, -33, 30, 13, 0, 15, -83, -72, 17, -11, -49, 7, 27, -78, 4, -33, -55, -24, 7, -33, 49, -53, -44, 18, 105, -5, -30, -34, 100, -69, -70, -52, -27, 126, 122, 9, -25, -9, 13, 0, 30, -16, -75, -23, -91, 54, 111, -26, 80, 70, -8, 28, -3, -16, -59, -71, -34, 75, 74, -6, 92, -44, 30, -27, -99, -126, -15, 74, -66, 68, 5, 1, 1, 79, -26, -112, -46, -23, 21, 75, -49, 42, -38, 18, 35, 44, -5, -9, 40, -25, 29, -4, -29, 27, -9, 32, -40, 113, -25, -29, -40, -33, 73, -36, -3, 31, 106, 83, 18, -49, 32, -63, 43, 71, 111, -58, 10, 20, 188, 22, 19, 111, -66, 12, -14, -31, -15, -10, -21, -47, 59, 94, -1, 37, -54, 40, 28, -114, -21, -58, -36, -8, 38, -59, 11, -49, 71, -40, 18, -45, -55, 35, 9, 19, -59, -52, -3, 32, 3, -12, -17, 38, -26, 77, -7, -60, -69, -8, -78, -69, 62, 91, 9, 56, 25, -1, 2, 17, 95, -87, 94, 6, -65, -15, 7, -4, -49, -53, 39, 25, -24, -76, 51, -5, -34, -24, -29, 15, 40, -113, -16, -12, 116, 12, -48, -32, 43, 2, -14, -12, 40, 134, 34, -34, 10]
6942A0m7j0JJ3M1m1J05r9L8oL4m9p2Q4J9O6j4m2l5J4Lp9J55j25J4R3r0p7J5J8
6972f3J41r5n7J89o1j30m2P3K9O5J4l5q5n0J01j6l2O2o5J7Q3Q9l8j01N0p1o6M8
7000d6J52l0L7q6N3n4kK2Kkj10Q0J8j08O0j9K2q0J17K9l8k1J9K5j6o2M2J04q8
7029B0QP0j82J25p6n5J41k8r7N1O6L7j7j01K9kJM0q1R8j1L2j12N2l7K0J05j68
7057g2M2O8l3K3j7o2R4n2K4j3L9m6k5K0l3POP4n6j1R2j9K0j26J32j9o2JJ8nL9
7088D8r2J23q6R8j31k9L9J2K1M3k7k2m0K8N0j29M4R3r9M0j8M1N1k09J16q5L3M1
7116d6R2j74J19LL6k0K2k5m5K3q0J35l3ok1k3Q0j5J1j19R9L3l9k0M5m6Q2p5j8
7145b5M5j2k5J25j64K3p4J62m5m9P4j37Q7J3j11J2J24OJ6j22N6j8LQ7m3p3J43
$$ y = [10, -37, -47, -46, -33, 8, -33, 72, -27, 11, 5, 39, -10, -82, 2, 21, 87, 73, 31, -4, 10, 13, -66, 89, -36, -22, 71, -19, -96, -81, -63, 78, -17, -74, 115, 54, -76, -118, -45, -16, 49, 63, 28, -57, -107, -6, -22, -54, 8, -57, -40, 43, 132, 94, -7, 43, -28, -94, -46, 106, 76, 113, 27, 80, 26, 24, 46, 48, 46, -64, 16, 34, -74, -14, -33, -11, -91, 26, 55, 17, -4, 15, 40, 24, -38, 4, 108, 20, 28, 98, -84, 41, -35, -90, 51, 23, -74, -23, 43, 80, 63, -38, -9, -11, -10, 30, -51, 47, 36, 68, -44, 8, -29, -9, 96, -72, -30, 38, 5, 28, 11, -51, 43, -9, 15, 2, 41, -5, -30, -10, -43, -36, -30, 44, -12, -23, 69, 50, 70, -56, 76, 57, -5, -4, 14, 9, 48, -44, 79, -7, 91, -40, -69, -30, -18, 3, 46, 19, -3, -43, -15, 35, -94, -50, 43, -56, -16, -34, 7, 58, -151, -35, -120, -87, -46, 46, -128, -9, -6, 30, 10, 32, 7, -38, -15, -95, 40, 7, 1, -20, -43, 37, 22, 33, -86, 13, 46, 7, -13, 32, -14, 68, -7, -25, 20, 8, -17, 108, -56, -33, -107, 55, 10, -39, 35, -102, -15, -2, -113, -101, 23, 29, 45, -77, -21, -39, -36, 51, 8, -65, 78]
7172G8p0J2o2J7K4o5O1L6j9K4o6k6K3k6Mk2LmP4m5O1n6R4J1j00K9J1kK2o0Pk8
7204f0M2Lo2J22l1k1L5Jq2PJ5L2Q6m9j42J06k0l4J8J29j13Rl7M6j0N5j03O3l5
7233c0M5j16l6K12l5K8j54J29k8L1j7K7O5j25m9J26j3m4N2r5O8o4m4K3P3J3r7
7260e5M1o5J98j07jo1R0j05J06j6n9J1k6P4k2n7L8o2J52n1l0J2m5P5m7P4j35J59
7288H6q0J0j30P4JK8p6J49n6Mj73J63j6o4P4nQJ3k9L6l2l6K6J37j20k4J20j40
7316e2J26l8j5j9J9O2p4Ml8O2o6Q5M0o1l9M2p6N9m1P1r0lQ3j34J89k4n9rk8M8
7346B4M3J1j7n6J17k28J12m3K2J7N0k0o8J47o6l7M1j08J17m9Pl7nL7j10Q5m2k3
7374g9J33Kl5n4N0o0LO8K4q7k4J7j7P6j11J21k7n0kQ9J2j2Pj2qj5K0p6L5M0l1
$$ y = [78, 8, 20, -42, -25, -1, -66, -5, 31, 12, 36, -30, -56, -33, -59, -55, -77, -74, -78, -4, -49, 12, -44, 50, 61, -39, -10, 1, -1, 21, -39, -32, -60, -18, -15, -77, 45, 14, -7, 28, 29, -53, -46, -31, 1, 87, 38, -104, 2, -18, -52, -34, 95, -18, -9, -46, 0, -10, 45, -58, 5, -30, 15, -101, -137, 75, 40, 68, -86, 43, 15, 46, 29, 56, 121, -4, -53, 73, 60, 16, 68, -27, 41, -23, -67, -44, 29, 42, -55, -14, -79, 119, 12, 11, -50, 40, -65, 41, 25, -34, -23, -49, 25, 3, -54, -16, -78, 74, 23, -7, 5, -40, 35, -12, 62, -73, 86, 6, 16, -114, -40, -39, -11, -87, 62, 6, 10, -163, 0, -16, -80, -6, -11, -3, 10, -19, 17, -15, -51, -25, 112, -8, -32, 88, -52, 74, 36, 21, 2, 21, 83, 9, 13, -25, 37, -29, 56, 96, 35, -4, 38, -38, 21, -20, 51, -39, -42, 41, -93, 96, 72, 13, 4, -24, 24, 67, 78, 61, 5, 122, -106, 6, -37, -15, 2, 52, 32, -36, 111, 45, 8, 49, -59, 58, 9, 16, -21, -26, 11, -99, -14, -56, -79, 54, 56, 21, -33, 17, -43, -40, 28, 52, -35, -59, -42, -59, 17, -94, 27, 0, -50, -52, 37, 49, 37, 44, 32, 24, 9, 29, -47, -12, 28, -3]
7405cJo8N6Q8n6M2m5ko8L6L4OKm1j2Q3p1J14o7K7j36k0J96j22m3J6N6M8q7J28
7435I2j04K1o8j0O5P0q5j0N1k5nL6p6kM6P8j2Rr2M9n8J7N4k0q7P6J6l2n3N4n6
7466f1O7O2o7J0qn1o2J30m1P4%L6j6j08J0n4J47o6k9N7M3p1rl7N1L0q5Q7Mqo8
7497c3J15n8QJ0o7k7N1j4LM7K4p5M5j1m8qJ22M1k06J77j18N8m1j0P6K9j4n3K8
7526E1k6p6Q3q5M3r4R0n5N7kJ08o3O0j02K6P4q2m2R5m4Ll3N0r2M9k0M1p6L2K11
7556A81j90J7l5J01o9J17o1p3J6l2n0J09JjKK2r6P5P3j79N2k8J06r7J14j5Jl4
7584B7o3J69p2K7p8oJ1j7N0O4o6p5O7n4N8j46K34j7j12k4L6M8J4l4k8Oj0l4N4
7613B9K1J0j51O8N7N5j73J37k9j20O8j2M3r9K1M1r4O9J82j42Q4j06M5J07j12Q
$$ y = [-3, -2, -70, -14, 74, 18, 60, 15, 13, -55, -19, 15, 21, 23, -18, -30, 53, -18, 96, 29, 56, -80, -100, 96, -26, -69, -53, 3, 51, -36, 92, -12, 9, -59, -69, -4, 66, -19, -29, 22, -3, -8, 28, -48, -50, -4, 74, 62, 71, -21, 28, -30, -13, 41, 21, -66, 10, 26, -6, -59, -5, -61, 6, 68, 1, 11, 3, -48, -110, 20, -21, 53, 53, 89, 73, -35, -25, -79, 68, 2, -27, 30, 73, 2, -7, -44, 7, 37, -48, 39, 43, 35, -33, 82, 24, 32, 42, -25, -52, -1, -15, -12, 35, 59, -16, 29, 18, -30, -38, 84, 125, -81, 96, -22, 36, -5, -15, 61, 90, 76, 23, 51, 25, -51, 32, -53, -10, -104, -14, -69, -12, -14, 94, 31, 91, -11, 15, 89, 7, -35, 60, 16, 19, -14, 36, -56, -7, -27, 14, -62, -30, 181, -9, 8, -27, 74, 5, 122, 61, -12, 4, -28, -78, 31, 32, 31, 33, 55, -41, 34, 107, -72, -20, -48, 58, -39, 75, 60, 61, 27, -36, 133, 61, 88, 10, 4, 15, -2, 48, 112, 46, -29, 38, -16, 42, -104, 130, 113, 1, -23, 13, 61, 75, 41, 13, 19, 9, -25, 29, 50, 60, -91, -23, 34, 89, -84, 53, 24, -96, -28, -40, 3, -96, -75, -34, -128, -59, 123, -19, 65, -41, 4, 111, -1, 7]
7639Gm1J0O4N4j02lk2L4k9K7N8L1q7Rp1J4O9J8L8j32Q4p6K6K9o2R4rqrJ1O3j51
7671f2J25j32N4O9r8R4nL6j41J07K1o8RN7K2j00L1m2J9l1OjJ00n0L7J8p3l5k6
7700e9M2l7J0O7o6M0q9J71J1j69R0k5J14p3j01k3R5K9j47J88r8L6Rr2P0N4l2M5
7728F0l2n4P2O6On1n8O7j35L5n3J69k14J26q3L9j8J57j05M6m0M9j04Mj3L9onL0
7757frM3n4L3k1L4m6n5P6K1L9l4K6j17J35m0n5RP4k6M9k00K4J28Qj23J08j55K11
7786G7p0lP9n4mk5mL6q4J12l5j25L9L6Jk4N7o1mJ62j15M6n4l5J8M1O0o7J8m3M3
7817A8o1L8LN0l3l0L0N0o7L7k7M0j7p9M9K5K0K6j19R4q6Kj5l0J24J7k9m0K1k4
7847a3l4o3N8rk0J6O3oJ1oq1Q2L6Qq0L7J2n3JJ7N4M8n5jn8R2k9k8L0q1J68j31
$$ y = [7, -34, -24, 40, 94, -8, -11, -33, 1, -28, -1, 57, 88, 1, 10, -61, -47, 22, 40, 78, -54, 30, -46, -20, 9, -53, 41, 32, 24, 15, 26, 89, -62, 63, -69, -15, 54, -44, 50, 45, 81, -60, 47, 68, 0, 9, 66, 88, -12, 19, -23, -4, -35, -29, -30, 70, 20, 57, 75, 2, -33, -59, -17, -54, -44, 23, -43, -3, -92, 79, 90, -79, 11, -14, 100, 27, -74, -97, -2, 27, -120, 68, -30, 6, 15, -77, -7, 47, 15, 60, 28, -26, 46, 112, 118, 67, 9, 76, -59, -24, -77, 92, -122, 4, -79, -40, -58, 99, -6, 40, 0, 49, -55, -51, -64, -25, -31, -36, -6, -15, 28, -26, 7, -14, 20, -26, -81, -5, 16, 55, 21, 47, -70, 65, 25, -30, -21, 53, 27, 76, -124, -100, 28, 36, -87, 21, -134, 77, 7, 4, 83, 29, 25, 0, -4, 32, -52, 60, 25, -100, -61, -25, -24, -48, 9, -52, -56, 106, -9, 37, -17, -52, -34, 7, 67, 0, 18, -25, 18, -43, -5, -2, 48, 15, -15, 15, 65, -2, 35, 8, 48, 31, -48, 1, 26, 46, 72, -47, 47, -39, -37, -52, -82, 42, 59, 30, -10, 11, -13, -47, -110, -52, -61, -81, -65, -2, -8, 3, -3, -84, -2, 34, 42, -38, -1, 11, -42, -41, -24, 30, 78, 23, 22, -36, 56, 27, -1, 29, -52, 116, -15]
7879a5K3rq6R4Ko9j5M5K2J24j00KR9j6p2j36L6N8LO9j06RJ22n6p3J27j65J35M9
7908A01r1J06j22J14j09nQL3L2Lj12R8k7j46P7LmJ50n5m8l8j1P2N1j01M5k7O8
7936F5n4J88j72pl2M4Lq3M8q3QQ5L8q4L1M6o4kq5J10J0N2Mj12o3R8R4j15N8J1
7966C7lM7k1J%j58k3K74j41n4Q5q6P6j3L6l2m0M6lk0L7N7j52N3qk5j4L6l4M7j01
7997i6J7K02o8j0q1M2n6J28j12N7K4p0M3m2J20j48P2O6k5Moj12N1M3j93J12N2
8024A4k3P3o4q%O4k4l3k1L2o3j3J01j01j6J47j33J05p9Q5n0L7J25o1j01o6J76
8051A03p6m4j4P5M9r8M0J6m1j6L3o4K2l5j08O9kR3k6K4Qj38J60m0Q4r2O4M9p4
8080B1p2N0lJ7m7O9Q5j93Q2P4q0j5O0l1n1k7J2R2q9Q6Ol4o3P2n%j24R7ol6K5R4
$$ y = [-15, 8, -1, -87, 7, 9, -60, -75, -30, -8, 116, 16, 18, 117, 101, 29, -107, -71, -13, -10, 59, -47, -38, 84, 28, -45, 82, -83, 52, 101, 10, 116, -6, 108, -1, -6, 2, 35, 67, 70, -42, 56, 29, -117, -40, -37, -41, 109, 54, 6, -32, -43, 29, 80, -21, 24, -3, 65, 11, 199, 27, 20, -12, 32, 35, -48, 0, -83, -75, 10, 48, -36, -5, 41, -23, -25, -110, 0, 10, 62, 66, -46, -109, -11, 83, -32, 26, 37, 34, 81, 60, 61, 61, -97, -120, 154, 13, -41, 44, -42, 34, 21, 57, 25, -15, 31, 28, 8, 45, 102, -50, 3, -5, -30, -44, -8, -42, 5, -96, -79, 123, 55, 45, -36, 6, -50, 78, -34, 23, 47, -23, 20, -22, 98, -50, 22, 88, 63, 67, 61, -51, 0, 43, -150, -38, 14, -9, 64, 0, -8, -8, 56, 32, -1, -22, 10, -53, -66, 35, -66, -82, 65, -68, 37, -42, 43, -7, 30, 155, 94, -7, -73, 103, 27, -17, -31, 44, 93, -5, 35, 51, 10, -6, 27, -37, -15, -50, -158, -89, -91, 2, -24, 0, 8, -130, 30, -10, 74, -18, 46, 95, 21, -51, -1, -4, 13, -34, 35, 120, -73, 9, 83, 3, -12, 48, 17, -34, -61, -49, 43, -46, 40, 46, 12, -51, 21, 16, 16, -108, -11, -17, -53, -28, 66]
8112F6p8l6K0OL9J0m7J06o6o9J19lol3K7j2oq0j9J06l7p8R4M7k0l0M6r7ql7m2
8143a18P0Q1j54K18o8j0Qkk5O4oj05R5l4j22J13q4P8P1r7O5p5J48J0j30jj0J08
8171H8q4j3P2p6mj4N6r5L5P2j02Q5P4j36O9n9N3j8OK9
$$ y = [66, -12, -48, -28, -22, 17, 27, -20, 86, 20, -49, 70, 67, 61, 28, 55, 43, 37, -43, -62, 44, 7, -71, 23, 70, 50, 20, 66, -31, -39, -76, -118, -48, 33, -121, 97, 29, 19, 27, 25, 0, 64, 58, -47, 48, 14, -108, 5, -79, -1, 70, -27, 38, -37, 111, 121, -9, -10, -20, 88, 4, -9, 63, -13, -17, -31, 25, -70, -35, 37, -65, 20, 94, -42, 27, -32, 21, 3, 9, 38]
8191C8
$$ Imaginary data points
##PAGE= N=2
##DATA TABLE= (X++(I..I)), XYDATA
0@%%%%%%%%%%%%qJ6j6J6k4L2l8M6n6O4p2Q8j04J22j46J69j93K24k56K94l36L80
34B02m31M87n47O14o89P69q57R53j057J173j300J438j589J752j930K128k344K581
52A353k844L137l463L827m241M714n256N889o641P549q671J0099j1988J4625j8593
67a0504K5322l9770J27239r2890l1677K61403j22056j21710Q7758O2241r1246
78E4110j6341K8609R539k1236j8742l7751K7189M1127m1669n4942M0443J9856
90C0192l8444j8532K7673J2380k6069k9676L0069L0220l4620l0228L5803K2030
102A0798k9526j6838L0083J4497l0661j1933L7172J2399l5147j0846L3640J2551
114A6189k8996j2271L0261J2581l2021j2680L5580J3789l7746j5245L6167J5548
$$ y = [0, 0, 0, 0, 0, 0, 0, 0, 0, 0, 0, 0, 0, -8, 8, -8, 8, -16, 16, -22, 24, -32, 32, -40, 48, -56, 66, -80, 89, -104, 120, -136, 158, -178, 202, -229, 258, -289, 325, -364, 405, -452, 501, -556, 617, -683, 755, -834, 918, -1012, 1116, -1228, 1353, -1491, 1646, -1817, 2010, -2231, 2483, -2773, 3116, -3525, 4024, -4647, 5452, -6536, 8089, -10504, 14818, -24952, 102287, 9397, -22280, 239123, 117067, -4643, 83115, 145356, 54110, 37769, 66378, 75917, 54681, 35939, -1812, 25377, 66504, 24835, -30107, 10336, 30192, -8252, -26784, 889, 13269, -12800, -42476, -12407, 17813, -16807, -47035, -11232, 10798, -18728, -35566, -5483, 9014, -21647, -33580, 3592, 15991, -19156, -30002, 3638, 16189, -12807, -25078, 5183, 17764, -14257, -26937, 8643, 22432, -15314, -30559, 5608, 21156]
126B1156l1899j7214K6755J9574k5207k2952K7193K5486k9707k6425L0640K6838
138B4238k7010k5085K2450K4154j6353k2946J4151K4061j3249k4292J4046K4970
150A9135j2618k3316J0090K1219o153j7962M002J5591l094j4442L996J4344m958
163E834j4261M980J3015m250j1185L315Q807m438p231O101O452p993p414Q568
177C00Q873q615r897Q335J0185r238r364J1179Q615j2925q507J3279R543j1678
191H5j1358Q934J3082p080j4003O662J4211p977j3745Q821J3436q261j3031N366
205d858J2681j167j2744j708J2764K271j2486q71J1472k21j0453m0R065J730p399
220a964m203O049M971m619m582M068K704l777p00L606j53k931q2J962M95r40M1
$$ y = [21156, -10743, -27957, -1202, 18372, -6835, -29787, -2594, 22892, -6815, -33240, -2600, 24238, -2772, -27857, -5407, 18747, 2394, -20552, -6401, 17660, 4411, -19881, -5835, 19135, 6517, -16799, -6709, 14510, 8357, -9605, -5603, 9988, 6894, -7548, -3552, 10792, 5834, -8427, -3447, 9568, 5318, -5867, -2552, 6255, 1817, -5414, 687, 7139, -854, -8268, 300, 9173, 558, -9339, -1004, 9181, -57, -9421, 1758, 10373, -2552, -11059, 2220, 11763, 85, -11273, -2339, 10743, 3663, -10340, -3678, 10533, 2556, -11189, -2368, 11068, 2807, -10224, -4858, 7823, 6656, -6088, -7796, 4968, 7239, -5247, -6118, 5354, 5133, -5320, -5360, 3705, 5435, -1964, -6167, -118, 4853, 234, -4348, -280, 2424, -1353, -2053, 1553, 1400, -1531, -1613, 349, 844, -96, -55]
237e5K81j603m66L666J234m950k272N002L073m365l340L814L604m355l855N619
253A032M537o589n361O336O336m754o924K952O757j507o563J511O262j913o363
268d251J799O857q82o814r44O271K513n130l271L848K927l069k103K721J891k791
284d28k487K476L379j563l587K25K890N81j377o29j92K45J075J56q81m31O22K19
302B93r91M44J991m42l380j54M223J291m100k554L429K971k841k602K516K470
318B564l036k695L412L505l144m520J944N107n05m861n44L966R26l346n30L007
334A250M46l233r24L378K259l201l212K113L797j168l301M13K384l55j695O38
350d11J528o42j854L0K210J095k070j824J265J744k4r84q48K52P37O06r09l28
$$ y = [-55, 226, -1377, -1843, 1823, 3057, -1893, -4165, 837, 3910, -455, -3795, 19, 3623, -732, -4587, 1032, 5569, -1020, -6381, -45, 6291, 1537, -5387, -2435, 4322, 2815, -3748, -2237, 4025, 2112, -4251, -2452, 4405, 3523, -3291, -4235, 2036, 4549, -581, -3852, -4, 2923, -146, -2249, 472, 2363, -428, -2915, -439, 2940, 1377, -2210, -1985, 905, 1486, 109, -520, -712, -467, 608, 764, -117, -548, 74, 293, -698, -254, 1737, 1295, -2085, -2239, 1984, 3275, -825, -3379, 50, 3021, 180, -2422, 94, 2564, -472, -3167, 245, 3750, 606, -3914, -1970, 3137, 2632, -2229, -2773, 1193, 2119, -1227, -1757, 1250, 1696, -1537, -2461, 917, 3176, -25, -3237, -1124, 2673, 1505, -1796, -1383, 1001, 646, -1049, -411, 1117, 475, -1379, -1349, 861, 1956, -114, -1938, -673, 1071, 1047, 63, -785, -533, 204, 810, -99, -427]
368d27R57l51j471R29K026m83k577m27K269J749j553k356Q64K119n65j575J063
385A91J015j310j349J245J873l93k301j118K182K145j667k363R04J859m70j176
401g33M89J161p15j607M76K721K93l256j132K968J536j951j375P99J022n56n69
418d29O69O90p36j666P02K429p6k564q66J883J415p84j383o1J212rj049L60J363
437A100j047j919J062K204j44k241o75J428J307o47r67M9M57j43K30N65L5q37
455a83m32L73Q21N83q35j309J93J533M77j186q62L05R26j47n01M26L38j034o13
474a127J421J197j113j583K50J489N98r28j286N72R93m01o34O87M01j175o49J201
492h7J501p10k142rK255Q15j761q52J356K48r00K41J229l26j628j90J474J045
$$ y = [-427, 530, 179, -1292, -363, 1663, 1180, -1397, -1824, 445, 2194, 641, -1715, -851, 1268, 703, -872, 191, 1206, -104, -1453, -208, 1665, 1272, -1029, -2147, 35, 2180, 513, -1850, -946, 913, 443, -733, -244, 917, 202, -1405, -929, 1792, 2085, -1171, -2303, 665, 2201, 250, -1125, -326, 696, 140, -429, 240, 930, 194, -1472, -770, 1659, 1583, -981, -1847, 36, 1451, 667, -716, -777, 435, 426, -623, -263, 1100, 53, -1866, -804, 1400, 1256, -985, -1660, -232, 1075, 428, -539, -490, -33, -176, 54, 619, 654, -183, -615, -242, 579, 1162, 327, -982, -789, 744, 1221, 35, -827, -522, 404, 257, -244, 182, 520, -514, -1127, 294, 1491, 378, -1205, -955, 534, 1132, 204, -1082, -510, 483, 82, -552, 135, 536, -639, -1288, -87, 1414, 704, -1438, -1447, 808, 1623, -138, -990, 366, 614, -286, -45, 1184, 858, -770, -960, 514, 1559]
510A559j083j567M11J231M9n41k96j04j56L42N06Kk01o61n15P78J234l95j528
529i35L4Q93M55j12m28m79K07L41J99J72l5o91l69Q47P65j48o65p00J68J268L67
550A154r76q18N60L71j19L0J92n44o14N8J296L63j208j204P13J294k8q48n0Q0
570b98RK53M00n0n10m03P8R88O27q72j101L95R51L23n28n25P1L79n4l5N01k84
592C15j088j0J562L14j198p09M53O01J29j53l70k97j04L03P10j3p82m45L77O45
612B40L72k12q19k43O87O05p1m79l46o9K46N03O3n65n10J37O70K77l85l82j95
633d76KN71P39n16j227K69Q91K14l97N4j71n07L58O77K95p81q40L38J243Q2q73
654e5n14M40Q1J9N42p6p68l28N81O28J07o44p35K97P89J36m20l22m9J9L89L25
$$ y = [1559, 476, -1091, -680, 551, 600, 59, -237, -341, -497, -155, 351, 353, 152, -509, -1024, -246, 988, 593, -935, -901, -8, 447, 335, -93, -572, -365, -24, 175, 347, 312, -379, -748, 99, 864, 716, 51, -649, -481, 787, 1154, 178, -640, -80, 291, 172, 202, 394, -150, -764, -706, 590, 953, -255, -1459, -746, 548, 520, -328, -378, -298, -289, -36, 364, 314, -196, -599, -521, 467, 1094, 222, -879, -484, 467, 790, 262, -263, -192, 187, 133, 98, 599, 315, -773, -783, 779, 1093, -105, -814, -361, 240, 369, 216, -154, -451, -555, -252, 458, 445, -337, -782, -405, 240, 612, 400, -419, -662, 25, 630, 559, 80, -266, -335, -89, 414, 477, -88, -598, -461, 209, 486, 101, -281, -476, -474, 97, 836, 320, -907, -638, 253, 467, 70, 124, -47, -554, -196, 481, 776, -5, -845, -507, 736, 818, -55, -569, -129, -48, -29, 513, 437, -331, -659, -78, 550, 657, 13, -722, -425, 364, 500, 80, -242, -291, -272, 117, 442]
676D42k79m04l37K69Q00K19r87k36L18L61J68J06j65q18M6Q56M10l90p36j52N44
697C5N13k56j93r1n27P8R30K22r72m91M87M44P9n3l33l34J25M82K15l2m81n02
719f55M59O09N0m46n32J17N26M57k82l53j67J9O1O35K01q77m72N46P25j55m78
740a2m17J06L19K75K0o8o26l20R15M18n29m29p7J28L37L80j68n22k05L68M83J62
762E38m52o03K49K93K80J9k32o39J91N62K37j56l63l47M2O20M41o36n78P6N75
783A17J24q0j58l02r3J83N69J30o23n27M41O63j94l47L3k29Q4M54J76l50l27j01
805c57K96N41J8n60l95J95L11N43k73n97q3K81J34K19N6o14m00M01Q54k56n16
826b02j68N2L13K73N0l95k52p8N35N35n28m90J64K27J54Q2J42n64l77M25P19j48
$$ y = [442, 163, -241, -578, -309, 491, 710, -277, -513, -195, 166, 334, 440, 275, -543, -497, 359, 769, 379, -357, -509, 35, 548, 292, 99, 8, -519, -441, 489, 711, -261, -752, -265, 179, 258, 205, -128, -462, -337, 145, 360, 328, -153, -655, -196, 413, 463, 17, -515, -398, 128, 585, 303, -50, -217, -198, -137, 498, 699, -178, -650, -104, 621, 466, -12, -429, -323, -4, 271, 291, 223, -403, -723, 192, 610, 81, -348, -425, -297, 40, 420, 252, -270, -475, -107, 376, 538, 86, -517, -268, 25, 305, 324, 92, -547, -356, 206, 443, 287, -76, -423, -381, 239, 680, 44, -534, -458, 117, 241, 161, 3, -299, -392, -209, 360, 490, -133, -660, -219, 444, 250, -97, -64, -293, -209, 245, 421, 71, -256, -357, -61, 480, 498, -62, -457, -262, 49, 592, 319, -278, -361, -80, 54, 273, 329, -285, -685, -284, 570, 314, -202, -370, -318, -5, 268, 318, -77, -329, -407, 128, 663, 135, -355, -191, 36, 190, 272, 414, -150, -527, -102, 617, 469]
848D69o12k31J70M31J27l22j16j93M4K26M98l09m95m5J60M11L74n01p44L18N37
869A97J36k34n8k55k33M82M07j44n55k55L03O03N1n42k14J83N4K58L17l54n58
890d11K0O41Q0j91j08m03L4N20K82k18l77m65M71M70n6l28k46l6K61L63rl16l41
913c63Q5L13K49p1l59l55K82N00P4k88m80J43L74J34o4N4l35m13L77P55p4q92
935c54j53N10K95j30r5j76j06Q6K84K98k38n24j39M19L98j24l59l15oO19K25l15
957A00k53r6K05Q7K87j01m75j54L12L71J7m75k52K19K69J00O2k47l45J23M78Q8
979C20l25k6j12m7L66L46k54n41m7L37L83r0m68j81K95P6K6J09j71m02K8M94K00
1002C16j92l23k63M11L96j09m05j54J84J95J06O2k08j98j01J86N33Ko50l04M28
$$ y = [469, -143, -374, -204, 227, 354, 32, -84, -277, -233, -7, 491, 182, -313, -358, -198, 213, 587, 86, -658, -340, 197, 333, 99, 41, -214, -447, 35, 442, 298, -257, -512, -209, 394, 445, -97, -311, -128, -74, 184, 501, 147, -411, -391, 250, 330, 139, 31, -372, -338, 182, 464, 246, -131, -596, -125, 345, 289, -39, -285, -321, -60, 303, 294, -22, -363, -278, 35, 284, 213, -146, -501, -219, 281, 355, 67, -413, -270, 104, 238, 174, 228, -107, -520, -143, 612, 538, -354, -507, 3, 298, 168, 73, -103, -209, -123, 161, 459, 221, -303, -442, -23, 375, 251, -108, -423, -429, 190, 415, 100, -153, -249, -44, 43, 330, 229, -246, -400, -88, 283, 300, -175, -427, -208, 61, 161, 223, -24, -369, -246, 232, 320, -5, -31, -143, -190, 176, 522, 268, -273, -320, 17, 400, 310, -158, -339, -44, 32, 58, 167, -4, -406, -378, 116, 316, 124, -199, -462, -51, 345, 236, -169, -323, -139, 56, 162, 224, 16, -182, -283, -97, 436, 438, -212, -516, -88]
1023h8N31k65k37J2j34P5K40J93k68l47QL11L06r5m69j12M9M39Q7j15m07q7M40
1046F7P0OO0l00k50K64L89o4l76k21N1L29L14k12j97k55J46L59J95l08l26J14
1068a45J72J73Q6k05m14j01O08L56k85n50k9K27K37P0j35N0l95K4N00J78l32l82
1090b92M4K80K18J3k29m30K73L22o1O0j75j78p6L41K02j16l28k61L41M67k27l68
1112a80J5pL8K83K42l51l96R6M06J33q2m14p8L53J51M5j28l34j00M15K49j62k58
1135f4j27K0J02L23ml62k44K12K63K08k73k85j39K99K22J04k00l72m1M17J29m5
1157A43j17k41j27L42M02o0n63m2L54j0J39j34j88k59J40M59J39k98m34J47L25
1178A17N6J6j86k03m7K88L69l00l43k2J06K83J54j67l94j6K05L24Kl53j15J4K70
$$ y = [-88, 443, 178, -59, -47, -181, -106, 134, 327, 59, -288, -280, 31, 337, 242, -227, -339, -290, 149, 236, 121, -286, -373, 67, 137, 143, 203, -97, -347, -83, 306, 242, -134, -355, -304, 25, 339, 127, -70, -325, -179, 180, 375, 67, -259, -145, 27, 200, 286, 81, -333, -434, 174, 530, 245, -305, -334, -107, 130, 200, 65, 115, -280, -256, 244, 422, 90, -292, -248, 32, 250, 263, 34, -396, -123, 199, 138, 198, 23, -155, -231, 110, 312, 196, -132, -393, -52, 415, 188, -180, -165, -172, -134, 149, 391, 40, -356, -260, 146, 279, 197, -217, -295, 58, 209, 254, 126, -208, -308, 107, 356, 194, -64, -191, -171, -69, 254, 250, -112, -356, -144, 119, 327, 54, -231, -370, -71, 151, 255, 55, -317, -358, 59, 188, 143, 26, -215, -342, 0, 402, 342, -221, -263, 91, 81, 220, 86, -102, -361, -221, 238, 377, 79, -355, -208, 117, 173, 189, 3, -200, -247, 41, 410, 110, -233, -255, -149, 134, 288, 121, -273, -289, -84, 240, 242, -111, -226, -212, 58]
1201E8J80q9j89l65K31M51L9l22j08q0P5L10K0r7l83J0K34K61j1l12j74K30R6
1224F5R6k8j45k48O8M41j1j59j95r0K28K24j4l53q0p5M20J66j51k36n1j8K00K47
1248C01j47m54j15L91K61j71j85n1N1N4L30mk84k15NL19J50j79j69K9o0K68K91
1271D16k16n68J95L79Ql2q7k32j10K75K63k0l66j51K7L22K23k97j97j00J25K42
1293I9R0j63l39J74K03j0J36j45l40K4K58K06j05k68p7K60P4J3K3j11k63J68L15
1316B22K05m55j48J12M0K10P1l37j72K05K44J7j49j95j79L05J63J4j11j93k29
1337c60K08M19k2m94l9K56n0K28J50k89l28K34K17R2p3k81n7R3K32J08j53l48
1359b57J66J08L54k91j05j07Q2L0K87j27k34q9J5L32J1r4m01J93J25K50q7k42
$$ y = [58, 238, 149, -40, -405, -174, 277, 316, -6, -114, -194, -119, 191, 211, 114, -269, -259, -25, 236, 225, -87, -261, -31, 65, 161, 133, -12, -260, -192, 249, 238, 79, -116, -206, 22, 246, 232, -121, -201, -276, 144, 310, 159, -77, -128, -146, 54, 301, 154, -300, -415, -24, 237, 66, -119, -170, -119, -65, 265, 261, -23, -238, -233, 86, 236, 57, -112, -83, -143, 125, 416, 200, -368, -173, 206, 214, 182, 95, -137, -247, 28, 291, 271, -95, -246, -219, 103, 326, 29, -168, -268, -143, 99, 189, 26, -313, -139, 64, 54, 190, 45, -295, -271, -13, 193, 88, -180, -257, 3, 77, 90, 113, 2, -261, -93, 222, 427, -28, -176, -64, -24, 186, 257, -80, -252, -47, 197, 214, 65, -130, -309, -4, 159, 173, 62, -131, -360, -152, 267, 245, -249, -288, -32, -82, 146, 296, 7, -321, -87, 130, 222, 149, -132, -189, -96, 136, 244, 91, -257, -91, 17, 371, 80, -25, -132, -50, -20, 267, 140, -94, -183, -168, 164, 175, 81, -320, -127, -2, 248, 161, -81]
1381h1k07J17K19R9p5q1j09o8K85K12j90l80M4J90J04J05j11l46J35N8K13J0j61
1404a8j27Q1J87J29j29j04j98K9K43J65k09k20mJ72J02j9j07k08k1K36K80k5l57
1427a22j27K56J64l8l7j70p8L7K20K04k87j31j2J07K17l8k15j58J9K98K28k01
1449A36m02N8K98o2J5M7j01k15J99J84P6k48j52J4K22K79k43k22j52J90J23J38
1471A82j84j25R2l0J3L27j13l64j08L97J39j58r1j64K5K16Q1K7j28l46J04K58
1493E0J41r5j83J8m2L96M0l71k07J62K26L4j39M3k41J8J35K40Jl73j04j6N42q2
1517A93k74j30N9P0K04L3j55j88Q6J51N7L7m0l14P5L18J07k12k76kJ66J58q4O4
1541A03j77p4q3L59J38l25j84J93K15P0j31j11lp3K60K1q3k18J3J9K90M9k17j70
$$ y = [-81, -288, -171, 48, 147, 72, -9, -118, -186, 99, 311, 121, -259, -215, -25, 79, 184, 73, -273, -138, -80, 133, 143, -18, -145, -64, 123, 252, 123, 19, -179, -150, 93, 258, 49, -171, -175, -3, 99, 80, -27, -235, -256, -20, 260, 235, -122, -249, 7, 171, 133, 96, -74, -152, -115, 105, 309, 22, -109, -121, -14, 203, 165, -50, -208, -189, 109, 337, 136, -266, -208, 90, 28, 43, 90, -11, -226, -27, 157, 233, -15, -167, -153, 69, 348, 105, -117, -269, -79, 44, 182, -2, -127, -35, -65, -52, 275, 162, -202, -310, 87, 226, 68, -23, -187, -162, 54, 135, 162, 34, -312, -208, 50, 191, 96, -87, -69, -111, 285, 325, -46, -253, -91, 135, 169, 30, 73, -168, -150, -15, 225, 226, -147, -251, -267, 275, 193, -81, -211, -152, -82, 122, 155, 0, -188, -102, 49, 106, 143, 103, -211, -136, 182, 289, 77, -199, -201, -35, 123, 39, 103, -74, -148, -231, 128, 266, -59, -243, -50, 165, 235, 104, -7, -10, -83, 177, 198, 115, -103, -90, -71, 219, 268, 51, -119]
1565a19r1K30K27j13l08J6J66m2J82O1k60j55J20K64R1k60j56o2K17J49rj88j23
1588a63Q4J28J44j94j36k4J90n4P9Nj63j27J82K35Ol60J61m6J03LN4n5k27L0K51
1613A06O6o0k07j78K05J46J49k12j14n3J17J12O7j13j31j15K08J83M5m01j09L37
1635D8J99j28j36q8M5J7J70N6j52j05p6K20K21k08j53k61L02J95j9l9k19R5kJ08
1659I0j3J8j89l02K61L99J1l84n7m1K93J59l01rk1L4nK29K7l08j51L56N8o5n6
1684C3l23J35J38K15j58j50o3Q7M3J19J4K4l62L4L30K00k44k07l5L40r4q2j5j37
1708a58J3J13J92l8m2j36j26K99J65r0k79j09K36J17j15j76J72j14o3J22L10j02
1730A91m66J20K28J77j76k59J4J98J55j58m1P4j52M3J42J39j44j98j36K53K06
$$ y = [-119, -210, 20, 247, 134, -174, -158, 8, -34, 148, 209, -51, -206, -86, 178, 269, 9, -147, -209, 8, 157, 148, -40, -163, -79, 49, 193, -1, -137, -161, 29, -25, 54, 59, -104, -231, -49, 186, 192, -168, -7, -53, 50, 53, 107, 52, -175, -145, 106, 172, 112, -95, -273, -68, 78, 227, 15, -99, -152, -35, 77, 144, 31, -100, -215, -7, 176, 221, -180, -289, 48, 247, 119, -17, -105, -60, -43, 127, 183, 31, -74, -150, 70, 291, 83, -70, -331, -29, 166, 147, 108, -111, -16, -18, 90, 77, 95, -94, -396, -135, 264, 275, -109, -166, -207, 86, 245, -56, -65, -86, -52, -57, 172, 199, -109, -260, 96, 154, 89, 33, -290, -155, -17, 198, 40, -110, -173, -86, -43, 76, 90, 114, -248, -214, 116, 316, 72, -135, -170, 170, 76, -6, -21, -158, -145, -32, 160, 122, 80, -56, -182, 117, 282, 192, -87, -196, 40, 157, 42, -134, 38, -76, -139, -17, 293, 191, -275, -155, 73, 250, 74, -185, -171, 27, 182, 24, -17, 57, -95, -52, 90, 229, 85, -113, -249, 4, 210]
1751B10m5k65o1J43J40r6j07Q0mj74J78K43M9l77k15K16L69j37l62K2K38L7J08
1774A90q9j03N2j30l5K69N4k86k00K08K96k1l18j82K50K61j58k03J34J09k52P6
1796g8J59K03k66k06R7K11J66l23k09J84J08j10J2O9K2j30n3J59K15j93k81j43
1818c87O31J7k06l88L24J97p8p8M1k6q3j4J31J64n7m31R5K41Q1j64k06Q9J73N9
1842A25m1j57J74r6k27K59K09n8l91j06L34K18q0l34J03J92l3k09K07Q3l06O3
1864g1Q8K17j39k78k7K15K37j07l58L9J99J23j92Q1K9p2k02O2L51J32m25j78K14
1887f2L64j55k85q0K54J87j92j04J55r7j00P9K29P7l36j97J82L23Ll81j19K84
1909B9J55j57j23J95j46j24k2L67J71l74j31qK99m6j20j49J27K06j91J21K1m3
$$ y = [210, 165, -100, -161, -18, 122, 26, -81, -1, -5, -179, -1, 242, 291, -86, -301, -85, 284, 147, -215, -193, 45, 82, 190, 101, -2, 50, -80, -115, 154, 208, -78, -278, -70, 226, 205, -113, -295, -45, 216, 58, -145, -11, 98, -154, -78, 81, 284, 18, -188, -91, 120, 286, -37, -246, -62, 46, -64, -52, 17, 39, -91, -144, 15, 230, 37, -244, -387, 244, 261, 55, -333, -9, 188, 110, 32, 73, 47, -36, -50, 81, 245, 188, -243, -148, 93, 174, 10, -196, -107, 66, 125, 84, -73, 101, 5, -222, 37, 246, 188, -203, -309, 25, 243, 163, -171, -68, 124, 91, -118, 89, 172, -134, -71, 17, 234, 95, -183, -210, 5, 242, 135, -223, -184, 15, 138, -54, 27, 56, -16, -218, -156, 195, 327, -98, -276, -62, 302, 147, -138, -218, 36, 223, 31, -73, 82, -15, -115, -36, 193, 270, -66, -263, -81, 242, 245, -136, -255, 29, 184, 27, -96, 99, -47, -171, -193, 174, 345, -29, -160, -168, 131, 85, -35, -184, -57, 149, -42, 79, 100, 57]
1931E7p7j63K10L01k61m10J66K76J20k12j89K67K9p6j81R5K39l13NJ86K10k26
1953E3k75NL50J7l8k09n9J83L7k02Q0N4r5j22J25M67k55k18j82K42K98j12l29
1976a85J65J03j05M6J15n7j40p3NL25J5l29j60K50L59j86k08p8J23J62j94J18
1998G1O3j14j44P2K40J6l20j50K14K83J5l77J3J33M2m6N1k0n3j52J20J69N5j07
2022G4k71Q7L51m8l04n8K10N1j26jK02l2j69j57L62J05k62k66P7K69Q2k89O3K5
2046b5R1p1L7O4j37j69O8K61l9o4j94J6J65J80j71k11J33J59j28o5J82L3k21o9
2070a75J88K54k83j83J58N4J29j15q1J05j5l0m3J95j94p5M9m9L15p6k74j30L16
2093D0J15j99j00J15K3o5J47N0R4l95j00K62K17j15j30r2J69R3Nj98j6J86j04
$$ y = [57, -20, -183, 27, 328, 67, -343, -177, 99, 219, 7, -182, 85, 114, 38, -143, -48, 191, -122, -117, 69, 279, 53, -222, -217, 133, 150, 112, -97, -156, 27, 64, -138, -58, -4, -99, -221, -96, 371, 116, -102, -284, -42, 256, 144, -185, -20, 83, -22, 24, 139, 82, -58, -131, -126, 199, 214, -115, -275, -25, 334, 148, -60, -138, -15, 147, -47, 71, 134, 20, -124, -52, 188, 204, -116, -266, -52, 231, 246, -131, -118, 15, 57, 11, 62, 42, -11, -163, -43, 126, 181, 74, -197, -110, 241, 193, -111, -169, 41, 92, -34, -35, 167, 135, -34, -191, 171, 276, 14, -252, -175, 94, 176, -113, -50, -25, 66, -5, 32, 96, -41, -210, -142, 119, 80, 16, -178, -162, 3, 183, 12, -199, -66, 93, -35, -100, 82, 115, -106, -175, 13, 267, -16, -199, -41, 13, 142, 27, -54, 51, 36, 6, -37, 158, -36, -111, -62, -111, 204, 128, -146, -276, 40, 155, -44, -144, -29, -6, -71, 76, 126, 220, -175, -275, -13, 204, 89, -41, -133, 36, 129, 134, -64, -80, 106, 2]
2116Bo2O9R4mk74J41K03L7l78o1J95K94j17l01J24J10j78J00J56j7l50J9J66J68
2140A36o5o1k57K29R3N4j49n6R2p2P8NJ46j05j92J5K45K59m89m5P8J61m6lo2K5
2166A4r3l2J53N8j74j14J18J00N1m8m9r3R9J67j53n4O2j06J78j43J39j42p3PJ94
2191F6J04o4k65R4J47j9N2j12K3k10J33K39n5k43LK7J39Q3j41j22o8K61J2l6j49
2216a01Q1N7n9K8J32n5j38n4J10J77j96j01O5R0pJ4p8l6L6j30K16N3kj47j36J65
2242a6K41j43j62n4K12L3n6q1P1j0j86J11J71j09j34RR1O4J0l5r4R0L3J2R1j96
2268c7R7j2j5O9L7j77j62P7K86n2j93J7P2J06p3M0n6q7K5k1K06k4j19j86J32J0
2294d0K51j42k39J87P7q4o4j0J00p1J1J56k8o7n4k32L72J00q5k32L5K04q0l2l0
$$ y = [2, -60, 9, 103, 99, -175, -34, 169, 206, -172, -233, -38, 256, 139, -162, -38, 72, -106, -6, 150, 133, -217, -198, -32, 136, 71, 10, -247, -18, 75, 129, -20, -76, 16, -56, 22, 27, 173, 68, -124, -109, 136, 395, -94, -139, -61, 100, 54, 51, -11, 14, -79, -111, 42, 100, -74, -188, -70, 30, 81, 33, -16, -109, -10, 157, 4, -50, 12, -94, 84, -59, 80, -62, -135, -128, 66, 170, 106, -159, -65, 82, 63, 115, 3, 26, -184, -51, 188, 133, -110, -107, -80, 59, 142, 1, -121, -189, 72, 84, 48, -101, -20, 37, -22, 6, 138, 83, -55, -109, 1, 178, -18, -119, -54, 36, 29, 43, -35, -71, -35, -165, 51, 104, 102, -45, -181, -16, 225, 82, -80, -134, 78, 111, 55, -26, 45, 35, -151, -40, 131, 22, -112, -103, -12, 52, 62, 27, -67, 23, 56, 68, 159, -37, 60, 48, 33, 102, 139, -38, -200, -123, 163, 111, -82, -65, 7, 113, 40, 80, 24, -63, -38, -59, 147, 123, 4, -182, -50, -40, 211, 69, -170, 17, 94, 10, -54, -64, 36, -35, -24, 132, 104, 37, -17, -249, 123, 223, 138, -94, -59, 145, 65, 33, 3]
2319CL8j62J03J1K30k04r9j53K21J80k24o8J10O1N7L5k14RM4m4J18L4l6j65O4
2344e1L8J89j20j70k1J06N5l9O9m8l8jJ3Q3P9k59J37pO7O7j63j05R0J10r1o6M9
2371b7l1j05M3J81J0j51j07J57J70p0q4J7J3j06P1J8n9p0%J38R8n2j35o7l1K71
2397I2M4j15r5q0J95m4k5M5L8j20N7J56j3j32j71J27J16J72k44j19J9J02l6J49
2421A18n0k38N9K03k12R2O1k02J7J39Q5r8p9q4J32M5k5J09m4j13J18J7L5q3j18
2446a16J3J06P8k7p6l2N7J45p7r9N6q3R7pN3l1j82k5N4K71j38o4j03J50l7J22
2472A05r1P5j91L8J26on6%k6n9J99J9k18m9M4J50Ok9o6k1J6K3J3P4j36j07J00
2499f7K1J69j17K5j72J21J03k0j17K0m6O8L2j4o2ON2pJ34J3k20mK77k17R7j9j82
$$ y = [3, 41, -121, -18, -7, 223, 19, -80, -233, -12, 168, -56, -124, -14, 47, 104, 139, -75, -66, -22, -66, 52, 86, 50, -115, -51, -13, 176, 56, -114, -135, -29, 26, -13, 56, 8, -30, -31, -18, 65, 144, -115, 22, 15, 82, 149, -14, -119, -29, 81, -10, -76, -27, -58, -163, -120, 61, 71, -80, -187, -30, 140, 70, -14, 3, 16, -90, -19, -1, -60, -130, -130, 8, 106, 54, -81, -148, -179, 92, 136, 21, -74, -154, 41, -3, -28, 17, 55, -65, -8, 148, 135, 3, -168, -41, 75, 247, 3, -116, -97, 5, -31, 118, 68, -170, -111, 92, -120, -28, 33, -169, -152, -13, 72, -26, -105, -189, -57, -12, -37, 72, 28, -85, 33, 50, 85, 2, -116, -103, 3, 81, 54, -22, -54, 3, 148, 71, -28, 28, -55, 42, 35, 88, 57, -125, -150, -96, 175, 37, -27, -130, 20, -17, 105, 14, 89, -102, -64, 62, 56, 0, 0, -26, -85, 114, 133, -85, -134, -90, 60, 66, 37, -29, -50, -34, -11, 2, 76, -60, -167, -67, -46, 123, 6, 31, -141, -20, 83, 63, -54, -34, -80, -12, 20, 6, -56, -50, 2, -5, 129, 142, -78, -82, 195, -22, 75, 56, -126]
2526a26J22J16kj4n8j71j6J30J14r6q9M3r4J96N1j18K3j56J51RJ48j73k2j41P8
2551i5K43j27j08j04P5J46k1l4Oml9K19l9j02MJ8Q0k6J0r3r7O0J14n0j6r3KO3
2579hJ31q3k6j13M9j1J29qm9jp3K8J58j25J5k9L7l2J14o7j3o3M7N0oL5j67q9J48
2608b2J13M9r0q0m3P5N5L5n8n3M6L4J20j58j46R5nJ62K1j95M7RN8r4j8k0K0L1
2636a2M3lL6q5k4N0m4J51k38J12p7J09J0L9J7k08J32kJ03q5r7J27r1J02J29k73
2662g9m7J03n5J19J00l4qj02j8J76m6j35L5q5J2J44k0j04n1l4K39n0n1o3p8J12
2688b0j09J61O1j00nm8J32M2j47rO2k2P0J9j39m2N7R3K0r7L1p2J37lm4l9j48P3
2716h6J48M3p9J8r0J0RJ28o4j32oQ8JN5O1k02K9J13J1J8l5j10J6N2J79j89j0j8
$$ y = [-126, -4, 112, 110, 96, 38, -133, -149, -19, 95, -1, -90, -47, -141, 55, 106, -12, 11, -145, 6, 15, 163, -10, -32, -173, -95, 148, 21, -87, -191, -116, 30, 9, -25, -19, -23, -62, 157, 118, 16, 20, 38, 118, 92, 102, 9, -88, -28, 86, 36, 20, -73, -71, -8, 123, 40, 14, -99, -50, -61, 68, 60, 11, 10, -63, -35, 123, -2, 13, -16, 21, -11, 103, 36, 23, -40, 7, 57, 51, 86, -81, -170, -22, 91, 140, 50, -30, -73, 2, 57, 92, 34, -19, 27, 61, 181, 23, -123, -28, -33, 129, 150, -45, 2, 11, 69, -25, -43, -63, -43, -12, 31, 28, 64, -21, -45, 5, -39, 112, -126, -14, -91, 18, 28, 67, 84, -124, 8, 6, 109, 24, -73, 54, -37, 65, 194, -79, -126, -23, -78, 41, 141, 107, 99, -3, -21, 155, 109, -26, 9, -76, -64, 80, 60, -44, -95, -129, 110, 60, 9, -54, -132, -20, -129, 32, 93, -7, -12, -60, 72, 114, -33, -42, 20, -2, 68, 87, -52, -94, -37, 56, 76, -21, 10, -62, 75, 72, 28, -11, -159, -86, 62, 105, 26, 44, -46, -36, -27, 101, 37, -95, -101, -13, -12, 43, 104, -98, -69, 44, 55, 73, 38, -72, -56, -4, 175, -14, -24, -42]
2744d2J22l5PR6j78L3n8O2O1j26K1J2J07j29P6pj43N4J47N2j27n5m3N1J03j07
2770d6N9l4j21J22M8O6j41j02P2L8N8pj11j3Q0J11Jj05P6k14J43k1M6j5m2P8N
2797C1j4rQp6K3J19p3l7L8j31N4P3Q5j49J25k40J86R1lj48pM9j9M9J11j30j21
2824a15J09j4J89k38K0LJ3M2j3jr3N8NJ22r6P4n1k4M2o6O3o1kk7O3Ol2Q9j14j1
2854f0o9J73Nj28p3K70l3m7p7j3m4Q9J52j31n0L7m1P1O5j01q8P5M6J12j45k7l5
2881f7NP9jm8J0l8J5M1Q6m1j82Q9J20K5j52M0k5n7Q7P4k2p7p1J20m1n8M1L2k0
2910c6j1K07o2q3k8j38K41m7l4P8j09J4L0N4j06L7n0N1Op4R2j28R8Qj7J49k01
2937e9L6pk4R7q4M9J4lp6K04k36OL1K0mJ82l8j17p3K0L3l6P3j07J16J3j1K0j6
$$ y = [-42, 80, 45, 52, 148, -30, 3, -55, 7, 68, -58, -37, -25, 82, -47, 29, 22, -121, -67, 80, 132, 5, -50, -93, -42, 61, -46, 13, -21, -142, -20, 28, 94, -47, -149, -77, -39, 19, 12, -99, -112, -32, 79, 80, -25, 51, -163, -20, -41, 5, -10, -52, 26, 31, 17, 8, 16, -60, -37, 82, 9, -28, 10, -121, -67, 6, 91, -58, 67, -173, 13, 104, 101, -47, -54, -5, -24, 25, 136, 6, -115, -6, -20, 169, -69, -49, -46, -33, 9, -4, -5, -98, -40, -35, 87, -9, 65, 14, -10, 32, -34, 29, -32, -34, -61, 2, 8, -24, 65, -49, -60, -129, 44, 49, -79, -152, 118, 85, 38, -39, -52, -96, -7, 145, 14, -36, 1, -40, 31, 96, -5, -93, -18, 28, 140, -5, -32, -67, -62, 17, 16, -32, -22, -60, -45, -4, 82, 41, -141, -52, 68, 93, -59, -19, -44, -101, -14, 60, 38, -39, -110, 10, -31, -89, -48, -16, -36, -47, 160, 98, 15, -13, -151, 90, 43, 9, 87, -22, -8, 22, 76, -30, 7, -43, 8, 14, -60, 32, -96, 2, 10, -7, 142, -59, -23, -30, -54, 43, -41, 8, 22, 19, -57, 147, -89, -83, -52, -32, -36, 146, 108, -9, -82, -62, -29, -65, 8, -99, 17, 30, 19, 39, 23]
2966B3o7K5R0r3N4p3j8PR9O0j45j16K2O9J50j22L3n3L6L2rJ0J5%p4N9OJp4m9L5
2997f7L3M6J3l2J0Q2l4J6M9o2q8L0Q9n4j8n7L6L4o1K2mj8KKl3oJ15j7J9j13O5
3028an5K0o4J28k2m0O1r7N2M1r9Q6M8j09q9J51L3k1k2L8r1J3m9RN9mK06j89L5
3057B8o8k9J55jj35M7j28O7LJ14n4l9n0N8L0m8O1n4k3L3J15k6M0j66JQ1K2ln4
3086b3k9J7M9j2Q2j72o3J38l7Q9Mr8k1Q0M2N8j24Q6Qj68R5K8N9j61O3m7J23pn2
3115Gj5j0oJ41j41j08M2J51l9J9m0L%N9j8j4j04J09o0N3o3N8j41O1N5l8O5%p7
3144e1k4N5NO3O6j57J0K2N7p8j1J10j05N0J3J1j21l1J01J76j58R4o5o5J40Om1
3171G2j70J66j37J34nj38M3Q1j11J4J39j42PL1lO7k7k0k5m6J33m9oL7l5m8K6O6
$$ y = [23, -44, -19, 71, -22, 32, -41, -59, -52, 47, 107, -38, -154, -132, -63, 87, -35, -2, -55, -19, 13, 4, 14, 29, 29, -45, 14, 20, 21, -53, -102, -67, -34, 12, 25, -7, 3, 85, 51, 67, 116, 54, -34, -4, 85, 31, 13, -44, -8, 26, -35, -13, -17, -35, -33, -31, -64, -70, 45, 28, 47, -66, -1, -56, -36, -100, 28, 6, -34, 27, -70, -18, 23, -76, 10, 58, -51, -140, 11, 44, 23, 1, 39, -52, -39, -88, -79, -20, -24, 182, -7, 28, -40, -69, 86, 85, -50, -3, -131, -64, -61, 53, -1, -40, -90, -32, -2, -50, 11, -43, -66, -33, 82, 56, 96, -70, -69, 12, 34, 31, -23, -52, -35, 14, 2, 84, -88, -151, -13, -50, 39, 43, -55, -76, 4, 46, 104, -20, 66, 74, -94, 1, 29, 88, -73, -10, -57, 66, 59, 7, -8, -18, -24, 117, -24, -132, -90, 61, 22, 41, 1, 4, 4, 63, 45, 31, -73, 36, -24, 29, -34, 24, -117, -56, -1, -39, 26, 26, -51, -75, -20, -15, 48, 114, -43, -33, -11, 46, -32, -43, 67, -38, 12, 25, 36, -85, -116, -15, 161, 3, 97, 32, -33, 107, 113, 72, -98, 68, -69, 65, 60, -78, -35, 46, -65, -51, 88, -54, -47, -16, -19, 48, 21, 1, -24, -70, 63, 14, 8, 45, 10, -38, -12, 54]
3199E4oj54J37k6R5k2n3N5o8JK3L8pj04J2OJ4L3o8K8j7J31o3Lq9K7JL6Jj11R6
3230Co4O3j7l9l0J47j16JQ1j9o3J01P7r2k8j00N2K7l2O0M0l2m3P1nM7p4k6m8N8
3260@j8Q4m6n6K9Jj1j3p2M0q0J11O7KM0p9r0R3P7q5N4l9j4K1O0K4j58PR0j5J6
3291D0k8j30J39N0p1O9qp8J2m9p0J32j4r6J33K8L1q0j21O6O7p3Q4n9j25P5P0R
3319CKm6n7N0J28p6o2MR2mO1q5Mj0L1j18N3%O6r2R3%p7M1k5o8N4k7P6l1R2j40
3351f8J00m7L5l9K9K9q8Q7l6o5j02J89l0O7m5k8M1k8j20J81j33R3l3N7n8K7p8
3378f3J31m8lO2m4p1mm2M4P4m6m3J8po3M7q5J84j43J50l9j4loo3R0O9n5p4L4l9
3409e2L6Q7K8j62N8O9m3m9Q9m9M3j0O8k5j73K1O9O1p6M1j8J9P8j36P3l2K5r9j2
$$ y = [54, 48, -106, 31, 5, 100, 78, 25, 80, 12, 13, 36, 74, 67, -37, -25, -19, -5, 28, -40, -12, -29, 102, 39, 42, -47, -20, -19, 17, 18, -93, 3, -61, 2, -15, -54, -84, 63, -53, -52, 29, 10, -53, 48, 125, 33, 5, -95, -43, -16, -48, 12, 52, 20, -23, 48, 43, 90, 16, -10, -58, 0, -18, 66, 20, -36, -7, -6, -17, -30, -102, -62, -142, -31, 36, 38, 78, -1, -91, 2, 79, -6, 48, 9, -5, 16, 76, 100, -58, -51, 39, 24, 40, 12, -118, 21, 71, 0, 69, 61, -17, -5, -54, -124, 8, -6, -102, 31, 59, 90, 10, -111, -45, 22, -51, 33, -26, -151, -76, -6, 3, 5, -41, -98, -48, 80, 4, -58, -54, 38, 34, 95, 10, 14, 4, 35, -83, -30, -30, 36, -56, 37, 37, -40, 1, -24, -92, -38, -65, 11, -20, 72, -68, 32, -15, 20, -19, 10, 39, -49, 38, 2, -63, -165, 24, -6, 61, 16, -12, 29, 1, -119, 62, -71, 22, -11, 46, -12, 15, -63, 68, 20, 17, 79, 35, -36, -40, -82, -38, 36, -10, -53, -35, -42, -105, -58, -143, 41, -102, 48, 9, -5, -8, -14, -77, 13, 82, 27, -47, -13, -52, -16, 71, 99, -63, -5, 64, 21, -28, 61, 12, 55, 45, 113, 88, -85, -64, 5, 66, -10, 31, 13, 32, 110, -26, 47, 15, 40, -59, -71]
3438g1J16r8J7p2J28j6K1p4k8M2jJ6P3o5K2J9j39J11J20j56l9Pl8M7K02p8n8M6
3466E4l2J07r9p1m8K8J70Rj14r5Q4j01J73n4Kn2J5J2p1J62j51L4J22j32P0k22
3492b00M2J32K5J6q5L8P0k3J3j23J06Qoo0J3M2m5M8j8PM8j26Kk1R4L6jP1k25O9
3522e3mO0L1j9OPj01K8Q6j00l7NJ66j4rq5QL2Rl9J33j72R3k0k1o7R9o7K8N9l5
3553Gj4K2L6q7K4L4l1l4p7k3J87o2oK6m1N6k5M3m8J12j49J20j92M3J56n0j1jl8
3582b3P0n0L3j6Kojn5R8k2k3N0J1r3%lK0J0O0n1n8K1L6q4N9j3J1n6N4J15j9m7
3614C0q6J40j67NR2m1mJ7n3J35p1j5P9p7Nn8K8M1KO8n4rLM6m2k4qn8j4L8O6n4
3646d0r4K08q4j4L0qm0k3J20m1Nj6L2J2K7j14M9Qo3l4Q6j2m4j1lJ90p0m0KJ8p0
$$ y = [-71, 45, -53, -36, -108, 20, 4, 25, -49, -77, -35, -36, -20, 53, -12, 10, 29, -110, 1, 121, -35, -74, -67, -105, -58, 144, 66, 8, 54, 22, 129, 30, -41, -89, -61, 109, 118, 4, -91, -7, -108, 65, 11, 13, -39, -24, -12, -83, 79, -72, -38, 84, -48, 22, -200, -158, -26, -1, 15, -70, -32, 38, 15, 28, -95, 11, 19, 13, -47, -34, 8, -37, 11, -7, 0, 48, -78, -76, -97, -3, 33, 32, 103, -122, -53, -57, 3, 34, 15, 21, 28, -73, -45, 41, -59, -96, -91, 75, 61, 52, -33, -25, 7, 16, -23, 110, -62, 31, 11, -10, -77, 22, -45, -17, 42, 7, -7, 15, 51, -36, -12, 22, -9, -43, -120, -143, 44, -18, -24, 2, -39, 17, -8, 35, -13, 99, -50, 70, -122, -79, 77, 27, 16, 15, -23, 47, -3, 30, 14, 16, 10, 9, -46, 52, 30, 7, 57, 68, -25, -25, -28, -8, 2, 62, 11, -47, -26, 10, -74, -15, -28, -17, -73, -19, 96, 77, 30, -56, 84, -83, -78, 14, -27, -31, -14, -67, 68, -3, -18, 61, -16, -11, -69, -41, 0, 2, 70, 16, 7, 10, 56, 14, -10, -18, -76, -90, -52, 14, -40, -134, 74, -10, -24, 6, -2, -42, -65, 55, 14, 19, 3, 35, 47, 74, -40, 9, 17, -46, -80, 6, -6, -50, -61, -64, 126, 56, 16, 18, 36, -34]
3677c4J19o3kk8O0j53J8N8%M4j2o9J12l5J38j81q1J01j4M4n2p6M9J20j58K52k29
3704g2N6k0LN6jnj68J12J67n7j01R3m8j02J12M3k6j12l9J30J6J9o0L3l5N5q3M7
3732A3j22N3Q1N7o2L8j09M4K0m4N6o5N1r7J14M3m8o0p5J06J20p7K9p9Q7M2r9o3
3760d6L3p3J67k01J15l8Q0N2lj5j11J64n1q0l7J12j06j9K7Q7j7q8O4r2%lP6N3
3788E0j04M8J00j37N4OlK3m9J08m1o8K7k9n3J13k4QJ4l6K3m9M3j06J04l3k1j6
3816d8j7K8o5Q4Mj52K07o2j1%K7l7K01r2p9Kn3j6J33r0j5RO9l2J7j42J01P9np9
3846c4o1M3Q3j49K25j55L7R5n1K3r5M5q6P8j1N5n8N2q7R4j53P5MO9m4RO7m4j0
3875A6jl2Rk5R0m2P1p6j1J38o5o5N4mj22Q0k9k4j5M2llQ4p3J0K2M8r8J63k01l
$$ y = [-34, 85, 22, 20, -8, 52, -101, -83, -25, -25, 19, 7, -62, 50, 15, 153, -28, -109, -8, -22, 22, -30, -106, -57, 63, -95, 157, -72, -16, -36, -33, 23, 22, 17, -151, -39, 128, 71, -30, 63, 15, -87, 25, 68, 42, -70, -109, 21, 37, 56, -4, 29, -6, 49, -34, 13, -109, -56, 25, 82, 20, 58, -51, -7, 13, -31, 25, -40, 11, -86, 28, 71, 23, -37, -112, -6, 114, 37, 66, -13, 74, 116, 17, -46, -13, -86, 81, -120, -5, -43, 37, 89, 86, 71, -40, 124, 73, -7, -44, 68, -38, -57, -30, 57, 40, -48, 16, -76, -76, -79, -3, 50, -54, -6, 94, -43, 11, 17, 14, 37, -12, 96, 55, -13, 14, -15, -68, 45, 21, 29, 43, 7, 30, -19, 24, -82, 22, -11, -32, -48, -65, -37, -102, -18, -14, -166, 41, -21, -32, -32, -5, -42, 159, 67, -12, -10, -63, -79, 54, -36, -51, -42, 27, -5, 12, -130, -29, 50, 45, -34, -95, -52, 31, -118, 107, -48, -11, 84, 33, 56, -39, 6, -80, -2, -13, 42, -16, 36, -51, 43, -110, -35, -31, 38, -6, 3, 70, 26, 16, 15, -17, -8, -33, 57, 15, 86, 10, -1, 137, 72, 7, 61, 57, -65, 15, -14, -38, -53, -11, -14, -17, 67, -6, 4, 26, 74, -24, 139, -62, -65]
3906f5J35j18n9Q4LRN6K6q0J1l7P6Po2J36p1r9P0N9q4r2P4O4nN4r1N5P7j34m6
3936d7O6k9o8J00j03jJ38q0rR6k5l3lN8k2o1J10l4l0p5J11J9r1%M6J14j38p9M7
3965b3M7N2o0k2K5Jm4OL9J9n5k9k8K9P2q5J12m1Rm2k8J69j63M5kj0K2J14j66J2
3995b5K5j1R3qm3Rj9j6l2J04j7j31J08Q9j24J5N%p6RJ0L4J17j15k6K7j87J86o9
4024f8K1M4l4m2p0J41L1j17R5M5lk6r7P9K3r2M5L6J6j9mM9p5j0K9J3JMK2q2Q5
4055D0m8p7J17KKk3n9L8p4J00l8k2K9k9l8M4njLKjk3P3l9J02r0N1j26J09P2o2
4086B9j03P3m5j0k7J58p1K5m6N7m5KJ1nN1L0j60J92l9j65M2o4J46R5j31L0J7%
4114D7oq3N1m2O1m6nl2J49j27K1K8M3m3M9%l7J7r0P5p5M4M7J7j81J40q6M6K9O5
$$ y = [-65, 70, -48, -107, -23, -20, -11, 45, 71, -9, 2, -35, 41, 48, -14, 122, 51, -48, 22, 81, -3, -95, -21, 43, 38, 92, 1, 56, 133, -1, -47, 19, -10, -78, 22, -81, -82, 56, -24, -33, 63, 38, 5, 2, 60, 38, -23, 87, 53, 23, -52, 59, 78, -13, -13, 33, 147, 9, -70, -23, 24, 76, 16, -6, 19, 20, -24, -18, 21, 40, -15, -44, -72, -43, 29, -56, 56, 15, 24, -18, -46, 123, -40, 5, 3, -7, 15, 129, -37, -25, 0, -11, 82, 74, 31, 40, 21, 5, -27, 77, 60, -71, 37, 126, 2, 17, 22, 22, -54, -45, -35, -1, 116, 1, -25, 2, -185, 1, -68, -47, -3, -37, -79, -149, -8, 23, -94, 1, 46, 43, 17, -80, -1, 22, -70, -25, 11, 27, 8, 4, 53, -22, -32, -3, 10, 11, 15, 37, -45, 40, -8, -85, 32, 34, 36, 13, -46, -8, -82, 18, -20, -42, -13, -42, -80, -36, -41, -42, -39, -37, -38, -61, 12, -27, 75, -15, 36, -90, 19, 91, 29, -74, -1, -46, -56, -83, 75, 4, 29, -17, 40, -5, -3, 8, 3, 54, 84, -76, 116, 77, -88, -46, -110, 36, 131, 0, 30, 47, 47, 41, -42, 9, -33, 28, -18, -23, -55, 94, -33, -12, 16, 59, 16, 65, 65, 28, 45, -45, 30, -45, -1, 46, 63, -118, 22, -64, -18, 11, 76]
4144G6j11j2M4m8Pl6K4P9m5J4o1J69j66Q6j6mL7j15j5J6M9O8l9NM6o2Q5j14J00
4173F1p3m5P7K6N7j48j03J51N2m7m9k5K2N4l5R1j39J05p5PL1JJ09m0n2q7J3R3
4201C2Mp8K6L1n7J26j26J06r4M6o3P5p6n7J83o7m2J8N1J3K4o7%O6m7K4j9r7N9
4230fK6J04j78J26j03J14l4j15O9Jok3p3J81o5L8q8R0pq7k6K0P4K9m5p1J01j27
4258h1K00q6l4K4K4p5ml0J15p0PN2l6L3j2l6k4n3J33k01J51j18N6R1j21O6Po1
4286h3Q8K7Mj15J58k1j49J83j15Q4L1p0Mq3M9pQ4j08O9N8l9n8m7J09m2Rr8K3J34
4315G9q1l9L3j8N7p8J2k8O6J7k4K1L0r7LL7o4J06n6J12j62J5M4P9m8KJO0q9R3
4345H3rp9m4N2L7O5r9L1q0M5m7J6R3K2J5j32Qk4M5l2O8j25J80j35J04n2l6o8J54
$$ y = [76, -35, -47, -3, -51, -44, -80, -56, 23, -22, -8, -69, 100, -66, 20, 4, 0, 37, -78, -93, -77, -28, 40, 1, 6, 52, -10, 75, -39, 61, -12, -57, 20, 46, 103, -45, -148, 3, 55, 8, -41, -66, -44, 10, -25, 66, -73, 32, -43, -36, -5, -4, 105, 65, 13, -74, -61, 32, 36, -42, -16, 15, -42, 84, -42, 64, -30, 16, -47, 28, -48, -105, 78, 11, -31, -13, 38, 51, 75, 8, 8, 74, 27, 51, 32, -65, -6, 20, 124, -54, 72, -31, 83, 49, -66, 3, 4, -2, -25, -98, 83, 18, 56, -32, 58, 51, -36, -62, -42, 32, 61, 16, -55, 46, -81, 119, 33, -1, 23, 47, -28, -32, -62, 53, -17, -10, 42, 6, 39, 27, -9, -33, -86, 47, -154, -3, -121, -65, 26, -95, -29, -22, -83, 5, 32, 36, -79, 79, 58, -91, 92, -23, 61, 92, 22, 26, -57, -8, -15, 69, -39, 30, 88, 49, -9, -56, 53, 11, 20, -78, -55, 79, -2, -41, -8, -26, 31, -47, -35, -63, 3, 20, -4, 17, 47, -50, -47, -10, -74, 32, -24, 88, -74, -59, -15, 64, 16, 18, 19, 79, -10, 83, 74, -5, -49, 3, 40, 105, 6, 37, -43, 2, -45, -29, 64, 86, 101, -31, -23, -47, -2, -34, 34, -91, 89, -46, 58, 6, -30, -98, 56]
4374E6n1K2Mr7J06L8r9j5N7N6k02J34m6R7q1m0M5p3O6K3M0pKKr2J24j11Q9r0l5
4404g8J07N7m1n9r9J35k2P3j75J53q2l0N6K3M9p9n9OJ38pj24N1kl3M6M4pl8L4
4433C7r3J18j15M6j0J34j53o6O6Rk6j0K0j9Q6kj5m0M9K5q8J28j95R6M4o4O8r6
4461f6qJ10Q6q1o8n8J22O3o4J7N5j08L5rkk4j3K5K9j2m5lj12J5R9M0l0K5q3K4
4491d1n2J51m5j68K02Jq8K9j0l1L3j7J12n2r8K5J1K0R1j18J4P7k7j10Q4R2Oj08
4519a7j2nLJ20k8q1N3o8j7kN9k0j62K20P8p6j82Q5K4Q1p0K2%M5j9N3l8pk2r8O2
4550a9MM9r1ML8k8L2k3P2J0r3M2k0k2L7o4R7l5j4o4O7l6K9K4JJ5j25O2R5O5j10
4581ar2J11Jq8L2L7q9M6m0P5qL3m3n1K9Q0pk7P1j19R3l9J0M4J3m8J1l9M2l5k4
$$ y = [56, 5, 27, 31, -66, 40, 78, -21, -36, 21, 77, -125, 9, -37, 60, -21, -61, -16, -89, -23, 0, 40, 33, 35, 37, -55, 69, -42, 47, -43, -78, 29, 86, 45, -14, -113, 22, 0, 73, -102, 51, -31, -61, -5, 18, 67, -12, -71, -65, 73, 66, -58, -7, -9, -42, 4, 48, 41, 3, 37, -56, 62, -53, -7, -17, 117, -36, -102, -36, -27, -53, -63, -43, -62, 24, 22, 7, -33, 16, 41, -47, 81, -114, -18, 26, -38, 30, -66, -74, 36, 122, 41, -27, -85, 37, 100, 36, 53, 108, 0, 35, 26, 24, 0, -13, 12, 41, 29, -16, -19, -131, -116, -17, 23, -7, 18, -65, -41, -93, 58, 13, -155, 47, 48, -40, -11, -21, -52, -19, -36, 76, 24, -74, -49, -38, -18, 73, -45, -31, 46, 19, -91, -7, 85, 91, -17, -29, -34, -31, 89, 61, -20, 33, -35, -52, -54, 5, -15, -177, 43, 121, 45, -137, -52, -28, 53, -17, 5, 5, 50, 31, 84, 46, 39, 17, -81, -19, -15, 34, -57, -53, -15, -43, -11, -34, 38, 48, -45, -3, -23, -45, -8, -72, 25, -10, -24, -88, -21, -57, -28, -4, -3, 12, -113, -51, 44, 109, -1, -93, 18, 19, -69, -37, 0, -89, -43, -83, -8, -16, 17, -26, -77, -48, 32, 25, -2, 69, -50, 43, 4, 14, 58, 71, 23, 34, -5, 37, 2, -22]
4612b2J70j76O9j09J58j40J1J3q4J15M4j38Q8n7N1n2J48n4k0j9Jk9pM0k2o9J76
4639H6r4Nk9J2Mq7J60q5j1l0P8l2J4L0J8j2Qn4J21j1q2m2j4O8k9l3Jj1K0oL3k9
4671c3N1m6M8q0R0r0M8J9j77J83m3J11r9oN7m1j7m5L9J10j24L3JJ5N2o9Pl5L0
4700a1km9J70m3q0J4J3j05J29j0j00N2J02j23l3J19q2K0ln2J78j25K7J0nJ0N2
4727G3N5j00p6O2j1j05J60N4j09k9K8k9J7k3k1k5P6RL2q4J50j67n0O2RO7l0n9
4755f4J03k9m6nj8M7M5p4Mn0L3N3p6J69j18RN8m6LQ1j12n3J28M7j07l3k5R7j63
4784a42rJ95j37R7j8P2j73J20k6J8J9o6J35j45J23j00lnP6n5L3j1K7K7K9k5J5
4811G1Qn4k0M0P2j61K4mJ15j85J06j13J20n7J01N5j10KK5p3j8Q1jO5j49Q8j0m
$$ y = [-22, 148, -28, 41, -68, 90, -50, -39, -26, -110, 5, 49, -89, -1, -58, -7, -59, 89, 35, 15, -4, -3, -32, -39, 1, -21, -90, 86, -8, -3, -32, -20, -16, -103, 57, -28, -39, -69, 9, -23, -9, 21, 39, 27, 35, -19, 102, 91, 9, -33, -47, 21, -8, -41, -40, -51, -31, -37, -4, -33, 18, -28, 20, -60, 30, -60, -12, 7, -170, 13, -30, 81, -18, -24, 33, -8, -25, -70, -31, 79, -45, -12, -11, 4, 56, -13, -6, -41, -11, -13, -62, 108, 65, -15, -1, 12, -93, 36, 26, -74, -22, 80, -43, -76, 43, -39, -19, -22, -74, 104, -21, 6, 16, 11, 21, 73, 128, 28, -48, 14, 3, -102, 58, 112, 3, -26, 2, -27, -10, -33, -54, -79, -3, 6, 38, -46, 104, -63, -113, -51, -42, 25, -5, -64, 39, 10, -36, -41, -59, -12, 33, -41, -37, -87, -54, -1, -77, 92, -26, -17, 41, -5, -2, 79, -33, -86, 42, 89, -18, -51, -76, 21, -142, -151, 44, -93, 4, -14, 58, -115, 5, -21, -3, 16, -50, 85, -60, 63, -37, -40, -45, 31, -24, 9, -2, 25, 52, 81, 56, 71, 79, 25, 5, 45, 117, -44, -20, -24, 91, -94, 12, -101, 19, -38, 63, 118, 8, 10, 35, -38, -56, 25, 24, 89, -60, 28, 18, 14]
4839A4J5k6m9R1m8l1N9L7n8R8q6j04P7nJ10j18qm7O8N2l2k8J7l4K7Rk7K4q9R9
4869Gn6P0k4JQPp1N9j14R2M5m7k8n9J26l9L0p3K6J0k6JJ34j02m5pO4pJ7L8N7j3
4901H1j11j01J09m9R5L4j6j15P6rm9Oj6Q9j30J34j26J93j01L4O5k9m1m7m4J70
4927A02q3j03J45q2l1Q3m2P0n0M7n2N9k8n5J9J6p2Q1qO7k07O4R0j8n3K3q8Q1k4
4956d9l1K4J3J04qj26Q0j5k3L1k9J16r2j4P1k1j0LQ6n6jRj60QJ14l5m6K1J06j12
4986d2o2J16m9m1J9O8l3k6J7l3J33r2R6j22P9O1j41oJ44q5J20j38J17j51M7l7
5012d1M6k9k8J24r7P6m8L9j49L5K4N9l9J25j56Lm4R2L7j0lm8PpN1j65N7j8l3J4
5042a26J11M9M8p8J6Lj40J37L8j53K4R2p3l4R6N7jq5L3rK6L5j1j11R9J1p5L0p0
$$ y = [14, 29, 3, -46, 45, -3, -34, 25, 62, 4, 102, 16, -88, -11, -16, 94, -24, -32, -79, -11, 41, 9, -19, -2, -36, -9, 0, -27, -3, -92, 7, -49, 21, -3, -2, 6, 13, -58, 1, -113, -21, 24, -23, -51, -110, 16, -23, 7, -66, -40, -30, -56, -55, 79, -23, -68, -75, -11, -18, -1, 37, 94, 81, -30, -131, -22, -71, 24, 58, 42, -73, 3, -6, -55, -49, -65, 24, -106, 28, -98, 95, -6, 28, 93, 64, 23, -24, -68, 102, 19, -84, 61, -21, -52, 31, -11, 59, 9, 56, 4, 63, 35, -20, -1, 15, -57, 24, 16, 83, -124, -60, 30, 12, -41, -18, -106, -25, -49, -80, -56, -43, 61, 53, -73, 7, -8, -31, 0, -29, 87, -5, -19, 52, 31, 21, 24, 110, 54, 53, 62, -98, -90, 24, -11, -57, -36, 70, -42, -104, 12, -37, -78, -59, 9, -24, -50, -33, -66, 67, -25, 71, -51, 28, 89, -52, -58, 86, 1, 121, -17, 100, -51, -4, -41, 5, -24, -52, 72, -25, 51, 3, 42, -107, -72, -48, 11, -28, 97, -59, -56, -100, -8, 29, 19, 16, -32, -25, -32, 19, -146, -89, -107, -140, -126, -15, 34, 82, 4, 20, 23, -117, 20, 58, -95, -71, 21, -52, -86, 10, 67, 66, -19, 14, 5, 31, 66, 55, -56, 43, 54, -21, 9, -61]
5071f1P7q9L6p2J17RK9J7n2K3m0l8L6lj9j9J36n0n8J06m7o2K3L0j1j3J06j10J18
5100A19j12m9k9Q5n1P9M0k69J77o1J41q8l3Q2p3J7j5k5R0r1O3N9J1q0rnQL1k2
5129a0r2J37j11PK4j6Q7o0N6l2L6q5R7J4l9j0n2O9l6K8J2j24J60j34M1M9n7%j6
5158e7O9O7j05JJ0l5J9O8oj05P0J39m4j56J11j08O8r8J29k2k8L0j8N8m6n2J33
5185I2j76K4PJ1M5j1nl7P3no4P1j10R4j7jN4o3N5m1k6J2J13q2L9lp1j0j4R6m1
5216Imm2L7m1k6oO7M7m3Pn0m3J18J1rl5J20r2j39J25M7No3j1q5J71j15rL9R5j23
5247c8lm5j0J16n1M8j05O0PN4j15P0O8Rk4j66K06r4m9M7K1K3o5l7P2L6j32Q6Q
5276cR5q9J2J2M7j09K8%M5r9M2m3P4o3J42r0L9j23Q8q7R2O4j8r9R7m0j01O4K6
$$ y = [-61, 16, -73, -37, -109, 8, 17, 46, 63, 11, 34, -6, -44, -8, -11, -30, -49, 87, 37, -21, 85, 38, -24, -1, 29, 18, 5, 111, 1, 119, 7, -42, -71, 14, -37, 42, 82, -187, -10, -71, 70, -18, -51, 31, -42, -25, -40, -65, 25, -66, -3, 56, 67, -13, -22, -27, -19, 12, -10, -102, 35, -76, -69, -45, -61, 26, -34, 22, -10, 26, -59, 38, 52, 13, 3, -49, 20, -16, 12, 24, -100, 60, -74, -33, 16, -41, -41, -57, 12, 79, -26, -25, -15, -50, -31, 37, 31, -74, -4, 135, 91, -65, 46, -62, 6, -92, 37, 15, -13, 17, -1, 57, 11, -41, 92, -84, -60, -53, -42, 3, -8, -13, -50, 23, 18, -46, 25, -85, 9, -8, -9, 45, -18, 37, -4, -30, -18, 95, 13, 52, 49, -22, -32, -46, 50, 9, 5, -37, 0, -41, -67, -73, -6, 41, -2, 5, -45, -88, 30, 41, 32, -3, 117, 25, -114, 11, 58, 63, 0, -11, -96, 75, -40, -49, -10, 85, -38, -41, -86, -96, 20, -31, 17, -88, -28, -21, 33, -82, -12, 56, 65, 41, -125, 81, -13, -62, -15, 6, 29, -36, -73, -1, 35, -97, -11, -3, 92, 3, 15, 27, 74, -35, -7, -7, 38, -61, -19, -62, 12, -51, 91, 1, 40, -83, 5, -82, 10, 74, 56, -43, 54, 14, -87, -23, 3]
5305Cl2rM2j23J12q4J68j19P2p9l7Q8M8l5M2j43J31l4m3L0n0%R8p7R9m0n6O5k9
5334Hjm4Q0n3k7P3n7O3k7J56k10O4j17Q3M6p6J48j24J19r0n6J02M2k31J56J2n
5361C4o4N1J8m2j10J28N4j12PJ07k7j3R7j40J36j51m5N2k7Q7q9l9j2J25n6L8K6
5388C3ON2j29N6o8NkJ36j2m3ll9j4K8m2J01n3k8L6q9Q5o7MMP6k03J64L2j31R3
5418a2l4kM6O9j07o2J05L0j04J08o6O2j7k5M7K1K9j27P1o5M3j6K4K7o1J9O3m9
5446A7M0m9q5K3O9j8J01q5M1m7Llon6P1r3J26q8KJ19j63O0jk4J21m7J5r0prR6
5477C3j0qK3k3R2o1j26J06P1r6P8p8J4J0l6M2J05k53N9P4o3k1J19r4J05j15m8
5504a01J0J06On6M2MJ8m4N1j9Q7q9P3lj41l4mJ93r5j1n2O3p6L6M3M6j57k8K26
$$ y = [3, -29, -38, 4, -119, -7, -91, 77, -42, 30, -49, -86, 2, 50, 15, 57, -86, 45, 11, -32, -2, -52, -52, 46, -31, 68, 28, -28, 37, 8, 7, -37, 43, -10, -37, 36, -21, 42, 15, 171, -39, 25, -92, -9, 37, -39, 109, -15, 104, 14, -42, 60, 102, -129, 27, 39, 34, -30, 21, 39, -3, -113, 15, 69, -43, -36, 71, 44, 31, 128, -12, 124, -27, -72, -20, -47, 40, -49, -88, -100, 25, -31, 7, 33, 39, 91, -38, 18, -50, -45, -47, 89, 77, 34, 31, -8, -22, 6, -36, 65, 12, -16, 20, -69, 16, -51, -47, -43, 33, -170, -6, 26, -105, -12, -46, -48, -2, 67, -40, -102, 3, 33, -71, 37, -29, 33, 16, -9, 38, 59, 88, -39, 32, -33, 10, -6, 18, 45, -16, 3, 66, 17, 57, 8, -77, -54, 15, -3, 98, 13, 54, 7, 10, 7, 1, -55, 16, -77, 49, -39, -37, 82, -81, -21, -22, -46, 75, 28, 43, -47, -54, -63, 33, 23, 15, 38, 15, 107, 46, -80, 26, 97, 1, 79, 1, 15, 25, -11, 31, 136, -117, -58, 16, -47, -68, 51, -43, 62, -53, -101, -91, 15, 21, -35, 7, 11, 29, -15, 36, 17, 104, 15, 88, 85, -56, -90, -94, 99, 4, -7, -59, 4, -72, -36, 7, 53, -104, -132, 94]
5533I4j78J04j0P4k52R5J14Q8j38K4l9MO7n8M8m3n8P2M4K1o5J00j45N1K3p9J1
5560c1J03J5j18K4O3m2n3O0j0j9J1J2p8j0J58m6n6L2k0lj4m4lO7M9l8rJ21j55
5589c4K6l6N6Rl2l6n4J11K1j5j20P3P8Q3k02J60j07k9jP2j26J22J8lk9N0p2J0
5617gL0m3O9KJ5n0%m3K1j0j20J34m7l2L7J8O2N9q6j2R2l6o3m3J14r3J2P1n6NM
5648Dm4J5PM5o2J19j37O0j25J57l2O7j44Q0Q5j18jO8k4o9L4p2Q4N0j49J24l6L1
5676A7j36K9K0O5j1p3J11j19Q4k6J0N7p3M5rR7n3n9R1p4r1J39K3o5P1Qq2M4rM6
5706G7n6N2j10j7j6Q2k4K2K7J7k16P5J06J4Oq7Km3P7N1l3m4P1j41R7n0J46m2k4
$$ y = [94, -84, 20, 10, 84, -168, -73, 41, 129, -9, 15, -24, -20, 47, -11, 37, -6, -64, 8, 52, 73, 8, 108, -37, 14, 37, -42, -31, 72, 87, -31, -7, 56, 14, -39, 21, 11, -8, 3, 15, -63, -73, 85, 39, -17, 15, -5, -8, -22, -66, -69, -2, 47, 9, 0, 121, -34, -8, -44, 12, 21, -11, -47, -101, 10, 31, 16, -104, -31, 47, 130, -72, 88, -19, -48, -49, 23, -103, 19, 37, 34, 5, 55, -17, -7, 23, -20, 49, 51, 66, 16, 16, -27, -6, -16, -136, -2, -49, -81, -44, -26, 36, 95, 9, -3, 89, 53, -10, -53, 61, -32, -20, 51, -5, 0, 4, -40, -25, -18, 27, -35, 84, -53, 7, -118, 39, 7, 74, -70, 10, 95, -23, -24, 44, 20, -49, -15, -87, -3, 47, -102, 22, -14, 17, -119, -90, -70, -5, -16, -89, 22, -97, -13, -39, -29, 28, -45, 0, -9, 88, 35, -24, 67, -7, -98, 41, 64, -1, 70, 78, -4, 40, 31, 77, 21, 73, -37, -54, -70, 12, -12, 10, 37, 54, -162, -87, 19, 33, 39, -48, -46, -89, -12, 39, 6, -38, 33, -108, -11, -61, 85, 43, 19]
$$ [...]
8191D7
##END NTUPLES=NMR FID
##END=
