##TITLE=1H_AM_NVEtOHS
 
 8 sc, 
 19.09.2022
##JCAMPDX= 6.0         $$ Bruker NMR JCAMP-DX V2.0
##DATA TYPE= NMR FID
##DATA CLASS= NTUPLES
##ORIGIN= UXNMR, Bruker Analytische Messtechnik GmbH
##OWNER= root
$$ XWIN-NMR		Version 3.5
$$ Mon Sep 19 13:30:44 2022 Russian Standard Time (UT+4h)  she@DPX200
##.OBSERVE FREQUENCY= 200.1313499994
##.OBSERVE NUCLEUS= ^1H
##.DELAY= (6, 6)
##.ACQUISITION MODE= SIMULTANEOUS
##.ACQUISITION SCHEME= undefined
##.AVERAGES= 8
##.DIGITISER RES= 18
##SPECTROMETER/DATA SYSTEM= spect
##.PULSE SEQUENCE= zg30
##.SOLVENT NAME= CDCl3
##.SHIFT REFERENCE= (INTERNAL, CDCl3, 0, 15.7039)
##AUDIT TRAIL= $$ (NUMBER, WHEN, WHO, WHERE, WHAT)
$$ ##TITLE= Audit trail, XWIN-NMR		Version 3.5
$$ ##JCAMPDX= 5.01
$$ ##ORIGIN= Bruker BioSpin GmbH
$$ ##OWNER= she
$$ F:/spectra/data/she/nmr/H-F/1/audita.txt
$$ ##AUDIT TRAIL=  $$ (NUMBER, WHEN, WHO, WHERE, WHAT)
(   1,<2022-09-19 13:28:45.82 +0400>,<she>,<DPX200>,
      <created by zg, POWCHK disabled, PULCHK disabled
       configuration hash MD5:
       00 E9 B6 7A A2 85 ED C7 34 08 36 98 17 FE 4E 26
       data hash MD5: 16K
       8B 10 12 19 66 18 E2 15 4F 50 52 BF 0F 3C C0 9A>)
$$ ##END=
$$ 
$$ hash MD5
$$ 4C 78 81 25 B8 D2 0A 6A 53 40 EA 13 8F 97 6C 93
##$RELAX= 
##$RELAX= 
##$RELAX= 
##$RELAX= 
##$RELAX= 
##$RELAX= 
$$ Bruker specific parameters
$$ --------------------------
##$DU= <F:/spectra>
##$EXPNO= 1
##$NAME= <H-F>
##$PROCNO= 1
##$TYPE= <nmr>
##$USER= <she>
##$AMP= (0..31)
100 100 100 100 100 100 100 100 100 100 100 100 100 100 100 100 100 100 
100 100 100 100 100 100 100 100 100 100 100 100 100 100 
##$AQSEQ= 0
##$AQ_mod= 1
##$AUNM= <au_zg>
##$AUTOPOS= <>
##$BF1= 200.13
##$BF2= 200.13
##$BF3= 200.13
##$BF4= 200.13
##$BF5= 200.13
##$BF6= 200.13
##$BF7= 200.13
##$BF8= 200.13
##$BYTORDA= 1
##$CFDGTYP= 0
##$CFRGTYP= 5
##$CHEMSTR= <none>
##$CNST= (0..31)
1 1 145 1 1 1 1 1 1 1 1 1 1 1 1 1 1 1 1 1 1 1 1 1 1 1 1 1 1 1 1 1 
##$CPDPRG= <>
##$CPDPRG1= <>
##$CPDPRG2= <>
##$CPDPRG3= <>
##$CPDPRG4= <mlev>
##$CPDPRG5= <mlev>
##$CPDPRG6= <mlev>
##$CPDPRG7= <mlev>
##$CPDPRG8= <mlev>
##$CPDPRGB= <>
##$CPDPRGT= <>
##$D= (0..31)
0 1.2 0 0 0 0 0 0 0 0.06 0 0.03 0 0 0 0 0.0002 0 0 0 0 0 0 0 0 0 0 0 0 
0 0 0 
##$DATE= 1663579725
##$DBL= (0..7)
120 120 120 120 120 120 120 120 
##$DBP= (0..7)
150 150 150 150 150 150 150 150 
##$DBP07= 0
##$DBPNAM0= <>
##$DBPNAM1= <>
##$DBPNAM2= <>
##$DBPNAM3= <>
##$DBPNAM4= <>
##$DBPNAM5= <>
##$DBPNAM6= <>
##$DBPNAM7= <>
##$DBPOAL= (0..7)
0.5 0.5 0.5 0.5 0.5 0.5 0.5 0.5 
##$DBPOFFS= (0..7)
0 0 0 0 0 0 0 0 
##$DE= 6
##$DECBNUC= <off>
##$DECIM= 32
##$DECNUC= <off>
##$DECSTAT= 4
##$DIGMOD= 1
##$DIGTYP= 9
##$DL= (0..7)
0 120 120 120 120 120 120 120 
##$DP= (0..7)
150 150 150 150 150 150 150 150 
##$DP07= 0
##$DPNAME0= <>
##$DPNAME1= <>
##$DPNAME2= <>
##$DPNAME3= <>
##$DPNAME4= <>
##$DPNAME5= <>
##$DPNAME6= <>
##$DPNAME7= <>
##$DPOAL= (0..7)
0.5 0.5 0.5 0.5 0.5 0.5 0.5 0.5 
##$DPOFFS= (0..7)
0 0 0 0 0 0 0 0 
##$DQDMODE= 0
##$DR= 18
##$DS= 0
##$DSLIST= <SSSSSSSSSSSSSSS>
$$ [...]
##$SUBNAM2= <"">
##$SUBNAM3= <"">
##$SUBNAM4= <"">
##$SUBNAM5= <"">
##$SUBNAM6= <"">
##$SUBNAM7= <"">
##$SUBNAM8= <"">
##$SUBNAM9= <"">
##$SW= 18.0517283424941
##$SWIBOX= (0..15)
0 0 2 0 0 0 0 0 0 0 0 0 0 0 0 0 
##$SW_h= 3612.71676300578
##$TD= 16384
##$TD0= 1
##$TE= 0
##$TE2= 300
##$TE3= 300
##$TEG= 300
##$TL= (0..7)
0 120 120 120 120 120 120 120 
##$TP= (0..7)
150 150 150 150 150 150 150 150 
##$TP07= 0
##$TPNAME0= <>
##$TPNAME1= <>
##$TPNAME2= <>
##$TPNAME3= <>
##$TPNAME4= <>
##$TPNAME5= <>
##$TPNAME6= <>
##$TPNAME7= <>
##$TPOAL= (0..7)
0.5 0.5 0.5 0.5 0.5 0.5 0.5 0.5 
##$TPOFFS= (0..7)
0 0 0 0 0 0 0 0 
##$TUNHIN= 0
##$TUNHOUT= 0
##$TUNXOUT= 0
##$USERA1= <user>
##$USERA2= <user>
##$USERA3= <user>
##$USERA4= <user>
##$USERA5= <user>
##$V9= 5
##$VALIST= <valist>
##$VCLIST= <CCCCCCCCCCCCCCC>
##$VD= 0
##$VDLIST= <DDDDDDDDDDDDDDD>
##$VPLIST= <PPPPPPPPPPPPPPP>
##$VTLIST= <TTTTTTTTTTTTTTT>
##$WBST= 1024
##$WBSW= 4
##$XGAIN= (0..3)
0 0 0 0 
##$XL= 0
##$YL= 0
##$YMAX_a= 287257
##$YMIN_a= -339001
##$ZGOPTNS= <>
##$ZL1= 120
##$ZL2= 120
##$ZL3= 120
##$ZL4= 120
##$ABSF1= 10
##$ABSF2= 0
##$ABSG= 5
##$ABSL= 3
##$ALPHA= 0
##$AQORDER= 0
##$ASSFAC= 0
##$ASSFACI= 0
##$ASSFACX= 0
##$ASSWID= 0
##$AUNMP= <proc_1d>
##$AZFE= 0.1
##$AZFW= 0.1
##$BCFW= 1
##$BC_mod= 2
##$BYTORDP= 1
##$COROFFS= 0
##$CY= 11.3945322036743
##$DATMOD= 1
##$DC= 2
##$DFILT= <>
##$DTYPP= 0
##$F1P= 2.36226072786647
##$F2P= -0.459571619588291
##$FCOR= 0.5
##$FTSIZE= 0
##$FT_mod= 4
##$GAMMA= 1
##$GB= 0.15
##$INTBC= 1
##$INTSCL= 1
##$ISEN= 128
##$LB= 0.24
##$LEV0= 0
##$LPBIN= 0
##$MAXI= 10000
##$MC2= 0
##$MEAN= 0
##$ME_mod= 0
##$MI= 1.114404
##$NCOEF= 0
##$NC_proc= 0
##$NLEV= 6
##$NOISF1= 3.799351
##$NOISF2= 2.8
##$NSP= 1
##$NTH_PI= 0
##$NZP= 0
##$OFFSET= 15.70392
##$PC= 1
##$PHC0= -18116.02
##$PHC1= 9.80069
##$PH_mod= 1
##$PKNL= yes
##$PPARMOD= 0
##$PSCAL= 0
##$PSIGN= 0
##$REVERSE= no
##$SF= 200.130013532006
##$SI= 16384
##$SIGF1= 3
##$SIGF2= 2
##$SINO= 400
##$SIOLD= 16384
##$SREGLST= <1H.CDCl3>
##$SSB= 0
##$STSI= 0
##$STSR= 0
##$SW_p= 3612.71676300578
##$SYMM= 0
##$S_DEV= 0
##$TDeff= 0
##$TDoff= 0
##$TI= <>
##$TILT= no
##$TM1= 0
##$TM2= 0
##$TOPLEV= 0
##$USERP1= <user>
##$USERP2= <user>
##$USERP3= <user>
##$USERP4= <user>
##$USERP5= <user>
##$WDW= 1
##$XDIM= 8192
##$YMAX_p= 0
##$YMIN_p= 0
$$ End of Bruker specific parameters
$$ ---------------------------------
##NTUPLES= NMR FID
##VAR_NAME=  TIME,          FID/REAL,        FID/IMAG
##SYMBOL=    X,             R,               I
##VAR_TYPE=  INDEPENDENT,   DEPENDENT,       DEPENDENT
##VAR_FORM=  AFFN,          ASDF,            ASDF
##VAR_DIM=   8192,          8192,            8192
##UNITS=     SECONDS,       ARBITRARY UNITS, ARBITRARY UNITS
##FACTOR=    0.0002768,     1,               1
##FIRST=     0,             0,               0
##LAST=      2.2672688,     0,               0
##MIN=       0,             -339001,         0
##MAX=       2.2672688,     287257,          0
$$ Real data points
##PAGE= N=1
##DATA TABLE= (X++(R..R)), XYDATA
$$ [...]
$$ plain form
1735 3052 1990 83 3100 2444 -3307 -3722 -257 -1344 -2468 873 1376 -1725 -234 3507 2396 609
1751 609 1913 733 -2879 -2380 -35 -1213 -2191 -164 395 -710 998 3237 2075 583 981 152
1767 152 -1767 -1535 -658 -1573 -2003 -590 286 385 1442 2343 1630 802 685 54 -1012 -1442 -1504 -1684 -1454
1786 -1454 -602 325 971 1326 1550 1652 1294 491 -104 -675 -1669 -2046 -1302 -835 -762 217 1257 1074 1156 2062
1806 2062 1623 15 -367 -486 -1856 -2173 -738 -567 -1208 115 1547 955 1082 2410 1506 -614 -454
1823 -454 -206 -1912 -2105 -405 -677 -1583 296 1897 912 1038 2470 1182 -960 -245 74 -1970 -2111
1840 -2111 -310 -833 -1595 670 2098 726 957 2398 945 -967 28 76 -2189 -2091 -238 -869 -1403
1857 -1403 953 1971 480 955 2372 801 -865 115 -205 -2349 -1888 -153 -879 -1183 1023 1674 411
$$ packed form
1735C052j062j907L017o56n751m15L465j087j124L341N03l101J491L741j111j787
1751F09J304j180l612M99K345j178r78K027N59j105J708K239j162j492L98q29
1767A52j919K32Q77r15m30J413Q76R9J057R01p13q28j17o31j066m30o2j80K30
1786a454Q52R27O46L55K24J02l58q03n95n71r94l77P44M67P3R79J040j83Q2R06
1806B062m39j608l82j19j370l17J435J71o41J323J432n92J27J328r04k120J60
1823d54K48j706j93J700k72r06J879J601r85J26J432j288k142P15L19k044j41
1840b111J801n23p62K265J428j372K31J441j453j912R95M8k265R8J853o31n34
1857a403K356J018j491M75J417j571j666R80l20k144M61J735p26l04K206O51j263
$$ plain form
1874 411 1174 2325 642 -775 30 -499 -2211 -1533 -169 -941 -978 966 1446 623 1422 2052 418 -662
1892 -662 -107 -689 -1890 -1275 -463 -1007 -692 910 1320 948 1473 1544 308 -394 -265 -833 -1538 -1237 -861
1911 -861 -861 -272 742 1173 1257 1359 1059 455 -92 -601 -989 -1161 -1263 -1164 -498 103 390 1039 1652 1255 695
1932 695 724 77 -1119 -1092 -628 -1282 -1421 -145 222 -138 1096 2229 1089 231 885 3 -1632 -786 87
1951 87 -1526 -1873 99 215 -465 1645 2850 447 -450 1075 -6 -1806 -72 558 -2377 -2464 580
1968 580 469 -404 2346 2943 -723 -1039 1718 360 -1718 447 349 -3584 -2700 1632 1059 -363 2503
1985 2503 2324 -2010 -1015 2995 893 -1975 203 -448 -4508 -2039 3265 1455 -1036 1887 1441 -2578
2001 -2578 169 4586 713 -3182 -557 -1041 -4392 -241 4728 590 -2627 1287 1290 -1961 2075 5390
$$ packed form
1874D11P63J151j683j417Q05n29j712O78J364p72l7J944M80q23P99O30j634j080
1892f62N55n82j201O15Q12n44L15J602M10l72N25P1j236p02J29n68p05L01L76
1911h61%N89J014M31Q4J02l00o04n47n09l88j72j02R9O66O01K87O49O13l97n60
1932F95K9o47j196K7M64o54j39J276L67l60J234J133j140q58O54q82j635Q46Q73
1951H7j613l47J972J16o80K110J205k403q97J525j081j800J734O30k935q7L044
1968E80j11q73K750N97l666l16K757j358k078K165r8l933Q84M332n73j422K866
1985B503j79m334R95M010k102k868K178o51m060K469N304j810k491K923m46m019
2001b578K747M417l873l895K625m84l351M151M969m138l217L914Ll251M036L315
$$ plain form
2017 5390 -1025 -4924 -656 -528 -3287 1602 4830 -1715 -4150 1833 2314 -767 3262 4513 -3680
2032 -3680 -5970 654 995 -2163 2077 3282 -4203 -4339 3824 3942 -230 2688 2363 -5739 -5185 3281
2048 3281 2498 -2359 745 1095 -5317 -2493 6687 4652 -1566 730 453 -5810 -2460 5919 2139 -4473
2064 -4473 -1107 80 -4288 676 8544 2954 -4293 -645 410 -4050 575 6656 -592 -7101 -1416
2079 -1416 1129 -2072 3093 7964 -523 -6440 56 2211 -1902 1988 4930 -4125 -8215 433 3499
2094 3499 -299 3249 5277 -3691 -6379 2732 4493 -1052 856 1833 -6320 -6689 3747 5273 -676
2109 -676 1144 2311 -4680 -3769 5964 5100 -2703 -1638 -349 -5881 -3253 6471 4567 -3149 -1019 1252
2125 1252 -3281 -314 7547 3022 -5490 -2887 -176 -3757 -127 6870 1617 -5610 -1203 2372 -952
$$ packed form
2017E390o415l899M268J28k759M889L228o545k435N983M81l081M029J251q193
2032c680k290O624L41l158M240J205p485j36Q163J18m172K918l25q102N54Q466
2048C281p83m857L104L50o412K824R180k035o218K296k77o263L350Q379l780o612
2064d473L366J187m368M964P868n590p247L648J055m460M625O081p248o509N685
2079a416K545l201N165M871q487n917O496K155m113L890K942r055m090Q648L066
2094C499l798L548K028q968k688R111J761n545J908R77q153l69J0436J526n949
2109f76J820J167o991R11R733q64p803J065J289n532K628R724j904p716K130K271
2125A252m533K967P861m525q512K603K711l581L630O997n253p227M407L575l324
$$ plain form
2140 -952 1921 6603 -403 -7267 -1992 1698 -1565 1041 4922 -1638 -6324 630 4438 577 1776
2155 1776 3879 -3089 -6784 492 3599 -934 -123 2118 -3261 -4697 3289 5573 88 -54 1437
2170 1437 -3598 -4393 2884 3756 -2184 -1879 566 -2734 -1998 5021 4680 -1702 -1450 746 -2465 -1848 3792
2187 3792 2066 -3931 -2458 754 -1217 130 4994 2449 -3203 -1352 1479 -962 -439 2958 -235
2202 -235 -4752 -1619 1847 72 750 3535 381 -3309 -96 2501 -204 -584 1210 -1669 -4029 -107
2218 -107 2598 274 141 1923 -357 -2108 1239 2655 -549 -1329 21 -1721 -2557 937 2282 -311
2234 -311 -459 1212 -61 -731 1786 1840 -1257 -1624 -228 -1172 -1339 1089 1282 -873 -413 1225 481 104
2252 104 1458 739 -1562 -1300 -31 -684 -801 584 368 -798 120 1379 750 275 783 65 -1191 -754
$$ packed form
2140i52K873M682p006o864N275L690l263K606L881o560m686O954L808l861J199
2155A776K103o968l695P276L107m533Q11K241n379j436P986K284n485j42J491
2170A437n035p95P277Q72n940L05K445l300P36P019l41o382K52K196l211O17N640
2187C792j726n997J473L212j971J347M864k545n652J851K831k441N23L397l193
2202b35m517L133L466j775O78K785l154l690L213K597k705l80J794k879k360L922
2218a07K705k324j33J782k280j751L347J416l204p80J350j742q36L494J345k593
2234c11j48J671j273o70K517N4l097l67J396r44j67K428J93k155M60J638p44l77
2252A04J354p19k301K62J269o53j17J385k16j166R18J259o29m75N08p18j256M37
$$ plain form
2270 -754 -8 -538 -745 9 82 -192 528 1185 717 206 298 -29 -603 -534 -327 -604 -706 -239 172 335 536
2291 536 741 621 284 108 48 -238 -672 -735 -527 -461 -291 275 557 321 397 774 512 -8 43 -142 -885 -908
2313 -908 -216 -221 -413 263 629 127 338 1067 581 -249 -33 -111 -1007 -835 94 -208 -663 248 706 45 414
2334 414 1248 418 -535 2 2 -1039 -732 216 -387 -828 383 826 19 456 1244 195 -656 152 96 -1060
2354 -1060 -678 237 -516 -787 610 869 -48 452 1165 62 -584 323 47 -1154 -634 203 -546 -633 715
2373 715 734 -170 468 1103 -6 -463 331 -138 -1202 -516 223 -527 -482 703 555 -147 605 1054 -54
2392 -54 -392 231 -318 -1077 -317 185 -546 -387 616 450 29 753 886 -133 -349 120 -374 -847 -214 -23
2412 -23 -572 -277 529 416 243 728 607 -156 -241 12 -379 -630 -291 -248 -479 -97 420 424 414 581 356 -27
$$ packed form
2270g54P46n30k07P54P3k74P20O57m68n11R2l27n74O9K07k77j02M67M11J63K01
2291E36K05j20l37j76o0k86m34o3K08O6J70N66K82k36P6L77k62n20N1j85p43k3
2313i08O92nj92O76L66n02K11P29m86q30K16p8q96J72R29l02m55R11M58o61L69
2334D14Q34q30r53N37%j041L07R48o03m41J211M43q07M37P88j049q51Q08n6j156
2354a060L82R15p53k71J397K59r17N00P13j103o46R07k76j201N20Q37p49q7J348
2373G15J9r04O38O35j109m57P94m69j064O86P39p50M5J185j48p02P52M49j108
2392e4l38O23n49p59P60N02p31J59J003j66m21P24J33j019k16M69m94m73O33J91
2412b3n49K95Q06j13j73M85j21p63q5K53l91k51L39M3k31L82N17Mj0J67k25l83
$$ plain form
2434 -27 -85 -145 -377 -441 -390 -390 -237 54 242 424 586 445 200 175 -47 -401 -347 -212 -479 -503 -26 67 -25 510
2458 510 836 288 41 291 -125 -648 -153 70 -678 -664 120 -5 -160 806 1044 -77 -185 429 -193 -684
2478 -684 242 202 -1104 -805 386 34 -78 1187 977 -666 -338 747 -115 -572 534 -25 -1709 -800
2496 -800 863 210 -1 1310 576 -1267 -201 1334 73 -656 424 -493 -2136 -365 1620 329
2512 329 -305 1004 73 -1463 482 2048 -98 -1204 55 -817 -1956 579 2190 -174 -1014 702
2528 702 -36 -1020 1466 2282 -964 -1911 -1 -619 -1285 1492 2054 -1300 -1609 929 395 -329 2051 1671
2546 1671 -2252 -2276 598 42 -652 1696 1116 -2505 -1571 1869 1136 1 1727 484 -3171 -1728 1867
2563 1867 721 -740 975 -45 -2944 -523 3204 1422 -646 722 -462 -3052 -302 3015 460
$$ packed form
2434b7n8o0k32o4N1%J53K91J88J82J62j41k45k5k22l54N4J35k67k4M77R3r2N35
2458E10L26n48k47K50m16n23M95K23p48J4P84j25j55R66K38j121j08O14o22m91
2478f84R26m0j306K99J191l52j12J265k10j643L28J085q62m57J106n59j684R09
2496h00J663o53k11J311p34j843J066J535j261p29J080r17j643J771J985j291
2512C29o34J309r31j536J945J566k146j106J259q72j139K535J611k364q40J716
2528G02p38r84K486Q16l246r47J910o18o66K777N62l354l09K538n34p24K380l80
2546A671l923k4K874n56o94K348n80l621R34L440p33j135J726j243l655J443L595
2563A867j146j461J715j020k899K421L727j782k068J368j184k590K750L317k555
$$ plain form
2578 460 -1734 25 -547 -2271 1064 3916 520 -1879 17 -496 -2027 1191 3145 -894 -2858 -174
2594 -174 -89 -1038 2244 3403 -1157 -2740 333 331 -816 1858 2101 -2579 -3226 709 1016 -83 2234
2611 2234 1925 -2620 -2524 1632 1415 -394 1202 481 -3499 -2333 2251 1823 -290 1108 469 -2896 -1166
2628 -1166 3070 1658 -1180 -81 -539 -3099 -684 3376 1421 -1422 -2 -41 -2036 506 3612 651
2644 651 -2400 -738 -481 -1908 833 3349 25 -2466 -140 478 -769 1557 2962 -971 -3079 -335
2660 -335 393 -752 1320 2194 -1518 -2625 735 1442 19 1383 1495 -2165 -2680 827 1256 -460 655
2677 655 778 -2113 -1726 1918 1925 -238 413 336 -2197 -1492 1815 1278 -1025 -267 75 -1658 -427 2563
2695 2563 1471 -995 -287 44 -1487 -287 2035 467 -1735 -576 154 -804 528 2320 413 -1549
$$ packed form
2578D60k194J759n72j724L335K852l396k399J896n13j531L218J954m039j964K684
2594a74Q5r49L282J159m560j583L073kj147K674K43m680o47L935L07j099K317
2611B234l09m545R6M156k17j809J596p21l980J166M584m28k113J398o39l365J730
2628a166M236j412k838J099m58k560K415M060j955k843J420l9j995K542L106k961
2644F51l051J662K57j427K741K516l324k491K326O18j247K326J405l933k108K744
2660c35P28j145K072Q74l712j107L360P07j423J364J12l660n15L507M29j716J115
2677F55J23k891L87L644Pk163O51p7k533P05L307n37k303P58L42j733J231K990
2695B563j092k466P08L31j531J200K322j568k202J159P30r58J332J792j907j962
$$ plain form
2711 -1549 -256 365 -662 309 1431 -575 -1941 -191 656 -144 706 1465 -441 -1417 306 804 -309
2728 -309 116 538 -1075 -1479 438 960 -64 329 718 -595 -783 792 852 -422 -285 31 -906 -769
2746 -769 749 782 -265 1 416 -295 -187 860 479 -671 -464 -72 -546 -276 636 317 -414 8 422
2765 422 25 128 568 10 -669 -320 11 -270 -127 283 -7 -254 207 468 162 115 201 -150 -392 -134 -10
2786 -10 -193 -168 5 10 44 288 355 166 26 7 -51 -132 -153 -163 -189 -200 -83 145 235 158 153 191 36 -51 61 -12 -332
2813 -332 -337 -91 -122 -99 248 286 -17 40 321 107 -85 85 -33 -480 -322 107 -44 -149 239 248 -134 96 498
2836 498 116 -208 65 -60 -533 -221 255 -104 -266 249 244 -167 193 565 -28 -329 104 -47 -525 -127 269
2857 269 -234 -328 344 270 -166 259 525 -162 -338 211 -15 -521 -85 229 -306 -262 424 273 -178 255 464
$$ packed form
2711a549J293O21j027R71J122k006j366J750Q47q00Q50P59j906r76J723M98j113
2728c09M25M22j613m04J917N22j024L93L89j313j88J575O0j274J37L16r37J37
2746g69J518L3j047K66M15p11J08J047l81j150K07L92m74K70R12l19p31M22M14
2765D22l97J03M40n58o79L49L31k81J43M10k90k47M61K61l06m7Q6l51k42K58J24
2786a0j83K5J73NL4K44O7j89j40j9n8q1k1j0k6j1J17K28R0p7nL8j55q7J12p3l20
2813c32nK46l1K3L47L8l03N7K81k14j92J70j18m47J58M29j51j05L88Rl82K30M02
2836D98l82l24K73j25m73L12M76l59j62N15nm11L60L72n93l01M33j51m78L98L96
2857B69n03r4O72p4m36M25K66o87j76N49k26n06M36L14n35M4O86j51m51M33K09
$$ plain form
2878 464 -214 -259 266 -64 -563 -53 201 -309 -157 471 188 -218 271 421 -204 -199 246 -183 -549 2 180
2899 180 -277 -103 413 89 -191 331 392 -210 -157 163 -236 -457 79 165 -286 -74 333 57 -59 383 312
2920 312 -235 -157 76 -222 -314 105 65 -275 -52 277 87 51 339 164 -231 -132 46 -173 -210 36 -45 -229
2942 -229 -3 228 145 122 220 69 -150 -93 -6 -97 -129 -62 -87 -92 41 162 207 187 105 23 -31 -88 -86 -47 -68 -160 -115 12
2970 12 15 70 279 221 -23 -2 41 -143 -173 54 -27 -287 -125 107 -54 32 410 232 -179 -40 110 -203 -157 225
2994 225 -48 -483 -108 198 -59 125 557 123 -417 -8 231 -196 -59 338 -234 -709 -18 374 -31 170
3014 170 568 -139 -642 159 470 -171 -97 235 -512 -814 269 664 -40 43 408 -361 -613 530 716 -325
3034 -325 -308 85 -614 -637 712 828 -336 -226 314 -385 -329 960 676 -750 -571 75 -516 -248 1074
$$ packed form
2878D64o78m5N25l30m99N10K54n10J52O28k83m06M89J50o25NM45m29l66N51J78
2899A80m57J74N16l24k80N22O1o02N3L20l99k21N36Q6m51K12M07k76j16M42p1
2920C12n47P8K33k98r2M19m0l40K23L29j90l6K88j75l95R9J78k19l7K46q1j84
2942b29K26K31q3k3R8j51k19N7Q7r1l2O7k5nJ33J21M5k0q2q2n4n7KL9k1r2M5J27
2970A2LN5K09n8k44K1M3j84l0K27q1k60J62K32j61Q6L78j78m11J39J50l13M6L82
2994B25k73m35L75L06k57J84M32m34n40M09K39m27J37L97n72m75O91L92m05K01
3014A70L98p07n03Q01L11o41P4L32p47l02J083L95p04Q3L65p69k52J143J86j041
3034c25J7L93o99k3J349J16j164J10N40o99N6J289k84j426J79O46n91K68J322
$$ plain form
3053 1074 588 -859 -397 407 -181 70 1142 249 -1289 -590 338 -209 90 1056 23 -1317 -225 836
3071 836 140 209 883 -376 -1570 -202 900 26 8 655 -524 -1338 372 1369 159 -121 399 -762
3089 -762 -1336 519 1299 -191 -492 201 -681 -894 1075 1520 -319 -666 98 -701 -741 1142 1160 -853 -924
3108 -924 135 -390 -216 1509 1059 -1089 -917 250 -254 -110 1292 476 -1552 -901 561 132 230 1346
3126 1346 239 -1600 -610 873 214 34 850 -329 -1770 -329 1234 395 59 721 -395 -1526 105
3143 105 1421 187 -404 205 -695 -1398 449 1568 108 -493 206 -510 -947 830 1475 -326 -926 -89
3161 -89 -556 -702 1041 1345 -545 -875 171 -164 -260 1157 945 -1018 -1081 147 -80 -108 1070 632 -1116
3180 -1116 -765 586 273 56 877 188 -1371 -721 642 253 -66 604 -20 -1188 -244 1043 399 -127
$$ packed form
3053A074m86j447M62Q04n88K51J072q93j538O99R28n47K99R66j033j340J092J061
3071H36o96O9O74j259j194J368J102q74j8O47j179q14J710R97j210k80N20j161
3089g62n74J855P80j490l01O93q82k13J969M45j839l47P64p99m0J883J8k013p1
3108i24J059n25J74J725m50k148J72J167n04J44J402q16k028O51J462m29R8J116
3126A346j107j839R90J483o59j80Q16j179j441J441J563q39l36O62j116j131J631
3143A05J316j234n91O09r00p03J847J119j460o01O99p16m37J777O45j801o00Q37
3161h9m67j46J743L04j890l30J046l35r6J417k12j963o3J228k27k8J178m38j748
3180a116L51J351l13k17Q21o89j559O50J363l89l19O70o24j168R44J287o44n26
$$ plain form
3198 -127 360 -268 -1182 -140 981 188 -369 161 -240 -802 319 1178 162 -466 28 -282 -708 339
3216 339 922 -186 -655 18 -97 -311 615 897 -279 -623 66 -60 -274 447 488 -585 -634 197 159 -32
3236 -32 540 409 -543 -439 294 120 -148 238 75 -634 -332 429 259 -31 281 102 -455 -129 432 120
3256 120 -240 8 -92 -434 -40 454 165 -124 99 63 -208 80 369 -26 -316 -80 -63 -197 91 306 -15
3277 -15 -153 103 100 -36 126 133 -179 -270 -32 -3 -62 66 95 -72 -25 175 135 35 42 -37 -154 -92 18 -5 -40 -8
3303 -8 -7 24 120 153 74 20 -38 -82 -42 -6 -42 -79 -47 -55 -26 134 153 31 8 30 -50 -53 44 -9 -169 -118 15 -28 12 186
3333 186 125 -77 3 107 -31 -68 75 -60 -249 -68 115 -18 -5 195 66 -120 70 195 -56 -113 49 -101
3355 -101 -267 -4 163 -68 -53 181 33 -130 133 208 -139 -157 69 -108 -234 58 149 -136 -58 220 38 -104
$$ packed form
3198a27M87o28r14J042J121p93n57N30m01n62J121Q59j016o28M94l10m26J047
3216C39N83j108m69O73j15k14R26K82j176l44O89j26k14P21M1j073m9Q31l8j91
3236c2N72j31r52J04P33j74k68L86j63p09L02P61j70k90L12j79n57L26N61l12
3256A20l60K48j00l42L94M94k89k89K23l6k71K88K89l95k90K36J7j34K88K15l21
3277a5j38K56lj36J62Pl12r1K38K9n9J28K9j67M7K00m0j00Pp9j17O2J10k3l5L2
3303hJL1R6L3p9n4n8m4M0L6l6l7L2qK9J60J9j22k3K2q0lR7n3j60N1J33m3M0J74
3333A86o1k02Q0J04j38l7J43j35j89J81J83j33J3K00j29j86J90J25k51n7J62j50
3355a01j66K63J67k31J5K34j48j63K63P5l47j8K26j77j26K92R1k85P8K78j82j42
$$ plain form
3377 -104 170 154 -199 -127 118 -96 -209 86 109 -167 0 274 33 -102 164 102 -211 -71 143 -140 -233 88
3399 88 81 -162 49 248 -28 -110 153 103 -199 -40 96 -169 -213 104 80 -118 61 198 -61 -73 182 95 -161
3422 -161 -45 42 -193 -161 125 80 -106 59 150 -40 -12 193 59 -161 -55 8 -147 -78 137 47 -105 40 117
3445 117 2 26 148 0 -166 -89 -17 -95 -53 69 -9 -97 33 120 57 49 80 -32 -142 -80 1 -13 -37 11 -2 -33
3471 -33 40 128 123 50 15 -21 -101 -99 -1 26 -54 -57 13 -10 9 124 182 22 -74 -18 -66 -139 -1 80 -84 -143 28 34 -31 157
3501 157 221 -46 -152 21 -17 -142 54 130 -151 -203 89 90 -19 205 252 -153 -219 89 24 -138 98 112 -303
3524 -303 -266 180 151 -22 231 189 -312 -250 226 99 -152 75 25 -433 -213 386 233 -86 160 98 -410 -142
3546 -142 451 142 -278 -22 -46 -453 -47 609 211 -256 55 41 -351 81 619 18 -497 -101 -20 -337 203
$$ packed form
3377a04K74j6l53P2K45k14j13K95K3k76J67K74k41j35K66o2l13J40K14k83r3L21
3399H8pk43K11J99k76q2K63n0l02J59J36k65m4L17k4j98J79J37k59j2K55q7k56
3422a61J16Q7k35L2K86m5j86J65R1j90K8K05j34k20J06O3j55O9K15r0j52J45P7
3445A17j15K4J22j48j66P7P2p8M2J22p8q8J30Q7o3qL1j12j10O2Q1j4k4M8j3l1
3471c3P3Q8np3l5l6q0KR8K7q0lP0k3J9J15N8j60r6N6m8p3J38Q1j64n9J71Oo5J88
3501A57O4k67j06J73l8j25J96P6k81n2K92Jj09K24M7m05o6L08o5j62K36J4m15
3524c03L7M46k9j73K53m2n01O2M76j27k51K27n0m58K20N99j53l19K46o2n08K68
3546a42N93l09m20K56k4m07M06O56l98m67L11j4l92M32N38o01n15L96Q1l17N40
$$ plain form
3567 203 680 -24 -508 20 114 -201 288 574 -297 -719 -36 130 -158 353 539 -371 -625 210 345 -54
3587 -54 313 341 -635 -709 269 363 -92 249 253 -612 -494 583 525 -123 94 48 -728 -455 646 445 -290 -24
3609 -24 28 -588 -136 903 460 -421 -160 -64 -589 -63 860 244 -639 -202 63 -343 233 963 107 -773 -216
3630 -216 88 -279 262 773 -215 -882 -82 325 -33 400 712 -359 -877 55 398 -58 241 412 -576 -823
3650 -823 288 594 34 221 316 -613 -671 458 593 -156 -50 69 -671 -504 671 670 -195 -83 68 -537
3670 -537 -287 757 509 -477 -305 -28 -457 -80 847 421 -529 -235 116 -240 101 778 124 -747 -313 137
3690 137 -150 177 703 -23 -706 -88 350 -16 173 489 -278 -786 -60 387 -12 112 364 -315 -597 207
3710 207 525 20 13 175 -426 -581 262 489 -91 -82 125 -314 -314 469 524 -140 -175 32 -325 -267 437 375 -292
$$ packed form
3567B03M77p04m84N28R4l15M89K86q71m22O83J66k88N11J86r10k54Q35J35l99
3587e4L67K8r76p4R78R4m55L41Mq65J18J077n8o48K17m6p76K73J101k01p35K66
3609b4N2o16M52J039m43q81K61R6n25N26R23o16q83M37K65m06N76P30q56q80N57
3630b16L04l67N41N11r88o67Q00M07l58M33L12j071n18R32L43m56K99J71r88k47
3650h23J111L06n60J87R5r29n8J129J35p49J06J19p40J67J175jq65J12J51o05
3670e37K50J044k48r86J72K77m29L77R27m26r50K94L51l56L41O77o54q71M34M50
3690A37k87L27N26p26o83O18M38l66J89L16p67n08P26M47l99J24K52o79k82Q04
3710B07L18n05pJ62o01j55Q43K27n80RK07m39%P83N5o64l5K07l57N8P04o2o67
$$ plain form
3733 -292 -219 98 -132 -34 526 287 -365 -232 79 -142 -55 362 82 -444 -156 202 13 72 363 27 -400
3754 -400 -93 193 -33 -31 177 -112 -377 22 286 54 31 192 -86 -269 86 239 -58 -96 38 -140 -200 157
3776 157 280 -5 -43 89 -45 -109 140 163 -152 -175 11 -76 -78 165 148 -81 -56 94 32 -11 97 16 -183 -106
3800 -106 31 -5 -3 87 36 -69 38 121 59 5 0 -63 -118 -23 42 -6 -17 14 3 16 96 97 30 -22 -53 -71 -31 -3 -14 -41
3830 -41 -38 -19 30 84 76 22 8 -20 -56 -31 20 -43 -101 -37 5 -5 76 128 33 -40 11 35 -51 -7 31 -89 -115 12 46 -10
3860 -10 64 128 -13 -49 62 58 -66 -32 6 -115 -112 62 59 -57 45 107 -34 -32 108 41 -112 -26 14 -117 -83 90
3886 90 31 -83 52 114 -24 -2 119 0 -133 -5 39 -106 -56 101 12 -76 93 134 -29 0 115 -10 -121
3909 -121 26 35 -130 -64 80 -4 -50 110 106 -50 -10 93 -27 -94 25 -2 -145 -64 80 4 -14 102 76 -58 17
$$ packed form
3733b92P3L17k30R8N60k39o52J33L11k21Q7M17k80n26K88L58j89N9K91l36m27
3754d00L07K86k26KK08k89k65L99K64k32k3J61k78j83L55J53k97l8J34j78o0L57
3776A57J23k85l8J32j34o4K49K3l15k3J86q7kK43j7k29K5J50o2m3J08q1j99P7
3800a06J37l6KR0n1j05J07Q3o2n4no3n5R5O5m8j1L1j1J3Q0Jo7n2l1j8M0K8j1k7
3830d1LJ9M9N4qn4j4k8l6K5N1o3n8O4M2j0Q1N2r5p3N1K4q6M4L8j20k6J27L4n6
3860a0P4O4j41l6J11mj24L4L8j21LJ74lj16J02O2j41KJ40o7j53Q6M0j31L4J73
3886I0n9j14J35O2j38K2J21j19j33J28M4j45N0J57q9q8J69M1j63K9J15j25j11
3909a21J47Rj65O6J44q4m6J60mj56M0J03j20o7J19k7j43Q1J44p6j8J16k6j34P5
$$ plain form
3934 17 99 -18 -66 12 -29 -125 -11 93 28 -15 80 51 -25 39 99 -16 -72 -37 -54 -94 -1 72 1 -23 37 37 -2 63 65
3963 65 -32 -75 -68 -53 -51 17 38 -2 -15 20 56 59 52 29 -27 -84 -71 -23 22 -1 -1 15 -12 1 82 96 25 -18 -8 -61 -85 13 55
3996 55 -50 -35 29 -18 -12 115 125 -27 -62 -13 -74 -105 50 62 -90 -93 55 9 -19 168 148 -87 -87 34 -48 -95 105
4023 105 74 -175 -103 102 26 0 211 119 -190 -124 99 -28 -81 137 14 -281 -92 188 46 7 224 33 -295
4046 -295 -78 195 -4 -85 103 -80 -348 -7 315 60 -35 164 -57 -324 52 326 -33 -175 70 -115 -318
4067 -318 158 426 -8 -151 107 -72 -259 220 390 -174 -309 31 -103 -222 323 413 -210 -287 107 -15 -119
4088 -119 343 277 -390 -385 107 3 -73 360 240 -427 -289 274 121 -30 302 76 -578 -293 322 127 -51
4109 -51 274 37 -516 -109 512 190 -94 169 -113 -592 -68 529 108 -213 92 -97 -453 134 650 78
$$ packed form
3934A7Q2j17m8P8m1r6J14J04o5m3R5k9p6O4O0j15n6L5j7m0R3P3p1k4O0%l9O5K
3963F5r7m3PJ5KO8K1m0j3L5L6Lpk3n6n7J3M8M5k3%J6k7J3Q1J4p1m3J0n3k4R8M2
3996E5j05J5O4m7OJ27J0j52l5M9o1l1J55J2j52lJ48m6k8J87k0k35%J21q2m7K00
4023A05l1k49P2K05p6k6K11r2l09O6K23j27n3K18j23k95J89K80j42l9K17j91l28
4046b95K17K73j99q1J88j83k68L41L22k55r5J99k21k67L76K74l59j42K45j85k03
4067c18M76K68m34j43K58j79j87M79J70n64j35L40j34j19N45R0o23p7L94j22j04
4088a19M62o6o67NM92j04p6M33j20o67J38N63j53j51L32k26o54K85O15j95j78
4109e1L25k37n53M07O21l22k84K63k82m79N24N97m21l21L05j89l56N87N16n72
$$ plain form
4129 78 -316 -1 -149 -439 198 601 -81 -426 20 -35 -248 368 623 -190 -492 8 -19 -207 345 452 -379
4150 -379 -501 135 151 -40 423 379 -459 -474 219 173 -79 288 173 -573 -392 383 291 -28 271 101 -562 -289
4172 -289 469 222 -187 69 -49 -574 -153 607 268 -198 51 -29 -466 8 613 138 -396 -72 -59 -359 139
4193 139 650 58 -397 -5 55 -218 229 553 -147 -546 -50 71 -152 255 473 -214 -460 105 179 -60 224
4214 224 290 -374 -497 124 185 -72 180 214 -351 -335 304 285 -77 90 75 -425 -296 314 244 -153 27 76 -308
4237 -308 -109 456 251 -186 -48 3 -302 -84 396 117 -276 -57 68 -148 72 430 85 -314 -61 47
4257 47 -156 37 287 -63 -338 -9 145 -37 110 273 -87 -298 20 126 -85 16 133 -168 -265 99 196
4278 196 -4 59 129 -126 -181 125 139 -90 -41 31 -141 -134 173 166 -61 -7 62 -72 -59 135 68 -158 -102 3 -76
$$ packed form
4129G8l94L15j48k90O37M03o82l45M46n5k13O16K55q13l02N00k7j88N52J07q31
4150c79j22O36J6j91M63m4q38j5O93m6k52L67j15p46J81P75r2l19K99j70o63K73
4172b89P58k47m09K56j18n25M21P60l39m66K49q0m37M74O05m75n34L24J3l00M98
4193A39N11n92m55L92O0k73M47L24p00l99M96J21k23M07K18o87k46N65P4k39K84
4214B24O6o64j23O21O1k57K52L4n65J6O39j9l62J67j5n00J29O10p0l97J80M9l84
4237c08J99N65k05m37J38N1l05K18M80k79l93K19J25k16K20L58l45l99K53J08
4257D7k03J93K50l50k75L29J54j82J47J63l60k11L18J06k11J01J17l01r7L64R7
4278A96k00O3P0k55n5L06J4k29M9P2j72PL07pk27N4O9j34J3J94o7k26N6J05p9
$$ plain form
4303 -76 -31 151 81 -93 -22 90 -5 -14 90 -13 -164 -69 38 -20 -5 67 19 -57 32 106 25 -8 15 -44 -91 -9 49
4330 49 -11 -18 15 13 13 54 73 11 -38 -46 -49 -32 -6 0 -41 -40 -10 38 47 47 28 -5 -44 -28 5 -2 -48 -34 -10 -26 16 79 57 22 18 32
4366 32 -13 -21 32 -8 -73 -46 12 -2 6 70 47 -26 15 48 -9 -35 3 -27 -99 -32 32 -14 -26 63 30 -39 9 71 -17 -65 4
4397 4 -34 -93 -5 54 -27 -22 74 39 -22 47 86 -36 -55 27 -19 -73 17 51 -26 -7 80 39 -30 45 42 -51 -38 30 -22 -81 0
4428 0 30 -41 6 84 23 -33 33 38 -55 -34 25 -41 -81 -9 23 -15 29 86 14 -9 47 36 -27 -12 6 -52 -48 21 29 8 33 43
4460 43 4 0 57 17 -17 -23 -36 -55 -40 16 21 1 18 8 -1 35 40 4 -20 -37 -56 -51 -3 11 11 19 23 -2 26 65 29 4 -1 -39 -65
4495 -65 -10 28 -5 1 23 11 -20 64 91 11 -10 2 -64 -80 23 49 -35 -32 32 -35 -39 95 92 -64 -48 3 -92 -90 62 47 -93
4526 -93 -30 51 -38 -29 155 94 -112 -53 38 -83 -59 139 40 -164 -31 100 -25 14 197 47 -183 -44 75 -71
$$ packed form
4303g6M5J82p0j74P1J12r5rJ04j03j51R5J07n8J5P2m8p6Q9P4q1l3K3n9m7Q2N8
4330D9o0pL3k%M1J9o2m9qlJ7K6Om1JL0M8R%j9l3l9J6L3pm6J4K4j6M2O3k2l5mJ4
4366C2m5qN3m0o5K7N8j4QO4k3p3M1L3n7k6L8l0p2O7O4m6j2Q9l3o9M8O2q8m8O9
4397Dl8n9Q8N9q1NR6l5o1O9L9j22j9Q2m6n4R0L4p7J9Q7m1o9P5lr3J3O8n2n9Q1
4428@L0p1M7P8o1n6O6Nr3K1N9o6m0P2L2l8M4N7p2k3N6j1o3J5J8n8MO9Qk1K5J0
4460D3l9mN7m0l4oj3j9J5N6Nk0J7j0rL6Nl6k4j7j9NM8J4%QMk5K8L9l6k5nl8k6
4495f5N5L8l3OK2j2l1Q4K7q0k1J2o6j6J03K6q4LO4o7mJ34lj56J6N1r5KJ52j5j40
4526i3O3Q1q9RJ84o1k06N9R1j21K4J98r9k04J33J31j25L9J83j50k30J39J19j46
$$ plain form
4550 -71 -36 142 -26 -224 -11 148 -9 37 193 -39 -245 7 137 -63 -42 102 -129 -272 83 221 -15
4571 -15 18 147 -125 -241 116 218 -87 -84 70 -159 -228 209 291 -84 -56 103 -133 -167 265 234 -220 -164 50
4594 50 -155 -133 327 241 -239 -137 117 -84 -59 327 123 -372 -200 122 -75 -26 337 83 -377 -104 226 5
4616 5 9 281 -44 -468 -99 252 5 1 251 -68 -403 54 370 22 -36 156 -193 -449 82 381 -49 -100 117
4639 117 -174 -335 245 442 -75 -182 49 -209 -303 283 388 -201 -247 82 -127 -155 394 386 -298 -291 77 -104
4661 -104 -128 369 235 -396 -274 160 14 0 403 174 -431 -227 218 20 -38 267 8 -500 -151 327 88
4682 88 -5 255 -50 -481 -48 366 45 -119 115 -130 -447 52 459 53 -120 113 -111 -348 159 434 -58
4703 -58 -257 13 -134 -270 258 436 -109 -243 80 -45 -163 289 338 -249 -325 49 -15 -103 289 283 -277 -266 140
$$ packed form
4550g1L5J78j68j98K13J59j57M6J56k32k06K52J30k00K1J44k31j43L55J38k36
4571a5L3J29k72j16L57J02l05LJ54k29o9M37Q2l75K8J59k36l4M32l1m54N6K14
4594E0k05K2M60q6m80J02K54k01K5L86k04m95J72L22j97M9L63k54m60K73L30k21
4616EMK72l25m24L69L51k47mK50l19l35M57L16l48n8J92l49k56N31K99m30n1K17
4639A17k91j61N80J97n17j07K31k58r4N86J05n89m6L29k09k8N49qo84PL68j81
4661a04k4M97j34o31J22M34j46j4M03k29o05K04M45j98n8L05k59n08L49M78k39
4682H8r3K60l05m31M33M14l21j64K34k45l17M99M07m06j73K33k24k37N07K75m92
4703e8j99K70j47j36N28J78n45j34L23j25j18M52M9n87p6L74o4q8L92on60J1M06
$$ plain form
4726 140 69 -68 234 140 -380 -270 150 68 -65 199 75 -348 -133 274 118 -62 123 -17 -359 -104 288
4747 288 83 -101 89 -14 -260 38 355 69 -151 29 -48 -253 43 301 -20 -205 40 0 -141 131 294
4768 294 -58 -212 15 -1 -133 80 181 -134 -222 50 63 -51 130 175 -137 -183 74 52 -77 66 85 -168
4790 -168 -149 130 104 -14 81 74 -134 -88 129 65 -82 -11 5 -131 -41 161 80 -73 18 35 -90 -18 121 8 -124
4815 -124 -39 0 -80 -5 126 25 -97 6 56 -31 -11 74 -36 -132 -27 41 -29 3 66 -9 -51 39 69 9 -2 21 -33
4842 -33 -77 2 39 -27 -22 25 -1 -11 48 62 -21 -38 -21 -29 -43 9 17 -24 -41 5 32 22 30 37 -23 -40 -12 8 -27 -23 1 -21 -22 26
4876 26 57 25 18 28 2 -36 10 16 -24 -39 -5 -9 -4 27 57 10 -10 26 12 -27 -2 6 -47 -60 4 1 -26 20 40 1 -20 27 3
4909 3 -43 -13 -7 -51 -43 26 18 -26 23 58 7 -2 65 5 -35 -11 21 -38 -42 31 14 -29 33 66 -9 8 48 13 -56 -14 3 -52 -41
$$ packed form
4726A40p1j37L02r4n20J10M20q2j33K64j24m23K15M07j56j80J85j40l42K55L92
4747B88k05j84J90j03k46K98L17k86k20J80p7k05K96K58l21j85K45m0j41K72J63
4768B94l52j54K27j6j32K13J01l15q8K72J3j14J81M5l12m6K57k2j29J43J9k53
4790a68J9K79k6j18R5pk08M6K17o4j47P1J6j36R0K02q1j53R1J7j25P2J39j13j32
4815a24Q5L9q0P5J31j01j22J03N0q7K0Q5j10r6J05O8p0L2O3p5m2R0L0o0j1K3n4
4842c3m4P9L7o6NM7k6j0N9J4q3j7J7qj4N2Qm1j7M6K7j0QPo0j7K8K0l5MK4k2jM8
4876B6L1l2pJ0k6l8M6Om0j5L4mNL1L0m7k0L6j4l9K5Qn3j3O4lk7M6K0l9k1M7k4
4909Cm6L0Om4QO9qm4M9L5n1rO7o0m0K4L2n9mP3j7m3O2L3p5J7M0l5o9M2J7n5J1
$$ plain form
4942 -41 4 -10 -26 34 41 0 -4 33 -23 -45 3 -7 -56 -34 21 -7 -7 43 38 1 4 28 -1 -13 16 -26 -44 -16 9 7 18 53 15
4975 15 -12 20 22 -4 7 -5 -63 -42 -13 -8 0 30 22 -11 7 32 14 -10 13 -24 -84 -26 9 -12 -1 43 1 -26 37 52 1 5 14
5008 14 -58 -67 19 35 -18 4 43 -14 -34 74 54 -23 -4 0 -80 -75 42 33 -52 10 36 -68 -40 91 44 -62 -1 0 -93 -49
5038 -49 88 18 -104 4 44 -59 13 153 41 -107 -14 20 -98 -2 149 -4 -136 28 75 -43 51 173 -15
5061 -15 -166 14 56 -71 21 129 -88 -196 46 105 -36 70 153 -115 -196 64 94 -77 19 96 -157 -196 134
5084 134 152 -48 57 105 -170 -147 174 138 -122 -15 40 -197 -114 235 166 -118 7 60 -184 -76 266 105 -218
5107 -218 -60 33 -179 -18 320 93 -231 -33 72 -131 25 303 -20 -331 -60 85 -99 67 292 -51
5127 -51 -310 13 169 -53 79 233 -141 -365 40 179 -37 72 197 -162 -305 159 251 -41 18 112 -254
$$ packed form
4942d1M5j4j6O0Pm1mL7n6k2M8j0m9K2N5k8%N0nl7LK4k9j2K9m2j8K8K5kJ1L5l8
4975A5k7L2Kk6J1j2n8K1K9NQL0ql3J8K5j8k4K3l7o0N8L5k1J1M4m2k7O3J5n1MR
5008A4p2rQ6J6n3K2L9n7k0J08k0p7J9Mq0NJ17rq5O2K6j04K8J31m7j06O1Jr3M4
5038d9J37p0j22J08M0j03P2J40j12j48R3L4j18R6J51j53j32J64M7j18R4J22j88
5061a5j51J80M2j27R2J08k17j08K42N9j41J06Q3k68q1K60L0j71R6P7k53l9L30
5084A34J8k00J05M8k75K3L21l6k60J07N5k37Q3L49o9k84J25N3k44J08L42j61l23
5107b18J58R3k12J61L38k27l24J98J05k03J56K78l23l11K71J45j84J66K25l43
5127e1k59L23J56k22J32J54l74k24M05J39k16J09J25l59j43M64R2k92N9R4l66
$$ plain form
5148 -254 -299 193 254 -96 -16 73 -230 -196 300 269 -146 -74 27 -252 -152 321 193 -231 -113 67 -169 -46
5170 -46 404 172 -294 -122 68 -129 -12 349 67 -355 -97 157 -40 60 347 -2 -378 -64 176 -48
5190 -48 31 241 -102 -398 2 257 9 44 205 -166 -353 77 268 -39 -38 100 -197 -312 169 317 -42 -48
5212 -48 84 -185 -233 243 293 -142 -139 44 -162 -147 300 275 -171 -126 85 -99 -82 294 180 -268 -178 78 -66
5235 -66 -35 293 122 -282 -120 134 -12 -11 228 11 -344 -121 160 6 -6 192 -18 -296 -16 219 27 -33
5257 -33 112 -79 -287 13 226 10 -57 89 -72 -192 114 259 -21 -88 40 -81 -179 121 218 -75 -126 59
5279 59 -33 -93 166 200 -111 -139 48 -44 -100 124 119 -156 -133 92 17 -28 153 100 -161 -110 96 13 -46 87 44 -166
5305 -166 -64 120 61 -7 87 42 -136 -37 121 32 -62 26 -4 -115 8 150 28 -43 20 -2 -81 9 95 -23 -98
$$ packed form
5148b54m5M92O1l50Q0Q9l03L4M96l1m15P2J01k79J00M73j28m24J18J80k36J23
5170d6M50k32m66J72J90j97J17L61k82m22K58K54j97J00K87l49l76L14K40k24
5190d8P9K10l43k96M00K55k48L5J61l71j87M30J91l07JJ38k97j15M81J48l59o
5212d8J32k69m8M76N0m35LJ83k06J5M47k5m46M5K11j84J7L76j14m48R0K56j44
5235f6L1L28j71m04J62K54j46JK39k17l55K23K81j54j2J98k10k78K80K35j92o0
5257c3J45j91k08L00K13k16o7J46j61j20L06J45k80o7J28j21r8L00R7k93n1J85
5279E9r2o0K59L4l11k8J87r2n6K24nk75K3K25p5m5J81n3k61N1K06q3n9J33m3k10
5305a66J02J84n9o8R4m5j78R9J58q9r4Q8l0j11J23J42j22p1O3k2p9R0Q6j18p5
$$ plain form
5330 -98 -18 -17 -53 27 108 -7 -71 21 33 -35 19 63 -62 -103 8 30 -26 27 69 -21 -49 49 60 -13 9 13 -46 -60 31 41
5360 41 -25 5 36 -11 -9 59 41 -29 -17 -5 -36 -37 17 17 -36 -26 31 12 5 43 23 -22 -27 -1 -19 -25 -4 15 -23 -15 31 38 7 26
5394 26 25 -22 -15 18 3 -29 -27 11 -4 -3 50 35 -17 3 18 -11 -26 3 -10 -42 -21 20 -12 -13 44 19 -17 5 38 -17 -28 5 -5
5427 -5 -47 -13 16 -2 -12 43 34 -5 18 41 -4 -27 9 8 -41 6 31 -11 0 38 29 -16 15 25 -21 -32 15 -13 -44 -6 9 -19
5459 -19 9 46 19 -18 20 13 -30 -11 11 -16 -50 -4 1 -9 8 53 8 -4 20 9 -4 13 8 -33 -37 -4 3 -8 29 31 -18 1 15
5492 15 2 -3 9 -6 -55 -25 15 -18 2 28 -2 -26 4 31 -6 2 19 -43 -62 -1 17 -12 20 37 -20 -25 46 33 1 23 17 -49
5524 -49 -46 35 28 -16 17 38 -48 -28 83 39 -34 7 14 -89 -41 64 19 -49 7 11 -70 -8 90 24 -54 3 -9 -104 -12 98
5554 98 -15 -72 24 14 -61 40 143 -4 -81 12 9 -80 41 121 -53 -104 36 34 -45 84 138 -75 -117 39 12 -78
$$ packed form
5330i8Q0Jl6Q0Q1j15o4R2J2o8N4M4j25m1J11K2n6N3M2r0k8R8J1p3K2Mn9j4R1J0
5360D1o6L0L1m7KO8j8p0J2J2l1jN4%n3J0N7j9pL8k0m5nK6j8oK1J9l8QM6Pl1J9
5394B6jm7PL3j5l2KL8j5JN3j5n2K0J5k9j5K9j3l2K1M1l2jN7k5l6K2L3n5j1L3j0
5427em2L4K9j8j0N5rl9K3K3m5k3L6jm9M7K5m2J1L8rm5L1J0m6j1M7k8l1L8J5k8
5459a9K8L7k7l7L8pm3J9K2k7l4M6Nj0J7M5m5j2K4j1j3J7nm1mL3Pj1L7Km9J9J4
5492A5j3nJ2j5m9L0M0l3K0K6l0k4L0K7l7QJ7o2j9O1J8k9L2J7n7nP1j3l2K2oo6
5524d9LQ1pm4L3K1q6K0J11m4p3M1Pj03M8J05m5o8N6Mq1O2R8o6p8N7j2r5R2J10
5554I8j13n7R6j0p5J01J03j47p7R3lq9J21Q0j74n1J40kp9J29N4k13m2J56k7r0
$$ plain form
5580 -78 63 95 -123 -130 78 58 -37 96 89 -145 -129 96 38 -70 59 56 -170 -95 163 76 -36 90 47 -172 -67
5605 -67 177 49 -100 47 -1 -184 -19 228 75 -101 40 11 -178 14 241 9 -178 2 -13 -154 64
5626 64 264 -19 -194 23 11 -124 101 215 -107 -232 19 39 -90 134 221 -133 -230 78 83 -61 127 167 -214
5649 -214 -243 116 113 -50 122 131 -212 -188 192 149 -62 75 49 -275 -161 226 138 -99 49 29 -239 -81 290
5672 290 126 -142 -11 -4 -248 -23 309 77 -191 -18 29 -174 60 342 21 -248 -28 25 -141 80 302
5693 302 -54 -278 5 84 -70 127 281 -112 -304 28 104 -64 102 179 -186 -281 94 172 -24 85 140 -221
5715 -221 -248 126 170 -79 28 73 -232 -177 214 192 -78 7 44 -203 -124 257 163 -148 -41 26 -182 -42 297
5738 297 137 -162 -31 45 -127 0 269 52 -249 -56 55 -97 24 261 1 -248 -19 104 -63 47
$$ packed form
5580g8J41L2k18pK08k0r5J33pk34J6K25n8j08J29lk26P5K58q7j12J26m3k19J05
5605f7K44j28j49J47m8j83J65K47j53j76J41k9j89J92K27k32j87J80j5j41K18
5626F4K00k83j75K17j2j35K25J14l22j25K51K0j29K24Q7l54r7L08Nj44J88M0l81
5649b14k9L59lj63J72Rl43K4L80m3k11J37k6l24J14L87q8k37J48k0k68J58L71
5672B90j64k68J31Pk44K25L32k32k68J73M7k03K34K82l21k69K20N3j66K21K22
5693C02l56k24K83P9j54J97J54l93j92L32P6j68J66P7l65r5L75P8j96J09N5l61
5715b21k7L74M4k49J07M5l05N5L91k2k70Q5L7k47P9L81r4l11J07O7k08J40L39
5738B97j60k99J31P6j72J27K69k17l01J93J11j52J21K37k60k49K29J23j67J10
$$ plain form
5758 47 199 -69 -279 -9 108 -29 33 164 -89 -217 67 147 -16 13 103 -133 -200 95 166 -37 -3 70 -108
5781 -108 -131 153 172 -65 -47 40 -124 -108 145 135 -101 -69 45 -80 -35 182 95 -136 -72 35 -72 -51 133 53
5805 53 -143 -54 79 -23 3 138 29 -154 -45 81 -19 -21 92 -13 -138 3 115 17 5 83 -11 -111 7
5828 7 94 -8 -36 35 -36 -95 39 99 -10 -36 36 -20 -64 43 74 -57 -60 8 -32 -43 66 72 -43 -37 37 8 -29 47 38
5857 38 -65 -46 33 5 -11 52 39 -33 -29 66 29 -10 30 8 -52 -33 45 16 -32 10 11 -25 -2 52 24 -36 -12 -1 -39 -20 39
5888 39 -3 -27 -6 17 -5 7 41 10 -29 -8 15 -7 3 25 9 -24 5 46 18 5 24 12 -32 0 27 -14 -19 1 6 -19 13
5919 13 38 -5 -13 4 7 -27 -18 21 -17 -42 -4 -4 -19 2 25 -12 -22 21 6 -21 -16 20 -24 -33 19 20 -14 5 37 7 -20 46 16 -32
5953 -32 -8 12 -8 -20 19 7 -14 2 34 1 -5 16 -1 -30 -13 12 -27 -29 12 -18 -19 7 30 0 -9 18 -14 -16 -5 11 -18 -13 -2
$$ packed form
5758D7J52k68k10K70J17j37O2J31k53j28K84Q0j63K9R0k36o7K95P1k03L4P3j78
5781a08k3K84J9k37J8Q7j64J6K53j0k36L2J14j25M5K17q7k31O4J07j07K1J84q0
5805E3j96Q9J33j02K6J35j09j83J09J26j00kJ13j05j25J41J12r8j2P8r4j00J18
5828GQ7j02k8P1p1n9J34O0j09k6P2n6m4J07L1j31lO8m0j1J09Oj15OP4k9l7P6r
5857C8j03J9P9k8j6O3j3p2MR5l7l9M0k2o0J9P8k9m8M2Jl6K3N4k8o0K4J1l8J9N9
5888C9m2k4K1K3k2J2L4l1l9K1K3k2J0K2j6l3K9M1k8j3J9j2m4L2K7m1nK0Nk5L2
5919A3K5m3qJ7Ll4RL9l8k5L8%j5K1K3l7j0M3j5k7NL6m4rN2Jl4J9L2l0k7O6l0m8
5953c2K4K0k0j2L9j2k1J6L2l3oK1j7k9J7K5l9kM1l0jK6K3l0rK7l2kJ1J6k9NJ1
$$ plain form
5986 -2 -13 -18 38 31 -10 8 25 5 -5 30 -4 -25 -3 17 -8 6 47 10 -20 8 3 -33 -1 22 -11 -50 -7 6 -13 12 42 -22
6018 -22 -30 8 8 -16 23 13 -55 -45 15 5 -18 37 28 -25 -7 52 8 -22 37 13 -66 -27 46 10 -1 41 11 -71 2 73 4 -27
6050 -27 21 -22 -93 -12 52 -10 -33 35 -16 -72 26 86 -13 -42 23 -37 -95 22 85 -33 -46 43 -8 -68 77 103 -49 -59
6078 -59 30 -39 -77 80 82 -76 -64 52 -17 -38 118 82 -115 -70 56 -33 -62 98 53 -150 -65 92 -2 -16 118 25
6104 25 -171 -57 100 -14 -42 100 -2 -176 -24 151 18 -20 98 -13 -175 13 171 -11 -57 60 -51
6125 -51 -179 56 193 -3 -56 54 -51 -155 96 192 -66 -125 30 -62 -130 125 195 -96 -125 59 -36 -99 157
6148 157 149 -176 -157 52 -33 -59 184 128 -182 -120 110 13 -43 174 81 -244 -129 136 34 -31 171 45 -241 -68
6172 -68 192 60 -39 105 -26 -272 -48 212 34 -81 76 -39 -232 26 261 16 -112 46 -63 -221 73
$$ packed form
5986bj1nN6pm1J8J7k0j0L5l4k1K2K0k5J4M1l7l0K8nl6L2K3l3l9M3J3j9K5L0o4
6018b2qL8%k4L9j0o8J0O0j0k3N5rn3J8N9m4l0N9k4p9L9P3l6j1M2l0q2P3P1o9l1
6050b7M8m3p1Q1O4o2k3O8n1n6R8O0r9k9O5o0n8J17O3j18j3Q9n1o0J45K6j52j0
6078e9Q9o9l8J57Kj58J2J16o9k1J56l6j97M5J26q9k9J60m5k03Q5J57r4j4J34r3
6104B5j96J14J57j14k8J42j02j74J52J75j33l8J18j11j62J88J58j82m6J17j11
6125e1j28K35J37j96n3J10j05j04K51R6k58n9J55r2o8K55P0k91k9J84r5o3K56
6148A57ql25J9K09q5k6K43n6l10O2K30r7n6K17r3l25J15K65j02o5K02j26k86J73
6172f8K60j32r9J44j31k46K24K60j78j15J57j15j93K58K35k45j28J58j09j58K94
$$ plain form
6193 73 266 -36 -145 36 -48 -152 140 269 -89 -179 37 -30 -118 158 213 -157 -178 67 18 -61 179 185 -195 -193
6217 -193 94 44 -51 146 109 -231 -169 137 71 -42 136 58 -251 -124 174 75 -65 83 2 -257 -60 243 84
6240 84 -76 60 -6 -210 3 250 43 -128 23 -24 -174 54 266 17 -145 36 -1 -137 78 230 -40
6261 -40 -192 10 18 -95 100 206 -79 -181 36 53 -64 104 154 -151 -199 60 62 -42 89 122 -153 -142 121
6284 121 101 -51 70 57 -166 -118 139 88 -51 38 42 -143 -66 169 82 -71 3 15 -133 -33 165 68 -101 -8
6308 -8 29 -91 7 168 24 -119 -14 21 -84 3 130 -22 -129 3 50 -33 33 119 -37 -135 18 63 -39 23
6332 23 80 -58 -117 46 82 -18 15 62 -61 -91 56 71 -32 -27 38 -70 -71 72 74 -41 -10 34 -48 -45 48 49 -63 -42
6360 -42 13 -37 -28 75 44 -63 -33 38 -27 -12 46 19 -62 -28 40 -3 -8 69 31 -54 3 38 12 -14 37 1 -64 -18 42 10
$$ packed form
6193G3J93l02j09J81q4j04K92J29l58r0K16o7q8K76N5l70k1K45m9p9K40Ol80K
6217a93K87n0r5J97l7l40O2L06o6j13J78p8l09J27K98r9j40J48q1k59J97L03j59
6240H4j60J36o6k04K13K47k07j71J51m7j50K28K12k49j62J81l7j36K15J52k70
6261d0j52K02Qj13J95J06k85j02K17J7j17J68N0l05m8K59Kj04J31L3k75J1K63
6284A21k0j52J21j3k23M8K57n1j39Q9Mj85P7K35q7j53P4J2j48J00J98r7j69R3
6308hL7j20R8J61j44j43J05L5j05Q7J27j52j07J32M7q3O6Q6j56r8J53M5j02O2
6332B3N7j38n9J63L6j00L3M7j23l0J47J5j03NO5j08jJ43Kj15L1M4q2LR3Jj12K1
6360d2N5n0RJ03l1j07L0P1o5J5N8k7q1L4O8m3nP7l8q5N7L5k6k6N1l6o5M6O0l2
$$ plain form
6390 10 -16 32 8 -45 9 48 -8 -30 1 -16 -41 0 40 -1 -40 4 18 -8 9 32 -5 -38 -5 16 -9 4 23 -4 -24 11
6420 11 42 -1 10 31 -9 -29 6 23 -20 -19 17 -15 -21 29 26 -29 -2 20 -17 -33 6 7 -31 -36 9 -13 -29 18 15 -17 -17 21 4 -29
6454 -29 5 5 -35 -8 19 1 -23 14 32 -6 5 33 -8 -31 8 -2 -20 -9 21 -18 -16 17 21 -17 -4 17 -22 -39 8 6 -39 -2
6486 -2 11 -22 -12 26 13 -14 3 12 -41 -2 20 -9 -20 9 14 -23 7 43 19 -16 18 14 -24 4 30 0 -34 7 -2 -23 16 48 2
6519 2 -11 22 4 -40 9 17 -38 -42 7 -7 -20 35 30 -33 -34 15 -14 -23 36 15 -56 -21 19 -20 -10 54 26 -40 3 46 6 4 55 0
6553 0 -64 -3 53 -7 1 54 -10 -60 9 65 -13 -7 31 -43 -97 26 48 -26 -10 39 -43 -58 51 77 -37 -21 26 -71 -88 69
6583 69 76 -44 -25 44 -50 -41 109 72 -72 -28 38 -63 -41 113 62 -96 -21 55 -46 -20 137 38 -122 -30 45 -58
6609 -58 -19 119 4 -152 -15 75 -33 22 131 -24 -171 -2 89 -36 11 104 -47 -172 44 126 -7 18 100
$$ packed form
6390A0k6M8k4n3N4L9n6k2L1j7k5M1M0m1l9M4J4k6J7K3l7l3L3K1k5J3J9k7k0L5
6420A1L1m3J1K1m0k0L5J7m3JL6l2oN0ln5K7K2l7j6L9Jl8nM5k2j6M7ll2%L8j7l3
6454b9L4%m0K7K7j8k4L7J8l8J1K8m1k3L9j0j8J1L0l9KL3Ml8J3K1l9j7M7km5L7
6486bJ3l3J0L8j3k7J7Rn3L9K2k9j1K9Nl7L0L6k4l5L4ml8K8K6l0l4M1rk1L9L2m6
6519Bj3L3j8m4M9Qn5mM9j4j3N5no3jM9k9rN9k1p1L5M0l9J0O4k8o6M3M3m0kN1n5
6553@o4O1N6o0QN3o4n0O9N6p8OL8p4n4J23K2p4J6M9q2j5J09K6j14J6M7r7j7J57
6583F9Pj20J9O9r4RJ50l7j44M4O6j01K2J54n1j58P5P6j01K6J57r9j60R2P5j03
6609e8L9J38j15j56J37R0j08N5J09j55j47J69R1j25M7R3j51j25K16Q2j33K5Q2
$$ plain form
6632 100 -78 -164 70 134 -46 -29 70 -95 -143 117 163 -54 -38 56 -103 -120 135 136 -101 -68 38 -96 -96 179 134
6657 134 -128 -70 53 -88 -59 186 93 -178 -83 59 -62 -17 206 67 -198 -62 95 -33 -8 196 -1 -242
6679 -242 -42 131 -6 13 162 -29 -238 -4 178 6 -15 113 -90 -250 32 182 -20 -44 90 -98 -200
6700 -200 101 211 -43 -74 53 -112 -176 149 214 -83 -85 57 -88 -99 198 203 -123 -124 55 -67 -72 205 145 -180
6724 -180 -122 79 -27 -36 212 101 -226 -125 104 -23 -34 179 37 -255 -82 146 27 -18 146 -12 -269 -67
6746 -67 174 18 -33 108 -36 -222 11 221 17 -54 70 -49 -195 54 217 -15 -90 39 -65 -148 119 224
6768 224 -35 -118 45 -45 -122 125 180 -103 -145 28 -29 -85 140 150 -131 -142 54 -2 -43 125 88 -177 -141 84
6792 84 24 -33 113 70 -171 -85 126 53 -36 73 26 -171 -69 150 48 -39 59 10 -151 -8 160 33 -65 26
$$ packed form
6632A00j78q6K34O4j80J7R9j65m8K60M6k17J6R4j59j7K55Jk37L3J06j34%K75m5
6657A34k62N8J23j41K9K45r3k71R5J42j21M5K23j39k65J36J57j28K5K04j97k41
6679b42K00J73j37J9J49j91k09K34J82j72k1J28k03j60K82J50k02k4J34j88j02
6700b00L01J10k54l1J27j65o4L25O5k97kJ42j45j1K97Nl26jJ79j22nK77o0l25
6724a80N8K01j06rK48j11l27J01K29j27j1K13j42k92J73K28j19m5J64j58k57K02
6746f7K41j56n1J41j44j86K33K10k04p1J24j19j46K49J63k32p5J29j04q3K67J05
6768B24k59q3J63r0p7K47N5k83m2J73n7n6K25J0k81j1J96n6m1J68l7k65L6K25
6792H4o0n7J46m3k41Q6K11p3q9J09m7j97J02K19j02q7R8m9j61J43J68j27r8R1
$$ plain form
6816 26 -8 -133 3 152 7 -85 15 2 -95 44 144 -21 -111 -2 -5 -89 42 117 -46 -106 21 27 -25 51 108
6841 108 -56 -107 38 38 -34 43 76 -73 -80 68 63 -18 35 53 -68 -68 62 49 -51 7 35 -69 -59 75 57 -41 -7
6868 -7 26 -59 -31 77 26 -65 -23 10 -52 -12 80 35 -48 -4 39 -23 -12 55 3 -71 4 38 -16 3 64 6 -57 5 46 -8
6898 -8 -6 36 -18 -63 -8 30 -7 -20 7 -12 -53 8 49 -13 -34 6 -16 -41 2 26 -18 -32 21 4 -20 9 39 -20 -25 7 6 -25
6930 -25 17 38 -19 -22 30 30 -9 16 38 -10 -29 25 6 -20 -4 20 -21 -24 23 22 -17 7 25 -22 -29 19 3 -38 -7 9 -13 -13 38
6963 38 13 -25 16 18 -26 -8 22 3 -24 7 21 -9 -13 25 9 -24 15 20 -26 -18 14 -3 -39 5 23 -24 -13 16 0 -18 16 29
6995 29 -41 -23 6 -10 -33 10 12 -35 -8 19 9 -11 20 -6 -29 -15 22 -9 -20 23 2 -23 20 44 -1 -8 26 -5 -30 17 31
7026 31 -18 -22 9 -11 -35 25 30 -18 -14 7 -20 -25 13 14 -37 -19 5 -21 -18 35 29 -41 -22 22 -16 2 43 10 -51 -13 33 -8 13 70
$$ packed form
6816B6l4j25J36J49j45r2J00j3r7J39J00j65r0J09lq4J31P5j63o0J27On2P6N7
6841A08j64n1J45%p2P7L3j49pJ48nq1N3J8j21%J30j3j00N8K8j04J0J34j8r8L4
6868gL3q5K8J08n1r1M2L3o2M0R2m5q3M4M3o2J1O7n2p4P5L4n4J9O1n8o3O2M1n4
6898hKM2n4m5N5L8l7j3K7j9m1O1M1o2k1M0k2k5M3K4m4j4N3j7k4K9L0n9nL2jl1
6930b5M2K1n7lN2%l9K5K2m8j9N4j9k6J6K4m1lM7jl9K4J8m7pM8j6m1L1J6k2%N1
6963C8k5l8M1Km4J8L0j9k7L1J4l0mL8j6l3L9Nm6QL2j7l6M4J8m7J1K9j6j8L4J3
6995B9p0J8K9j6k3M3Km7K7K7j0k0L1k6k3J4L7l1j1M3k1k5M3K4m5pL4l1k5M7J4
7026C1m9mL1k0k4O0Nm8MK1k7nL8Jn1J8K4k6LN3op0J9M4l8J8M1l3o1L8M6m1K1N7
$$ plain form
7060 70 8 -60 11 36 -15 10 51 -24 -68 10 37 -26 7 49 -26 -73 33 31 -29 13 30 -63 -65 44 45 -26 19 38 -55 -66 62
7091 62 45 -48 7 22 -91 -44 83 54 -47 12 38 -59 -19 114 53 -69 5 17 -66 -28 112 31 -82 1 31 -58 13
7118 13 127 -8 -115 -11 28 -52 24 118 -29 -130 8 50 -41 46 113 -57 -149 24 48 -38 39 93 -84 -129 73
7143 73 104 -30 43 72 -104 -114 80 88 -39 18 64 -112 -92 135 101 -59 8 34 -121 -70 154 69 -109 -22 22 -121
7169 -121 -22 175 67 -125 -21 33 -105 -7 184 29 -163 -27 44 -71 38 199 7 -171 -7 72 -45 42
7191 42 170 -58 -199 7 100 -33 54 145 -81 -187 56 123 -32 32 96 -137 -183 81 120 -37 6 67 -130 -148
7215 -148 133 147 -72 -20 32 -139 -113 171 140 -93 -36 38 -107 -52 217 112 -122 -47 42 -96 -22 210 76 -161
7239 -161 -48 55 -62 3 197 12 -194 -47 78 -44 15 171 -20 -221 -15 117 -22 26 135 -62 -212
$$ packed form
7060G0o2o8P1K5n1K5M1p5m4P8K7o3L3M2p5m7J06ko0M2J7r3kJ09Jp1M5J9r3j1J28
7091F2j7r3N5J5j13M7J27k9j01N9K6r7M0J33o1j22P4J2q3L8J40q1j13Q3L0q9P1
7118A3J14j35j07J04L9q0P6R4j47j01J38M2r1Q7O7j70r2J73K4q6P7N4j77m5K02
7143G3L1j34P3K9j76j0J94Qj27N7M6j76K0K27l4j60O7K6j55N1K24q5j78Q7M4j43
7169a21R9J97j08j92J04N4j38R8J91j55j92J36P1j15J09J61j92j78J64P9j17Q7
7191D2J28k28j41K06R3j33Q7R1k26j06K43O7j55O4O4k33m6K64L9j57M3O1j97j8
7215a48K81J4k19N2N2j71K6K84l1k33N7P4j45N5K69j05k34P5Q9j38P4K32j34k37
7239a61J13J03j17O5J94j85k06J47J25j22N9J56j91k01K06J32j39M8J09j97j50
$$ plain form
7260 -212 16 124 -17 -7 95 -83 -179 74 157 -16 -16 66 -84 -148 106 155 -51 -41 49 -85 -101 138 147 -70
7284 -70 -53 43 -70 -71 152 123 -128 -91 31 -62 -42 149 85 -140 -70 60 -15 -22 129 39 -163 -67 81 -11 -4 109
7310 109 22 -159 -27 101 4 -12 97 -18 -144 -4 125 21 -15 66 -16 -113 32 133 -1 -42 26 -44 -112 34
7334 34 108 -25 -66 14 -26 -75 53 114 -50 -86 29 -20 -49 79 91 -72 -63 36 9 -19 73 64 -69 -65 41 14 -14 57
7362 57 42 -76 -41 63 27 -20 48 30 -71 -34 69 30 -31 16 4 -70 -18 63 21 -26 4 3 -67 -9 73 5 -53 -6 6
7391 6 -45 10 67 7 -36 12 20 -16 20 60 -17 -52 18 32 6 11 45 -18 -51 23 28 -13 6 20 -21 -37 10 28 -13 -3 21 -17
7423 -17 -30 27 32 -18 -12 9 -30 -31 16 23 -26 -20 18 0 -5 25 24 -24 -17 20 -2 -15 32 18 -14 -7 24 13 -15 17 14 -23 -11 12 3 -12
7459 -12 2 12 -23 6 35 8 -23 23 9 -31 -11 21 0 -26 7 16 -27 -5 27 -4 -19 6 22 -12 -1 29 -10 -16 30 24 -12 18
$$ packed form
7260b12K28J08j41J0J02j78r6K53Q3j73%Q2j50o4K54M9k06J0R0j34j6K39Rk17
7284g0J7R6j13jK23k9k51L7J22r3K0J91o4k25P0J30p5pJ51r0k02R6J48r2PJ13
7310A09q7j81J32J28r7j6J09j15j26J40J29j04l6Q1q2r7J45J01j34m1O8p0o8J46
7334C4P4j33m1Q0m0m9J28O1j64l6J15m9k9J28J2j63RR9k7k8R2rj33MJ06k7k8P1
7362E7j5j18L5J04l6m7O8j8j01L7J03l9o1M7j2p4N2Q1m2m7L0jp0N8Q2o8n8M7J2
7391Fn1N5N7o0m3M8Ql6L6M0p7l5P0J4k6NL4o3l3P4Nm1J9J4m1j6M7J8m1J0K4l8
7423a7j3N7Nn0OK1l9jM7Pm9OL8j8nL0jm8PL7k2j3M7j4l2PL1j1k8L2ll7J2K3rj5
7459a2J4J0l5K9K9k7l1M6j4m0K0L2k1k6L3Rm3K2L2l1j5K5J6l4J1L0l9oM6ol6L0
$$ plain form
7491 18 40 2 -7 20 23 -19 -5 17 -10 -16 24 16 -31 3 32 -4 -9 22 1 -24 -8 0 -15 -21 28 -3 -24 14 26 -6 -3 19 -3 -29
7525 -29 17 20 -7 -4 16 -7 -15 33 30 5 12 24 -15 -24 30 32 -15 5 4 -19 -10 31 18 -25 -4 4 -29 -26 36 5 -37 -3 2 -22 2 52
7561 52 6 -36 11 8 -22 14 46 -13 -43 9 13 -15 31 63 -11 -39 19 22 -18 36 28 -44 -52 26 37 -17 35 40 -45 -35 33 15 -28
7594 -28 19 7 -71 -43 52 17 -23 33 20 -76 -24 68 25 -23 25 5 -66 -5 83 18 -25 31 16 -66 23 94 6 -52 21 -13
7624 -13 -60 34 92 -8 -64 23 -7 -52 45 98 -40 -75 7 -3 -52 47 82 -69 -100 27 8 -37 69 72 -88 -79 53 21
7652 21 -20 71 61 -99 -55 94 48 -11 66 39 -123 -57 104 49 -32 52 9 -132 -37 125 41 -52 40 -8 -120 -14
7678 -14 139 6 -84 3 -21 -106 31 157 -1 -91 4 -10 -95 68 136 -38 -122 19 -1 -73 75 134 -48 -114 49
7703 49 30 -42 89 122 -101 -127 47 41 -41 85 94 -137 -110 87 44 -35 69 54 -146 -109 94 65 -47 54 18 -159
$$ packed form
7491A8K2l8rK7Lm2J4K2k7oM0qm7L4K9l6nL1k1k5J6Qj5oM9l1k1L8J2l2LK2k2k6
7525b9M6Lk7LK0k3qM8lk5PJ2l9rN4Km7K0jk3RM1j3m3K1Ql3LO2l1m2L4Nk4K4N0
7561E2m6m2M7ll0L6L2n9l0N2Mk8M6L2p4k8N8Lm0N4qp2qP8J1n4N2Nq5J0O8j8m3
7594b8M7j2p8K8R5l5m0N6j3r6N2R2m3m8M8k0p1O1Q8o5m3N6j5q2Q9P1q8n8P3l4
7624a3m7R4N8j00n6Q7l0m5R7N3j38l5Q2j0m9R9L5j51l1J27j9m5J06Lj60RJ32l2
7652B1m1R1j0j60M4J49m6n9P7k7j62O6J61n5q1Q4m3j41R5J62q4r3R2m8j12J06
7678a4J53j33r0Q7k4q5J37J26j58r0R5j4q5J63O8j74q4J41k0p2J48N9j82o6J63
7703D9j9p2J31L3k23k6J74oq2J26Rk31K7J97m3p9J04j5k00L7K03k9j12J01l6j77
$$ plain form
7729 -159 -68 141 73 -60 20 8 -147 -32 165 62 -77 3 -7 -113 10 184 27 -109 -1 0 -92 37 167
7752 167 -12 -130 -6 27 -71 69 152 -44 -153 6 27 -58 57 124 -82 -160 30 56 -39 63 90 -109 -130 55
7776 55 68 -36 47 67 -117 -108 103 104 -31 25 34 -113 -79 117 84 -56 8 28 -107 -37 143 78 -75 -14 16 -95
7802 -95 -13 129 41 -114 -31 16 -72 3 138 14 -125 -37 28 -47 22 120 -25 -118 -4 57 -25 25 103 -44 -114 19
7828 19 73 -17 17 70 -68 -101 39 86 -13 4 47 -48 -88 66 74 -27 -14 21 -68 -76 66 63 -52 -31 13 -36 -47 78
7856 78 47 -67 -44 14 -43 -32 73 31 -78 -23 34 -16 -3 68 22 -77 -36 40 -7 -9 63 3 -69 -15 50 10 -5 45 -6
7885 -6 -73 -13 56 -7 -17 12 -15 -57 0 62 -5 -31 13 -19 -38 8 56 -21 -38 4 -7 -37 21 49 -23 -35 13 5 -25 35 36 -19
7917 -19 -46 20 17 -5 25 34 -23 -20 27 8 -17 6 1 -34 -33 13 6 -15 -1 9 -22 -18 26 16 -26 -12 2 -21 -14 29 22 -16 -5 27 -8
$$ packed form
7729a59R1K09o8j33Q0j2j55J15J97j03j39Q0j0j06J23J74j57j36J08Jr2J29J30
7752A67j79j18J24L3r8J40Q3j96j09J59K1q5J15O7k06p8J90K6r5J02K7j99k1J85
7776E5J3j04Q3K0j84RK11Jj35N6Rj47L4J96l3j40O4K0j35P0J80o5j53O1L0j11
7802i5Q2J42q8j55Q3M7q8P5J35j24j39Q8O5p5O9R8j45r3J14O1q2N0P8j47p0J33
7828A9N4r0L4N3j38l3J40M7r9J7M3r5m0J54Qj01J3L5q9qJ42lj15K1M4m9j1J25
7856G8l1j14K3N8n7J1J05m2j09N5N7n0J3P1m6r9M1P6m7kP2o0p2N4O5m0j5N0n1
7885fo7O0O9o3j0K9k7m2N7O2o7k6M4l2j9M6M8p7j7M2j1l0N8K8p2j2M8ql0O0Jn5
7917a9k7O6lk2L0Rn7LM7j9k5K3nl5JM6pk1J4J0l1MM4j0m2J4J4k3PM3pl8J1L2l5
$$ plain form
7952 -8 -6 29 8 -29 -7 11 -3 -10 20 14 -24 8 24 -18 -13 30 9 -30 -8 19 -8 -21 6 2 -32 -1 14 -10 -18 14 4 -36 -8 5
7986 5 -22 -27 7 1 -18 14 26 -10 1 14 1 -16 5 8 -13 -11 29 9 -8 7 25 -17 -2 25 -1 -33 0 11 -26 -10 18 -4 -29
8019 -29 -9 10 -17 -10 22 -20 -45 -3 -2 -23 -7 11 -13 -22 12 15 -15 -6 14 -29 -18 16 15 -11 11 16 -11 -2 29 14 -1 15 -2 -19
8053 -19 -9 35 10 -25 -3 -3 -35 -5 27 -3 -28 -4 -2 -33 -7 28 -15 -37 -6 -2 -33 11 37 -8 -27 4 6 -17 14 33 -14 -25
8085 -25 16 8 -1 42 38 -16 -19 23 8 -6 23 16 -58 -32 45 -1 -12 33 7 -61 -21 30 6 -15 27 -8 -67 -12 33 7 -17 20 -14
8118 -14 -51 7 51 3 -11 14 -19 -56 11 69 5 -25 16 -15 -53 38 63 -19 -26 13 -11 -49 50 74 -26 -39 19 -20 -32 52
8148 52 57 -63 -66 2 -32 -40 62 35 -75 -47 25 -2 -13 61 26 -89 -49 44 -8 -1 60 6 -101 -18 68 10 -10 51 -15 -107
8178 -107 -8 81 7 -20 41 -31 -98 6 95 0 -29 31 -34
$$ packed form
7952hKL5k1l7K2J8j4pL0ol8L2J6m2NM3k1l9K2K7k7j3K7ml4L1J5k4qL2j0m0K8J3
7986Ek7nL4oj9L2J2l6J1J3j3j7K1Lk1KM0k0j7J5J8m2J5K7k6l2L3J1l7J6K8k2k5
8019b9K0J9k7PL2m2k5M2Jk1J6J8k4rL4Ll0RK0m3J1L4jk6K2Nk7RL1j5j5J6j7j7
8053a9J0M4k5l5K2%l2L0L2l0k5K4Kl1K6L5m3k2L1Ml1M4K6m5j9L1Kk3L1J9m7j1
8085b5M1qrM3mn4lM2j5j4K9pp4K6P7m6j1M5k6o8M0N1k4k1M2l5n9N5M5k6k4L7l4
8118a4l7N8M4m8j4K5l3l7O7N8o4l0M1l1l8R1K5q2pL9k4l8R9K4j00j3N8l9j2Q4
8148E2Nj20lO8l4qJ02k7j10K8P2k7j1P4l5j15M0R3n2PO1n4j07Q3Q6n8k0O1o6r2
8178a07R9Q9p4k7O1p2o7J04Q9r5k9O0o5
8191c4
$$ Imaginary data points
##PAGE= N=2
##DATA TABLE= (X++(I..I)), XYDATA
$$ plain form
0 0 0 0 0 0 0 0 0 0 0 0 0 -8 8 -8 8 -16 16 -24 25 -32 40 -48 56 -64 80 -89 105 -121 141 -161 185 -211 241
33 241 -273 307 -347 390 -437 487 -544 606 -674 746 -828 916 -1012 1117 -1230 1356 -1494
50 -1494 1648 -1812 2000 -2206 2438 -2698 2993 -3332 3731 -4193 4751 -5433 6291 -7407 8926
65 8926 -11121 14590 -20927 36274 -153721 -76656 182017 -32806 64872 207321 -14368
76 -14368 -155646 179502 245718 -47083 -86788 4949 -237907 -288323 74893 178343 -62902
87 -62902 -6117 140475 -24645 -49234 249356 212460 -121345 -136965 -31726 -191652 -172048
98 -172048 131726 117692 -133086 -41380 133007 24436 38537 251483 120755 -191232 -139271
109 -139271 -3052 -121298 -95918 116606 25745 -177708 -17420 171804 71551 68407 194665
$$ packed form
0@%%%%%%%%%%%qJ6j6J6k4L2m0M9n7P2q8J04j20J44j69J94k26K62l02L46l96M52
33B41n14N80o54P37q27R24j031J150j280J420j574J744j928K129k347K586k850
50a494L142l460L812m206M644n136N691o325P063p924Q944j0184J1724j3698J6333
65H926k0047K5711l5517N7201j89995P7065K58673k14823R7678J42449k21689
76a4368j41278L35148O6216k92801l9705R1737k42856n0416L63216J03450k41245
87f2902N6785J46592j65120k4589K98590l6896l33805j5620J05239j59926J9604
98a72048L03774j4034k50778R1706J74387j08571J4101K12946j30728l11987N1961
109a39271J36219j18246K5380K12524r0861k03453J60288J89224j00253l144J26258
$$ plain form
120 194665 23597 -211444 -85877 48651 -79612 -81969 58184 -45109 -161589 48719
130 48719 205101 75884 45157 121429 -30104 -170446 -14299 70451 -85995 -103995 6758
141 6758 -63083 -100230 107330 195712 41560 9475 76143 -31659 -105527 30408 48763
152 48763 -117382 -120777 -8795 -41539 -37960 128778 151566 -621 -6235 69050 -7852 -56445
164 -56445 35663 3759 -143117 -111481 6636 -11510 -3243 114383 98317 -23573 7198
175 7198 82882 10737 -39169 13116 -37412 -142108 -78683 27422 1887 1912 84394 61254
187 61254 -16527 35222 89379 8941 -43198 -12634 -56390 -116869 -44410 31559 -3414 -3877
199 -3877 61591 47999 6290 55375 77783 -5215 -49174 -26012 -55827 -86760 -24872 19852
$$ packed form
120A94665j71068k35041J25567J34528j28263k357J40153j03293j16480K10308
130D8719J56382j29217l0727P6272j51533j40342J56147Q4750j56446j8000J10753
141F758o9841l7147K07560Q8382j54152l2085O6668j07802p3868J35935J8355
152D8763j66145l395J11982l2744L579J66738K2788j52187n614P5285p6902m8593
164e6445R2108l1904j46876L1636J18117j8146Q267J17626j6066j21890L0771
175G198P5684p2145m9906N2285n0528j04696O3425J06105k5535K5Q2482k3140
187F1254p7781N1749N4157q0438n2139L0564m3756o0479P2459P5969l4973m63
199c877O5468j3592m1709M9085K2408q2998m3959K3162k9815l0933O1888M4724
$$ plain form
211 19852 -14319 -5324 53361 49147 26218 59413 56082 -18425 -47371 -26556 -47917 -66125 -21178
224 -21178 3329 -19597 2002 54310 51958 34806 51661 35714 -22317 -38054 -23521 -43524
236 -43524 -56787 -25060 -8036 -15132 13446 53971 49681 35735 41856 23268 -17918 -28702 -25045
249 -25045 -43952 -51780 -28037 -11897 -5941 21441 48648 45087 35835 35140 17357 -11961 -24390
262 -24390 -30334 -44671 -46371 -28089 -11632 1801 24151 41850 42104 37031 31023 13925 -8830
275 -8830 -24418 -35074 -43110 -40530 -26933 -10620 6324 24083 37120 41613 38128 27211 10588
288 10588 -8080 -25492 -37085 -39807 -35892 -26462 -9879 9240 23977 34970 41841 37427 22915
301 22915 7698 -7908 -25948 -37078 -36901 -33380 -26086 -8384 11741 24323 33983 40969 35058
$$ packed form
211A9852l4171Q995N8685m214k2929L3195l331p4507k8946K0815k1361j8208M4947
224b1178K4507k2926K1599N2308k352j7152J6855j5947n8031j5737J4533k0003
236d3524j3263L1727J7024p096K8578M0525m290j3946O121j8588m1186j0784L657
249b5045j8907p828K3743J6140N956K7382K7207l561r252o95j7783k9318j2429
262b4390n944j4337j700J8282J6457J3433K2350J7699K54n073o008j7098k2755
275h830j5588j0656q036K580J3597J6313J6944J7759J3037M493l485j0917j6623
288A0588j8668j7412j1593k722L915R430J6583J9119J4737J0993O871m414j4512
301B2915j5217j5606j8040j1130J77L521P294J7702K0125J2582R660O986n911
$$ plain form
314 35058 19452 6015 -8045 -26017 -36419 -35371 -31990 -24394 -6108 13268 24593 33281 38867
327 38867 32355 17802 4942 -9144 -25887 -35307 -34744 -30578 -21352 -4133 13430 25061 32906
340 32906 35990 30049 17473 3441 -11167 -24988 -33783 -34953 -28854 -17480 -3066 12756 26360
353 26360 32622 32163 28217 18023 1233 -13412 -23081 -32517 -36227 -26552 -12869 -2811 11865 28267
367 28267 31560 27472 27570 19580 -1578 -15792 -20868 -32241 -37868 -22603 -7520 -3672 10378 30017
381 30017 29646 23296 29122 21543 -6052 -18934 -18626 -32198 -38271 -16544 -2882 -7287 8031 32460
395 32460 28334 20843 32390 21738 -13791 -22184 -14472 -30893 -37195 -10071 -1524 -14279 6779
408 6779 37926 28592 19240 34617 17845 -23721 -22338 -6448 -28472 -36703 -6552 -4651 -21538
$$ packed form
314C5058j5606j3437j4060j7972j0402J048L381P596J8286J9376J1325Q688N586
327C8867o512j4553j2860j4086j6743r420N63M166R226J7219J7563J1631P845
340C2906L084n941j2576j4032j4608j3821q795j170O099J1374J4414J5822J3604
353B6360O262m59l946j0194j6790j4645r669r436l710R675J3683J0058J4676J6402
367B8267L293m088R8p990k1158j4214n076j1373n627J5265J5083L848J4050J9639
381C0017l71o350N826p579k7595j2882L08j3572o073K1727J3662m405J5318K4429
395C2460m126p491J1547j0652l5529q393P712j6421o302K7124Q547j2755K1058
408F779L1147r334r352J5377j6772m1566J383J5890k2024q231L0151J901j6887
$$ plain form
421 -21538 10557 47194 28585 15310 32789 10637 -30850 -15818 4118 -28731 -40482 -7241
433 -7241 -8757 -23278 21093 56449 23053 6290 28725 5920 -30544 -3935 11328 -36994
445 -36994 -48769 -6870 -7505 -17829 33971 59000 8536 -4678 29823 8467 -24866 6578
457 6578 9313 -53470 -55319 1942 911 -10245 41430 50746 -11319 -9245 41445 16520 -20984
470 -20984 8081 -3284 -70341 -50877 21007 10900 -9156 37287 34641 -25118 606 60586
482 60586 20701 -27456 -1604 -18187 -74924 -31602 41879 10755 -20470 25650 23124 -22843
494 -22843 22146 74713 10189 -44990 -12126 -22131 -63579 -6720 51449 -5974 -38847 20459
506 20459 26300 -8285 42247 73308 -15421 -63269 -9803 -10729 -45665 9766 42999 -33892 -50779
$$ packed form
421b1538L2095L6637j8609j3275J7479k2152m1487J5032J9936l2849j1751L3241
433g241j516j4521M4371L5356l3396j6763K2435k2805l6464K6609J5263m8322
445c6994j1775M1899o35j0324N1800K5029n0464j3214L4501k1356l3333L1444
457F578K735o2783j849N7261j031j1156N1675R316o2065K074N0690k4925l7504
470b0984K9065j1365o7057J9464P1884j0107k0056M6443k646n9759K5724N9980
482F0586l9885m8157K5852j6583n6737M3322P3481l1124l1225M6120k526m5967
494b2843M4989N2567o4524n5179L2864j0005m1448N6859N8169n7423l2873N9306
506B0459N841l4585N0532L1061q8729m7848N3466r26l4936N5431L3233p6891j6887
$$ plain form
519 -50779 32220 42236 5804 48003 54017 -45193 -67285 10724 7770 -35754 7690 19943
531 19943 -56695 -42279 59058 56815 5243 34719 27361 -60065 -48481 39030 15700 -44177
543 -44177 -9078 -799 -57915 -14238 83796 53447 -12928 14925 12312 -51725 -17606 56258
555 56258 2455 -65711 -22907 -3754 -39505 16499 90934 29540 -37329 6665 17478 -30332
567 -30332 6894 52434 -27327 -85041 -18817 12018 -16571 32619 76080 -3948 -50465 19703
579 19703 36337 -13516 11139 29363 -56793 -84918 5165 32456 -6796 26510 48552 -26487
591 -26487 -39661 46187 49511 -14895 -3490 3281 -66972 -62208 32739 38482 -15896 8682 27520
604 27520 -26303 -12545 66679 43879 -31636 -20896 -9048 -56027 -31894 47091 25174 -34789
$$ packed form
519e0779Q2999J0016l6432M2199O014r9210k2092P8009k954m3524M3444J2253
531A9943p6638J4416J01337k243n1572K9476p358q7426J1584Q7511k3330n9877
543d4177L5099Q279n7116M3677R8034l0349o6375K7853k613o4037L4119P3864
555E6258n3803o8166M2804J9153l5751N6004P4435o1394o6869M3994J0813m7810
567c0332L7226M5540p9761n7714O6224L0835k8589M9190M3461q0028m6517P0168
579A9703J6634m9853K4655J8224q6156k8125R0083K7291l9252L3306K2042p5039
591b6487j3174Q5848L324o4406J1405O771p0253M764R4947N743n4378K4578J8838
604B7520n3823J3758P9224k2800p5515J0740J1848m6979K4133P8985k1917n9963
$$ plain form
616 -34789 -3771 24065 -10074 13347 69833 21509 -51247 -26112 -3176 -36051 -10705 42435
628 42435 10 -49050 474 35961 7024 24112 55115 -5388 -58736 -13747 11548 -22962
640 -22962 -7459 24177 -21087 -45992 18678 48224 11893 18242 33741 -20748 -48068 5545
652 5545 19057 -23766 -16138 6665 -26660 -28391 35995 48657 4721 6736 19008 -20262 -28684
665 -28684 18011 13649 -32950 -24629 -631 -19135 -8615 42753 37424 -6502 407 16125 -10845
678 -10845 -12773 18504 -395 -41589 -24595 2911 -8107 3009 37835 21853 -12619 3946
690 3946 20860 -3021 -7264 9807 -13783 -41774 -16093 9014 -2543 4620 27592 11195 -9249
703 -9249 12426 23559 -1955 -9134 -86 -19768 -33842 -6869 10141 -2877 2240 19291 8435
$$ packed form
616c4789L1018K7836l4139K3421N6486m8324p2756K5135K2936l2875K5346N3140
628D2435m2425m9060M9524L5487k8937J7088L1003o0503n3348M4989K5295l4510
640b2962J5503L1636m5264k4905O4670K9546l6331O349J5499n4489k7320N3613
652E545J3512m2823P628K2803l3325j731O4386J2662m3936K015J2272l9270q422
665b8684M6695m362m6599Q321K3998j8504J0520N1368n329m3926O909J5718k6970
678a0845j928L1277j8899m1194J6994K7506j1018J1116L4826j5982l4472J6565
690C946J6914k3881m243J7071k3590k7991K5681K5107j1557P163K2972j6397k0444
703i249K1675J1133k5514p179R048j9682j4074K6973J7010j3018N117J7051j0856
$$ plain form
716 8435 -659 18200 20373 -4924 -12019 -6039 -18903 -23905 -2381 6094 -5156 1086 15844 10506
730 10506 6902 18518 13622 -7852 -12159 -7361 -15581 -17271 -2958 579 -5705 3073 15667 12700
744 12700 10173 15055 7521 -7799 -9717 -7314 -13740 -14613 -5545 -2750 -3202 6144 15019 12907 10684
759 10684 11336 4467 -5335 -7659 -8647 -13304 -13302 -7413 -3336 376 7616 12816 12537 10968 8830 3532
775 3532 -2867 -7496 -10855 -12682 -11736 -8149 -2757 2973 7271 10528 12776 11559 7216 3097 -1739
790 -1739 -8512 -12340 -11267 -10106 -8485 -2271 4193 6436 9409 13663 11811 5633 2431 -1544 -9306
805 -9306 -12503 -9622 -9244 -8967 -1918 4944 6097 9323 14279 11120 4049 1990 -1418 -9585 -12056 -8614
821 -8614 -9201 -9182 -1110 5646 6085 9426 14046 9880 3112 2028 -1498 -9716 -11639 -8391 -9316 -8531 -97
$$ packed form
716H435r094J8859K173k5297p095N980j2864n002K1524Q475j1250O242J4758n338
730A0506l604J1616m896k1474m307M798q220j690J4313L537o284Q778J2594k967
744A2700k527M882p534j5320j918K403o426q73R068K795m52R346Q875k112k223
759A0684O52o869r802k324r88m657KN889M077L712P240N200k79j569k138n298
775C532o399m629l359j827R46L587N392N730M298L257K248j217m343m119m836
790a739o773l828J073J161J621O214O464K243K973M254j852o178l202l975p762
805i306l197K881L78K77P049O862J153L226M956l159p071k059l408q167k471L442
821h614n87J9Q072O756M39L341M620m166o768j084l526q218j923L248r25P85Q434
$$ plain form
838 -97 5914 6057 9420 13257 8892 3064 2002 -2118 -9806 -11201 -8477 -9032 -7224 541 5545 6220
854 6220 9537 12288 8332 3430 1416 -3157 -9389 -10558 -8787 -8450 -5793 470 4936 6979 9748
869 9748 10950 8000 3869 331 -4070 -8315 -10119 -9617 -7680 -4336 9 4607 8216 9492 9138 8078
885 8078 4559 -966 -4717 -7043 -10266 -10697 -6278 -2590 -714 4348 9337 8587 7443 9042 5403 -2712
901 -2712 -5467 -5978 -10833 -11253 -3886 -1042 -2326 3818 10429 7628 6580 10912 5545 -5738 -6310 -4500
917 -4500 -11071 -10874 -997 -852 -5332 3714 12471 7258 6454 12533 3727 -9874 -5926 -1554 -10709 -10336
933 -10336 747 -2802 -8595 5687 16125 7020 5579 12260 298 -12836 -2761 2550 -11163
946 -11163 -11471 395 -5297 -9389 10480 19766 4748 2547 10605 -2202 -12417 2650 5228 -14730
$$ packed form
838i7O011J43L363L837m365n828j062m120p688j395K724n55J808P765N004O75
854F220L317K751l956m902k014m573o232j169J771L37K657O263M466K043K769
869I748J202k950m131l538m401m245j804N02J937L344M345M598L609J276l54j060
885H078l519n525l751k326l223m31M419L688J876N062M989p50j144J599l639q115
901b712k755n11m855m20P367K844j284O144O611k801j048M332n367j1283n72J810
917d500o571J97R877J45m480R046Q757n213q04O079q806j3601L948M372r155L73
933a0336J1083l549n793J4282J0438r105j441O681j1962j3134J0075N311j3713
946a1163l08J1866n692m092J9869R286j5018k201Q058j2807j0215J5067K578j9958
$$ plain form
960 -14730 -14593 46 -5621 -6809 16357 20491 -1276 -1470 10699 -1593 -9214 7753 3800 -21906
974 -21906 -17101 3042 -2696 -2763 20038 16186 -9850 -2797 15387 1668 -6419 8812 -2606 -29447
988 -29447 -14763 10710 1213 -1496 18316 8252 -15730 2172 23459 3537 -8295 4528
1000 4528 -10027 -31345 -6071 19213 1133 -5710 12807 2442 -14310 12058 29351 -568
1012 -568 -15152 -728 -12604 -25858 5106 22802 -5902 -13278 9525 3080 -6859 21524 28262
1025 28262 -11469 -22637 -712 -8215 -16787 12778 18060 -18296 -18132 13815 9727 774 24606
1038 24606 18788 -24507 -23743 7665 -356 -11303 11887 6662 -28390 -13930 24996 16105 1694
1051 1694 18814 6263 -30665 -15058 19494 3273 -14093 4028 -3463 -28698 -1539 35276
$$ packed form
960a4730J37J4639n667j188K3166M134k1767j94J2169j2292p621J6967l953k5706
974b1906M805K0143n738o7K2801l852k6036P053J8184j3719q087J5231j1418k6841
988b9447J4684K5473r497k709J9812j0064k3982J7902K1287j9922j1832J2823
1000D528j4555k1318K5274K5284j8080o843J8517j0365j6752K6368J7293k9919
1012e68j4584J4424j1876j3254L0964J7696k8704p376K2803o445r939K8383O738
1025B8262l9731j1168K1925p503q572K9565N282l6356J64L1947m088q953K3832
1038B4606n818m3295P64L1408q021j0947K3190n225l5052J4460L8926q891j4411
1051A694J7120j2551l6928J5607L4552j6221j7366J8121p491k5235K7159L6815
$$ plain form
1063 35276 15264 -5259 9498 -1070 -26334 -1269 26612 -1823 -22967 -3351 -5749 -19827
1075 -19827 12245 37950 5467 -15401 4668 681 -15543 10048 24236 -14703 -31259 -2876
1087 -2876 629 -8446 19737 30485 -9138 -20649 9687 8812 -6804 12209 13027 -27740 -30866
1100 -30866 6852 9323 -3111 17141 17497 -18813 -15439 20799 14757 -6307 5649 681 -32055
1113 -32055 -20826 18261 12289 -6152 8779 7456 -18214 -3293 29399 13051 -12798 -2960
1125 -2960 -5599 -26544 -7390 23913 7000 -13935 2099 5362 -9848 8508 30154 3696
1137 3696 -20922 -6343 -3464 -16574 2064 20797 -3888 -19712 3147 10314 -1157 13421
1149 13421 22821 -7731 -23517 -1597 2660 -9983 3343 11877 -12820 -17895 10386 15525 1890
$$ packed form
1063C5276k0012k0523J4757j0568k5264K5065K7881k8435k1144J9616k398j4078
1075a9827L2072K5705l2483k0868K0069l987j6224K5591J4188l8939j6556K8383
1087b876L505r075K8183J0748l9623j1511L0336q75j5616J9013Q18m0767l126
1100c0866L7718K471j2434K0252L56l6310L374L6238o042k1064J1956m968l2736
1113c2055J1229L9087n972j8441J4931j323k5670J4921L2692j6348k5849R838
1125b960k639k0945J9154L1303j6913k0935J6034L263j5210J8356K1646k6458
1137C696k4618J4579K879j3110J8638J8733k4685j5824K2859P167j1471J4578
1149A3421R400l0552j5786K1920M257j2643J3326Q534k4697n075K8281N139j3635
$$ plain form
1162 1890 10812 12879 -13891 -18485 6073 5938 -9567 -888 3488 -14757 -10082 17185 16050 -379
1176 -379 5234 5916 -12828 -9836 10736 3941 -12950 -5457 -230 -10540 -1365 19255 11542 -4568
1190 -4568 1775 4424 -7648 -2911 9941 -1868 -16069 -6127 990 -4942 3507 16167 5216
1203 5216 -6410 2837 6241 -3567 -705 5428 -7159 -15510 -3088 3238 -2067 3964 11170 1250
1217 1250 -4417 5868 7224 -2526 -1737 801 -9063 -11834 14 3560 -1700 2543 7286 840 -567
1232 -567 7550 6004 -3113 -3298 -1976 -7900 -7656 959 1952 -2119 1611 5632 2471 2563 6832 3466
1248 3466 -3610 -3648 -2692 -5926 -5145 -153 -103 -1726 2081 5308 3782 3652 4848 1476 -2942 -2997 -2920 -4899
1266 -4899 -4339 -1683 -1016 -277 2865 4805 4146 3681 3174 833 -1596 -2674 -3628 -4449 -4009 -2596 -752
$$ packed form
1162A890Q922K067k6770m594K4558j35j5505Q679M376j8245M675K7267j135j6429
1176c79N613O82j8744K992K0572o795j6891P493N227j0310R175K0620p713j6110
1190d568O343K649j2072M737J2852j1809j4201R942P117n932Q449J2660j0951
1203E216j1626R247L404r808K862O133j2587q351J2422O326n305O031P206r920
1217A250n667J0285J356r750P89K538r864k771J1848L546n260M243M743o446j407
1232e67Q117j546r117j85J322n924K44Q615R93m071L730M021l161R2M269l366
1248C466p076l8R56l234P81M992N0j623L807L227j526j30J196l372m418n5P7j979
1266d899N60K656O67P39L142J940o59m65n07k341k429j078r54q21M40J413J844
$$ plain form
1283 -752 1286 2865 3846 4358 3693 2144 986 -581 -3200 -4473 -3828 -3570 -2972 -153 2173 2143 3067
1300 3067 4891 3826 1488 1144 -319 -4040 -4828 -2917 -3145 -3229 194 2397 1500 2950 5572 3747
1316 3747 805 1023 -426 -4492 -4573 -2117 -3078 -3521 434 2532 1333 3260 5895 3224 172 1006
1332 1006 -472 -4582 -4139 -1811 -3383 -3584 860 2713 1362 3492 5688 2559 -47 1162 -592
1347 -592 -4593 -3882 -1916 -3582 -3159 1340 2663 1389 3536 5224 2163 193 1195 -982 -4594 -3715
1363 -3715 -2114 -3428 -2458 1499 2347 1518 3623 4768 2139 545 827 -1548 -4323 -3474 -2334 -3041
1379 -3041 -1852 1188 1999 2002 3700 4219 2217 737 90 -1892 -3688 -3387 -2739 -2592 -1382 655 1958
1396 1958 2746 3500 3487 2451 913 -692 -1951 -2924 -3641 -3261 -1866 -842 143 2095 3405 2908 2772
$$ packed form
1283g52K038J579R81N12o65j549j158j567k619j273O45K58N98K819K326l0R24
1300C067J824j065k338l44j463l721p88J911k28q4L423K203q97J450K622j825
1316C747k942K18j449m066q1K456r61m43L955K098j199J927K635k671l052Q34
1332A006j478m110M43K328j572k01M444J853j351K130K196l129k606J209j754
1347e92m001P11J966j666M23M499J323j274K147J688l061j970J002k177l612Q79
1363c715J601j314R70L957Q48q29K105J145k629j594K82k375k775Q49J140p07
1379c041J189L040Q11LJ698N19k002j480o47j982j796L01O48J47J210K037J303
1396A958P88P54j3j036j538j605j259r73p17L80J395J024R85J952J310m97j36
$$ plain form
1413 2772 3066 1146 -1530 -1943 -2364 -4140 -3497 -714 -379 -691 2161 3879 2196 2505 4082 1004 -2862
1430 -2862 -1954 -1797 -4573 -3189 691 -669 -2075 2439 4582 1770 2767 4945 -132 -4591 -1350 -654
1446 -654 -4698 -2651 1507 -2008 -3453 3692 5974 1432 2745 4904 -2010 -5681 484 943 -5125
1461 -5125 -2878 1253 -3548 -3632 6125 7339 261 1707 4153 -3370 -5182 3215 1851 -6867 -4092
1476 -4092 870 -3971 -2143 8974 7327 -2541 145 4045 -3181 -3198 5688 691 -10240 -5012 1981
1491 1981 -2767 191 10671 4704 -6415 4 6039 -1708 -1360 6081 -3003 -13628 -3427 5260
1505 5260 -1113 1216 9650 374 -8876 2908 9601 -931 -1842 3882 -6989 -14192 1034 8880
1519 8880 -1301 -518 6770 -2726 -7735 7945 12103 -2833 -4832 995 -8450 -11105 6500 10171
$$ packed form
1413B772K94j920k676m13m21j776O43K783L35l12K852J718j683L09J577l078l866
1430b862R08J57k776J384L880j360j406M514K143k812R97K178n077m459L241O96
1446f54m044K047M158l515j445P145K282m542J313K159o914l671O165M59o068
1461e125K247M131m801q4R757J214p078J446K446p523j812Q397j364q718K775
1476d092M962m841J828J1117j647r868K686L900p226j7Q886m997j0931N228O993
1491A981m748K958J0480n967j1119O419O035p747L48P441r084j0625J0201Q687
1505E260o373K329Q434r276r250J1784O693j0532r11N724j0871p203J5226P846
1519H880j0181P83P288r496n009J5680M158j4936j999N827r445k655J7605L671
$$ plain form
1533 10171 -4670 -3991 4779 -2441 -3463 12624 11113 -7998 -8207 644 -6268 -6054 10064 7100
1547 7100 -10595 -5983 6558 860 912 13880 5763 -14041 -8195 4408 -2521 -2901 9245 810
1561 810 -15136 -3412 11593 3857 1836 10790 -833 -16536 -3521 9714 -857 -3929 5038
1574 5038 -4513 -14824 2861 16231 3522 -1281 5860 -4528 -13787 3340 12820 -3215 -8162
1587 -8162 886 -5669 -9806 9550 17022 -1083 -6093 3073 -3428 -7721 8679 10954 -9338 -12010
1601 -12010 693 -2356 -3575 12811 12563 -7901 -8190 5185 654 -2846 9328 4754 -15258 -11317
1615 -11317 4990 1794 -509 11137 5662 -12070 -5169 10182 3548 -2143 5766 -1672 -16812
1628 -16812 -6167 10052 3275 -1730 6565 520 -11148 883 13975 2929 -5103 1038 -4744
$$ packed form
1533A0171j4841O79Q770p220j022J6087j511j9111k09Q851o912K14J6118k964
1547G100j7695M612J2541n698N2J2968q117j9804N846J2603o929l80J2146q435
1561H10j5946J1724J5005p736k021Q954j1623j5703J3015J3235j0571l072Q967
1574E038r551j0311J7685J3370j2709m803P141j0388r259J7127R480j6035m947
1587h162R048o555m137J9356P472j8105n010R166o501m293J6400K275k0292k672
1601a2010J2703l049j219J6386k48k0464k89J3375m531l500J2174m574k0012L941
1615a1317J6307l196k303J1646n475j7732O901J5351o634n691P909p438j5140
1628a6812J0645J6219o777n005Q295o045j1668J2031J3092j1046q032O141n782
$$ plain form
1641 -4744 -13424 314 12257 859 -5462 2775 -311 -6310 6421 13752 -1339 -8842 -1023 -3444
1655 -3444 -7893 4452 10020 -4105 -7961 2860 2264 -1532 8362 9607 -6314 -9646 891 -420
1669 -420 -4298 4618 5191 -7880 -6777 5822 4752 350 6765 4526 -8693 -6976 4111 1218
1683 1218 -3807 2187 935 -8336 -2970 8632 5154 -514 3690 1183 -7544 -2861 5903 468 -5268
1698 -5268 -514 -799 -5751 945 9088 3264 -2358 1663 713 -4510 133 5032 -1944 -6525 -1206
1713 -1206 -119 -2706 2852 7174 683 -2934 1850 1655 -2241 870 2586 -4012 -6026 -168 920
1728 920 -1093 2762 4595 -741 -1789 2940 2144 -1494 118 259 -4507 -4233 897 1115 -764 1818
1744 1818 2759 -492 9 3397 1711 -1588 -865 -959 -3580 -2498 937 500 -824 1136 2126 656 1244
$$ packed form
1641d744q680J3738J1943j1398o321Q237l086n999J2731P331j5091p503P819k421
1655c444m449J2345N568j4125l856J0821n96l796R894J245j5921l332J0537j311
1669d20l878Q916N73j3071J103J2599j070m402O415k239j3219J717J1087k893
1683A218n025N994j252r271N366J1602l478n668M204k507q727M683Q764n435n736
1698e268M754k85m952O696Q143n824n622M021r50n223M643M899o976m581N319
1713a206J087k587N558M322o491l617M784j95l896L111J716o598k014N858J088
1728I20k013L855J833n336j048M729p96l638J612J41m766K74N130K18j879K582
1744A818R41l251N01L388j686l299P23r4k621J082L435m37j324J960R90j470N88
$$ plain form
1761 1244 2715 815 -1617 -1243 -1179 -2397 -1658 56 -176 -463 1126 2031 1466 1476 1596 243 -1097 -1154
1779 -1154 -1272 -1807 -1565 -786 -291 323 1225 1798 1738 1328 810 292 -405 -1242 -1604 -1518 -1589 -1198 104 978
1799 978 973 1384 1930 1211 436 623 -61 -1715 -1896 -1167 -1512 -1296 555 1188 420 1174 2267 1176 210
1818 210 816 -135 -2248 -1883 -663 -1428 -1362 755 1090 31 1325 2639 1033 -30 815 -320 -2461
1835 -2461 -1573 -288 -1519 -1463 860 1022 -5 1606 2747 698 -239 835 -397 -2420 -1276 -255
1851 -255 -1753 -1448 1044 1021 95 1774 2538 361 -229 936 -490 -2337 -1145 -442 -1868 -1156 1216
1868 1216 948 142 1757 2232 263 17 916 -707 -2265 -1108 -606 -1689 -762 1181 737 253 1763
1885 1763 1991 380 256 645 -967 -2059 -1036 -731 -1415 -497 870 559 546 1746 1743 545 300 159
$$ packed form
1761A244J471j900k432L74O4j218P39J714k32k87J589R05n65J0J20j353j340n7
1779a154j18n35K42P79M95O14R02N73o0m10n18n18o97q37l62Q6p1L91J302Q74
1799I78nM11N46p19p75J87o84j654j81P29l45K16J851O33p68P54J093j091r66
1818B10O06r51k113L65J220p65O6K117L35j059J294J314j606j063Q45j135k141
1835b461Q88J285j231N6K323J62j027J611J141k049r37J074j232k023J144J021
1851b55j498L05K492k3r26J679P64k177n90J165j426j847J192P03j426P12K372
1868A216k68q06J615M75j969k46Q99j623j558J157N02j083R27J943m44m84J510
1885A763K28j611j24L89j612j092J023L05o84R18J367l11j3J200lj198k45j41
$$ plain form
1903 159 -1082 -1667 -1035 -888 -1118 -385 496 629 969 1578 1420 747 274 -277 -945 -1244 -1257 -1122 -723 -275
1923 -275 160 864 1313 1196 1129 1102 262 -690 -774 -974 -1622 -1217 -138 -197 -235 1023 1493 744 1099 1654 110
1944 110 -1280 -638 -786 -1947 -955 539 -489 -852 1269 1731 471 1383 2093 -567 -1997 -205 -375
1961 -375 -2058 -524 866 -1332 -1417 1980 2248 289 1570 2019 -1641 -2394 803 240 -2272 -486 626
1978 626 -2263 -1388 3255 2757 -270 1208 1527 -2432 -1972 2246 561 -3109 -1028 267 -2572 -473
1994 -473 4691 2584 -1619 486 1335 -2315 -731 3484 -214 -4728 -1398 664 -1895 966 5422
2009 5422 1030 -3451 530 2217 -1482 450 3487 -2313 -6222 -495 2129 -980 1708 4689 -1369
2024 -1369 -4410 2123 3757 -987 438 2133 -4522 -6274 1817 3729 -994 960 3025 -3072 -3588
$$ packed form
1903A59j241n85O32J47k30P33Q81J33L40O09j58o73m73n51o68k99j3J35L99M48
1923b75M35P04M49j17o7k7q40r52q4k00o48M05J079n9l8J258M70p49L55N55j544
1944A10j390O42j48j161R92J494j028l63K121M62j260R12P10k660j430J792j70
1961c75j683J534J390k198q5L397K68j959J281M49l660p53L197n63k512J786J112
1978F26k889Q75M643m98l027J478L19l959M60M218j685l670K081J295k839K099
1994d73N164k107m203K105Q49l650J584M215l698m514L330K062k559K861M456
2009E422m392m481L981J687l699J932L037n800l909N727K624l109K688K981o058
2024a369l041O533J634m744J425J695o655j752Q091J912m723J954K065o097n16
$$ plain form
2039 -3588 4723 4917 -1851 -1039 443 -5297 -4451 4581 4235 -2649 -854 1800 -2846 -1166 7032 4236
2055 4236 -4335 -2760 88 -4010 -1660 6177 2467 -5490 -1856 2521 -961 1293 7414 1343 -7116
2070 -7116 -2687 1790 -1974 138 5465 -930 -7493 -512 4763 706 2017 5591 -2142 -8087 -292
2085 -292 4245 -959 -179 3098 -3786 -7102 2652 6949 700 539 2844 -4045 -6435 3183 5690 -2029
2101 -2029 -2391 708 -4280 -4318 5940 7200 -1546 -1988 1238 -3292 -3113 5673 4572 -4948 -4336 411
2117 411 -2414 -994 7274 4773 -4696 -3009 2129 -1037 -460 5707 1311 -7599 -3985 2308 -176
2132 -176 756 6154 1206 -6465 -1495 4359 605 100 3698 -1984 -8118 -1461 4610 731 228 3638
2148 3638 -1391 -5749 1505 6116 462 -1389 1081 -3439 -6198 1643 5583 -356 -1736 1529 -1610
$$ packed form
2039c588Q311J94o768Q12J482n740Q46R032l46o884J795K654m646J680Q198k796
2055D236q571J575K848m098K350P837l710p957L634M377l482K254O121o071q459
2070g116M429M477l764K112N327o395o563O981N275m057J311L574p733n945P795
2085b92M537n204P80L277o884l316R754M297o249j61K305o889k390R618K507p719
2101b029l62L099m988l8J0258J260q746m42L226m530J79Q786j101r520O12M747
2117D11k825J420Q268k501r469J687N138l166N77O167m396q910L614O293k484
2132a76R32N398m948p671M970N854l754n05L598n682o134O657O071l879n03L410
2148C638n029m358P254M611n654j851K470m520k759P841L940n939j380L265l139
$$ plain form
2163 -1610 -3154 4040 5900 -1462 -3324 -99 -2560 -3339 3390 4354 -2584 -3014 1396 -123 -634 4721
2179 4721 3817 -3604 -3693 627 -918 -1434 3248 1928 -4186 -2440 2625 1258 434 3776 1282 -4556
2195 -4556 -2427 2034 28 -1084 1808 -230 -4221 -647 3873 1575 42 2056 -305 -3807 -497
2210 -497 2817 -234 -1853 314 -938 -2772 1107 3997 778 -884 951 -339 -2173 740 2285
2225 2285 -1230 -2487 -151 -449 -1213 1784 2992 -241 -1161 901 241 -989 860 1047 -1999 -2264
2241 -2264 184 142 -376 1531 1728 -702 -613 1284 576 -573 345 -44 -2028 -1442 544 306 -216 929
2259 929 911 -393 178 1378 451 -631 -242 -519 -1426 -737 442 85 -257 525 740 266 578 964 157
2278 157 -615 -473 -480 -817 -550 -46 -73 -79 427 790 667 506 415 78 -362 -518 -462 -546 -668 -439 50 283 393
$$ packed form
2163a610j544P194J860p362j862L225k461p79O729R64o938m30M410j519n11N355
2179D721r04p421q9M320j545n16M682j320o114J746N065j367q24L342k494n838
2195d556K129M461k006j112K892k038l991L574M520k298j533K014k361l502L310
2210d97L314l051j619K167j252j834L879K890l219j662J835j290j834K913J545
2225B285l515j257K336k98p64K997J208l233r20K062o60j230J849J87l046k65
2241b264K448m2n18J907J97k430Q9J897p08j149R18l89j984N86J986k38n22J145
2259I29j8j304N71J200r27j082L89k77r07O89J179l57l42P82K15m74L12L86q07
2278A57p72J42pl37K67N04k7oN06L63j23j61r1l37m40j56N6q4j22K29M89K33J10
$$ plain form
2301 393 723 776 310 84 271 -48 -642 -579 -429 -778 -544 359 530 181 561 847 195 27 524 23 -937
2322 -937 -664 -268 -771 -511 598 482 -132 532 994 153 -1 623 -145 -1198 -565 -40 -757 -469 670
2341 670 325 -310 695 1154 70 -52 613 -301 -1227 -328 102 -837 -496 697 231 -259 891 1163 -93
2360 -93 -98 612 -369 -1146 -164 36 -966 -458 731 208 -160 947 977 -249 -46 618 -416 -1073 -127 -110
2380 -110 -993 -268 787 148 -113 918 791 -230 130 582 -508 -999 -136 -211 -839 -46 713 56 -43
2399 -43 879 692 -109 246 396 -635 -888 -143 -249 -649 36 483 -21 121 846 612 27 209 116 -654
2419 -654 -680 -169 -290 -474 3 252 49 328 746 510 140 109 -119 -496 -470 -303 -346 -284 -30 102 248 485
2441 485 523 419 337 37 -288 -334 -375 -537 -348 -18 -83 -58 413 531 257 449 575 -102 -530 -187 -311 -717
$$ packed form
2301C93L30N3m66k26J87l19n94O3J50l49K34R03J71l49L80K86o52j68M97n01r60
2322i37K73L96n03K60J109j16o14O64M62q41j54O24p68j053O33N25p17K88J139
2341F70l45o35J005M59j084j22O65r14r26Q99M30r39L41J193m66m90J150K72j256
2360i3nP10r81p77R82K00j002N08J189n23l68J107L0j226K03O64j034o57R46J7
2380a10q83P25J055o39k61J031j27j021L60M52j090m91Q63p5o28P93P59o57r9
2399d3R22j87q01L55J50j031k53P45j06m00O85M47n04J42P25k34n85J82r3p70
2419f54k6N11j21j84M77K49k03K79M18k36l70l1k28l77K6J67m3O2K54J32J46K37
2441D85L8j04q2l00l25m6m1j62J89L30o5K5M71J18k74J92J26o77m28L43j24m06
$$ plain form
2463 -717 -189 252 -288 -304 572 587 115 637 735 -479 -782 60 -209 -758 60 345 -737 -454 960 728
2483 728 49 801 604 -1028 -828 553 -27 -833 158 129 -1217 -315 1562 829 -184 681 285 -1405
2501 -1405 -499 1240 11 -1221 -58 -106 -1339 242 2219 651 -810 380 167 -1293 200 1747
2517 1747 -472 -1939 -213 56 -944 980 2436 -181 -1589 450 544 -801 813 1600 -1530 -2526
2533 -2526 251 659 -452 1358 1900 -1371 -1872 1214 1210 -494 847 775 -2609 -2359 1358 1324 -407 1010
2551 1010 938 -2176 -1301 2482 1651 -872 131 -127 -2905 -1316 2663 1450 -1207 118 302 -1949
2567 -1949 19 3508 1220 -2057 -702 -298 -2160 100 3262 479 -2522 -349 634 -923 1230
2582 1230 3481 -248 -3255 -628 479 -1081 983 2703 -1208 -3300 309 1639 -21 1601 2414
$$ packed form
2463g17N28M41n40j6Q76J5m72N22R8j214l03Q42k69n49Q18K85j082K83J414k32
2483G28o79P52j97j632K00J381n80q06R91k9j346R02J877p33j013Q65l96j690
2501a405R06J739j229j232J163m8j233J581J977j568j461J190k13j460J493J547
2517A747k219j467J726K69j000J924J456k617j408K039R4j345J614P87l130r96
2533b526K777M08j111J810N42l271n01L086mj704J341p2l384K50L717l4j731J417
2551A010p2l114Q75L783q31k523J003k58k778J589L979j213k657J325J84k251
2567a949J968L489k288l277J355M04j862K260L162k783l001K173R83j557K153
2582A230K251l729l007K627J107j560K064J720l911k092L609J330j660J622Q13
$$ plain form
2597 2414 -1931 -3495 528 1561 -493 815 1349 -2562 -2901 1835 2590 34 857 947 -2761 -2490 2180
2614 2180 2146 -996 -281 130 -2662 -1419 3303 2591 -1038 -387 189 -2221 -807 3202 1505 -2369 -1271
2631 -1271 -5 -1620 183 3723 1369 -2422 -881 594 -1004 451 3013 -67 -3461 -1102 846
2646 846 -429 1024 3001 -343 -3081 -158 1597 -103 717 1828 -1623 -3501 110 1853 56
2661 56 732 1580 -1528 -2525 1261 2326 -174 -45 489 -2202 -2414 1522 2191 -487 -250 569 -1455 -1169
2679 -1169 2326 2113 -1061 -981 -50 -1624 -1020 2153 1533 -1434 -856 522 -621 11 2455 1102 -1924
2696 -1924 -1165 274 -732 -139 1872 371 -2028 -597 1060 120 490 1793 -84 -2164 -552 859
2712 859 -232 -23 1030 -563 -1832 234 1527 284 237 892 -684 -1623 279 1109 -355 -436 304
$$ packed form
2597B414m345j564M023J033k054J308N34l911l39M736P55k556Q23R0l708K71M670
2614B180l4l142P15M11k792J243M722p12l629O51N76k410J414M009j697l874J098
2631a271J266j615J803L540k354l791J541J475j598J455K562l080l394K359J948
2646H46j275J453J977l344k738K923J755j700Q20J111l451j878L611J743j797
2661E6O76Q48l108r97L786J065k500J29N34k691k12L936O69k678K37Q19k024K86
2679a169L495k13l174Q0R31j574O04L173o20k967N78J378j143O32K444j353l026
2696a924P59J439j006N93K011j501k399J431J657r40L70J303j877k080J612J411
2712H59j091K09J053j593j269K066J293j243m7O55j576r39J902Q30j464q1P40
$$ plain form
2729 304 -736 -1045 921 1484 -39 -217 396 -533 -825 689 801 -726 -738 96 -381 -343 1035 991 -408
2748 -408 -352 364 -159 -307 566 244 -942 -631 203 -45 0 759 429 -461 -110 483 38 -159 198 -196
2768 -196 -804 -286 297 52 21 385 165 -184 201 453 5 -221 -77 -275 -439 -68 176 -15 -27 202 203
2789 203 141 249 207 -66 -222 -187 -163 -168 -121 -64 -14 45 147 300 280 89 -19 -3 -114 -210 -89 -84 -291 -195 136
2814 136 182 102 309 309 -69 -89 175 -3 -291 -119 -59 -367 -179 342 219 -24 251 296 -118 -43 329 -39 -458
2837 -458 -134 -34 -368 -104 453 145 -184 269 354 -140 8 356 -185 -546 -49 56 -359 -42 439 14
2857 14 -219 391 402 -166 19 325 -275 -538 102 94 -413 -24 428 -37 -146 498 366 -260 17 302 -316
2878 -316 -456 154 28 -458 -4 426 -45 -91 489 258 -318 50 290 -318 -396 137 -71 -436 91 431 -70
$$ packed form
2729C04j040l09J966N63j523j78O13r29k92J514J12j527j2Q34m77L8J378m4j399
2748d08N6P16n23j48Q73l22j186L11Q34k48M5P59l30q90L51N93m45j97L57l94
2768a96o08N18N83k45l1L64k20l49L85K52m48k26J44j98j64L71K44j91j2K29J
2789B03o2J08m2k73j56L5K4nM7N7N0N9J02J53k0j91j08J6j11r6J21Nk07R6L31
2814A36M6q0K07%l78k0K64j78k88J72O0l08J88N21j23k43K75M5m14P5L72l68m19
2837d58L24J00l34K64N57l08l29M53Q5m94J48L48n41l61M97J05m15L17M81m25
2857A4k33O10J1n68J85L06o00k63O40qn07L89M52m65j09O44j32o26K77K85o18
2878c16j40O10j26m86M54M30m71m6N80k31n76L68K40o08p8N33k08l65N27L40n01
$$ plain form
2899 -70 -57 443 166 -248 143 278 -334 -382 95 -94 -332 191 373 -100 -33 395 131 -156 176 148 -396 -340
2921 -340 83 -85 -222 185 230 -138 10 374 144 -73 109 7 -383 -241 66 -62 -129 108 114 -65 102
2942 102 315 154 -20 26 -89 -274 -153 23 -42 -71 30 67 58 158 238 155 27 -72 -125 -152 -123 -78 1 6 -41 38
2968 38 163 159 119 188 92 -180 -188 -34 -139 -152 85 54 -173 -19 284 132 63 288 110 -349 -198 94 -128 -175
2992 -175 189 32 -357 15 448 133 45 367 -4 -556 -133 285 -125 -176 246 -119 -529 169 675 121 -40
3013 -40 308 -201 -684 106 541 -201 -344 140 -253 -538 493 887 -68 -290 208 -253 -552 460 676 -496
3033 -496 -628 132 -164 -302 824 873 -499 -564 293 -73 -286 704 480 -993 -757 369 77 -42 928
3052 928 485 -1003 -548 652 174 -118 656 -20 -1398 -538 843 316 -23 705 -49 -1252 -106 1190
$$ packed form
2899g0J3N00k77m14L91J35o12m8M77j89k38N23J82m73O7M28k64k87L32k8n44N6
2921c40M23j68j37M07M5l68J48L64k30k17J82j02l90J42L07j28o7K37Oj79J67
2942A02K13j61j74M6j15j85J21J76o5k9J01L7rJ00Q0q3j28r9n3k7K9M5P9Nm7P9
2968C8J25mm0O9r6k72qJ54j05j3K37l1k27J54L03j52o9K25j78m59J51K92k22m7
2992a75L64j57l89L72M33l15q8L22l71n52M23M18m10n1M22l65m10O98N06n54j61
3013d0L48n09m83P90M35p42j43M84l93k85J031L94r55k22M98m61k99J012K16j172
3033d96j32P60k96j38J126M9j372o5Q57l66k13R90k24j473K36J126k92j19R70
3052I28m43j488M55J200m78k92P74o76j378Q60J381n27l39P28p54j203J146J296
$$ plain form
3070 1190 289 -311 283 -472 -1406 66 1367 234 -397 304 -307 -1004 578 1528 -43 -840 -44 -477
3088 -477 -939 724 1454 -324 -950 147 -89 -448 1062 1350 -769 -1269 40 -104 -377 1031 1010 -1085
3106 -1085 -1154 486 377 5 1121 672 -1456 -1178 609 378 -104 836 236 -1570 -752 1179 727 -8
3124 -8 660 -85 -1666 -520 1305 499 -385 267 -305 -1424 51 1714 549 -528 97 -350 -1232 277
3142 277 1583 62 -1006 -136 -255 -816 743 1693 -93 -1111 -61 -80 -573 776 1274 -665 -1374
3159 -1374 -10 180 -199 976 1152 -823 -1214 303 395 -126 746 559 -1270 -1183 560 605 6 699 382
3178 382 -1187 -747 919 613 -211 279 -80 -1292 -534 1085 605 -286 190 -19 -956 -80 1237 410
3196 410 -622 -136 -213 -869 83 1188 240 -687 -45 53 -451 374 1110 -58 -926 -198 3 -377 369 883
$$ packed form
3070A190r01o00N94p55r34J472J301j133o31P01o11o97J582R50j571p97P96m33
3088d77m62J663P30j778o26J097k36l59J510K88k119n00J309j44k73J408k1k095
3106a085o9J640j09l72J116m49k128K78J787k31m82R40o00j806Q18J931m52p35
3124hO68p45j581J146J825q06q84O52n72j119J475J663j165j077O25m47q82J509
3142B77J306j521j068Q70j19n61J559R50j786j018J050j9m93J349M98j939p09
3159a374J364J90l79J175J76j975l91J517R2n21Q72j87j829Q7J743M5n99O93l17
3178C82j569M40J666l06q24M90l59j212P58J619m80q91M76k09r37Q76J317q27
3196D10j032M86p7o56R52J105r48r27O42R8n04Q25P36j168q68P28K01l80P46N14
$$ plain form
3216 883 -268 -828 91 330 -82 460 644 -519 -875 92 262 -158 281 381 -570 -583 438 490 -17 248
3236 248 191 -623 -502 407 291 -232 53 69 -481 -166 621 385 -169 23 40 -416 -135 443 107 -375 -100
3257 -100 51 -205 89 556 162 -277 -24 76 -179 16 268 -105 -399 -56 112 -30 133 311 -30 -217
3277 -217 64 137 -78 -19 34 -208 -235 66 145 23 75 125 -46 -23 152 95 -82 -81 -78 -134 -47 100 67 -11 41 60
3303 60 55 98 94 -28 -99 -100 -93 -30 17 -10 -42 20 49 67 141 107 -50 -93 -37 -59 -79 18 18 -129 -42 128 94 59 157 82 -135
3334 -135 -75 75 -43 -124 22 -22 -174 9 240 91 -5 141 43 -166 1 155 -96 -195 19 -26 -170 78
3356 78 257 -4 -65 155 56 -152 52 143 -189 -223 77 4 -159 121 238 -68 -62 221 78 -149 51 108 -224
3379 -224 -182 141 12 -160 140 205 -89 -18 263 50 -182 50 88 -232 -125 152 -45 -181 131 191 -92 31
$$ packed form
3216H83j151n60R19K39m12N42J84j163l56R67J70m20M39J00r51j3J021N2n07K65
3236B48n7q14J21R09j16n23K85J6n50L15P87k36n54J92J7m56K81N78l36m82K75
3257a00J51k56K94M67l94m39K53J00k55J95K52l73k94L43J68j42J63J78l41j87
3277b17K81P3k15N9N3k42k7L01P9j22N2N0j71K3J75n7j77JLn6Q7J47l3p8N2J9
3303F0nM3mj22p1jPO3M7k7l2O2K9J8P4l4j57m3N6k2k0R7%j47Q7J70l4l5R8p5k17
3334a35O0J50j18q1J46m4j52J83K31j49r6J46r8k09J67J54k51r9K14m5j44K48
3356G8J79k61o1K20r9k08K04R1l32l4L00p3j63K80J17l06OK83j43k27K00N7l32
3379b24M2L23j29j72L00O5k94P1K81k13k32K32L8l20J07K77j97j36L12O0k83J23
$$ plain form
3401 31 232 -16 -197 73 72 -228 -100 121 -83 -151 169 201 -80 35 193 -47 -148 117 61 -213 -93 79
3423 79 -83 -89 211 164 -83 20 152 -38 -90 116 11 -225 -100 65 -57 -31 170 90 -102 23 143 -4
3445 -4 -25 60 -72 -216 -85 59 5 8 114 48 -47 46 141 40 -31 -11 -86 -148 -57 62 55 22 52 49 22 60 123 67 -45
3474 -45 -80 -69 -89 -60 43 72 -12 -17 57 65 46 90 89 -75 -156 -55 -21 -71 34 121 -41 -100 87 140 15 89 140 -105
3502 -105 -217 -5 47 -90 39 148 -98 -155 167 203 4 93 142 -215 -276 93 116 -117 36 119 -208 -174 301
3525 301 282 -59 54 78 -328 -252 252 169 -203 -42 64 -274 -104 485 296 -193 -55 45 -313 -125 445
3546 445 145 -398 -123 104 -196 66 617 177 -445 -117 134 -202 28 484 -62 -632 -107 245 -71 190
3566 190 582 -102 -632 1 317 -81 98 371 -376 -741 101 476 17 183 372 -401 -623 318 542 -103
$$ packed form
3401C1K01k48j81K70jl00J28K21k04o8L20L2k81J15J58k40j01K65n6k74J20J72
3423G9j62oL00m7k47J03J32j90n2K06j05k36J25J65j22K6K01q0j92J25J20j47
3445dk1Q5j32j44J31J44n4LJ06o6r5R3R5j01p1K0p5o2R1J19pl3L0lk7L8O3n6j12
3474d5l5J1k0K9J03K9q4nP4Qj9M4jj64q1J01L4n0J05Q7j62n9J87N3j25P4N1k45
3502a05j12K12N2j37J29J09k46n7L22L6j99Q9M9l57o1L69K3k33J53Q3l27L4M75
3525C01j9l41J13K4m06P6N04q3l72J61J06l38J70N89j89m89J38J00l58J88N70
3546D45l00n43K75K27l00K62N51m40o22L28K51l36K30M56n46n70N25L52l16K61
3566A90L92o84n30O33L16l98J79K73p47l65Q42L75m59J66J89p73k22R41K24o45
$$ plain form
3586 -103 -35 120 -570 -581 495 626 -109 -28 155 -456 -349 670 576 -355 -277 -1 -491 -245 769 535 -453
3607 -453 -274 138 -263 -32 831 329 -745 -424 106 -228 48 802 175 -806 -261 355 6 181 706 -110
3627 -110 -975 -243 425 19 142 559 -261 -884 75 693 128 111 365 -472 -888 192 684 -4 -67 205
3647 205 -476 -645 508 836 -50 -185 78 -504 -545 583 685 -314 -374 59 -344 -241 791 671 -432
3666 -432 -442 61 -260 -160 724 401 -687 -496 181 -54 78 766 297 -739 -391 310 25 25 526 -31
3686 -31 -859 -265 469 156 117 490 -108 -760 -59 560 89 -61 209 -321 -722 120 659 99 -92 189 -249
3707 -249 -498 292 628 -88 -294 12 -291 -404 397 606 -141 -276 107 -107 -187 457 470 -332 -422 32 -105
3728 -105 -113 427 358 -370 -314 206 74 -6 379 163 -503 -333 193 42 -47 275 59 -424 -122 363 140 -28
$$ packed form
3586a03O8J55o90j1J076J31p35Q1J83o11J07J019r4r31P8K76m90K46J014k34r88
3607d53J79M12m01K31Q63n02j074L21N30l34K76P54o27r81N45O16l49J75N25q16
3627a10q65P32O68m06J23M17q20o23R59O18n65j7K54q37m16J080M92o88o3K72
3647B05o81j69J153L28q86j35K63n82m1J128J02r99o0M33m03J03J032j20j103
3666d32j0N03l21J00Q84l23j088J91O77k35J32O88m69j036L48P01k85%N01n57
3686c1q28N94P34l13l9L73n98o52P01O19m71j50K70n30m01Q42N39n60j91K81m38
3707b49k49P90L36p16k06L06l03j13Q01K09p47j35L83k14q0O44J3q02r0M54j37
3728a05qN40o9p28N6N20j32q0L85k16o66J70N26j51q9L22k16m83L02M85k23j68
$$ plain form
3750 -28 191 -53 -444 -101 293 25 -110 105 -53 -276 119 402 77 -113 52 -91 -257 74 262 -76
3770 -76 -190 37 -14 -83 200 298 -50 -165 42 -19 -117 93 115 -171 -195 60 70 22 149 139 -114 -99 97 36
3794 36 -59 14 -13 -169 -82 123 77 16 77 52 -59 21 111 20 -70 -48 -62 -77 14 104 32 2 37 32 36 67 52 -45 -84 -76
3824 -76 -40 -3 19 16 -5 21 33 62 81 42 -38 -66 -41 -59 -17 32 -10 -66 12 73 51 69 92 -5 -87 -20 7 -53 -26 28 -39
3855 -39 -67 63 121 24 34 68 -39 -87 31 42 -99 -57 26 -52 -52 114 127 -20 16 78 -31 -76 64 7 -144 -69
3881 -69 47 -52 -35 134 88 -57 32 108 -42 -69 62 -13 -147 -17 84 -43 -36 132 68 -56 62 121 -57 -91
3905 -91 43 -35 -139 2 69 -76 -41 127 64 -46 68 79 -81 -73 48 -26 -124 22 36 -87 -15 139 56 -22 63
3930 63 54 -82 -42 66 -29 -119 0 10 -51 28 136 46 -26 52 42 -47 -9 54 -51 -112 -33 -3 -36 48 108 29 -22 20
$$ packed form
3750b8K19k44l91L43L94k68j35K15j58k23L95K83l25j90J65j43j66L31J88l38
3770g6j14K27n1o9K83R8l48j15K07o1r8K10K2k86k4K55J0m8J27j0k53J5J96o1
3794C6r5P3k7j56Q7K05m6o1O1k5j11Q0R0r1r0K2j4j5R1R0p2l0L5nML1j5r7l9Q
3824g6L6L7K2lk1K6J2K9J9l9q0k8K5j8M2M9m2n6P8O1k2J8K3r7q2O7K7o0K7N4o7
3855c9k8J30N8r7J0L4j07m8J18J1j41M2Q3p8%J66J3j47L6O2j09m5J40n7j51P5
3881f9J16r9J7J69m6j45Q9P6j50k7J31p5j34J30J01j27PJ68o4j24J18N9j78l4
3905i1J34p8j04J41O7j45L5J68o3j10J14J1j60QJ21p4r8J46J4j23P2J54q3p8Q5
3930F3rj36M0J08r5r0J19J0o1P9J08r0p2P8j0q9L8O3j05o1P9L0l3Q4O0p9n1M2
$$ plain form
3958 20 33 -11 -3 15 -69 -97 -37 13 14 58 68 8 -10 21 47 25 -3 -31 -64 -71 -38 34 62 33 9 26 19 17 63 54 -41 -76 -50
3991 -50 -51 -39 40 87 -13 -27 55 32 -4 77 76 -101 -131 -22 -39 -59 82 108 -60 -64 102 76 -27 100 87 -151 -159 49
4019 49 23 -59 101 113 -132 -73 173 107 -27 101 54 -233 -146 136 48 -77 89 48 -212 -35 275 119 -72
4042 -72 70 -18 -300 -66 257 37 -161 33 -7 -222 79 387 61 -170 33 -23 -261 56 347 -47 -280
4063 -280 35 26 -161 203 427 -63 -310 36 23 -181 166 321 -227 -399 87 135 -68 268 348 -275 -384 144
4085 144 139 -107 187 173 -436 -386 250 255 -38 230 177 -427 -277 370 235 -139 78 18 -497 -202 492 266 -138
4108 -138 80 39 -411 -54 568 186 -314 -62 -53 -408 41 628 133 -374 -25 44 -266 163 610 -33 -563
4129 -563 -103 38 -224 222 578 -144 -550 31 221 -76 256 460 -317 -639 57 253 -68 221 340 -402
$$ packed form
3958B0J3m4QJ8q4k8O0N0JM4J0o0j8L1K6k2k8k8l3pL3P2K8k9k4J7pkM6rr5l5K6
3991e0jJ2P9M7j00j4Q2k3l6Q1jj77l0J09j7k0J41K6j68mJ66k6j03J27j3k38qK08
4019D9k6q2J60J2k45N9K46o6j34J28m7k87Q7K82q8j25J66m1k60J77L10j56j91
4042g2J42q8k82K34L23k20j98J94m0k15L01L08l26k31K03n6k38L17K91l94k33
4063b80L15rj87L64K24m90k47L46j3k04L47J55n48j72M86M8k03L36Q0o23j09N28
4085A44nk46K94j4o09N0O36Nk93K68n3o04J50O47j35l74K17o0n15K95O94k26m04
4108a38K18m1m50L57O22l82n00K52Rl55M49N87m95n07L49O9l10M29M47o43n30
4129e63M60J41k62M46L56p22m06N81J90k97L32K04p77l22O96J96l21K89J19p42
$$ plain form
4149 -402 -513 290 393 -11 163 182 -518 -492 335 362 -129 61 98 -474 -280 549 424 -170 -28 16 -480 -214
4171 -214 543 297 -334 -120 23 -333 1 665 252 -408 -154 45 -277 44 576 61 -558 -135 156 -108
4191 -108 185 595 -20 -557 -56 224 -91 120 394 -232 -605 16 328 -1 163 346 -258 -514 146 354
4211 354 -63 10 140 -369 -450 261 402 -60 15 147 -291 -276 367 347 -192 -125 31 -301 -197 420 321 -210
4233 -210 -111 103 -153 -53 435 196 -348 -195 71 -138 -25 396 133 -348 -96 186 -17 37 310 -13 -412
4254 -412 -108 156 -47 8 235 -55 -331 41 270 33 17 167 -129 -324 39 215 -41 -40 90 -102 -173 172
4276 172 267 -21 -50 67 -112 -167 124 157 -113 -106 59 -42 -49 203 181 -104 -89 45 -50 -92 98 52 -176 -102 79
4301 79 15 2 135 79 -120 -54 82 -11 -66 24 -23 -143 -35 104 36 -8 65 23 -62 17 84 -5 -68 -22 -43 -60 30
$$ packed form
4149d02j11Q03J03m04J74J9p00K6Q27K7m91J90L7n72J94Q29j25n94J42M4m96K66
4171b14P57k46o31K14J43l56L34O64m13o60K54J99l22L21N32n15o19M23K91k64
4191a08K93M10o15n37N01K80l15K11K74o26l73O21L12l29J64J83o04k56O60K08
4211C54m17P3J30n09q1P11J41m62P5J32m38J5O43k0n39O7J56l32J04O17r9n31
4233b10R9K14k56J00M88k39n44J53K66k09J13M21k63m81K52K82k03N4K73l23l99
4254d12L04K64k03N5K27k90k76L72K29k37j6J50k96j95L63J76k56JJ30j92p1L45
4276A72R5k88k9J17j79n5K91L3k70PJ65j01pK52k2k85J5J34r5m2J90m6k28P4J81
4301G9o4j3J33n6j99O6J36r3n5R0m7j20J08J39o8m4P3m2q5P9O7q9o3M6k1j7R0
$$ plain form
4328 30 89 20 -8 30 29 9 39 45 -39 -89 -34 -8 -8 7 32 5 -17 37 56 34 4 -10 -41 -56 -34 13 9 -23 -6 26 19 44 70
4361 70 35 -26 -28 -8 -31 -40 5 -5 -58 -8 51 36 16 54 27 -59 -34 24 -27 -65 -13 -11 -66 -3 82 26 -6 43 30 -58 -13 35
4393 35 -47 -100 -6 -2 -55 18 88 6 -30 67 36 -36 -2 35 -55 -90 14 13 -50 28 81 4 -20 78 43 -63 -16 16 -79 -67
4423 -67 35 2 -64 24 67 -6 7 72 7 -68 1 8 -59 -55 31 -19 -68 30 70 10 20 66 5 -50 5 27 -55 -41 18 -14 -25
4454 -25 51 73 11 22 37 -12 -22 22 0 -57 -54 -16 -33 -6 44 35 8 7 12 -13 5 12 -22 -47 -39 -43 -1 37 47 22 18 21 -1 26 49
4489 49 -9 -43 -36 -44 -45 18 55 21 5 31 15 -11 38 45 -35 -67 -14 -37 -46 49 80 -28 -33 58 5 -31 76 53 -110 -97 -3 -56
4521 -56 -65 89 80 -82 -32 83 37 -16 105 49 -149 -92 63 -13 -51 124 63 -147 -26 156 41 -16 131 17 -213
4546 -213 -71 134 -16 -65 109 4 -187 24 227 31 -54 90 -51 -260 11 194 -34 -103 73 -54 -188
$$ packed form
4328C0N9o9k8L8jk0L0Oq4n0N5K6%J5K5k7k2N4J9k2l0j4l1j5K2M7ml2J7L2pK5K6
4361G0l5o1kK0k3rM5j0n3N0N9j5k0L8k7q6K5N8n1l8N2Kn5O3Q5n6l2M9j3q8M5M8
4393C5q2n3R4Mn3P3P0q2l6R7l1p2L4L7r0l5J04jo3P8N3p7k4R8l5j06M7L2r5J2
4423f7J02l3o6Q8M3p3J3O5o5p5O9Po7MQ6n0m9R8M0o0J0M6o1n5N5K2q2J4N9l2j1
4454b5P6K2o2J1J5m9j0M4k2n7LL8j7K7N0rk7jNk5J8Pl4k5QmM2L8J0k5mLk2K7K3
4489D9n8l4PqjO3L7l4j6K6j6k6M9Pq0l2N3k3rR5L1j08nR1n3l6J07k3j63J3R4n3
4521e6rJ54rj62N0J15m6n3J21n6j98N7J55p6l8J75o1k10J21J82j15n7J47j14k30
4546b13J42K05j50m9J74j05j91K11K03j96q5J44j41k09K71J83k28o9J76j27j34
$$ plain form
4567 -188 127 288 -25 -108 62 -92 -210 117 231 -119 -168 74 -45 -125 244 288 -146 -184 78 -44 -135 203
4589 203 196 -264 -226 115 15 -59 275 193 -301 -207 177 33 -73 211 73 -411 -197 250 89 -26 232 41
4611 41 -394 -101 326 78 -104 117 -71 -434 -28 397 93 -100 129 -58 -351 72 435 12 -221 32
4631 32 -112 -325 161 449 -41 -259 60 -40 -220 254 429 -178 -370 22 -46 -178 271 377 -264 -353 133
4652 133 77 -87 300 280 -395 -394 164 98 -72 257 182 -410 -266 302 189 -43 211 70 -468 -240 342 150
4674 150 -117 127 9 -427 -76 457 170 -141 58 -50 -404 -27 443 70 -261 6 -36 -292 137 513
4694 513 22 -312 -9 -25 -244 155 421 -128 -386 12 60 -120 236 405 -176 -381 74 105 -110 172 256
4715 256 -316 -384 134 181 -52 194 207 -318 -289 207 166 -100 85 61 -354 -228 287 196 -89 78 62 -302 -114
$$ packed form
4567a88L15J61l13q3J70j54j18L27J14l50m9K42j19q0L69M4m34l8K62j22r1L38
4589B03pm60L8L41j00p4L34q2m94R4L84j44j06K84j38m84K14M47j61j15K58j91
4611D1m35K93M27k48j82K21j88l63M06M25l04j93K29j87k93M23L63m23k33K53
4631C2j44k13M86K88m90k18L19j00j80M74J75o07j92L92o8j32M49J06o41q9M86
4652A33n6j64L87k0o75JN58o6j70L29p5n92J44N68j13k32K54j41n38K28N82j92
4674A50k67K44j18m36L51N33k87l11J99j08l54L77M70l73l31K67m2k56M29L76
4694E13m91l34L03j6k19L99K66n49k58L98M8j80L56J69n81k05M55L1k15K82Q4
4715B56n72o8N18M7k33K46J3n25K9M96m1k66J85k4m15J26N15r1k85J67j6l64J88
$$ plain form
4738 -114 340 153 -176 -28 -15 -266 -36 372 133 -183 -9 41 -168 35 349 25 -279 -53 24 -152 62
4759 62 305 -22 -263 26 109 -49 87 234 -121 -297 5 99 -70 65 174 -115 -200 111 171 -30 39 101
4781 101 -169 -205 99 134 -63 5 81 -120 -94 187 161 -61 -5 42 -129 -90 141 90 -117 -38 49 -63 -5 176
4805 176 82 -111 -38 33 -66 -46 104 5 -158 -34 68 -15 20 113 20 -116 -6 73 -26 -36 37 -49 -124 12 96 18
4831 18 12 59 -10 -55 34 74 -22 -49 -9 -32 -52 27 58 -2 -13 40 20 -3 38 33 -38 -76 -31 -11 -13 14 32 -15 -14 30 33 16 11
4864 11 2 -52 -58 -6 16 -6 -5 3 10 4 43 63 10 -22 -6 -13 -29 4 11 -21 -24 25 28 13 34 45 -3 -35 -3 9 -46 -30 9 -28 -37 33
4900 33 33 5 8 38 -11 -41 15 3 -50 -27 13 -18 -14 36 50 -1 14 47 4 -27 19 3 -70 -15 27 -8 -31 54 48 -18 28 50
4932 50 -12 -38 22 -17 -61 -19 13 -35 -23 37 26 -3 33 42 -20 -30 11 -9 -42 -3 3 -36 -13 36 24 10 42 28 -28 -12 14
$$ packed form
4738a14M54j87l29J48J3k51K30M08k39l16J74N0k09K03L14l24l04K26P7j76K14
4759F2K43l27k41K89Q3j58J36J47l55j76L02R4j69J35J09k89q5L11O0k01O9O2
4781A01k70l6L04L5j97O8P6k01K6K81k6k22N6M7j71L9K31n1k07P9Q7j12N8J81
4805A76r4j93P3P1r9K0J50r9j63J24J02q3L5R3r3j36J10P9r9j0P3q6p5J36Q4p8
4831A8oM7o9m5Q9M0r6k7M0k3k0P9L1o0j1N3k0k3M1np1l8M5K0kK7J8m7JM4Lj7n
4864A1rn4oN2K2k2JQPoL9K0n3l2J6pj6L3Pl2lM9Lj5K1J1m8l2L2J2n5J6L9l7rP0
4900C3%k8LL0m9l0N6j2n3K3M0l1MN0J4n1J5L3m3l1M6j6p3N5M2l5k3Q5oo6M6K2
4932E0o2k6O0l9m4M2L2m8J2O0j1k9L6Ro2j0M1k0l3L9Ol9K3M9j2j4L2j4n6J6K6
$$ plain form
4963 14 -2 -25 -7 -13 -31 11 43 32 20 31 5 -25 -3 8 -31 -21 -13 -41 -24 21 38 8 18 8 -25 -13 4 -8 -33 -19 -16 -56
4995 -56 -6 53 25 3 35 8 -24 34 47 -20 -36 0 -33 -48 37 64 -8 -5 37 -11 -24 54 55 -51 -53 0 -49 -39 64 64 -40
5026 -40 -5 49 -27 -22 81 40 -96 -51 8 -62 -25 105 38 -82 -1 76 -15 -11 128 12 -142 -42 54 -42 -12 139 13
5053 13 -145 23 116 -13 8 121 -49 -198 -2 108 -44 -20 106 -59 -159 76 162 -29 -9 81 -109 -197 74
5076 74 154 -68 -29 87 -97 -130 184 199 -68 -46 63 -127 -127 187 159 -146 -77 74 -82 -43 266 178 -173 -97
5100 -97 72 -92 -60 240 81 -267 -95 115 -44 7 263 50 -300 -71 143 -31 -19 204 -42 -362 -41
5121 -41 229 4 21 217 -76 -330 38 258 -13 -41 128 -151 -317 107 303 -18 -36 121 -148 -262 177
5142 177 306 -103 -131 40 -171 -211 261 304 -140 -131 74 -112 -139 293 252 -252 -220 61 -98 -94 323 205 -282
$$ packed form
4963A4j6k3J8oj8M2L2j1j2J1k6l0K2J1l9J0Qk8J7M5J7l0J0j0l3J2J7j2k5J4Lm0
4995e6N0N9k8k2L2k7l2N8J3o7j6L6l3j5Q5K7p2LM2m8j3P8Jj06kN3m9J0J03%j04
5026d0L5N4p6NJ03m1j36M5N9p0L7J30o7j20Q1P7r1MJ39j16j54J00R6r6L0J51j26
5053A3j58J68R3j29K1J13j70j49J96J10j52K4J26j65j00K35Q6j91K0R0j90q8K71
5076G4Q0k22L9J16j84l3L14J5k67K2J09j90%L14k8l05O9J51j56L9L09q8l51P6
5100i7J69j64L2L00j59l48J72K10j59N1K56k13l50K29K14j74J2K23k46l20L21
5121d1K70k25J7J96k93k54L68K20k71k8J69k79j66M24J96l21j8J57k69j14M39
5142A77J29m09k8J71k11m0M72M3m44RK05j86k7M32m1n04L2K81j59MM17j18m87
$$ plain form
5165 -282 -180 147 -6 -23 313 105 -387 -186 166 2 -15 270 37 -382 -93 268 57 0 203 -57 -404
5186 -404 -46 292 30 -68 136 -87 -343 66 361 28 -89 86 -128 -319 112 349 -52 -156 45 -113
5206 -113 -202 226 360 -91 -198 42 -81 -166 229 286 -196 -232 64 -2 -70 287 244 -242 -227 116 19 -67 215
5229 215 121 -319 -202 172 72 -31 203 80 -308 -135 214 63 -77 114 -21 -334 -80 253 69 -64
5249 -64 99 -17 -263 -2 283 33 -136 22 -59 -219 64 294 19 -135 45 -5 -138 102 243 -62 -203
5270 -203 12 -14 -109 118 206 -95 -178 60 50 -52 115 152 -161 -209 49 42 -62 86 116 -144 -124 136 93 -53
$$ packed form
5165b82J02L27j53j7L36k08m92K01L52j64j7K85k33m19K89L61k11n7K03k60l47
5186d04L58L38k62r8K04k23k56M09K95l33j17J75k14j91M31K37m01j04K01j58
5206a13q9M28J34m51j07K40j23q5L95N7m82l6K96o6o8L57m3m86J5L43r7q6K82
5229B15r4m40J17L74j00j03K34j23l88J73L49j51j40J91j35l13K54L33j84j33
5249f4J63j16k46K61K85k50j69J58q1j60K83K30k75j54J80n0j33K40J41l05j41
5270b03K15k6r5K27Q8l01q3K38j0j02J67L7l13m8K58pj04J48L0k60K0K60m3j46
$$ [...]
8191f1
##END NTUPLES=NMR FID
##END=
