##TITLE=1H_AM_NVEtOHK
 
 8 sc, 
 19.09.2022
##JCAMPDX= 6.0         $$ Bruker NMR JCAMP-DX V2.0
##DATA TYPE= NMR FID
##DATA CLASS= NTUPLES
##ORIGIN= UXNMR, Bruker Analytische Messtechnik GmbH
##OWNER= root
$$ XWIN-NMR		Version 3.5
$$ Mon Sep 19 13:36:57 2022 Russian Standard Time (UT+4h)  she@DPX200
##.OBSERVE FREQUENCY= 200.1313499994
##.OBSERVE NUCLEUS= ^1H
##.DELAY= (6, 6)
##.ACQUISITION MODE= SIMULTANEOUS
##.ACQUISITION SCHEME= undefined
##.AVERAGES= 8
##.DIGITISER RES= 18
##SPECTROMETER/DATA SYSTEM= spect
##.PULSE SEQUENCE= zg30
##.SOLVENT NAME= CDCl3
##.SHIFT REFERENCE= (INTERNAL, CDCl3, 0, 15.7039)
##AUDIT TRAIL= $$ (NUMBER, WHEN, WHO, WHERE, WHAT)
$$ ##TITLE= Audit trail, XWIN-NMR		Version 3.5
$$ ##JCAMPDX= 5.01
$$ ##ORIGIN= Bruker BioSpin GmbH
$$ ##OWNER= she
$$ F:/spectra/data/she/nmr/H-F/1/audita.txt
$$ ##AUDIT TRAIL=  $$ (NUMBER, WHEN, WHO, WHERE, WHAT)
(   1,<2022-09-19 13:34:40.10 +0400>,<she>,<DPX200>,
      <created by zg, POWCHK disabled, PULCHK disabled
       configuration hash MD5:
       00 E9 B6 7A A2 85 ED C7 34 08 36 98 17 FE 4E 26
       data hash MD5: 16K
       9E E5 3F AC 74 C9 DA 61 03 CD 5F B3 7E A0 48 69>)
$$ ##END=
$$ 
$$ hash MD5
$$ A9 85 BB 7C DB 2A D8 B4 7D 54 41 DB 56 4D BE 4E
##$RELAX= 
##$RELAX= 
##$RELAX= 
##$RELAX= 
##$RELAX= 
##$RELAX= 
$$ Bruker specific parameters
$$ --------------------------
##$DU= <F:/spectra>
##$EXPNO= 1
##$NAME= <H-F>
##$PROCNO= 1
##$TYPE= <nmr>
##$USER= <she>
##$AMP= (0..31)
100 100 100 100 100 100 100 100 100 100 100 100 100 100 100 100 100 100 
100 100 100 100 100 100 100 100 100 100 100 100 100 100 
##$AQSEQ= 0
##$AQ_mod= 1
##$AUNM= <au_zg>
##$AUTOPOS= <>
##$BF1= 200.13
##$BF2= 200.13
##$BF3= 200.13
##$BF4= 200.13
##$BF5= 200.13
##$BF6= 200.13
##$BF7= 200.13
##$BF8= 200.13
##$BYTORDA= 1
##$CFDGTYP= 0
##$CFRGTYP= 5
##$CHEMSTR= <none>
##$CNST= (0..31)
1 1 145 1 1 1 1 1 1 1 1 1 1 1 1 1 1 1 1 1 1 1 1 1 1 1 1 1 1 1 1 1 
##$CPDPRG= <>
##$CPDPRG1= <>
##$CPDPRG2= <>
##$CPDPRG3= <>
##$CPDPRG4= <mlev>
##$CPDPRG5= <mlev>
##$CPDPRG6= <mlev>
##$CPDPRG7= <mlev>
##$CPDPRG8= <mlev>
##$CPDPRGB= <>
##$CPDPRGT= <>
##$D= (0..31)
0 1.2 0 0 0 0 0 0 0 0.06 0 0.03 0 0 0 0 0.0002 0 0 0 0 0 0 0 0 0 0 0 0 
0 0 0 
##$DATE= 1663580079
##$DBL= (0..7)
120 120 120 120 120 120 120 120 
##$DBP= (0..7)
150 150 150 150 150 150 150 150 
##$DBP07= 0
##$DBPNAM0= <>
##$DBPNAM1= <>
##$DBPNAM2= <>
##$DBPNAM3= <>
##$DBPNAM4= <>
##$DBPNAM5= <>
##$DBPNAM6= <>
##$DBPNAM7= <>
##$DBPOAL= (0..7)
0.5 0.5 0.5 0.5 0.5 0.5 0.5 0.5 
##$DBPOFFS= (0..7)
0 0 0 0 0 0 0 0 
##$DE= 6
##$DECBNUC= <off>
##$DECIM= 32
##$DECNUC= <off>
##$DECSTAT= 4
##$DIGMOD= 1
##$DIGTYP= 9
##$DL= (0..7)
0 120 120 120 120 120 120 120 
##$DP= (0..7)
150 150 150 150 150 150 150 150 
##$DP07= 0
##$DPNAME0= <>
##$DPNAME1= <>
##$DPNAME2= <>
##$DPNAME3= <>
##$DPNAME4= <>
##$DPNAME5= <>
##$DPNAME6= <>
##$DPNAME7= <>
##$DPOAL= (0..7)
0.5 0.5 0.5 0.5 0.5 0.5 0.5 0.5 
##$DPOFFS= (0..7)
0 0 0 0 0 0 0 0 
##$DQDMODE= 0
##$DR= 18
##$DS= 0
##$DSLIST= <SSSSSSSSSSSSSSS>
$$ [...]
##$SUBNAM2= <"">
##$SUBNAM3= <"">
##$SUBNAM4= <"">
##$SUBNAM5= <"">
##$SUBNAM6= <"">
##$SUBNAM7= <"">
##$SUBNAM8= <"">
##$SUBNAM9= <"">
##$SW= 18.0517283424941
##$SWIBOX= (0..15)
0 0 2 0 0 0 0 0 0 0 0 0 0 0 0 0 
##$SW_h= 3612.71676300578
##$TD= 16384
##$TD0= 1
##$TE= 0
##$TE2= 300
##$TE3= 300
##$TEG= 300
##$TL= (0..7)
0 120 120 120 120 120 120 120 
##$TP= (0..7)
150 150 150 150 150 150 150 150 
##$TP07= 0
##$TPNAME0= <>
##$TPNAME1= <>
##$TPNAME2= <>
##$TPNAME3= <>
##$TPNAME4= <>
##$TPNAME5= <>
##$TPNAME6= <>
##$TPNAME7= <>
##$TPOAL= (0..7)
0.5 0.5 0.5 0.5 0.5 0.5 0.5 0.5 
##$TPOFFS= (0..7)
0 0 0 0 0 0 0 0 
##$TUNHIN= 0
##$TUNHOUT= 0
##$TUNXOUT= 0
##$USERA1= <user>
##$USERA2= <user>
##$USERA3= <user>
##$USERA4= <user>
##$USERA5= <user>
##$V9= 5
##$VALIST= <valist>
##$VCLIST= <CCCCCCCCCCCCCCC>
##$VD= 0
##$VDLIST= <DDDDDDDDDDDDDDD>
##$VPLIST= <PPPPPPPPPPPPPPP>
##$VTLIST= <TTTTTTTTTTTTTTT>
##$WBST= 1024
##$WBSW= 4
##$XGAIN= (0..3)
0 0 0 0 
##$XL= 0
##$YL= 0
##$YMAX_a= 266058
##$YMIN_a= -335542
##$ZGOPTNS= <>
##$ZL1= 120
##$ZL2= 120
##$ZL3= 120
##$ZL4= 120
##$ABSF1= 10
##$ABSF2= 0
##$ABSG= 5
##$ABSL= 3
##$ALPHA= 0
##$AQORDER= 0
##$ASSFAC= 0
##$ASSFACI= 0
##$ASSFACX= 0
##$ASSWID= 0
##$AUNMP= <proc_1d>
##$AZFE= 0.1
##$AZFW= 0.1
##$BCFW= 1
##$BC_mod= 2
##$BYTORDP= 1
##$COROFFS= 0
##$CY= 11.3945322036743
##$DATMOD= 1
##$DC= 2
##$DFILT= <>
##$DTYPP= 0
##$F1P= 2.36226072786647
##$F2P= -0.459571619588291
##$FCOR= 0.5
##$FTSIZE= 0
##$FT_mod= 4
##$GAMMA= 1
##$GB= 0.15
##$INTBC= 1
##$INTSCL= 1
##$ISEN= 128
##$LB= 0.24
##$LEV0= 0
##$LPBIN= 0
##$MAXI= 10000
##$MC2= 0
##$MEAN= 0
##$ME_mod= 0
##$MI= 1.114404
##$NCOEF= 0
##$NC_proc= 0
##$NLEV= 6
##$NOISF1= 3.799351
##$NOISF2= 2.8
##$NSP= 1
##$NTH_PI= 0
##$NZP= 0
##$OFFSET= 15.70392
##$PC= 1
##$PHC0= -18114.62
##$PHC1= 7.80069
##$PH_mod= 1
##$PKNL= yes
##$PPARMOD= 0
##$PSCAL= 0
##$PSIGN= 0
##$REVERSE= no
##$SF= 200.130013532006
##$SI= 16384
##$SIGF1= 3
##$SIGF2= 2
##$SINO= 400
##$SIOLD= 16384
##$SREGLST= <1H.CDCl3>
##$SSB= 0
##$STSI= 0
##$STSR= 0
##$SW_p= 3612.71676300578
##$SYMM= 0
##$S_DEV= 0
##$TDeff= 0
##$TDoff= 0
##$TI= <>
##$TILT= no
##$TM1= 0
##$TM2= 0
##$TOPLEV= 0
##$USERP1= <user>
##$USERP2= <user>
##$USERP3= <user>
##$USERP4= <user>
##$USERP5= <user>
##$WDW= 1
##$XDIM= 8192
##$YMAX_p= 0
##$YMIN_p= 0
$$ End of Bruker specific parameters
$$ ---------------------------------
##NTUPLES= NMR FID
##VAR_NAME=  TIME,          FID/REAL,        FID/IMAG
##SYMBOL=    X,             R,               I
##VAR_TYPE=  INDEPENDENT,   DEPENDENT,       DEPENDENT
##VAR_FORM=  AFFN,          ASDF,            ASDF
##VAR_DIM=   8192,          8192,            8192
##UNITS=     SECONDS,       ARBITRARY UNITS, ARBITRARY UNITS
##FACTOR=    0.0002768,     1,               1
##FIRST=     0,             0,               0
##LAST=      2.2672688,     0,               0
##MIN=       0,             -335542,         0
##MAX=       2.2672688,     266058,          0
$$ Real data points
##PAGE= N=1
##DATA TABLE= (X++(R..R)), XYDATA
$$ [...]
$$ plain form
1725 -389 3482 -1075 -2910 2247 1779 -2905 -351 3047 -958 -2541 1973 1548 -2532 -318 2594 -823
1741 -823 -2173 1663 1337 -2110 -323 2153 -642 -1803 1343 1125 -1688 -315 1718 -447 -1429 1017
1757 1017 944 -1270 -301 1300 -266 -1083 695 735 -888 -276 935 -106 -762 435 537 -570 -217
1774 -217 589 -19 -469 212 326 -266 -136 264 26 -196 20 105 -21 -74 -24 72 57 -141 -75 222 -2 -282
1796 -282 120 295 -287 -218 466 76 -523 178 516 -433 -352 671 131 -742 231 718 -566 -492 844 163
1816 163 -944 266 867 -658 -593 986 218 -1101 272 1007 -725 -700 1073 250 -1214 280 1104
1833 1104 -766 -776 1135 277 -1299 257 1173 -792 -837 1172 324 -1329 269 1236 -777 -857 1190
1850 1190 361 -1330 260 1251 -765 -869 1176 373 -1320 236 1222 -745 -876 1138 369 -1277 192
$$ packed form
1725c89L871m557j835N157m68m684K554L398m005j583M514m25m080K214K912l417
1741h23j350L836l26l447J787K476k795j161L146k18k813J373K033k165r82K446
1757A017p3k214R69J601j566q17J778M0j623O12J211j041o56J197J02j107L53
1774b17Q06o08m50O81J14n92J30M00k38k22K16Q5j26n3N0R6j5j98O6K97k24k80
1796b82M02J75n82O9O84l90n99P01L38r49Q1J023n40q73R73M87j284P4J336o81
1816A63j107J210O01j525O5J579p68j319J373P35j732K5J773q23j464J494Q24
1833A104j870j0J911q58j576J556R16j965m5K009q48j653J598R67k013q0K047
1850A190q29j691J590R91k016j04K045q03j693J556R86j967j31K014p69j646J469
$$ plain form
1867 192 1176 -705 -842 1073 371 -1202 169 1099 -659 -793 980 353 -1099 139 1003 -580 -721
1884 -721 864 324 -971 120 884 -494 -615 758 287 -818 82 752 -388 -502 609 245 -628
1901 -628 71 563 -286 -372 441 169 -434 35 371 -155 -220 241 92 -212 7 141 -46 -62 34 15 11 5 -88
1924 -88 58 123 -157 -97 261 -4 -321 175 322 -352 -218 511 -3 -577 284 551 -531 -335 774 25
1944 25 -842 394 776 -746 -472 1041 22 -1120 514 993 -974 -592 1313 7 -1429 642 1215
1961 1215 -1227 -723 1603 2 -1709 782 1455 -1459 -846 1896 17 -1999 906 1696 -1668 -1010
1977 -1010 2175 72 -2265 978 1955 -1854 -1188 2421 152 -2527 1024 2197 -2020 -1374 2659 237
1993 237 -2789 1051 2437 -2166 -1570 2886 326 -3067 1065 2657 -2327 -1730 3118 374 -3321 1140
$$ packed form
1867A92R84j881j37J915p02j573J371R30j758j34J773o27j452J238Q64j583j41
1884g21J585n40j295J091P64j378j21J373m71j105R00O70j140j14J111l64q73
1901f28O99M92q49q6Q13k72o03M69L36n26o5M61j49l04K19J34j87j6R6j9mor3
1924h8J46O5k80O0L58k65l17M96J47o74J34P29n14n74Q61K67j082J96J109p49
1944B5q67J236L82j522K74J513j019j142J634M79j967L82J905j306j436K071N73
1961A215k442N04K326j601j711K491O73k914O13K742j879k016K905P90l364O58
1977a010L185k103k337L243R77l809O66L609k269k679L551J173m217O46M033k422
1993B37l026L840J386m603N96M456k560l393M132J592m984N97M848k744l695M461
$$ plain form
2009 1140 2867 -2508 -1852 3376 415 -3579 1211 3084 -2688 -1972 3639 423 -3822 1299 3279
2024 3279 -2843 -2072 3852 452 -4067 1345 3463 -2957 -2193 4033 500 -4257 1341 3640 -3019
2039 -3019 -2339 4145 597 -4442 1292 3831 -3014 -2503 4218 708 -4586 1209 4013 -3006 -2660 4274
2055 4274 824 -4706 1177 4169 -2997 -2791 4338 895 -4817 1183 4327 -3031 -2874 4426 925
2070 925 -4908 1217 4428 -3115 -2948 4496 927 -5002 1261 4496 -3180 -3021 4535 947 -5046 1273
2086 1273 4557 -3200 -3102 4547 1005 -5054 1233 4593 -3153 -3174 4489 1136 -5012 1116 4615 -3056
2102 -3056 -3261 4406 1260 -4937 991 4609 -2926 -3312 4307 1388 -4869 856 4570 -2818 -3352 4212
2118 4212 1462 -4791 754 4499 -2775 -3330 4154 1462 -4717 722 4410 -2719 -3258 4095 1432
$$ packed form
2009A140J727n375O56N228k961l994M790J873n772P16N611l216m245N121J980
2024C279o122P71N924l400m519N412K118o420P64O226l533m757N598K299o659
2039c019O80O484l548n039N734K539o845N11O721l510n294N795K804p019L46O934
2055D274l450n530N883K992p166K06P129l443n712O000L144p358J57P300l501
2070I25n833O125L211p543J67P444l569n929O263L235p676J59P556l588n993O319
2086A273L284p757R8P649l542o059O287L360p746k1P663l353o148O128L499p671
2102c056k05P667l146o197N928L618p535l86P619k919o257N725L714p388n34P564
2118D212k750o253N545L745p274n55P484k692o179N439L688p129n39P353k663
$$ plain form
2133 1432 -4655 715 4314 -2691 -3152 4041 1385 -4564 689 4208 -2602 -3072 3942 1364 -4423
2148 -4423 615 4089 -2439 -2998 3767 1396 -4258 478 3958 -2253 -2942 3535 1435 -4071 345
2163 345 3827 -2042 -2885 3300 1447 -3888 210 3663 -1861 -2797 3076 1429 -3673 146 3494 -1693
2179 -1693 -2667 2886 1373 -3465 127 3312 -1580 -2510 2721 1277 -3249 163 3128 -1489 -2334 2549
2195 2549 1186 -3049 158 2913 -1388 -2178 2355 1106 -2794 132 2690 -1261 -2044 2131 1045
2210 1045 -2544 74 2459 -1100 -1899 1873 1006 -2282 -11 2219 -924 -1755 1627 978 -2002 -78
2226 -78 1986 -762 -1588 1407 920 -1748 -113 1769 -629 -1402 1223 835 -1512 -109 1532 -528
2242 -528 -1221 1048 731 -1304 -105 1316 -467 -1039 898 601 -1109 -88 1086 -398 -866 748
$$ packed form
2133A432o087N370L599p005m61P193k656n949N253L519o810m70P014k578n787
2148d423N038L474o528n59O765k371n654M736L480o211o89O477k100n506M416
2163C45L482n869q43O185j853n335M098L453n524r36N873j647n102L819L348n187
2179a693r74N553j513m838L592L185m892r30N231j444m526L412K965m617q45M883
2195B549j363m235L207K755m301p90M533j249l900K926K558l951p83M175j086
2210A045l589K618K385l559p99L772q67l288K271K230l143q31L382o49k980J924
2226g8K064k748q26K995m87k668J635J882k398p73K625l88k347J403J641k060
2242e28o93K269l17k035J199J421j783n72J937k97j710J021J174j484m68J614
$$ plain form
2258 748 503 -899 -76 877 -311 -701 566 401 -692 -96 663 -199 -521 387 324 -475 -89 472 -83
2277 -83 -382 224 268 -274 -100 291 22 -211 78 172 -96 -118 110 67 -88 -60 75 53 -87 -56 110 32 -159
2300 -159 -6 182 -56 -201 135 160 -250 -96 313 -30 -331 164 292 -317 -160 425 6 -434 211 392
2320 392 -384 -229 531 20 -553 244 480 -447 -276 611 31 -641 261 542 -500 -326 676 42 -708
2339 -708 273 605 -551 -364 715 55 -766 278 657 -589 -410 756 72 -792 273 689 -578 -422
2357 -422 772 90 -809 267 704 -560 -442 784 105 -811 251 709 -565 -447 770 115 -790 248
2375 248 708 -530 -440 735 110 -771 227 663 -510 -433 686 121 -735 187 621 -485 -411 651 105
2394 105 -672 180 563 -440 -370 582 109 -595 180 524 -363 -310 519 94 -523 146 456 -325 -263 436 73
$$ packed form
2258G48k45j402Q23R53j188l90J267j65j093N96P59q62l22R08o3p99L86N61n55
2277h3k99O06M4n42J74L91k69k33K89R4k68k2K28m3j55K8J35k2j40L1J66p8j91
2300a59J53J88k38j45L36K5m10J54M09l43l01M95J28o09J57N85m19m40O45J81
2320C92p76J55P60n11n73P97K36r27J71Q87n80o72R02K81j042J74J002o34p50
2339g08R81L32j156J87J079o60q21J044L79j246J79J166o84q64J065M16j267J56
2357d22J194o82q99J076M37j264J18J226o79r16J062M58j274J18J217o55r05J038
2375B48M60j238R0J175o25q81R98M36j173P7J119n65q56R22M34j106P4J062n46
2394A05p77Q52L83j003P0R52m73p04P75L44q87N3Q29m25o17O69L10p81O2O99l63
$$ plain form
2415 73 -420 123 360 -251 -201 331 60 -328 79 268 -178 -160 224 22 -203 53 148 -112 -65 120 -3 -86
2437 -86 37 35 -32 16 16 -36 45 17 -79 37 118 -91 -77 179 29 -210 105 213 -192 -120 304 19 -341 168 322
2462 322 -327 -192 448 -15 -477 227 424 -453 -247 594 -24 -622 305 511 -569 -288 741 -47 -752
2481 -752 396 617 -715 -331 877 -65 -886 488 721 -819 -373 1035 -66 -1020 551 833 -928
2498 -928 -429 1172 -67 -1168 610 951 -1030 -515 1291 -27 -1294 607 1068 -1116 -608 1406
2514 1406 -7 -1437 649 1182 -1203 -686 1526 27 -1563 697 1289 -1275 -751 1645 32 -1673
2530 -1673 740 1372 -1377 -771 1768 14 -1782 799 1458 -1473 -797 1884 0 -1876 869 1531
2546 1531 -1553 -831 1973 -6 -1983 876 1600 -1610 -904 2040 14 -2075 883 1688 -1649 -989
$$ packed form
2415G3m93N43K37o11N0N32k71l88M07J89m46J8L84k02k25K56R5k60M7J85j23q3
2437h6J23ko7M8%n2Q1k8r6J16Q1k09J4K56j50k39L15J08m05P2M24k85l60N09J54
2462C22o49J35O40m63m62P04J97q77K06Q41o18n98R27K06j080K81J029p88p05
2481g52J148K21j332L84J208r42q21J374K33j540M46J408j101r54J571K82j761
2498i28M99J601j239j101J778L41j981N15J806j318j267J901M61k184N08K014
2514A406j413j430K086N33k385N17K212j499j590K260N92k564N24K396j613j705
2530a673K413O32k749O06K539j754j796K581O59k931O76K681j884j876K745O62
2546A531l084P22K804j979j977K859P24l210P06K944k026k089K958Q05l337O60
$$ plain form
2562 -989 2084 78 -2158 858 1790 -1645 -1063 2144 137 -2222 821 1875 -1654 -1132 2185 186
2578 186 -2274 829 1946 -1660 -1178 2209 205 -2315 838 1968 -1707 -1195 2255 193 -2343 869
2594 869 1975 -1740 -1196 2289 162 -2365 895 1985 -1767 -1201 2289 146 -2380 897 1987 -1762
2610 -1762 -1211 2278 200 -2370 864 2018 -1720 -1240 2263 253 -2347 804 2022 -1663 -1280 2229
2626 2229 311 -2328 738 2029 -1596 -1319 2172 361 -2294 674 2004 -1560 -1317 2122 358
2641 358 -2264 646 1959 -1524 -1278 2079 341 -2213 647 1904 -1490 -1228 2038 315 -2131 646
2657 646 1831 -1470 -1170 1987 308 -2064 647 1789 -1394 -1127 1908 319 -1986 579 1718 -1320
2673 -1320 -1112 1811 328 -1911 513 1664 -1227 -1101 1684 350 -1830 427 1596 -1129 -1089 1580
$$ packed form
2562i89L073k006k236L016R32l435N82L207k007k359L043J054l529N22L317j999
2578A86k460L103J117l606M82L387k004k520L153J130l675N12L450k062k536L212
2594H69J106l715N44L485k127k527L260J090l752N66L490k143k526L277J090l749
2610a762N51L489k078k570L234J154l738M80L503k010k600L151J218l685L83L509
2626B229j918k639L066J291l625K77L491j811k655K968J330l564K43L439j764
2641C58k622K910J313l483K46L357j738k554K860J257l394K62L266j723k446K777
2657F46J185l301L00L157j679k372K711J142l183K67L035j589k305K565J139l038
2673a320K08K923j483k239K424J151k891J26K785j334k180K257J169k725M0K669
$$ plain form
2689 1580 389 -1719 376 1520 -1031 -1039 1482 382 -1619 348 1440 -963 -967 1380 343 -1502
2705 -1502 333 1334 -900 -876 1301 308 -1384 339 1227 -846 -796 1206 274 -1262 312 1112 -774
2722 -774 -748 1093 250 -1160 276 1007 -689 -685 969 237 -1039 208 915 -598 -629 851 249 -925
2740 -925 169 833 -489 -585 733 261 -796 133 738 -402 -510 620 239 -672 95 640 -334 -429 545
2759 545 205 -555 77 520 -279 -350 438 158 -458 74 401 -239 -276 341 103 -367 57 291 -183 -199 245
2780 245 88 -246 46 210 -111 -128 159 59 -149 22 136 -51 -77 84 41 -59 6 60 15 -16 1 33 30 -16
2804 -16 -23 57 32 -57 7 106 -35 -99 86 65 -136 -41 173 -36 -181 120 143 -187 -68 226 -28 -229 141 176
2828 176 -222 -82 297 -25 -280 173 240 -253 -108 357 -21 -314 200 266 -290 -134 382 -25 -355 208 296
$$ packed form
2689A580j191k108K095J144k551qK521j100k001J967J092k403mK347j037j845
2705a502J835J001k234K4K177r93j692J723Q88k073N0K002r32j536J574Q00j886
2722g74K6J841q43j410J436P31j696MJ654p32j276J247P07j513l1J480o02j174
2740i25J094O64j322r6J318m72j057R29O05j140j08J130l81r11P67N45r74r5R74
2759E45l40p60O32M43p99p1P88k80o16N32L27o40l7O17k38m70M24K34m74j6M44
2780B45j57l34K92J64l21j7K87j00k08J71J14j87k6J61m3j00O5N4m5l1J7L2lm6
2804a6pQ0k5q9O4R9j41o4J85k1k01R5K14k09j45L01K3l30J19K94k54k01L70L5
2828A76l98J40L79l22k55M53O7m93J45M65l78k93N14O6n56J56N16m07l30N63Q8
$$ plain form
2849 296 -339 -151 407 -44 -401 213 306 -357 -169 436 -38 -420 215 323 -379 -182 454 -24 -435 228
2869 228 352 -374 -174 465 -13 -442 229 361 -352 -185 465 -1 -437 221 379 -357 -178 460 3 -428
2889 -428 205 357 -342 -187 432 6 -431 185 335 -327 -192 407 5 -403 169 312 -304 -179 387 19
2909 19 -374 148 297 -284 -165 348 10 -337 151 284 -238 -148 302 31 -274 127 234 -192 -117 260 20
2930 20 -242 92 202 -159 -110 193 29 -199 61 154 -124 -102 133 26 -156 31 100 -76 -67 88 23 -76 16
2953 16 71 -19 -37 20 33 -6 -28 16 42 0 -44 31 57 -38 -41 80 45 -100 17 126 -52 -112 123 73 -165 14 205
2980 205 -83 -176 175 122 -238 -12 269 -107 -235 219 146 -312 -17 330 -140 -291 289 190 -379 -12 410
3001 410 -163 -331 359 208 -442 -7 495 -182 -381 403 255 -499 -17 568 -201 -456 441 295 -575 -41
$$ packed form
2849B96o35J88N58m51l57O14R3o63J88O05m74l82O35J08p02J97O36m78m11O63
2869B28J24p26K00O39m78m29O71J32p13J67O50m66m36O58J58p36J79O38m57m31
2889d28O33J52o99J55O19m26m37O16J50o62J35N99m02m08N72J43o16J25N66l68
2909A9l93N22J49n81J19N13l38l47M88J33n22R0M50k71l05M01J07m26P5L77k40
2930B0k62L34J10l61M9L03j64k28K60R3k78K2K35j07j82J87O9j76RJ55o5r9R2
2953A6N5r0j8N7J3l9k2M4K6m2m4P5K6r5lJ21l5j45J17J09j78o0K35n0k38J79J91
2980B05k88r3L51n3l60K26K81l76j28M54p3m58K95L47m70j51N80r9n69L67M22
3001D10n73j68O90j51o50M35N02o77j99P84j48p54M82N85p69k55Q97j46q70N34
$$ plain form
3021 -41 627 -225 -534 468 355 -641 -83 698 -232 -617 505 401 -700 -109 759 -223 -683 528 451
3040 451 -749 -115 813 -238 -722 573 493 -794 -127 881 -239 -763 614 526 -838 -125 935 -266
3058 -266 -798 661 531 -893 -129 981 -302 -845 677 544 -935 -141 1018 -317 -881 703 584
3075 584 -962 -155 1051 -298 -932 704 628 -988 -192 1100 -274 -973 702 684 -994 -232 1116
3092 1116 -259 -1018 708 710 -1013 -236 1159 -248 -1016 733 730 -1027 -255 1163 -251 -1037 723 732
3110 732 -1057 -261 1151 -278 -1047 740 709 -1065 -236 1153 -287 -1031 749 697 -1065 -233 1169
3127 1169 -279 -1030 744 719 -1050 -238 1153 -259 -1019 737 738 -1028 -273 1150 -226 -1047 692
3144 692 746 -999 -295 1136 -187 -1037 662 750 -990 -321 1125 -183 -1031 625 736 -964 -313 1085
$$ packed form
3021d1O68q52l09J002j13r96N58P81r30l85J122j04j101N91Q68r82m60J211p7
3040D51j200O34R28j051m84J295q0j287O67J008j120n24J377q8j364P13J060j201
3058b66n32J459j30j424P64J110j283n43J522j33j479P94J159j335n64J584j19
3075E84j546Q07J206j349o34J636p6j616P96J292j374o99J675j8j678P62J348
3092A116j375p59J726Kj723P77J395j407p68J749lj757P72J418j414p86J760R
3110G32j789P96J412j429p69J787l1j774Q29J389j440p44J780n2j762Q32J402
3127A169j448p51J774k5j769Q12J391j412p60J756Jj766P55J423j376q21J739
3144F92N4j745P04J431j323q50J699Q8j740O69J446j308q48J656J11j700O51J398
$$ plain form
3162 1085 -184 -1012 615 697 -949 -293 1050 -185 -962 618 689 -893 -256 1036 -186 -915 605
3179 605 641 -858 -231 983 -176 -878 585 612 -832 -238 937 -158 -845 538 589 -787 -249 881
3197 881 -147 -828 488 588 -743 -269 833 -115 -788 432 557 -683 -258 788 -91 -740 413
3214 413 552 -626 -243 734 -78 -661 375 496 -585 -215 689 -75 -606 366 450 -554 -188 619 -94
3233 -94 -563 338 392 -494 -165 560 -95 -510 296 347 -459 -148 495 -85 -448 270 318 -396 -140 438 -59
3254 -59 -399 225 283 -333 -133 390 -35 -344 188 259 -274 -122 335 -15 -288 157 232 -228 -99 274 -22
3275 -22 -232 129 167 -189 -78 200 -11 -188 87 113 -149 -46 152 -32 -137 71 75 -130 -8 108 -25 -83
3297 -83 70 48 -75 9 58 -27 -39 52 15 -36 22 14 -11 7 9 -20 7 42 -6 -5 48 -4 -47 42 52 -67 -4 75 -22 -86
$$ packed form
3162A085j269q28J627Q2j646O56J343j235p77J580P1j582O37J292j222p29J520
3179F05L6j499O27J214j159p02J463K7j444N94J175j095o87J383N1j376N38J130
3197H81j028o81J316J00j331M74J102r48o73J220J25j240M25J046q79o49J153
3214D13J39j178L83R77q12n83J036J21j081L70R04p64n31R72Q4j004L66Q07p13
3233i4m69R01N4q86L29P25o55m15Q06N1q06L11O43n80l63P18M8p14K56N78m97
3254e9l40O24N8o16K00N23m25l09N32P1n33J52M57l50k73M45P5m60J29L73k96
3275b2k10L61L8l56J11K78k11j77K75K6k62J03J98j84j05K08Mk05J22J16j33n8
3297h3J53k2j23Q4M9q5j2R1l7n1N8qk5J8Kk9K7L5m8JN3n2m3Q9J0j19O3P9r7o4
$$ plain form
3327 -86 61 45 -116 -28 101 -37 -99 85 74 -119 -19 143 -37 -123 111 92 -142 -30 165 -42 -149 123
3349 123 117 -169 -30 211 -48 -166 146 128 -186 -22 217 -46 -188 153 126 -209 -37 231 -64 -189 169
3370 169 130 -222 -38 237 -62 -218 163 142 -225 -34 239 -70 -213 160 152 -234 -35 260 -59 -210 171
3391 171 152 -216 -34 253 -57 -203 164 163 -203 -37 244 -58 -210 157 154 -209 -51 226 -45 -215 138 149
3413 149 -210 -61 214 -47 -194 132 141 -185 -64 207 -38 -189 117 129 -168 -48 193 -22 -165 101 128
3434 128 -146 -51 175 -11 -134 98 122 -110 -45 146 -3 -123 64 97 -95 -45 113 -5 -103 39 76 -88
3456 -88 -54 86 5 -89 12 65 -37 -44 54 33 -58 -15 55 -14 -39 18 50 -33 -31 52 28 -38 -10 61 2 -56 23 70 -22 -46
3486 -46 55 36 -72 -8 88 -20 -92 59 71 -103 -37 119 -18 -129 69 104 -126 -67 159 -7 -168 69 141
$$ packed form
3327h6J47j6j61Q8J29j38o2J84j1j93J00J62j80q6K34j9k34J12J95k07j07K72
3349A23ok86J39K41k59j18L12j8l14J64K39k63j42L41k7l35J72K68k95j25L58
3370A69l9l52J84K75k99j56L81k1l67J91K73l09j43L73ql86J99K95l19j51L81
3391A71j9l68J82K87l10j46L67jl66J66K81l02j52L67ll63J58K77k71j70L53J1
3413A49l59J49K75k61j47L26Rl26J21K71k45j51L06J2k97J20K41k15j43K66K7
3434A28k74R5K26j86j23K32K4k32O5J91j49j20J87L3j92N0J58j18r8J42L7j64
3456h8L4J40q1r4J01N3j02pR8k1r1M3P0o9k5N7L2q3KQ3k4o6K8P1n9n8P9M7r2k4
3486d6J01j9j08O4R6j08p2J51J2j74O6J56j37j11J98L5k30N9K26j66j61K37P2
$$ plain form
3509 141 -136 -74 195 2 -195 102 167 -158 -89 237 4 -237 112 203 -188 -102 267 8 -266 129 245 -226
3531 -226 -134 301 13 -309 132 265 -231 -173 321 24 -343 129 304 -253 -201 355 44 -381 122 345 -275
3552 -275 -227 398 65 -416 119 378 -273 -251 403 77 -437 143 411 -305 -267 449 91 -470 149 429 -332
3573 -332 -278 462 88 -502 145 443 -345 -289 483 84 -524 155 463 -356 -311 494 87 -544 153 469 -371
3594 -371 -325 503 98 -551 144 502 -361 -346 535 128 -580 130 550 -356 -380 541 154 -590 125 569 -345
3615 -345 -385 547 164 -610 119 565 -362 -392 541 163 -635 113 572 -370 -406 541 155 -617 121 556 -371
3636 -371 -396 549 132 -605 129 555 -378 -387 554 145 -605 137 563 -369 -379 551 157 -597 132 572 -352
3657 -352 -393 536 171 -593 103 563 -339 -404 523 178 -601 81 558 -331 -427 493 191 -588 64 551 -322
$$ packed form
3509A41k77O2K69j93j97K97O5l25O9L26k33k41L49R1l91Q6L69k59k74L95J16m71
3531b26R2M35k88l22M41J33m96N8M94k97l67M72J75n57N2N56l11m25N03K23o20
3552b75M8O25l33m81N35K59o51K2O54l26n14N80K68p16L8P16l58n61O19K80p61
3573c32N4P40l74n90O47K98p88N6P72l99o08O79L08q19M5Q05m07o31O97L16q40
3594c71M6Q28m05o49O95L58q63J5Q81m07p08P10M20r06k4R21l87p44P15M44r14
3615c45m0R32l83p74P29M46r27l0R33l78p98P48M59r42l6R47l86p72P38M35r27
3636c71k5R45m17p37P34M26r33rR41m09p50P42M26r32j0R30l94p54P29M40r24
3657c52m1R29l65p64O96M60r02o5R27l45p79O82M77q89r6R20l02p79O52M87q73
$$ plain form
3678 -322 -399 494 180 -567 73 530 -306 -379 479 180 -533 74 511 -295 -370 471 168 -504 83 485 -275
3699 -275 -337 455 161 -484 78 470 -273 -328 418 152 -462 60 437 -256 -330 391 154 -464 41 419 -227
3720 -227 -317 359 153 -428 25 413 -201 -305 343 157 -387 24 383 -171 -280 310 154 -363 32 344
3740 344 -172 -264 297 121 -338 31 323 -163 -222 264 112 -306 35 285 -162 -210 234 91 -280 29 248
3761 248 -128 -183 209 90 -240 33 221 -112 -155 185 81 -201 24 202 -89 -130 169 84 -164 22 183
3782 183 -77 -127 134 76 -140 10 143 -69 -109 116 49 -124 6 107 -56 -89 84 26 -109 6 77 -56
3804 -56 -52 60 10 -73 13 63 -47 -36 46 10 -44 24 43 -22 4 34 -12 -8 31 15 -24 31 18 -17 -7 14 -5 -2 35 -3 -35
3835 -35 27 25 -49 2 32 -28 -40 29 4 -58 6 55 -52 -55 52 21 -67 11 69 -39 -63 82 11 -90 19 88 -48 -52
$$ packed form
3678c22p7Q93l14p47O40M57q36p3Q58k99p13O07M37q06p5Q41l03o72N87M02p60
3699b75o2P92k94o45N62L92p43n5P46k66o14N22L77o93p4P21k37o18N05L78o46
3720b27r0O76k06n81M53L88o14j04O48j86n44M11L59n54j09N90j56n17L95L12
3740C44n16r2N61j76m59L69K92m86n9M86j52m18L41K50m47m8M44j43l71L09K19
3761B48l76n5L92j19l30K73J88l33m3L40j04k82K25J78k91m1K99q5k48J86J61
3782A83k60n0K61n8k16J50J33k12m0K25o7j73J30J01j63l3J73n8j35J15P1j33
3804e6MJ12n0q3Q6N0j10J1Q2l6n4O8J9o5K6L0m6ML9j6l9N5j3l5J0K1j9LL7l8l2
3835c5O2kp4N1L0o0j2O9k5o2O4M9j07lJ07l1q8P8N8j08k4J45p1j01J09O9j36m
$$ plain form
3863 -52 90 30 -88 17 101 -49 -58 107 46 -116 22 114 -56 -86 112 36 -123 14 111 -76 -84 98 21 -134
3887 -134 25 113 -74 -93 105 28 -132 13 113 -70 -84 117 36 -130 16 125 -65 -72 111 45 -134 21 137
3910 137 -60 -88 116 49 -121 18 129 -62 -89 107 45 -121 18 120 -68 -80 94 26 -118 6 103 -54
3932 -54 -85 73 37 -112 0 97 -52 -74 87 43 -87 9 96 -31 -55 73 50 -82 1 86 -31 -65 62 44 -58
3957 -58 -2 69 -17 -42 41 35 -44 -18 47 -9 -47 23 34 -35 -27 28 8 -36 13 33 -6 -36 11 18 -26 -17 33 5 -42 2 33 0
3989 0 -23 40 31 -22 0 59 -1 -40 32 49 -28 -33 63 14 -73 17 68 -47 -56 80 36 -88 11 86 -50 -87 85 56 -117
4018 -117 2 115 -50 -108 93 59 -139 -4 148 -56 -137 124 90 -154 -5 176 -44 -132 134 108 -171 -2
4040 -2 196 -52 -161 159 115 -189 -11 212 -67 -175 154 106 -216 -24 237 -81 -200 154 138 -244 -40 258
$$ packed form
3863e2J42o0j18J05Q4j50rJ65o1j62J38R2j70l0J98p6j59J37R7j87qJ82p7j55
3887a34J59Q8j87j9J98p7j60J45J00j83j4K01q1j66J46J09j90pJ83o6j79J55J16
3910A37j97k8K04o7j70J39J11j91k7J96o2j66J39J02j88j2J74o8j44J24R7j57
3932e4l1J58l6j49J12R7j49k2J61m4j30R6Q7j27k4J28k3j32Q3Q5j17l4J27j8j02
3957e8N6P1q6k5Q3op9K6O5n6l8P0J1o9QN5k0m4M9K0l9l0M7Pm4RN0k8m7M4L1l3
3989@k3O3rn3K2N9o0l9P2J7p7nR6m9q7R0N1j15rJ36m4j24R9P5j36l7J72k9j73
4018a17J19J13j65n8K01l4j98J35J52k04q1K61l4k44J49J81k20q8K66k6k79J69
4040bJ98k48j09L20m4l04J78K23k79j08L29m8l22J92K61l18j19L54j6l82K04K98
$$ plain form
4062 258 -74 -231 171 163 -255 -55 275 -68 -255 193 187 -266 -66 313 -66 -271 206 213 -276 -62 323 -66
4084 -66 -299 220 215 -296 -60 353 -70 -299 235 208 -315 -84 355 -75 -333 225 221 -331 -93 355 -93 -342
4106 -342 230 227 -338 -93 377 -91 -335 251 249 -336 -87 394 -66 -354 249 275 -338 -96 406 -58 -369 242
4128 242 282 -342 -121 418 -58 -385 225 286 -369 -126 415 -68 -387 227 284 -359 -132 414 -62 -391 227
4149 227 280 -364 -131 406 -65 -395 230 271 -364 -114 422 -61 -372 249 282 -346 -123 416 -56 -366 246
4170 246 293 -345 -118 408 -45 -381 215 296 -349 -146 408 -39 -385 199 285 -333 -149 392 -35 -381 193
4191 193 296 -314 -147 386 -26 -374 191 291 -313 -148 383 -19 -353 200 280 -300 -125 368 -15 -341
4211 -341 191 265 -285 -105 352 -25 -329 169 242 -272 -126 323 -40 -318 169 222 -262 -118 313 -24 -300
$$ packed form
4062B58l32j57M02qm18K00L30l43j87M48om53K00L79l79k05M77Pm89K14L85l89
4084f6k33N19nn11K36M13m23k29N34k7n23K31M39m30k58N58mn52K38M48m48k49
4106c42N72ln65K45M70m68k44N86kn85K49M81m60k88O03K6o13K42N02m64l11O11
4128B42M0o24K21N39m76l27O10O1o55K43N41m83l19O14N7o43K27N46m76l29O18
4149B27N3o44K33N37m71l30O25M1o35K50N36m83l11O21L3o28K23N39m72l10O12
4170B46M7o38K27N26m53l36N96Q1o45K03N54m47l46N84Q6o18J84N41m27l46N74
4191A93J03o10J67N33m12l48N65J00o04J65N31m02l34N53Q0n80J75M93l83l26
4211c41N32P4n50J80M57l77l04M98P3n14J46M49l63k78M87N3m84J44M31l37k76
$$ plain form
4232 -300 141 215 -258 -117 287 -7 -287 131 230 -231 -114 272 -4 -271 131 223 -220 -114 261 -6 -260
4253 -260 121 200 -193 -95 242 7 -223 106 186 -182 -85 226 -4 -212 104 161 -171 -80 188 -19 -193 79
4275 79 141 -156 -80 170 -3 -157 73 126 -131 -60 156 -1 -145 72 114 -110 -60 144 2 -134 57 115 -96
4298 -96 -57 109 1 -115 41 90 -87 -54 97 -3 -102 34 78 -73 -46 75 2 -81 27 59 -61 -42 61 1
4322 1 -57 20 43 -37 -13 53 0 -36 38 34 -22 10 41 9 -16 26 6 -10 5 26 -2 -7 17 6 -11 4 -3 -20 5 8 -9 1 8
4355 8 -7 -4 18 -2 -17 10 11 -22 -21 32 -6 -39 19 15 -33 -15 41 5 -41 33 40 -33 -16 56 -2 -47 42 46 -30 -19 61 -3 -45 21
4389 21 44 -49 -22 59 -10 -60 20 35 -53 -23 64 -18 -70 27 51 -68 -30 61 -14 -70 36 46 -63 -12 63 -15 -68 37
4417 37 55 -56 -29 76 -16 -63 26 44 -39 -28 58 -6 -63 28 46 -59 -16 59 -9 -70 27 36 -67 -35 43 -15 -60 14 39
$$ packed form
4232c00M41P4m73J41M04k94k80M18R9m61J17L86k76k67M02R2m43J06L75k67k54
4253b60L81P9l93R8L37k35k30L29Q0l68R7L11k30k08L16N7l32R1K68k07j74K72
4275G9O2k97P6K50j73j54K30N3k57P1K16j57j44K17M2k24N0K04j42j36J91N8k11
4298i6L9J66j08j16J56M9j77L3J51j00r9J36M4j51K7J21p3q3J08L2j20J9J03o0
4322An8P7K3q0K4O6n3l6P4mn6L2L1l2k5M2k0j6J5K1k8nK4j1j7J5pj7K5Lj7J0P
4355Hj5LK2k0j5K7Jl3JN3l8l3N8mm8J8N6l6m6P4Pp3J7P2n8m5Q9Mp6J1Q0o4m2O6
4389B1K3r3K7Q1o9n0Q0J5q8L0Q7q2n2R7K4j19L8R1p5n6J06J0j09N1P5p8n3J05
4417C7J8j11K7J05r2m7Q9J8q3J1Q6o4n7R1J8j05M3P5o8o1R7Rj03L2P8n8m5P4K5
$$ plain form
4446 39 -58 -29 48 2 -52 24 44 -43 -24 49 11 -43 14 42 -31 -14 39 4 -27 21 30 -10 -12 32 10 -13 14 23 -9 -19 6 5
4478 5 -8 -10 14 0 -20 -6 5 -3 -32 -8 8 -26 -35 8 -4 -40 0 30 -13 -29 25 25 -19 -4 39 1 -37 31 50 -41 -11 62 8
4511 8 -45 28 55 -54 -17 66 2 -80 32 63 -55 -52 73 -3 -94 40 75 -85 -65 97 15 -120 24 101 -89 -73
4537 -73 108 12 -128 35 119 -90 -78 138 25 -131 47 146 -96 -86 155 39 -156 43 151 -111 -102 150 37
4560 37 -179 36 155 -124 -108 167 34 -191 47 172 -124 -123 174 34 -208 51 189 -141 -136 190 47 -219
4582 -219 45 209 -138 -145 213 71 -235 49 229 -135 -156 231 89 -257 57 258 -141 -155 241 87 -261
4603 -261 36 252 -153 -195 231 82 -270 34 253 -163 -185 240 82 -281 42 262 -165 -192 249 74 -301
4624 -301 48 265 -162 -194 260 85 -300 58 282 -164 -205 268 95 -292 41 289 -167 -211 267 104 -311
$$ packed form
4446C9r7K9P7m6n4P6K0q7J9P3l8n4N7K8p3J7N3l5l1M8Rm0kM4k2k3K7Rl2j0K5j
4478Ej3kK4j4k0J4J1qk9K4J6l4rM3j2l6M0L0m3j6N4%m4J5M3l8l8O8J9r1L0P3n4
4511Hn3P3K7j09L7Q3o4q2J12L1j18LJ25p6r1J34L5j60K0J62q2j35J44P7j90J6
4537g3J81r6j40J63Q4k09J2K16j13j56J78R9k42J0K41j16j95J99J08k62RK52j13
4560C7k16K15J19k79J6K75j33k25K38J25k96JK97j40k42K59J38l30NL26j43k66
4582b19K64J64l47pL58j42l06K84J80l64k1L87j42l46L14K01l99j4L96j54l48
4603b61K97K16m05m2M26j49l52L04K19m16k2M25j58l63L23K20m27k7M41j75l75
4624c01L49K17m27l2M54j75l85L58K24m46m1M73j73l87L33K48m56m4M78j63m15
$$ plain form
4645 -311 47 297 -167 -224 264 106 -316 27 294 -172 -238 255 115 -332 29 309 -166 -240 265 117 -314
4666 -314 36 299 -155 -230 271 108 -303 22 304 -142 -225 267 110 -300 25 300 -149 -216 256 118 -291
4687 -291 29 298 -145 -222 248 107 -302 25 292 -146 -226 237 119 -296 -1 287 -152 -237 231 131 -305
4708 -305 -2 296 -141 -216 235 128 -288 -2 285 -121 -208 229 136 -268 19 274 -110 -207 216 121 -264 -1
4730 -1 252 -113 -188 205 109 -241 4 236 -113 -196 182 109 -240 12 220 -112 -186 174 94 -229 5 224 -89
4753 -89 -182 174 103 -219 -11 219 -77 -182 173 102 -190 -13 207 -73 -164 156 104 -178 -12 196 -71 -156
4775 -156 130 91 -172 -15 173 -75 -133 110 81 -153 -27 148 -59 -128 106 63 -148 -13 131 -42 -116 95
4797 95 67 -123 -8 129 -39 -103 88 67 -98 -8 101 -26 -83 88 66 -95 -2 101 -26 -79 70 58 -86
$$ packed form
4645c11L58K50m64n7M88j58m22L43K67m66o6M93j40m47L61K80m75p4N05j48m31
4666c14L50K63m54p5N01j63m11L25K82m46q3M92j57m10L25K75m49o7M72j38m09
4687b91L20K69m43p7M70j41m09L27K67m38q0M63j18m15K95K88m39q5M68j00m36
4708c05L03K98m37p5M51j07m16K86K87m06q7M37r3m04K87K55l84r7M23r5l85K63
4730aK53l65p5L93r6l50K45K32l49q3L78p3l49K52K08l32p4L60q0l23K34K19l13
4753h9r3L56p1l22K08K30k96j05L55p1k92J77K20k80r1L20n2k82J66K08k67q5
4775a56K86l9k63J57J88k48n8K43k9k34J26J75k07o9K34m3k11J35J44j73p4K11
4797I5k8j90J15J37j68o4J91k1j65R0J09j27n7J71k2j61R3J03j27n3J49j2j44
$$ plain form
4820 -86 -14 85 -23 -65 51 37 -69 -7 66 -17 -65 45 27 -56 -15 57 -9 -43 26 39 -42 -16 52 -1 -38 24 20 -18 -7
4849 -7 31 -2 -20 22 10 -18 11 33 -2 -7 14 9 -10 -11 17 7 -9 5 -11 1 -17 -2 -10 -4 -8 -11 0 -10 -14 -7 -1 -17 3 10 -2 -8 25
4886 25 26 -4 -5 34 1 -16 15 30 -9 -4 39 7 -19 21 27 -20 -11 37 3 -37 13 23 -18 -15 28 5 -45 -3 24 -26 -24 28 5 -33
4920 -33 8 27 -31 -30 34 9 -28 14 36 -12 1 46 10 -16 16 38 -20 -13 33 24 -16 21 32 -16 -13 26 11 -37 4 24 -22 -22 19
4953 19 2 -27 14 29 -22 -27 19 5 -23 1 29 -14 -11 13 5 -18 5 14 2 -2 15 8 0 8 9 12 9 13 13 7 19 5 5 16 12 -9 15 -5
4991 -5 -7 1 14 -20 -9 7 -7 -17 4 14 -26 -22 24 -16 -41 8 24 -29 -6 41 -6 -39 33 31 -32 -14 61 1 -38 44 46 -29 -15
5024 -15 64 -3 -45 43 45 -66 -19 71 -6 -53 52 56 -66 -32 81 -16 -100 39 67 -77 -33 94 -11 -94 46 75 -89
5051 -89 -37 104 -6 -112 63 97 -98 -33 130 3 -121 70 94 -96 -36 141 4 -136 69 108 -122 -56 154
$$ packed form
4820h6P2R9j08m2J16j4j06O2P3q3m8J10j8q3M1P2o6l4O9J3q1K6O8n3l7O2ml8J1
4849gL8l3j8M2j2k8K9K2l5nK1nj9jK8j0j6J4j6J2j8J5qOmlJ1j0mPOj6K0Pj2oL3
4886B5Jl0jL9l3j7L1J5l9NM3l2k6M0Om7RM8l4m0N0J0m1LM3k3n0M2K7n0KN2k3l8
4920c3M1J9n8JO4k5l7M2K2m8J3M5l6k6L2K2n8PM6rm0L7J1m8LL9j5m8M1K0m6%M1
4953A9j7k9M1J5n1nM6j4k8K4K8m3LK4qk3K3Rj2mJ7pqQJLlM%oJ2j4%J1mk1K4k0
4991ekQJ3l4J1J6j4j0K1J0m0MM6m0k5M9J6n3K3M7m7l3P2ko3J8P5o0l9Q2Kp5J4
5024a5P9o7m2Q8Kj11M7R0p7m7J05Mj22L4J13r7q4J39K8j44M4J27j05q3J40K9j64
5051h9N2J41j10j06J75L4j95O5J63j27j24J91K4j90O0J77j37j40K05L9k30O6K10
$$ plain form
5074 154 -1 -145 70 112 -131 -70 150 -22 -168 78 113 -146 -82 168 -21 -183 65 133 -136 -77 178 -2
5096 -2 -184 87 137 -149 -75 182 8 -179 94 165 -160 -78 220 2 -207 101 174 -157 -91 209 -5 -225 92
5119 92 170 -176 -102 224 20 -228 94 186 -180 -108 220 5 -243 97 188 -195 -116 233 5 -227 100 197 -187
5142 -187 -119 236 15 -230 92 221 -173 -109 253 38 -242 106 208 -176 -122 253 25 -250 99 214 -194
5163 -194 -130 245 19 -261 86 220 -197 -142 247 16 -275 88 226 -195 -147 257 26 -264 98 226 -178
5184 -178 -140 254 32 -249 97 228 -186 -139 260 40 -247 92 240 -169 -124 250 41 -256 90 215 -170
5205 -170 -135 245 36 -260 63 220 -174 -153 227 41 -248 71 206 -167 -139 237 43 -249 68 224 -160
5226 -160 -137 240 50 -239 72 226 -156 -144 228 58 -230 70 223 -140 -136 232 57 -224 57 217 -133
$$ packed form
5074A54j55j44K15M2k43O1K20j72j46K46L5k59O4K50j89j62K48O8k69N9K55j80
5096bj82K71N0k86P4K57j74j87K73P1l25Q2K98k18k09L08P3l31O6L00k14k20L17
5119I2P8l46P4L26k04k48L22R2l66P2L28k15k48L40R1l83P9L49k28k32L27R7l84
5142a87O8L55k21k45L22J29l94O4L62k15k80L48J02l84N4L75k28k75L49J15m08
5163a94O4L75k26k80L47J34m17N5L89k31k91L63J38m21M8M04k31k90L62J28m04
5184a78L8L94k22k81L46J31m14M7L99k20k87L39J48m09M5L74k09k97L46J25l85
5205a70L5L80k09k96L23J57l94K1L80j86k89L19J35l73K8L76j94k92L17J56l84
5226a60K3L77j90k89L11J54l82J2L72j70k88L00J53l63ML68j75k81K81J60l50
$$ plain form
5247 -133 -130 201 59 -217 44 180 -131 -123 182 53 -203 40 185 -132 -124 174 47 -186 46 182 -108 -117 163
5270 163 56 -185 45 178 -102 -100 170 61 -176 35 165 -92 -110 143 55 -166 31 159 -91 -114 122 52
5292 52 -153 19 135 -81 -99 123 44 -154 4 122 -77 -102 103 43 -129 10 115 -63 -83 98 39 -108
5314 -108 7 104 -52 -70 101 57 -86 10 112 -42 -70 77 34 -89 5 90 -30 -60 71 35 -73 -11 77 -10
5338 -10 -72 49 34 -71 -9 74 -18 -51 39 34 -61 0 61 -19 -46 42 38 -32 2 59 -9 -31 41 30 -18 10 50 3 -28 22
5368 22 37 -16 1 32 8 -21 7 20 -14 -33 17 -2 -24 -10 20 -20 -25 4 5 -20 -5 12 3 -21 1 23 -11 -9 8 5 -17 -5 29
5401 29 -9 -10 11 15 -28 -4 28 -4 -25 15 37 -15 -7 23 18 -30 4 35 -26 -10 28 8 -35 4 21 -24 -28 19 5 -36 8 18 -19
5434 -19 -14 27 4 -21 15 36 -9 -2 35 -1 -27 13 31 -7 -16 30 9 -29 19 18 -22 5 25 3 -23 5 26 -26 -12 9 -10 -25
$$ packed form
5247a33LL31j42k76K61J36l11QL05j29k56K43J45l17QK98j27k33K32J36k90rK80
5270A63j07k41K30J33k80KK70j09k37K11J30k57j8K53q8k21J97J28k50k3K36p0
5292E2k05J72J16k16j8K22p9j98J58J18j99k5K05o0j72J39J05j78k0J81n9j47
5314a08J15R7j56j8J71m4j43R6J02j54k8J47m3j23R4Q5j20l0J31l6j08O2Q8q7
5338a0o2J21j5j05O2Q3r2l3R0nr5O1O1q0k7Q8mp0L4N7o8k2P2j1m8K8M0m7l1N0
5368B2J5n3J7L1k4k9K8J3l4j9N0j9k2J4L0m0nK9Jk5J5J7rk4K2K2l4KJ7lk2J2L4
5401B9l8jK1Mm3K4L2l2k1M0K2n2QL0nm8L4L1o1J6L8k0m3L9J7m5mM7j4m1M4J0l7
5434a9NM1k3k5L6K1m5PL7l6k6M0J8l8rM6k1l8M8jm0K7K0k2k6K8K1n2J4K1j9j5
$$ plain form
5466 -25 11 12 -17 -21 22 -7 -28 11 17 -23 -21 13 -1 -21 2 6 -13 -1 15 -4 -4 20 5 -10 10 21 -11 5 34 3 -17 25 8
5499 8 -23 -2 21 -13 -11 20 5 -27 2 32 -15 -27 27 9 -33 12 30 -37 -31 31 -2 -40 21 34 -44 -23 46 10 -41 31 44 -34
5531 -34 -5 59 6 -56 48 53 -39 -12 73 2 -63 39 57 -59 -31 81 -2 -72 35 57 -69 -26 91 -13 -83 60
5557 60 58 -82 -26 105 -23 -98 57 69 -92 -27 115 -16 -106 67 90 -99 -29 132 -20 -113 74 98 -101 -33
5581 -33 154 -16 -126 81 100 -122 -36 149 -19 -141 91 97 -127 -51 139 -33 -153 84 103 -142 -49 162 -20
5604 -20 -159 85 117 -147 -56 178 -14 -162 101 129 -134 -48 193 -18 -173 94 131 -157 -63 198 -23 -182
5626 -182 113 146 -173 -73 212 -4 -178 108 141 -177 -72 206 -14 -218 107 153 -189 -85 211 -20 -221
5647 -221 105 150 -186 -100 207 -26 -196 104 161 -175 -80 221 -4 -202 117 171 -188 -70 217 -6 -215 114
$$ packed form
5466b5L6Jk9mM3k9k1L9Om0KL4j4k0K3Mj9J2J6j9%K4j5j5K0J1l2J6K9l1k0M2j7
5499Hl1K1K3l4KL1j5l2K9L0m7j2N4j8m2M5J8o7OO2l3l8O1J3p8K1O9l6n1P2J3p8
5531c4K9O4n3o2J04Nr2K7Q5p1o5J02J8j16K8J12q3p0J07K2j26M3J17j04p0J43
5557F0kj40N6J31j28p5J55J2j61O5J42j31r0J73K3j89P0J61j52r3J87K4j99O8
5581c3J87j70j10K07J9k22Q6J85j68j22K32Ok24P6J90j72j20K37J9k45R3K11j82
5604b0j39K44L2k64R1K34j92j48K63K8k63Q6K41k11j55K67L7k88R4K61k21j59
5626a82K95L3l19J00K85k16j74K86L3l18J05K78k20k04L25M6l42J04K96k31k01
5647b21L26M5l36Q6L07k33j70L00N7l36R5L01k25j98L19N4l59J18K87k23k09L29
$$ plain form
5669 114 185 -186 -78 230 -6 -225 100 188 -189 -94 220 -11 -236 105 186 -201 -99 242 -6 -242 94
5690 94 173 -204 -116 231 -4 -236 100 204 -188 -102 238 5 -231 115 206 -172 -110 236 15 -236 102 194
5712 194 -170 -108 223 0 -219 85 187 -178 -111 211 18 -226 86 169 -169 -112 200 12 -231 87 176 -170
5734 -170 -120 202 5 -218 78 182 -154 -114 208 35 -218 84 186 -151 -106 218 27 -199 80 185 -147
5755 -147 -102 210 28 -202 72 176 -147 -110 184 8 -198 53 163 -127 -105 165 16 -182 43 150 -133
5776 -133 -113 160 26 -181 37 156 -114 -100 146 29 -153 45 152 -91 -93 151 25 -171 37 139 -88
5797 -88 -87 140 34 -158 31 135 -89 -91 130 29 -147 24 121 -84 -94 106 29 -136 24 123 -76 -79 101 34
5821 34 -112 15 104 -57 -84 96 39 -108 11 100 -52 -74 88 37 -86 15 90 -38 -64 73 50 -76 -4 78
$$ packed form
5669A14P1l71J08L08k36k19L25Q8l77R5L14k31k25L41Q1l87J02L41k48k36L36
5690I4P9l77Q8L47k35k32L36J04l92Q6L40k33k36L46R1l78O2L46k21k51L38R2
5712A94l64O2L31k23k19L04J02l65O7L22j93k44L12Q3l38N7L12j88k43L18Q9l46
5734a70N0L22j97k23K96J04l36M0L22j73k53L02J02l37M5L24j91k26K79J05l32
5755a47M5L12j82k30K74J04l23L7K94j76k06K51J10k90K2K70j49j98K25J07k83
5776a33K0K73j34k07K18J19k70J4K46j17j82J98J07k43kK44j26j96K08J02k27
5797h8JK27j06j92J89J04k24kK21j01j76J71R7k05j0K00p7j65J60R9j99lJ80o7
5821C4j46J27Q9j61k7J80n7j47J19Q9j52k2J62n1j23J01P5j28k6J37k3j26P2Q2
$$ plain form
5845 78 -38 -71 50 36 -76 -6 66 -29 -61 43 33 -73 -24 61 -27 -63 36 36 -50 -14 58 -13 -55 43 40 -41 -7 57 -4
5874 -4 -28 25 42 -31 -17 51 -3 -31 18 43 -27 -26 34 7 -36 8 28 -23 -23 16 9 -32 -5 23 -13 -21 19 14 -41 -16 21 7 -24
5907 -24 8 18 -25 -12 25 -3 -22 24 24 -9 2 40 12 -14 22 32 -13 -10 37 5 -19 12 33 -15 -24 21 6 -22 -9 20 -23 -36
5939 -36 8 24 -31 -13 17 -22 -26 25 9 -23 -11 34 -17 -32 20 12 -33 0 37 -15 -19 37 33 -14 11 31 -11 -5 35 23 -25 12 26
5972 26 -2 -20 21 6 -30 -1 23 -14 -27 25 4 -30 -7 15 -28 -16 25 2 -30 6 13 -19 -4 27 2 -24 12 34 -22 -1 32
6003 32 -1 -34 24 16 -29 2 30 0 -21 34 20 -26 -1 32 -18 -21 31 18 -36 7 26 -17 -28 32 0 -46 2 34 -30 -30 44 5
6035 5 -56 23 40 -47 -22 49 6 -59 39 54 -38 -11 72 4 -54 34 48 -51 -20 65 -16 -66 41 42 -59 -34 68 -12 -86 36
6065 36 44 -77 -26 80 -15 -89 60 58 -79 -32 88 -23 -86 42 58 -84 -16 102 -26 -82 73 74 -84 -14 125
$$ packed form
5845G8j16l3J21j4j12P0P2r5l2J04j0j06M9Q5q8l6R9%q6L6P2p1m2R8lq1L4O4o1
5874dk4N3J7p3J4O8n4k8M9K5p0JO0k7m3M4K0n1%L9pm1K7K8l6qM0nn5K5L7j4l1
5907b4L2J0m3J3L7k8j9M6%l3J1L8k8k6L6J0m5LM7l2k4L1K1m8rM5j5k8J3K9m3j3
5939c6M4J6n5J8L0l9mN1j6l2J2M5n1j5N2qm5L3L7n2mN6mm7K5K0m2OM0j2m8L7J4
5972B6k8j8M1j5l6K9K4l7j3N2k1l4K3K2m3J2M1k3l2L6Pl2J5L1k5k6L6K2n6K1L3
6003C2l3l3N8qm5L1K8l0k1N5j4m6K5L3n0lN2j3n4M3J9m3j1O0l2m6M8L2o4%P4l9
6035Eo1P9J7q7K5P1m3o5R8J5r2K7Q3o8n8Q8J4r9L1Q5q1n0J07Jj01K5J02q0p4J22
6065C6Qj21N1J06r5p4J49kj37M7J20j11o3J28J6j42O8J18j28n6J55Jj58P0J39
$$ plain form
6090 125 -21 -99 65 79 -101 -12 138 -30 -117 80 76 -118 -34 133 -32 -127 92 75 -126 -33 134 -47 -137 76
6114 76 83 -134 -44 142 -31 -138 81 108 -130 -36 143 -35 -126 88 101 -144 -28 163 -31 -143 114 102 -146
6137 -146 -34 181 -29 -145 108 104 -155 -48 177 -38 -173 106 106 -172 -57 182 -39 -183 108 113 -182 -59
6159 -59 188 -33 -192 105 128 -170 -45 192 -35 -175 108 134 -168 -54 192 -23 -191 118 135 -163 -52
6180 -52 206 -21 -177 118 145 -156 -63 201 -18 -183 112 132 -184 -54 200 -35 -199 103 139 -187 -74 196
6202 196 -29 -192 111 140 -183 -60 211 -26 -196 119 151 -174 -56 212 -24 -176 117 152 -172 -71 206
6223 206 -5 -183 105 156 -170 -73 197 -9 -185 88 157 -166 -80 194 -8 -193 73 147 -168 -91 181 -12
6245 -12 -192 87 140 -143 -78 192 -2 -184 82 145 -142 -80 188 5 -180 92 148 -140 -68 181 9 -170
$$ packed form
6090A25j46p8J64J4j80Q9J50j68q7J97mj94Q4J67j65r5K19j7k01R3J67j81r0K13
6114G6Pk17R0J86j73j07K19K7k38R4J79j78r1K14J3k45J16J91j94j12K57j2k48
6137a46J12K15k10j16K53mk59J07K25k15j35K79%k78J15K39k21j44K91Nk95J23
6159e9K47k21j59K97K3k98J25K37k27j40K83K6l02J14K46k15j68L09J7k98J11
6180e2K58k27j56K95K7l01R3K64k19j65K95K0l16J30K54k35j64L02L6l26J13K70
6202A96k25j63L03K9l23J23K71k37j70L15L2l25J18K68k36j52K93L5l24J01K77
6223B06k11j78K88N1l26R7K70k06j76K73O9l23Q6K74k02j85K66P4l15P7K72j93
6245a2j80K79N3k83O5K70j94j82K66O3k87O2K68j83j85K72N6k88P2K49j72j79
$$ plain form
6267 -170 89 148 -140 -83 184 -3 -169 69 141 -146 -78 167 7 -157 58 128 -121 -96 156 5 -154 58
6289 58 131 -118 -80 145 15 -154 50 131 -100 -81 133 16 -132 36 122 -81 -64 142 24 -123 49 131 -92
6312 -92 -63 135 28 -122 33 103 -72 -73 106 12 -126 29 98 -75 -77 93 16 -123 25 95 -68 -76 86 18 -97
6337 -97 20 85 -64 -78 67 23 -88 14 81 -41 -64 71 27 -82 10 82 -34 -46 65 20 -68 1 71 -48 -61
6362 -61 48 25 -72 -12 69 -42 -64 35 32 -56 -13 54 -22 -62 40 38 -49 -10 52 -17 -30 35 33 -46 -11 54 -4 -33 27 34 -45
6393 -45 -5 54 -3 -37 21 26 -25 -23 41 5 -38 6 28 -27 -25 29 3 -45 -18 21 -32 -38 21 12 -43 -11 23 -21 -21 24 10 -36 -7
6426 -7 32 -6 -21 16 30 -23 4 45 5 -26 28 26 -26 0 42 3 -18 13 29 -28 -6 33 -2 -32 16 20 -35 -18 21 4 -31 -4
6458 -4 30 -26 -19 26 2 -40 13 27 -20 -14 34 2 -37 18 37 -14 -3 44 18 -27 22 25 -10 -15 33 5 -28 13 26 -23 -11 20 -19
$$ packed form
6267a70K59N9k88N7K67j87j66K38P2k87O8K45j60j64K15P0k49K5K52j51j59K12
6289E8P3k49L8K25j30j69K04Q1k31J9K14j17j48J68Q6k03J7K06j18j47J72Q2k23
6312i2K9J98j07j50J55P0j75jJ79r4j38J55O9j73kJ70p7j39J48P0j63qJ62o8j15
6337i7J17O5j49j4J45m4j11J02O7j22k3J35m4j09R2P2j16j2J11m5q8O9P0j19j3
6362f1J09k3r7O0Q1j11k2R9lq8M3O7p6m0J02kq7L9O2o9j3O5kp9L5O5n8k9O0Pp9
6393d5M0N9n7l4N8Nn1KO4l6m3M4K2n5KN4k6m8K7L9n3oN9rn5L2L4m4%M5j4m6K9
6426gL9l8j5L7J4n3K7M1m0l1N4kn2K6M2l9k1L1J6n7K2L9l5l0M8Mn5J7L9j7l5K7
6458dL4n6PM5k4m2N3J4m7OM8l2l9N5J9n1J1M7k6m5M9Ll5nM8k8l3M1J3m9J2L1l9
$$ plain form
6491 -19 -30 0 16 -34 -9 20 -8 -34 12 4 -32 -14 16 -4 -23 30 9 -33 6 27 -11 -21 24 20 -33 -1 32 -9 -13 45 20 -29
6523 -29 0 38 -16 -26 31 17 -38 4 34 -20 -24 34 2 -51 8 24 -39 -34 44 -6 -46 11 31 -31 -28 43 -5 -52 27 44 -44 -15
6555 -15 57 -6 -56 28 45 -46 -20 67 -3 -56 38 44 -57 -16 66 -7 -50 44 47 -61 -22 70 -16 -74 51 46 -80 -22 64 -18
6585 -18 -82 45 60 -74 -31 87 -28 -81 55 53 -84 -11 96 -23 -69 77 69 -83 -16 104 -30 -85 71 68 -101
6610 -101 -7 121 -43 -92 78 58 -114 -21 124 -31 -100 80 68 -122 -27 113 -34 -121 68 67 -126 -24 117
6633 117 -50 -125 89 74 -121 -21 144 -37 -118 113 77 -133 -14 145 -36 -124 119 86 -139 -12 161 -45
6655 -45 -126 100 84 -160 -21 156 -53 -136 97 87 -160 -23 160 -56 -154 112 88 -156 -13 162 -56 -153 110
6678 110 89 -154 -28 182 -40 -144 114 107 -149 -34 174 -39 -143 127 97 -143 -31 181 -35 -154 122
$$ packed form
6491a9j1L0J6n0K5K9k8k6M6ql6J8L0k0j9N3k1m2L9K1l8j0M5mn3L2L3m1mN8k5m9
6523b9K9L8n4j0N7j4n5M2L0n4mN8l2n3N9J6o3NP8n0m0N7K0o2LP1m8m7P9J7q8K9
6555a5P2o3n0Q4J7r1K6Q7p0n3R4Oj01M1Q2p3m3R4Lj08L9R2q6n8J25nj26N8Q6q2
6585a8o4J27J5j34M3J18j15n3J36kj37P3J07j19m6J46qj52O7J20j34n5J56lj69
6610a01R4J28j64m9J70k0j72R3J45j55o9J80j2j90R5J40j47q7J89jj93J02J41
6633A17j67p5K14j5j95J00J65j81q1K31l6k10J19J59j81q8K43l3k25J27J73k06
6655d5q1K26j6k44J39J77k09q3K33j0k47J37J83k16r8K66k4k44J43J75k18r7K63
6678A10k1k43J26K10k22j04K58pk56J15K08k13j04K70l0k40J12K12k16j19K76
$$ plain form
6699 122 105 -161 -48 171 -46 -157 97 103 -166 -43 180 -55 -163 112 110 -172 -51 185 -49 -179 114 111
6721 111 -146 -38 181 -40 -161 115 115 -169 -40 182 -53 -166 113 106 -155 -39 186 -30 -171 100 115 -149
6743 -149 -36 175 -33 -165 96 114 -158 -62 173 -42 -166 82 113 -144 -50 151 -27 -154 91 117 -144 -53
6765 -53 159 -12 -148 97 118 -126 -54 171 -6 -142 86 114 -123 -44 148 -18 -136 90 111 -120 -53 150
6787 150 -8 -142 78 105 -132 -64 139 -14 -156 58 101 -121 -69 128 -16 -130 58 94 -110 -73 120 0
6809 0 -129 57 99 -93 -54 125 14 -109 54 102 -72 -55 117 16 -117 41 95 -89 -65 101 8 -105 24
6832 24 84 -103 -49 92 1 -113 16 84 -83 -54 86 2 -106 11 77 -65 -46 88 14 -99 15 74 -49 -45
6856 -45 86 31 -70 16 86 -38 -46 77 20 -76 7 74 -37 -51 60 20 -63 -4 44 -31 -61 43 23 -62 -10 51 -21
$$ packed form
6699A22j7k66J13K19k17j11K54Ok69J23K23k35j08K75kk82J21K36k34j30K93l
6721A11k57J08K19k21j21K76%k84J29K22k35j13K79pk61J16K25k16j41K71J5k64
6743a49J13K11k08j32K61J8k72R6K35k15j24K48L1k57R4K01j78j27K45K6k61R1
6765e3K12j71j36K45K1k44P2K25j77j36K28K8k37P9J92j66j18K26K1k31O7K03
6787A50j58j34K20K7k37O8K03j53j42K14M3k22N2J97j44j14J88L6k04L7J93j20
6809@j29J86M2j92L9J79j11j23J63M8j74J7J72j01j33J58N4j84K4J66r3j13J29
6832B4O0j87N4J41r1j14J29O8j67K9J40q4j08J17O6j42J9J34p4j13J14N9j23M
6856d5J31n5j01Q6P0j24qJ23n7r6Q3O7j11j4J11m0q3N9M8p5l0J04k0q5N2O1p2
$$ plain form
6883 -21 -51 29 22 -55 -12 47 -8 -51 25 27 -52 -15 48 -11 -50 34 25 -42 -6 49 -13 -42 34 42 -28 -5 45 -4 -33 18 27 -28 -12
6916 -12 35 4 -42 3 18 -26 -23 32 6 -52 -5 39 -20 -38 26 11 -30 -3 34 -11 -31 29 22 -27 -1 32 -8 -28 17 9 -31 1
6948 1 35 -9 -29 21 19 -29 -3 31 -17 -31 11 19 -33 -17 30 -7 -37 16 22 -36 -25 9 -26 -41 14 9 -38 -13 15 -7 -39 14 24
6981 24 -21 -11 40 1 -24 26 19 -33 5 39 -5 -38 21 25 -24 -10 35 -4 -32 26 30 -19 -12 31 -13 -25 10 11 -40 -11 34 2 -31
7014 -31 16 11 -41 -7 33 -21 -30 30 15 -25 4 44 -8 -22 23 14 -26 5 41 -2 -18 25 20 -36 4 33 -23 -23 25 8 -36 -6 21
7047 21 -19 -23 22 -6 -43 2 24 -39 -26 37 -6 -54 21 44 -47 -13 54 1 -45 40 42 -37 -15 47 -7 -45 35 32 -39 -7 54 -1
7079 -1 -43 42 40 -54 0 71 -22 -53 43 36 -60 1 74 -28 -72 30 25 -87 -24 66 -36 -70 54 37 -84 -6 71 -25 -61
7108 -61 55 43 -76 -10 78 -20 -67 65 53 -67 -8 96 -28 -68 69 51 -86 -7 103 -37 -74 71 42 -100
$$ packed form
6883b1l0Q0pp7M3N9n5m3P6Kp9L7O3n9l9Q4ro7L6N5o2k9P6Qp0K3N0m9k9N1Rn5J6
6916a2M7l1m6M5J5m4LN5k6n8M7M4n9j8O4j5m1K7L7m5k0O0pm9K6L3m0k0M5qm0L2
6948AL4m4k0N0km8K6L4m8j4M2Qn2J6M7l7l0N3On8J1L4l5j5N5nm7K5K8k2l2N3J0
6981B4m5J0N1l9k5N0pn2L8L4m4l3N9Mm9J4M5l9k8N8Mm9PM3m4j2L5Jn1K9M5l2l3
7014c1M7nn2L4M0n4rO0j5m0K9M0n2j4M5rm0L1L6m3j6M3nn6M0K9n6%M8j7m4L0K7
7047B1m0mM5k8l7M5K2o3J3O3m3m8P5K3r1L4O7n3m6Q5Kp9K2O2n4l8Q0lp1L2O1n5
7079am2Q5kr4N4P1r3l1R6pr6O1P3j02m4J02nj12O3R0j02l4J24j7j21P8P7r6l6
7108f1J16j2j19O6Q8r8m7J32j2j20N9J04j24m0J37j8j37P9J10j40l7J45k9j42
$$ plain form
7132 -100 -4 97 -43 -90 73 48 -114 -8 109 -50 -92 72 50 -105 0 104 -50 -97 87 67 -107 -4
7154 -4 115 -37 -96 95 72 -104 -11 123 -47 -101 104 74 -113 -2 124 -48 -103 92 66 -126 -12 131 -49
7177 -49 -107 96 50 -139 -24 123 -53 -118 90 68 -146 -9 139 -45 -122 97 72 -135 -4 150 -44 -110 101
7200 101 77 -127 -9 144 -48 -108 115 77 -141 -9 144 -46 -121 104 80 -129 -19 153 -47 -134 100 82
7222 82 -132 -17 147 -42 -136 92 68 -148 -29 148 -42 -124 104 82 -137 -27 146 -34 -126 99 89 -124
7244 -124 -16 153 -32 -121 107 75 -122 -16 151 -30 -122 92 87 -131 -18 145 -34 -128 88 78 -120 -26 130
7267 130 -30 -127 81 76 -119 -33 139 -30 -118 88 81 -106 -36 132 -30 -117 73 88 -114 -33 128 -9 -96 80
7291 80 91 -103 -24 126 -16 -105 68 79 -95 -38 113 -18 -107 62 73 -102 -41 108 -19 -107 57 71 -96 -36
$$ packed form
7132a00R6J01j40m7J63k5j62J06J17j59m2J64k2j55J05J04j54m7J84k0j74J03
7154dJ19j52n9J91k3j76R3J34j70n4K05l0j87J11J26j72n5J95k6j92J14J43j80
7177d9n8K03m6j89J15J47j76o5K08k2k14J37J48j84p7K19k5k07J31J54j94o6K11
7200A01k4k04J18J53j92o0K23l8k18J32J53j90p5K25k4k09J10J72k00q7K34j8
7222H2k14J15J64j89r4K28k4k16J19J77j90q2K28k2k19J10J73j80r2K25j0k13
7244a24J08J69j85q9K28l2j97J06J67j81r2K14nk18J13J63j79r4K16j0j98R4J56
7267A30j60r7K08nj95Q6J72j69q8K06pj87P0J68j62q7J90J5k02Q1J61j37q7J76
7291H0J1j94P9J50j42q9J73J1j74N7J51j31q9J69J1j75O1J49j27q8J64J4j67O0
$$ plain form
7315 -36 113 -7 -104 60 73 -88 -43 100 9 -96 55 81 -80 -27 99 -3 -85 53 86 -67 -29 88 -1 -84
7339 -84 49 78 -56 -29 81 -2 -89 23 65 -56 -41 72 -3 -86 21 60 -60 -54 62 7 -76 24 54 -48 -36
7364 -36 68 11 -70 25 78 -39 -38 65 15 -47 13 53 -30 -34 57 25 -55 9 63 -36 -39 45 22 -52 15 44 -13 -37 37 20
7394 20 -43 6 45 -13 -42 28 24 -49 6 35 -12 -29 25 36 -34 -7 40 -10 -28 35 38 -27 6 49 10 -19 32 37 -39 -15 28 -2
7426 -2 -35 28 26 -22 -20 32 3 -34 1 32 -20 -20 25 2 -31 0 22 -17 -21 23 3 -22 0 34 -16 -19 22 20 -18 1 33 -11 -28 26
7460 26 27 -22 12 31 -3 -8 24 28 -19 -6 28 -8 -29 10 11 -31 2 24 -15 -35 19 16 -27 -9 24 -16 -26 15 13 -22 -7 34 -16
7493 -16 -19 9 15 -18 -8 33 -2 -22 23 24 -21 4 27 -14 -22 13 21 -24 0 26 0 -24 12 11 -15 -2 38 -11 -26 14 9 -36 -11 20
7527 20 -20 -19 12 2 -25 12 29 -2 -17 28 13 -23 10 32 -3 -15 34 3 -13 15 32 -9 -18 27 8 -24 -7 15 -31 -16 27
$$ packed form
7315c6J49j20r7J64J3j61M5J43r1j05J51K6j61N3J26j02q2J38L3j53L8J17q9q3
7339h4J33K9j34K7J10q3q7J12M2j21J5J13p5q3J07L9j20OJ16n5q3J00L0j02J2
7364c6J04n7q1R5N3j17JJ03n0o2O0M0q3mR1l2q0O4N4r9lQ4k3p4O7K9n7k4P4j7
7394B0o3M9L9n8k9P0mp3N5K9m7j7N4J1p0K7M7n0j8O3Lo5L3M3l9k9N1Np6K4M3l0
7426bl3O3km8KN2k9l7L5L1n2%M5k3l3L1K2l9mM4k0k5K2L4n0lM1kl8J9L2m4j7N4
7460B6Jm9L4J9l4nL2Mm7J3L4l6k1L9Jm2L3K2l9k0N4lm3J8L3m0j0M1kl5J5M1n0
7493a6lK8Ol3J0M1l5k0M5Jm5K5K3m1qL5Qm5K4K6k6k4L6jk6J3M0m9j5M0nm5K5L1
7527B0m0JL1j0k7L7J7l1j5M5j5l6L3K2l5j2M9l1j6K8J7m1rM5j9l2J7K2m6J5M3
$$ plain form
7558 27 5 -37 4 21 -33 -12 28 -2 -31 7 16 -25 -23 35 -11 -44 11 17 -24 -8 48 -4 -30 22 30 -27 -8 47 -3 -21 32 39 -35
7591 -35 -7 49 -16 -37 39 26 -39 -6 46 -14 -50 34 31 -53 -9 48 -4 -49 44 21 -62 -14 48 -21 -45 37 34 -51 -7 61 -17
7622 -17 -43 51 30 -58 3 70 -17 -44 60 42 -62 0 74 -27 -47 70 35 -69 8 68 -29 -56 49 31 -78 -1 69
7649 69 -34 -63 65 29 -84 -1 73 -44 -70 60 24 -88 4 92 -30 -48 71 44 -73 -6 87 -34 -60 79 51
7674 51 -66 9 93 -28 -63 74 42 -89 2 101 -37 -70 74 48 -95 -5 93 -24 -82 73 43 -94 0 97 -46
7699 -46 -84 72 46 -96 0 90 -35 -69 86 43 -91 5 103 -36 -82 96 50 -97 0 107 -43 -80 77 44 -106
7724 -106 1 105 -44 -73 75 50 -108 -8 89 -39 -83 74 47 -102 -23 101 -37 -91 72 55 -101 -9 100
7747 100 -33 -90 84 55 -106 -14 108 -33 -75 81 53 -81 -4 104 -36 -92 77 55 -89 -2 102 -37 -80
$$ packed form
7558B7k2m2M1J7n4K1M0l0k9L8Rm1KN8m6l3N5Om1J6N6n2k6N2Qn7J9N5n0j8N3Pp4
7591c5K8N6o5k1P6j3o5L3N2o0l6Q4lq4M4N7n2m5R3k3q3M8O2o9k4Q2lq5M4O8p8
7622a7k6R4k1q8O1O7q7k7J04j8j04O2P4j01k0J17l5j04P7O0r7k7J05j8j09P7P0
7649F9j03k9J28l6j13Q3P4j17k6J30l6j12R2Q8j22j8J19k7j17O7R3j21k6J39k8
7674E1j17P5Q4j21l5J37l2j31R1R9j38l3J44k6j43R0R8j17n8J55l0j37R4R7j43
7699d6l8J56k6j42R6R0j25l4J55m3j34R6R8j39m6J78m6j47R7J07j50l7J57l3j50
7724a06J07J04j49k9J48k5j58J00R7j28m4J57k7j49P9J24j38n4J63j7j56R2J09
7747A00j33n7J74k9j61R2J22j41m2J56k8j34P7J08j40n6J69k2j44Q7J04j39m3
$$ plain form
7770 -80 72 42 -104 -13 114 -42 -83 57 51 -100 -18 94 -28 -89 57 43 -91 -14 89 -32 -84 61 58 -75
7794 -75 -9 96 -21 -65 65 70 -60 -13 93 -12 -74 66 60 -75 -15 85 -13 -75 54 45 -81 -18 74 -12 -85 44
7820 44 43 -76 -25 72 -20 -75 46 36 -68 -25 75 -20 -75 42 46 -50 -22 64 -14 -50 45 56 -60 -18 73 -9 -62 45
7848 45 56 -37 -15 60 -7 -51 34 39 -49 -26 52 5 -66 17 35 -43 -33 37 -14 -61 26 31 -43 -22 47 -3 -46 14 41 -23 -18 46
7880 46 15 -46 19 55 -32 -14 30 10 -33 16 41 -25 -6 40 16 -34 16 43 -13 -20 31 16 -32 3 28 -18 -27 22 17 -41 -12 44
7912 44 -4 -21 28 17 -29 -8 26 -13 -24 24 28 -23 0 32 -2 -22 19 29 -21 -14 37 -3 -17 15 19 -15 -3 36 4 -27 8 12
7944 12 -13 -5 25 12 -28 1 15 -3 -9 16 10 -23 7 31 -10 -15 23 9 -20 12 25 -3 -3 30 21 -17 7 47 5 -5 20 23 -19 14
7978 14 29 -3 -12 20 19 -9 4 17 -6 -27 12 20 -23 -4 28 -7 -14 21 10 -20 -5 12 -3 -14 3 19 -20 3 27 -7 -17 16
$$ packed form
7770h0J52l0j46R1J27j56m1J40oj51Q2J12j22o1J46j4j34P7J03j21n2J45lj33
7794g5O6J05j17m4J30Nj30M7J06j05o2J40oj35O0J00r8o2J29rj26O3R2q6p3J29
7820D4jj19N1R7r2n5J21j0j04M3J00r5n5J17Mr6K8Q6p8l6R5J1j16M2R1q2n3J07
7848D5J1r3K2P5o7m4Q5Nq8K3P8m7p1Q3J8p8J0P0n1m7Q7Np4K1O9n0m3O0K7o4NO4
7880D6l1o1O5L6q7J8M4k0m3M9K5o6J9M6k4n0N0K7n6pN1j5m8L5K5m6rM9nn8K9N6
7912D4m8j7M9j1m6K1L4l9j1M8Mn1K3L2l4k0M1J0n0PN1m0j4L2Ml4J2L9l2l1L5M
7944A2k5QL0j3m0K9J4j8oK5ol3L0K4m1nL8j4k9L2J3k8%L3rl8K4M0m2j0K5Lm2L3
7978A4J5l2rL2jk8J3J3k3k1L9Qm3J9L2l5pL5j1l0J5J7j5j1J7J6l9K3K4l4j0L3
$$ plain form
8010 16 12 -16 -6 25 -3 -17 22 27 -1 6 24 -3 -15 23 18 -15 -4 29 -14 -27 4 8 -30 -9 12 -1 -23 4 6 -29 -3 13 -7
8043 -7 -21 12 16 -21 -7 12 -11 -20 21 4 -24 6 29 -7 -3 27 10 -9 11 24 0 -5 27 6 -7 25 20 -9 -15 28 -12 -26 13 11
8077 11 -22 -26 9 -9 -35 4 11 -24 -28 22 -3 -31 22 31 -15 -3 26 1 -28 24 36 -23 3 29 2 -21 31 24 -26 12 43 -11 -20
8110 -20 27 29 -29 4 40 -8 -27 14 9 -38 -3 44 -18 -22 28 5 -42 1 23 -12 -28 21 24 -35 -4 41 -6 -21 39 32 -21 -5 53
8143 53 -14 -28 46 27 -35 11 49 -10 -30 38 14 -38 -3 50 -28 -38 47 26 -42 16 55 -24 -35 44 31 -51 12 48 -29 -47
8173 -47 42 15 -45 7 46 -25 -40 52 23 -46 12 64 -13 -31 59 34 -68 9
$$ packed form
8010A6mk8J0L1k8j4L9Nk8PJ8k7j2L8nl3J1L3m3j3L1Ml8K1K1j3k2K7Kl5K6J6k0
8043gj4L3Ml7J4J9k3rM1j7k8L0K3l6ML0j7j9K0J3k4nL2k1j3L2nk9oM3m0j4L9k
8077A1l3mL5j8k6L9Pl5mN0k5k8N3Rm6J2K9k5k9N2J2n9K6K6k7k3N2pn0L8L1n4r
8110b0M7Kn8L3L6m8j9M1nm7L5M7o2mN0k3m7M3K2l5j6M9Ln9L1M5m7j5O0pn3J6N8
8143E3o7j4P4j9o2M6L8n9k0O8k4n2L5N3p8j0Q5k1o8N8L9p9j1P9j3q2O3L6p7j8
8173d7Q9k7o0N2L9p1j5R2k9o9N8N2p7j8R0k5j02P7
8191I
$$ Imaginary data points
##PAGE= N=2
##DATA TABLE= (X++(I..I)), XYDATA
$$ plain form
0 0 0 0 0 0 0 0 0 0 0 0 0 -8 8 -8 8 -16 16 -24 24 -32 40 -48 56 -64 80 -88 105 -121 138 -161 185 -209 239
33 239 -270 305 -345 385 -432 486 -542 600 -669 742 -822 909 -1003 1108 -1222 1345 -1483
50 -1483 1632 -1800 1982 -2188 2417 -2677 2968 -3307 3699 -4160 4711 -5389 6239 -7344 8849
65 8849 -11023 14458 -20722 35858 -151212 -65896 191242 -44100 32520 177054 -50626
76 -50626 -218196 133451 266058 8066 -19473 122383 -101521 -217654 106601 222877
86 222877 -80534 -129320 -398 -167826 -247235 95690 218134 -45018 -65457 110999 -11024
97 -11024 -83145 191080 240654 -77625 -130003 39007 -53435 -118338 129256 156330 -152586
108 -152586 -191347 2669 -55143 -105698 127230 162808 -102974 -97568 124764 78585 -6681
$$ packed form
0@%%%%%%%%%%%qJ6j6J6k4L2m0M8n6P2q8J04j20J44j68J93k26K59k99L46l94M48
33B39n09N75o50P30q17R18j028J142j269J411j564J731j912K111k330K567k828
50a483L115l432L782m170M605n094N645o275P006p859Q871j0100J1628j3583J6193
65H849j9872K5481l5180N6580j87070Q5316K57138k35342P6620J44534k27680
76e0626j67570L51647J32607k57992k7539J41856k23904j16133L24255J16276
86B22877l03411m8786J28922j67428p9409L42925J22444k63152k0439J76456j22023
97a1024p2121K74225M9574l18279n2378J69010r2442o4903K47594K7074l08916
108a52586l8761J94016n7812n0555K32928L5578k65782N406K22332m6179q5266
$$ plain form
119 -6681 151264 128453 -155184 -158250 58833 19012 -70344 69896 59467 -178658 -150415
130 -150415 74819 41952 -52307 73536 82584 -104533 -50355 165091 112945 -19063 51669
141 51669 33625 -148997 -104984 87936 35613 -85566 -5233 11791 -120478 -61086 116924
152 116924 59312 -61706 15498 50985 -50545 6950 155255 75812 -64931 -15580 7069
163 7069 -94050 -52995 74889 5583 -105577 -28911 27014 -43617 -4103 103729 31313
174 31313 -73050 2391 61412 -3662 19555 100709 20713 -84944 -25204 19880 -50147 -39767
186 -39767 34106 -20647 -88204 -6428 55198 527 5054 62968 9994 -52776 15351 63763
198 63763 6335 -894 42430 -6648 -64833 -12155 21819 -35199 -42831 4821 -17391 -45436
$$ packed form
119f681J57945k2811k83637l066K17083l9821q9356J40240j0429k38125K8243
130a50415K25234l2867r4259J25843R048j87117N4178K15446n2146j32008P0732
141E1669j8044j82622M4013J92920n2323j21179Q0333J7024j32269N9392J78010
152A16924n7612j21018P7204L5487j01530N7495J48305p9443j40743M9351K2649
163G069j01119M1055J27884o9306j11160P6666N5925p0631L9514J07832p2416
174C1313j04363P5441N9021o5074K3217Q1154p9996j05657N9740M5084p0027J0380
186c9767P3873n4753o7557Q1776O1626n4671M527N7914n2974o2770O8127M8412
198F3763n7428p229M3324m9078n8185N2678L3974n7018p632M7652k2212k8045
$$ plain form
210 -45436 17759 57508 10278 -552 34606 9089 -24221 18803 42632 -5450 -18491 12146
222 12146 -8060 -38215 -6358 9737 -31606 -37051 1191 -549 -12478 23767 42606 8581
234 8581 12 24214 12047 -10723 7356 15606 -14240 -19806 2872 -4429 -22409 -8696 -1289
247 -1289 -21448 -19980 5700 8997 2921 18890 27305 10859 5789 15124 6412 -8636 -4948 -2079
261 -2079 -12747 -13222 -2871 -4959 -12301 -7793 -3622 -7736 -4821 5725 9387 9460 14866 17508 12213
276 12213 7160 4034 -2259 -8476 -9977 -9530 -9418 -8222 -6366 -4687 -3115 -2336 -1440 982 2824 3796
292 3796 7649 12338 12145 9860 8932 4199 -4115 -7420 -7173 -10637 -12415 -7441 -4412 -5523 -1519 4330
308 4330 2523 156 4268 5799 2877 5905 11253 8053 3198 4002 1095 -7120 -9050 -6759 -9880
$$ packed form
210d5436O3195L9749m7230j0830L5158k5517l3310M3024K3829m8082j3041L0637
222A2146k0206l0155L1857J6095m1343n445L8242j740j1929L6245J8839l4025
234H581q569K4202j2167k2770J8079Q250k9846n566K2678p301j7980J3713P407
247a289k0159J468K5680L297o076J5969Q415j6446n070R335q712j5048L688K869
261b079j0668m75J0351k088p342M508M171m114K915J0546L662P3N406K642n295
276A2213n053l126o293o217j501M47J12J196J856J679J572P79Q96K422J842R72
292C796L853M689j93k285r28m733q314l305K47l464j778M974L029j111M004N849
308D330j807k367M112J531k922L028N348l200m855Q04k907q215j930K291l121
$$ plain form
323 -9880 -11566 -5247 -758 -1338 2116 7112 5078 2086 4644 5636 2768 3509 6205 3890 207 -181
339 -181 -1891 -6387 -8430 -7695 -7692 -6926 -3303 925 3660 5058 5836 6069 4839 2597 2227 3299 1748
356 1748 -580 685 754 -3701 -5086 -2648 -5420 -9646 -5219 -285 -2373 338 9119 7806 1166 5066
372 5066 8193 -512 -2749 5178 1192 -8555 -2182 4444 -5323 -7782 2945 -1570 -13464 -3546 7993
387 7993 -1222 -1971 13500 9002 -6589 3085 13634 -2645 -8788 6788 735 -17049 -3054 12511
401 12511 -5143 -11868 7458 1606 -18247 -626 18957 -961 -8461 15004 9239 -14344 3382
414 3382 21958 -5663 -18431 7012 2086 -22223 -1 22953 -6743 -20167 10058 6826 -19560
427 -19560 4025 28351 -5102 -19867 14995 13148 -16993 4803 27206 -12554 -30272 8955
$$ packed form
323i880j686O319M489n80L454M996k034k992K558R92k868P41K696k315l683l88
339a81j710m496k043P35LP66L623M228K735J398P78K33j230k242l70J072j551
356A748k328J265O9m455j385K438k772m226M427M934k088K711Q781j313o640L900
372E066L127q705k237P927l986r747O373O626r767k459J0727m515j1894R918J1539
387G993r215p49J5471m498j5591R674J0549j6279o143J5576o053j7784J3995J5565
401A2511j7654o725J9326n852j9853J7621J9583j9918p500K3465n765k3583J7726
414C382J8576k7621j2768K5443m926k4309K2222K2954k9696j3424L0225l232k6386
427a9560K3585K4326l3453j4765L4862j847l0141K1796K2403l9760j7718L9227
$$ plain form
439 8955 9788 -21547 2400 28046 -12743 -29498 15671 17865 -18220 4039 30058 -13559 -30178
452 -30178 20592 23236 -19005 425 26193 -20729 -37487 18968 22876 -23391 -2894 27578
464 27578 -18242 -32954 28455 30736 -23316 -5306 27467 -18457 -32341 32465 32647 -28406 -11996
477 -11996 24063 -20991 -34517 32401 31172 -33700 -15069 27956 -13535 -26995 39223 33843
489 33843 -36955 -18560 28981 -11029 -26335 38271 30162 -43613 -22883 30157 -8882 -27120
501 -27120 35710 26355 -47560 -21555 38549 23 -22569 37029 24863 -51021 -21984 42253
513 42253 1421 -26466 31437 19618 -54908 -20795 47538 3390 -30287 26683 17176 -54024
525 -54024 -14708 56581 8370 -31554 23832 16228 -53052 -12366 58047 5059 -39494 16926
$$ packed form
439H955Q33l1335K3947K5646m0789j6755M5169K194l6085K2259K6019m3617j6619
452c0178N0770K644m2241J9430K5768m6922j6758N6455L908m6267K0497L0472
464B7578m5820j4712O1409K281n4052J8010L2773m5924j3884O4806J82o1053J6410
477a1996L6059m5054j3526O6918j229o4872J8631M3025m1491j3460O6218n380
489C3843p0798J8395M7541m0010j5306O4606q109p3775K0730N3040l9039j8238
501b7120O2830r355p3915K6005O0104l8526k2592N9598j2166p5884K9037O4237
513D2253m0832k7887N7903j1819p4526L4113O8333m4148l3677N6970r507p1200
525e4024L9316P1289m8211l9924N5386p604o9280M0686P0413n2988m4553N6420
$$ plain form
537 16926 14889 -49769 -8053 60440 3443 -44491 13487 17491 -42936 -2236 62916 2750
549 2750 -47480 11768 20250 -38722 -2196 58099 -4145 -53893 9389 24047 -32905 -226
561 -226 55945 -7423 -55897 11228 30151 -27138 707 53097 -10363 -56619 13807 34460
573 34460 -25879 -3952 45375 -16146 -57919 16875 39454 -23270 -6005 41746 -16521 -54283
585 -54283 21870 43411 -22634 -9842 37275 -16165 -50117 24849 43569 -25564 -16569 30957
597 30957 -16037 -45659 27388 44001 -25788 -18810 29594 -11462 -38988 29103 42040 -28058
609 -28058 -22188 27570 -7829 -34118 28281 37642 -31835 -25865 25814 -4428 -29804 27723 34940
622 34940 -32222 -24746 28364 841 -26036 25438 30180 -34348 -24865 29405 3711 -24819 21501
$$ packed form
537A6926k037o4658M1716O8493n6997m7934N7978M004o0427M0700O5152o0166
549B750n0230N9248Q482n8972L6526O0295o2244m9748O3282J4658n6952L2679
561b26N6171o3368m8474O7125J8923n7289K7845N2390o3460m6256P0426K0653
573C4460o0339K1927M9327o1521m1773P4794K2579o2724J7265M7751n8267l7762
585e4283P6153K1541o6045J2792M7117n3440l3952P4966J8720o9133Q995M7526
597C0957m6994k9622P3047J6613o9789O978M8404m1056k7526O8091J2937p0098
609b8058N870M9758l5399k6289O2399R361o9477N970N1679l0242k5376N7527P217
622C4940o7162P476N3110k7523k6877N1474M742o4528R483N4270k5694k8530M6320
$$ plain form
635 21501 25171 -35495 -23886 30550 6003 -23729 18611 22907 -32625 -19581 32973 8121
647 8121 -23621 14121 19058 -31142 -17519 32288 7916 -24263 9963 16477 -28019 -14680 31373
660 31373 7758 -23825 7745 16259 -22769 -10704 30484 6937 -24282 4494 14351 -20074
672 -20074 -9464 27451 4979 -24322 3013 14240 -16449 -7672 25015 3705 -23160 3293
684 3293 15385 -12632 -6058 22387 1981 -22739 2337 14339 -11503 -6579 18833 683 -20852
697 -20852 3105 14640 -9330 -6117 16262 420 -18125 3992 14559 -7492 -5919 13366
709 13366 -251 -16304 3124 12383 -7269 -6500 10609 -18 -13171 3676 11591 -5762 -5864
722 -5864 8791 518 -10394 3605 10121 -4893 -5550 6790 327 -8872 2325 7589 -4869 -5248
$$ packed form
635B1501L670o0666J1609N4436k4547k9732M2340M296n5532J3044N2554k4852
647H121l1742L7742M937n0200J3623M9807k4372l2179L4226O514m4496J3339M6053
660C1373k3615l1583L1570Q514l9028J2065M1188k3547l1219K8776R857l4425
672b0074J0610L6915k2472k9301K7335J1227l0689Q777L2687k1310k6865K6453
684C293J2092k8017O574K8445k0406k4720K5076J2002k5842M924K5412j8150k1535
697b0852K3957J1535k3970L213K2379j5842j8545K2117J0567k2051J573J9285
709A3366j3617j6053J9428R259j9652P69J7109j0627j3153J6847P915j7353j02
722e864J4655q273j0912J3999O516j5014o57J2340o463r199J1197N264j2458l79
$$ plain form
736 -5248 5585 1018 -6364 2558 6662 -3659 -4118 4776 1220 -4920 1878 5031 -3096 -3473 3529
751 3529 714 -4260 730 3215 -2643 -2584 2919 1141 -2436 963 2678 -1338 -1497 1919 714 -1683
767 -1683 230 1336 -760 -965 642 68 -1049 -406 194 -66 -80 114 348 537 49 -65 805 485 -947
786 -947 -312 901 -440 -1079 954 723 -1759 -681 1454 -533 -1615 1367 1345 -1812 -324 2571 -49
803 -49 -1794 1578 1436 -2521 -900 2520 -466 -2489 1478 1600 -2690 -913 2879 -378 -2665 1708
819 1708 2078 -2435 -593 3374 -145 -2759 1578 1919 -2820 -1128 2917 -480 -2994 1469 2040 -2547
835 -2547 -970 2958 -271 -2721 1571 2211 -2121 -752 2882 -121 -2531 1210 1754 -2266 -1156 2175
851 2175 -269 -2275 1079 1708 -1663 -803 1994 32 -1681 920 1460 -1155 -616 1479 87 -1288
$$ packed form
736e248J0833m567p382Q922M104j0321m59Q894l556o140O798L153q127l77P002
751C529k815m974M990K485n858N9N503j778l577L399J715m016j59L416j205k397
767a683J913J106k096k05J607n74j117O43O00k60j4J94K34J89m88j14Q70l20j432
786i47O35J213j341o39K033k31k482J078K135j987j082K982k2l157J488K895k620
803d9j745L372j42l957J621L420k986k023L967J22m290J777L792l257k287M373
819A708L70m513J842L967l519k614M337L41m739J692M045l397k514M463N71m587
835b547J577L928l229k450M292O40m332J369L634l003k410L741N44m020J110L331
851B175k444k006L354O29l371Q60K797j962j713K601N40k615N39K095j392j375
$$ plain form
867 -1288 334 723 -1002 -743 626 81 -635 161 520 -98 -212 161 300 120 -233 -51 527 34 -692
886 -692 208 714 -797 -869 941 173 -1611 212 1652 -885 -1161 1936 774 -2315 268 2531 -1283
903 -1283 -1980 2488 1007 -3388 138 3405 -1736 -2868 3034 1283 -4362 274 4647 -1854 -3439
918 -3439 3950 1838 -5281 351 5716 -2433 -4594 4452 2135 -6348 399 6848 -2959 -5683 5101
933 5101 2704 -7161 631 8148 -3259 -6590 5918 3458 -7899 569 8989 -3957 -7892 6372
947 6372 4130 -8620 443 9800 -4456 -8896 7113 5058 -9164 339 10648 -4801 -9743 7983
961 7983 6028 -9916 -150 11115 -5491 -10780 8811 6900 -10771 -567 11836 -5882 -11437
974 -11437 10010 7900 -11753 -1054 12597 -6137 -11964 11192 8668 -13068 -1868 13141 -6437
$$ packed form
867a288J622L89j725K59J369n45p16P96L59o18j14L73J39j80l53J82N78m93p26
886f92R00N06j511p2J810p68j784J823J440k537k76L097j162l089K583K263l814
903a283o97M468j481m395L526L267n141j132N902j751n645M636M373o501j585
918c439P389k112p119N632N365q149k161R046k317q483O747O449r807k724J0784
933E101k397r865P792P517j1407l331J2508k460j1357Q468Q420j2946l935J4264
947F372k242j2750R063R357j4256m440J6009k055j4222R503J0309j5449m942J7726
961G983j955j5944R766J1265j6606n289J9591j911j7671J0204J2403j7718n555
974a1437K1447k110j9653J0699J3651j8734n827K3156k524k1736J1200J5009j9578
$$ plain form
987 -6437 -12528 12183 9276 -14311 -2504 14011 -6165 -12715 13030 9738 -15484 -3218 14844
1000 14844 -5660 -12906 13389 9871 -16649 -3975 15573 -5105 -13215 13421 9925 -17461 -4332
1013 -4332 16672 -4230 -13433 13298 9854 -18233 -4568 17745 -3605 -13960 12934 9617 -19007
1026 -19007 -4568 18916 -3243 -14758 12573 9557 -19408 -4111 20313 -2955 -15676 12177
1038 12177 9524 -19678 -3657 21349 -3075 -16825 11675 9685 -19580 -3218 22048 -3316
1050 -3316 -17895 11203 10173 -18941 -2760 22385 -3519 -18774 10661 10731 -18131 -2675 22096
1063 22096 -3863 -19474 10202 11446 -17132 -2738 21524 -4161 -19883 10015 12343 -16105
1075 -16105 -2891 20832 -4480 -20094 10053 13081 -15495 -3355 19924 -4906 -20087 10456
$$ packed form
987f437o091K4711k907k3587J1807J6515k0176o550K5745l292k5222J2266J8062
1000A4844k0504p246K6295l518k6520J2674J9548k0678q110K6636l496k7386J3129
1013d332K1004k0902r203K6731l444k8087J3665K2313k1350j0355K6894l317k8624
1026a9007J4439K3484k2159j1515K7331l016k8965J5297K4424k3268j2721K7853
1038A2177k653k9202J6021K5006k4424j3750K8500j990k9265J6362K5266k5364
1050c316j4579K9098j030k9114J6181K5145k5904j5255K9435P0k8862J5456K4771
1063B2096k5959j5611K9676J244k8578J4394K4262k5685j5722K9898K328k8448
1075a6105J3214K3723k5312j5614L0147L028k8576J2140K3279k4830j5181L0543
$$ plain form
1087 10456 13817 -15135 -3874 19134 -5164 -19731 11083 14402 -15033 -4450 18412 -5211
1099 -5211 -19193 11541 14576 -15171 -5200 17645 -4963 -18353 11795 14542 -15163 -5829 16928
1112 16928 -4323 -17310 11724 14230 -15028 -6388 16216 -3487 -16235 11198 13562 -14859
1124 -14859 -6895 15552 -2527 -15108 10547 12845 -14527 -7055 15102 -1594 -14141 9780
1136 9780 11981 -14231 -7001 14824 -871 -13479 8940 11067 -13891 -6699 14658 -338 -12944
1149 -12944 8187 10310 -13367 -6196 14496 -52 -12567 7374 9580 -12700 -5660 14115 84
1162 84 -12237 6476 8915 -11795 -5125 13489 225 -11761 5654 8406 -10620 -4605 12628
1175 12628 278 -11218 4787 7883 -9387 -4189 11562 277 -10588 4022 7426 -8171
$$ packed form
1087A0456L361k8952J1261K3008k4298j4567L0814L319k9435J0583K2862k3623
1099e211j3982L0734L035k9747R971K2845k2608j3390L0148K747k9705R334K2757
1112A6928k1251j2987K9034K506k9258Q640K2604j9703j2748K7433K364k8421
1124a4859P964K2447j8079j2581K5655K298k7372P472K2157j6696j2547K3921
1136I780K201k6212P230K1825j5695j2608K2419K127k4958P192K1357j4996j2606
1149a2944K1131K123k3677P171K0692j4548j2515J9941K206k2280P040J9775j4031
1162H4j2321J8713K439k0710O670J8614j3264j1986J7415K752j9026O015J7233
1175A2628j2350j1496J6005L096j7270N198J5751j1285j0865J4610L404j5597
$$ plain form
1187 -8171 -3782 10462 246 -9852 3520 7053 -7070 -3470 9352 104 -9134 3118 6612
1200 6612 -6242 -3224 8303 -35 -8338 2919 6169 -5561 -2971 7366 -126 -7485 2770
1213 2770 5704 -4951 -2784 6431 -178 -6621 2514 5114 -4367 -2582 5515 -129 -5680 2221 4480
1228 4480 -3733 -2340 4634 27 -4702 1865 3832 -3077 -2108 3767 138 -3844 1460 3151 -2489
1243 -2489 -1825 2985 255 -3010 1086 2515 -1938 -1489 2315 307 -2274 767 1873 -1454 -1148 1681
1259 1681 241 -1656 498 1306 -1014 -790 1178 200 -1092 283 812 -588 -442 675 119 -542 107
1276 107 332 -182 -133 152 31 -48 -74 -77 196 144 -308 -34 444 -217 -466 543 379 -784 -110 869 -351
1297 -351 -832 796 558 -1175 -181 1230 -423 -1109 1025 761 -1436 -218 1576 -475 -1379 1160 914
$$ packed form
1187h171M389J4244j0216j0098J3372L533j4123L600J2822r248r238J2252L494
1200F612j2854L018J1527q338q303J1257L250j1730K590J0337p492p359J0255
1213B770K934j0655K167R215o609o443R135K600r481J785Q097n644n551P901K259
1228D480q213J393O974m607m729O567J967o909R69N875l629l982N304J691n640
1243b489O64M810k730l265M096J429m453M49L804k008k581L041J106l327L06K829
1259A681j440j897K154Q08k320K24J968r78j292J375N29j400J46J117n56o61O49
1276A07K25n14M9K85j21p9k6lK73n2m52K74M78o61k49J009j64j163O74R79j220
1297c51m81J628k38j733R94J411j653o86K134k64k197J218J794k051r04K539k46
$$ plain form
1314 914 -1656 -281 1792 -497 -1574 1253 1046 -1791 -318 1961 -500 -1719 1319 1157 -1883 -357
1330 -357 2072 -508 -1820 1331 1210 -1900 -399 2100 -515 -1886 1308 1257 -1901 -424 2082 -486
1346 -486 -1870 1281 1266 -1826 -446 2003 -435 -1797 1196 1229 -1716 -462 1871 -369 -1662 1096
1362 1096 1159 -1554 -453 1702 -291 -1486 964 1050 -1360 -438 1466 -220 -1279 774 886 -1127
1378 -1127 -395 1183 -128 -1019 577 697 -827 -347 851 -38 -716 326 486 -486 -270 474 54 -377
1396 -377 65 223 -132 -146 65 134 8 -172 -38 255 -32 -354 208 426 -407 -340 652 113 -833 251 850
1417 850 -670 -681 1038 253 -1287 284 1320 -898 -1026 1444 428 -1811 350 1820 -1186 -1413
1433 -1413 1895 597 -2344 434 2362 -1482 -1823 2357 774 -2904 538 2909 -1797 -2247 2842
$$ packed form
1314I14k570J375K073k289j077K827k07k837J473K279k461j219L038j62l040J526
1330c57K429k580j312L151j21l110J501K499k615j371L194n1l158J477K506k568
1346d86j384L151j5l092J380K449k438j362K993L3k945J254K333k240j293K758
1362A096O3k713J101K155j993j195K450Q6k410R22J904j686j059K053J12k013
1378a127P32J578j311q91J596J20j524M80J198q89o78J042J60r72K16P44m20m31
1396c77M42J58l55j4K11O9j26j80J34K93k87l22N62K18q33O7R92n39r46J084N99
1417H50j520j1J719p85j540J571J036k218j28K470j016k239K161J470l006k27
1433a413L308j298k941K778J928l844l41M180j583l678L442K371m706m50N089
$$ plain form
1448 2842 970 -3444 615 3459 -2112 -2690 3295 1218 -3963 656 3947 -2385 -3102 3707 1477
1463 1477 -4420 635 4437 -2608 -3554 4085 1782 -4868 533 4885 -2810 -3989 4446 2096 -5321
1478 -5321 437 5322 -2974 -4391 4867 2416 -5796 348 5775 -3175 -4754 5311 2689 -6338 259
1493 259 6241 -3389 -5114 5789 2929 -6919 199 6727 -3574 -5447 6236 3121 -7466 110
1507 110 7217 -3688 -5766 6590 3306 -7978 -9 7672 -3699 -6081 6808 3495 -8372 -159
1521 -159 8087 -3600 -6373 6892 3708 -8663 -337 8483 -3464 -6676 6885 3880 -8902 -461
1535 -461 8837 -3342 -6996 6891 4058 -9114 -520 9232 -3304 -7324 6915 4155 -9312 -475
1549 -475 9599 -3389 -7651 6997 4284 -9488 -370 9899 -3531 -7963 7088 4394 -9612
$$ packed form
1448B842j872m414M059K844n571n78N985k077n181M619L291o332p17O809k230
1463A477n897N055L802p045r46P639k303o650N401M352p695j179Q435k350p417
1478e321N758M885q296j417R258k451q212O144N427q950j579J0065k622r027O597
1493B59N982r630j725J0903k860r848P118O528j0301j873J1683l115j0587P576
1507A10P107j0905k078J2356l284j1284P969P681j1371k382J2889l313j1867Q213
1521a59Q246j1687k773J3265l184j2371Q326Q820j1947l212J3561l005j2782Q441
1535d61R298j2179l654J3887k833j3172Q594R752j2536m020J4239k760j3467Q837
1549d75J0074j2988m262J4648k713j3772R118J0269j3430m432J5051k694j4006
$$ plain form
1562 -9612 -301 10121 -3654 -8241 7152 4578 -9616 -305 10235 -3710 -8473 7095 4792
1575 4792 -9508 -405 10208 -3638 -8626 6970 5059 -9284 -631 10071 -3507 -8716 6793
1588 6793 5315 -9052 -863 9880 -3379 -8735 6676 5530 -8853 -1098 9686 -3258 -8687
1601 -8687 6638 5656 -8752 -1270 9496 -3213 -8575 6642 5704 -8711 -1383 9332 -3149
1614 -3149 -8408 6675 5660 -8688 -1484 9173 -3032 -8194 6622 5594 -8572 -1594 8982
1627 8982 -2825 -7942 6416 5490 -8394 -1739 8719 -2505 -7670 6054 5354 -8086 -1887 8398
1641 8398 -2122 -7372 5618 5174 -7709 -2014 8069 -1767 -7095 5169 4996 -7311 -2038 7767
1655 7767 -1468 -6792 4782 4766 -6950 -1988 7475 -1327 -6524 4471 4517 -6614 -1842 7199 -1245
$$ packed form
1562i612R311J0422j3775m587J5393k574j4194R311J0540j3945m763J5568k303
1575D792j4300R103J0613j3846m988J5596j911j4343Q653J0702j3578n209J5509
1588F793j478j4367Q189J0743j3259n356J5411j146j4383P755J0784j2944n429
1601h687J5325r82j4408P482J0766j2709n362J5217r38j4415P328J0715j2481
1614c149n259J5083j015j4348P204J0657j2205n162J4816j028j4166O978J0576
1627H982j1807n117J4358r26j3884O655J0458j1224n165J3724p00j3440O199J0285
1641H398j0520n250J2990m44j2883N695J0083r836n328J2264j73j2307N273R805
1655G767r235n324J1574j6j1716M962R463q802n197J0995M6j1131M772R041q444
$$ plain form
1670 -1245 -6256 4181 4278 -6265 -1695 6857 -1180 -5981 3904 4018 -5870 -1569 6461 -1092 -5662
1685 -5662 3575 3807 -5408 -1493 6002 -956 -5315 3178 3608 -4842 -1447 5481 -782 -4925 2787
1700 2787 3408 -4291 -1419 4929 -615 -4519 2433 3194 -3785 -1369 4406 -496 -4104 2127 2949 -3344
1716 -3344 -1314 3925 -420 -3715 1905 2686 -2984 -1213 3466 -379 -3288 1704 2391 -2653 -1083
1731 -1083 3040 -346 -2863 1508 2082 -2319 -944 2613 -265 -2440 1285 1790 -1944 -834 2173
1746 2173 -175 -2025 1034 1497 -1565 -726 1748 -78 -1610 760 1214 -1178 -623 1321 14 -1214
1762 -1214 489 913 -837 -523 935 64 -863 294 646 -518 -377 587 76 -546 115 383 -258 -233
1780 -233 287 81 -228 -9 145 -22 -77 4 69 50 -110 -76 181 45 -258 49 308 -199 -266 383 158 -513
$$ packed form
1670a245n011J0437R7j0543M570Q552q037m801R885J14r888M301Q030p553m570
1685e662R237K32r215L915P495o958m359Q493M30q450L395O928o263m143P712
1700B787O21p699K872O348n544l904O952P61o979K416N775m902l608O231Q22o293
1716c344K030N239m345l295N620P81n670J771M679l845k909M992O87n044J570
1731a083M123l386k517M371N74m401J375L557k878k175L725N05l734J110L007
1746B173k348j850L059M63l062Q39K474j826j532K370M54k392N55J944j307j228
1762a214J703M24j750L14J458q71r27J157L52j164J41R64n11o22O61K68o41K5
1780b33N20k06l09K19J54j67n5Q1O5j9j60L4K57j36l03L07K59n07o7O49k25o71
$$ plain form
1802 -513 47 537 -316 -460 560 244 -733 29 751 -404 -620 707 327 -928 38 924 -474 -767
1820 -767 830 409 -1072 2 1068 -521 -875 925 479 -1173 5 1188 -535 -969 980 549
1836 549 -1247 -21 1270 -539 -1031 1013 603 -1286 -34 1299 -534 -1074 1013 617 -1299 -52
1852 -52 1322 -536 -1089 992 634 -1274 -86 1299 -507 -1073 963 638 -1238 -91 1256 -476
1868 -476 -1043 921 606 -1168 -99 1184 -422 -964 836 586 -1068 -109 1084 -367 -878 748 539
1885 539 -943 -91 958 -311 -763 631 448 -814 -92 792 -255 -628 514 382 -637 -87 616
1902 616 -176 -475 353 265 -444 -59 410 -115 -301 208 164 -224 -45 190 -27 -110 44 22 -12 3 -43 33 104
1925 104 -111 -125 202 56 -295 75 335 -258 -286 429 109 -569 114 576 -425 -463 659 195 -836 163
$$ packed form
1802e13N60M90q53j44J020l16r77P62P22j155k16J327l80j255R66Q86j398k93
1820g67J597m21j481J074J066j589l54J800m46j652J178J183j723m34J949m31
1836E49j796J226J291j809m92K044m10j889J252J333j833n40K087l96j916J247
1852e2J374j858n53K081l58j908J188J385j806n66K036l25j876J147J347j732
1868d76n67J964l15j774J069J283j606n42J800k50j654R59J193j451n11J626k09
1885E39j482Q52J049j269m52J394j83j262P22Q84j047l73J142j32j019N50P03
1902F16p92k99Q28q8p09L85M69n25j86N09m4l88J79K35k17q3J54k2l4J5m6P6P1
1925A04k15j4L27j46l51L70K60n93k8P15l20o78O83M62j001l8J122m64j031R99
$$ plain form
1945 163 825 -581 -644 902 244 -1121 227 1081 -761 -815 1172 322 -1404 310 1354 -954 -1007 1451
1963 1451 390 -1709 398 1628 -1139 -1198 1718 460 -1984 458 1889 -1308 -1387 1968 564 -2269
1979 -2269 463 2150 -1457 -1621 2182 693 -2534 448 2407 -1551 -1843 2380 824 -2799 398
1994 398 2672 -1651 -2068 2585 979 -3042 370 2919 -1742 -2255 2785 1091 -3303 370 3172 -1863
2010 -1863 -2430 3022 1191 -3575 409 3411 -1992 -2587 3238 1239 -3839 414 3632 -2116 -2753 3443
2026 3443 1300 -4078 438 3843 -2211 -2894 3584 1375 -4263 405 4049 -2224 -3068 3648 1514
2041 1514 -4407 347 4242 -2206 -3228 3703 1639 -4534 248 4409 -2157 -3413 3721 1778 -4616
2056 -4616 182 4561 -2124 -3570 3750 1881 -4697 152 4679 -2151 -3702 3806 1937 -4791 158
$$ packed form
1945A63O62j406o3J546o58j365J348Q54j842n4J987q50j726J714J044k308n3K458
1963A451j061k099K107J230k767n9K916j258k444K442J431l197p9L355j404k833
1979b269K732J687l607j64L803j489l227K982J959l958k92M223j556l623L197
1994C98K274m323m17M653j606m021L412K549m661n13N040j694m394L673K802n035
2010a863n67N452j831m766L984L002n403n95N825j999n078M253L218n748o37O196
2026C443k143n378M516L405o054o83O478k209n638M668L644o273q44O716k134
2041A514n921M754L895o448j022O931k064o173M782M161o566j256P134j943o394
2056d616M798M379o685j446P320j869o578M849M527o830j551P508j869o728M949
$$ plain form
2071 158 4786 -2215 -3800 3890 1976 -4872 179 4876 -2287 -3872 3938 2020 -4911 175 4934
2086 4934 -2296 -3927 3963 2109 -4912 120 4950 -2247 -3999 3909 2211 -4864 10 4941 -2143
2101 -2143 -4043 3822 2327 -4783 -151 4886 -2026 -4076 3697 2424 -4700 -280 4811 -1908 -4070
2116 -4070 3603 2478 -4624 -364 4745 -1826 -4035 3537 2459 -4564 -385 4674 -1771 -3939 3510
2131 3510 2417 -4493 -367 4589 -1755 -3840 3455 2341 -4410 -372 4474 -1700 -3727 3358 2291
2146 2291 -4294 -397 4354 -1576 -3631 3193 2239 -4127 -478 4199 -1423 -3542 2976 2234 -3921
2161 -3921 -572 4036 -1225 -3434 2743 2196 -3693 -635 3860 -1071 -3298 2536 2154 -3456 -651
2176 -651 3674 -946 -3157 2344 2054 -3269 -629 3474 -891 -2972 2219 1941 -3064 -567 3274 -858
$$ packed form
2071A58M628p001j585P690j914o848N051M697p163j585P810j918o931N086M759
2086D934p230j631P890j854p021N032M830p197j752P908j698p075M874M931p084
2101b143j900P865j495p110M632N037o912k050P773j273p124M420N091o719k162
2116d070P673j125p102M260N109o571k209P572j078p023M179N059o445k168P449
2131C510j093o910M126M956o344k085P295j114o751M038M846o174k027P085j067
2146B291o585L897M751n930k055O824r54o366L649M677n622k119O518p42o155
2161c921L349M608n261k209O177n47n889L058M495m931k227N834l82n610K805
2176f51M325m620k211N501k90n323K640M103m365k081N191k78n005K497L841m132
$$ plain form
2192 -858 -2802 2080 1793 -2872 -530 3052 -815 -2617 1922 1669 -2635 -482 2817 -726 -2429 1727
2208 1727 1568 -2400 -484 2564 -618 -2233 1518 1487 -2119 -522 2301 -471 -2029 1314 1394 -1858
2224 -1858 -533 2046 -357 -1836 1113 1291 -1620 -513 1800 -276 -1633 953 1147 -1417 -486 1559
2240 1559 -234 -1423 817 969 -1218 -427 1320 -205 -1213 698 833 -1035 -348 1112 -175 -993
2256 -993 575 678 -838 -290 911 -127 -794 455 548 -648 -247 693 -62 -624 306 437 -441 -205
2274 -205 487 5 -419 166 316 -259 -177 279 52 -261 31 197 -102 -150 101 82 -102 -63 72 37 -94 -59
2296 -59 94 49 -139 -40 175 -22 -187 103 195 -193 -128 284 40 -328 100 319 -239 -231 383 90 -438 114
2318 114 431 -294 -319 472 125 -541 111 531 -348 -400 544 160 -638 113 614 -395 -448 613 181 -707
$$ packed form
2192h58j944M882k87m665K342L582l867j802M539k53m304K153L299l543j703M156
2208A727j59l968J916L048l182j615L751l1l606J597K823k772j558L343Q0l252
2224a858J325K579k403j479K949J78k911J107K313k076j357K586J94k564R31K045
2240A559j793j189K240J52k187P91J747j525j008J911J35j868O87J460j287q18
2256i93J568J03j516N48J201j038o67J249R3j196M01R40p55n62R30J31q78K36
2274b05O92m82m24N85J50n75Q2M56k27l13K92J66k99m8K51j9j84L9J35l5j31L5
2296e9J53m5j88R9K15j97j65K90R2l88O5M12k44l68M28K19n58QO14k93n28N52
2318A14L17p25k5P91l47o66O52M20q79n2R44l84p98P51N01j009n3J061m32q88
$$ plain form
2338 -707 117 668 -417 -503 645 214 -755 117 724 -427 -538 690 250 -791 116 757 -436 -553
2356 -553 698 268 -800 94 779 -423 -577 692 279 -812 72 769 -424 -597 673 280 -806
2373 -806 63 758 -407 -593 650 280 -773 52 733 -380 -567 603 275 -729 48 707 -328 -523
2391 -523 576 279 -672 48 648 -315 -483 525 248 -604 46 587 -280 -433 461 216 -528 28 493
2410 493 -252 -371 379 167 -454 31 398 -201 -303 305 134 -346 20 289 -149 -207 209 88 -227 18
2430 18 181 -94 -104 114 36 -93 19 63 -43 -15 35 -35 20 27 -58 2 95 -67 -100 129 57 -194 38 217 -161
2455 -161 -183 255 66 -342 63 339 -247 -266 380 95 -485 97 474 -344 -349 526 118 -620 168 578 -438
2476 -438 -408 679 120 -771 229 708 -571 -486 812 133 -899 274 833 -666 -557 949 155 -1055
$$ packed form
2338g07Q24N51j085q6J148m31r69Q72O07j151j11J228m40j041R07O41j193j17
2356e53J251m30j068Q94O85j202j54J269m13j091Q84O97j193j73J270l93j086
2373h06Q69O95j165j86J243l70j053Q25O81j113j87J170l28j004P77O59j035j95
2391e23J099k97r51P20O00r63j68J008k77q52O50N41q67j53Q94k45p44N56M65
2410D93p45j19P50k12o21M85L67n99j02O08j71m80L66K69m38n8M16j21l15K45
2430A8J63k75j0K18p8j29J12M4j06K8N0p0N5Pq5O0R3j62l3K29p2k51K32J79l78
2455a61k2M38j89m08M05K76n86j9O46k85n80N82L77q18nQ75m08p38P88M10j016
2476d38L0J087n59q91J000M79j279Q5J298o79j032J173N59j499J09J506p94j210
$$ plain form
2494 -1055 308 943 -763 -656 1062 185 -1207 325 1064 -833 -766 1169 247 -1330 332 1209 -885
2511 -885 -860 1284 304 -1460 334 1356 -933 -948 1404 375 -1580 335 1468 -1001 -1038 1505 392
2528 392 -1708 359 1574 -1084 -1113 1606 398 -1823 401 1662 -1160 -1157 1715 411 -1928 434
2544 434 1754 -1236 -1216 1802 424 -2024 450 1834 -1285 -1281 1857 465 -2120 437 1934 -1292
2560 -1292 -1371 1913 553 -2161 408 2031 -1269 -1453 1940 608 -2229 349 2103 -1267 -1544 1959
2576 1959 682 -2296 322 2168 -1281 -1615 1991 702 -2335 325 2193 -1312 -1625 2023 708
2591 708 -2356 347 2216 -1340 -1639 2053 702 -2380 378 2226 -1374 -1630 2084 691 -2382 384
2607 384 2245 -1348 -1627 2079 719 -2373 342 2243 -1318 -1673 2044 765 -2359 278 2241 -1264
$$ packed form
2494a055J363O35j706J07J718q77j392J532P39j897O7J935r22j577J662Q77k094
2511h85K5K144r80j764J794J022k289j5K352j029j955J915J133k469l7K543j113
2528C92k100K067J215k658k9K719j208k221K224J261k822LK872j304k339K362
2544D34J320k990K0L018j378k448K474J384l119ML138j392k585K557J497l226
2560a292p9L284j360k714K569J623l300j84L393j332k837K578J754l370k77L503
2576A959j277k978K618J846l449l34L606j289l037K660J868l505l13L648j315
2591G08l064K703J869l556k99L692j351l082K758J848l600k56L714j393l073K766
2607C84J861l593k79L706j360l092K715J901l561l55L717j279l124K637J963l505
$$ plain form
2623 -1264 -1692 1991 825 -2332 211 2226 -1207 -1723 1933 851 -2300 155 2198 -1146 -1705 1892
2639 1892 856 -2258 142 2164 -1115 -1651 1860 841 -2203 153 2111 -1099 -1597 1826 790
2654 790 -2137 184 2047 -1090 -1534 1771 750 -2086 186 1969 -1039 -1483 1696 715 -2010 148
2670 148 1898 -980 -1455 1592 725 -1906 91 1821 -899 -1410 1494 740 -1801 34 1758 -791
2686 -791 -1368 1383 746 -1694 1 1666 -714 -1299 1304 731 -1583 0 1571 -660 -1227 1200
2702 1200 677 -1481 -1 1457 -627 -1120 1132 612 -1374 24 1342 -617 -1043 1044 539 -1274
2718 -1274 22 1214 -576 -949 954 495 -1140 29 1109 -509 -865 850 468 -1027 -25 999
2734 999 -418 -778 743 447 -898 -38 902 -333 -714 629 421 -774 -62 782 -276 -632 530
$$ packed form
2623a264m28L683j166l157K543K015l433n16L656j082l151K455K043l344n59L597
2639A892j036l114K400K022l279n36L511j019l044K356J958l210m98L423j036
2654G90k927K321J863l137m44L305j021k836K272J783l008m44L179r81k725K158
2670A48J750k878m75L047q67k631J997J730k720n11K904p54k541J835J724k549
2686g91n77K751o37k440J695J665k380n85K603n73k314J583J571k231n67K427
2702A200n23k158J480J458k084m93K252n20j986J398J318j959m26K087n05j813
2718a274J296J192j790l73J903m59j635J169J080j618l56J715l82j495J002J024
2734I99j417l60J521k96j345Q60R40j235l81J343k08j195P12Q44j058l56J162
$$ plain form
2751 530 367 -676 -70 673 -231 -552 450 312 -562 -74 547 -195 -447 368 244 -475 -45 446 -159
2770 -159 -353 306 195 -357 -25 330 -123 -252 224 142 -262 -11 247 -77 -172 149 89 -158 -11 150 -41
2791 -41 -101 74 52 -65 -31 51 4 -43 -13 16 13 -24 -36 27 20 -69 -19 91 -12 -100 55 93 -113 -57 150 7 -176
2818 -176 79 169 -155 -100 225 25 -229 99 222 -181 -129 283 33 -300 107 261 -224 -172 315 51 -344
2839 -344 104 307 -254 -213 337 40 -393 113 336 -268 -233 372 60 -416 118 366 -294 -240 409 73 -439
2860 -439 130 383 -307 -254 417 79 -458 126 412 -294 -265 430 86 -462 126 410 -301 -277 413 92 -458
2881 -458 109 412 -291 -281 416 79 -460 97 387 -295 -289 392 83 -435 89 389 -268 -251 377 93 -409
2902 -409 68 369 -245 -260 351 99 -384 75 345 -217 -227 321 92 -353 72 305 -193 -201 277 85 -304
$$ packed form
2751E30j63j043O06P43r04l21J002j38q74M88O21p42k52Q15j24p19M30M91o05
2770a59j94O59j11n52L32L55m53j29M76q2m04K51K58l24r5L21o0k47J47J61j91
2791d1o0J75k2j17L4Q2m7m7L0K9ll7j2O3pq9N0J10j03q8J55L8k06N6K07j43j83
2818a76K55R0l24N5L25k00k54L28J23m03N2M12k50l33M07J54m85N2M87k64l95
2839c44M48K03n61M1N50k97m33N06K23o04L5O05l12m76N34K48o60N4O49l36n12
2860d39N69K53o90N3O71l38n37N84K86p06K9O95l44n48N88K84p11K4O90l21n50
2881d58N67L03p03J0O97l37n39N57K90o82OO81l09n18N24L00o57J7O28k84n02
2902d09M77L01o14j5O11k52m83M59K70n62j0N48k29m45M25K33m98qM78j92l89
$$ plain form
2923 -304 52 261 -160 -184 227 67 -257 37 216 -124 -165 172 59 -203 14 181 -86 -133 130 52 -143
2944 -143 -3 128 -61 -88 79 52 -79 -8 82 -13 -50 28 40 -22 -12 25 28 -5 -42 8 41 -36 -58 63 38 -93 -11
2971 -11 111 -42 -123 92 86 -165 -40 177 -36 -199 134 148 -216 -64 257 -44 -255 173 201 -277 -75 336
2993 336 -53 -312 222 242 -342 -91 410 -62 -389 261 289 -405 -111 473 -87 -456 294 336 -470 -151 548
3014 548 -100 -527 322 382 -527 -184 609 -95 -594 346 460 -561 -219 688 -74 -660 376 516 -600
3033 -600 -261 749 -61 -723 389 577 -645 -301 809 -41 -792 411 627 -697 -326 854 -69 -858
3051 -858 437 657 -768 -336 898 -76 -906 468 676 -806 -354 940 -102 -947 490 714 -838
3068 -838 -352 991 -80 -970 514 743 -855 -386 1032 -72 -1005 511 803 -872 -417 1061 -42
$$ packed form
2923c04L56K09m21k4M11j60l24K94J79l40m1L37j13k62K17J67k67m7K63p8j95
2944a43J40J31j89k7J67k7j31P1R0r5l7P8J2o2J0L7Ll3l7N0L3p7k2J21k5j31Q2
2971a1J22j53q1K15ok51J25K17k13j63L33J4l64J52L21l01k11M28K8m78K02M11
2993C36l89k59N34K0n84K51N01m72l27O50K8o94K94N84n60l69P50M2q06L19O99
3014E48o48m27Q49O0r09L43P93p04m99R40J14j021L42R07p62n86J036J40j116
3033f00L39J010q10o62J112J88j222L44J110q50p51J203K16j324L71J180r23p89
3051h58J295K20j425M32J234r74q30J374K08j482M52J294j042q45J437K24j552
3068h38M86J343j071q90J484K29j598M69J418j104r33J516K92j675M55J478j103
$$ plain form
3085 -42 -1045 499 847 -878 -465 1086 -19 -1094 496 879 -877 -498 1101 0 -1115 480
3101 480 888 -912 -528 1111 -11 -1147 485 894 -913 -507 1138 -18 -1132 502 899 -930
3117 -930 -486 1133 -21 -1131 529 890 -929 -476 1141 -18 -1132 532 893 -911 -483 1135
3133 1135 -11 -1122 498 895 -891 -519 1109 16 -1133 461 910 -885 -542 1080 46 -1124
3149 -1124 424 906 -851 -544 1071 65 -1100 414 905 -817 -541 1044 72 -1059 414 872
3165 872 -796 -503 1021 61 -1039 414 846 -780 -467 994 32 -992 403 790 -770 -450 937
3182 937 14 -954 379 755 -730 -442 898 28 -922 359 726 -684 -443 837 52 -867 319 706
3200 706 -626 -421 815 90 -824 289 704 -572 -418 768 87 -783 267 663 -525 -401 711
$$ packed form
3085d2j003J544L48j725M13J551j105j075J590L83j756L79J599j101j115J595
3101D80M08j800L84J639j122j136J632M09j807M06J645j156j114J634L97j829
3117i30M44J619j154j110J660L61j819M53J617j159j114J664L61j804M28J618
3133A135j146j111J620L97j786L72J628j093j149J594M49j795L43J622j034j170
3149a124J548M82j757L07J615j006j165J514M91j722K76J585r72j131J473M58
3165H72j668K93J524r60j100J453M32j626L13J461r62j024J395L87j560L20J387
3182I37r23r68J333L76j485K88J340q70r50J281L67j410K41J280p85r19J186L87
3200G06j332K05J236p25r14J113M15j276J54J186o81q70J050L96j188J24J112
$$ plain form
3217 711 89 -726 230 596 -516 -381 641 61 -677 213 533 -472 -335 584 42 -622 210 482 -434
3236 -434 -284 524 31 -543 204 425 -396 -256 484 36 -477 177 403 -332 -238 429 49 -426 148 351
3256 351 -277 -206 370 47 -365 116 306 -237 -203 294 36 -330 74 248 -195 -164 244 29 -270 66 191
3277 191 -173 -150 192 16 -213 60 165 -137 -93 172 6 -143 62 121 -102 -47 120 2 -84 59 62 -75
3299 -75 -15 79 -9 -45 34 24 -28 -3 27 -20 -1 14 -18 -13 18 -12 -31 30 -4 -38 13 45 -49 -34 68 -5 -71 33 67 -76
3329 -76 -36 112 6 -110 60 94 -100 -54 145 0 -130 78 134 -119 -54 171 -10 -160 88 126 -157 -72 184
3352 184 -20 -187 91 142 -170 -77 209 -15 -208 102 160 -188 -102 204 -23 -229 108 176 -193 -87 241 -16
3374 -16 -224 127 186 -195 -89 260 -11 -238 133 188 -198 -84 260 -5 -234 135 178 -206 -93 234 -13
$$ packed form
3217G11o22q15R56L66j112J35J022n80p38Q90L20j005J37R19n42o64Q32K72r16
3236d34J50Q08m93n74P47K21q21J40P40m48n13O54K26p35R4O67l80m75N74K03
3256C51o28P1N76l23m12M81J90n43L4M97k58l66M04J74m43L1M08k15k99L36J25
3277A91l64K3L42j76k29K73J05l02M4K65j66j49K05N9k23N5J67j18q6J43Lj37
3299g5O0R4q8l6P9j0n2K5L0m7J9J5l2NL1l0j9O1l4l4N1L2r4J5J02p3o6J04L4j43
3329g6M0J48j06j16J70L4j94M6J99j45j30K08N6k53O5K25j81j50K48L8k83Q5K56
3352A84k04j67K78N1l12R3K86k24j93L10N8l48Q6L06k27k06L37O8l69J06L28k57
3374a6k08L51N9l81J06L49k71k27L71N5l86J14L44k65k29L69M3l84J13L27k47
$$ plain form
3395 -13 -239 110 182 -202 -100 230 -10 -235 104 176 -192 -100 229 -12 -230 91 178 -174 -102 226 7 -207
3417 -207 99 183 -157 -100 214 18 -193 87 175 -144 -93 195 26 -178 72 161 -119 -86 161 9 -170 42
3439 42 117 -115 -93 127 19 -151 33 117 -90 -76 86 19 -127 18 100 -56 -67 79 23 -71 10 83 -19 -56
3463 -56 51 36 -58 -13 53 2 -40 20 42 -31 -30 44 31 -33 -29 48 12 -58 13 54 -33 -60 35 43 -78 -25 71 -12 -100 32
3493 32 71 -98 -76 106 5 -140 38 125 -96 -89 148 30 -150 46 152 -111 -110 170 40 -203 48 195 -136
3516 -136 -136 200 57 -242 54 219 -165 -168 232 58 -275 45 247 -180 -193 251 72 -319 51 287 -192 -220
3538 -220 283 89 -350 39 327 -185 -254 318 124 -374 36 373 -191 -269 347 159 -407 24 408 -208 -322
3559 -322 362 180 -438 25 429 -226 -349 385 165 -476 15 458 -244 -380 386 173 -490 26 474 -264
$$ packed form
3395a3k26L49P2l84J02L30k40k25L39P2l68R2L29k41k18L21Q7l52P2L28k19k14
3417b07L06Q4l40N7L14j96k11K80Q8l19N1K88j69k04K50Q9k80L3K47j52j79K12
3439D2P5k32K2K20j08j70J84Q4k07J4J62o7j46J45Q2j56j1J46n6r4Q1P3j02l7
3463e6J07j5r4M5O6n1m2O0K2p3JP4j3o4MP7l6p0P1M1q7k7R5Qj21N3R6q3q8J32
3493C2L9j69K2J82j01j45J78Q7k21PK37j18j80J96J06k63JK80j30k43K51J47l31
3516a36%L36j43k99K96J65l84lM00j74l33L20K02m27j3M44j79l91L70K36m79k8
3538b20N03j94m39L89K88n12o9N72j94m98M10L37n64p8O16j88n66M31L84o16j14
3559c22O84j82o18M63M04o55j23P34k20o41M91M43p02j36P66k13o63N16M48p38
$$ plain form
3579 -264 -383 415 186 -509 27 491 -260 -402 433 194 -535 31 523 -248 -407 471 218 -549 28 553
3599 553 -244 -427 458 245 -563 16 563 -252 -458 465 267 -584 -24 578 -247 -490 455 274 -602 -31
3619 -31 604 -248 -504 464 287 -597 -30 604 -250 -494 477 271 -588 -14 612 -250 -482 481 276 -596
3639 -596 10 606 -259 -482 479 273 -594 0 602 -252 -486 475 258 -590 -38 582 -249 -498 441 278
3659 278 -595 -46 586 -233 -503 432 304 -576 -59 585 -211 -505 428 305 -555 -64 597 -193 -491 415
3679 415 317 -537 -57 577 -194 -466 401 283 -518 -52 540 -194 -438 388 273 -502 -52 508 -192 -445
3699 -445 363 244 -495 -46 481 -178 -414 339 245 -449 -52 465 -168 -395 320 235 -431 -55 449 -138 -373
3720 -373 305 254 -397 -53 427 -122 -362 274 230 -380 -69 401 -107 -342 246 220 -346 -62 371 -113 -321
$$ packed form
3579b64j19P98k29o95N36M64p51j42Q35k39p29N66M92p71j59Q78k53p67N77N25
3599E53p97j83Q85k13q08N79N47q15k06R23j98q51N60O02q25k43R45j81q76N71
3619c1O35q52k56R68j77q84N67O34q54k44R71k06q59N74O26q62k32R63k05q72
3639e96O06N96q65k23R61k06q67N94O02q54k34R61k17q48N52O20q31k49R39j63
3659B78q73N49O32q19k70R35j28q80N17O44p96k94R33j23q60M91O61p90k98R06
3679D15r8q54M80O34p71k72Q67j18q01M66N92p34k44Q26j15p75M50N60p00k53
3699d45Q08j19p39M49N27o59k36P53r4o94L97N17o33k27P15q5o66L76N04n87k35
3720c73O78n1o51L44M80n49k40O36m4o10L11M70n08k35N88k6n66K84M33m84k08
$$ plain form
3741 -321 216 189 -329 -66 317 -107 -289 216 166 -290 -42 294 -92 -248 201 137 -264 -28 272 -88 -216
3762 -216 180 152 -227 -21 242 -75 -191 158 124 -192 -33 211 -58 -175 136 105 -176 -34 171 -53 -167
3783 -167 92 77 -163 -41 131 -49 -142 73 65 -126 -30 117 -43 -105 75 49 -97 -10 90 -40 -73 64 33
3806 33 -68 8 74 -26 -30 51 24 -36 16 47 -29 -15 34 -2 -27 21 20 -27 -3 7 -26 -11 14 -24 -29 0 -7 -46 -5 16 -38
3837 -38 -5 45 -14 -42 27 27 -47 4 57 -20 -48 54 40 -62 11 84 -19 -55 75 53 -76 1 96 -40 -69 71 53
3864 53 -92 -12 109 -33 -80 68 61 -115 -18 102 -44 -112 74 57 -118 -7 105 -41 -104 87 51 -122 -14
3887 -14 127 -34 -100 101 70 -108 6 137 -40 -95 107 71 -121 5 124 -53 -123 96 60 -127 -15 126
3909 126 -52 -113 92 54 -124 -19 119 -55 -118 80 61 -122 -29 119 -52 -100 80 63 -104 -23 116 -40 -100
$$ packed form
3741c21N37k7n18K63L83m24j82N05n0m56K48L36l86j56M49o4m01K36L00l60j28
3762b16L96k8l79K06K63l17j16L49l4l16J59K44k69j17L11l1k81J42K05k24j14
3783a67K59j5k40J22J72j80r3K15qj91R6J47j60o2J80k6j46Q7J00j30l3J37l1
3806C3j01P6O6j00mQ1k7o0N2L1p6J4M9l6k5M8jm7K4J0l3J5K5l8nK9pl9M1K1n4
3837c8L3N0n9k8O9%p4N1N3p7k8J02j4j02P3P3j03l6J30k2j29P7R5j36k9J40j8
3864E3j45Q0J21j42m7J48pj76R7J20j46o8J86j7j75J11J12j46o3J91l6j73J08
3887a4J41j61o6K01l1j78J14J31j77n5K02l6j92J26J19j77p0K19l6j87J12J41
3909A26j78o1K05l8j78J05J38j74o3J98j9j83R3J48j71m8J80j7j67Q1J39j56o0
$$ plain form
3932 -100 73 71 -92 -4 113 -10 -83 73 61 -75 -18 105 -11 -79 66 68 -63 -27 75 -17 -75 41 47 -58 -34
3957 -34 53 -8 -68 16 46 -60 -33 43 -9 -53 7 40 -17 -28 32 15 -36 5 39 2 -29 17 34 -11 -3 43 27 -17 21 47
3987 47 3 -30 21 38 -36 -10 43 10 -43 9 49 -35 -50 46 23 -67 -11 67 -30 -71 63 39 -105 -18 99 -33 -89 72
4015 72 64 -100 -13 122 -18 -111 94 103 -109 -32 146 -27 -139 99 109 -126 -40 171 -34 -154 103 130 -156 -45
4039 -45 176 -39 -181 100 142 -185 -70 202 -48 -219 118 148 -188 -74 232 -28 -216 130 175 -210 -81
4060 -81 257 -16 -252 139 221 -221 -96 284 4 -265 140 229 -227 -134 294 -5 -301 138 236 -253 -132 317
4082 317 -4 -321 138 259 -278 -155 313 -13 -330 136 264 -280 -145 340 -1 -342 146 274 -279 -140
4102 -140 350 -3 -357 165 284 -272 -156 374 11 -364 175 303 -286 -161 382 1 -388 149 310 -307
$$ packed form
3932a00J73kj63Q8J17j23p3J56j2j36N7J23j16o8J45Kj31L6J02r2n8J16Oj05K4
3957c4Q7o1o0Q4L0j06K7P6n2m4O0L3n7j1O0j7n1M1L4l7l1M6J7m5QM6j6m4L8K6
3987D7m4l3N1J7p4K6N3l3n3N2M0q4j5R6k3r0N6P8r7m1J34k4j44Q7J17j32n6J61
4015G2qj64Q7J35j40r3K05Rk12P7J78j73j12K38J0k35Q6K11k05j20K57K7k86J11
4039d5K21k15j42K81M2l27J15K72k50j71L37L0l36J14L06k60j88L46M5l85J29
4060h1L38k73k36L91Q2m42J25L80k80k69M05Q9m56R3M28k99k96M39R8m89J21M49
4082C17l21l17M59J21n37J23M68l26l17M66J28n44J35M85l41l41M88J28n53J39
4102a40M90l53l54N22J19n56J16N30l63l75N39J28n89J25N43l81l89N37J61o17
$$ plain form
4122 -307 -198 380 15 -400 152 329 -301 -206 378 24 -419 143 337 -316 -218 386 25 -425 143 337 -303
4143 -303 -213 401 40 -419 151 345 -297 -211 414 42 -399 165 350 -289 -195 402 39 -408 147 342 -311
4164 -311 -205 390 24 -408 133 329 -302 -219 380 24 -408 127 328 -288 -222 377 42 -401 135 339 -265
4185 -265 -213 373 67 -401 111 347 -270 -213 368 62 -377 113 351 -246 -205 370 65 -362 112 327 -256
4206 -256 -221 334 54 -359 101 306 -249 -209 317 39 -352 93 276 -246 -196 297 42 -327 102 282 -221
4227 -221 -173 284 56 -308 100 266 -208 -175 277 51 -290 86 258 -190 -173 279 64 -279 63 245 -180
4248 -180 -180 241 57 -265 48 226 -170 -152 217 47 -255 45 201 -160 -153 190 50 -242 43 172 -137 -121
4270 -121 184 37 -200 48 173 -118 -105 180 44 -166 55 161 -102 -96 145 23 -151 36 136 -94 -90 120
$$ packed form
4122c07J09N78l65m15N52J77o30R5N84l54m43N62J94o53R8O04l61m50N68J94o40
4143c03R0O14l61m59N70J94o42Q6O25l72m41N64J85o39R4N97l63m47N55J95o53
4164c11J06N95l66m32N41J96o31Q3N99l56m32N35K01o16O6N99l35m43N36K04o04
4185b65N2N86l06m68N12K36o17N7N81l06m39M90K38n97M1N75l05m27M74K15n83
4206b56L5N55k80m13M60K05n55M0N26k78l91M45J83n22N0M93k55l69M29J80n03
4227b21M8M57k28l64M08J66m74L3M52k26l41L76J72m48J7M52k15l43L42J82m25
4248a80%M21j84l22L13J78l96J8L69j70l02L00J56l61PL43j40k92K85J29l09J6
4270a21L05j47k37K48J25k91J3K85j36k10K21J06k63OK41j22j74J87J00k30MK10
$$ plain form
4292 120 27 -144 12 112 -82 -87 113 18 -118 -1 96 -79 -97 83 25 -116 24 97 -62 -60 83 33 -76 27
4316 27 77 -35 -42 73 24 -57 28 54 -34 -18 58 22 -35 21 42 -22 -22 29 0 -33 12 20 -23 -1 6 -19 -13 1 3 -19 -6 2 -25
4349 -25 -10 1 -14 -7 13 -3 -3 21 -2 -13 6 26 -10 -17 45 7 -22 14 35 -14 -11 39 14 -29 21 41 -23 -29 38 -2 -55 16 30
4382 30 -49 -43 39 7 -64 14 49 -61 -31 58 1 -69 19 48 -52 -35 71 3 -48 30 54 -37 -29 73 6 -67 24 63 -50
4411 -50 -23 65 21 -60 29 72 -37 -37 61 0 -79 9 34 -56 -44 51 -8 -71 5 63 -67 -47 47 -7 -63 -1 46 -43 -42 50
4441 50 9 -63 22 49 -27 -37 45 25 -46 10 54 -21 -25 42 13 -39 10 51 -20 -38 26 14 -36 0 18 -23 -37 19 -1 -30 -15
4472 -15 8 -8 -38 -4 -1 -14 -19 0 0 -19 -5 5 4 -12 13 16 -2 -15 17 26 -22 -3 21 13 -21 23 37 -15 -14 43 6 -55 16 29
4506 29 -34 -37 46 0 -73 8 52 -55 -45 59 -1 -86 4 60 -59 -66 63 24 -93 19 84 -54 -70 90 37 -105 33
$$ packed form
4292A20r3j71J56J00j94nK00r5j36J17R7j75j8J80n8j41J40P3j59KJ43n0j09J03
4316B7N0j12pJ15m9q1Q5K6q8J6P6l6n7N6K1o4%N1k9l3M5Qm3K2Pk5OJ4Kk2J3Qk7
4349b5J5J1j5PK0j6%K4k3j1J9K0l6pO2l8k9L6K1m9LN0k5m3N0K0o4oO7m0n3P1J4
4382C0p9OQ2l2p1P8L5j10L0Q9n7p0Q8K9j00J7J06o8n1P8K4r1QJ02o7p3R1L9j13
4411e0K7Q8m4q1Q9M3j09%R8o1p9Q8K5r0J2R5n9o3P6N8j30K0R4n4n6O2M7q9JR2
4441E0m1p2Q5K7p6j0Q2k0p1N6M4p5mO7k9n2M9M1p1j8O4j2n0L6J8m1j4N6k0k9J5
4472a5K3j6l0L4Lj3nJ9%j9J4J0jj6K5Lj8j3L2Rm8J9K4ql4M4J4n2JN7l7o1P1J3
4506B9o3lQ3m6p3Q1M4j07J0J04o0q5R0N6j19pJ29l9j17J12O5j38j6J60n3j42J38
$$ plain form
4533 33 122 -55 -80 102 50 -110 12 123 -62 -95 127 60 -134 4 146 -67 -116 122 58 -168 -2 146 -83
4556 -83 -138 119 56 -184 -7 156 -87 -144 141 76 -180 0 184 -86 -157 154 94 -194 1 206 -89 -168 172
4579 172 102 -203 2 222 -87 -173 182 111 -227 -10 239 -83 -202 177 119 -254 -25 243 -105 -218 183
4600 183 126 -267 -20 261 -109 -232 188 138 -267 -17 268 -106 -232 213 148 -257 -7 284 -111 -235 212
4621 212 135 -255 -8 285 -108 -231 211 136 -271 -14 298 -109 -250 203 147 -291 -35 292 -112 -280 214
4642 214 159 -304 -51 297 -118 -277 211 153 -308 -49 310 -107 -281 224 173 -297 -33 322 -91 -274 226
4663 226 188 -292 -31 319 -90 -281 217 182 -281 -37 316 -84 -273 206 176 -301 -48 306 -109 -269 193
4684 193 165 -291 -58 294 -104 -275 198 162 -294 -63 300 -96 -266 183 176 -273 -59 303 -64 -263 195
$$ packed form
4533C3Q9j77k5J82n2j60J22J11j85l3K22o7j94J38J42k13m9K38o4k26J66J48k29
4556h3n5K57o3k40J77J63k43n7K85o5k56J80J84k70p1L11o0k88J95K05k95p9L40
4579A72p0l05K05K20l09q6L55p1l38K17K49l22j19L79n8l73K29K68l48j13M01
4600A83n7l93K47K81l70j23M20n0m05K50K85l74j26M45o5m05K50K91l95j24M47
4621B12p7l90K47K93l93j23M42p5m07K57L12m07j41M53n6m38K56L27m04j68M94
4642B14n5m63K53L48m15j59M88n8m61K59L59m17j74N05n1m70K64L55m13j83N00
4663B26l8m80K61L50m09j91M98l5m63K44L53m00j89M79l0m77K53L54m15j60M62
4684A93k8m56K33L52l98j71M73l6m56K31L63l96j70M49pm49K14L62l67j99M58
$$ plain form
4705 195 190 -259 -38 303 -59 -252 192 183 -267 -73 289 -65 -259 176 172 -249 -76 273 -69 -261 151 154 -250
4728 -250 -70 248 -80 -247 156 153 -239 -58 244 -58 -232 149 146 -215 -68 242 -48 -211 156 159 -191 -41
4750 -41 242 -44 -200 143 159 -182 -52 222 -38 -197 134 157 -171 -63 197 -35 -199 102 129 -181 -74
4771 -74 176 -49 -179 93 113 -170 -67 173 -29 -178 95 106 -151 -49 153 -27 -129 92 112 -129 -32 143
4793 143 -11 -117 80 90 -108 -33 130 -17 -113 65 82 -105 -40 105 -14 -110 58 60 -103 -35 82 -30 -99
4816 -99 34 49 -94 -40 80 -4 -75 26 59 -63 -44 77 -5 -77 26 47 -46 -25 58 4 -52 26 41 -42 -15 47 -5
4843 -5 -47 10 32 -30 -17 22 -10 -38 11 17 -29 -22 9 -10 -28 4 -5 -24 -18 -2 -7 -17 -15 2 -3 -8 -5 3 0 1 -2 9 4 6 7 22 3 9 14 17
4883 17 -10 -1 19 -16 -11 11 4 -20 0 16 -13 -18 12 -11 -36 -10 11 -25 -29 13 16 -36 -4 26 -23 -23 27 5 -27 7 38 -22 -27 31
$$ packed form
4705A95nm49K21L41l62j93M44rm50J94L62l54j94M35mm21J73L49l42j92M12Lm04
4728b50J80L18l28j67M03ll92J81L02l02j74L81ll61J47L10k90j63L67Ll50J50
4750d1K83k86j56L43J6l41J30K74k60j59L31K3l28J08K60k32j64L01K7l10J07
4771g4K50k25j30K72K0k83J03K40k02j49K73J1k57J02K02j80j02K21K0k41R7J75
4793A43j54j06J97J0j98P5J63j47r6J78J7j87O5J45j19r6J68Kj63O8J17j12o9
4816i9J33J5j43N4J20q4p1J01L3j22J9J21q2p2J03K1r3K1Q3n4n6P8J5q3K7O2n2
4843em2N7K2o2J3L9l2k8M9Om6PL1j9j8L2rj9OJ6nj0KJ7nnLQlJlJ1nKJJ5j9ONL
4883A7k7RK0l5NK2pk4K0J6k9nL0k3k5K6K1l6mM2Ln2L2L0m9%N0k2l2L4L1o0nN8
$$ plain form
4917 31 18 -35 12 32 5 -13 35 18 -34 9 24 -14 -28 31 16 -40 2 33 -16 -31 25 5 -39 -12 22 -25 -43 22 2 -31
4947 -31 -10 23 -18 -30 16 9 -25 0 25 -6 -14 21 18 -21 2 27 2 5 25 14 -10 17 31 14 -4 19 11 -17 4 10 6 -11 -4 6
4981 6 -2 -2 -7 -24 -14 -13 -18 -9 0 -19 1 4 -13 -8 14 4 -22 12 21 -16 -13 21 4 -16 19 40 -13 4 51 16 -37 13 40 -23 -25 46 20
5018 20 -42 21 37 -36 -39 52 -3 -69 24 37 -61 -55 61 -7 -89 11 59 -55 -51 78 2 -80 42 76 -63 -44 95 17
5046 17 -92 38 96 -50 -46 116 47 -114 39 119 -70 -64 118 16 -121 36 105 -90 -89 117 27 -150 33 113
5070 113 -95 -93 128 16 -161 38 127 -110 -97 131 15 -161 42 138 -115 -99 149 40 -162 66 158 -102
5092 -102 -90 181 46 -168 62 180 -108 -114 175 48 -204 43 186 -127 -123 184 56 -208 44 183 -147 -148
5114 -148 193 47 -230 37 187 -150 -141 205 46 -224 51 204 -137 -154 211 70 -232 52 230 -134 -138 220
$$ packed form
4917C1j3n3M7K0k7j8M8j7n2M3J5l8j4N9j5n6M2L1m9j5N6k0m4K7L4m7j8O5k0l3
4947c1K1L3m1j2M6pl4K5K5l1qL5ll9K3K5k5LK0j1k4K7J4j7j8K3qk8K1Omj7PJ0
4981Fq%nj7J0JnRRj9K0Lj7NK2j0k6L4Rl7LL4j7k0L5K1n3J7M7l5n3N0K7o3kP1k6
5018B0o2O3J6p3lR1n5o6R3J3r8OJ16o8q2J00M8j14MJ29p6q2J22L4j39J9J39p8
5046A7j09J30N8j46MJ62o9j61J53Q0j89OJ82j02j37J57O9j95JK06r0j77J83Q0
5070A13k08KK21j12j77J99Q9k37J3K28j16j76K03R6k53J6K48j09k02K28R2k60
5092a02J2K71j35k14K30J18k88oK89j27k52K47J43l13ML07j28k64K52J39l30j
5114a48L41j46k77K67J50l37RL46j59k70K75J53l41j7L65j41l02K84J78l64mL58
$$ plain form
5136 220 80 -213 52 239 -130 -136 224 66 -236 54 220 -136 -155 217 64 -252 45 219 -157 -176 220
5157 220 57 -265 26 231 -160 -183 215 70 -267 36 236 -153 -183 233 83 -271 31 247 -135 -180 234
5178 234 83 -267 43 252 -134 -177 233 96 -261 27 252 -139 -191 222 80 -251 27 239 -136 -190 209
5199 209 73 -256 6 224 -146 -187 203 76 -262 21 238 -132 -176 206 99 -239 2 252 -120 -180 210
5220 210 109 -240 25 254 -104 -185 218 104 -240 21 231 -113 -185 201 91 -239 -4 225 -110 -194 173
$$ packed form
5136B20j40k93K65J87l69oL60j58l02K90J66l56j9L72j53l16K97J74l76j9L96
5157B20j63l22K91K05l91k3L98j45l37L03K00l89l0M16j50l54L02K16l82m5M14
5178B34j51l50L10K09l86m3M10j37l57K88K25l91n2M13j42l31K78K12l75n4L99
5199B09j36l29K62K18l70m1L90j27l38K83K17l70m4L82j07l38K41K50l72o0L90
5220B10j01l49K65K29l58q1M03j14l44K61K10l44p2L86j10l30K35K29l35q4L67
$$ [...]
8191F0
##END NTUPLES=NMR FID
##END=
