##TITLE=1H_AM_NVEtAc
 CDCl3
 8 sc, 
 16.6.2023
##JCAMPDX= 6.0         $$ Bruker NMR JCAMP-DX V2.0
##DATA TYPE= NMR FID
##DATA CLASS= NTUPLES
##ORIGIN= UXNMR, Bruker Analytische Messtechnik GmbH
##OWNER= root
$$ XWIN-NMR		Version 3.5
$$ Fri Jun 16 15:24:42 2023 Russian Standard Time (UT+4h)  she@DPX200
##.OBSERVE FREQUENCY= 200.13135
##.OBSERVE NUCLEUS= ^1H
##.DELAY= (6, 6)
##.ACQUISITION MODE= SIMULTANEOUS
##.ACQUISITION SCHEME= undefined
##.AVERAGES= 8
##.DIGITISER RES= 18
##SPECTROMETER/DATA SYSTEM= spect
##.PULSE SEQUENCE= zg30
##.SOLVENT NAME= CDCl3
##.SHIFT REFERENCE= (INTERNAL, CDCl3, 0, 15.7039)
##AUDIT TRAIL= $$ (NUMBER, WHEN, WHO, WHERE, WHAT)
$$ ##TITLE= Audit trail, XWIN-NMR		Version 3.5
$$ ##JCAMPDX= 5.01
$$ ##ORIGIN= Bruker BioSpin GmbH
$$ ##OWNER= she
$$ F:/spectra/data/she/nmr/H-F/1/audita.txt
$$ ##AUDIT TRAIL=  $$ (NUMBER, WHEN, WHO, WHERE, WHAT)
(   1,<2023-06-16 15:23:20.60 +0400>,<she>,<DPX200>,
      <created by zg, POWCHK disabled, PULCHK disabled
       configuration hash MD5:
       00 E9 B6 7A A2 85 ED C7 34 08 36 98 17 FE 4E 26
       data hash MD5: 16K
       90 1B AD D4 94 84 F7 04 E7 48 37 EC F7 5A EF 67>)
$$ ##END=
$$ 
$$ hash MD5
$$ E9 1B E7 11 7F E0 55 4E FC A4 8F 7A 84 F9 F5 4A
##$RELAX= 
##$RELAX= 
##$RELAX= 
##$RELAX= 
##$RELAX= 
##$RELAX= 
$$ Bruker specific parameters
$$ --------------------------
##$DU= <F:/spectra>
##$EXPNO= 1
##$NAME= <H-F>
##$PROCNO= 1
##$TYPE= <nmr>
##$USER= <she>
##$AMP= (0..31)
100 100 100 100 100 100 100 100 100 100 100 100 100 100 100 100 100 100 
100 100 100 100 100 100 100 100 100 100 100 100 100 100 
##$AQSEQ= 0
##$AQ_mod= 1
##$AUNM= <au_zg>
##$AUTOPOS= <>
##$BF1= 200.13
##$BF2= 200.13
##$BF3= 200.13
##$BF4= 200.13
##$BF5= 200.13
##$BF6= 200.13
##$BF7= 200.13
##$BF8= 200.13
##$BYTORDA= 1
##$CFDGTYP= 0
##$CFRGTYP= 5
##$CHEMSTR= <none>
##$CNST= (0..31)
1 1 145 1 1 1 1 1 1 1 1 1 1 1 1 1 1 1 1 1 1 1 1 1 1 1 1 1 1 1 1 1 
##$CPDPRG= <>
##$CPDPRG1= <>
##$CPDPRG2= <>
##$CPDPRG3= <>
##$CPDPRG4= <mlev>
##$CPDPRG5= <mlev>
##$CPDPRG6= <mlev>
##$CPDPRG7= <mlev>
##$CPDPRG8= <mlev>
##$CPDPRGB= <>
##$CPDPRGT= <>
##$D= (0..31)
0 1.2 0 0 0 0 0 0 0 0.06 0 0.03 0 0 0 0 0.0002 0 0 0 0 0 0 0 0 0 0 0 0 
0 0 0 
##$DATE= 1686914600
##$DBL= (0..7)
120 120 120 120 120 120 120 120 
##$DBP= (0..7)
150 150 150 150 150 150 150 150 
##$DBP07= 0
##$DBPNAM0= <>
##$DBPNAM1= <>
##$DBPNAM2= <>
##$DBPNAM3= <>
##$DBPNAM4= <>
##$DBPNAM5= <>
##$DBPNAM6= <>
##$DBPNAM7= <>
##$DBPOAL= (0..7)
0.5 0.5 0.5 0.5 0.5 0.5 0.5 0.5 
##$DBPOFFS= (0..7)
0 0 0 0 0 0 0 0 
##$DE= 6
##$DECBNUC= <off>
##$DECIM= 32
##$DECNUC= <off>
##$DECSTAT= 4
##$DIGMOD= 1
##$DIGTYP= 9
##$DL= (0..7)
0 120 120 120 120 120 120 120 
##$DP= (0..7)
150 150 150 150 150 150 150 150 
##$DP07= 0
##$DPNAME0= <>
##$DPNAME1= <>
##$DPNAME2= <>
##$DPNAME3= <>
##$DPNAME4= <>
##$DPNAME5= <>
##$DPNAME6= <>
##$DPNAME7= <>
##$DPOAL= (0..7)
0.5 0.5 0.5 0.5 0.5 0.5 0.5 0.5 
##$DPOFFS= (0..7)
0 0 0 0 0 0 0 0 
##$DQDMODE= 0
##$DR= 18
##$DS= 0
##$DSLIST= <SSSSSSSSSSSSSSS>
$$ [...]
##$SUBNAM2= <"">
##$SUBNAM3= <"">
##$SUBNAM4= <"">
##$SUBNAM5= <"">
##$SUBNAM6= <"">
##$SUBNAM7= <"">
##$SUBNAM8= <"">
##$SUBNAM9= <"">
##$SW= 18.05172834244
##$SWIBOX= (0..15)
0 0 2 0 0 0 0 0 0 0 0 0 0 0 0 0 
##$SW_h= 3612.71676300578
##$TD= 16384
##$TD0= 1
##$TE= 0
##$TE2= 300
##$TE3= 300
##$TEG= 300
##$TL= (0..7)
0 120 120 120 120 120 120 120 
##$TP= (0..7)
150 150 150 150 150 150 150 150 
##$TP07= 0
##$TPNAME0= <>
##$TPNAME1= <>
##$TPNAME2= <>
##$TPNAME3= <>
##$TPNAME4= <>
##$TPNAME5= <>
##$TPNAME6= <>
##$TPNAME7= <>
##$TPOAL= (0..7)
0.5 0.5 0.5 0.5 0.5 0.5 0.5 0.5 
##$TPOFFS= (0..7)
0 0 0 0 0 0 0 0 
##$TUNHIN= 0
##$TUNHOUT= 0
##$TUNXOUT= 0
##$USERA1= <user>
##$USERA2= <user>
##$USERA3= <user>
##$USERA4= <user>
##$USERA5= <user>
##$V9= 5
##$VALIST= <valist>
##$VCLIST= <CCCCCCCCCCCCCCC>
##$VD= 0
##$VDLIST= <DDDDDDDDDDDDDDD>
##$VPLIST= <PPPPPPPPPPPPPPP>
##$VTLIST= <TTTTTTTTTTTTTTT>
##$WBST= 1024
##$WBSW= 4
##$XGAIN= (0..3)
0 0 0 0 
##$XL= 0
##$YL= 0
##$YMAX_a= 253095
##$YMIN_a= -236310
##$ZGOPTNS= <>
##$ZL1= 120
##$ZL2= 120
##$ZL3= 120
##$ZL4= 120
##$ABSF1= 10
##$ABSF2= 0
##$ABSG= 5
##$ABSL= 3
##$ALPHA= 0
##$AQORDER= 0
##$ASSFAC= 0
##$ASSFACI= 0
##$ASSFACX= 0
##$ASSWID= 0
##$AUNMP= <proc_1d>
##$AZFE= 0.1
##$AZFW= 0.1
##$BCFW= 1
##$BC_mod= 2
##$BYTORDP= 1
##$COROFFS= 0
##$CY= 11.3945322036743
##$DATMOD= 1
##$DC= 2
##$DFILT= <>
##$DTYPP= 0
##$F1P= 15.7292609196834
##$F2P= 12.9074282941183
##$FCOR= 0.5
##$FTSIZE= 0
##$FT_mod= 4
##$GAMMA= 1
##$GB= 0.15
##$INTBC= 1
##$INTSCL= 1
##$ISEN= 128
##$LB= 0.24
##$LEV0= 0
##$LPBIN= 0
##$MAXI= 10000
##$MC2= 0
##$MEAN= 0
##$ME_mod= 0
##$MI= 1.114404
##$NCOEF= 0
##$NC_proc= 0
##$NLEV= 6
##$NOISF1= 3.799351
##$NOISF2= 2.8
##$NSP= 1
##$NTH_PI= 0
##$NZP= 0
##$OFFSET= 15.70392
##$PC= 1
##$PHC0= -20784.64
##$PHC1= 11.85272
##$PH_mod= 1
##$PKNL= yes
##$PPARMOD= 0
##$PSCAL= 0
##$PSIGN= 0
##$REVERSE= no
##$SF= 200.130013532006
##$SI= 16384
##$SIGF1= 3
##$SIGF2= 2
##$SINO= 400
##$SIOLD= 16384
##$SREGLST= <1H.CDCl3>
##$SSB= 0
##$STSI= 0
##$STSR= 0
##$SW_p= 3612.71676300578
##$SYMM= 0
##$S_DEV= 0
##$TDeff= 0
##$TDoff= 0
##$TI= <>
##$TILT= no
##$TM1= 0
##$TM2= 0
##$TOPLEV= 0
##$USERP1= <user>
##$USERP2= <user>
##$USERP3= <user>
##$USERP4= <user>
##$USERP5= <user>
##$WDW= 1
##$XDIM= 8192
##$YMAX_p= 0
##$YMIN_p= 0
$$ End of Bruker specific parameters
$$ ---------------------------------
##NTUPLES= NMR FID
##VAR_NAME=  TIME,          FID/REAL,        FID/IMAG
##SYMBOL=    X,             R,               I
##VAR_TYPE=  INDEPENDENT,   DEPENDENT,       DEPENDENT
##VAR_FORM=  AFFN,          ASDF,            ASDF
##VAR_DIM=   8192,          8192,            8192
##UNITS=     SECONDS,       ARBITRARY UNITS, ARBITRARY UNITS
##FACTOR=    0.0002768,     1,               1
##FIRST=     0,             0,               0
##LAST=      2.2672688,     0,               0
##MIN=       0,             -236310,         0
##MAX=       2.2672688,     253095,          0
$$ Real data points
##PAGE= N=1
##DATA TABLE= (X++(R..R)), XYDATA
$$ [...]
2134a820Q38K848k496j367L936K23m288O95L010j658j276K315K64j987k87O26
$$ -1820 -982 1866 -630 -1997 1939 2162 -2126 -1431 1579 -79 -1355 960 1224 -763 -1050 -424
2150d24P23N92j028n63J612q01k347K351K599l101j546L297m07l302K106K818
$$ -424 299 891 -137 -700 912 111 -2236 115 2714 -387 -1933 1364 957 -2345 -239 2579
2166B579k409j739J879J91j189M92Q25Q5n28j463M06K131p86j963K083J159l471
$$ 2579 170 -1569 310 501 -688 -196 629 714 186 -1277 -871 1260 474 -1489 594 1753 -1718
2183a718l63M033o24l167J853J733k652q55K678M21j639k10O15J53l66n75J010
$$ -1718 -2081 1952 1328 -1839 14 1747 -905 -1760 918 1339 -300 -510 105 258 -108 -683 327
2200C27J349j946j618K521R67k950M27L095j771k931K431J897k348o06K071k14
$$ 327 1676 -270 -1888 633 1600 -1350 -923 2172 401 -2530 -99 1798 -550 -1156 915 701
2216G01j709J71J288L85r30q20J103Q02j713n09K773j81k992Q00K667j749j878
$$ 701 -1008 -837 451 836 -94 -914 189 991 -722 -1231 1542 1361 -1631 -831 1836 87 -1791
2233a791K475J115k656n19K197L4j599K68J231j78j435j28J789K06j977N0K199
$$ -1791 684 1799 -857 -1376 821 855 -744 -476 755 577 -858 -986 803 1009 -968 -918 1281
2250A281p86k319J623K162k170j491K370O52k298k3K196l25j855L01J553k95j414
$$ 1281 495 -1824 -201 1961 -209 -1700 670 1322 -976 -999 1197 872 -983 -682 871 576 -838
2267h38K87J600m76j865P58J998j235j797J726J388k212r02K437M01k316R9K031
$$ -838 -551 1049 573 -1292 -534 1464 229 -1568 158 1546 -666 -1568 869 1270 -1046 -947 1084
2284A084m60j788O01J703o49j605P73J622j053j527J370J434j725j210K021P78
$$ 1084 624 -1164 -563 1140 491 -1114 -341 1281 228 -1299 71 1505 -220 -1430 591 1369
2300A369k088m60K195m9k163M36J907o61j795Q81J665j119j459J315J390j560
$$ 1369 -719 -1179 1016 967 -1196 -760 1147 486 -1309 -428 1237 118 -1341 -26 1364 -196
2316a96j152J694R17j845o01K021K72k059J01K035l85j996P12J879r86j724J258
$$ -196 -1348 346 1263 -582 -1183 838 1110 -949 -848 1187 802 -1194 -482 1397 411 -1313 -55
2333e5J438j424j299J544J061j696q39J842N73k016k08K004n5k075M22K034p60
$$ -55 1383 -41 -1340 204 1265 -431 -1270 572 1145 -871 -1079 925 870 -1205 -783 1251 491
2350D91j842J095J665j315j416J454J220j605r80J751P53j840m65J943J50k076
$$ 491 -1351 -256 1409 94 -1322 132 1352 -253 -1233 518 1271 -569 -1034 909 1059 -1017
2366a017J69K002m25k043Q60J780j154j591J368J373j530j100J630Q53j685o90
$$ -1017 -848 1154 729 -1314 -454 1326 172 -1419 -51 1322 -208 -1308 322 1175 -510 -1200
2382a200J843M93j950k40K054m7k147M43K112q00k038J351J649j581j338J664
$$ -1200 643 1136 -814 -1054 1000 953 -1194 -751 1361 561 -1477 -126 1523 -58 -1396 268
2398B68R92j702o17J631L60j614l25J749K95j926j27K070k49k299R68K138j331
$$ 268 1260 -442 -1059 572 932 -682 -1007 742 1037 -889 -1016 1054 805 -1494 -526 1612 281
2415B81j908J700J439k042o88J995M05j980q5J593J37j296k90J561N7j984L7K381
$$ 281 -1627 73 1512 -530 -1218 777 1182 -798 -883 710 847 -449 -739 822 879 -1105 -1068 1313
2433A313l62k545J134K184j907j747K497J060k501l70K091j99j631M58J348j53
$$ 1313 951 -1594 -460 1724 -183 -1930 567 1627 -874 -1244 847 648 -983 -525 823 670
2449F70j357k69J550M38j887L6K469r97k746J783K427k413j406K785K58k886M86
$$ 670 -687 -956 594 1032 -855 -819 1650 653 -2093 -310 2117 -296 -1702 1083 1341 -1545 -1059
2466a059K351o25j511N05Q18l11r11N6J625K12k396m5K818j104k496K447K052
$$ -1059 1292 667 -844 -339 479 168 -743 -687 938 1150 -1246 -1291 1527 423 -2073 374 2426
2483B426l480j118L428M3k732J227J914j725j332J156R30n3q28m66J146J27k241
$$ 2426 -1054 -2172 1256 1299 -1433 -206 1708 -17 -1349 -193 737 684 -144 -610 536 663 -1578
2500a578O84L292j700l152K581J779l499k0M036j160l423J569J805j574l93J510
$$ -1578 -894 2398 698 -2454 127 1906 -1593 -1613 2423 1263 -2160 -591 1214 -360 -753 757
2516G57M4p16j005k16K036N59k517M89K716k590k588M082J896m426L5L517k055
$$ 757 801 85 -920 -1136 900 1459 -1058 -569 2147 -443 -3031 1051 2947 -1479 -1444 2073 18
2533A8k637L006J903k483p91R88j90M5PK1J540n40l235J140L629k312k173L895
$$ 18 -2619 387 2290 -193 -984 4 -186 -141 -134 -113 1427 887 -2348 -1208 2421 109 -2064 1831
2551A831L18n174J151M698k092k464K676L88l002L83J991K31j98j076q34J507
$$ 1831 2149 -3025 -1874 2824 732 -1732 944 1332 -1670 -1287 704 935 737 -339 -1173 334
2567C34K4k157K215K798m158k361M634L51m280K492L664m043k599L637Q24k135
$$ 334 358 -1799 416 3214 -944 -3305 1329 1680 -2600 -108 3556 -487 -3086 551 1375 -760
2583g60R25J087j254p24k82N14K394o03l139J648K152l817n61N614r24n367K260
$$ -760 165 1252 -2 -726 -1008 -494 1900 1297 -1842 -194 1958 -1859 -2420 3194 2270 -3097 -837
2600h37L175l699p99M403l60l407M39J270l74M60k8j58J109j606k468L392K574
$$ -837 2338 -1361 -2160 2243 1883 -1524 -1085 185 -189 271 243 85 1194 -412 -2880 512 3086
2617C086m085p29M421k349m315M299L371m384j164L397j250k507K072J794q97
$$ 3086 -999 -1728 2693 344 -3971 328 3699 -685 -1849 1548 298 -2209 -137 1657 760
2632G60q59r90J92J846r40j395L065N31n076N03N281k071l516M061J436n280k
$$ 760 -99 -1089 -897 949 9 -1386 1679 2210 -2866 -2363 2918 847 -2669 1392 2828 -2452 -2454
2649b454M495p12k445J398N21j399l31L55J270J206k243j914L100M98l786J941
$$ -2454 2041 1329 -1116 282 803 -596 -927 -572 698 1904 -339 -2253 847 1345 -2441 -500
2665e00M309l859l655M491J428m162J009L704k267k759J715J480o41k33k41O12
$$ -500 3809 -50 -3705 786 2214 -1948 -939 2765 498 -2261 -546 934 293 60 -181 431
2681D31K29k098o0L789o27m094J965L086l825j621N061K97m858R25L303k031j644
$$ 431 660 -1438 -1498 2291 1664 -2430 -465 2621 -1204 -2825 2236 2533 -2325 -1400 1903 -128 -1772
2698a772K379R53j647j083L00J492L94j913K19K686j790l262L277K828l959j244
$$ -1772 607 1560 -87 -1170 -870 622 1016 -897 -678 2008 218 -3044 233 3061 -898 -2142
2714b142M165p65l975K007L311k183k192J903Q45j304p00J111J344q91k273J069
$$ -2142 2023 1258 -2717 -710 2601 418 -1774 129 974 -330 -1030 81 1425 534 -1739 -670
2730f70K534j889k181L251J328m261k18M195r06l374J950K393k542j581K317J227
$$ -670 1864 -25 -2206 1045 2373 -1888 -2106 2089 1183 -2191 -241 2152 -390 -1971 346 1573
2746A573j665r98J154J019j280j380J979J670k740j404L281M30l543P52L430j656
$$ 1573 -92 -1090 64 1083 -197 -1577 402 2072 -668 -2072 1209 1639 -1904 -1152 2278 622
2762F22l029K246K116k236j348K218Q01k054p52J854J007j867r90K170P47k683
$$ 622 -2407 -161 1955 -281 -1629 589 1390 -664 -1416 438 1445 -422 -1412 758 1505 -1178
2778a178l40L159l08l133J032K776j759k309K301J744k480j273K379P78k146n04
$$ -1178 -1518 1641 1333 -1800 -768 2008 249 -2060 241 1985 -495 -1768 611 1389 -757 -1261
2794a261K173L51k291k86K485N7k676M78K630j051k469J511K319k069j694K196
$$ -1261 912 1263 -1028 -1314 1171 1228 -1448 -970 1660 609 -1860 -349 1970 -99 -1793 403
2810D03J315k407q41K464M99k385k31K325l7k366L09K321o39k312J021K231j434
$$ 403 1718 -689 -1530 934 1433 -952 -1183 1142 1105 -1261 -952 1369 730 -1582 -561 1670 236
2827B36j987J773J683k065j395K365R34k432m40K382J20k311J24K330n04k183
$$ 236 -1751 22 1705 -360 -1755 610 1544 -888 -1328 1054 1174 -1137 -1013 1317 813 -1370
2843a370Q25K109j148j931J389J800j733j568J953J182k124q16K283L68k300J0
$$ -1370 -545 1564 416 -1515 -126 1674 -59 -1627 326 1508 -616 -1432 851 1219 -1081 -1071
2859a071K255l54k161N85K101r33j875J143J780j381j622J625J447j922j078K101
$$ -1071 1184 830 -1331 -746 1355 422 -1453 -310 1470 89 -1533 92 1539 -383 -1461 640
2875F40P39k273k23K177j15k142M89J994p35j798R29J583r86j566J144J488j346
$$ 640 1379 -894 -1117 1060 945 -1197 -708 1286 551 -1247 -318 1265 279 -1287 -143 1345 -1
2892aj437J703J168k082q30K357L20k321J75K185p04j872J045J497r82j295Q94
$$ -1 -1438 265 1433 -649 -1479 878 1198 -1123 -948 1237 533 -1339 -294 1203 221 -1074 -180
2909a80J226r15j249J134J315j458j309J807J071k268l71K452l39k409Q58K023
$$ -180 1046 131 -1118 16 1331 -127 -1436 371 1442 -826 -1197 1255 916 -1493 -635 1388
2925A388j198j360J349Q12j198p11R22Q74o83j074P29J337j356j260K111Q99k597
$$ 1388 190 -1170 179 991 -207 -918 4 878 195 -879 -150 1187 -169 -1429 682 1581 -1016
2942a016k56K663p24k239J582J592j922r07J552K89q83m0M22L81n11j054Q76J645
$$ -1016 -1272 1391 667 -1572 10 1602 -320 -1227 325 614 -269 -309 113 494 -17 -1071 -195 1450
2960A450j529j419K199N98k818M37K944j340k217J929R68k059P4J764l64r89J1
$$ 1450 -79 -1498 701 1299 -1519 -1082 1862 522 -1695 234 1202 -857 -783 981 617 -372 -361
2977c61J60M83J49j082N99J425j823j428K769O16k857P22K504k199j771K722P80
$$ -361 -201 282 431 -651 -52 1373 -450 -1878 891 1507 -1350 -628 1876 -323 -2094 628 1408
2994A408k152K90J208j047l21O59K2N61q1j634M71J888j537j045K860j98l444
$$ 1408 -744 -454 754 -293 -614 45 67 628 547 -1087 -616 1272 -265 -1310 1550 1352 -2092
3011b092J256K740k149j149K728l58k552J040J243p85K22K14p89M09K32j345J220
$$ -2092 -836 1904 -245 -1394 1334 976 -1576 -536 707 -78 144 358 -431 -22 210 -1135 85
3028H5J869k361j361K829l15k783K206K242l015j189K755m81j746J716O87j490
$$ 85 1954 -407 -1768 1061 746 -2037 169 2411 -604 -1793 962 481 -1265 451 1138 -352
3044c52N5J23n19J326L24j795P63J301k506m24L579o14l175J976J609l080ML257
$$ -352 -297 -174 -693 633 957 -838 -75 1226 -1280 -1704 1875 1261 -1914 62 1671 -1409 -1405 1852
3062A852r29k046J217J32j062Q81M90o48Q23m41j998J663J788k413j68K824j736
$$ 1852 923 -1123 94 226 -836 45 535 -113 710 269 -1729 -66 1722 -691 -859 1965 229
3079B29k836K854J795k851L9K290j704j472J873N56q04M72m99p98J136j38j149
$$ 229 -2607 247 2042 -809 -770 1520 -184 -1656 217 773 -31 441 -58 -856 280 142 -1007
3096a007J848Q14l026p9K971j251k016K802Q46l452K83K542j087j041J612k06
$$ -1007 841 1655 -1371 -1450 1521 270 -1746 1056 1902 -1550 -1267 1275 188 -853 759 553
3112E53j255L97O1J7J252o81j506J488M91k432R94K924k141k176K628N14k666
$$ 553 -702 -305 -244 -227 1025 344 -1162 326 817 -1615 -621 2303 162 -2014 614 1128 -1538
3129a538J069K384j734j321J312l4n49P34n9k32M71r75p50K059L48k346Q15J913
$$ -1538 -469 1915 181 -1140 172 138 -411 323 264 32 503 -472 -1222 837 1185 -1161 -346 1567
3147A567k263j187L070L22k748Q14J647j713p24J800K40r79M4k30M8P06o16k29
$$ 1567 -696 -1883 1187 1509 -1239 -425 1222 -491 -1215 585 825 -154 -110 -340 -292 414 -202 -431
3165d31J564n83k175J182K038j947q53K546m91k566J211J826j357o70J225j86
$$ -431 1133 550 -1625 -443 1595 -352 -1205 1341 850 -1716 -505 1321 -36 -706 519 333
3181C33r46K24M42L59J56j121j16J413o13j326J608J167k366n74K412m35j981
$$ 333 -613 -389 53 412 568 -553 -669 744 131 -1195 413 1580 -786 -1360 1052 617 -1364
3198a364J473J307j762p82J420K71p45N7L49N0l09p01N33J277r54j279J524O39
$$ -1364 109 1416 -346 -1128 292 563 -182 -125 224 274 -35 -736 -203 1074 120 -1159 365 1004
3216A004k006R4K255p23j895J182J079j402m00J409Q5j014k21O20M17m58m94O40
$$ 1004 -1002 -908 1347 624 -1271 -89 990 -412 -812 597 682 -332 -553 67 484 26 -468 172
3234A72O33j188o59J681K66j700K15J718j071j404J460J086j554m93J290L3j035
$$ 172 805 -383 -1042 639 905 -795 -580 1138 67 -1337 123 1209 -345 -838 452 485 -550
3251e50J10Q20J63q24l60Q88L69j103j26J451l11j562O82J512j124j045J344N83
$$ -550 -440 380 543 -281 -641 247 616 -487 -613 838 527 -1035 -353 1159 35 -1010 334 917
3269I17j436k63J340M2j110Q4Q76p9r12J00J017j17j197K79J249n74j158R28R75
$$ 917 -519 -782 558 600 -510 -426 450 371 -541 -441 576 459 -738 -459 790 216 -942 -14 961
3288I61j184p81J386M46j344o6J207j52j121K57R82l10r42L94R47m62r35N72J010
$$ 961 -223 -1004 382 828 -516 -582 625 473 -648 -391 591 281 -661 -267 680 218 -717 -145 865
3307H65q75r16J066O70j152m72J298J03j202P9J175k20j165N11R68n89q46N94
$$ 865 -10 -926 140 810 -342 -814 484 587 -615 -536 639 419 -746 -235 733 144 -702 -108
3325a08P78p00o70Q01N73q98n17J124L55j232j42J233q5j201L34J070n09j006
$$ -108 670 -30 -700 101 674 -224 -741 383 738 -494 -636 597 512 -689 -355 715 206 -800
3343h00O67Q09o26p88Q07O27r13n14J013L11r98k18J145nj116J75J097l59r99
$$ -800 -133 676 50 -738 69 696 -217 -731 282 593 -405 -623 522 517 -599 -424 673 314 -685
3362f85M62R57o48p18O44O50q29m95Q30M92r44k81R28J29r90L4R87j85r69L27
$$ -685 -223 734 86 -632 12 662 -167 -662 168 660 -284 -565 363 492 -498 -464 523 338 -631 -304
3382c04R18m83q47P09P38q74m78Q20L75q54k72Q86J24p95j67R55K9r97J41R97
$$ -304 614 131 -716 -7 731 -143 -621 199 574 -280 -552 334 458 -337 -504 451 480 -517 -376 621
3402F21l75r66O11Q30p48o63Q92L71q91j33P84O7p50p7P56Lp09OP99j11q97L16
$$ 621 246 -720 -109 721 -27 -690 202 573 -318 -451 333 400 -350 -427 329 332 -377 -371 428 317 -580 -264
3424b64R54n87p99P97N94j041k45J044j6q40J63O23k14m63N2M90M2o05n5P70p5
$$ -264 690 103 -696 101 695 -346 -591 453 437 -403 -240 383 169 -294 -242 248 290 -315 -370 400 325
3445C25q77L82R52q59q07J172M30j217J69R73m41p85N00N11l57k34J11K15l8l89
$$ 325 -552 -170 782 -77 -884 288 718 -499 -330 643 202 -583 -83 428 71 -163 -52 163 125 -264
3465b64p5Q79j91j031N08R20j049m41J353l1j278L29R93o78m25P04J15n51L1Q2
$$ -264 -339 540 349 -682 -174 746 -303 -744 609 578 -700 -371 622 -56 -481 223 338 -213 -182 -100
3485a00J70K79m01k29P12k69r69R15Q39j265l32J345l91j282J042Q11j068k53
$$ -100 70 349 -52 -281 431 162 -807 108 947 -318 -650 695 304 -978 64 875 -193 -446
3503d46P13k62k93L29L8j0J47n89j05J016k98r38R79N15j532J9J570n11j055J002
$$ -446 267 5 -288 41 79 69 216 -373 -478 538 240 -698 281 796 -736 -717 853 342 -713 289
3523B89L00j193K09R37l93k57L09m07K7L83l98K4Q74o70r84J200M80j434M59J264
$$ 289 589 -604 -395 542 149 -108 201 -206 -179 204 -194 -170 704 34 -950 250 730 -704 -245 1019
3543A019j094r26J267K31r67M98N37q02j79N50l30L74L20q72K4Q11o24n78J413
$$ 1019 -75 -1001 266 497 -470 28 565 -237 -416 134 -196 178 498 -374 -350 461 -163 -741 672
3562F72J58j630M11J178j115l45J412k12j209N03M71n21K10M51o24J65J74o97
$$ 672 830 -800 -389 789 -326 -671 741 529 -680 -177 294 -227 -17 434 -190 -25 149 -548
3580e48L69J027q71o54J219k75j244J012J012j346l37J183m90q07R51L68p17J42
$$ -548 -179 848 -23 -677 542 267 -977 35 1047 -299 -636 547 57 -750 201 569 -148 -6
3598fnm38N52K98p35L24O19j178k00J506l20j128Q99N08j397J11J269m33o36N85
$$ -6 -11 -449 103 401 -334 -10 609 -569 -769 737 417 -711 188 696 -701 -590 679 246 -390 195
3618A95j6o37M53J98k68M53j95q05N72O43r87N5J222q09j103J182M76j122L18
$$ 195 179 -458 -5 193 -75 378 183 -622 -50 593 -394 -339 883 74 -1029 153 629 -493 -175
3637a75R31q90n69Q08Q3k97K81p9l51L60j54m19Q26K22j084J69R54p36n94J263
$$ -175 756 -134 -703 105 188 -109 172 93 -258 102 -52 -471 355 577 -507 -338 616 -120 -714 549
3657E49J27j306L47P82o21k50P11j06m15J75j39O1M23k59m27O78p4r33N77R36
$$ 549 676 -630 -283 499 -122 -372 339 233 -182 -7 -146 -85 338 79 -348 330 256 -677 -100 836
3677H36r19n98J091r5r65N18P37o60l05N07j34j99K21k1J10J30n01j02P28j34
$$ 836 -83 -681 410 315 -650 -132 605 -55 -360 147 13 -186 35 14 124 254 -247 -349 379 245
3697B45p40N72M90r07k16J000p5p96L92M88o38j92N40M4j83n7p8J46J59l58J07
$$ 245 -495 77 567 -340 -556 444 369 -427 -35 453 -185 -377 163 207 24 -33 -111 35 194 -164 -57
3718e7N18l84o59P01M15q57q2R33l63o99M12N36m96j85L53Q1k55n7R5K83o0m80
$$ -57 461 77 -582 119 534 -323 -405 528 165 -534 -122 414 -82 -267 86 167 -88 -145 -50 233 173 -307
3740c07J71N43m67l93P44J89p84l9P36k43o83N69M02n35k02L40J99k72j13J25
$$ -307 -136 407 -60 -453 291 480 -304 -343 393 150 -533 36 438 -97 -299 41 240 -32 -145 -20
3760b0K38k60k91L52L58m99k77N92J09o81R1P58l78m09L17L35m77j49M04J86m40
$$ -20 218 -42 -333 19 377 -122 -399 193 302 -379 -288 470 92 -317 0 335 -142 -291 113 299 -141
3781a41n7K40J84l25j73M63R5n37q2O31l7o24K80M50l02m33M38K90m81j35M24
$$ -141 -198 42 226 -99 -272 191 286 -251 -333 298 261 -363 -83 367 65 -368 70 360 -121 -256 168
3802A68O1m08n5M04O3m14q1M64J7n12Q8N38j63n52L12M88l78l99M08L09m83j36
$$ 168 229 -179 -234 170 233 -181 -262 202 219 -293 -205 333 170 -382 -70 418 40 -359 49 358 -125 -261
3824b61M02R2l93p2M59l5l60k5M74j01m37J24M86k28m32K72M13m37l11M54K54
$$ -261 141 233 -160 -232 227 192 -168 -193 281 180 -257 -133 353 125 -307 -35 378 -59 -370 84 338
3845C38m09j91M34Q8m71J7M23n4m77J87L72j26m57K33L81k54l45L48K63l93k46
$$ 338 -71 -262 172 260 -211 -194 229 175 -302 -115 257 131 -326 -93 288 34 -311 37 300 -93 -339
3866c39M57K16n10n8M55o0m14Q3M26j04m11R9M08j00m11K68L09k81l25L38K50
$$ -339 118 334 -176 -234 221 161 -253 -170 256 152 -259 -160 248 148 -263 5 314 33 -292 46 296
3887B96l53j93M01R3m19oL79q4l51Q2L38n6l77J23L68j84k94K18L54l16l20M16
$$ 296 -57 -250 151 244 -175 -181 198 114 -237 -155 183 127 -250 -127 241 57 -237 -19 335 19 -301 115
3909A15J88m23r1M27n9l87J22K56m9k39L9K71p8k65O0L05j15l30J65M30m57j83
$$ 115 303 -120 -211 216 157 -230 -108 148 99 -140 -101 170 92 -173 -113 192 77 -253 -88 342 -115 -298
3931b98M23Q5m12L5M07j67k46J04K11n4k46M7K30Rk24k8L67j77m06K94L55l26
$$ -298 125 210 -202 -167 240 73 -173 -69 142 88 -158 -111 119 128 -96 -124 243 66 -340 -46 309 -17
3953a7l01N48l9m12R7L76j90j93J81L5q4m2mQ6J60l29r6M27j02l90K78M27n34
$$ -17 -318 230 191 -221 -124 252 62 -131 50 85 1 -41 -45 41 201 -128 -224 203 101 -289 -11 416 -118
3976a18k44N52N9m89J98K44k21j67J79M7J8M8l05J79K10l65o7N56j35n71L60M18
$$ -118 -362 190 249 -240 -42 202 -19 -186 -7 40 58 106 -199 -20 190 -175 -242 314 179 -392 -32 386
3998C86o01j22P29j20o10K99K58k68l1K76k03O7j5k81K88K82m87j86O70k09o15
$$ 386 -215 -337 392 272 -338 -39 219 -49 -80 196 -7 60 45 -236 52 334 -153 -339 331 122 -493
4019d93N19N10p49j30O68k27m97M47K45l68j4J08j58J96Pk35K06K52n68r7P92
$$ -493 26 536 -213 -343 325 98 -399 48 293 -75 -89 19 -139 57 64 -171 35 287 -281 -378 414
4040D14k14o92O73K98q49n7Q99k95n03M01J06l38K6K75j43J93j25m29M14L09o60
$$ 414 200 -492 181 479 -370 -427 472 177 -326 75 181 -157 -131 144 1 194 69 -360 54 363 -297
4061b97O8P89m43p59O90M65q45M9P41l53n78M51K68l91J38L0r7J35j12k42M72
$$ -297 -229 560 117 -642 48 513 -332 -283 458 105 -473 -22 246 -145 -7 23 -74 61 -51 -293 179
4082A79K19p07N7P60n36n65Q82K99r75M2Q01m25m59N81J62m49%O8O8J56j60k48
$$ 179 398 -309 -252 508 -28 -593 289 588 -387 -345 456 31 -428 153 315 -134 -134 -66 2 158 -2 -250
4104b50M55Mo90L67P05n84n76Q55J60j010K56R10m25o21N62P9m22J57J87mnk88
$$ -250 205 209 -481 -114 591 7 -569 286 446 -564 -308 602 177 -444 118 197 -225 -68 119 115 110 -178
4126a78j29N00M8o12L31O15p61m65R60J61r34K94P54o21n59P35K32m68m3K68p1
$$ -178 -307 193 241 -371 -40 575 -186 -651 309 470 -464 -170 584 -37 -596 139 371 -97 -140 128 57
4147E7n5k30J41M63k81n45M08N20p31k36J026o5j106K97Q31n32m26P08J60o06
$$ 57 2 -228 -87 376 95 -450 -42 478 -253 -489 537 472 -634 -337 494 -38 -464 244 404 -202
4167b02j63M34J15j47j76J86K66l67l96O09M38q14k91R33j31r58N76P83p01m97
$$ -202 -365 69 184 37 -139 47 313 -54 -450 159 597 -217 -508 425 294 -664 -88 695 -6 -503
4187e03O57J49n95Q7M80o5l34r1J95L32l97k71N91J84q01p0R79k56q52N46O36
$$ -503 154 303 -292 -205 275 210 -124 -215 -20 312 -85 -356 235 419 -382 -452 527 271 -581 -35 601
4208F01q52l79R02J47o79j4N44j35l86Q6L89J08n05j65N61M8p07K51Q07n22p97
$$ 601 -251 -630 272 419 -260 -274 270 135 -251 -165 224 332 -173 -338 223 271 -436 -185 622 100 -697
4229f97P17O06q01l05Q76j6q25K04N47o6m89N1L87o4l72oO39j23p15K66P09n39
$$ -697 20 626 -175 -480 396 380 -445 -241 306 240 -249 -198 189 125 -247 -253 386 263 -452 -186 523 -16
4251a6n86Q04M03r57j38R03j08p14K54N87l06n37L13M11k13l72J12N65l33n51
$$ -16 -602 202 605 -352 -490 413 305 -409 -155 432 126 -411 -98 313 100 -272 -160 405 72 -479
4271d79M30N97o62m83Q57K07q70K2Q66k45p79L65O00l67m23L49L97l63m80M20
$$ -479 -49 548 -114 -597 260 467 -403 -381 485 240 -539 -174 426 59 -364 -15 382 19 -461 -41
4291d1M22l63m38N21L46p00k25Q20O7q17J21P78l50o15M49M91m19m93M62L90m82
$$ -41 381 18 -420 101 447 -253 -478 342 409 -408 -287 491 141 -474 -25 466 47 -446 16 406 -76
4312g6l43N10K70m50l28O59J56p32mP26j29p26K41P00m16n70M80N16n43l91N82
$$ -76 -419 91 361 -89 -417 242 398 -334 -338 388 259 -467 -226 474 58 -512 -32 484 -59 -450 132
4333A32K76n87j92N88J64n77j36O58l0o20R1O72k66o33L49N98m48n54N78L64n90
$$ 132 408 -179 -371 217 381 -196 -332 326 296 -324 -233 439 173 -460 -111 487 39 -515 63 427 -163
4354a63k60N38K63o50p2O43l7n36JO26j71n92K94N26l28n78M46N06n08l97O33
$$ -163 -423 115 378 -272 -344 299 262 -274 -273 353 182 -410 -116 410 82 -496 -50 456 -52 -449 184
4375A84J99o71l8N70K1n79N5N63p1n76J45N85k41o03L72N61m61m82N99K77n77
$$ 184 383 -288 -326 244 265 -314 -259 304 233 -343 -198 387 146 -457 -85 476 15 -467 132 409 -168
4396a68k28N84J60o47K5N15J9n40J18M50j25n20J79N91k84n70L98N71o10l70O27
$$ -168 -396 188 348 -299 -274 241 260 -280 -162 288 163 -357 -178 413 129 -441 -43 528 -82 -452 175
4417A75K00o84J6O01o3n92J53M57j20m16J51M00j30m91K06N62l28o03N17M73o49
$$ 175 375 -309 -293 308 245 -347 -194 263 143 -273 -122 278 148 -343 -137 425 97 -506 11 484 -165
4438a65l04Q13J3p03J56N64k68l97L00K66k23k84J49L49j24m55J82N60l65o23
$$ -165 -469 344 357 -346 -190 374 106 -291 9 275 52 -232 -83 266 142 -313 -131 429 64 -559
4458e59P37L67q74n2Q17j70p34M18M48l99l06L92ko2j04J9K92o4n15J65O49m22
$$ -559 178 545 -329 -381 436 266 -468 -50 398 -1 -307 85 83 21 -83 -64 228 164 -351 -186 463 41
4480D1n46P58K41r78O1R45l80o47N91K60n24j13M45r9l8n3j36L01K9m84J96O97
$$ 41 -505 253 494 -484 -423 522 142 -505 86 346 -178 -291 154 55 17 -36 -172 129 158 -326 -130 567
4502E67o03o21R14K45j017K45R77p88n63Q43J96o17K10K39l39O2O4j72L89J43
$$ 567 -36 -657 257 502 -515 -270 707 -81 -644 199 395 -222 -12 227 -112 -50 14 -158 231 374
4522C74q39L31P29p66m86J153K5j189M22Q92q43l15R29r3p21L86J07l16L30K0
$$ 374 -465 -134 595 -171 -657 496 521 -668 -246 646 -197 -512 417 324 -397 -11 96 -220 110 130
4542A30l69L75P8p36L87P70p34n24J148k01j175Q31Q19r66k27Q01l52n17O22P3
$$ 130 -239 136 214 -522 -135 635 -99 -623 525 324 -851 -20 799 -167 -394 407 55 -462 160 233
4562B33k78K05j61m08O00R6p60N47O10j056l11J305k71j082R49M90j243P0J001
$$ 233 -45 160 -1 -409 191 287 -473 74 684 -372 -683 622 351 -731 218 708 -535 -465 536
4581E36m15m35N77k20l67L95o3k42O52j82r16N81P60j099J8J247o50j059J060
$$ 536 121 -314 263 43 -324 71 8 -234 418 236 -680 -99 661 -438 -420 827 177 -882 178
4600A78M12j051L34P96p33l48N68j69q9M28l74l01N97j81p16R44M88j260L4J152
$$ 178 590 -461 -127 669 -64 -412 156 -13 -102 326 -48 -349 248 67 -649 295 783 -477 -443 709
4620G09p23p58J190K41j165K75O89o83n8O56l15j72K80l51j31P37k99o61Q28J76
$$ 709 -14 -772 418 659 -506 -231 458 -225 -283 373 58 -114 166 -185 -316 421 122 -539 289 465
4640D65j183L89J164q18n96J002l6j069N71O80o55j36M30l34o6M13k70l8N83o07
$$ 465 -718 -329 835 17 -579 423 387 -682 -111 569 -86 -222 208 -126 -192 221 -49 -87 496 -111
4660a11m99R36R2r89N41P90j018m57J133r1q50N80L90o60q0M85k23R4J72m33O7
$$ -111 -610 326 418 -571 -30 760 -258 -715 418 327 -523 57 447 -213 -293 192 -31 63 235 -198 -131
4681a31M44m14k58Q66j77r94O27O54q99j67J064l63p97N32M03n94Q4L56k22n6
$$ -131 313 -101 -359 507 330 -664 -37 617 -282 -449 615 252 -545 -13 390 -204 -120 236 14 -42
4701d2Q6k94K82L12n54j04P07l04o99P45M32q95q9Q79m26n65O16L36n53j71M08
$$ -42 44 -250 32 344 -210 -314 393 89 -610 135 567 -328 -417 462 36 -529 87 423 -130 -301 107
4722A07j30m1Q6q4J15J27n00J68O22l64n73O81K28q58J02P95l58m96N43J57m86
$$ 107 -23 -64 22 -62 53 180 -320 -152 470 106 -467 214 442 -416 -314 481 123 -373 170 327 -159
4743a59o3L77pj19r5k4K36o8l56K84L49m83l41P37Q7o97J86N96m07m52N08J55
$$ -159 -222 155 148 29 -66 -90 146 78 -278 6 355 -128 -469 268 355 -342 -156 440 33 -419 89 244
4765B44m10k0L71j17j51q2J93K05k52k25L03K12m24j38O04o4o44L03M92m13l69
$$ 244 -166 -186 185 68 -83 -165 28 233 -19 -244 59 271 -153 -291 313 249 -395 -92 400 -13 -382
4786c82N34J94n09k6L06K6k69kK52Mk10j85M52N7m44m2M58j02m14K18M29m57k10
$$ -382 152 346 -163 -189 117 143 -126 -128 124 128 -82 -267 185 242 -202 -244 214 112 -302 -84 345 -112 -322
4809c22M80J01m22j8L97l7k93n7L45m9l03L1L22k1m27K10L38k41l48L38L43m54
$$ -322 158 259 -163 -181 216 179 -114 -171 174 125 -178 -147 175 154 -273 -63 275 34 -314 24 367 -87
4831h7k10N14J9m66K5L68l5l09Q9K89p8k75QL62j84l15K34L79l57k41K84K63m23
$$ -87 -297 217 236 -230 -205 163 128 -181 -92 197 119 -156 -148 214 30 -285 -51 328 -29 -270 14 277 -146
4854a46j36N01k2l84k4M62j27l16J38L12k41k46K06K37j62k73K46K05l08j86M16
$$ -146 -282 219 197 -187 -211 251 124 -192 -54 258 17 -229 -23 214 52 -221 25 230 -78 -264 152
4875A52P8m21k3M35q2l82J21L69k18k52J61L15k08l05K87K17l15k15M14J19m07
$$ 152 230 -191 -214 221 139 -243 -122 247 29 -223 -62 253 45 -260 27 244 -71 -286 128 247 -160
4896a60r7N09p3l84J04L68j34l91K29K81k26k38K77J49k35j92K75J55l34j50L83
$$ -160 -257 252 179 -205 -101 267 133 -258 -29 252 26 -212 65 214 -21 -213 62 217 -117 -267 116
4917A16J03m00N8M18j48m66K34M14l03k39K34K00l35q2L09M2k11j48K40J80l55
$$ 116 219 -181 -123 295 147 -319 -85 329 26 -213 21 221 -114 -196 113 155 -56 -204 36 216 -139
4938a39j15M51P3n57J07N06k38m66L81L02l93j88M76j1l39N1K15Jk14oJ60J73
$$ -139 -254 197 270 -287 -180 326 88 -378 3 305 -88 -276 200 189 -150 -99 116 117 -97 -103 57 230
4960B30l40j19L88J5m85J53N29l55m07N09J62n05M8L85j25k32Q6J63o5n5q7J53
$$ 230 -110 -229 159 174 -311 -158 371 16 -391 118 280 -225 -177 208 83 -149 -63 100 35 -20 -107 46
4982D6J37l67q4N58q7n78L04M92n74k20O92J9o22K15K53k33j00K23K3m5m3j67
$$ 46 183 -184 -268 290 203 -375 -71 421 -153 -373 319 338 -284 -69 184 -49 -149 74 97 52 9 -158
5004a58J27K73l91l9N65k53n81M24M78o20j92O92j59o32M04L51l66n1K05j77N8
$$ -158 -31 242 -149 -188 377 124 -457 -33 445 -175 -367 325 166 -466 -62 289 -77 -128 77 -100 -42
5025d2L2r0J91J81m61n6N65k49n46O69K74p80k9P57l13m50N13J26n07J03K08k01
$$ -42 -10 -100 91 272 -189 -245 320 71 -475 194 468 -312 -341 416 103 -347 166 292 -215 -112 96 -105
5047a05J87N0l18J49K39n33J83O21m18o39Q12J58q78L00P66n78l91N72n4l69L17
$$ -105 82 132 -186 -37 202 -331 -148 473 55 -584 228 386 -492 -192 574 -4 -395 177 123 -246 71
5068G1J14k54Q9qk50L77K13o72J27O32n40m46Q92J28r65M09N81p03k11P45j13
$$ 71 185 -69 20 12 -238 139 352 -320 -193 439 -101 -547 345 473 -492 -83 498 -205 -416 329 216
5089B16m48L09K1l16K53Q5k59L45J5p02L31P55p32l57J017k81r35O61N59q23p
$$ 216 -232 77 98 -218 35 120 -139 206 221 -481 -150 605 -127 -484 533 252 -683 -22 537 -286 -293
5110b93P02m22l46N52o7k21K53j07l00M51l9n96N43L94p78j85R48k96p57Q12K88
$$ -293 409 -13 -359 193 126 -95 158 51 -249 202 163 -433 110 504 -274 -459 489 193 -564 248 536
5131E36r20L7P36m22j80M04j26l03L31j69j79O00j61o43N78K82q41J92Q68n43
$$ 536 -384 -347 389 -33 -213 191 65 -238 93 -76 -255 345 184 -459 119 401 -440 -248 620 77
5151G7o53P91J26p43K09O84n17k26L76j51n4K73k46p5M25l37m17P29J56q66L26
$$ 77 -576 215 341 -402 -193 491 -26 -252 124 -27 -81 192 -54 -129 296 -41 -458 271 427 -439 -113
5172a13O27o42m46Q94M8p90L42M17n20k4L62j00q8J22j88m1M49l40l04O18q0p44
$$ -113 514 -128 -574 320 368 -422 -80 337 -183 -207 155 55 -33 89 -99 -140 309 -31 -335 283 203 -541
5194e41M15O47o26k77P40j58o36L59L79l75n4L28k36l3J39k26J86K51m07j69O16
$$ -541 -126 521 -105 -382 358 200 -436 -77 302 -73 -127 201 -35 -68 71 -155 31 282 -125 -294 322
5215C22j76n50N16L21p12r4P32k25n23M76J92m39j7K81q2k7M3j73J49J27l36P5
$$ 322 146 -404 112 433 -279 -373 359 134 -389 87 279 -160 -177 104 22 -5 38 -135 14 141 -195 -120
5237a20N13l56m65M78L02o48N3O20k86m53L91K07l60J2K01o0m4k2m5J88K9l63
$$ -120 393 37 -428 50 352 -296 -243 377 91 -362 29 236 -124 -112 89 29 -15 -37 -82 106 135 -228
5259b28K08L32l31l46N43J30n64N9N19l06l11L81J69l07r6K26K4j31l4N4J11q0
$$ -228 -20 312 -19 -365 178 308 -256 -197 322 16 -295 86 255 -52 -148 78 102 -29 -63 -9 102 22
5281B2l04K56K89l89j60N42j1m93R1M72k86k83L41J45l48o0K10Q6j70q2K30Q9
$$ 22 -282 -26 263 -126 -286 256 245 -248 -157 315 29 -254 87 232 -116 -176 34 120 -50 -132 98 187
5303A87k30j28K48N4l00mM26j23m06K07L13k53k28K92J67l21j7K13L5k56L8K19
$$ 187 -43 -171 77 131 -169 -173 253 130 -276 -69 244 -9 -237 55 222 -99 -116 97 132 -124 -86 133
5325A33k0k07m3K56j3l14O0L20j55k59K52K54l00j78L18R5l30l8L08j9k28l2K58
$$ 133 113 -94 -137 119 106 -208 -148 172 17 -242 10 264 -36 -214 104 199 -131 -169 139 120 -108 -140 118
5348A18nk42M4K69j27l05J80K09j58k30K79K10l50q4K78R5l27k9L22p0k41M6K58
$$ 118 113 -129 -85 184 57 -248 -68 141 -17 -247 32 242 -108 -192 86 181 -146 -175 147 77 -164 -118 140
5371A40q0k59J33K60j41k95K12K47k26k21L26J27l07n0K67l6l39J72K73j25k21
$$ 140 60 -199 -66 194 53 -242 -30 217 -9 -230 96 223 -84 -134 133 97 -242 -70 203 78 -143
5392a43J27K17j81j83Q9K16j16j89J61J93k80j15L26Q7m08L1L41o6k70J04J92
$$ -143 -16 201 20 -163 -74 142 26 -163 -2 191 -89 -204 122 209 -199 -168 173 107 -163 -59 133
5413A33q0j71J39J41j29j37J07K18k22j79J58K49k88r9L32j2l78J73K64j71k78
$$ 133 53 -118 21 162 33 -104 3 221 -1 -180 -22 227 -61 -160 172 160 -218 -45 219 48 -230
5434b30K77M7r2r6O8M5j4j39J23K08j77k20K59J92m29pM33n7m47K09K97l08j26
$$ -230 47 94 2 -94 -26 19 5 -134 -11 197 20 -200 59 251 -178 -185 248 191 -256 -47 250 -58 -184
5457a84L03k1j19o8M8J11j5j98J65K01k91j91L50J21m60Q1M37k17l22L17J19k80
$$ -184 119 98 -21 -89 -41 70 55 -143 22 223 -68 -259 91 212 -248 -167 270 53 -269 48 167 -113
5479a13K3J82q0q6R5n6R8K0k35J49K27l06k54N37J8n64K54M41l68k49M20K2l36
$$ -113 -90 92 12 -74 21 -35 63 83 -152 -3 224 -82 -336 201 219 -345 -91 350 -18 -267 153 175 -161
5502a61Q0J94j92J01P8j54O2P8k24J31K98l59k14N24K7o08L20M41n48j44M26n4
$$ -161 -81 113 -79 22 100 -54 8 86 -138 -7 291 -68 -282 242 269 -339 -19 422 -126 -270 156 102
5524A02l46K51J57k75J18M8k04J98O9l05J47L66m85j75O18p2n76M49K26n76L5
$$ 102 -244 7 164 -111 7 55 -149 49 118 -187 -40 326 -159 -334 284 212 -364 85 311 -265 -230
5545b30N49j84l63L40n9k42K10j3j20K31O8n01K66L97n23o5O46k78o56N42L44
$$ -230 319 135 -228 112 53 -189 21 8 -112 119 187 -314 -48 349 -174 -239 407 129 -527 15 359
5566C59o92J57N11l81k94N18o8l10L33r5k56K86Q8m74M01K99n98j62P79l75m69
$$ 359 -333 -176 335 -46 -340 178 110 -200 133 38 -218 68 156 -318 83 382 -216 -378 401 26 -443
5587d43O44J62o56J38M91m44j26M68j36k88K81j06j70L71k7m93L84K23o07J22
$$ -443 201 363 -293 -155 336 -108 -234 234 98 -190 91 -15 -185 186 159 -334 50 273 -334 -212
5607b12P21n22m30O87lp03L65N06n90J9L88l58m2L44j64j41L71k01m31O14J09
$$ -212 509 -13 -443 244 241 -462 -97 409 -181 -162 226 -132 -174 170 6 -135 236 35 -396 218 327
5628C27o85K52N41o20k62P88j03o06M12L00n21j8M49k76q8K94k28j25M10k14k94
$$ 327 -358 -106 435 -185 -447 341 238 -368 44 344 -177 -195 254 -22 -110 184 -44 -169 241 27 -267
5649b67N48rp05L60M87n24j96O83k37n51M34K50m27O8L10k95j9K34k23m3L65k63
$$ -267 281 272 -433 -73 414 -110 -306 377 140 -411 23 273 -154 -86 224 -71 -90 144 -79 -122 243 -20
5671b0k66M78m6n55M49M01o75j11P28k86m32N13J20m86J09K34k35M1J81k33L0
$$ -20 -286 192 146 -409 40 441 -234 -345 383 97 -335 178 298 -188 -79 155 -80 -39 142 -91 -61
5692f1L26l63r4M86j59n40M40K38n46K8O37l06m30M48Q1l30J01K35k49M1J19k93
$$ -61 265 -98 -192 294 135 -405 35 273 -273 -245 392 86 -344 104 185 -145 -44 191 -58 -17 102 -191
5714a91J93K26k87o4L65k61l36N17J35o03J14N06l10k82M45L9l49J28J00r6mN1
$$ -191 2 228 -59 -123 242 -19 -355 162 297 -306 -192 314 4 -278 167 206 -143 -15 85 -11 -15 36
5736C6j29J37O9l10R3L61k98k19L96O2n07J34M60k66k79M13J7l47J26R9p8L9j5
$$ 36 -93 44 113 -197 -104 257 -41 -260 136 198 -309 -175 285 19 -260 153 170 -177 -51 48 -30 9 -6
5759fl9Q9m3j50J42J88k71j58M07o1l73K21L42l15j52L13K4k37L6J12o6Mj07J06
$$ -6 -45 44 1 -149 -7 181 -90 -248 159 98 -275 -54 288 -27 -179 134 158 -79 -43 69 3 7 -100 6
5783FP6j06j06J27J52k79n2L49r3l11K03K27k44j43K82lk01R4N1J1p1L2L8N8r1
$$ 6 82 -24 -130 -3 149 -130 -182 167 74 -237 -34 193 -51 -194 88 85 -116 -22 29 40 -31 1 39 97 6
5808Fj05K28n3k15J01J99q9k62K68P9k42r5K66N9k37NK37j01n3kP4m2j18M9J17
$$ 6 -99 129 76 -139 -38 161 72 -190 78 157 -85 -180 86 145 -92 -87 150 49 -4 -6 68 26 -92 -43 74
5833G4m2j58R0K02j86j44K04R9j95q9K62o2j84P5J56m2j39P2J12kj17o1J80l8
$$ 74 32 -126 -36 166 -20 -164 40 139 -56 -145 117 55 -129 -54 102 60 -79 -7 105 103 -14 -75 105 67
5857F7k15Q1K09j88p9J78M0j28q6K30l0k24R4J35m4j62J34M6l2j18J41K8k9k02
$$ 67 -148 -67 142 -46 -125 53 93 -35 -121 109 79 -145 -51 84 40 -122 12 58 26 -92 49 77 48 -154
5881a54J52J09o1k24K37P8k57M4K04o8j79J71R4j49r4J32O2p0j12J51J8p2j18
$$ -154 -2 107 46 -178 59 137 -120 -76 128 60 -119 52 146 -3 -97 35 97 27 -85 66 84 12 -106
5904a06J38J24j73q5K13k7k07L4K48j86j04J46R1r5j13Q0R6p1k7P0O5r9j33R6
$$ -106 32 156 -17 -102 111 84 -123 -89 159 -27 -131 15 106 11 -102 -22 74 3 -24 46 111 12 -121 -25
5928b5J19j69l2K62j04k06R6J69p4j01J90m7j65O6N5O1m0j08P3J16j61r1J45Q9
$$ -25 94 -75 -107 155 51 -155 -59 110 36 -65 125 78 -87 -21 34 95 55 -53 20 136 -25 -116 29 118
5952A18k06N2J97q9k49J44J84k12n6K04j9j76R1N7K8o9n5L5J11j05o6J98M6k82
$$ 118 -88 -36 161 72 -177 -33 151 -61 -117 87 68 -108 -17 40 68 -1 -56 -21 90 -15 -81 117 163 -119
5976a19M5K70k00j75K45M4j99N2J09q7k9L6lk2Q9q1l3J61j24r3J42J10k98Q0K46
$$ -119 -74 196 -4 -179 66 110 -89 -37 72 -15 -44 -8 -11 -33 56 -25 -58 103 -21 -114 28 138 -160 -80 166
6001A66k25r7K53J1k83J44J64k45N4J36r5n8K05j86l6K46j49j50K69m4l06J88
$$ 166 -59 -156 97 108 -175 -31 133 -112 -58 78 -17 -75 130 -56 -92 154 5 -145 124 80 -226 -38
6023c8K17k00j26L21j00k07J89P4k59J48Q4j41kJ01j41J6K83k38j99L44k1l30
$$ -38 179 -21 -147 174 74 -133 56 130 -129 19 103 -38 -40 61 -80 -64 219 -19 -218 126 105 -225
6045b25K39K32l45q0L55k13j57K50J11l45K16M0k59J86J56k53O8J80k12j26M15
$$ -225 14 246 -99 -179 176 -37 -194 56 167 -178 38 78 -181 5 161 -92 -24 156 -56 -182 233
6066B33q5l60L31J43m60M8M33k95j81L11j5k76K43R1l41J99J36l53J03L27l26
$$ 233 148 -212 119 262 -198 -150 283 -12 -193 118 103 -173 70 161 -180 19 155 -198 -95 232 -94
6087i4q7M22j99l62L91J51n05K92K35l36r0M20k67j98L46%l29J80J86l44J32K62
$$ -94 -181 241 42 -320 71 222 -283 9 244 -92 -182 238 -29 -227 119 119 -210 -30 156 -188 -56 206
6109B06k82o7M40l20k77N03l3m30K11L18m46L2L85k72j43L50j30j38K06Pl45K31
$$ 206 -76 -143 297 -23 -300 203 170 -260 -49 269 -177 -145 240 -32 -175 175 45 -93 113 120 -225 6
6131FJ62l13j7L97k76k01M14p7m05L42K35m20M3L19k97p2L30j40j88J99N3l38
$$ 6 168 -145 -162 235 -41 -242 172 95 -310 32 267 -153 -110 209 -88 -160 170 30 -158 41 94 -244
6153b44L28P0k80O5L19l55j06L98q8l13L01O1l14R5L02l31k0K92k05r2K72o6k68
$$ -244 84 154 -126 -61 258 -97 -203 195 107 -206 95 156 -158 -63 239 -92 -112 180 -25 -117 155 89 -179
6176a79K56L1l13J79J83k68p3L84j92k12K88R8l51J71J21j87l3K02j62k7K55j93
$$ -179 77 108 -205 -26 157 -111 -184 200 8 -204 84 182 -169 2 123 -64 -97 105 -57 -84 171 -22
6198b2j53K56pk58J78J79k57o3K98j84j21K43M3k96J72J06k54N3K01j13n4J51
$$ -22 -175 81 74 -184 -6 173 -84 -147 151 -33 -154 89 132 -164 8 114 -140 -87 114 1 -53 98
6220I8j13j10K20l4k07J60J14k44MK95k25m6K02n6j74J34M8j04NJ16j30RJ04j39
$$ 98 -15 -125 95 61 -146 14 128 -116 -112 183 -42 -88 114 58 -116 18 66 -38 -33 83 -47 -38 66 -73
6244g3pK26j03j84K05O5k11N7J63j63o4J73o7j19J16j6q1R0P2j47L7P4r3nJ63
$$ -73 -80 146 43 -141 64 129 -82 -25 138 -25 -89 84 17 -102 14 -2 -83 7 79 -68 -31 43 -50 -55 108
6269A08j16m5Q0Pj06J04mj06N3Q1n1l5P7Kq8M2J12j13kM9j12N3J34j22n8J29o
$$ 108 -8 -53 27 34 -72 32 28 -78 -25 56 5 -30 47 49 -39 3 115 2 0 49 -63 -10 124 2 -56 73 67
6296F7j04J6Q1p3j9J00l6o5L8M7n4q2M6Q9m7jl7J8J8m3MJ21k8r3M3K4j3p5N0k1
$$ 67 -37 -21 60 -13 -32 68 32 -33 5 52 -2 -84 -38 51 4 3 -34 -16 2 -41 -37 84 56 -37 6 30 17 -58 -8 -29
6326b9o3J13k5mL0m0j8J03k8k2k1k5J2j2K5P4j16J0J37j26KK8mj0J2M4m1K3j7
$$ -29 -92 21 -4 -8 22 -18 -36 67 39 17 -4 -29 -17 -29 -4 70 -46 -36 101 -25 -23 5 1 -9 3 47 6 29 12
6355A2O1p5k5nP0m3l0J04m6j9j6L0j4%n7R8q1K1J7J6j00O4L8k4JMrL6k6L0p8N7
$$ 12 73 -2 -27 -32 38 -5 -35 69 23 4 -12 18 4 4 -53 45 -36 -15 2 18 -82 -18 20 -4 -3 1 -8 28 2 32 -46 11
6387A1Rr5J17J8p0l7N9k9Nm3P6p0PR0l6j2k1J7J1o6ML8J7k7qQ9qm4k7M4J0n6M0
$$ 11 20 -75 42 60 -10 -47 12 -17 -12 -55 21 -49 -42 48 12 0 -21 -4 7 -59 -55 -17 0 -27 -35 54 46 2 -25 19 29 -27 13
6420A3k0j5M6k7M7j6p7K6L1J6j4l6N3l3l4R0nq0L9km3O0k2L0q4K9M6K4l5kj9Q7
$$ 13 -7 -22 24 -3 44 28 -49 -23 8 24 10 -26 27 -6 -40 50 45 -35 4 2 -41 19 -3 27 -57 -28 18 42 7 5 -14 73
6452G3p1K8jL1q5J9L1k7LJ5M8q2L5ok8l3K0M9m5J2JNM4o1Jklk4K2JR0j25P8Kn6
$$ 73 2 30 29 60 -25 -6 25 -2 1 16 64 -18 17 11 -17 -50 -30 19 -26 -14 -13 -8 36 -25 -24 -26 -29 -53 -31 -30 60 -65 13 15 -41
6487d1K1N8m7j2M1k6o9Q1j3L7j6j5Qj1L3o8PP5l6qmNo1L0K7N1l1Pq8R0K5j03P7
$$ -41 -20 38 -9 -21 20 -6 -75 6 -7 30 14 -1 7 -4 29 -39 -32 43 7 -1 -5 0 -61 -31 -4 47 16 23 -65 25 50 -53 24
6520B4L7n4q5R3N6j10JQ6n1q9J28j0r8O3P1j15M2L8j11J17j0j8k6J00p5n2P7k3
$$ 24 61 7 -78 15 71 -39 -38 48 -3 -92 36 26 -72 -9 62 -53 -11 27 -84 33 23 5 -21 79 4 -48 29 6
6548Fn1M5N2j33j7J43n5k0K3J3%j8Q0j01m8R3o5RP0Kq9N5j3rP5L3j08n3J84o7
$$ 6 -45 0 52 -81 -98 45 -10 -30 -7 6 6 -12 68 -33 -81 12 -53 -44 26 28 -61 -6 -19 -28 47 80 -28 -81 103 36
6578C6j14M5J36j58J17Pj13L9M8n3j7P0q0k3J12J9k06J78K9j53nJ89p7j15J10
$$ 36 -78 -33 103 -55 62 69 -44 -5 43 -10 -27 43 -37 -60 52 71 -135 43 72 -81 -86 103 26 -89 21
6603B1M4j38L1R1r5OJ07j30L3J24j79L6J01Pj77J88L1j41OJ49j41m5J16j9l2Q4
$$ 21 65 -73 -42 49 -46 -40 67 -63 -30 94 -85 -49 52 59 -118 70 101 -40 -34 115 -26 -71 45 26 -6 78
6629G8j4j12K1R5j51M3J31j24j3L2N1j47J47M8j86P9J12j09j6J09j10qL3N1j31
$$ 78 64 -48 -27 68 -83 -40 91 -33 -46 -14 37 -110 37 85 -101 -22 90 -19 -35 74 -36 -44 -11 40 -91
6654i1R9M2r6R7j0r4J3Q4m1j22J79n4j11P2J20j60J0J30o4o5O2L0p3J16n6k6N3
$$ -91 8 50 -46 51 41 -53 -40 44 3 -119 60 6 -105 -33 87 -73 -63 67 3 -62 0 30 -43 73 17 -9 44
6681D4M1j71L6J34j07n2J86q2j40R3P8j86O6M5M5r6J03j1o8J3O8j16J16j3o4R2
$$ 44 85 -86 -50 84 -23 -75 111 29 -111 -18 60 -126 -60 -15 30 -66 37 26 -42 -29 39 -77 39 26 -38 54
6707E4M9r7o5J82j3j68O3R1r9n1J03m8m2J05n9k7M9o1l0P4l4p2J55j2j39N0P5
$$ 54 103 6 -59 123 110 -58 5 96 -3 -54 49 1 -41 64 5 -22 27 -34 -64 10 -24 -96 59 47 -92 -42 33
6734C3k4j22R8J14j85O0J09n1p8M1L5j8L0m3nJ4K2q0R0L4j21K3M6j4j27J79lj24
$$ 33 9 -113 -15 99 -86 -26 83 32 -46 -5 30 12 42 -1 -6 8 30 -50 40 74 -47 -24 22 8 -119 60 57 -67
6762f7Q9k6k5JN8Lq1L9l7L4L6n8O5j9L7j14RJ42j19m9N9P4j09J4J37j4j82J89
$$ -67 22 -4 -29 -28 30 33 -48 -9 -46 -12 24 -34 31 12 49 -65 -56 86 -33 -82 -23 51 -58 -44 93 79 -103 86
6790H6o8k5MPK8j8m8J8M3%m5R0j9n3m4J14N0k23L8J50m1j09K4J4M9q7J47l4l5
$$ 86 18 -7 -3 4 32 14 -34 -16 27 27 -18 72 53 0 -44 70 120 -103 -65 85 44 -65 -41 -27 22 -65 82 48 13
6819A3k3l9J37p9j18R5N5m1j03J27L6j03K2Q3j16oO6L1m7o4J5R7o4OL9ro8J3m
$$ 13 -10 -49 88 9 -109 -14 41 0 -103 24 60 -43 -21 62 -54 -60 6 37 -10 -74 -59 38 -26 -20 19 10 -58 -45 -49
6848d9J17j02l7J34k6r3O5N2p1j9K4R3r9n8J5O4l2mJ2L3p2j6Q4K5n0k0J10l4j23
$$ -49 68 -34 -71 63 37 -56 9 61 -10 -29 -5 88 -11 -69 -54 10 -22 -26 -14 19 -53 -69 15 40 -10 -30 80 46 -77
6877g7R5Ql7o0R7P1j08PL0J8o1k7R6Pr7M4N4m8l6qJ09o8p3P9k1Mn8J07o0k1jM1
$$ -77 18 26 -11 -71 26 97 -11 -4 26 44 -17 -44 52 59 -38 6 60 12 -24 -32 77 9 -64 15 -6 -2 -60 47 -13 -34 -35 6
6909FM2o4OM7l8l1k9R8l9n8P0J8m0j9N9K5p1j3P4L5j24O7NL3p6mL2O0j31M7P8
$$ 6 48 -16 -10 37 -1 -32 -61 37 -2 -60 10 28 -12 -31 28 53 -18 -31 43 78 -46 21 26 59 -17 -21 11 71 -60 -13 65
6940F5n3j4rJ11j38l2J03N7j29j0L5N9l7k2L2l6O5o9J8M0m8j5P8o7r6J38L5q7
$$ 65 12 -2 -11 100 -38 -70 33 90 -39 -49 -14 45 8 -14 18 -18 47 -22 -4 36 -12 -27 51 -16 -112 26 61 -26
6968b6l0J17pn0l1J39p9n3K0n5P1qn7Q7j0p0j5J61m4j36P9O7j70L2J38j17n3R5
$$ -26 -56 61 54 4 -27 112 33 -20 0 -55 16 8 -49 38 28 -42 -57 104 60 -76 3 70 -100 -68 70 -47 -100 -5
6996eJ9o9LQ3n2QL5j03J55%j46O5O3p6r7J10J38k19O4Q9Qj93J33O1j09QO1l4J4
$$ -5 14 -55 -52 31 -21 -13 22 -81 74 74 -72 -7 56 -20 -117 -7 131 -88 -24 65 73 -120 13 74 -35 -27 34 0 14
7025A4Km0LR1j48QK11j76lJ04J3j48j1J76q6q0Q2m0J7P8Jr0M7k3r0Q9Q8k04K7
$$ 14 16 -24 -21 70 -78 -70 141 -35 -38 66 79 -69 -80 96 10 -70 12 -28 -11 67 68 -22 25 2 -88 1 89 -115 -88
7054h8K08j33r9J91Lj85Q3P3j02j9R7k4l6O3n0j4N5m6n4J46qj76O6J99k18o3K73
$$ -88 120 -13 -112 79 82 -103 -20 53 -49 -68 29 5 -31 32 -18 -32 23 -23 -77 69 61 -115 -49 150 -68 -131 142
7081A42j02k02J66J00k00N2J26j39KJ24r6k1R1o7n5J57K8k85J94J78k52n2K49
$$ 142 40 -162 4 104 -96 -44 82 -57 -55 69 -27 -48 43 -24 -79 78 106 -179 15 193 -59 -111 138
7104A38j17j49J97O8k51J00J44j61J9N6l4r5K26j62j51K97m6k65K27R1k97N5K48
$$ 138 21 -128 69 137 -114 -14 130 -31 -12 44 10 -85 141 -21 -172 125 79 -186 41 132 -165 -110 138
7127A38q6k22K69Jk83J87J41k36J2J87j22J2K4j4j05K18r8j31J07J08j92N5K22
$$ 138 52 -170 99 100 -183 4 145 -91 -79 108 -14 -2 22 8 -97 121 23 -108 -1 107 -85 -30 192
7150A92k49j12K63l5k07K07N1k09N2R2j11LJ80j50o4J71J3k79L28l1k55Q2K94
$$ 192 -57 -169 94 59 -148 59 110 -99 -47 45 -66 -63 117 -33 -97 74 87 -192 136 105 -150 -68 226
7173B26k90p8K47l9k00J22J22k26J19J15j74J8J79k24Q1J16j47j41K89j2k70K09
$$ 226 -64 -142 105 66 -134 -12 110 -116 3 118 -56 -38 141 -83 -2 114 -33 -174 115 103 -167 42
7195D2J42k43rK04n8k42K08P6k08Q9O9j90Q0J51k42R3J41k02L2J60k1k56K56Q5
$$ 42 184 -59 -68 136 78 -164 44 120 -88 1 70 -120 -40 111 -131 -38 103 -99 -67 93 72 -184 72 157
7219A57k37n5K41p3k02K49l3j09M6P4j46J35M7j21jJ56j16p7K01j14j64J50J01
$$ 157 -80 -135 106 33 -169 80 47 -62 -16 58 -88 47 94 -27 -28 128 12 -65 136 22 -142 8 109
7242A09k27O6K28j52j61J58L7j41R0L4o5J2P1r0l7J30j26l1K24j28j31K14Ok00
$$ 109 -118 -52 176 24 -137 21 58 -83 7 41 -24 -12 59 -31 -68 62 -64 -95 129 1 -130 84 90 -110
7266a10J14J27j30n8J23l0p2%N9q7R1n6m2Q4P6j68K8J73j47j30J93qj97J32J92
$$ -110 4 131 1 -57 66 36 -36 -36 23 -64 27 -29 -71 13 89 -79 -51 122 -25 -155 38 30 -167 -35 157
7291A57k06o4K01o1l1O9Lq2k8O9k8qN3r5K1R6p4l3J05K4j72Q1P8n3j13J07j8k3
$$ 157 -49 -113 88 27 -4 65 68 -14 -42 27 -1 -9 44 -51 -30 66 -8 -41 64 88 -84 -3 75 22 -91 16 -2 -25
7319b5j7J17p5J2lo9L0P5j05O8J11j67n8J65j6j32Q9R1o7m1O0l9j7O2j2qj0j6
$$ -25 -42 75 0 12 9 -60 -30 45 -60 8 119 -48 -106 59 43 -89 0 91 24 -17 43 4 -13 49 37 29 19 3
7347CJj1M8p9L1M0j00OJ41r4j0L2M9o9ROL1n5L5J2j0m9O8Lo7J0%K1j2n6N7M2M
$$ 3 4 -7 41 -38 -7 33 -67 -61 80 -14 -24 8 57 -12 -3 3 34 -21 14 26 16 -33 35 38 -29 -19 -19 2 -10 -66 -9 33 37
7380C7o8PP1q1n7J73n7n4KO2m4k8K3J0K5r6M6Q7J1o8j7J14j28K8O6j1r4J7R1k
$$ 37 -31 -24 47 -34 -91 82 25 -29 -27 35 -9 -37 -14 -4 21 -75 -29 58 69 1 -16 98 -30 -2 64 53 -41 -24 67 65
7410F5r6L4L7q3j2N8jNMm1N2pp0M8J18j34j4P5mm8RL9q1N6JrJ2K9Mo6Nl0K8O6
$$ 65 -31 3 40 -43 -55 3 2 7 11 -30 22 15 -55 -7 111 -23 -37 38 34 -14 -5 34 -47 9 10 1 13 42 46 -20 -15 -45 -17 49
7444D9Mj18Q2P0j45N9JR3j71O3Q5j49O6j2K7O1j0p4J7mJm7J03o0o7P8Q4j27k8
$$ 49 53 -65 17 87 -58 1 2 95 -76 -13 72 -77 -11 -23 4 65 55 -19 -2 -6 -5 -52 51 -9 -76 2 86 -41 -69
7473f9J21m4q1N8P2n6NJ0l7LN8k0pM1j04L6O1L0j76J21M2j60M1J68j7k01J50K2
$$ -69 52 8 -73 -15 57 1 6 16 -21 -18 40 20 13 54 -50 -14 47 77 -99 22 64 -96 -55 113 96 -105 45 67
7501F7j57Q1J03j19k8J21j06%J27j21n1J31o2n5J05L9j50O9J22j74k6J90m2j56
$$ 67 -90 -9 94 -25 -53 68 -38 -38 89 -32 -83 48 -14 -69 36 75 -75 -6 116 -58 -84 106 64 -92
7525i2J80j00l6P0N4q4k6J15j77K5J94j63J0K8N3j85J25K05k58QJ68j19r8J56
$$ -92 88 -12 -48 22 76 -8 -34 81 -96 -71 123 -40 -30 -2 51 -134 -9 196 -62 -54 114 -5 -103 53
7549E3%j61J20J05k48J30R2j91L6K18k08n8K07m2k42K52Q9k63O4K46k61k1J91
$$ 53 53 -108 12 117 -131 -1 91 -100 -64 154 -54 -112 95 53 -189 63 152 -111 -47 199 -62 -83 108
7572A08j17j00J91J2k12J14J57k65O5K30k27j19K81q9k23K43Q6k96O5K16j95m0
$$ 108 -9 -109 82 94 -118 -4 153 -112 -47 183 -44 -163 118 29 -194 49 135 -161 -96 120 -75 -115
7594a15J64n3j14K09k5k26J69P9k34J45J84k67p4L10j55j74K74J5l13J63K32k28
$$ -115 49 -4 -118 91 66 -160 9 88 -146 -1 183 -84 -158 152 -3 -177 97 112 -201 -38 194 -34
7616c4j9K00k16p9K89j05k03K38J0k05J05J32k08NK33j70j22K39Lk66J96J03k23
$$ -34 -53 147 -69 -148 141 36 -167 71 81 -124 -19 113 -95 -90 143 -27 -149 90 93 -173 23 126 -97
7639i7J4K72k59l5K27j29j32J85lj84K14Q4k95Q9K74k62j45L11n4l14K95P5k73
$$ -97 -83 189 -70 -105 122 -7 -139 46 43 -141 73 157 -138 -49 225 -37 -182 129 75 -239 56 131 -142
7662a42J49J11j93M4J95k20o3K12q5j66K40J5k65J30K06k55n6L11j75k15L02M
$$ -142 7 118 -75 -31 164 -56 -119 93 8 -158 82 97 -168 -38 168 -87 -143 168 -7 -222 80 84
7684H4k86K08J03l01J45J19j79MJ83q1j89L07k7k63J48J76k71P7J89j50j14K16
$$ 84 -202 6 109 -192 -47 72 -107 -103 80 -1 -190 117 90 -173 -25 151 -120 -43 146 -4 -118 98
7706I8j7k59K23K4j47N6J89k49PK11j30j16J88L7k83K03J06k92J10J70j64l5J42
$$ 98 81 -178 45 69 -78 -22 167 -82 -75 136 6 -110 78 115 -168 35 141 -151 -41 129 -35 -70 72
7729G2q9j16J69K3j67R6J36k11J9J56j16o0K12o7j89J91P5k29P3J31j49o1J80
$$ 72 -17 -133 36 59 -108 -12 124 -87 -68 88 -28 -88 124 57 -132 59 134 -95 -22 109 -40 -101 79
7752G9o0j05J87n8j02M4O6j01K6R3p4q4J50r1p3J37Qj24Q7K9q8N8N8n4n7Q1Kn2
$$ 79 19 -86 101 43 -59 -15 51 -50 -24 69 -5 -89 61 -30 -103 34 42 -82 5 34 -54 4 62 8 -49 32 34 -18
7780a8J5M0j11J22l8j16Q3J42j11m8J51l5j38R4O7p9l9R0j06rR3m5o2Q1l3n0N9
$$ -18 -3 37 -74 48 10 -106 -23 119 8 -40 111 76 -62 32 99 20 -19 71 -35 -44 49 4 -58 23 -10 -60 -1
7807aMl9k5P6p0j7J18j9j30P0O4p0J2J16q8m7J33q6p2R1k1o8O9K8m6J7k4J5L7
$$ -1 3 -36 -61 15 -55 -72 46 27 -103 -33 31 -39 -27 89 1 -46 87 1 -71 20 -1 -69 0 28 -18 -1 -25 -10 27
7836B7K9r5MP7k6p4L7Q1n4k7J4L4p7J00kj17O3J5lJ4K6r1ON6j3n0N8M6o0k2Q1
$$ 27 56 -39 -35 42 16 -58 -21 60 6 -21 -7 27 -50 50 48 -69 -6 9 6 20 46 -45 -39 17 4 -46 12 58 -2 -24 57
7867E7l8o3N9l2lJ0K3L1n3K1qJ4j4n3O3RJ0m3lkJ4k8L5j4k6J1k6No1R3qJ8k1Q
$$ 57 19 -44 15 -17 -20 -10 13 44 -9 12 4 18 4 -49 14 23 33 -10 -13 -15 -1 -29 6 -8 -34 -23 -49 -44 -105 -12 -20 -2 -23 -15
7901a5M1l4Jl7pj9kJ30j1q9N1L0r7N6L3m3l3R0kn4M9n3O0m0n4N1NM0n0k2OJ3o4
$$ -15 26 -8 -7 -44 -51 -70 -72 58 47 -42 9 39 -58 -2 31 -12 -45 45 43 -11 38 -15 45 5 -49 2 7 47 -3 -25 -19 -6 -70
7934g0L4N5m8jJ07o5o0QJ9QK2k4j6N8r0N2J7N4j09LJ05n9rPJ8J2j2oj3k2P2m4
$$ -70 -36 19 -29 -30 77 12 -48 -40 -21 -13 9 -15 -31 27 -63 -11 6 60 -49 -46 59 0 -9 -2 16 28 16 10 -3 -25 47 3
7966Cj8pR3l8l3N6q8P3m9l0NL3Jj2Q2l1r9N6O7r5K9rm7LR1m3n0N0%l1P8o1m1O8
$$ 3 -15 -22 71 33 0 56 -32 41 -8 -38 -33 0 1 -11 71 40 -59 -3 64 -31 -2 -11 -58 -55 36 -7 -57 -7 -7 -38 40 -21 -62 6
8000FK3q2j5J55j13l6Q3N1r5k3J24j08J7MMj4N5n4j3P8m7j9K5J02j09l6M4p3j5
$$ 6 29 -53 -68 87 -26 -62 21 72 -23 -46 78 -30 -13 -9 -5 -19 36 -18 -31 47 0 -19 6 108 -1 -37 7 -66 -81
8029h1J53K0j62J07K7q9K1L1m1mL1Nl5Q4m5l4N5j4q9J1J19p9n8Q9Rp5R8n1p4O9
$$ -81 72 92 -70 37 64 -25 -4 27 -14 -18 13 18 -17 67 22 -12 43 29 -60 -49 70 -9 -67 22 31 -44 54 3 -71 -2
8059bJ02j14j6O4o8o6J11J3j05Q8j2m4M5Q6j82O7N5k1r8J49p1rLL6o0MR8r1kJ06
$$ -2 100 -14 -30 34 -34 -100 11 24 -81 7 -5 -49 -4 82 -100 -33 22 1 -97 52 -19 -28 -25 11 -49 -45 53 -38 -40 66
8089F6k3j07J47r5n6J06Pq1Q7Rq1k0J2Q6j00O6Mq4P0Lq0j6J03j7p8J26k9j30J86
$$ 66 43 -64 83 -12 -68 38 45 -36 51 60 -21 -41 -29 57 -43 23 27 -57 13 16 -64 -80 23 6 -72 54 25 -105 81
8118H1Jk16J19O0p9%L2K7q1R0l8j6O2M0n8j3M4p8r5J96k1j29J04j7q2N2P7q5o1
$$ 81 82 -134 -15 45 -34 -34 -2 25 -56 34 -4 -20 42 82 24 11 55 -23 -118 78 57 -72 32 15 -67 -15 62 -23 -84
8147h4J10l9p4J13Rj23J07nj01R1L3l3q0J32r8j16K33n8p0K5J13j33L4K9m8JQ9
$$ -84 26 -13 -87 26 35 -88 19 14 -87 4 37 4 -76 56 -42 -158 75 17 -53 -28 85 -48 -14 15 -33 -32 57
8174E7r8k8J19K0r7N0K9q8k7J13j09%J53q2p2J16J3
$$ 57 -41 -69 50 70 -27 23 52 -36 -63 50 -59 -59 94 12 -60 56 69
8191F9
$$ Imaginary data points
##PAGE= N=2
##DATA TABLE= (X++(I..I)), XYDATA
0@%%%%%%%%%%%Qj6J6j6K4l2L5m3N6o6P5r0J07j30J53j77K03k31K69l08L50l99
$$ 0 0 0 0 0 0 0 0 0 0 0 0 8 -8 8 -8 16 -16 19 -24 32 -34 41 -49 58 -72 81 -96 107 -124 145 -163 187 -212
33b12M54n11N74o47P25q14R10j010J122j245J379j527J688j862K052k263K496
$$ -212 242 -269 305 -342 383 -431 479 -531 591 -654 725 -802 886 -976 1076 -1187 1309
50A309k749L026l335L679m064M496m986N547o196O959p870Q979j0362J2146j4544
$$ 1309 -1440 1586 -1749 1930 -2134 2362 -2624 2923 -3273 3686 -4184 4795 -5567 6579 -7965
65g965J7954k3222L2486n3370J80448k8442l54199K53959P0713k28388Q3622K57227
$$ -7965 9989 -13233 19253 -34117 146331 117889 -236310 17649 88362 -140026 -56404 200823
77B00823j37637j50239K8731J1130M1337Q4545p6314J0858Q0366j88802j11652
$$ 200823 63186 -87053 -58322 -47192 -5855 78690 2376 13234 93600 -95202 -206854
88b06854L17515P3095k94783O9324K10399k61902j31790L40328O9652k60259L2450
$$ -206854 110661 183756 -111027 -41703 168696 -93206 -224996 115332 184984 -75275 -42825
99d2825J09875j31031k7683J37135K7982j6893n1343j17723O2696J38919j09489
$$ -42825 67050 -63981 -91664 45471 73453 56560 5217 -112506 -49810 89109 -20380
110b0380l3318K06218r5034k78442J66249K27876j95287o8759K24204p9382k30213
$$ -20380 -53698 152520 57486 -220956 -54707 173169 -22118 -90877 133327 53945 -176268
121a76268J21557J61727q0197l6560L5785m2893j6480O311p187J03725M0840j82119
$$ -176268 -54711 107016 26819 -9741 26044 -16849 -33329 -27018 -34205 69520 110360 -71759
133g1759l0232J80261o2621j34849J87395R0465k47994l9983K06044l8930j18319
$$ -71759 -101991 78270 15649 -119200 68195 158660 -89334 -129317 76727 37797 -80522
144h0522J16604N7909j31043l8723O5524L0008J6363k3511l9126M6160o081j03416
$$ -80522 36082 93991 -37052 -75775 -10251 19757 36120 12609 -26517 19643 13562 -89854
156h9854O9067J47721j09469j23192J34582L6572j58877N0348J64675q7154j23420
$$ -89854 -20787 126934 17465 -105727 28855 65427 -93450 -43102 121573 34419 -89001
167h9001Q1566M7826o8114O938N7288k923l7321m1627J1300P7312j0928q0476
$$ -89001 -7435 40391 -27723 -20785 36503 33580 -3741 -45368 -34068 43244 32316 -48160
179d8160N4277O3398j16426m1676J49935J0054j35124L8429R4617q4926n9003
$$ -48160 6117 69515 -46911 -88587 61348 71402 -63722 -25293 69324 -15602 -74605
190g4605R9135L6817p3375j9047L6022P555j9960j3582L1881L6604n3883n4463
$$ -74605 24530 61347 -12028 -31075 4947 12502 -7458 -21040 10841 47445 -6438 -60901
202f0901P1494M3115q5445n202R7044l5816r7614N9396P6121o6264l9622O5711
$$ -60901 10593 53708 -31737 -36939 60105 24289 -73325 -13929 62192 -4072 -43694 22017
214B2017R678o1235j507N0357J0165l7222j8765L4290J8883m7282j1787O7871
$$ 22017 31695 -29540 -31047 19310 29475 -7747 -26512 7778 26661 -20621 -32408 35463
226C5463R46p8979J5604P3737l7995n7555N8707L9466o7364k3544O1309R514m9514
$$ 35463 36409 -42570 -26966 46771 8776 -48779 9928 49394 -17970 -41514 19795 29309 -20205
239b0205J87M1638l393m1196N63M4558P43m8069N539N0622j9268n0879L4316M6602
$$ -20205 -20018 21620 18227 -22969 -22406 22152 22895 -25174 -19635 30987 11719 -39160 -4844 41758
253D1758m4847l5468N0228K0615n1366o843M9595j636m4985N563L9926q181l6817
$$ 41758 -3089 -38557 11671 32286 -19080 -25923 23672 22036 -22949 -17386 22540 14359 -22458
266b2458J1554L6454j6378l7228K1890L5839k8697l1275L5431K3721m0877j5342
$$ -22458 -10904 25550 9172 -28056 -6166 29673 976 -30299 5132 28853 -12024 -27366
278b7366M3365O824m2667R83M0100p351l6972J2604L4282j6445l1469K0343K8487
$$ -27366 15999 22823 -19844 -18861 21239 13888 -23084 -10480 23802 7357 -24112 -3769 24718
291B4718k4093k4866K8213K0406l1494j5268L3851R231l4844l351L4507k641l3243
$$ 24718 625 -24241 3972 24378 -7116 -22384 11467 20698 -14146 -17497 17010 14369 -18874
304a8874P708L1076j2480k8481J6346K5376j9955k1873K3100J7732k5290j3334
$$ -18874 -11166 19910 7430 -21051 -4705 20671 716 -21157 1943 19675 -5615 -18949
316a8949K7018Q844k7647m234K7849j7k7099M331K6033q204k4292J1851K2072
$$ -18949 8069 16913 -10734 -14968 12881 12864 -14235 -9904 16129 7925 -16367 -4516 17556
329A7556j5163j9305J7825J5971k0045j2680K1471R027k2711n411K2955J761k3088
$$ 17556 2393 -16912 913 16884 -3161 -15841 5630 14657 -8054 -13465 9490 11251 -11837
342a1837J917K2488n553k1197Q965J9266j1889j6600J4519J3778j5948j0626J6752
$$ -11837 -9920 12568 7015 -14182 -5217 14049 2160 -14440 79 13857 -2091 -12717 4035
355D035P919j6989n255J7244L146j7560j070J7804j465j7770M432J6982q118j5587
$$ 4035 11954 -5035 -10290 6954 10100 -7460 -8530 9274 7809 -9961 -5529 11453 3335 -12252
369a2252J1026J3049j3187r700J3857O118j3851l430J3268J994j2167j293J1497
$$ -12252 -1226 11823 -1364 -11064 2793 8911 -4940 -8370 4898 6892 -5275 -6568 4929
382D929P21j1732P70J3123k713j3981N400J3529q529j0985J1632P531j3496m267
$$ 4929 5650 -6082 -5312 7811 5098 -8883 -3483 10046 1517 -9468 2164 9695 -3801 -8068
396h068J3143J233j0920Q05Q347j887p394J211P617M4q615j74R507k170j0265
$$ -8068 5075 6308 -4612 -3807 4540 2653 -4741 -3530 4087 4131 -4484 -4658 4849 2679 -7586
411g586O062J0466r419q431J1067M479j1010M20J0135l208q127L261N345j720
$$ -7586 -1524 8942 -477 -8908 2159 6638 -4372 -3952 6183 2975 -5152 -1891 3454 1734
425A734k905L96K904k20n444K74Q285j423r120L988P146p873m495J0681J688j0169
$$ 1734 -1171 -775 2129 1909 -3535 -3261 5024 3601 -5519 -1531 5615 -2258 -6753 3928 5616 -4553
441d553J077O873l637l431M704J929k793j873m17K439K468l327j139N441j964
$$ -4553 -3476 3397 -240 -3671 1033 2962 169 -1704 -2121 318 2786 -541 -1680 3761 1797
456A797p568M746P444o432m060P294n79p755L287O201l372k942K185n43j249J098
$$ 1797 -5771 -1025 6419 -13 -4073 3221 2642 -5113 -1826 4375 1003 -1939 246 -297 -1546 -448
472d48r2J397J795m307k620N779Q90n657L272N251o394m255P011J770n218J801
$$ -448 -540 857 2652 -1655 -4275 1504 2394 -3263 9 5260 -1134 -5389 1622 3392 -1826 -25
488b5L550l718k522K560J068L84K74k418k03K252k632j619O122O85p432P23O025
$$ -25 3525 -193 -2715 -155 913 1297 1571 -847 -1050 1202 -1430 -3049 3073 3758 -3674 -2951 3074
505C074m002l425O916J876p177m88M511j252j434K800N23j498j112j820J813M380
$$ 3074 -928 -4353 2563 4439 -2738 -3226 1285 33 -1401 1399 1922 424 -688 -2508 -695 3685
521C685k403l594M558L22p661K325Q960l995o650N545J867p497J252P524j648
$$ 3685 1282 -2312 2246 2568 -5093 -2768 6192 2197 -4453 1092 2959 -4538 -3286 4238 2590
536B590m518R59K50p95J138K83J420K155m946m380O878L265p053K039P560p445
$$ 2590 -1928 -969 -719 -1514 -376 -93 1327 3482 -1464 -5844 1034 4299 -2754 -715 6845 -600
552f00p559R285M934p732M27N964n097n077M681L521p87p15k706o43K693k601
$$ -600 -8159 1126 6060 -1672 -1245 4719 -378 -5455 -774 2747 1960 1245 -1461 -2104 589 -2012
568b012j077Q419q8j1695J904R583o097m622J1493Q52j2889J099Q915l154k601
$$ -2012 -3089 5330 5242 -6453 -4549 5034 -1063 -5685 5808 6660 -6229 -5130 3785 631 -1970
583a970N480m37m840q45L08L329M321m692m221O072j575q687P664J0119j0428
$$ -1970 3510 3073 -1767 -2612 -2304 1025 5346 654 -3567 2505 930 -7757 -93 10026 -402
598d02p069J0128m02r589O812Q852p761n657M283O11j100K523M37K78m33o303
$$ -402 -7471 2657 2255 -7334 -522 8330 569 -5088 -805 -194 -1294 1229 1666 1944 1511 -4792
614d792J28J0112j237q683O040M661j2315j222J4615j479j1027N044M597q489
$$ -4792 -4664 5448 4211 -4472 1568 6229 -6086 -7308 7307 5828 -5199 -155 4442 -4047
628d047r99Q456N28l893j519j296J929K014l224K135O329p186q179R862N596j0254
$$ -4047 -5046 3410 3938 45 -1474 -2770 -841 1173 -2051 84 6413 -773 -8952 910 6506 -3748
644c748J266J0422p414r580R200O284p181p64M773k904l656J581K699K748j571
$$ -3748 -2482 7940 526 -9054 146 6430 -751 -1515 3258 354 -3302 -1721 978 3726 2155
659B155n958J919N281n574k611J0441j17j2557K756R882o051n069R278J549r602
$$ 2155 -3803 -1884 3397 -2177 -4788 5653 5536 -7021 -4265 5617 -434 -5503 3775 5324 -4278
674d278n3O363k25k410P69J056J65l071k214O067L553p800j873Q324k711q453
$$ -4278 -4331 2032 1807 -603 166 1222 1387 -1684 -3898 2169 5722 -2078 -3951 4373 1662 -6791
690f791P095P479r066m620Q240L41o854K666N591k718m359O35L146J106k932q44
$$ -6791 304 7783 -1283 -5903 2337 2678 -4176 -1510 4081 1363 -2996 -2361 785 1891 -1041 -1885
706a885M771n54p306K540Q279m401o589O712L468q555o84Q716r83o975J956M501
$$ -1885 2886 2332 -4974 -2434 5845 1444 -5145 1567 5035 -3520 -4204 4512 3529 -3446 -1490 3011
722C011k651l242K395L433j606m493J046N126k103n135M248M816o561l680P710
$$ 3011 360 -2882 -487 2946 1340 -3153 -2107 3019 916 -4219 29 4845 -1716 -5396 2314
737B314J875p575P35O868k731n724L467M712l132l640K753L128k817l391L459
$$ 2314 4189 -3386 -2651 4217 1486 -4238 -771 3941 809 -2831 -78 3050 233 -3158 301
752C01L755m377l720N194K575o067j064O610o02o702K001N661k834m587L524L684
$$ 301 4056 -321 -4041 1153 3728 -2339 -3403 3207 2605 -4097 -2096 3565 731 -3856 -332 3352
768C352l823l019L868K839l924k380M329J957m802j278N432L99n613O51N565j957
$$ 3352 -471 -3490 378 3217 -707 -3087 1242 3199 -1603 -2881 2551 2950 -2663 -2012 3553 1596
784A596n064K865M331l552l721L939K883m270k225M389J563m603j019M771L67
$$ 1596 -3468 -603 3728 176 -3545 394 3277 -993 -3218 1171 2734 -1869 -2888 1883 2250
799B250m865M62M844j206m574J987M327k650l680L180L245l620k552L975J904
$$ 2250 -2615 -2153 2691 1485 -3089 -1102 3225 575 -3105 75 3320 -300 -2852 1123 3027
814C027m220j264M342N26m433Q3M299q29m150J371L815k009l543K442L119k874
$$ 3027 -1193 -2457 1885 2411 -2022 -1939 2360 1531 -2619 -1248 2567 558 -2985 -543 2576 -298
830b98k596L278K120l563j533L835J026l920k46L889k03l863R57L622j377l355
$$ -298 -2894 384 2504 -1059 -2592 1243 2269 -1651 -1897 1992 1789 -2074 -1117 2505 1128 -2227
846b227J821L018k268k765K762K183l144j759L296J140l418n66L270O2l264M19
$$ -2227 -406 2612 344 -2421 341 2524 -620 -2379 917 2057 -1361 -1927 1343 1405 -1859 -1440
862a440L007p48k794J051K789j374k671J935K510k261k100K739J567l022q50L125
$$ -1440 1567 819 -1975 -924 1865 491 -2180 -245 2265 4 -2096 643 2210 -812 -1662 1463
878A463K09k943K53K585o40k225P06K090q95k175Q59K125j074k241J615K002k255
$$ 1463 1672 -1271 -1018 1567 927 -1298 -592 1498 603 -1572 -713 1412 338 -1903 -288 1714 -541
895e41j672K779J159k937k89K824m48k416R26K100q33j659O17J442m62j469O32
$$ -541 -2213 566 1725 -1212 -1501 1323 875 -1541 -615 1485 652 -1007 -390 1052 590 -879 -247
912b47J819r29k309J413K169k185j491K761M89l039P5K769o80j948J053J075r86
$$ -247 1572 643 -1666 -253 1916 -269 -1760 1001 1490 -1549 -1474 1295 615 -1333 -280 795 -191
929a91q51O20J144q5j403p4J804m15k045J576K175k335j837K656Q24k697M81K459
$$ -191 -1042 -422 722 637 -766 -840 964 549 -1496 80 2255 -80 -1917 739 1563 -1134 -653 1806
947A806j206j998R84J170n79n42J97N47p9j458j2K348k48k543J064K179k335j534
$$ 1806 600 -1398 -414 756 177 -365 -168 379 300 -1158 -1170 1178 930 -1613 -549 1630 -705 -2239
965b239L373R15l187L5K433j143j448J565J106r85r60o4Q31O86j233k09K089q55
$$ -2239 1134 2049 -1138 -1103 1330 187 -1261 304 1410 425 -535 -599 232 918 -315 -524 1565 710
983G10l113J549L168k405j891L142K55l763P14L436j012k018J201O12j107m28
$$ 710 -2403 -854 2314 -91 -1982 1160 1415 -2348 -1634 1802 790 -1228 -27 585 -522 -950
999i50Q49J210K77k124p09K543k25k707K228K942l803k714M185J150l881J134
$$ -950 -101 1109 1386 -738 -1447 1096 871 -1836 392 3334 -469 -3183 1002 2152 -1729 -595
1015e95L385k622k928K176J823j053m05K70J31l39j596N09L557n54m236J722L092
$$ -595 2790 168 -2760 -584 1239 186 -219 51 182 -157 -1753 -1244 2313 1759 -2477 -755 2337
1032B337l764j464N881K65n879Q88L914k458j617L626P67k957j097P26J160R31
$$ 2337 -1427 -2891 2990 3255 -2624 -1736 2178 -280 -1897 1729 2496 -461 -1558 -832 328 1259
1048A259j438k96K297j993l999L930M437m766k305N150j187n835L853N402l922
$$ 1259 -179 -475 1822 -171 -4170 -240 4197 -569 -2874 2276 1089 -4746 -893 4509 587
1063E87l081L109q0k485J395K138L52j105k851O2L857q94l168M001K101p301j170
$$ 587 -2494 615 535 -1950 -555 1583 1935 830 -2021 -1959 1898 1004 -2164 1837 3938 -3363 -4533
1080d533P841q30n724L917L080o356j670N870P71k723L20k0p63J0o34J850L632
$$ -4533 3308 2478 -3246 671 3751 -2605 -4275 1595 2366 -357 -37 -57 -820 -810 -1444 406 4038
1097D038l528m901M589K821n870J298P437m368p255N189M208n153J22N032k331
$$ 4038 510 -4391 198 3019 -2851 -1553 5884 1516 -5739 -550 3658 -1495 -1373 3659 1328
1112A328m429J246K138R54J55k093J17J940l392j890P028J497q023O94O452m579
$$ 1328 -3101 -1855 283 1237 1392 -701 -584 1356 -2036 -3926 3102 4599 -3424 -2730 3722 -857
1128h57m222P795K752p807p60M899j528k098K877J317j415k037j725K592L570
$$ -857 -5079 2716 5468 -2339 -3099 1800 272 -1826 1051 2368 953 -1084 -2809 -217 3353
1143C353l417k255N220j314p304L997P561n455m607O257L17o836K331O035k232
$$ 3353 -64 -2319 2901 1587 -5717 -1720 5841 386 -4221 2036 2353 -4483 -2152 3883 1651
1158A651l418J096P22l60k19J4K557P48n365q61O422q21n722M392M325p420k903
$$ 1651 -1767 -671 51 -309 -528 -514 2043 2791 -2574 -3435 2987 2166 -3556 836 5161 -2259 -5162
1175e162P783P49o014J880L868l591k790K883K309o42k059q71K327K80l676J605
$$ -5162 2621 3370 -2644 -764 3104 -487 -3277 -394 1915 1273 -786 -1657 670 950 -2726 -1121
1191a121N518l434n740M851L807o083o47O890j587o334K458M276k464j985K176
$$ -1121 4397 963 -4777 74 3881 -2202 -2849 4041 2454 -3880 -1422 2854 390 -1595 581
1206E81J153j829j978R32L337n92m076J601L842l865l161N800K203o413m27N656
$$ 581 1734 -95 -2073 -1141 2196 1604 -2472 -871 2971 -894 -4055 1745 3948 -2465 -2892 2764
1222B764j715m423L187L472l218k528K311J860j442j759J654K279k364l088L231
$$ 2764 1049 -3374 -187 3285 67 -2461 -150 1710 268 -1491 163 2442 78 -3010 221
1237B21L104m148k045M899L97n443J052N160k090m123K574K821k915j936K779
$$ 221 3325 -823 -2868 2031 2428 -3015 -1963 3197 1107 -3016 -442 2379 -536 -2472 307
1252C07J783k380j920K262K033k563j838L445J496m209p63M551k02m376J364L862
$$ 307 2090 -290 -2210 52 2085 -478 -2316 1129 2625 -1584 -2347 2204 2002 -2374 -1010 2852
1268B852k220l189K484K546k652j917K520J594k663j470K784J306l042j087L354
$$ 2852 632 -2557 -73 2473 -179 -2096 424 2018 -645 -2115 669 1975 -1067 -2154 1200
1283A200M78l511J86L689q85l514J479L228j989k584K307K202k499j849K682J555
$$ 1200 1678 -1833 -1647 2042 1157 -2357 -878 2350 361 -2223 84 2286 -213 -2062 620 2175
1299B175k849j091K926P49l125l34L066j31l065N23K935r74k863J420K613j852
$$ 2175 -674 -1765 1161 1910 -1215 -1549 1517 1386 -1679 -1156 1779 805 -2058 -638 1975 123
1315A23k236K042J896k225j573K561J153k615q25K759N48k794j5K713l19k707
$$ 123 -2113 -71 1825 -400 -1973 588 1741 -874 -1699 1060 1608 -1186 -1201 1512 1193 -1514
1331a514O90K649j055k450J366K173j702j989J963J670k184j436K341R72k398
$$ -1514 -824 1825 770 -1680 -314 1859 157 -1832 131 1801 -383 -1819 522 1494 -904
1346i04p02K584L21k619M6K561k94k549O68K512j014k276J474K065j694j813J927
$$ -904 -1606 978 1299 -1320 -1274 1287 993 -1556 -888 1624 610 -1666 -192 1873 179 -1634 293
1363B93J472j995j250K127Q93k177p44K220N03k463j97K484j18k689O72K574j081
$$ 293 1765 -230 -1480 647 1540 -637 -1381 839 1342 -1121 -1318 1166 1048 -1641 -969 1605 524
1380E24k416J421K070j749j527J876J304j876j097J852J069j870q66K163P13k483
$$ 524 -1892 -471 1599 -150 -1677 199 1503 -373 -1470 382 1451 -419 -1285 878 1591 -892
1396h92m89K778Q7k999N77K856j313k623J861K168k197j635K011J125j895r15
$$ -892 -1381 1397 1484 -1515 -938 1918 605 -2018 -157 2011 -186 -1821 190 1315 -580 -1495
1412a495J936R27j966j112K149J087k459o40L111Jl509P60L425j448k832K202
$$ -1495 441 1368 -598 -1710 439 1526 -933 -1573 1538 1539 -1970 -1210 2215 767 -2065 137
1428A37K044k654j419K555J025k009q52J600P14j802r82K365J227k962j150L512
$$ 137 2181 -473 -1892 663 1688 -321 -1173 427 1141 -661 -1643 722 1949 -1013 -2163 1349
1444A349J22l796J262L891k365l471K928K358k940j038L030K92k758l33K125Q85
$$ 1349 1471 -2325 -1063 2828 463 -3008 -80 2278 -662 -1700 1330 1622 -1136 -1469 656 1541
1460A541j681j042K000Q34l220o25M398J64m765J038M167k940l328M440K221m422
$$ 1541 -140 -1182 818 1652 -1568 -2193 2205 2369 -2396 -1358 2809 -131 -3459 981 3202 -1220
1476a220j194L443j55k365R01K064k43k219j085K399J844k926q29M058p98n460
$$ -1220 -2414 1029 874 -1491 -590 1474 1231 -988 -2073 326 2170 -756 -1585 2473 1675 -3785
1492c785K443N478l579l670M642J012n398N30M997q17l190O53J175o72q11J03
$$ -3785 -1342 4136 557 -3113 1529 2541 -2857 -2327 2670 1853 -1337 -684 491 -181 -992 -889
1508h89K496P79m338j286N146k07m928L450M587o112l762O705J629n484J510M219
$$ -889 1607 2386 -1952 -3238 1908 1701 -3227 223 4810 -1302 -5064 1641 3270 -2214 -704 3515
1524C515l580l242K818K217m09j048j154R77P47l209O42O041j946o994L458M792
$$ 3515 -65 -3307 -489 1728 1319 271 -883 94 841 -2368 -1726 4315 2369 -4625 -1167 3625
1540C625n876j380Q117j054p894K191M686k934j070L620k00k619j069o1L003K090
$$ 3625 -2251 -3631 4486 3432 -4462 -2271 2415 -519 -1589 2031 1831 -788 -1857 -1918 1085 3175
1556C175l936p39M464l213n373O892N083p973k222P164k660o112N941M874n559
$$ 3175 -761 -1500 2964 -249 -5622 1270 6353 -1620 -3842 3322 662 -5450 491 5365 -194
1571a94k538K765l67p55J420M59J073p70n042J117O783k543m933O100J481r457
$$ -194 -2732 33 -334 -1089 331 790 1863 1093 -3949 -2832 3951 1408 -3525 2575 4056 -5401
1587e401J063R802k880o185M957J600o513O18N443k25j727r27j558J557J084k724
$$ -5401 -4338 5464 2584 -3601 1356 2956 -3557 -2939 2504 2279 552 -375 -1933 -376 708 -2016
1603b016K672M621o355n245P773K318p573L056P157p040n928P335K779n022J289
$$ -2016 656 5277 -1078 -6323 1450 3768 -3805 -749 6408 -632 -6560 775 3554 -1468 -179
1618a79L038l199k029J123J313K740n62m835J581L648n115j149Q861j015r662
$$ -179 2859 -340 -2369 -1246 67 2807 2245 -2590 -1009 2639 -2476 -3625 5236 4221 -5441
1633e441L183O562o102k104Q030m57p342J079L821j245j22J081l68L26k106k582
$$ -5441 -2258 4304 -1798 -3902 4128 3671 -3671 -2592 1229 -16 -138 943 575 901 -1205 -3787
1649c787M849L766o211j525O633l058o791O797N760p573k688O348j518m801L735
$$ -3787 1062 4828 -1383 -2908 3725 667 -6124 673 6433 -1140 -3828 2520 1002 -3799 -64
1664f4L478k725j994j47O94J867r90j683L707K60o760J362P597l330n475N946
$$ -64 3414 689 -1305 -1452 -758 1109 119 -1564 2143 2403 -4357 -2995 4602 1272 -4203 1743
1680A743K226p917L48P443j567m722K444J834k800p46J817J696N0l118j204M041
$$ 1743 3969 -3948 -3600 3843 2276 -2446 -2 1832 -968 -1714 103 1799 1849 -1269 -2473 1568
1696A568n7m596K993M808n602m149O593J831o256J303N307l313m170L331K663
$$ 1568 1511 -3085 -92 4716 -886 -5035 1558 3389 -2867 -1564 3743 430 -3740 -409 2254
1711B254j964j241R32J007o57k309J143L996j988m491L242L406m990j477O241
$$ 2254 290 -951 -19 988 331 -1978 -835 3161 1173 -3318 -76 3330 -1660 -3137 3104
1726C104m43o017J730M541k779k727L209J642k816j548J886J866j288k185J782
$$ 3104 2661 -3356 -1626 2915 136 -2591 618 2260 -556 -2104 -218 1648 360 -1825 -43
1741d3K356k997k388M351J826m958m39M991j335m529K718L749l202k642K916J615
$$ -43 2313 -684 -3072 1279 3105 -1853 -2292 2699 1364 -3165 -447 3302 100 -2542 374 1989
1757A989k588j106K366J213k378j648K649J570l169j081L897J14m313R30M124
$$ 1989 -599 -1705 661 1874 -504 -2152 497 2067 -1102 -2183 1714 1828 -2485 -1555 2569
1772B569j725l534K589K609k962j813L001J418k909r93K674Q25k781n19K979K86
$$ 2569 844 -2690 -101 2508 -454 -2267 734 2152 -757 -1750 924 1749 -1032 -1551 1428 1714
1788A714l312J63L462r18l356J629L042k371k518K660J941k916j300K933Q89k961
$$ 1714 -1598 -1435 2027 1109 -2247 -618 2424 53 -2465 195 2136 -780 -2080 853 1742 -1219
1804a219n23L024J30k958K97L017p05k921J154K740j551k525J999K228k375j772
$$ -1219 -1742 1282 1412 -1546 -1249 1768 1063 -1858 -704 2036 485 -2040 -41 2187 -188 -1960
1820a960K652J323k847q57K851L72k934N0K796l93k770Q60K608j246k400J548
$$ -1960 692 2015 -832 -1689 1162 1534 -1400 -1350 1446 1053 -1717 -857 1751 505 -1895 -347
1836c47K184j948j758K136J559k424j087K620P03k700k28K666j91k643N86K520
$$ -347 1837 -111 -1869 267 1826 -598 -1685 935 1638 -1062 -1290 1376 1185 -1458 -872 1648
1852A648r06k385J252K103j560j950J905J629k192j372K417J010k594n09K595
$$ 1648 742 -1643 -391 1712 152 -1798 107 1736 -456 -1828 589 1599 -995 -1504 1091
1867A091P3k523L57K370o13k196Q91J955j063j824J298J827j545j670J793J481
$$ 1091 1164 -1359 -1002 1368 755 -1441 -550 1405 342 -1482 -184 1643 98 -1572 221 1702
1883A702k232r97K518M49k629nK565n72k207Q85J828j066j545R73J470r54j483
$$ 1702 -530 -1527 991 1440 -1189 -1194 1371 799 -1408 -523 1305 239 -1306 -333 1137 183 -1300
1900a300J072J568j540j449K068J305k399q94K712J18k667P36K364j222j878J300
$$ -1300 -228 1340 -200 -1649 419 1724 -675 -1569 1143 1261 -1406 -670 1694 472 -1406 -106
1916a06J340j168r40R74R19j016j251R81J594j250j642J912J166k676m62L083
$$ -106 1234 66 -874 100 1019 3 -1248 -267 1327 77 -1565 347 1513 -1163 -1625 1458
1932A458l02k827J078K029j559j250J759P63j229n79N13P93l40j099Q09J496j554
$$ 1458 1156 -1671 -593 1436 -123 -1373 386 1149 -80 -659 -146 647 307 -792 17 1513 -41
1949d1j833K319J386k811k31K963j099k732J773J981j831r14J556j15j039K8P45
$$ -41 -1874 445 1831 -980 -1211 1752 653 -2079 -306 1675 -156 -1070 486 371 -668 -640 105
1966A05O46k54j504L84J793j327j444K637J002l577k1L284j141k265K273J232
$$ 105 751 497 -1007 -623 1170 -157 -1601 1036 2038 -1539 -1560 1724 583 -1682 591 1823
1982A823k660n03J837N7o46J34k2R9j42j204Q58K296j746k061K440O95l195R76
$$ 1823 -837 -1340 497 554 -92 42 20 119 -23 -1227 -369 1927 181 -1880 560 1255 -1940 -964
2000i64L475j914k723K266J018k237N54J943p74j084K1p4R08M52j402M47J494
$$ -964 2511 597 -2126 140 1158 -1079 -525 1418 644 -440 -419 -493 415 867 -535 -88 1406
2017A406k129j564L532P84l556P09K763k518j919L426R83k682O7J340j105k40
$$ 1406 -723 -2287 1245 2029 -1527 -818 1945 -573 -2492 934 1917 -765 -698 642 -463 -703
2033g03Q89K72L57m09j940Q76K158j620j120L114m23m106J539L409k217j542K911
$$ -703 186 458 815 406 -1534 -658 1500 -120 -1240 1874 1451 -2655 -1116 2293 76 -1466 1445
2050A445k94l151R77K101o56l71J43p12K77P0r01J507J735k857j501L219j62l038
$$ 1445 1151 -2000 -1023 1078 422 51 194 -518 -241 -171 -1072 435 2170 -687 -2188 1031 869 -2169
2068b169K406K778l700j779L323K24k303J533J463j946q13N49L34R67o8j582Q27
$$ -2169 237 3015 -685 -2464 859 1083 -1220 313 1776 -170 -983 -434 -100 867 799 -783 44
2085D4R11k479k8L846p60l805J978K087l338l58M007n92l098R46J259j283K67
$$ 44 955 -1524 -1552 2294 1534 -2271 -293 1794 -1544 -1902 2105 1513 -1585 -639 620 -663 -396
2102c96J128j31j45q83j212J898J503k411q1K780k002l131L451K373l545m98L016
$$ -396 732 601 456 -427 -1639 259 1762 -649 -730 2050 48 -3083 368 2741 -804 -1302 1714
2119A714j574k595K457J732j558o22L20l39L23j6k16J614J1l140N52L265j640
$$ 1714 140 -2455 2 1734 176 -446 -126 -465 -142 -158 -374 1240 1251 -1889 -1337 1928 288
2136B88k130L328O98m350K55L859j207k068K050O12k328k37J450L79R7q68p48
$$ 288 -1842 1486 2184 -2166 -1911 1948 741 -1327 723 1335 -993 -1230 220 599 696 -172 -920
2153i20J316p3k020J670K655k823k339L320N92l314J339L193k401k355K193J024
$$ -920 396 323 -1697 -27 2628 -195 -2534 786 1378 -1936 -597 2596 195 -2160 33 1057
2169A057j517K63J042l65o95p73L98J959m89k218J360J591k856p67L912j64l698
$$ 1057 -460 -197 845 480 -215 -988 -590 1369 880 -1338 22 1613 -1243 -2010 1902 1738 -1960
2186a960J213K485k367j194K785O02k288k58J014K29l93k68O73R56j538j547K291
$$ -1960 -747 1738 -629 -1823 962 1564 -724 -982 32 261 -132 -400 273 1229 -309 -1856 435
2203D35J420k734l26L049j136l099K222K389k465j175K162J41j961K80J587lj129
$$ 435 1855 -879 -1205 1844 708 -2391 -169 2220 -245 -1420 742 883 -1078 -798 789 786 -343
2220c43o20R51Q60j351o51K280K08k991N27K899j275k270K227J401k686p41K516
$$ -343 -963 -12 848 -503 -1154 1126 1334 -1657 -1130 1769 494 -1776 451 1852 -834 -1575 941
2237I41K00j894K43J300k77j287J0J553K48j839k00K097m46k255J219K234j910
$$ 941 1141 -753 -510 790 513 -774 -764 789 1037 -802 -1002 1095 649 -1606 -387 1847 -63
2254f3j845K294J101k365k76K279k49j955L04J670k35j453K88J465l74j789O64
$$ -63 -1908 386 1487 -878 -1154 1125 876 -1079 -775 895 660 -793 -505 960 586 -1203 -539
2271e39K003r96k006J528J651k056j147K302O38k440q1K196l38j868N55J727o74
$$ -539 1464 468 -1538 -10 1641 -415 -1562 740 1378 -1062 -1143 1053 715 -1153 -598 1129 455
2288D55j704P61J625q25j608J216J498j611j316J959R76k075n56K208Q4k187K94
$$ 455 -1249 -488 1137 312 -1296 -80 1418 -193 -1509 450 1426 -649 -1205 1003 1087 -1100 -806
2305h06K080o49j874Q39J643j010j522J193J401j400j223J597J079j835p97J892
$$ -806 1274 625 -1249 -410 1233 223 -1299 -106 1295 -105 -1328 269 1348 -487 -1284 608
2321F08N07k057j08K108k27k035N47J941q00j790J090J635j293j431J501J139
$$ 608 1115 -942 -1050 1058 831 -1204 -657 1284 484 -1306 -216 1419 126 -1305 196 1335
2337A335j660q66J723P27k001l99K093j1j995J93J999n84j883Q32J798j190j518
$$ 1335 -325 -1191 532 1259 -742 -1141 952 941 -1054 -861 1138 554 -1329 -497 1301 111 -1407
2354a407J375J379j604j121J730R16j846n97J988L08k012l4J973k61j977O79J889
$$ -1407 -32 1347 -257 -1378 352 1268 -578 -1175 813 1121 -891 -925 1048 787 -1190 -511 1378
2371A378j029j716J302J464j478j231J618R62j690q23J702O65j858l32J931N6
$$ 1378 349 -1367 -65 1399 -79 -1310 308 1270 -420 -1243 459 1124 -734 -1066 865 921
2387I21k003J85K208o38k055J065J834j512j444J715J075j682q42J723N27j659
$$ 921 -1082 -897 1311 673 -1382 -317 1517 5 -1439 276 1351 -331 -1173 550 1077 -582
2403e82l82J683L44j832l06K016o3k241O30K283j150k155J657J682j927j090K045
$$ -582 -964 719 1063 -769 -1075 941 878 -1363 -733 1550 400 -1755 -98 1584 -343 -1433 612
2420F12N49k014j76J737K23j486k20J439J72j699m0K125j70k432O81K407j538
$$ 612 1161 -853 -1029 708 931 -555 -775 664 836 -863 -903 1222 1052 -1380 -699 1708 170
2437A70j977K258J380k607o66K286N6j831K97J567l86j373j55J510M48j709k00
$$ 170 -1807 451 1831 -776 -1442 844 900 -931 -634 933 547 -826 -981 529 977 -732 -932
2454i32K152m96k646J411K741k099k050K660Q12k938J84K789o30k052O65J044
$$ -932 1220 724 -1922 -511 2230 131 -1919 741 1553 -1385 -1201 1588 958 -1094 -429 615
2470F15m04p12J41J137J96k144j71K713m88k633J689K304l082j684L640O14l122
$$ 615 211 -501 -360 777 973 -1171 -1342 1371 883 -1750 -61 2243 -839 -2523 1117 1731 -1391
2487a391O29K334j626j507J532J148n59q49l96R31M39j623K45K791j301l255K101
$$ -1391 -762 1572 -54 -1561 -29 1119 560 -289 -685 246 685 -938 -693 2098 797 -2458 -357
2504c57K652l171r46L962o87l833J346K649j552r64J535O6j222l70K74J529M89
$$ -357 2295 -876 -1822 2140 1453 -2380 -1034 1615 63 -901 634 700 -522 -892 -618 911 1400
2521A400k264k27K618j471k689L523K270m392j084M072j036l071K659K292k954
$$ 1400 -864 -1091 1527 56 -2633 890 3160 -1232 -2316 1756 720 -2351 308 2600 -354
2536c54j331J740J90l64L09q1N52j90k528Q38L639j631l027L098J239m720N54
$$ -354 -1685 55 245 -119 190 109 661 471 -2057 -1219 2420 789 -2238 860 2099 -2621 -2067
2553b067N110j576l728K448J355k996K19K615k23j068o19n42J331O37j898J064
$$ -2067 3043 1467 -2261 187 1542 -1454 -1235 1380 1157 89 -530 -1072 259 896 -1002 62
2569F2K552l256k856M542J590m528J044M024l556l189M099J714k906Q9J622j390
$$ 62 2614 -642 -3498 1044 2634 -1894 -850 3174 -382 -3571 528 2242 -664 -575 1047 -343
2585c43p72O32N91J507m63k998Q81K816k705j246M897k97n776J607M405k982j959
$$ -343 -1115 -483 108 1615 1152 -1846 -965 1851 -854 -2100 2797 2500 -3276 -1669 2736 -246 -2205
2602b205M296N7m259M49K466m44j73J91n72M82o56j849K612K741l827j803M257
$$ -2205 2091 2148 -2111 -1662 804 360 187 378 -194 288 -368 -2217 395 3136 -691 -2494 1763
2619A763p52m480L563L964m475k440L961k6l042J952K170j661j380p0L64J660
$$ 1763 1011 -3469 94 4058 -417 -2857 1104 1078 -1964 -12 2158 497 -883 -953 -589 1071
2635A071l63j838J915R95m237J9N422j252m499L026K450m888n85N156l49l630
$$ 1071 708 -1130 785 1780 -2457 -2438 2984 1732 -2767 259 2709 -2179 -2764 2392 2043 -1587
2651a587J116J379j596k29J135O85M29j790j777K654J468l437P00M118l119m130
$$ -1587 -471 908 -688 -917 218 903 1332 -458 -2235 419 1887 -1550 -850 3268 149 -3981
2667c981M280K781m401j58L978j936l315K218K192j208p71J61J72K31j162j18
$$ -3981 299 3080 -1321 -1479 2499 563 -2752 -534 1658 450 -321 -160 12 243 -919 -1037
2683a037L013k08m186J190L756k899k324M642Q90n187L19M141j556k309K281J163
$$ -1037 1976 1768 -2418 -1228 2528 -371 -2695 1947 2837 -2350 -2031 2110 554 -1755 526 1689
2699A689k115r78J049J132K06j646k47K234r86k991K633L120l614k200M105L06
$$ 1689 -426 -1404 -355 777 983 -663 -910 1324 338 -2653 -20 3100 -514 -2714 1391 1697
2715A697m109J412L749k118k788K052J397j520o07J098R60r39j859Q53K540j384
$$ 1697 -2412 -1000 2749 631 -2157 -105 1292 -228 -835 263 1223 284 -1575 -722 1818 434
2731D34k551K623J743l825p51M327l32l887J495K865k350j862K462J334k001j022
$$ 434 -2117 506 2249 -1576 -2327 2000 1668 -2219 -724 2141 -209 -2071 391 1725 -276 -1298
2747a298J320J019j169j207J614J577k385j587L027J037l448P4L607j289l285
$$ -1298 22 1041 -128 -1335 279 1856 -529 -2116 911 1948 -1500 -1426 2181 892 -2393
2762b393K006K559k262j747K327R65k097p58J911Q49j803j013J978R86k512n12
$$ -2393 -387 2172 -90 -1837 490 1455 -642 -1400 511 1360 -443 -1456 522 1508 -1004 -1516
2778a516K954Rl233P11L053j432k560K044K024k420j472K457R61k269o34K162
$$ -1516 1438 1447 -1786 -1075 1978 546 -2014 30 2054 -366 -1838 619 1580 -689 -1323 839
2794H39M23k224l51K441J05k508J48K665p86k646J390K424j827k014K170J538
$$ 839 1262 -962 -1313 1128 1233 -1275 -1127 1538 752 -1894 -504 1920 93 -1921 249 1787
2810A787k402r55K440N95k396l25K374Q1k346K30K299n38k301Q33K283j230k172
$$ 1787 -615 -1570 870 1465 -931 -1256 1118 1199 -1147 -917 1382 844 -1457 -624 1659 429 -1743
2827a743J614J869j957j506K204J192k427p44K372L36k357L6K368l80k281P01
$$ -1743 -129 1740 -217 -1723 481 1673 -754 -1498 874 1210 -1147 -1111 1257 877 -1404 -703
2843g03K129r22k029J221J874j522j649J850J355k123r37K204O51k317k39K289
$$ -703 1426 504 -1525 -304 1570 48 -1601 249 1604 -519 -1456 748 1399 -918 -1157 1132
2859A132j92k179M69K084p98j938J030J850j268j676J469J530j755j311K048R09
$$ 1132 940 -1239 -770 1314 516 -1422 -392 1458 190 -1486 -17 1513 -242 -1553 495 1404
2875A404k206n15K318O7k208K80K064o08j834Q32J662r36j583J059J614j296j501
$$ 1404 -802 -1317 1001 1068 -1140 -860 1204 596 -1238 -406 1256 320 -1263 -204 1410 114 -1387
2892a387J536J380k029r63K215N63k399m9K326m95j973Q21J734j083j371R57J236
$$ -1387 149 1529 -500 -1463 752 1315 -1084 -1133 1193 698 -1275 -454 1280 197 -1174 -217 1019
2909A019q75j195J007J293j191j491J659J290k079p62K376R6k576O54K283j109
$$ 1019 144 -1051 -44 1249 58 -1433 226 1516 -563 -1325 1051 1147 -1429 -775 1508 399
2925C99j677J281J060j323o90J065P79p71j029O62J227j033j260J756J096k430
$$ 399 -1278 3 1063 -260 -950 115 894 123 -906 -244 983 -50 -1310 446 1542 -888
2941h88o42K715j86k431J140J915j798j264J788N91j230j48O69J71m57p61O66
$$ -888 -1530 1185 999 -1432 -292 1623 -175 -1439 349 940 -290 -438 231 402 -55 -816 -150
2958a50J429j121j610J732J094k491j29L053j017k723J656J662k006l82J940k60
$$ -150 1279 158 -1452 280 1374 -1117 -1246 1807 790 -1933 -277 1385 -621 -1003 937 677
2974F77j442L18M49K93J95q37J12J237j202j499K341J198k913j03K821j493k219
$$ 677 -765 -447 2 295 490 -347 -235 1002 -200 -1699 642 1840 -1073 -1176 1645 152 -2067
2991b067K582J313k528k82J692o99p76J056L1j02Mj204K64J962j013j577K252
$$ -2067 515 1828 -700 -982 710 11 -765 291 322 220 224 -980 -716 1246 233 -1344 908
3008I08M83l280O83L277j730j995K540K84k782Q22K021r16n70N62p29N2P24r21
$$ 908 1391 -1889 -1206 2071 341 -1654 886 1170 -1612 -790 1231 315 -255 307 -422 -370 354 -567
3026e67N15J643j804j864K703O87k932J369K625k808j929L121L95k278J240J142
$$ -567 -52 1591 -213 -2077 626 1313 -1619 -250 2375 -433 -2362 759 1154 -1124 116 1258
3042A258j769l42R52k53O09N38j623rJ703j700r11L260q0l637J321K440k577p82
$$ 1258 -511 -853 99 -154 455 993 -630 -639 1064 -636 -1547 1713 1633 -2004 -683 1757 -820 -1602
3060a602L359n54k779J068J118j171M89Q98r31K04O6j499J176K013k007j170K662
$$ -1602 1757 1203 -1576 -508 610 -561 -72 826 -105 99 165 -1334 -158 1855 -152 -1322 1340
3077A340p98k916K409K476k972r40K685j067j937J966J101j532K1J79q11Q44N55
$$ 1340 542 -2374 35 2511 -461 -1401 1284 217 -1720 246 1347 -185 -164 15 -796 48 603
3094F03j152Q96J001k551n41L195n27k592K161J361l353j72L203q11j736J490
$$ 603 -549 347 1348 -1203 -1744 1451 924 -1668 493 1854 -1499 -1671 1532 721 -1015 475
3110D75K22j586M35P46j74O25l56j606J036J206j971K79K716j623k682K371J394
$$ 475 697 -889 -454 292 118 743 387 -1219 -183 1023 -948 -669 2047 424 -2258 113 1507
3127A507k632L81K580j543j976J615O79q96M46K84o59K04k42o46J616O31k308
$$ 1507 -1125 -744 1836 293 -1683 -68 611 -285 161 445 -214 -10 -252 -898 718 1349 -959
3144i59J44K186j671j459K797P85l024K18K175j323j112J862M08j401l7K51l0
$$ -959 -815 1371 -300 -1759 1038 1823 -1201 -983 1192 -131 -1243 619 1027 -374 -411 -160 -190
3161a90O02k95o24J139j23j968R90K174j680j443K296R2k581R17K313j298j373
$$ -190 412 117 -507 632 509 -1459 -469 1705 25 -1418 878 970 -1611 -694 1619 321 -1052
3178a052J318L07j171L12O76K3r2p54k71J224p4j390J048J400k182q48K473N2
$$ -1052 266 573 -598 -286 390 413 321 -433 -704 520 446 -944 104 1504 -678 -1526 947 999
3196I99k177R28J675j681j070J615M96r83p4N08k0k62l71L15J064p19j366J221
$$ 999 -1178 -250 1425 -256 -1326 289 785 -198 -272 236 216 -46 -417 -102 962 243 -1123 98
3214I8R84j753k55K166m49k189J063J518j360p86J522K07j345l6Q12K25m45l59
$$ 98 1082 -671 -926 1240 791 -1398 -335 1183 -177 -963 559 766 -579 -615 197 422 -23 -382
3232c82M58M74q39o27J429N27j740o9J775o46j567J239J304j553p70J358K50j155
$$ -382 76 550 -289 -916 513 1040 -700 -769 1006 360 -1207 32 1336 -217 -987 371 621 -534
3250e34J34Q52O7q91k49R18K68r13l27J366j31j503M52J566q83j269J259Q03j456
$$ -534 -400 452 519 -372 -621 297 565 -348 -675 691 560 -943 -491 1075 192 -1077 182 985 -471
3269d71l74J457J36j232lJ019j15q50P3R31n8j146J03J242l45j252O53J233j088
$$ -471 -845 612 748 -484 -487 532 417 -433 -360 571 513 -633 -530 712 367 -885 -232 1001 -87
3288h7r19J255O49j410j92J312o6j203K32J059k62r63K71R20l81r79O04R90p79
$$ -87 -1006 249 898 -512 -704 608 542 -661 -429 630 368 -595 -324 596 215 -764 -160 830 51
3307E1r40J002P88j188n44J249L07j280l9J300k93j048K92R85m48r32N44R30o99
$$ 51 -889 113 901 -287 -831 418 725 -555 -594 706 413 -635 -343 642 194 -738 -194 736 37
3326C7q12Q13P18r37n74J021M23j086k62J209R2j257J92J121l31j121N85R25o27
$$ 37 -775 38 756 -181 -755 266 689 -397 -659 550 642 -615 -423 698 367 -754 -169 756 129
3345A29q03P37O15q12n75R24M54r55l35J009J45j068M7J066l22q79L17R89n57
$$ 129 -674 63 678 -134 -709 215 669 -286 -621 388 533 -535 -488 578 256 -623 -306 683 126
3364A26q31P60O71q43n83R35L93q92l46R58K46j024l7R62l4j089K64J032m58r34
$$ 126 -705 55 726 -117 -700 235 628 -264 -610 348 594 -430 -467 495 461 -628 -364 668 210 -724
3384g24N75P85p51n53Q35M15p92l97Q41K73q64p3Q07P3r43J12J003l57r45N62
$$ -724 -149 636 -115 -668 167 582 -210 -607 234 507 -357 -430 377 450 -493 -381 622 265 -680 -118
3404a18Q23o74p06Q71M04q65k40R22m1o88k9O43K9o47k4O80Mq62J70R86m18r41
$$ -118 705 31 -675 196 600 -265 -505 417 376 -312 -341 302 331 -316 -340 340 344 -518 -348 638 220 -721
3426g21O96P47r23m91J078R3r14P4P60k42m34J08N10j02n41j18P41O4q52J84R90
$$ -721 -25 722 -201 -692 386 479 -435 -361 399 157 -277 -169 341 239 -302 -420 321 385 -467 -283 707
3447G07o88q85R82O84j224j06J069k52q66M58N99l98l94K48K00J7l26k3O43j09
$$ 707 19 -866 116 800 -424 -530 539 287 -579 -121 478 80 -314 -66 134 151 -175 -198 445 336
3467C36r43L36J000q17o95J271K02j412K57J126n93o20P15K06o47o0L90M1P5k79
$$ 336 -607 -271 729 -88 -783 488 690 -722 -465 661 68 -552 163 369 -278 -338 52 93 168 -111
3487a11k56O02k7q61O36R07j058p00J324L9j290P06J006j044n64R59nn21L72Q7
$$ -111 -367 235 208 -653 -17 890 -168 -868 456 495 -795 -89 917 -127 -691 268 263 -258 114 201
3507B01k56J43k64j88Q60n9j010N73P37j256k74J586k39j414Q05P40j255O5J093
$$ 201 -55 88 -176 -364 496 437 -573 0 737 -519 -793 793 554 -860 -55 685 -570 -505 588
3526E88l19o19L70j05j27N22k56k96P47m19r71R35Q74j290p4J257p85j158J357
$$ 588 269 -350 20 -85 -212 310 54 -242 505 86 -885 50 924 -366 -440 817 32 -1126 231
3545B31N84j230J47Q05p44l00P02J4j19K36n85k69R39l28o61J006L56j569J62
$$ 231 815 -415 -268 537 -207 -507 195 209 90 326 -259 -528 411 83 -578 428 784 -785 -623
3564f23J493p84q30J341rj429M57Q71n40p6N10m75k04M47m25P2R74o68r08J042
$$ -623 870 86 -744 597 588 -841 -384 487 -53 -129 381 -94 -298 149 -276 -204 770 102 -806 236
3584B36K41j250O54J252j325p52J355r2r51P90N19q56j47L93k81K85M07o45j8
$$ 236 477 -773 -119 1133 -192 -944 411 319 -632 158 677 -179 -326 67 -214 71 478 -167 -185
3603a85O24p74m05J364pj365O53Q35j280j48J417l06j005N77K73o41K63M59l47
$$ -185 439 -335 -740 624 617 -748 -95 740 -540 -688 729 423 -582 -5 268 -373 -110 349 2
3622BO1J29p30M00Q02q39k32J067m19j245J046Q75j231q8J061o32p22Q28L35o08
$$ 2 63 192 -538 -138 664 -175 -407 660 241 -1004 42 917 -314 -402 659 27 -695 133 468 -140
3642a40K14O0m36L32J24m41N09L55j063n6J139m38q05R66L92j282L0J084m33n03
$$ -140 74 134 -302 30 154 -287 222 577 -486 -542 597 159 -646 320 712 -570 -540 544 111 -392
3662c92O49J8n95J65J38k7L51k04m54L95K87q30K87J016p60q01J010K31j089M94
$$ -392 257 275 -320 -155 -17 -44 307 103 -351 44 331 -499 -212 804 44 -757 253 484 -605 -111
3682a11P57o92m55N47R4k94K48j1q4J01k16j90O38K4q30L90O58q18l50J045J2
$$ -111 646 -46 -501 46 140 -154 94 83 -1 100 -116 -306 332 356 -474 -84 574 -244 -594 451 463
3703D63r52K66O55n48k87O28Nk90m7M3R3J51k68m4M82k68n58M53N95p83k60Q90
$$ 463 -489 -223 432 -116 -403 225 230 -60 -107 -64 29 180 -88 -132 350 82 -476 -23 572 -211 -471 419
3725D19p2q45L91O27n44l20M46J35l25j12K20J66o8l47J02M16l30l70N17L45p55
$$ 419 347 -498 -107 520 -24 -344 102 237 -88 -200 20 186 118 -229 -127 289 -41 -411 106 451 -304
3746c04j07Q41j87o76M10M84n60l07M81K20l58p9J91J70k89k81L71L60m41k96
$$ -304 -411 430 243 -433 -23 461 -99 -406 75 295 -63 -142 49 219 -70 -351 20 380 -61 -357
3766c57O26No14P7O47k45o04L74M44m00k95M19K38m36j68K96K64l55j87M03J87
$$ -357 269 274 -340 -263 384 139 -465 -91 353 -47 -342 77 315 -121 -289 7 271 -84 -271 132 319
3787C19m77j04N77No42O8O57l23m47L57M23m26k87L82J85m17j22M53M2l20j29
$$ 319 -158 -262 315 320 -322 -254 403 80 -367 -10 413 -13 -300 82 267 -150 -272 181 223 -97 -226
3808b26M04Q6m85JM86j33m56K31M37l00m17M00K74m40j67M22J49m33o0M30L3m65
$$ -226 178 264 -221 -220 266 133 -323 -92 345 45 -372 28 302 -138 -305 117 266 -167 -227 203 236 -229
3830b29MM46m9l93J17L84j65m81K96M08l18l94L79L03l66k14M49P1m56K2M31o8
$$ -229 -225 221 172 -221 -104 280 115 -366 -70 338 20 -374 5 308 -58 -272 177 248 -208 -186 245 177
3852A77m23O6M76j48m20K12M19l40l01K83K95l42k38M12J62m40j2L42K5m41l7
$$ 177 -246 -180 296 148 -272 -60 359 19 -282 1 296 -46 -284 128 290 -150 -162 180 205 -236 -273
3873b73M88r7l31Q2L55j36l20J66L64k57l41K98L15l57k10L90P3m02K1M28j22
$$ -273 215 118 -213 -131 224 88 -232 -66 298 41 -300 -2 313 -44 -254 136 209 -193 -172 256 134
3894A34l35K0L37o9l70J66L68j89l54K06K98k22l27M16K22m31j49M38J0l89N6
$$ 134 -201 -181 156 87 -283 -117 251 62 -292 -86 212 -10 -337 79 301 -130 -279 159 169 -220 -164
3915a64M04j56k84O2L34k4l91Q9L44r4l61J91L53l27k60M26J67n22m4N01q3l61
$$ -164 240 84 -200 -138 196 172 -219 -130 214 120 -241 -50 303 -24 -284 142 309 -213 -257 244 161 -200
3937b00J39K07j23j65L4K04m0j45j03L71q5l86J94M62l72l26M96R7n08K6N28k03
$$ -200 -61 146 23 -142 -108 96 56 -89 -192 179 94 -292 -98 364 -8 -334 162 259 -249 -223 305 102
3959A02l07K30J05j50o0N8M0P3j81j05L49M1m53J49N34m95l29O25Q1n71J84L65
$$ 102 -205 25 130 -20 -80 -22 18 91 -90 -195 154 195 -258 -109 425 -70 -399 226 307 -264 -80 285
3981B85l49j86K87N0j24L4m8l8K19k06j63M81j6o53K72N78n21k31O36m6o55K30
$$ 285 -64 -250 37 87 -37 -3 -51 -89 130 -76 -239 242 226 -427 -155 423 -98 -329 307 261 -394 -164
4003a64M36l00j29K53o4p7O8j28Q8L60l91k56N52p7n80L78N93p68k24O60k0o14
$$ -164 272 -28 -157 96 32 -45 23 -105 -17 343 -48 -304 248 171 -409 -31 562 -206 -430 230 210 -404
4025d04L88L90m53k42L96r6M5J63k59M8K09l89j28O57rp43L21N61o71k77Q91j08
$$ -404 -16 374 -79 -321 75 -21 24 187 -72 -24 185 -204 -332 325 316 -427 -106 455 -216 -493 398 290
4047B90p05K87M28m68j3L09p7o6J9k30K12L85n28j20O95k92p50O21N59p90j28
$$ 290 -415 -128 300 -168 -181 128 51 -15 4 -226 -14 371 -157 -277 418 126 -624 -3 556 -234 -362
4068c62Q14k81o69M68M46n10KK05j57j3P3j95K28K80n58j00P58k98o94P21M85
$$ -362 452 171 -498 -30 416 -94 -92 113 -44 -57 16 -179 49 329 -229 -329 429 131 -563 158 643
4089F43j041j19R72k85o44N80K84n26j37K91K8Q3p8k14K43J13n15L8Q64m15p46
$$ 643 -398 -517 455 170 -474 106 390 -136 -273 18 46 129 51 -163 80 193 -322 -284 580 165 -581
4110e81O55M07r45R4R30l39p84N20L38m40KK57N4j57j43j31M55M7n86K76N39n79
$$ -581 74 481 -464 -370 560 221 -563 -43 295 -145 -143 114 168 11 -132 -263 192 239 -347 -71 468 -111
4132a11n66R41L83j044J07P64m46o17O69M29o14j30L80p1j02n7N8L46j62n89L20
$$ -111 -677 264 647 -397 -290 474 28 -589 80 509 -105 -235 145 74 -28 -85 -27 319 157 -432 -112
4153a12N91o16l50Q37Q6j011J01J060m97n98O82K86p07j34N25O6j95j23O1K44
$$ -112 479 -137 -487 350 436 -575 -474 586 89 -509 173 459 -248 -382 143 209 14 -109 -48 196
4173A96l07k95N15L92o77m29R34O0r03L57Q49o66o20P06L32o75k8O07n7n04j3
$$ 196 -111 -406 109 501 -176 -605 329 389 -514 -157 692 26 -594 112 444 -231 -259 348 291 -213 -226
4194b26L27J52k48k89M59J49o78r0R13j50r22M39P47p16n05R37J74p77j4N58q8
$$ -226 101 253 5 -284 175 324 -354 -444 469 319 -603 -164 583 -133 -638 299 473 -304 -318 240 152
4215A52n33K14L27Q2m57j06N32J71p08qQ07l38q62O37P75p84m41Q56J12q51K8
$$ 152 -381 -167 160 242 -215 -321 211 382 -326 -334 473 135 -727 -90 685 -99 -540 316 428 -423 -395
4236c95P65o3n78O1M44j11l39K7M84r7n86J26P34m05o51O85N10q58l55R77Kp78
$$ -395 370 307 -271 -210 234 123 -216 -189 295 198 -388 -262 472 67 -584 101 611 -247 -602 375 377 -401
4258d01R7P03k99m84K54M78k80m14K01N23k78n69L97O58o05m73O24L52q49j16
$$ -401 -304 399 100 -384 -130 348 68 -346 -145 378 100 -469 -72 586 -19 -492 132 484 -365 -481
4278d81R79j73p55K11O66l73m95L57M71l86l99L69L72l18m85M29M49o49k59P85
$$ -481 498 325 -430 -219 447 74 -421 -64 407 21 -378 -9 363 45 -440 -11 438 -211 -470 315
4298C15Q9q08N8Q05k71o71L11O25l52n25M69L57m24m28N24L01m58k76N54J79o63
$$ 315 404 -404 -346 459 188 -483 -172 453 101 -424 45 402 -22 -450 74 375 -83 -359 195 374 -289
4319b89r8P26n3p47K23P63l67o40M01N03m61m55O05K97n39k48N02K69o34j56O36
$$ -289 -387 339 286 -461 -238 525 158 -482 -81 422 -39 -494 111 408 -131 -379 123 392 -242 -398 238
4340B38L2n87M3O90k32o45L11O55m26n92N47M13n65l44O34K52n97j46N64J09o02
$$ 238 270 -317 -274 416 184 -461 -150 505 79 -513 34 447 -118 -462 172 424 -173 -319 245 354 -248
4361b48K8N23j09n29J57N74k69n74M00N19n24l50N53K65o28j79O50R9o16n3N82
$$ -248 -220 303 194 -335 -178 396 127 -447 -47 472 -52 -402 151 416 -212 -391 259 358 -258 -311 271
4382B71k1n59N4O10j68n65K70N20l70n29M59N14o72j79N95J63o71kN22j4n02P9
$$ 271 250 -309 -255 355 187 -378 -108 412 42 -487 -28 486 -186 -365 230 393 -278 -280 242 228 -274 -195
4404a95M87j15m88J44N72k79n71L63N51n31m39O33K97o66j09O69n0o50J45N45
$$ -195 292 177 -311 -167 405 126 -445 -82 469 -62 -501 132 429 -237 -346 323 273 -377 -232 313
4424C13j80m29J45L98j53m37J28O26l02n80L41O00n75l76P49J52p64J0P31k60
$$ 313 133 -296 -151 247 94 -343 -215 411 109 -471 -130 470 -105 -481 268 420 -344 -334 397 137
4444A37m67K71L53k90l19K50L29j13l55NN32k11o03N49N25q05l08R13j01p45L09
$$ 137 -330 -59 294 4 -315 -65 264 151 -204 -199 333 122 -481 68 593 -212 -520 393 292 -453 -144
4465a44O01m43m18M82J00k37j9N4J55J3l85J9N98j98o70N81M71r23p9R97k61q15
$$ -144 457 14 -404 78 178 -59 -78 -24 131 144 -241 -222 376 178 -492 89 560 -363 -442 555 294 -521
4487e21M97M56o45j15N59o7k48K4q5K05J47m54P5O19l56p68Q19M70j036P6R36
$$ -521 -24 432 -213 -328 231 164 -84 -60 -145 60 207 -247 -172 447 91 -677 142 612 -424 -348 588
4508E88n04p93Q11L61o83O7M01l12r2J81j02J86J92o46J0Q03m24o25R58K43j232
$$ 588 84 -709 102 463 -220 -153 248 -64 -156 25 -77 109 301 -345 -335 468 44 -581 377 620 -612
4529f12K27J037o07o38R61K7q61K69M32l42J60J49l58J32K23n58J68Q71o64p01
$$ -612 -385 652 45 -593 368 395 -466 -197 235 -107 53 202 -156 -24 199 -359 -191 680 16 -685
4549f85R87J47j198O01J003r86n19R40q9o74N55L05n65J47M8l30M07L16p06R9
$$ -685 302 449 -749 -148 855 -131 -650 290 201 -473 82 387 -178 -31 17 -313 94 410 -296 -197
4569a97P47q04m47J268j6j238O34P76j077k37J144k68o55N34Rn56M02J30l53M27
$$ -197 550 -254 -701 567 551 -687 -53 723 -354 -591 553 285 -370 164 173 -383 19 149 -204 223
4589B23Q5r26M13Q78q83l16J232l93j306R75P58j066l2R47n86n66O87J12m36L68
$$ 223 308 -618 -205 673 -210 -526 706 313 -993 -18 740 -326 -358 589 3 -563 124 236 -200 168
4609A68j08m25M99J04p10N73O65j170k60J251l76r58J006M73j268L3J014m83m09
$$ 168 60 -365 134 238 -472 101 766 -404 -664 587 211 -747 259 732 -536 -503 511 28 -381
4628c81O58m6n42L63q1k83O25m0p58N24M45j057J78J211p26q33R74K65j076L30
$$ -381 277 231 -311 52 -29 -312 313 273 -485 39 484 -573 -395 816 90 -743 231 496 -580 -250
4648b50Q79o25m37N44r4k74M90k03j96M08k72m71O82L78r72K22R21q71n82J106
$$ -250 629 4 -433 111 17 -257 233 30 -166 242 -30 -501 181 559 -413 -191 730 -141 -723 383
4668C83J93j016K78O23o36j66N81j03k46K64k46j05M62k62l61O64Q2r96L44R00
$$ 383 576 -440 -162 461 -175 -341 240 137 -109 155 -91 -196 266 4 -357 307 389 -607 -263 637
4688F37p96l89J039j64r30M00O73n77j27N01k02k43K04o8N2K87l60k96P05j25
$$ 637 -159 -548 491 327 -603 -203 470 -107 -234 267 65 -178 26 -42 10 297 -63 -359 346 221
4708B21p13N61N26q46k82R77j85p49N42M66o39j88M51p6j32J01q9J08Q9m33M0
$$ 221 -492 69 595 -251 -533 444 259 -490 52 518 -121 -309 142 66 -66 35 -54 54 143 -290 -250
4729b50O08k41o07N46M59q25o4Q57k62o63M08M09m83j28M14l9j95l1k4K60j7k74
$$ -250 358 117 -490 56 515 -310 -374 483 221 -442 -34 375 -108 -236 178 139 -56 -87 -111 149 132 -142
4751a42P2L67l61l58O01K32p23M1O93l74n06N24K37m12p2L16o7j36k9J58R1j56
$$ -142 -70 297 -64 -422 179 411 -312 -271 422 48 -458 66 303 -109 -181 135 68 -68 -97 61 152 -4
4773dk24K19K61l78j93N47O7o71J67N56k91m02M49K19m83p1L76K8j90j60K17J29
$$ -4 -228 -9 252 -126 -319 228 295 -376 -209 347 56 -346 103 322 -161 -232 144 172 -18 -178 39 168
4795A68k52j41L54N0l90o1M82m2n13K63M15m28k56M20K85n11p2M17j9l92P1L64
$$ 168 -84 -225 129 179 -211 -272 210 168 -345 -82 333 -95 -351 69 354 -157 -229 188 169 -223 -152 212
4817B12l9l46j6L72l6l84Q9M71k31m52L33L06m02j52M15J13l77j09M72j02l38
$$ 212 173 -173 -189 183 147 -237 -148 323 92 -360 -27 279 -123 -275 140 253 -124 -233 239 137 -201
4838b01R9K83m9l68J81K65j24l69K16L27k69k74L24K50l95j91M21P1m77O7M69
$$ -201 -102 181 132 -236 -55 210 86 -283 -67 260 -9 -283 41 291 -104 -295 126 197 -280 -213 256
4859B56r3m44K08L08j85k94K15K07j37k83K82K01k92j66L00J67m39l2M79o4m45
$$ 256 163 -281 -73 235 50 -244 -29 178 41 -242 40 241 -51 -217 83 250 -189 -221 258 194 -251
4880b51J54L25j77l08K14K51k15k44L07J12j94j82L03J48l73j33M30R7m85K1M59
$$ -251 -97 228 51 -257 -43 208 -7 -251 56 168 -26 -208 95 243 -130 -263 167 264 -221 -200 259
4901B59j22m02K36L08k69k75K80K00k23j87L23J72l96j17L15J44m81p2N74m6n01
$$ 259 137 -265 -29 279 10 -265 15 215 -8 -195 128 300 -96 -213 102 246 -235 -307 267 221 -280
4922b80K06L64j80l97L15K40l43j08K70O7k74p2K08J85k40k07M19R8m81MM77j01
$$ -280 -74 290 110 -287 28 268 -75 -183 87 154 -120 -192 16 201 -39 -246 173 271 -210 -206 271 170
4944A70n00K95L68l75k64M51O7l42m3K63n6j28k8J89J77l48j11M02J2m41J35M63
$$ 170 -330 -35 333 -42 -306 145 212 -130 -173 90 34 -94 -122 67 244 -104 -215 187 199 -242 -107 356
4966C56l11m51M19L47n62k1M18m3l99J90J13l4p4q8J03J72k61j20M44Q1o47J76
$$ 356 45 -406 13 360 -202 -223 195 152 -247 -57 56 22 -52 -140 -37 135 -126 -246 198 279 -368 -192
4988a92N89m12m02O61J03o20P4M41k58k43L29ll9n2l1L9K19k39k08M26k3n72L29
$$ -192 397 -15 -417 244 347 -273 -199 242 -16 -259 70 67 28 -24 -55 -16 203 -36 -244 182 159 -413 -84
5011h4O13o42l00P31o1o65L50M00l70j99K74m6l2J11j50P5K32m23j47O00n0o28
$$ -84 529 -113 -413 318 257 -408 -58 342 -28 -227 47 1 -31 80 -70 5 237 -186 -333 267 217 -411
5033d11N06L63p78j26Q41j85n99M20L38o05LM52j99k0J12k15J8L34l81j14O64
$$ -411 95 458 -320 -446 395 210 -389 31 369 -236 -233 219 20 0 112 -103 -85 249 -132 -246 418
5054D18k47p77P05M01q30L5Q43n17n70O03K25n87J85L54l21j1J64k56K06K48m84
$$ 418 171 -606 99 500 -330 -295 548 31 -539 64 289 -298 -113 241 -80 -91 73 -183 23 271 -213
$$ [...]
8191e4
##END NTUPLES=NMR FID
##END=
