##TITLE=1H_AM_NVENE
 
 8 sc, 
 4.04.2022
##JCAMPDX= 6.0         $$ Bruker NMR JCAMP-DX V2.0
##DATA TYPE= NMR FID
##DATA CLASS= NTUPLES
##ORIGIN= UXNMR, Bruker Analytische Messtechnik GmbH
##OWNER= root
$$ XWIN-NMR		Version 3.5
$$ Mon Apr  4 10:28:36 2022 Russian Standard Time (UT+4h)  she@DPX200
##.OBSERVE FREQUENCY= 200.131346
##.OBSERVE NUCLEUS= ^1H
##.DELAY= (6, 6)
##.ACQUISITION MODE= SIMULTANEOUS
##.ACQUISITION SCHEME= undefined
##.AVERAGES= 8
##.DIGITISER RES= 18
##SPECTROMETER/DATA SYSTEM= spect
##.PULSE SEQUENCE= zg30
##.SOLVENT NAME= CDCl3
##.SHIFT REFERENCE= (INTERNAL, CDCl3, 0, 15.7039)
##AUDIT TRAIL= $$ (NUMBER, WHEN, WHO, WHERE, WHAT)
$$ ##TITLE= Audit trail, XWIN-NMR		Version 3.5
$$ ##JCAMPDX= 5.01
$$ ##ORIGIN= Bruker BioSpin GmbH
$$ ##OWNER= she
$$ F:/spectra/data/she/nmr/H-F/1/audita.txt
$$ ##AUDIT TRAIL=  $$ (NUMBER, WHEN, WHO, WHERE, WHAT)
(   1,<2022-04-04 10:27:35.45 +0400>,<she>,<DPX200>,
      <created by zg, POWCHK disabled, PULCHK disabled
       configuration hash MD5:
       00 E9 B6 7A A2 85 ED C7 34 08 36 98 17 FE 4E 26
       data hash MD5: 16K
       35 37 D5 70 5A 51 F4 F5 23 88 A9 16 C4 EA B0 5A>)
$$ ##END=
$$ 
$$ hash MD5
$$ 29 0B B5 E9 30 6E CF 21 59 7D 0C 01 9E F2 C1 F4
##$RELAX= 
##$RELAX= 
##$RELAX= 
##$RELAX= 
##$RELAX= 
##$RELAX= 
$$ Bruker specific parameters
$$ --------------------------
##$DU= <F:/spectra>
##$EXPNO= 1
##$NAME= <H-F>
##$PROCNO= 1
##$TYPE= <nmr>
##$USER= <she>
##$AMP= (0..31)
100 100 100 100 100 100 100 100 100 100 100 100 100 100 100 100 100 100 
100 100 100 100 100 100 100 100 100 100 100 100 100 100 
##$AQSEQ= 0
##$AQ_mod= 1
##$AUNM= <au_zg>
##$AUTOPOS= <>
##$BF1= 200.13
##$BF2= 200.13
##$BF3= 200.13
##$BF4= 200.13
##$BF5= 200.13
##$BF6= 200.13
##$BF7= 200.13
##$BF8= 200.13
##$BYTORDA= 1
##$CFDGTYP= 0
##$CFRGTYP= 5
##$CHEMSTR= <none>
##$CNST= (0..31)
1 1 145 1 1 1 1 1 1 1 1 1 1 1 1 1 1 1 1 1 1 1 1 1 1 1 1 1 1 1 1 1 
##$CPDPRG= <>
##$CPDPRG1= <>
##$CPDPRG2= <>
##$CPDPRG3= <>
##$CPDPRG4= <mlev>
##$CPDPRG5= <mlev>
##$CPDPRG6= <mlev>
##$CPDPRG7= <mlev>
##$CPDPRG8= <mlev>
##$CPDPRGB= <>
##$CPDPRGT= <>
##$D= (0..31)
0 1.2 0 0 0 0 0 0 0 0.06 0 0.03 0 0 0 0 0.0002 0 0 0 0 0 0 0 0 0 0 0 0 
0 0 0 
##$DATE= 1649053655
##$DBL= (0..7)
120 120 120 120 120 120 120 120 
##$DBP= (0..7)
150 150 150 150 150 150 150 150 
##$DBP07= 0
##$DBPNAM0= <>
##$DBPNAM1= <>
##$DBPNAM2= <>
##$DBPNAM3= <>
##$DBPNAM4= <>
##$DBPNAM5= <>
##$DBPNAM6= <>
##$DBPNAM7= <>
##$DBPOAL= (0..7)
0.5 0.5 0.5 0.5 0.5 0.5 0.5 0.5 
##$DBPOFFS= (0..7)
0 0 0 0 0 0 0 0 
##$DE= 6
##$DECBNUC= <off>
##$DECIM= 32
##$DECNUC= <off>
##$DECSTAT= 4
##$DIGMOD= 1
##$DIGTYP= 9
##$DL= (0..7)
0 120 120 120 120 120 120 120 
##$DP= (0..7)
150 150 150 150 150 150 150 150 
##$DP07= 0
##$DPNAME0= <>
##$DPNAME1= <>
##$DPNAME2= <>
##$DPNAME3= <>
##$DPNAME4= <>
##$DPNAME5= <>
##$DPNAME6= <>
##$DPNAME7= <>
##$DPOAL= (0..7)
0.5 0.5 0.5 0.5 0.5 0.5 0.5 0.5 
##$DPOFFS= (0..7)
0 0 0 0 0 0 0 0 
##$DQDMODE= 0
##$DR= 18
##$DS= 0
##$DSLIST= <SSSSSSSSSSSSSSS>
$$ [...]
##$SUBNAM2= <"">
##$SUBNAM3= <"">
##$SUBNAM4= <"">
##$SUBNAM5= <"">
##$SUBNAM6= <"">
##$SUBNAM7= <"">
##$SUBNAM8= <"">
##$SUBNAM9= <"">
##$SW= 18.0517287032376
##$SWIBOX= (0..15)
0 0 2 0 0 0 0 0 0 0 0 0 0 0 0 0 
##$SW_h= 3612.71676300578
##$TD= 16384
##$TD0= 1
##$TE= 0
##$TE2= 300
##$TE3= 300
##$TEG= 300
##$TL= (0..7)
0 120 120 120 120 120 120 120 
##$TP= (0..7)
150 150 150 150 150 150 150 150 
##$TP07= 0
##$TPNAME0= <>
##$TPNAME1= <>
##$TPNAME2= <>
##$TPNAME3= <>
##$TPNAME4= <>
##$TPNAME5= <>
##$TPNAME6= <>
##$TPNAME7= <>
##$TPOAL= (0..7)
0.5 0.5 0.5 0.5 0.5 0.5 0.5 0.5 
##$TPOFFS= (0..7)
0 0 0 0 0 0 0 0 
##$TUNHIN= 0
##$TUNHOUT= 0
##$TUNXOUT= 0
##$USERA1= <user>
##$USERA2= <user>
##$USERA3= <user>
##$USERA4= <user>
##$USERA5= <user>
##$V9= 5
##$VALIST= <valist>
##$VCLIST= <CCCCCCCCCCCCCCC>
##$VD= 0
##$VDLIST= <DDDDDDDDDDDDDDD>
##$VPLIST= <PPPPPPPPPPPPPPP>
##$VTLIST= <TTTTTTTTTTTTTTT>
##$WBST= 1024
##$WBSW= 4
##$XGAIN= (0..3)
0 0 0 0 
##$XL= 0
##$YL= 0
##$YMAX_a= 296308
##$YMIN_a= -236882
##$ZGOPTNS= <>
##$ZL1= 120
##$ZL2= 120
##$ZL3= 120
##$ZL4= 120
##$ABSF1= 10
##$ABSF2= 0
##$ABSG= 5
##$ABSL= 3
##$ALPHA= 0
##$AQORDER= 0
##$ASSFAC= 0
##$ASSFACI= 0
##$ASSFACX= 0
##$ASSWID= 0
##$AUNMP= <proc_1d>
##$AZFE= 0.1
##$AZFW= 0.1
##$BCFW= 1
##$BC_mod= 2
##$BYTORDP= 1
##$COROFFS= 0
##$CY= 11.3945322036743
##$DATMOD= 1
##$DC= 2
##$DFILT= <>
##$DTYPP= 0
##$F1P= 2.36226072786647
##$F2P= -0.459571619588291
##$FCOR= 0.5
##$FTSIZE= 0
##$FT_mod= 4
##$GAMMA= 1
##$GB= 0.15
##$INTBC= 1
##$INTSCL= 1
##$ISEN= 128
##$LB= 0.24
##$LEV0= 0
##$LPBIN= 0
##$MAXI= 10000
##$MC2= 0
##$MEAN= 0
##$ME_mod= 0
##$MI= 1.114404
##$NCOEF= 0
##$NC_proc= 0
##$NLEV= 6
##$NOISF1= 3.799351
##$NOISF2= 2.8
##$NSP= 1
##$NTH_PI= 0
##$NZP= 0
##$OFFSET= 15.70392
##$PC= 1
##$PHC0= -17384.3
##$PHC1= 9.60078
##$PH_mod= 1
##$PKNL= yes
##$PPARMOD= 0
##$PSCAL= 0
##$PSIGN= 0
##$REVERSE= no
##$SF= 200.130013532006
##$SI= 16384
##$SIGF1= 3
##$SIGF2= 2
##$SINO= 400
##$SIOLD= 16384
##$SREGLST= <1H.CDCl3>
##$SSB= 0
##$STSI= 0
##$STSR= 0
##$SW_p= 3612.71676300578
##$SYMM= 0
##$S_DEV= 0
##$TDeff= 0
##$TDoff= 0
##$TI= <>
##$TILT= no
##$TM1= 0
##$TM2= 0
##$TOPLEV= 0
##$USERP1= <user>
##$USERP2= <user>
##$USERP3= <user>
##$USERP4= <user>
##$USERP5= <user>
##$WDW= 1
##$XDIM= 8192
##$YMAX_p= 0
##$YMIN_p= 0
$$ End of Bruker specific parameters
$$ ---------------------------------
##NTUPLES= NMR FID
##VAR_NAME=  TIME,          FID/REAL,        FID/IMAG
##SYMBOL=    X,             R,               I
##VAR_TYPE=  INDEPENDENT,   DEPENDENT,       DEPENDENT
##VAR_FORM=  AFFN,          ASDF,            ASDF
##VAR_DIM=   8192,          8192,            8192
##UNITS=     SECONDS,       ARBITRARY UNITS, ARBITRARY UNITS
##FACTOR=    0.0002768,     1,               1
##FIRST=     0,             0,               0
##LAST=      2.2672688,     0,               0
##MIN=       0,             -236882,         0
##MAX=       2.2672688,     296308,          0
$$ Real data points
##PAGE= N=1
##DATA TABLE= (X++(R..R)), XYDATA
0@%%%%%%%%%%%%%%Qj6J6j6J6j6K4l2L2l6M4m8N3o1O9q0R1j00J11j25J38j52J68
37H8j84K01k23K45k67K96l25L53l84M22m65N09n57O10o74P47q27R21j032J163
57F17j321J515j758K067k471L021l795M937o733R816j5860L1020j19740j38197
71b36882M49258l93494K04803J93707m01758K78977j32509n6999K09330j71022
81e6589R7705m6988l7013J09123j09310O4902k2394n3787Q0201L341k7106j1518
93i433L6001j02485Q7564P5293j89608J84220r1452j03465K68581k25072O3757
104f099P7906k19022K30135q0990m432R2531k13964J68132q7010P110J92371k63137
116a06469J56474k9558j70109K81450j69142O534J37344k03435J20341M944q2152
$$ y = [0, 0, 0, 0, 0, 0, 0, 0, 0, 0, 0, 0, 0, 0, 0, 8, -8, 8, -8, 8, -8, 16, -16, 16, -20, 24, -24, 29, -32, 37, -43, 48, -52, 59, -66, 72, -80, 88, -96, 105, -118, 127, -140, 156, -169, 184, -200, 222, -243, 266, -291, 319, -355, 392, -435, 486, -546, 617, -704, 811, -947, 1120, -1351, 1670, -2125, 2812, -3921, 5895, -9965, 21055, -98685, -236882, 212376, -181118, 23685, 217392, -184366, 94611, -37898, -94897, 114433, -56589, 41116, -5872, -42885, 66238, -43072, 21830, -564, -54351, 25850, 29191, 2085, -9433, 26568, -75917, 11647, 86940, -102668, 81552, -9900, -113365, 155216, -69856, -6099, 71807, -147215, 82920, 1930, -2502, 90029, -123935, 44197, -42813, -35703, 156668, -106469, 50005, 20447, -149662, 131788, -37354, -30820, 106524, -96911, 23430, 28374, -53778]
127e3778Q6154m1332O891J4970j41k4620o606K8037l2507O1000l6808j6409L7796
140B2647q5435J09907m0015m4312J17363j68193R6293N2020j46877J79351j14816
151b2067m2573J43028j46952R7710R471r2055R5515p4850L2854J9323m6461O4507
163C7450o2603L2490Q468n4657O7227m3947J7400K4618m7341L1521l1841K1751
175E36J3318k0451L5652n5823K0092J4639k7996N4756m0536P76P022k5464M5315
188B1836l2717K4818n386m1428O5923n6742K0319L7172p7380P2329k3763l2212
200b7231O0850o2534K7918J9189l1187L4634l4185M773P131p442L2229k8973O465
213A637o511j5742L7093j6275J0940q121k3852K6711j7495K5433J699l3362K9218
$$ y = [-53778, 32376, -8956, -2065, 12905, 12764, -11856, -18462, 9575, -22932, 38068, 1260, -15149, 22647, -62788, 47119, 7104, -37208, 80155, -88038, 8255, 60275, -86602, 92749, -22067, -64640, 78388, -68564, 29146, 38617, -53438, 42077, -32773, 81, 19404, -27057, 37450, -25153, 7337, 15805, -38852, 28375, -15572, 1828, 26446, -20895, 10626, -21215, 536, 13854, -6597, 29055, -26768, -6676, 7963, -20033, 34723, -5813, -5037, 1985, -23479, 21836, -10881, 13937, 8551, -32877, 33046, -23696, -3377, 33795, -43585, 28744, 4981, -27231, 33619, -28915, -997, 18192, -12995, 21639, -12546, -7773, -642, -8084, 24145, -4828, 1637, -4874, -20616, 16477, 202, 11142, 3021, -20831, 5880, -11615, 13818, 15517, -17845, 11373]
226A1373k8748J1567K9510l5865K1387r826j5331K6018j0834K422j450j871R17
239g31r95J2827k1571R004O616j6748L0058j9358r423J6517k2938K6532J111j4803
253c902J1657k5959J4911J0501p105J7650k6498j360R282p604K4975j0775r556
266c783K649j3635J9150K164l707L921j8525Q567N815l454J0599j2465m540R061
280A817k826M507J851j1346N44R219l979N752r73j7669J3016K025k668J6090k2520
295g160k531J2074j1020K3194n685j9662J1952j4149J3153J7067j9015M838j0615
308g559n890K2471m180N02k904j5316J0059N746J562K981j2383j692N347K498
322A242O597o298p707L239N14P613K556j2088M90l35K125J3801r797o178K163
$$ y = [11373, -17375, -5808, 23702, -12163, 9224, -602, -15933, 10085, -749, 1673, 223, -1648, -731, -1726, 11101, -10470, -1466, 5150, -11598, 18460, -898, -10321, 6196, -16742, 9790, 10901, -3902, 7755, -18204, -3293, 7208, 103, 17753, -8745, -10105, -823, -8427, 16548, 5773, -3783, -1134, -14769, 4381, 6545, 2838, 6759, -11766, -3199, 2616, -838, 9761, -2704, -7244, 1817, -1009, 3498, 5349, -5997, -5453, 3766, -213, 5539, 4566, -13103, -87, 1938, -730, 15360, -7160, -9691, 2383, -8637, 14557, 8872, -10790, 1162, -12987, 166, 17233, -1782, 3056, -7559, -13449, 9022, 4842, 5344, 2440, -12876, -2817, 2929, 4491, 7472, -4911, -6603, -1256, 1242, 7839, 1541, -6166, -2927, -2413, 5200, 7756, -4332, -3842, -4177, -2052, 11749, 1952, -4226, -2063]
337b063q553J7030L716j2776O025j4410M165J8747j1802N918o682j4493J9695
350D517j961l8O602j9447N364Q111m638J0331q439q748Q958j872M262L572j1587
365e013J319M028j372P823n388p751O042k393N990L915j1510K544j609J406J0292
380H323q126p97k112l520J1904l945J79r82r664J1715j769p04N709j4421P494
395g16L786o040J0542j0699k454R278o108O775j505q928N496K57J652L312n753
410a105l318L747J301J946J880r161J152M555k305R614q012p197Q002p190J1294
425E203K967j3934P762q072L117J2312j1784M426m526l433J2890o719K064m009
439a736o812J2392k164L693j877j2851P152L25N094N218j0752k41j759L432O404
$$ y = [-2063, -10616, 6414, 10130, -2646, 3379, -11031, -6866, 11881, 79, 5997, -685, -15178, 4517, 2556, 2518, 9120, -10327, -4963, 3148, -1490, 8841, 402, -8346, 612, -1260, 3002, 6574, -5013, -3694, 334, -1038, 6785, 1397, -6354, -312, -2705, 3285, 7200, -4310, -1766, -3375, -1969, 8323, 197, -600, -2712, -6232, 5672, 1727, 1906, 924, -8740, 2975, 1206, 502, 6211, -8210, -716, 3070, -2970, 7572, -3127, -5581, 3697, -2411, 4364, 2859, -6069, -573, -316, 1336, 4648, -1105, -4423, -676, 625, 2571, 4451, -4710, -3558, 997, -1308, 8306, 294, -6903, 1099, -6091, 5203, 8170, -5764, 1998, -6074, -2957, 9355, -2429, 1997, -2529, -5962, 6928, 209, 2273, -1736, -8548, 3844, 1680, 5373, 3496, -9355, -2203, -1878, 3216, 8434, -2318, -2559, -4318, -886, 5518]
454E518m617j005m865L188O693j938mr016n07O454L374O690r862m561q60j632
470f950J5275m622k850J475j2479J2814O43n751P172j2440P365O479n974N932
484F089j3655P99Q157k185J2607j0246p540M596o742J2477J725p169K624o111
498d574M576K764k000j203n631O942J138K374J537j3141L151N31K950J0484q654
513A244m22m812k740J0730n469N555k171p960J1567p678J675L449j1016J0337
527B289l76K9L309j0237L222k919N238O452r082O945r020j758J2254j0996Q199
542C549r84r165J1799o838J986K094p866P193l540L991J809p680N675o036K626
557a387N314n588M827m639P06J123k788O388q038N761J548r146J3029j0517p30
$$ y = [5518, 901, -104, -4969, -1781, 4912, 2974, 2970, -6046, -6553, -99, 3275, 9965, 103, -4458, -5318, -6950, 8325, 3703, 853, 2328, -10151, 2663, 3306, -2445, 4727, -7713, -348, 6131, 157, 6089, -7566, -6767, 1390, -795, 11812, 1566, -5974, -1378, -8120, 4357, 6082, -1087, 1537, -4574, 2, 2766, 766, -437, -6068, 874, 2012, 4386, 5923, -7218, -4067, -3536, -586, 9898, 1244, 822, -3990, -6730, 4000, -1469, 4086, 1915, -6045, 5522, -2156, -481, 2968, -8048, 2289, 1913, 1942, 5251, -4986, -1764, -4683, 555, 7007, -2075, 4870, -4150, -5908, 6346, -4650, 3549, 2565, -6600, 5199, -1639, 347, 2441, -5425, 1768, -1772, 2219, 4028, -3652, 2023, -4013, -1387, 3927, -1661, 3166, -1473, -767, 356, -2432, 3956, -4082, 1679, 3227, -5919, 7110, -3407, -4137]
572d137J0831j3393J0734j126p991R168q151M945M70k919O040r672P812k345n258
587d992J2544j2219N036L726j0947J1548o210L74N166q204P501n873J491N129
601D070q747R055n064k937P607p193M495R9k111Q48j885M522o595O473R7r540
617f806J4194j1294K84J2224j6967J2593j194j0232J4188j1685M274M215q656
630d862J0532q617K411L683r358J1144o154o19O839r311N921j595j823L459l368
645a718M242m552L333P45o786Q886p270J150P200q746P196l462l638M417m655
660c658O908l162J286K215j0289R835n675r38J1537j2895Q028l68r665J1396q957
675d402L289N717p544Q790p235j718M336p273R475r42k743M351p702J698J364
$$ y = [-4137, 6694, -6699, 4035, 2909, -5082, 4086, -4065, 880, 1350, -1569, 4471, -5201, 2611, 266, -4992, 7552, -4667, 369, 4095, -6852, 4696, -1514, -1140, 4026, -4178, 3323, -2550, -1059, 4070, -4677, 4378, -686, -3623, 3984, -3209, 1286, 1385, -726, 122, -1763, 2759, -3836, 2637, 2734, -6806, 7388, -3906, -3622, 8602, -8365, 4228, 3034, -7198, 6990, -4695, -421, 3794, -4862, 5670, -2947, -536, 3147, -6211, 4933, -1221, -1840, 4999, -4312, 1609, 14, -1809, 1650, -1718, 2524, -2028, 1305, 2050, -4736, 4150, -3120, -1970, 5230, -3516, 3680, 218, -3420, 997, -3658, 3250, 88, 1374, 3589, -6700, 3135, -2540, -3478, 8059, -4836, 3192, 2824, -6841, 4555, -4402, -1113, 4604, -2940, 5850, -1385, -3103, 1233, -6040, 3435, 2493, -250, 4101, -3601, -1903, -539]
690e39m56K591o54J056l555K784j605l684O694n501M105M116q157N585n894j284
706d398P239m878O706l061m089M576p127N974J99l866P441o215K370J455o905
721d579M979k670K133M601l997J670m736r88L467r67M880j912k469Q97l245K441
737d95P45l04J343q32O76j591J03j092n67L790j514J914p55m475L178k037J968
754E5L053m433K730k312q39M185m122K278l76k539M964k657J84R04m198L135M34
771D46l33K243k778n17M94n05J339L55m32k62K33o25j17M42p53J259M37o67J75
790D34j509J40Q59O11Q38j249m39q45L18J891p94Q29j157j617K160j223J394R44
808A585k971K162j468o05L218l023J618P84l347L224j574j072L525k806R06J185
$$ y = [-539, -995, 1596, 942, 1998, -1557, 1227, -378, -4062, 2632, -2869, 1236, 5352, -2805, 2780, -3114, -4398, 2841, -2037, 4669, 1608, -2481, 2095, -5032, 942, 1141, -2725, 4716, -1499, 871, 2326, -4579, 400, -2270, -137, 4464, 467, 2137, -2599, -3587, -120, -1087, 3793, 1881, -588, 309, -2936, -495, 250, -54, 1289, 457, 1133, -458, -355, -1447, -2014, 1776, 262, 2176, 1421, -3054, 124, -1913, 55, 3108, -1325, 1405, -907, -1746, 2439, -1683, 595, 219, -2320, 2644, -13, 171, 1075, -3123, 12, 446, 113, 2356, -422, -939, -445, -950, 389, 744, 312, 50, 283, -342, -459, -17, -770, 489, 926, 259, 434, -1075, -935, -76, 535, 1373, 124, -315, -1160, -842, 1049, 255, 1084, -73, -1690, 470, -753, 641, 1585, -1386, 776, -692, -1297, 1921, -1102, 516, 1300, -2047, 1177, -397, -1469, 2056, -750, 156, 1341]
824A341l366K186K85j337K582j491j451J746j434O97K108k393N49K58k241K906
840I45l68j080K234l119P46J378k147L056j408r22J767k903K176o7r13K590l100
857a135J348j33k098M011k648R89J447m459L680j374q89M144m087J309O57l171
873b409L543p00r01J898k035n04J598p68q2K311k798J43K257m430M338r4m030
890b663O371n935O58M971p559P103j711m882P685p378K940L662o727O676l865
905f54j636M801n103M108n43k315K948l430K078j8o38J859k306J430j430M88J002
922F41j453K730l159J572Q2k889N447m771K363J664o476P694n318O37N936r633
938d933Q162l397m090J0121j0217N855J604q989J0699p138N96O607r139O576j819
$$ y = [1341, -2025, 161, 446, -891, 1691, 200, -1251, 495, -939, -242, 1866, -527, 22, 280, -1961, 945, 577, -503, 1731, -1388, -642, 736, -1411, 1645, 237, -685, 1082, -1821, 355, 288, -625, 1965, -1135, 213, 80, -2018, 1993, -655, 334, 1781, -2678, 1002, -372, -1261, 2883, -1204, 105, 762, -2409, 1134, 434, -467, 1431, -604, -1108, 490, -278, -360, 1951, -847, -704, 1553, -2877, 1461, 1367, -2663, 3708, -2227, -1569, 3402, -4157, 2946, 1235, -3647, 4038, -3340, -400, 3262, -3465, 3211, -654, -2290, 2511, -2592, 1516, 973, -1342, 1606, -1824, 254, 236, -402, 1457, -849, 581, -849, -361, 641, -812, 1918, -1241, 331, 413, -2476, 2971, -1800, 563, 2227, -4249, 3445, -1873, -1236, 4700, -4933, 3229, -168, -4258, 5863, -4354, 1501, 3105, -5884, 4815, -2323, -1727, 4880, -4259, 2317, 498]
953D98l595N779m078J718O72j373J07k64J472k865M315k459k026N748q062O008
969A595O03o721J0470r591K361N869j1281J2256n923l540J0362j2992Q577M60
983B505p710J1454r507K556L830p981Q501m587J65L552n875M803k799O74K007
998A588k807L034l600K534j115r03M667o808N941k653l787R559j0300O462J435
1013C247j0013J3101r817J838Q069j3613J2040n122m701J1934j2579P442J244
1026C070q743J0860p733J242M876p049N611k230j110J950j295J482j984L120l939
1041a872J016L521o723Q416m692k907Q197j1237Q651K16p514J2196j1823L579
1055i76N066j1465J3340o790j796R161j2692Q050j199n489J0024p269L129J238
$$ y = [498, -3097, 2682, -1396, 322, 994, -379, -272, -536, 936, -1929, 2386, -73, -2099, 3649, -4413, 1595, 2198, -4523, 5947, -3644, -1283, 4586, -6695, 5561, -362, -3902, 6460, -6532, 2045, 2505, -5205, 6249, -3258, -702, 3128, -4853, 3648, -939, -774, 2778, -3097, 1706, -1093, -419, 1588, -1219, 1815, -1785, 749, -366, -1269, 3398, -3410, 2531, -122, -3909, 5650, -4650, 1812, 3247, -6766, 6335, -3482, -1644, 6425, -7188, 4852, -270, -4971, 6963, -5616, 1826, 3070, -5673, 5187, -2546, -1304, 3572, -3477, 2134, -96, -1206, 744, -551, 931, -1053, 2067, -1872, -856, 2665, -4058, 4358, -334, -3241, 4956, -6281, 2370, 2586, -4928, 7268, -4555, -976, 4090, -7375, 5965, -825, -2621, 6540, -6152, 1898, 699, -4790, 5234, -2035, 1094, 2332]
1069B332n968N013l530K208J587j892K334l574J906j775L26K567l585N523m016
1084e44k8L414q522P905k869j896R739j0940N483k81q844J2099p412K628O447
1099F379j1154Q221m725l600Q668p347N939J157n676M728n551M62K916j039L341
1114B719j039p16k595M4L74p72N354l350J399J137o891N603l613j19P201o637
1130a901N451j993o240O719o414M230M262o000O454n669j962M514n702N942J74
1145A865k384M207n359O60K14k031M244o52J107j94k705o1j165J776Q12J333K37
1162A904k315J081l078J115K058k425M891k465j480K800o027L645Q65k419O093
1177D243m493j69J690n230M748o33r07L975m222J160K07k791L103j036L61J687
$$ y = [2332, -3636, 1377, -2153, 55, 1642, -250, 2084, -1490, 416, -1359, -1033, 1534, -2051, 3472, -544, -572, 2842, -5680, 2225, -644, -2540, 7199, -3741, 1742, 1461, -7383, 4716, -2696, -68, 6379, -4775, 3446, -1279, -4879, 3789, -3558, 2381, 3538, -2138, 2590, -2961, -2499, 417, -622, 2719, 1680, 964, -1631, -1587, -1213, -1985, 3369, 19, 1418, 2555, -4336, 1267, -2346, -2465, 4736, -1901, 3550, 1557, -4683, 2036, -4378, -148, 4114, -1886, 4568, -1101, -3063, 1451, -4251, 1691, 1865, -519, 3688, -1671, -1011, -797, -2828, 1416, 764, 1871, 1677, -1028, -1089, -2254, -478, 334, 1667, 1904, -411, 670, -2408, -1293, 765, -1660, 3231, 766, -714, 2086, -3941, -296, 569, -1850, 4243, -250, -419, 1271, -3959, 789, 156, -751, 3224, -998, 162, 369, -2422, 681, -355, 6, 1693]
1193A693j768K37n74n97N11Q06K96l09N89j627K28P77j441K137p65o09J800k400
1211a016J130j0j467K498j430O75O38k318J795j211K56J833k125J549q34j139
1227a176K113j723J103N09j766J623j147p1J261j228J005j98q28O52n94L25N59
1244D19r3j30k58k94l19R54q0OO43j643O79J44r13K021j235p9J061k086J551j30
1264B18j049J902j548L67P84j473J284n57l31Q27q40O49j05j40L12p40M81l82
1282c41K12P49p27N63n90n60P57l76O90K01n66jn11K23J67M53J63o15L49q57K93
1303c24P62q13J204q15o21J113j450J281K83j271J597j546M2J298j557J524k61
1320D46j219J307j113K46R87q19M17p2o46K34M01k10K35L07j046N06J09o06J328
$$ y = [1693, -75, 162, -412, -1009, -498, 308, 604, 295, 884, -743, -515, 262, -1179, 958, 193, -416, 1384, -1016, 114, 104, -1363, 1135, -295, 380, 1018, -1300, 495, -716, -460, 1373, -752, 797, -37, -1176, 937, -786, 317, 826, -940, 683, -464, -535, 726, -502, 503, 305, -523, 129, -465, -140, 419, 326, 196, -62, -356, -675, 279, 199, 205, 848, -795, -116, 28, -885, 1136, -99, -178, 883, -1203, 348, 218, -831, 1071, -477, -110, 674, -799, 485, -72, -403, 424, -416, 233, 128, -12, 300, -440, 41, -341, -129, 620, -107, 456, -134, -694, 63, -313, 377, 578, 12, 11, -500, -277, -110, 343, 506, -109, 240, -617, -324, 438, -375, 829, 14, -607, 506, -944, 337, 620, -651, 946, -600, -558, 740, -817, 707, 446, -773, 534, -579, -333, 654, -165, 252, 180, -466, -232, 169, -41, 194, 501, -545, -39, 70, -536, 792]
1339G92q38j86O64j251J120m0m90R12j274M90K22n61J218r04R3K12r05J032l67
1358f1J55M12q74N15n64K26N18n53R07q24j69N01r34J177j37l82N95j099M47Q4
1378f0J7O18p35L80o13RR21r12J015n62p92J215j115Q47L52j064R48r02K14M88
1398B69n35Q37p81K67o3n94J109q66P30J2j086J252j354Q53O81j437J817j767
1416f56L4J486k059K332p94j284J986k307J316Q00j562J746j455r8Q06q32J181
1433F40n48N6j96n05Q14p41J147m78n71J036j870J633j67q63K187k711J197L32
1451C92j983L325k283M54J302l232L084j357k92K450l325K179q30j205K961k639
1467i99J714j38k028K491k058J254P60j742J700j848N62N65o67J712j689P52p23
$$ y = [792, -46, -232, 432, -819, 301, 261, -229, 683, -591, -101, 121, -440, 778, -126, -33, 179, -726, 306, -61, 94, 506, -368, 147, -417, -191, 327, -226, 681, -143, -312, 189, -745, 432, 295, -87, 508, -591, -144, -60, -43, 575, -160, 220, -393, -384, 537, -375, 640, 78, -714, 501, -614, 233, 585, -479, 469, -433, -219, 269, -266, 571, -210, 57, -6, -600, 509, -357, 373, 385, -701, 551, -803, 50, 731, -706, 1111, -656, -622, 864, -1195, 1137, 343, -941, 1045, -1262, 54, 854, -708, 1038, -417, -515, 291, -541, 640, 92, 148, -48, -553, 261, -480, 667, 189, -382, 654, -1216, 417, 250, -613, 1574, -1137, 60, 392, -1591, 1734, -549, -95, 1207, -2025, 1059, -298, -590, 1860, -1465, 714, -116, -1321, 1640, -999, 715, 577, -1451, 1040, -1018, 236, 996, -746, 954, -894, -332, 233, -434, 1278, -411, 341, -382]
1484c82p95K261j913K075p34j940K662l143K424P24k770L828l847R72K165m016
1500b429M626k570q79L525m626L509o31k287L826l635J876O34k311K936k419Q61
1516FL30j539K211j607J495m50j254J434k592K644k54n88K564m398K169o41j622
1533b092N120m053K066K21m615N273l463J209L169n255M478k502j367M027m650
1548b434L485k90k138L753l864J548K86k034L184k071J150k6j366J628k030J769
1564E50r96q0K236k984L082k208j549L522m265M455q0l334M495n861K234K305
1580A522m012O078m014o64K998n301M754j082j500L907m303K169j63k135K948
1595A202k167J496J89j124J140j932J615r18M37J339k686K797k054p2K610m070
$$ y = [-382, -1177, 1084, -829, 1246, 512, -1428, 1234, -1909, 515, 1239, -1531, 2297, -1550, -578, 1587, -2429, 2197, -373, -1252, 2273, -2353, 1156, 525, -1762, 2064, -1571, 305, 939, -1372, 1564, -855, 6, 336, -1203, 1008, -599, 896, 446, -808, 626, -1966, 678, 424, -164, 2400, -1998, 171, -470, -2092, 3028, -1025, 1041, 1262, -3353, 1920, -1543, -334, 2835, -2420, 2058, -444, -1811, 2216, -2434, 1051, 761, -1377, 2376, -1488, 60, 346, -1688, 1496, -575, 575, 549, -817, 811, -1219, 550, -446, -526, 1710, -1274, 1808, -400, -1949, 1573, -2692, 1763, 1683, -1651, 2844, -3017, -783, 1522, -2490, 3588, -426, -1090, 1908, -3393, 1361, 279, -1221, 2686, -1617, 552, 389, -1746, 1202, -965, 531, 720, -404, 736, -1196, 419, -499, -62, 1277, -1409, 1388, -666, -738, 1872, -2198]
1611b198L490j420j429M334m642K818l30l457N197l869J941J817m845M344k945
1626a194m8L582m040L179j278j760K864k663J926pj110J458j804J202o39J94R72
1643H34j671J932j869M11J302k465L187k108k64K312l856L539j048j617L802m352
1659a931K237O02l044M288k942N00J693l408L075j382j49J962k710J876j065l50
1675g48J877j804J539j003n95J193j248J693q86j18N25j665K116j233L31J072
1691A046k524K427j235k53K047l060K209o14j092K886l008J502J61k127L186k255
1707g04N34J306k563K471j080o57J367j817J530J02k42M32j612N93m37J023J013
1724A259j229P45j849J35J345r88J975j269n97J122j863J797o32p72J833j684
$$ y = [-2198, 1292, -128, -1557, 2777, -1865, 953, 623, -2834, 2363, -1506, 435, 2252, -2593, 1751, -1194, -1242, 2340, -1700, 1479, 201, -1559, 1305, -1358, 568, 561, -549, 909, -895, 307, -332, -138, 834, -837, 1095, -774, -363, 939, -1526, 1661, -447, -711, 1601, -2255, 1284, 236, -1381, 2421, -1931, 306, 908, -2136, 2152, -790, -290, 1403, -2005, 1070, -312, -461, 1501, -1209, 667, -398, -748, 1129, -675, 864, -139, -734, 459, -789, 904, 18, -100, 425, -1240, 876, -357, -26, 1046, -1478, 949, -286, -539, 1508, -1552, 657, 43, -1049, 1837, -1171, 331, 492, -1635, 1551, -704, -170, 1136, -1427, 1044, -36, -693, 674, -1143, 387, 489, 247, 679, -933, -340, -777, 246, 1259, 30, 775, -1074, -939, 406, -582, 1393, 124, -473, 649, -1214, 583, -49, -821, 1012, -672]
1740f72J532j71j730J317j603J310J120j046J101j981N9P31o96J889j179j4O49
1757F16j425J424r28n08J073p23J522j61r47k62j231J207N95P99K68j833K13q39
1775a140N56J588j139R83p92p18J359j474P07K6o91J858p92P8l24j566J204Q3
1793a94Q71N44j379J9p88N45Q15m05O23j035L25M61p86Q80j197J31J155o69J225
1812A141r82j119P71o80J378M17q26J81j048M33M05j9M23p45L97q0j34M94j017
1831f10M81J04j9R42j016j2k04l30J200m11K89l13q02Q77n05O30J33r62R03p48
1851c73L67N51j078R00n88k0Q32j046P30l06l47Q91q10L89K9m84O64l40N7J2j58
1872a28J51r3L18m90K91J04n24R41q31mO98j049J146l95o48J019j104Q37K06r51
$$ y = [-672, 860, 689, -1041, 276, -1327, -17, 1103, 57, 1158, -823, -764, -33, -729, 1160, -19, -33, 616, -809, 615, -313, -821, 252, -471, 1051, 890, -57, -319, -1550, -343, 252, 1051, 1319, -514, -301, -1140, -584, 1004, -135, 848, 56, -662, 697, -777, -70, -44, -735, 1123, 331, 409, 85, -1481, -277, -194, 677, 1221, -158, -139, -927, -382, 433, 28, 651, -384, -59, 402, -384, 496, -701, -570, 585, -84, 1141, 159, -960, -189, -869, 509, 926, 100, 281, -767, -334, 71, 52, 475, -270, 127, 47, -87, 407, -610, -129, -25, -44, 898, -118, -130, -334, -664, 536, 125, 414, 101, -701, 176, -329, 301, 434, -528, 375, -373, -6, 545, -533, 367, -221, -241, 591, -455, 275, -31, -378, 513, -297, 92, 121, -363, 301, -39, 18, 30, -128, 23, -70, 248, -242, 49, 153, -371, 570, -261, -265, 433, -616, 530, 135, -513, 506, -598, 239, 445, -506]
1892e06R63r83M94O94j015Q17r22r7J090o32P06n33q04O21j05O73M4n80k50j72
1912d97O13J02K22m66n54O48k62P04j68j000P84o37Q21N77j506Q20q30K15J628
1931A214j431N19n78q89J924n19J76l9j577J011L04L50M02j290j79J13N93O97
1949H01l59n68o57M50N03M12J7j193K59j8M13R66j321J51j78l14J752j060j38
1968h2J03j220J869j52n22N32j790R87Q33m18Q29j437m61Q52J7R52l09j088j33
1987f38K21N87O31k58j101J29N8L04J199j203k30K90r50J715k66r23R49j416Q73
2006b9Q66j269R33r64j75J408q82N23l96r99J213j53K74K99j251J21L93J12O59
2025F83k65r01N6K20J45Q91n54o70L19n92R02M22q31N75r66J58R97r98R94n23
$$ y = [-506, 457, -526, -32, 662, -353, 464, -458, -555, 535, -97, 609, 76, -728, -107, -212, 461, 505, -75, -325, -497, 116, 218, 440, -26, -580, 68, -194, 510, 342, -658, 126, -511, 310, 887, -619, 201, -629, -414, 1214, -217, 302, -276, -1165, 759, 240, 416, 377, -1200, -189, 115, 465, 867, -423, -602, -489, 104, 801, 442, -126, -783, -333, 170, 582, 599, -594, -335, -353, 60, 1026, -295, -144, -322, -636, 1116, 56, -82, 21, -1199, 670, 518, -4, 528, -1262, -275, 558, 140, 969, -468, -929, -77, -60, 892, 583, -505, -638, -417, 170, 801, 543, -558, -429, -371, -67, 1132, -71, -301, -11, -961, 754, 488, -435, 514, -902, -29, 837, -432, 501, -463, -638, 770, -112, 411, 15, -984, 229, 76, 350, 649, -602, -481, -88, 24, 683, 418, -483, -427, -207, -62, 829, 275, -395, -76, -668, 234, 656, -175, 400, -566, -408, 589, -409, 585, 62]
2045F2q68J501j121M15P22j597J220j13p36J241j100J3P95p63O82j20p06N45k40
2064a68J67N44o63PR2m68Q09Q7o53O38p72j75J204r25M93L76j495J102j40n64
2084e04J385j075mN09j026J047k02k62P28j162N42J37o47J289p81k52P74j191
2102f95O58M92q40P82k23n99O52l15k05N05k26M9L55m81n3l1k03P11j42K9J13
2123C33j078P12J00m38J296j172j94J059j286J035O7j374J193m20K27R35j194
2140a99k6m14M6J144j42L39p23q83O73k00N73N18p92J35Q7l21J17n3m06M64Q15
2161G52l29L8o86j098R69M30O75M40j403j60n07L81J283q23N35m35q33J609j026
2180a88k17N89j317J569O47q24K44j453k37J042N96O49n66o58o57J52P94j19L21
$$ y = [62, -806, 695, -426, -11, 711, -886, 334, 221, -515, 726, -374, -361, 434, -329, 353, 233, -473, 72, -168, -1, 543, -120, -113, -21, -489, 320, 407, -246, 392, -380, -555, 649, -276, 217, 593, -902, 200, 60, -504, 881, -194, -198, 311, -715, 332, 130, -132, 596, -566, -24, 113, -534, 755, -26, -278, 496, -695, -37, 455, -385, 397, 174, -425, 227, -88, -293, 212, -14, 35, 390, -91, -144, -175, -378, 333, 191, 220, 333, -745, -33, 67, -371, 925, -247, -441, 618, -668, 367, 434, -940, 253, -167, 60, 995, -199, -225, -639, -593, 551, 409, 748, 25, -858, -185, -385, 188, 706, -86, 49, 136, -185, -68, -121, -527, -63, 752, 423, 461, -225, -1323, -354, 76, 751, 1191, -212, -372, -879, -498, 785, -38, 497, 62, -771, 838, -188, -405, 184, -1133, 436, 1083, 259, 503, -950, -1187, -145, 451, 1100, 534, -124, -781, -629, 165, 46, 367]
2199C67k41j97N20m17j19o18%R91J96P83r33j339K95k70J395Q63q90j57j030J43
2219f58P05L1M95q72K94L43n55Q67j207k94J123n04J194j87j423L43m77O38Q51
2238G07l13j12o08J12Q8R1K47n78M62J48m2K73j002R5O3L12J068q44k4m76p14
2259a047J409k46J80L15j249N40M1q6N11m74J33j56K33R1n21O02n90K30O65j020
2279d39O72k44m64J036o95J33J27n45O35k13J47o6l98M55l50M10Rm97N00m83L42
2300G2J59n12N56o13L41K92o87Q32o27m2P21r70O04m6m00Q10m59n3j29k04L60
2321ER1N13o51j80J64o50J207j66m79O76j179N29M50o80Q27o69ON20n44N11n07
2342b06j01M66k85N78m19k47J19k77P53k87rpo68Q95k70K1L66j108P13Q2j78P45
$$ y = [367, 126, -71, 449, 32, -87, -705, -705, 286, 482, 1265, 332, -1007, -712, -982, 413, 1276, 386, 229, -801, -658, 47, 78, 573, -299, -5, 338, -217, 650, -557, -851, 272, -232, 962, 775, -648, -305, -782, -144, 707, 394, 282, -326, -214, -126, -35, 212, -366, 96, 244, 202, 475, -527, -432, -369, -57, 1011, 167, 143, -333, -1047, 362, 116, 296, 611, -638, -98, -57, -143, 368, -106, 27, -129, 104, 195, -326, 276, -314, -84, 581, -439, 233, -11, -475, 561, -134, -1, 126, -419, 216, 3, 150, 84, -314, 141, -209, 201, 210, -287, 213, -270, 72, 231, -281, 275, -338, 3, 295, -392, 440, -187, -229, 492, -478, 126, 80, -320, 490, 31, -22, -151, -355, 5, 96, 609, -42, -222, -58, -708, 499, 333, -146, 530, -649, -120, 330, -350, 477, -192, -186, 334, -210, 301, -206, -307, 159, -126, 452, 33, -214, -95, -372, 381, 94, 85, 78, -590, 305, 35, 56, 422, -686, 27, 109, -69, 676]
2364F76r87M6J32j10P88m38Kl38k20P36l97N14l09o37Q42o32N33J92r35Q08m97
2385b31J63N85q96M66k23o3O20n02J74l36K5M05j92M76p40L8L24n38J107n80l73
2406b91O04j031R62J24o41P64r47K94M60n20O49n80l5K59k78N65m43J17o5k89
2426c22O93n68L67k8o37R48p09K37M29j011R27l38j74O59q55M01k6r6M58m68L01
2447A88m85J35M49n61Q39o94k44P63r80J007j43p34R64j008M64M51q16Q47o22
2466a80o2N27n38N04k77n8J47k40M31m74L42o9m06Q45q09L46K56r18J129n95n7
2487a56O65j098P88j79k35P35q67M55j94j64O84o92N74m06k71Q07q61P78j96o75
2507e08J007r30M86L64r09Q67n50JN14o05M31k70N5J49k31L94n89M29m4l69Q87
$$ y = [676, -311, -265, -133, -243, 545, 107, 109, -229, -449, 287, -110, 404, 95, -542, 300, -332, 201, 393, -542, 266, -231, -68, 517, -379, 87, -136, -199, 421, -81, 93, -243, -218, 187, -5, 471, -269, -231, 93, -445, 662, 82, -291, 313, -718, 244, 368, -273, 491, -456, -162, 298, -222, 427, -153, -188, 71, -207, 358, -85, 32, -33, -322, 371, -197, 170, 142, -495, 453, -256, -19, 410, -601, 326, -12, -186, 473, -382, 19, -7, -103, 355, -113, 188, -297, -162, 287, -274, 565, -129, -373, 390, -590, 417, 274, -460, 504, -504, -40, 411, -405, 442, -180, -242, 285, -253, 251, -26, -84, 63, -177, 254, -220, 122, 53, -353, 492, -317, 29, 285, -633, 496, -99, -156, 509, -589, 199, 20, -215, 520, -347, 108, -86, -250, 434, -258, 316, -90, -361, 446, -415, 363, 167, -508, 499, -431, 55, 419, -490, 377, -173, -172, 342, -263, 168, -102, -47, 102, -129, 265, -324, 105, 61, -308, 579]
2528E79r78M21K51r41J355q53o7Q45j402J149j59o87J151j096L47M02o76O90m37
2547a06L8P0j20L93n01M68l45k07P60q22O13p4o42R16p61L84J86p23Q83o66L04
2568D8L27q82Q21n63J03O58p95N97m69j36N35n64P81m96j50N87r91Q86j94n56
2588d53R93q15L03L03o99M20k08J64Q5L4J15o69O08l65o7Q76j031N86K4p56J043
2609D91p99J99M09p53R85n92p4M45j006R12q6k82P32q28R8J44k40L69o8J85l59
2630a18K05K1n94P97n08L8P96r57M99j68n59P84l80L80j3m34L99o24N34M8m48
2651c02P87p53K22L83p74O86l70n2M88m93M70l79j11L40m99N94j25k29L94m83
2671b06J55K3l9J21o3L02n06K66j5n62R78n43k2O67j127O67K7n48R36o64J23K20
$$ y = [579, -399, 22, 273, -668, 687, -166, -233, 612, -790, 359, 200, -487, 664, -432, -85, 317, -359, 331, -106, -68, 2, -118, 275, -226, 242, -103, -310, 450, -372, 241, 167, -475, 441, -320, 64, 250, -473, 410, -256, 48, 375, -507, 314, -249, -146, 512, -283, 314, -155, -291, 244, -320, 461, -35, -185, 402, -589, 297, 103, -453, 540, -275, 28, 331, -368, 52, -156, 8, 93, 127, 242, -427, 181, -184, -251, 625, -406, 180, 204, -552, 491, -308, -109, 300, -453, 532, -60, -134, 311, -695, 217, 131, -151, 581, -247, -149, -5, -245, 124, 56, 241, -118, 87, 108, -486, 311, -197, -159, 637, -320, 179, 11, -548, 236, -144, 236, 223, -211, 188, -436, 98, 146, -302, 485, -268, -46, 337, -437, 249, -121, -173, 315, -178, 292, -87, -198, 142, -357, 237, 112, -117, 277, -206, -51, -28, -67, 54, -9, 293, -213, 53, 38, -524, 454, -89, -111, 556, -571, 96, 123, -425, 511, -153, -30, 190]
2693A90n74O21l34M9K99n22M42k30p3L27k96J92r9k3j0o5L34l75K96q6m45O54
2715B72m36J60L70p05M45j88o1M38m25K97l12l6L90m70N69k91l09N99o43M23J44
2736B31m89N09l94Q1K01l20L56k61J13J14l24L07k69R6K25k32K05k67N5O0n7L92
2758C32m70J60l4l78P59l54K9K38p73N00mp9N26n72R8p4j79N08k89K11p3k94L69
2781A57l03J41M7j98L52j68J39j42k99K88k25M41O0m14K71m67K01L58l22K92l15
2802a06l2L33k21K26l49j31K86m1M87k81l30m5k77O11J17J5Jo57K90l0K6M99n57
2825a66K36J06l38L94m35j19L36L1L79j66l34l08jN15O8K60l57n01L52j59L77
2846A70J31n43K74j66K09L29n97J10k20R6O94k91k4l11l71M63J75J25q5k54o2
$$ y = [190, -384, 237, -97, -48, 251, -271, 171, -59, -132, 195, -101, 91, -8, -31, -41, -106, 228, -147, 149, 63, -382, 272, -164, -4, 366, -339, 106, -82, -143, 295, -130, 167, -145, -181, 209, -261, 308, 17, -292, 307, -336, 87, 231, -258, 251, -143, -62, 139, -181, 175, -86, 27, 141, -183, 124, -145, -49, 176, -56, 149, -118, -63, -3, -60, 332, -138, 22, -12, -390, 369, 15, 44, 282, -491, 9, 5, -74, 452, -120, -22, -96, -275, 233, -56, 155, 82, -212, 157, -146, -5, 42, -156, 196, 28, 167, 25, -274, 14, -211, 230, 290, -124, 147, -320, -119, 239, -83, 209, -106, -138, 195, -26, 200, -149, -280, 6, -35, 452, 171, -159, -204, -481, 130, 247, 262, 263, -394, -104, -134, -108, 391, -166, 70, 176, -162, 232, -203, -322, 14, 45, 424, 258, -76, -384, -385, 130, 198, 458, 101, -400, -48, -207, 170, 301, -242, 32, -134, 75, 404, -193, -83, -303, -207, 487, 196, 172, -139, -510, -47, 128, 253, 168, -86, -148]
2867a48QL61k75o5J60k96O22p5n15K00m42L68N71k83L4m78j83L98J47K63l03k40
2889a71N%M35j65j42n5j66M64n6r8m2l93M31P8n7J77n37J31K67j08K45k93k01
2912b51J81J58J09j29j17k61K47L34k34J74l72k47O27k30K08J9o66M50J7pL76
2933C86n90N5J84j58L78j91k76J86kJ14R1k37k12K52J25K5J52n38m2L49r4M14
2955C71j97n10K75j13K88K46m52J8j20J47L39k22p4k10K6L78k5J4l13j67L03P1
2977G3K10k15l35J65%L04J09m85%nJ50M01j98l55l9M6K18L62k70l88J19j18L69
3000A18L65o11M5p7j40P34k89k56J55m60N18K47l96J73m35M6N45j63N5k41l09
3021c76L60J63N3o7l25p7K42K10%j05l03j1L06P6O9k10k85J71J10K00l0k94rn3
$$ y = [-148, -140, 221, -54, -119, 41, -255, 367, 292, -223, -23, -465, -97, 474, 191, 225, -253, -436, -38, 109, 372, 69, -171, -166, -166, 269, 104, -38, -93, -259, 205, 149, 51, 9, -384, 47, 125, 68, 245, -292, -161, 106, -2, 243, -50, -251, -70, 88, 197, 68, -49, -310, -63, 271, 37, 211, -161, -408, 219, -11, 197, 216, -450, 0, 17, 10, 386, -204, -149, 35, -123, 255, 64, -212, -26, -28, 86, 177, -60, -272, -20, 105, 130, 282, -256, -298, 51, -43, 371, 174, -336, -61, -174, 114, 360, -92, -74, -194, -47, 292, 70, -4, -214, -188, 190, 165, 179, -134, -301, 2, 73, 283, 68, -267, -102, -102, 202, 311, -174, -174, -179, -29, 372, 174, -181, -220, -174, 44, 406, 136, -252, -133, -251, 118, 483, -128, -83, -160, -300, 434, 145, -111, 44, -416, 102, 349, -47, 126, -309, -263, 282, 119, 174, -67, -376, -16, 147, 200, 133, -192, -269, -27, 183, 183, 78, -225, -236, 70, 146, 215, 5, -280, -109, 1, 201, 171, -123, -132, -185]
3045a85K79J44k47L4k68J23L84k84J84k29k68N29j90P7J26n37L13R7j58L42l25
3066e9j41K61j20J38R0l06K0J37p4J84ll21J97n7rL30l53K6J07k71L87q7j68K18
3090A26l18J58J53j69J78j76l8R1l9J51j30K2k2j20K58j48K2J18l00K28Pj30J89
3113A11j64l6J40m7MK0o6p2J94o8j4J15l19J97Q0j80L52l37q3L25l52L84l3m01
3137b50L72k50P4L23l65Q5Nj32K27K9j42n2P7q1J27J26l16J63k5j35L50k60n2
3160a02J67k11K67l3j96J00j40J81J07p9n9j71Q9N9J89l8k47J27j89J88K27l98
3182a62K51j42j27M98l95k7J34l09M25O9k24K1j86KK39J12j61n4k1j02L44j10
3204G5k25J83k47L26K11m02J02l30M7N13j13Q6k20l61K42J04J42J5j91n0P3J86
$$ y = [-185, 94, 238, -9, 25, -243, -120, 264, -20, 164, -65, -333, 196, 6, 83, 209, -328, -15, 82, -76, 266, -59, -200, 61, -59, 79, 169, -137, -117, 20, -54, 130, 127, -194, 3, -54, -63, 267, -86, -60, 47, -224, 163, 76, -92, 126, -192, -34, 119, -50, 128, -48, -86, 5, -34, 117, -13, 9, -13, -133, 125, -23, -1, 117, -183, 45, 52, -78, 111, -53, -89, 51, 4, 8, 28, -38, -110, 84, 16, 2, 117, -202, -5, 75, -105, 247, -90, -173, 152, -200, 184, 151, -250, 122, -128, -54, 269, -96, -11, -6, -138, 89, 118, -24, -76, 1, -80, 47, 173, -143, 20, -5, -140, 210, -50, -102, 65, -146, 121, 88, -108, -8, -148, 33, 140, 61, 2, -169, -80, -21, 168, 130, -117, 10, -179, 9, 236, -162, 89, -53, -180, 318, -77, -104, 30, -279, 146, 215, -9, 12, -174, -172, 67, 179, 18, -36, -57, -159, 185, 75, -150, 33, -214, 112, 323, -79, 23, -307, -260, 253, 140, 226, 6, -355, -113, -9, 133, 148, -43, -93, -20, 166]
3226A66j88m4p3r6N39o4k00ln49L56L77r0K24m50k23K50K2K12p4k17L2J48J46
3249B01j50j29k32J05M74l3M6l36m30L76Q8K48J54n62Q8K0k3L14k77j08J69O5
3271F8J73q5l14k33K53K85J31R6n53j74K38k7M75j24m17K20j90K22J99m21Q8j1
3293a01J25L11k27j98j82O0L17J46j4l26j13N3J36K65k43p3J6o2L54j62k03L0
3315i1j38L56J46j78j20k71J41K41J08ql15KPJ51K07l04K2m6k2L67k24r6L4j75
3339b06L37N2j80oj92J32J93K5j10j54j6M9K49lk13J0j57J95J93k16Q3j79j0K88
3363A64j39M6j27j24K57k2R9j12k32J28kJ88M6k20K3q9J25J19j47M5j36R0J60
3386A40j19N1j65n9K13PN5q2j31mO1J26p2M8r9q1K53j86L4Q1k65L25k2j57J67
$$ y = [166, -22, -66, -139, -235, 304, 240, 40, 37, -512, -156, 221, 131, 355, -95, -318, -68, -46, 166, 92, -125, -93, 55, 201, 51, -78, -310, -205, 269, 236, 282, -54, -484, -108, -20, 228, 382, -180, -92, -72, -95, 219, -58, -166, 3, 68, 241, 156, -158, -391, -138, 147, 278, 374, -179, -353, -115, -142, 333, 209, -208, 12, -178, 44, 243, -178, -90, -101, 24, 335, 108, -90, -272, -212, 105, 251, 237, -89, -202, -149, -13, 252, 9, -64, -48, -110, 244, 82, -121, -91, -229, 127, 273, 95, -25, -296, -155, 86, 194, 186, -129, -127, -120, 31, 238, -66, -44, -90, -112, 255, 31, -65, -31, -206, 131, 183, 3, -3, -195, -63, 130, 155, 45, -109, -125, -76, 173, 170, -43, -33, -190, 5, 198, -18, 65, -114, -124, 164, 25, 71, -56, -180, 77, 55, 154, 42, -190, -62, -64, 124, 170, -50, -27, -116, 9, 128, -19, 26, -110, -20, 140, 21, 72, -93, -152, 61, 68, 123, 41, -90, -94, -33, 93, 21, 69, -30, -111, 142, -44, -10, 71, -194, 131, 109, -48, 119]
3411A19l07J04J71p8J72k06p9N4j8J71n4l1k2q2J23l2K2lr1J12p0Q1l5j03J42
3436F0r9O0M9j47J23o2K9P1j36Q0r3O4P2j23J58j85L0J44k17K56q7j67K56k76
3460a40J29J32k33K19j22q1J42r1Q8K2o7l1jL5j2J18j03n9J12j71J79nj36K15
3484A39k28R8Q3k31K31j25OJ89k71J26o1n2K34j29N2q5j26J55l7J49n8j42P2j12
3508a23J98K2j48J10j81R6J14r1R0j54L2O1k7Q3j57R2j7j3J77k53O4L8j15L10
3532B08k00o2P5k19L10j2o7M9k85J71P0j1J31k48J4K9K2J61j33j8n3J5J57j15
3556a1P7j24rJ72j40J12j13j08K42j16J32n4k36J94q5J73P1k89R8j47J33K25j96
3579AP3j85l6K45p9J04j38j06J24l4J37q2p9M4p9K00q1p4N4j41K35k2r9M6k17
$$ y = [119, -188, -84, 87, 9, 181, -25, -104, -50, -68, 103, 49, 18, -4, -86, 37, 5, 27, 24, -67, 45, -25, 56, 21, -82, 60, -39, 21, 70, -77, 46, -16, 13, 84, -52, 28, -65, -1, 71, -52, 106, -79, -49, 95, -122, 134, 47, -120, 136, -140, -11, 121, -112, 107, -15, -96, 46, -45, 43, 65, -2, -33, -34, 1, -11, 107, 4, -55, 57, -114, 65, 60, -76, 139, -89, 9, 92, -139, 92, -33, -27, 162, -109, 17, -44, -96, 138, 9, 61, -24, -150, 5, -32, 117, 59, -83, -11, -123, 75, 97, -51, 59, -122, -26, 88, -3, 87, -67, -35, 26, -1, 82, -75, 17, 0, -13, 164, -89, -25, 13, -102, 208, 8, -54, 21, -198, 112, 100, 33, 82, -203, -32, 38, 27, 158, -90, -76, -47, -25, 136, 3, -15, -68, -53, 104, -11, 66, -58, -67, 105, -35, 77, -36, -144, 98, -18, 114, 60, -176, 18, -67, 106, 177, -112, -14, -161, -28, 197, 1, 74, -111, -147, 98, 19, 123, -15, -121, 3, -31, 106, 24, -55, -11, -90, 110, 29, -45, 9, -132, 103, 81, -18, 28, -189]
3604a89J92Q6n3Q8k81O6Q9K4J79k29m6j1j6K64j34J4o8j52K60p4L9L2k43J98k
3629C3l2J11k27P5Q6k7P1j31m0K9J08N4j09Qj62J19J73j19J04k25o7K35j00K13
3653A80q1k57J60j09J50J21k19R7r7J0J15j03M4m8M7N0n6L2j74R2J18o0J35k00
3677e3q8J51p8J87j4j81M8n8R7Q0m8p6o5Q7JJ03rk03J19o7O3J76k40J13m3j21
3703a19K41j82JJ43j81J98n5j59J18r3Q8J33q8o1n6l2O2J64p0o4L5j78J58R1j42
3728d8J50j54l1J75j47R6oj29J58p8J8L5r8Q0k0K3j7n7O4m3R6m1q1Q5j28J04Q5
3755I1j30J15j22p2J84q6M6L6j32L6K4J8QK4n7k1Q0j13R3L0j23J62j24l8J58j77
3781i0J44K5j50J50j55K4J22j09J00l5r6P4l5K3L6Jm5qM1p7J07l2q3J45j37L6
$$ y = [-189, 3, 89, 36, 124, -157, -91, -2, 22, 201, -28, -74, -85, -101, 163, 29, 43, -25, -177, 83, 9, 48, 80, -163, 35, 33, 1, 112, -115, -40, 46, 19, 90, -41, -81, -52, 56, 110, 1, 9, -153, -34, 139, 20, 124, -101, -168, 67, -33, 180, 99, -158, 2, -107, 43, 164, -55, 42, -55, -45, 70, -33, 11, -37, 10, 60, 4, 36, -138, -46, 72, 12, 147, -53, -141, 10, -68, 119, 105, -76, -28, -86, 11, 91, 43, -33, -98, -11, -10, 93, 84, -119, 0, -67, -4, 172, -68, 45, 2, -119, 122, -60, -59, 84, -97, 101, 46, -113, 5, -88, 0, 133, 45, -16, -72, -104, -42, 122, 52, -12, 23, -155, 3, 94, -48, 102, -52, -83, 92, -55, 41, 35, -94, 64, -14, 4, 39, -59, 21, 1, 24, 7, -50, 14, -29, 67, 26, -55, 30, -98, 6, 91, -39, 76, -46, -118, 66, -20, 26, 62, -70, -34, -10, 8, 16, 40, -17, -38, 42, -71, 22, 52, -71, 91, -33, -71, 87, -90, 54, 79, -71, 79, -76, -52, 70, -39, 61, 26, -70, 4, -31, -8, 28, 29, -16, -24, 17, -60, 47, 15, -68, 77, -60, -24]
3807b4R2j54J28nj06J12p8J7O1l6Ql6J0j3L1K5l9O9r5LQ0j09J27m8q9J46j52P7
3835BP5j64J39p0m9J30j10N3L3q6M0pLK8K6m8l6O2q3O8N4q9J04r2l7Q0j01J10
3863C5Rm0N8j05J1KkJ17o7K5k9j02J06o7N9M9r8Q0o4rO3j06R8nk7J01j08j7J0
3892b3m2O4L6nk8J0o0J1Q1p9N7K3q8J20j09n7J25j17J40K9j25Q7j51L6J24q1J24
3919A02q6o9P6r4Q2J4o2P3m7J8On2J1lM8J2j2j6n8M2kM1K2o4M1n5K0M6q8J02p7
3950b9j0J46j74Q8j8j19J91p6LP8j78J16qn0J18j11J8L5p8Q6k7l0L7j7J8Nkm3
3978c1L3onN7p3NL6p6J02l5m0Q4j03P6%o6J10j03K8M5j12J28o5kR7j41P5j6o1
4007e9J17q1L1L1r1N8qj7M5l1NPmk9L5j1k3O7q4N4J0q8J23n2m4J22j58Q9K8j18
$$ y = [-24, 68, -86, 42, 37, -69, 43, -35, -18, 43, 7, 15, -21, -11, -24, 7, 32, -7, 62, -33, -30, 50, -59, 68, 20, -69, 77, -75, 2, 77, -87, 52, -18, -67, 63, -47, 6, 39, -47, -7, -14, -11, 17, 43, -5, -41, 21, -62, 6, 60, -29, 75, -17, -54, 26, -75, 35, 44, 4, 62, -43, -32, -30, -32, 85, 18, 43, 14, -88, 18, -49, 10, 59, -39, 41, -23, -32, 31, -75, 23, 18, -9, 92, -16, -33, -23, -65, -1, 35, 30, 2, 12, -48, -37, 44, -35, 22, 45, -43, 77, -32, -89, 36, -81, 59, 88, -37, 50, -101, -65, 59, -22, 102, 16, -53, 23, -71, 11, 25, -37, 36, -11, 7, 13, -39, -28, -31, 17, 29, 17, 1, -57, -15, -17, 24, 46, -18, 23, -32, -12, 34, -54, 48, -29, -39, 107, -67, 21, 3, -116, 75, -1, 2, 80, -98, 18, 10, -40, 78, -33, -15, 20, -58, 28, 1, -29, 8, -9, 9, 14, 12, -31, 2, -4, -9, 48, -25, -20, 16, -60, 42, 7, -33, 51, -52, 24, 24, -42, 68, -35, -7, 38, -74, 54, -11, -13, 84, -57, 18, 2, -59, 58, -23, 8, 39, -52, 6, -2, -19, 26, -5, 0, 7, 3, -26, 9, -2, -25, 42, -42, 12, 22, -66, 57, 5, -39, 83, -75, 14, 42, -76]
4037g6J53j01j5J08j09Q0jq9P9p0M5L5m4J5l5NJ8QJj4Mk5M4ql5M8m4K7K6p6O6
4068B0m8mR0q5P4n7m7J12j02Q3Rj15R8n3K4P2j13N4rm6R5n0mK5o3M1RpnJ4m1L1
4100BL9p8O4m6l0J10r2M3J9j09J37n9l0J02j45P5K2p0J11q1mN1q3P9k0k9L5l6
4128b3K8J0j0Kj0RrK4l6LK4m3P0l6k3N3q5P3Mn8Q5j04M3M3q8J02o3j5Q2r9P1J9
4160D3q7Q2o5K1L7o0M2pk0L6l1J0KKqL2l0j2L7l8J9J4n2N7l6oN3p3N1lm1P9q9
4193d1L6L3p4R8p6JP0q5P5j0o1O0m2J6L2m6L4l0j1L1k2OJ3j5kJ6orL2m7J5J7m4
4226c6N6l6lN5o3M7rn3P7m8J6L4o9M5k3j6N1m9M6k5k3N7m4J1J1m3N9j6j4K8n4
4257c1J4J6k6N3k4pMj5lQj1J9K7k8Pln3O0klO6j01J3J6o9J18m1k1O8r5M5J0o2
$$ y = [-76, 77, -24, -39, 69, -40, 40, 39, -50, 29, -41, 4, 39, -5, 10, -25, -20, -2, 6, 7, -7, -3, -28, 16, 8, -27, 21, -23, 4, 30, -46, 20, -28, -32, 58, -27, 47, -10, -57, 55, -47, 36, 45, -70, 28, -25, -1, 71, -42, 12, 3, -43, 52, 2, -2, 23, -40, 1, 10, 3, -2, 12, -29, 2, 41, -37, 27, -19, -49, 61, -31, 12, 31, -78, 59, 0, -30, 72, -73, 2, 24, -46, 65, -16, -20, 31, -52, 27, 7, -22, 13, -23, 5, 15, 5, 7, -3, 6, -3, 21, -15, -12, 12, -31, 39, 3, -20, 33, -52, 21, 25, -33, 52, -52, -9, 34, -54, 48, -15, -30, 52, -47, 24, 43, -44, 38, -27, -6, 31, -29, 13, 6, -14, 22, -9, 1, 3, 5, -3, 29, -1, -13, 24, -14, 5, 19, -33, 24, -12, -18, 35, -38, 13, 10, -31, 48, -41, -5, 28, -46, 52, -24, -23, 47, -38, 37, 27, -34, 26, -16, 0, 32, -14, 20, -10, -21, 10, -12, -6, 7, -8, -10, 6, 0, -9, 23, -24, -9, 8, -36, 20, -16, -19, 36, -27, 20, 11, -42, 35, -13, 3, 37, -32, 13, -10, -26, 25, -24, 22, -3, -26, 31, -13, -2, 9, -34, 25, 9, -5, 23, -31, -17, -1, -27, 26, 2, -5, -1, -16, -19, -11, -22, -3, 24, -4, 3, 0, -53, 7, 5, 2, 68, -33, -20, -4, -73, 45, 4, -17, 51, -44, 1, 11, -51]
4290e1P9l9j5P9p3K6j1n1O1NOK0m3qoJOK7jJOl8Mkk3N8Kpmn2J1LK3N3l1Nn8qM8
4329Cl1N4Ln7P3q0J6M8q4P7kj5N4r2OL0k8N7ml0J1l4JK9mj2K3nj2L8o7J6J5k6
4363b9Q4m0n4N9p9L7M9p4J05p1j7M8o2O4%j6K2l9K2j2nJ9k7L7l7RK3m1N4k7j3
4394a1L6o0L6%j7M2n1K2J1m3N0j8Nqj6K5l4N1k6k5O6o6L4Ro4R0n2rO1p2O1j8l2
4427b3L0k8K2J2Jk0pJ2l7M3Qk2L6n7J2L3o4P1m5oP9q3M2j0o3R6l6J3J4n9J8MK0
4460FJ4Kl7j7L5jJL6q8M9Rk5P2q1LL2m1O3qn2K7n0O5Rk0Km1K6J0QJm6M4l3L6L7
4496D7p8L3m3J1R3o2K0l6l3O1%K6k3n2J6JN5j9k5mm9Q0Kj6K8p9L2L5l7O2p2qM0
4529Fm0O3l2l6J9j1N0jj7k4j8M7j0L8k9n2N9m5N2L7q7L6l8J1P4n3Rk2k6N4j2J3
$$ y = [-51, 28, -11, -26, 53, -20, 6, -5, -56, 5, 10, 16, 36, -7, -15, -21, -20, -14, 13, 12, 13, 19, -19, -15, -17, -40, 18, 20, 13, 9, -43, -32, -29, -6, 47, 16, 21, -37, -45, 3, -28, 26, 29, -28, 45, -35, -19, 29, -55, 22, 20, 5, 59, -33, -27, 3, -25, 32, 28, -2, 9, -25, -24, 5, 1, -11, 12, 7, -5, 33, -34, -18, -3, -29, 55, 15, -39, 20, -59, -22, 27, -47, 58, -13, -30, 18, -44, 20, 20, 4, 26, -13, 9, -3, -8, 11, -16, 21, -16, -7, 16, -25, 29, 2, -11, 25, -35, 1, 1, -16, 26, -25, -3, 8, -35, 15, -3, 2, -6, -22, 3, -31, 20, -6, -31, 35, -31, 3, 12, -52, 38, -14, -23, 38, -34, 27, 9, -23, 7, -21, 1, 13, 14, -6, -13, -1, -38, 5, 13, -9, 27, -30, -18, 15, -49, 22, -23, -29, 50, -33, 9, -1, -64, 32, -4, 9, 23, -36, -18, -14, 6, 20, 22, -15, -32, 3, 2, 3, 39, -49, 0, 9, -16, 56, -25, -22, 10, -31, 32, 24, -28, -1, -51, 14, 23, 3, 5, -36, -10, 0, 8, 9, -37, 7, -26, 10, 47, -31, 2, -41, -30, 63, 1, 21, -15, -48, 13, 13, 39, 16, -36, -20, -19, 36, 17, -8, -12, -61, 19, 21, 5, 33, -46, -14, 21, -16, 46, -26, -34, 6, -34, 29, -3, -39, -20, -31, 19, 18, 1, -23, -41, 6, -4, 34, 5, -47, 12, -33, 19, 56, -31, 5, -33, -22, 52, -1, 8, -14, -40, 14, 2, 15]
4561A5lm4K8kK5kk2nrL8k4qRl6N0J3m1M3p3J8N3m3N7m0k2L1j6K3j1qlnL0nRLo4
4598d1N3k7J0K8m8K9k6JN4l8J6Jm2N2l2J6J3l6J1j1POjJ2l2K9j8ML7m9J8Pl0M4
4632A7k2mL2n7M8nj6K3l4J4J3nJ3l5J5j6MK9k1J2k2j1M3k2L1k2n2N1k3L2L3q2
4664c9L3j8J3N8n0Ok6PL2mJ3n1KK0lN7o3pJ6l7R5j8m1J5o5P0K4l8J7o4K1M9%J1
4698C5m1k3jK8M8l8j3l9PO6qPm2m7O4jM0rq4L6rL2L9n0j5j4PO0k3j1l4MM3LK5
4733D2n5k7K0QO6j8o3J5l2O1K2l0k0m1K8L0PJ2n5pL4J0M3n2j1j6oP3k6j0j5l3
4765d6N8LRj2m6L0jJ8J5n3J5pJ5L3l2Ml1K3L1k0K0m2j2M0l0M5nn3K9j2L4Ml0J5
4799Ik0RK4j4Lk6RJNJ9l1K3j5j4M3l5K0jk4M1l1J0J9m4L8j9j3K3l3K5nOjk0K2
$$ y = [15, 12, -32, -4, -6, 19, 17, -5, -10, -19, 19, -5, -13, -4, -40, 10, 23, -18, 25, -48, -30, 23, -20, 37, -3, -25, 6, -10, 13, 2, -6, -9, -14, 16, 11, 20, 23, -41, 12, -15, -5, 23, -25, 4, -22, -21, 33, -5, 11, 12, -30, 22, -10, 6, 19, -17, -6, -17, -10, -4, -5, 7, -25, 4, -14, -10, 27, -22, -4, 3, -27, 17, -5, -9, 23, -34, 14, 9, -7, 16, -18, -4, 9, 4, 17, -18, -3, -19, -15, 14, -7, 5, -17, -28, 15, -7, 24, 2, -50, 1, -22, 10, 43, -39, -6, -24, -11, 47, -3, 3, -23, -16, 16, 12, 25, -26, -24, -4, -7, 50, -13, -20, -4, -41, 54, 36, -5, 10, -55, 15, 39, 1, 18, -46, -25, 24, 24, 35, -6, -29, -30, -2, 46, 8, -5, -44, -37, 29, 21, 28, -14, -61, 3, 2, 42, 33, -51, -15, -24, 8, 47, -3, -18, -32, -25, 35, 12, 1, -33, -29, 14, 17, 42, -13, -40, -20, -12, 54, 36, -27, -12, -44, 17, 39, 9, -11, -52, -24, 6, 13, 25, -30, -37, -3, 7, 50, -2, -13, -29, -35, 38, 12, 2, -13, -46, 12, 15, 24, 12, -34, -4, -5, 13, 28, -25, -10, -17, -2, 31, -1, 3, -28, -5, 26, 6, 26, -16, -28, 12, -18, 27, 22, -31, -2, -14, 20, 24, -6, 9, -11, -2, 22, 8, 11, -15, -6, -5, 0, 19, -12, 11, -4, -18, 25, -10, 10, 9, -15, 26, -5, 5, 24, -20, 18, -1, -14, 9, -24, 1, -4, 2, 1, -19, 3]
4834CloRj7J0%Rj2j1K5j0J4%l7L2lkL1l5J2j1rL7j4lj9k6L7NJ4j3l8K2J1ML0m5
4871ij1PKL6ok6k4J1J2K8ll5j1J5J4K5k0k6JMN0k2j3rk5L9K4j5%l4nK5J3K0l8
4906fj6jJ2L2K2m0j8k4L6L5k0j8k0%K9K0j3j8k9J4L8K3j6l5j9J9K9J3Jm4j0K4
4938@LL3l0l0J0J0J9J5m1k4J8J6L2rl3rk3N5RKj9l1LK2J6qj5j9K4OJ5j7j0j9K3
4973fK3Rj5l6MJ5J4J9j9k0Rj4L7Kk6%pK3Nj9J0m6L8K1j8K5l7k3J5J2J7Nl1j3J8
5008iPJ3%j7nPkK6ok4J7k4L2qj8K8l0PL1l7K8j2l2M2j8OJk7K1lOOnnOoQoJ2k5
5048a5K0qqJ4j4K2kj6K5k6K1Nk9J3k7K6J4j3Qk6jK4k0N1k8k3J9k3K0J6k7J1pr
5082a3K4k6J0JqJ5J3k1rKKJ6J2l2J6l0J8M9m0Qj4k0M5njMn3L0J8JJ3l6LJJ7K2
$$ y = [3, 0, -6, 3, -14, -4, -4, 5, -7, -18, 7, -3, 11, 11, -26, 6, 3, 1, 32, -3, 9, -2, -11, 26, 12, 9, -10, -36, 1, 6, 20, 7, -31, -9, 2, 6, 36, -9, -20, -13, -11, 25, 19, -7, -31, -20, -8, 20, 17, -18, -29, -14, 0, 25, 5, -21, -20, -16, 34, 12, -1, -10, -35, 4, 28, 13, 13, -21, -26, -1, 12, 32, -6, -22, -23, -11, 21, 43, 3, -15, -39, -3, 32, 12, -6, -26, -26, 3, 23, 10, -8, -37, -23, 15, 38, 22, -13, -32, -13, 16, 29, 30, -14, -24, 0, 3, 36, 6, -24, -14, -4, 15, 30, -11, -35, -17, -1, 31, 22, -11, -20, -43, 12, 21, 23, 4, -27, -24, -2, 14, 6, -9, -28, -4, 2, 17, 0, -10, -29, -6, 17, 26, 11, -25, -21, -6, 8, 27, 8, -12, -3, -17, 20, 22, -4, -4, -11, 12, 17, -2, 8, -38, 0, 21, 3, 28, -9, -32, -17, -5, 12, 17, -14, -27, -9, -2, 11, 11, -6, -11, -4, -6, 20, 14, -10, 7, -17, 15, 7, -11, 17, -13, -6, 25, -12, 16, 4, -28, 14, -4, 2, 3, -24, -3, -6, 0, 6, 1, -4, 2, -4, 4, -2, 10, -15, 5, -3, -11, 3, -11, 11, 9, -7, 18, -8, 13, 18, -11, 2, -25, 1, 15, 2, 10, -16, -17, 7, -13, 38, 10, -13, 6, -17, 3, 19, -8, 3, -4, -13, 11, -15, -5, -4, -12, 3, 16, -5, -14, -12, -10, 6, 18, -14, 2, -28, -10, 39, -1, 7, -7, -27, 18, 13, 12, 16, -37, -7, 11, 12, 25, -11, -8, -7, 10, 32]
5118C2j7k2j5PL4Mj1k7R%NK6l0k0J1JL1qk6mpM3J6k1k3j8J9K2J7mn1J2KK1K5m3
5154a0j2J8k8N9jl5J4k3mM8j8mpl2L9J7j0Kk6j4M8j5j1Ml2K6J8mmk1mL1oJ0jl1
5190a9K4nJ0J2k0j0jNJ7Kj8j3J2RPJj8nJ2pRMj6nK4j3J9%k6J8j6QOkj2Mj2K5%
5229A0j7OqkK8k8J6pj7K2J3j9K1j8nJJJ4kj6R%j5J6J3pqnqJ9jj1J5j7mJ2kPj1
5268eOLJoKqQKQrj2RrJ6kj4K2j2qK9l0J1Rl6L2m%jj2PmMJPj7J4oj0J6Plkj6J2
5312@J3k5J5Ok4K8j3L%rJ9ojnj0J2nJ4kJ1j3j3MJ6j8J6k7J5Rk0J8jj8PM%J8j4
5350Dq%j2J6POk5J7k0J2J9k3K0pj0J4moOj%J7j9j2Oj6K9Oj7mqj7L9n%Ol0J3K7
5389B0k2J4l1kL1K%j0k0MPK1j4J0j9KJ9j5J3qj6J9j2J1J3k4KJ0JOnj2kLJ9mj5
$$ y = [32, 15, -7, -22, -15, 19, 23, 12, -15, -6, -6, -1, 25, -5, -25, -14, -13, 18, 10, -16, -20, -27, 16, 32, 11, -12, -30, -11, 11, 28, 24, -27, -15, -13, 8, 33, -10, -22, -4, -32, 27, 26, -9, 5, -18, -22, 26, 8, 4, -3, -35, 4, 21, 11, 13, -13, -27, 21, 6, -5, -1, -33, -7, 11, 7, 3, -18, -22, 9, 3, 13, 12, -19, 5, 0, 10, 22, 2, -8, -9, -4, 13, 15, -3, -16, -4, 5, 12, 13, -5, -10, 2, -5, 4, 8, -8, -13, 11, -2, 17, 17, -9, 9, -7, 1, 7, 5, -7, -3, -15, 10, 10, -7, -1, -9, -11, 17, -11, 5, -2, -19, 3, 16, -3, 18, 0, -5, -4, -3, 11, 9, -7, 2, 2, -13, 3, 16, 9, 1, -4, -12, 7, 6, -5, 10, -7, -11, 1, -1, 6, -5, 1, 4, 5, -1, 1, -7, 1, 3, 11, 2, -10, -1, -10, 6, 4, -10, 12, 0, -8, 21, -9, 2, 11, -25, 7, 3, 3, 2, -10, -3, -7, -3, -2, 5, -12, 2, -4, -14, 2, 9, 6, 4, -12, 0, 13, -12, 3, 9, -15, 13, 0, 3, 3, -6, 13, 7, 6, 1, -9, 3, -2, 12, 10, 21, 8, -5, -1, 15, -3, 13, -14, 1, 10, -10, 8, 7, -11, -4, 0, 0, 18, 4, -4, -4, -16, 0, 7, 13, -12, 5, -15, -3, 16, -7, 13, 6, -4, 10, 6, 0, 6, 5, 5, 22, 3, -9, -3, -19, 10, 16, -1, -5, -13, -30, 9, 4, 4, 10, -20, -7, 20, -2, 12, -19, -21, 10, 12, 12, 2, -18, -14, -7, 14, 0, 10, -9, -7, 12, -3, 10, 2, -14, 5, -7, 4, 17, -7, -5, 5, 6, 12, 7, -5, -7, -4, 15, 11, -4]
5426dj6J9jlK1k1mJ6k3L5ol4J0NJ1J7j4rQj4K0Pj8%j0MK6j1k1K6k4J2L0m6NJ6
5462Ik6L0nj3J4k0RJ7j8oNrJ4J3qjjqJ6pk1L2k6K1Pk7K1j2MJ8rj1KrpNK2j2Kj1
5502fkJ7%k6L0k0J6J1k8J6j4jJ9j7JJ3j2KKlkjj8K9Jk9L1j8OK6j8MQl0K3%lJ1
5540A8j2k5L0j4J9mk2J7KrJ1mj8J9kpJ1jk0K8j7OK0l1J4krJ6j3j0K0nJNj8J2P
5577A3njJ8j6mOj4K0jk9J9j1J0J7l0J9Jk4K1oKRj5oRjkRpKJ2j7J2lj6K4j4nL4
5616C0m0K4Kk1K4k3LJ8j0kk%NpJ1j2J7lk4L0k2RJj3J3j2oK9j8KPj7L3j5nPj7Q
5654DrRj0J5jk6M4k0j5M0m4L2Km1M2k3kK0l0J3QqRoN%loJJ3pLrk1M0k0NJ5l3K0
5694Fj0OJ5k9J6jnJ3j0%%nK0j8RJk2K4j5J9%k7K6j4nK7l4K4j3mJ5j6PkKKLLk2
$$ y = [-4, -20, -1, -2, -5, 16, -5, -9, 7, -16, 19, 13, -21, -11, -6, 5, 22, 8, -1, 7, -7, 13, 20, 2, 2, -8, -4, 22, 11, -10, 16, -8, 4, 34, -12, -7, 9, -17, 13, 8, -5, 9, -11, -2, 15, -3, -9, -4, -13, 1, 14, 6, 5, 4, -4, 12, 5, -16, 16, -10, 11, 18, -9, 12, 0, 4, 22, 13, 2, 4, -5, -12, -7, 15, 3, 5, -6, -8, 9, 9, -17, 13, -7, 9, 20, -8, 8, -6, -7, 12, -5, -4, 9, -3, -1, 1, -2, -4, -5, -23, 6, 7, -22, 9, -9, -3, 23, 5, 9, 17, -13, 10, 10, 7, 18, 6, -19, 11, -3, 16, 12, -10, 7, 9, 0, 11, 7, -11, 8, 6, -1, 10, 9, -11, 17, 0, 6, 26, -5, 9, 7, -2, 14, 1, -9, 11, 6, 7, 12, -6, 6, 13, 8, 7, 25, 9, 5, 11, -3, 17, 16, -13, 6, -5, 5, 22, -8, 11, 12, -12, 9, 3, 5, 14, -1, -7, 2, 1, -1, 8, 1, 3, 15, -2, 10, 7, -9, 15, 1, -4, 30, -10, 14, 16, -5, 19, -4, -1, 17, 7, 5, 3, 3, 8, 1, 12, 0, 17, 14, -10, 20, -2, 7, 8, -5, 8, -4, -10, 19, 1, 3, 10, -7, 26, 11, 6, 13, -4, 4, -5, 4, -6, 9, 8, -18, 26, 6, -9, 31, -13, 19, 21, -20, 22, -1, -3, 17, -13, 0, 8, 0, 9, 3, 8, 8, 5, -1, 0, 13, 6, 9, 0, -21, 19, -1, 4, 19, -14, 6, -4, 2, 17, -12, 4, 3, -2, 11, 1, 1, 1, -4, 16, -2, 7, 8, -14, 10, -5, 14, 14, -13, 13, -1, -6, 21, -13, 11, -2, -6, 9, -7, 0, -2, 0, 2, 5, 8, -14]
5733a4K3Mj0Rj1JJ2j9K6k5j2K5j1PJ9l0J3n%J1j1OmNnK%j3J5j1O%pk%j0K7j5n
5772iJ1rJ4Lp%mmJ2Nj1kjk%J5rQJj1J7qnJ2j9J0Mj0kKqPKJQj9QRmLj2qJLRQj9
5819a0QLlJ1oknJ0j1ROj0KnNRj0pJ1rNO%j4OMQqlqJ1KRk0K0j3pNpKkj1J8Kj0Q
5865aPqRNj3OopPJ6k1KOKJ1r%Lj3RrPj4J6JnLkKnMlQj9J2j4J3p%QjMJpJ1j3LJ0
5913Ij3jPj2J7MmjJjj0MOklj1KQOprJ1jqQMPj0oQj3NQnjNlRj1%JQjrJ4j9NOmN
5963ClMMkRqjrMnPKlj1RlJ5k7PJ8j8QJpPlnR%KMj8J0lLNj4lQJ2j5J7k0kJ3j4K6
6010A3rlNpjJ1j8pJ9rNnj4K5j8J0Oj2Kj%J4mj1RJKKolj0OMJ2pkmJ1jKoj6K7j6
6054dJ3j4pJ4Lj1J4onJ0k9K2lj4J8kj5K2j9QRj4J6njK%k4L4pj5L0j8pJ3j4K0p
$$ y = [-14, 9, 13, 3, 12, 1, 2, 14, -5, 21, -4, -16, 9, -2, 5, 24, -6, 7, 2, 2, 13, 2, 8, 4, 9, 4, 6, 6, -7, 8, -3, 3, 3, -4, -6, -6, -16, 11, -4, -9, 2, -7, 7, 10, 3, 3, -1, -5, 7, 12, 1, -1, -2, -4, -4, 11, 2, 10, 11, 0, 17, 9, 4, 16, -3, 7, 11, 1, -1, 1, -7, 0, 2, 3, 11, -8, 0, 9, 5, 8, -4, -12, -11, -8, 1, 9, -10, -2, 1, -2, 9, 3, 1, -4, 6, -5, 4, 10, 0, 2, -3, 2, 11, 1, -6, 5, -4, 1, 7, 7, -7, -1, 3, 11, 3, 0, -8, 3, 5, 14, -6, 14, 1, -6, -1, -8, -6, -8, -19, -1, 1, -9, -1, 6, -2, 7, 12, -1, 5, -1, -8, -1, 15, -6, -4, 2, 4, 15, 6, 6, 9, -4, 5, -4, 3, -11, 5, 6, 1, 4, 2, 4, -1, 3, 0, 8, -11, 1, -13, 0, -7, -7, 1, 0, 4, 5, -2, 9, -4, -1, 9, -4, -5, 2, -10, 7, 11, 7, 6, 7, 6, -4, 0, 6, 4, 1, -10, -8, 0, 6, -1, -10, 1, 0, -8, 0, 4, 11, 1, -5, 3, -10, -5, 3, -2, -3, 2, -1, 8, -3, -3, -2, 6, 5, -4, 10, -9, -4, 2, -2, 3, 0, 4, 8, 6, 15, 7, 6, -3, 1, -4, 3, 5, 2, -9, 0, -3, 12, -15, -8, 10, -8, 0, 1, -6, 1, -2, -7, 2, 2, 4, 8, -10, 0, -3, 0, 5, -9, -12, -4, 8, -7, 10, -10, -12, 1, -13, 13, 4, 1, 6, -1, -2, 9, -9, -16, 3, -6, -1, -6, -20, 5, -13, -3, 3, -9, -7, -8, -8, 6, 2, -9, 0, 1, 3, 5, -1, -4, -14, -8, -4, 8, 1, -1, -5, 6, 5, 7, 1, -15, 12, -4, 9, -5, -12, 2, 5, -6, 8, 2, -3, 7, -22, 0, -3, -17, 1, -1, -16, 6, -13, -5, 4, -10, 6, 1, 0, 2, 2, -22, 12, 5, -10, 20, 2, -5, 8, -6, 14, 7]
6092Gj8K9j5ONk1J1j2J0Jmj2%RmJ4mLj6J6kJ%j2J9j4lJ4l1K4lKRlj0lN%J1j5m
6133a0K0qLRk2JJ7k1K1j0rJ4j4LJ4j9J1LoNkj6K7j2Lj6J5j1RLj1K4k5jJ7rQMj3
6172dnKJ4moNoJ2j1JQLpkQmnjrORj6LJ4j7L4j3j9J0j3J4JoMj4JJ4JJ0k5J1mJ7
6215A1Kk7K5k1NK0j3MJk1J2QQjk3J7qNjmJKQj3pJ1k1RK2j5J2j9oL2j6%koQJJ1
6256A1%rpMJ4j3j0K0k5K4pnJ4k0MJ7j8PrkJ8k1J7qoRqJ1Rj0Nj6J0j4J1Nj0RK%
6296CRj2J1npJ5kj0jjPpNnJLJOorNpOjlJ3ppJ4rMlrJ9j3RKqKJj0QPkpJ6j8RPr
6346EMJj9J9rKPj6RMqJ6j9MPj5J4mkj9J6pQpJ0j1J5j8K1j2oJ2kmjrOJ8j5KQjK
6389FpJRj4QLr%O%rJ6mj2RpJ5j4qMmK3plj0qJ0NJ1n%j8J1NjMLj0MJ6pj1J2j4K2
$$ y = [7, -11, 18, 3, 9, 14, -7, 4, -8, 2, 3, -1, -13, -13, -4, -8, 6, 2, 5, -11, 5, 3, 4, 4, -8, 11, -3, -6, 8, -23, 1, -2, 0, 9, 6, -4, -7, -2, -2, 9, -6, -10, 10, 2, 5, 14, -8, -7, 10, -11, 10, 0, -9, 5, -9, -6, 8, -11, 0, 3, -3, 2, 0, -16, 11, -1, 2, -14, 1, -10, -1, 2, -9, 15, -10, -11, 6, -3, 5, 9, -4, -9, -7, 7, 3, -3, 2, -4, 8, -3, -2, 6, 9, 2, 0, 8, 4, -1, -2, -11, -5, 4, -12, -9, 5, -12, 22, 9, -10, 0, -13, 1, 2, -4, 0, -14, -13, 1, 2, 12, -13, -2, -6, 11, 13, -14, 11, -10, -5, 15, 2, 6, 7, -14, -2, 6, 14, 13, -10, 7, -1, 4, 3, -1, 0, 2, 10, -3, -10, 1, -20, -11, 11, -4, 8, -11, -17, 15, -1, -1, -3, -9, -1, 0, 11, 11, 2, -5, -1, 13, 0, -10, 10, -15, 9, 2, -3, 11, -9, -5, 12, -6, 1, -8, -10, 8, -13, 4, -4, -10, -1, -9, 2, 11, 1, 6, -10, 0, -14, -3, 2, -8, 1, 3, 3, 12, 0, 11, 6, -1, 14, 12, 2, 1, 0, 7, 0, 5, 0, 1, 4, 5, 11, 5, -4, 1, -6, 0, -1, -4, 9, 2, -5, 9, 0, 4, 1, -8, 11, -2, 7, 9, 1, 3, 4, -6, 2, 9, 7, 0, 16, -2, 7, 14, 5, 9, 10, -9, 10, 1, 3, 10, -6, 3, 7, -1, 15, -4, 0, 7, -8, 6, 2, 0, -19, -3, -10, -2, -9, 1, -10, 5, -13, 8, -4, -10, 2, 0, -4, -5, -14, -8, 10, -5, -3, 5, 4, 6, -1, 0, 9, -5, 3, 6, -3, -3, 3, 3, -6, 10, 6, -6, 3, -4, 11, -3, -11, -7, -11, 12, 5, 2, -8, -16, -6, -1, 10, 5, 5, -13, -2, 3, 2, 6, 9, -1, 3, 19, 12, 1, 13, -1, 21]
6434B1j3j2OqjJ8J%j9jR%J5j0rj7J2J1Lj5J1j5K0Nlj3LqMK6j8oj4RJ4J0j2jj8
6473a5NK6j0Rj9pJ2LQj6j0J6kN%j5JqJ5J9j7Pj4PJJ2j5j5J1jJ0Nj3jJlL0k3mJ1
6513Fj3QJ6k0J2j4OJlJ5j3pM%jNnjKNPj3MMj0J1j4LPmMKpNKkKrJKMMnjj2NlJ1
6561AolJ1jKlj4PnJ3J5j9oJ0pK0pnj3%QmRKj8mJ7JJ2j8mMnJ6rKk7K0KJ3J0k2M
6604aLPJ0j4k1QJK4j1Nk5lL3Kn%k9J2QJQl3kRQK6j3j4JpJ4Rjk0lJ0PJ4mj8NlJ9
6647A7Jk4J0pKJ0qJmj0J8N%j2j2PJ1N%j6kJNJ7j4mKNlOJmj5OQrOj%J1oN%rj1J4
6693CJ3j7jj0K0Jm%j5PjKJ0Nj4Pj6J7Rj2Mj0lNkjJlPpJ0qJkQklKK%jOj5J5j6J
6739gNpJ1ll%JJ2pLlj8J6rqROj0J0lJ1mkLqPK%mj4RL%OMj4PLj8J9%j6MQjQj6J1
$$ y = [21, 8, -4, 2, -6, -7, 11, 12, 12, -7, -8, 1, 1, 16, 6, -3, -20, -8, 3, 6, -9, 2, -13, 7, 12, 9, -4, -1, -9, -5, 21, 3, -3, -17, -8, 6, 16, 4, 3, -15, -10, 16, 6, 15, -4, -11, 1, 4, 12, -4, -14, 2, 0, 5, 5, -10, -9, -17, -2, 17, 0, 7, -7, 0, 1, 13, -2, -17, -6, -7, 3, 8, -5, -6, -5, -8, 22, -1, -5, 6, -7, 1, 17, -3, 9, -5, 1, 2, -1, 14, 1, -6, -2, -2, -3, 2, -3, -4, -2, 3, 10, -3, 1, 5, -5, 6, -8, -5, 2, -2, 2, 4, -3, 2, 4, 2, 4, -5, -4, -2, 2, 6, 1, 0, -12, -7, -10, 1, -5, -8, 3, 2, 4, 1, -13, -6, -11, 2, 17, -2, -8, 2, -5, 15, 8, 3, -10, -10, -2, -6, 3, 5, -13, -17, 0, 1, 13, -5, -9, -5, -10, 6, -3, -1, -28, -8, -6, 7, 17, -5, -1, 2, 9, 19, 5, -16, -8, -7, 17, 6, 11, -14, -17, 16, 18, 13, 13, -16, -4, 4, 5, 13, -20, -22, -13, -5, 21, 8, -6, -5, -12, 2, 11, 10, -10, -13, -3, 4, 18, 14, -4, 1, -2, 17, 18, -6, 4, -3, -1, 9, 1, 2, -2, -12, 6, 11, 11, -1, -13, -6, 5, 10, 10, -6, -8, -7, -2, 15, 1, -3, -1, 4, 1, 7, 8, 4, -11, -5, 3, -6, 0, -1, -1, 10, 4, 9, 9, 0, -11, 3, 16, -1, -2, -12, 8, 9, 5, 5, -10, -3, -4, -2, 8, 13, -1, 6, -10, 7, 16, 4, 8, -2, -5, 0, -2, -3, -2, -5, 2, -5, 5, -3, -2, -4, 4, 2, -1, 1, 3, 3, 2, 8, -7, 8, -8, -7, -2, -9, 2, -1, -4, -4, -3, 9, 2, 5, 2, -16, 0, -9, -17, -8, -2, -12, -2, -5, 6, 2, 0, 3, -5, 2, 4, 4, 0, -14, -5, -2, -2, 4, 8, -6, 1, 4, -14, 5, 5, -11, -7, 1, 0, 8, -8, 3]
6787CnnJ3Jj2Oj9K0kKOk5J8j2J2J5j8LlJ2J4ol0mRJ4%Ok1kK1LkJj0mnJ1J8k0j3
6828a0kPJ8%nj7lJ4jK0j7nmNQnj3PpK4%j0jk1nL2Rnrk0K2OPpk1J0MJ3j1nrj5K6
6871D%Prj8RlJ5J0k2mMkK0oJk2QJ3NrklLOKjk2jJ2J6Nl1J9rMJ9nrj2rK2qOjj2
6916a0J0j0J3MqnLOJ1j3oMJLLj1k%ONqkJ4r%Oj2KJ2lmRj%mPj2%NjLqJkJjPmrM
6966eMJPj5LlMNM%j3jPJ8j1Mj1KJ2krKpmMJ4Nj7LNNNj7j6LLJ4Pj2j4KJ5J6j0n
7011BrkNPmmqpJ9J3oqrLK0%%j0k2J8Q%Kk7QJ9llKj7KLK5j3rqkNK8j3j0lrJ3J1
7056Glk4jJ5LNPj9lJ6NKMj6kmJ4%nNojOJ1j7KkqJ0jmmqK0lpJ3k0JK2rOqk1J5N
7102bNoj4PJ1mPnkj6PJ6pMokKkJ6j0KjKKPjPk1J6kj8OnJ5JqPnpNlRk2J8rnJ7j4
$$ y = [3, -2, -7, 6, 7, -5, 1, -18, 2, 0, 2, 8, -17, 1, -11, 1, 16, -2, 1, -2, 10, 24, 18, -12, -16, -7, 7, 7, 13, -8, -10, 11, 14, 12, 13, 3, -1, -6, 5, 23, 3, -10, -12, -5, 13, 13, 8, -9, -12, 2, 1, 21, 4, -1, -5, 0, 8, 3, -10, -3, -10, 14, 14, 4, 3, -18, -23, 9, 18, 13, 4, -16, 6, 12, 19, 12, -9, 1, 5, 18, 7, 2, -7, -22, 4, 4, 11, 2, -16, -7, -10, 5, 15, -7, -11, -7, -9, 11, 5, 6, -16, -8, 5, 10, 1, -1, -4, -1, 5, 7, 6, -16, -17, -5, 11, 16, -15, 4, -5, -1, 18, 13, 4, -8, -17, 5, -3, 3, 2, -10, 0, -10, 3, 7, -1, -6, -3, 3, 14, 1, -5, -1, 0, 3, 6, -5, -7, -7, -1, 4, -4, -6, 8, -1, -1, 5, -7, -5, 7, 4, 0, 9, 8, 8, 4, 11, -1, -1, 4, 3, 6, -2, -1, -3, -2, -3, 4, 0, -9, -5, -1, 0, 7, -8, -5, -8, -4, 1, 5, 5, -8, -9, -2, 16, 5, 9, -2, 0, 12, 10, 1, 3, -4, -8, -4, 10, 15, -2, 1, 6, 11, 16, -1, -17, -14, -11, 3, 10, -2, -16, -14, 1, 17, 7, 2, -7, -9, -4, 3, -1, -5, -13, -20, -1, 12, 6, -2, -11, -8, 12, 12, 12, 2, -20, -2, 6, 6, 8, -19, -11, 8, 5, 2, 4, -13, -11, -8, 17, 4, -5, -13, -15, -10, 18, 5, -5, -8, -17, -4, 7, 4, -20, -21, -6, -3, 2, 9, -10, -13, 3, 8, 10, 14, -2, -4, -8, 6, 6, 1, 6, 0, -1, 5, 16, -1, 1, -1, -9, 1, 0, -4, -8, -16, 4, 1, -6, 7, -13, -12, 10, 1, 7, -1, -22, -7, -2, 3, -3, -17, -10, 1, -3, 4, -1, -3, -19, -12, 4, -3, 1, -5, -7, -5, -7, 9, -1, 1, 0, 2, 4, 11, 10, 17, -4, 12, 10, -8, -2, -7, 8, 9, 1, 8, 3, -4, 1, -2, 7, -15, 3, -6, -11, 6, -8]
7150hJ0J0j6Nl%J1qMk5K0Qj1J8j4rJ8j6J3jkNj9J9kj4J9k3J5lkKmnRpK3k2QPj9
7191iJ6lJ7k5MlRJ3j1qlLRRj3RqkNoJ2j6mQpJ7qMlpJ1Nk3J1j0K3ok5J2PrNpR%
7236Bj1NMJ7j2j0NqK1qNrj0K1j4J1nj0K0k5J2J5j6jj0RJ5j7MkoJ3Kj1Roj2QJ6
7275A1j5j6J9j2J6J6k1Pj8J5J0j2Qj5KLJ4rJ7l3J4LJ0oolj1J4%%Mr%%%Qj1NJ2
7314A1k1J8Nj6N%kPjPoj3J7nmj1J5loJ3j8J3mrK4j1NmqPJKlpmMkRmjNj0%NJ3j6
7360cMPj5QoOJ7j0mqLMKj0J2j9K9j3o%pJ2Nj4NPjnNj2OJQj6J5nlMLmJpMqlOOj3
7408a2J3mR%%RppMJqQmkPp%Oj1J0oMKmj2J5mOnj2J7Jj3J6qnjlRPj3J3Lj5J0j2
7454eJ6pmPJ2k2Rj4J2J1k0J5j4PKNn%j1R%jlk%KJOj0NoPKjkrjJ1OoLokJ5nrK4
$$ y = [-8, 2, 12, -4, 1, -2, -2, 9, 1, 5, -20, 0, 8, -3, 15, 1, -8, 10, -6, 7, 6, 4, 9, -10, 9, 7, -7, 12, -11, 4, 1, -1, 1, -3, -8, 1, -6, 17, -5, 3, 10, -9, 7, 4, 21, -4, 0, -3, 6, 19, 8, 0, -3, 0, 9, 18, 5, 14, 6, 4, 9, 3, 15, -1, -5, 3, -4, 13, 5, 9, 6, -1, 10, 15, -8, 3, -7, 16, 10, -15, -3, 4, -5, 0, -7, 2, 2, -9, -4, 0, 17, 5, -5, 0, -8, 13, 5, 10, 1, -9, 12, -2, 9, 4, -6, 14, -11, 1, 16, 0, -1, -11, -2, 13, -4, 0, -2, -8, 5, 7, -4, 5, -1, -13, -5, 11, -4, -20, -1, -13, 3, 19, -2, 5, -13, 2, 12, 0, 8, -7, -5, -2, 12, 3, 20, -13, 1, 4, 14, 8, 2, -1, -12, 2, 2, 2, 6, -3, -3, -3, -3, 5, -6, -1, 11, -10, 8, 13, -3, 2, 2, 0, 7, 6, 13, 7, -6, 11, 6, 2, -9, 6, 3, -3, 10, -8, 5, 1, -8, 16, 5, 10, 6, -2, 5, 6, 8, 5, -2, -6, -2, -4, 5, 1, 0, 5, -5, -5, 0, 13, -3, 1, 8, -7, 1, -5, 1, 18, 8, 4, -4, -1, 3, 5, -5, 7, -12, 17, 4, -2, -2, -9, 3, 8, -6, -1, 6, 5, 0, 5, -7, -1, 0, 8, -8, 7, 2, -1, 3, 6, 2, 3, -4, 0, -8, -11, -5, 1, -12, 1, -3, 6, 6, 6, 15, 8, 1, 5, 6, -2, 6, 2, 0, 7, 0, 0, 6, -5, 5, -1, 3, 5, 1, -11, 4, 0, 6, 1, -11, 6, 7, -6, 10, 2, -3, -4, -7, 2, 9, -4, 9, 12, -3, 7, -5, 11, 4, 0, 7, 19, -3, 6, -8, 4, 15, -5, 10, -4, 3, 5, 10, 5, 5, -6, 3, 3, 2, -1, -3, -3, -1, 0, 6, -4, 1, -5, 2, 4, 3, 1, -8, -9, 2, 8, 2, 5, -1, -3, 12, 7, -2, 22]
7501B2k8J8Jj9Q%kJ0rkPKlMJonj2JJ6j0KkOj2MQmJn%MPk%%%Mk%Rj0Ok%kPj7MJ5
7551A3k3PKLJRoj8K3j5J0kj2N%JjNqJ0oLPj1PplQoK%LKjjKmkJ2j7jJ5j2J0jqJ
7598dPkOrNljLj1MJ3j1kRj5KRqRnQp%jjJ0LmjJ4j0Jj0%kjJ3%nKJqQKpjNn%jkO
7650Cj0mJ2nJ1j0Rj0NqJJ2jj2PojJ8kj1KmJ1mRkj3NLpLOmmpJ7kjj4J3loOpJ0r
7696dOOknj2qJ9%Ojk4K1j4J2krJ1J4pj2J0Pj0%k%MjmNKMj5LLljQk1J8j2%NoJ0
7741ak1J9Qj5J5Jj1n%J0ojJ5k0J1loK3j8J5opRjNpJjnOjMnmKknjpJ3JpQmJJ0o
7788AMJm%nJLnoMLMjL%J0j2Mj0JJ2j0POj7jQmRpOMj5Q%%nkLJ%lj0J0%jRklkJ0
7839GJoLkjklKJMjMj2LLNnjpMLojJ2j4K1j8Q%llOJjpJ1KrRj2lK%NoQnJ9j2olO
$$ y = [22, -6, 12, 13, -6, 2, 2, 0, 10, 1, -1, 6, 8, 5, 9, 10, 4, -1, -13, -12, 4, -6, -4, -6, 0, -12, -8, 0, -4, -3, -8, -8, -4, 3, 1, 1, 1, 1, 5, 3, 3, 12, 2, 8, 6, 6, 4, 11, -6, -2, 13, -10, -3, -1, 2, 3, 12, 6, -12, 11, -4, 6, 4, -8, -3, -3, -2, -3, 2, -6, 4, -2, 1, 8, -3, 4, -3, -6, 2, -4, -2, -2, 1, 3, 2, 1, 3, -1, -3, 9, -8, -9, 6, -6, 4, 3, -5, -4, 3, 1, 7, -2, 3, 0, -1, 2, -9, -5, 8, -3, -5, 4, -11, -9, 0, -8, 1, -4, 4, -3, -3, -4, -5, 5, 8, 4, 3, 17, 7, 8, -2, -2, -4, -5, 8, 8, 3, 5, 6, -2, 6, 8, 1, 0, 5, 0, 0, -1, -3, 3, -7, -11, 1, -4, 7, -3, 6, -4, 1, -7, -6, 6, 5, -7, 0, -6, -7, 11, 9, -2, 0, -4, 7, 3, 12, 10, -3, 2, 5, -2, 1, 7, 3, -1, -8, 9, 7, 6, -8, 5, 2, -4, 2, -5, 5, -4, 2, 8, 6, 1, -11, -19, 0, 0, 6, 5, -19, 2, -12, 0, -2, -11, 0, 14, 7, -5, 5, 12, 2, 2, 0, 0, 4, 3, -1, 4, 6, 10, -5, -2, 1, -2, -3, 5, -16, 2, -10, -10, -5, -11, -1, -22, -3, 5, -10, 5, 6, -5, -10, -10, 0, -6, -7, 8, -12, -1, -4, -10, 13, -5, 10, 4, -3, 6, 5, 10, 3, 4, 3, -2, 4, 3, 7, 2, -2, 0, -2, -7, -8, -15, -2, -1, -8, 0, -4, -3, 7, 1, 5, 6, 2, 2, -3, -2, 1, -4, -10, -6, -3, 1, 0, 3, 3, 13, 1, 5, -5, -4, 8, -2, 5, 11, -6, -7, 1, -3, 6, -1, 5, 9, -6, 2, 2, 2, -3, -5, -2, -1, -1, -4, -14, -4, -4, -5, 4, 2, -1, -3, 7, 8, 2, 5, 3, 2, 0, -3, -1, 0, 4, 3, 7, -5, -2, 1, 6, 1, 0, -7, -3, 0, -6, -7, 5, -9, 12, -6, 2, 2, -1, -4, 2, 3, 2, -5, 6, 8, -1, 8, -4, -7, -5, -5, 0, -6, 2, -3, 16, 4, -2, -5, 1]
7891ARlj4QJj1J6j3MmmJ2m%KLKonKJ0oM%kM%rJ0mkKNj5kJNjJ8p%q%ONkj1KljJ
7942dJ5j4O%mKJnJJoJ8k6J2RkNj7JkJ1Nklj5K2mNLj2j2J1nJ4j0JJ1onKk%NolJ1
7988Glj1OLqQjOj6NJ2j5K3lj6OpJ0JmLpQloLJ3ooOrMJKPlpnpJ1Ll%Oj1nNRKom
8039bmRj1OnLJ4Pk2J1Kj1RJkJj3QRj9J8%j3K0j9PJ5j7NKj2Pj1PNmoJ4j5J3Lk6
8081a6J2NJ%knJ2j0QjlJJjJoNLJknjPjoPNqKj5J4LmmpJ1rMLKrPoJ%Rkk2K3qPR
8133A1pj4OKRKrj0mJ7jnNlJjKqLJj1J1KK%j0MNj0J9oj0M%P%j4J0mMjKj4RMOom
8181dJJ4j5OnnJ4jKl
$$ y = [1, 10, 7, -7, 1, 2, -9, 7, -6, -2, -6, -10, 2, -2, -2, 0, 3, 5, -1, -6, -4, 6, 0, 4, 4, 2, 6, 6, -3, 7, 3, 1, 3, 8, -7, -9, -8, -3, -4, 14, 7, 7, -1, -1, 5, 10, 8, -3, -1, -4, -5, -4, 11, -3, 3, 3, -1, 1, 2, -3, -2, -1, -7, 11, -15, -3, 6, 4, 9, -8, -7, -9, 2, 7, 5, 2, -13, 9, 5, 10, 13, 1, -11, 0, -5, 9, -1, 0, 11, 5, 0, 2, 0, 0, 5, -1, -4, 7, 4, -7, -1, 2, -6, 2, 1, 7, -9, -4, 8, -7, 16, 13, -3, 3, -4, 6, 7, 3, 6, -1, 7, 4, -2, 1, 14, 8, 2, 8, -1, 3, 4, 6, 13, 10, 3, -2, -9, 2, 5, 2, 2, 8, -3, -8, -3, 6, 8, 2, -2, -6, 3, -8, -2, -7, -4, 10, 17, -5, 6, 8, -3, 6, 7, 5, 6, -7, 1, 10, -9, 9, 9, -4, 16, -3, 4, 19, 2, 7, 9, -3, 4, -7, 0, 5, 1, -5, 9, -6, 7, 10, -16, -4, 1, 2, 2, 0, -5, 7, -3, 5, 4, 1, 2, 3, 2, 3, -3, 2, 5, 6, 4, -1, -2, 5, 4, -2, 5, 10, 2, 4, -11, 3, 6, 2, -2, -9, 2, -7, -3, 0, 2, -7, 0, -6, -5, -5, 4, 2, -20, 3, -5, 2, 11, 4, -10, -4, -2, 7, 9, 0, -10, -14, 3, 2, -3, 2, -1, 0, -1, 1, -7, -4, -3, -14, -3, -1, 1, 1, -9, -5, 0, -10, 9, 3, -7, -3, -3, 4, 4, -10, 0, -4, 0, -1, 1, -13, -4, 0, 6, 0, -4, -3, 11, -4, 2, -3, -8, 6, 5, 7, 4]
8191D
$$ Imaginary data points
##PAGE= N=2
##DATA TABLE= (X++(I..I)), XYDATA
0@%%%%%%%%%qJ6j6J6k4L2m0M9n7P2q8J05j29J58j84K16k55K98l46M00m60N27o03
32c21O84p75Q78r90J113j249J399j566J745j939K154k387K643k924L227l558L924
49B058m323M760n242N773o363P022p761Q594r542J0634j1906J3409j5216J7438
63I335k0247K3925k8975L6388m8467P2575j94326K73350o2521k17339M52610m69015
75a72707J29630J27689k21997K51967j05037n4369R9119j30673J38375p6559j1235
86b5797N6410q0783P4178J8632n2965j1404K8066l1322j948J35214j78133N9107
98a0745Q5855k10016K42477q0856j41770K26467k15739J19933Q4813j78427J56943
109G8935j67180N6384J02275j45892K16552j86781l0602J74241k41582K20710
$$ y = [0, 0, 0, 0, 0, 0, 0, 0, 0, 0, -8, 8, -8, 8, -16, 16, -24, 25, -32, 40, -48, 57, -72, 86, -98, 118, -137, 161, -185, 215, -245, 282, -321, 363, -412, 466, -524, 589, -660, 739, -827, 918, -1021, 1133, -1254, 1389, -1535, 1692, -1866, 2058, -2265, 2495, -2747, 3026, -3337, 3685, -4076, 4518, -5024, 5610, -6296, 7113, -8103, 9335, -10912, 13013, -15962, 20426, -28041, 44534, -149792, 123558, 61037, -156302, 296308, -172707, -43077, 84612, -137385, 114582, 9545, -44824, 54295, -76378, 61997, -14562, -25797, 30613, -50170, 24008, 42640, -10325, -21729, 6337, -24985, -26933, 108281, -69852, -10745, 75110, -134906, 107571, 26715, -115055, 111412, -104327, 15606, 100419, -78008, 78935, -88245, -31861, 70414, -75478, 141074, -45707, -76309, 97932, -143650, 77060]
119G7060o074j81620K18864j63236Q053J26912j41131P8807K879l9956L7811j8515
131a46p979j6063M0961j9969J6529R274o4953O4311n2266L7046M8499j19992J16443
144E1695p8220k9153J60405j74344R1542K5359j56829J84892q6014k1593J09079
155G6819j41260P7693l815m2304P6471p0725M4670j5142k8073N8798o8904M7885
167A2113L567l6976N3966n3895J5249P344j2707L9714l8936K2201k2082j5757
179b6199N3343m0885L2639r197l8105L9999k9312L2160m813k0147L0419n3797
191c3895M9268o684l7712P1318p0055K4384L7002p5079O4672k6340j9353N6708
203C4234m8242J9979o188k0435L3214j7450K2007j5051j8156K0309k1243L1994
$$ y = [77060, 70986, -110634, 108230, -55006, -46953, 79959, -61172, 17635, 20514, -19442, 18369, -146, -8125, -24188, 16773, -3196, 13333, 22607, -42346, 21965, -30301, 6745, 55244, -64748, 51695, -26525, -55678, 104727, -69617, 21925, 47284, -109545, 75347, -10667, -32260, 76819, -64441, 13252, 9437, -32867, 43604, -27121, 17549, 2407, -25666, 33132, -35772, 12113, 15680, -21296, 32670, -21225, -5976, 1368, -11339, 28375, -10561, 11640, -10442, -26199, 27144, -13741, 18898, 9701, -28404, 11595, -17717, 14443, 9630, -10517, 19902, -33895, 15373, 8689, -29023, 42295, -27760, -3376, 33626, -41453, 23219, -3121, -22474, 34234, -14008, 5971, -217, -20652, 12562, -4888, 17119, 2068, -16088, 4221, -17022, 14972]
215A4972k722j8028J1729k8787K6669K231m752J9217m2508K0633L062j5679M1884
228B7921l3830k053J6852k7065K6964j732j1915P581o895N886l719Q652j0407
241c760n628K1530j9771J5280K9k7608K7152j2148O439J7133l0104J1828r090
254h718P83K5789j8507Q121j2307j3493K5420q096J1838j433k3195J1835n893
267g856J0826J0799j6329M416j0769K289J5949r377M974n633r552J3539m14j991
281H71K828q977p68J1660k398l135L328j4240P791J3133j1952R990j1335j2809
295a6013K3509p741O769N133k8352J3454K278j013K1334k1736n782N904q930K1871
309A0685l06j3132K728j1428Q516J2274o019J65q901k882J0819J301J345m618
$$ y = [14972, 12250, -5778, 5951, -22836, 3833, 6064, 1312, 20529, -21979, -1346, 1716, -13963, 27921, -5909, -7962, 8890, -18175, 8789, 7057, -4858, 2723, -4172, 1714, -2005, 6647, -3760, -9388, 12142, -7629, 7651, 7680, -19928, 7224, -4924, 1515, 18648, -11456, 372, -8718, -7935, 17854, -653, 7468, -4839, -18332, 7088, -1008, 10830, 9397, -13798, -1963, -7856, 2970, 13769, -2560, 1856, -8913, -6624, 9325, -52, 4922, -711, -10263, 3276, 2862, 871, 3699, -5278, -6046, 5614, 3216, 81, 3409, -10831, -3040, 10093, -1859, 8131, -3204, -16013, 7496, -245, 6524, 11657, -16695, -3241, -963, -1976, 19358, -2378, -8160, -2256, -11186, 10685, 10379, -2753, -25, -11453, -2937, 9337, 3318, 3483, -5418, -8300, 2519, 3820, 5165, 547]
323E47q774O063M406J800K075j1727j169P693n33Q804o501j2785Q782k510Q081
338D252Q810j9421K867o05l120K1628j0877p484M957j4506J6895P252j3046P492
352E094j2848q22J7174p690K732k029j2103J1161L082k880M124r690j195R398
366C508k463K506j737r805P455K801r28M984j1098m11O463k336Q388o125o828
381e626N003l562R294k04q025L905p568P810N459r178O675r078M88J2153j0117
396b571N582k633q773J3366l834r76L485j0307N268M645k506K396m702l448N223
411B15K786j461O89o060j200R065l124K934k175j1479J1088p25R35Q063j6920
426g369M148L661m765J4461j0447l970N569p235J2225l202o603L769p398J1162
$$ y = [547, -8227, -2164, 2242, 4042, 6117, -5610, -6779, 914, 381, 9185, 2684, -10101, -1319, -3829, 4252, 13062, -6359, -3492, -4097, -7217, 14411, 3534, -3950, 1007, -13499, 3396, 10648, -2398, 5094, -7754, -8576, 8598, 908, 3640, 1611, -10492, 669, 3751, 871, 4995, -4695, -5890, 3508, 1045, 3551, 1814, -7991, -536, 2265, 1337, 6321, -4777, -5188, 1275, -1061, 7327, 1202, -5626, -623, -4185, 5109, 4905, -3120, 785, -6783, 1027, 6486, -2692, 3983, -5095, -4607, 7546, -2571, 3011, 378, -8395, 4971, 1137, 161, 3646, -6661, -1393, 3252, 746, 3142, -1560, -5008, 215, 3001, 1540, 2229, -3831, -5031, 4034, 910, 3844, 1669, -9810, 1278, 553, 1488, 9551, -7369, -3221, 440, -4325, 10136, -311, -4281, 1288, -5947, 6278, 3076, -3527, 242, -7156, 4006]
440D006K076o242K230j1536O449P793k469M699j0672k569N378P15O356n611l519
455b916L08J129P685m289l238l585j035J0445P24P51p512p913P119P2J0245p56
471G234j2378N677p583O388R172j2939O589m790q46J2833j0792J642m426m296
485h515J5367m118L564m211j3827J0894j258N131O290j3101K373r65Q14O054n242
500g50k51k814M687M636m519J726j0029J091R317j827P659p861o876L568l726
515e969J1044j861l601M102j0556R159q7p164R162r281N209O461q070M448q054
530e058P86N271q46Q107j0167M47J208p710J4934o611k436P847j2889R460M06
545B749o683P595q118M708K369l259N188q927L368J068k968Q649o548Q39M48l785
$$ y = [4006, 6082, -160, 2070, -9466, -3017, 4776, 2307, 7006, -3666, -6235, -857, -142, 6214, 603, -2916, -2608, -1479, 6206, 1917, -1321, -4906, -5941, 4504, 5228, 5979, -1533, -9446, -2327, -2255, 7990, 7234, -5144, 533, -7050, -662, 8510, -4429, 2160, -2630, -3476, 9357, -1435, 207, -4219, -8515, 6852, 2734, 6298, 2087, -11740, -846, -2104, 3027, 9317, -3784, -1411, -2376, -1562, 4492, -750, -1001, -3815, 872, 5508, 989, 2715, -7314, -6223, 3094, 1267, 8926, 1065, -5811, -2243, -5969, 5075, 3214, -387, 3715, -6841, 2318, 2231, -4933, 4229, -5052, 157, 6618, -1452, 2996, -5058, -4272, 999, 153, 8260, -1907, -1460, -252, -7962, 6972, 361, -2075, 5772, -7117, 2343, 2749, -3934, 3661, -4457, 251, 2620, -639, 4549, -4378, -1010, 58, -2910, 5739, -809, 30, 478, -3307]
561c307N365m127M521k759k081Q055j1120P654Q5j0305J5355r456L10Q619j3735
576f926Q779j696k709P142p507N788n058J54O663j0469J0906m664n673J1888j2177
591e559O456K715q275R439p665K656J967n587R069q028K926K962q900R574m106
606c56j219M889n543K573j731L038k186p48O489j1621Q997Q6j0737J6884j2178
621c363K79J1268j6727J2048k132o787J2219j0910N876k01o626J0123r485N736
635A318K360q751R975p191L31N033o160N194k712J304k40k244N143p732N614L59
651A601o089J0624p697N95L659q198P076k277K085J882n609N448q585M662M315
666C492q638J2696q411k641R177j3267R221k6n740J1178r057L015K16p897R250
$$ y = [-3307, 2058, -2069, 2452, -307, -2388, 5667, -5453, 2201, 2286, -8019, 7336, -2120, -1810, 6809, -6926, 1853, 157, -2552, 4590, -2917, 2871, -2187, -2033, 4630, -5839, 5067, 403, -5270, 6618, -5559, 897, 3612, -4663, 4776, -2889, -233, 1734, -3853, 5216, -2812, 114, 3076, -5824, 3750, -356, -1575, 3314, -2229, 344, -1387, 1651, -535, -1283, 5206, -6415, 2582, 2668, -8069, 8815, -3363, -3084, 8184, -8543, 3505, 1373, -5414, 6805, -4105, 1771, 1570, -5056, 5067, -4418, 1318, 3678, -5073, 4902, -2289, -1958, 3075, -3085, 2109, -603, 701, 461, -1783, 3360, -4372, 1242, 1601, -4488, 6136, -1561, -966, 2693, -5505, 1571, -706, 1379, 3261, -2348, 3100, -5485, -823, 3492, -5146, 7550, -861, -3502, 5675, -7592, 1629, 1603, -4137, 7041, -2016, 999, 1215, -6682, 2568]
681B568m908L835M428q859M614m271j257N973k183K232j161n43j711j28K449m877
697c799N872p42k617P069q906J415J839n391R796l387k2J929q366O100k773P11
713a272N903p365N671k076l879N805o956L337K629k429N522n032j306k76k376
728d100O102o75J240l06n277K278j155J210K797j949J050r83l57n17p29J049q45
745a167L346n61j664J085m568K749J607j302M023m503rJ569l086M727k389j112
761a255K978l774L758l12l255K834l211J714K878k503J600j874j620K084k74Q64
777F32M26j011l67J73j11l24Q28l54M35P91j408Mn60j8J609K1J92j206q34M47
797f35J65J875p39p47J02j853K210K74p52J782l007P80J152k165L324j580j176
$$ y = [2568, -2340, 1495, 5923, -2936, 1678, -2593, -3850, 2123, -60, 2172, 1011, 468, -1243, -1371, 1078, -3799, 2073, 1331, -1286, 5783, -3123, -1708, 131, -5260, 4536, 1149, 1127, 3056, -5310, 790, -1983, -1272, 4631, -2734, 2937, 861, -3018, 2787, -4169, -832, 1797, -632, 4890, -142, -1448, -1724, -4100, 2002, 1327, 2567, 2261, -3016, -738, -1893, -683, 2114, 165, 1215, 232, -125, -642, -1371, -322, -1167, 2179, 1618, -46, 1039, -3529, -780, 827, -475, 3548, -955, -964, 605, -2481, 2246, -143, -1255, 1723, -2051, 1707, 1395, -1860, 974, -2237, -523, 2355, -148, 1452, -422, -2042, 42, -232, 632, 1058, 47, -320, -147, -258, -582, 246, -108, 327, 1118, -290, -286, -846, -864, 745, 766, 958, -248, -1082, -635, -470, 1405, 666, -81, 21, -1832, 378, 652, -100, 1682, -1325, -545, 607, -1558, 1766, 186, -990]
814i90K720l511J692J243k942L503j299j689K708k907P90K269k325J561j85k487
830a849K074l8o86K230j898j030J809j885J632J347k763J885j332j131L163k167
846f39J247O15k930K445j548K66K149k509K165j553j059K447k774K971k75k376
862a358L209l905J535K216l455M035k306j832L335l284K196J376k859J874j027
877b50j209K049r4r61J677j264j837L465k794Q34L481n949M332q83m430P863n818
894a788J277M443q672O910j918l485Q045p285K633J867o042O623l192n2L239m938
910b335L217j425m00K569k475K002j636r7Q12j223K336j936J448q88j451L086
926A604l755L807q81k939N403o675M140J365n856Q675p487J351N088r493J0080
$$ y = [-990, 1730, -1781, -89, 1154, -1788, 1715, 416, -1273, 1435, -1472, -682, 1587, -738, 823, 638, -1849, 225, 187, -499, 1731, -167, -1197, 612, -1273, 359, 1706, -1057, 828, -504, -1635, 1528, -639, 608, 1223, -1707, 738, -810, -544, 1605, -904, 1261, -292, -1351, 1096, -1678, 1293, 1018, -1358, 1851, -2054, -519, 1697, -1758, 2277, -29, -1861, 1474, -1810, 386, 1762, -1097, 777, -250, -1459, 590, 496, -465, 1212, -52, -1889, 1576, -1218, -384, 3097, -2852, 1480, 597, -3833, 4030, -1788, -511, 3932, -4740, 2170, 252, -3233, 4812, -2473, 160, 2027, -4015, 2608, -584, -636, 2603, -2335, 882, -543, -943, 1626, -849, 1153, -483, -580, 232, -991, 1345, -591, 857, -31, -1482, 1604, -2151, 1656, 775, -2164, 3239, -3436, 704, 2069, -3787, 4888, -2599, -1248, 3840, -5653, 4427]
941D427m484l298Q996j1122O900J074p330J0215p586P30M836p424O123j446k029
956a418L226k832Q21l61J446j539J040J447n229N992l799p67P017r604P080j468
972A052o583J1770j0252M486M367j1927J2331p203j280R955j2392Q750j851o278
986e055J0106q598M340J898o176O720n416J779J862l393M358l589J640p43r16
1001a183K864l744M876m063P6M207p974Q969m253l084R431j2392Q437M79q821
1016f175J3616j1605L065O368j2714J2985o244l006J0204j2279P781m7o612R417
1030D754o931J731K621m762L883j612Q58r19O56p1k775O025n577K711K558q896
1046e746R714n874l99Q999j2326R061k915o745J2859j1523O276L468j1317J2144
$$ y = [4427, -57, -3355, 5641, -5481, 1419, 2493, -4837, 5378, -2208, -1478, 3358, -4066, 2057, 611, -1418, 1808, -1024, -203, -564, 882, -657, 383, 1830, -3399, 2593, -1206, -1973, 5044, -4560, 2520, 1052, -5531, 6239, -4013, 473, 4840, -7087, 5244, -1959, -3239, 6716, -5676, 3074, 1223, -5055, 5051, -3547, 793, 2691, -3485, 3235, -2181, -402, 1460, -1933, 2425, -1164, 476, -267, -1183, 1681, -2063, 2813, -1250, -1174, 3033, -4941, 4028, -225, -3309, 6122, -6270, 2167, 2646, -6175, 7441, -4164, -1099, 5269, -7445, 5540, -704, -3710, 6494, -5785, 1996, 1949, -4663, 4754, -2177, -446, 2175, -2587, 1296, -316, 542, -377, 279, 208, -2567, 3458, -2119, 592, 3150, -5746, 3968, -1906, -2305, 6694, -5632, 3429, 514, -6231, 6628, -4895, 1381, 4849, -6468, 5676]
1060E676q552k82Q249j0282Q969k271m466O440p362L824Q91j978M247l892J561
1075G72j746m27J914k099M052l201J839M81n073O106o079K710M843p883R340o314
1091g65l416Q311j0814R103R34p076J0521j0441J700M522q824J0276l401j525
1105h95O040q778L428o33k619O164j907J199o30k690n14m06K848j007L366j148
1121A818l510L686o065K938K851m608Q063m834j415L799q783O635l09k068Q027
1136F225p766K009K19o279P655l206J374M209o220L376k643k231M102k370L384
1151A838N22k106N86l088O03O96J276J642p40J43k834N07k29n12M039k562J800
1168A581L48m890L927l179M38N098m585L877j480m464M614l938K329L191m109
$$ y = [5676, -2876, -3158, 5091, -5191, 3778, 1507, -2959, 3481, -3881, -57, 834, -1144, 3103, -789, 772, -974, -1401, 513, -1586, 2466, -735, 1104, 1585, -3488, 2618, -3461, -751, 4092, -3791, 5549, -765, -4181, 4130, -6684, 2419, 3353, -3723, 6798, -3643, -1943, 2579, -6245, 4031, 630, -895, 5145, -3633, -205, -838, -3457, 2707, 800, 1999, 1369, -1321, -1835, -2241, 607, -400, 2966, 1818, -1692, 1994, -4071, -1133, 1718, -2890, 5173, 339, -1076, 2723, -6060, 575, 266, -1802, 6225, -1541, 468, 687, -5592, 2063, -1143, 231, 4440, -1780, 1596, -1047, -3278, 824, -1546, 1838, 2360, 254, 840, -2248, -1645, -949, 327, 1969, 1229, 1372, -1462, -955, -1184, -1696, 2343, -219, 1581, 1929, -2961, 966, -2213, -1775, 3323, -1262, 2615, 1135, -3329, 1285, -2653, -324, 2867, -1242]
1183a242L612k600j845L070l011K393R78j794K007j805o42O10o18R81O26J31q09
1200D2J08o88n31J754j164Q88O71k069J878j340n22J851k002J898l1j397J696
1217A042k275R14Q09j301K306j752j35J008k054K165m90p22J682k131R18L48j216
1234h84J765r52m5O82j330P51Nj38P51m05k93k16l2lO84K96p53N49j017j37J327
1255F05j181J273j02j552J692j438K91J401j862J525m09j071J670j408M89N68
1271D91j151J106n18j1N14p02M63n21J60L37l40Q60p04j27J72q29J002K7m4M25
1291F10r29L0q0J70N13j6J70p85J12n9k10J201q02K82J44j368J401o10RJ326j839
1312g30R66j56j140K042j208J91R11j907J195o4o63J428q38k11L79o64K72N25
$$ y = [-1242, 2370, -230, -2075, 995, -2016, 377, 1355, -439, 1568, -237, -879, -269, -887, 94, 720, 851, 42, 150, -538, -1069, 685, -479, 409, 1080, -989, 889, -451, -973, 878, -1124, 774, 743, -654, 1042, -1233, -319, 490, -811, 1495, -257, -392, 616, -1438, 727, 237, -485, 1197, -934, -16, 332, -884, 881, -71, -116, 566, -764, -13, -8, -146, 605, 200, -93, -309, -341, -344, 340, 636, -117, 432, -585, -722, 605, -576, 697, 595, -957, 735, -703, -412, 989, -873, 652, 243, -828, 842, -566, -77, 491, -660, 446, -72, -83, 431, -271, 192, -329, -169, 168, -172, 688, -16, -143, 29, -800, 202, 229, 185, 610, -319, -289, -369, -199, 314, 298, 468, -317, -205, -264, -474, 727, -75, 207, 351, -1017, 384, -226, -217, 1109, -730, 236, 80, -1060, 982, -226, -35, 876, -1031, 164, 100, -563, 865, 27, -184, 195, -469, -197, 328]
1330C28j50j78L37p47J3Q42q21Q06p0j092J125q02K87Q75j222Q13n69l27J102
1349E50q88P99k47q09R03q49O59L47o67O74q42J57K31l35R06o56K87j06q51J053
1369C16o17M46N92j141O31n79p2Q37m72N49n98j66K28m60J152o70LM19j365J295
1389C28k71l10J124j427N54M1n59J111p36M03j87n06O98p80R01j87m04Q32j429
1408h04R66j36m84J628j787Q52n3j473K432j580N45J023k646K123q38m90K227
1425A505k181R06o7j268J733q32M93J28q44N23o89Q72k14P9M61j455J249r16K28
1444b89J466k031J814j218q93K421k521K178j30k228K849k830J319J386k650L032
1460A675k376j01J929k727K945j209q69J990k904K138k22r48K222k426R98j85
$$ y = [328, 178, 0, 337, -410, -397, 445, -376, 430, 360, -732, 393, -409, -122, 753, -469, 344, -225, -552, 550, -338, 461, 214, -595, 308, -541, 118, 465, -202, 472, -370, -213, 18, -317, 589, -67, 220, 114, -737, 316, -301, 145, 737, -404, 227, -352, -424, 413, -59, 490, -108, -274, -46, -506, 646, -24, -21, 398, -967, 328, 57, -253, 871, -556, -2, 39, -520, 591, -145, 258, 71, -435, 263, -517, 384, 197, -207, 625, -804, 162, 26, -458, 1170, -617, 235, 182, -1291, 1141, -439, 106, 1129, -1517, 606, -232, -722, 1505, -676, 230, 163, -1105, 628, -204, 289, 417, -427, 96, -593, 279, 65, 144, 605, -850, 399, -517, -289, 1177, -854, 960, -258, -1151, 1270, -1251, 927, 797, -1431, 1418, -1412, -93, 1293, -1357, 1675, -701, -802, 1127, -1600, 1345, 136, -733, 1257, -1647, 491, 269, -679, 1543, -883, 115, -70]
1476g0r00J965j321J122p84p95J085j516K320q57l60J288l159K599q27n30L153
1493B413m011K394o10k394M591l838J854J227m201M651k988P0K991m441L603j271
1509D0j322L244l419K111l74j502K318k165J745k95o54J214k416J816j056N85
1525a30K031k829K397k633n36L110l241M269j647k396L570n142L690Q17l197N212
1541C345m904J096K008m562N109k687j99L251m454L370j577j481L193l020K535
1556A023l60j382J793k339J642p50L3J227j893K727k260L26J117l734M414k013
1572d29K98L385n898L624j746j948O152m916K963J30n053N405l796J425L071m706
1588b039M049k416j067L012l451K769m43r22J882k335J242r20L01J053j392K123
$$ y = [-70, -970, 995, -326, 796, 12, -783, 302, -1214, 1106, 249, -111, 1177, -1982, 617, -210, -740, 2413, -1598, 796, 186, -2208, 2383, -1455, 399, 1626, -2575, 2076, -912, -842, 2149, -2292, 1311, 40, -1282, 1962, -1457, 654, 280, -1222, 1096, -1069, 676, 381, -273, 941, -1475, 341, -715, -130, 1901, -928, 1469, -1164, -1700, 1410, -1831, 2438, 791, -1605, 1965, -3177, 513, 1330, -1867, 3345, -1559, -463, 1545, -3017, 2092, -595, -794, 2457, -1997, 1373, -204, -1685, 1508, -1512, 1023, 663, -719, 1074, -1265, 377, -373, -340, 887, -1006, 1721, -539, -213, 904, -2830, 1584, -429, -131, 3254, -2644, 980, -766, -2714, 3438, -1478, 1485, 1615, -3438, 1967, -1829, -404, 2667, -2039, 2010, -406, -1473, 1539, -1912, 857, 414, -508, 1374, -961, 281, -639, -338, 715, -677, 1446]
1604A446k380Q96Q13k556L662k920N33K254l970M373k399j216L517m869M169l89
1620I64k559M459n156K077J307l397M985l235M1J972l776L354j100m55K005k513
1636a027J541q95n4J002j176J632j613P18J18j493K620k284J282N81k818L455
1652A589k679P45K262l986L731k011j202L739m086K877n3k761L620l150J259J342
1668A236k528K767k142J58J209j872K383j336p1P05j738J842q06M50M00j530J403
1685E30j380J087M69j558K009k178R12J058k216K634k072Q9J901k673K713j428
1701a03j007K471k873K306j26j923K728k444R65R51k267K032j077K50J261j488
1717c44O30j149K44Q67n9J250j695n7k46p19K354r86N34K4j989J833j105M36J091
$$ y = [1446, -934, -38, 775, -1781, 1881, -1039, -506, 1748, -2222, 2151, -248, -1464, 2053, -2816, 1353, 964, -1595, 2864, -2292, -215, 1092, -2305, 2680, -555, -514, 1458, -2318, 1036, -64, -519, 1486, -1027, 514, -381, -435, 567, -609, 1023, -590, 128, 246, -1247, 1373, -911, 371, 952, -1866, 1589, -1090, -345, 1917, -2069, 1662, -349, -1551, 2188, -1898, 979, 926, -1835, 1785, -1365, -106, 1236, -1292, 1475, -667, -509, 700, -1172, 1211, -125, -196, 509, -1229, 613, -193, 257, 657, -873, 530, -850, 237, 706, -852, 1157, -1021, -109, 949, -1267, 1367, -705, -616, 1285, -1388, 1325, -103, -1110, 1361, -1512, 794, 668, -1255, 1473, -971, -6, 945, -1322, 710, -367, -117, 1144, -344, 286, -863, -619, 248, 189, 1439, -256, -313, -559, -1278, 1076, 90, 624, 648, -1341, 492, -613, -177, 914]
1736I14j950J945q12l24J209k421J325j3j37K003j863K58o35q54K010q17R84k03
1754F19j436J393j238N90M14j339J594l80K84L69j786K78l45R79J243n12P5j832
1772a030l0P27n6J817j130l23L24j432J558n99l74J223j144J326k14j261N75j240
1790a283J135J004l53N40j638k00L26J65J241p46P4l78m18J089r24L97j19o22
1808g10J675p23M7q0j632J324J01L90Q13j545M7k75R9J015m34K50n08p9N05n49
1828b69N24n95KQ26n25O63o85o41O77l95J013r4o20K56r11Q63J38k65O38j167
1848e67N82J10m93J033j065L15L43p47J080p70l2N59q76R24l86l12O52p15N41
1867A76rl57L10k71K13n1J19j74j53N37o40N41p9p48J139q06K74N48j325J090
$$ y = [914, -1036, 909, 97, -227, 982, -1439, -114, -127, -264, 1739, -124, 134, -501, -1355, 655, -162, 822, 619, -817, 576, -662, -72, 342, -997, 597, 217, 501, 870, -916, -638, -983, -4, 1239, 727, 802, -1030, -1060, -333, -389, 1428, 298, -25, 299, -1133, 425, -174, -548, 675, -469, 857, 643, -618, -43, -1283, -148, 856, 503, 1043, -595, -795, -469, -304, 937, 191, 265, -113, -531, 558, -366, 31, -88, -710, 965, 242, 289, 209, -1423, -99, 2, 392, 1205, -340, -293, -568, -469, 546, 112, 362, -146, -225, 280, -269, 255, -340, -338, 488, -37, 626, -59, -700, -23, -418, 595, 501, -119, 137, -774, 89, 227, -38, 600, -567, 15, 125, -368, 665, -400, -85, 258, -489, 591, -179, -211, 348, -528, 396, 10, -302, 350, -365, 176, 167, -190, 120, -151, 62, 11, 130, -44, -197, 340, -300, 241, 162, -586, 553, -253, 21, 569, -756, 334]
1887C34l99j93J002j335O75m3m40J233j144K04J22p23J422n19j85J52j057Q86
1905hK71M4J66q63j6J15N50J89l15j67n94P24J50p6K59j201P19K22k02R85j589
1926f37K60N10o43J733j157o65P31j121J685J16j131N33j269P69J099n50K70j108
1944e75k72Q41L35M72o52o60j93N58P54j45j48r84J02Q03j30P48j037n57Q81n48
1964d07J276m18j255R79q96J114P05j645P11r17K44J708j091K14o53q65J534Q5
1982D23J51j86j255K11O74M39K16m46r92J52P79k8P59q24r86J065n91Q35N61j771
2002h14R60m02j83J590j527K35K51q92J638o09n01M65j113J113M23o40M15j010
2020f01l8R65o7K06k52q75J61O61K8L84l43j003O02J9K49P75j174J89o3m38J421
$$ y = [334, -65, -258, 744, -591, 84, 41, -399, 834, -310, -106, 16, -707, 715, 196, 11, 163, -894, -8, 263, 307, 473, -390, -406, -291, 259, 448, 133, -34, -628, 96, 246, 170, 429, -772, -53, 169, -33, 952, -637, -377, 133, -510, 1223, 66, -599, 132, -989, 696, 812, -319, 214, -1055, -286, 813, 263, 533, -575, -847, -6, 329, 801, 149, -511, -704, -146, 608, 463, 315, -669, -567, 236, 106, 854, -183, -740, 141, -407, 869, 451, -804, 175, -721, 393, 1098, -547, 164, -753, -509, 1199, 108, 322, -331, -1196, 338, 423, 574, 388, -867, -656, 18, 457, 673, 227, -765, -613, 166, 138, 897, 73, -913, 152, -439, 396, 957, -814, 146, -256, -439, 1151, -376, -141, 110, -782, 856, 247, -254, 211, -902, 211, 634, -6, 409, -601, -639, 326, 259, 465, 213, -662, -501, 160, 188, 572, 229, -774, -172, -153, 96, 871, -303, -114, -177, -615, 806]
2041H06q43JM63j351J356j77p69J347j403L66R54j379J014l01p77J280o35%M42
2060C94r48M96K43k67N04n05l30M83k96L98M06r33L21Lo07J271m40n40R50j319
2080g16M49R14j159J072l58r25J152q18M13N74r78P57o44j58R52r14Q19o8j062
2099f98J087o80n4J096j005K73L34q90N77J15m72N35m6k79L48l59k37L46j54M72
2119C09Q9n48K93p21K75Q68q38Q02l53j059J480p92k6R61j603Q55N29p11R60j029
2139b59m80N55j03J115k10n28k55r06R47L98p8N60r10j88M35l45R8J46j80K76
2159H8P02n04n65j15p16J063R57k85J57j390l86O42J24J301p24n08M11j112J263
2178D03r8j183J268p71N81J196j657o2m53k73J638L58r5p54q71lL30R77j03k43
$$ y = [806, -37, -36, 427, -924, 432, 255, -514, 833, -570, -204, 750, -629, 385, 84, -693, 587, -48, -48, 394, -554, -58, 185, -82, 422, -83, -413, 70, -226, 172, 578, -355, -34, -31, -638, 633, 193, -347, 603, -716, -267, 647, -512, 560, 202, -723, 429, -389, 24, 598, -380, 377, -267, -425, 527, -387, 432, 364, -698, 389, -291, -345, 751, -254, 19, 353, -537, 40, 155, -317, 218, 172, -107, 241, -118, -355, -9, -163, 309, 398, -150, 143, -578, -303, 565, -273, 529, 176, -883, 597, -195, -221, 740, -863, -8, 521, -190, 770, -259, -739, -184, -287, 828, 618, 90, -165, -1071, -124, 274, 196, 756, -154, -342, 93, -252, -154, -8, -188, 88, 790, 286, -279, -394, -1110, -47, 910, 625, 782, -608, -994, -352, -228, 1073, 349, -159, 252, -860, 403, 305, -878, 390, -381, 200, 1396, -261, -323, -776, -1049, 589, 947, 852, 98, -773, -776, -446, 531, 428, 185]
2198A85Lm94M85k54l38M9k6J111K8k36n83j431Q94O28O33Q39j534m99j75L9J215
2219E39j78O3n07k79Q30p48L96k57q19J603k71J8K75j746M77M72J82R43p16m37
2239a60k51K8N05j32K63l86R7M77n00J92o17r2P92m9P19p35p55L98n83J235L09
2260G55q34N17j030J61Q15n13M81l29j98K26j09L14n55L44K8l84R13q54K0N67
2280C35q58R22k28n55O37n85M38J43l61K42m81M16jj03L70o78L89qj81N40o85
2301b92L58n6k40P16p77L94Q9o79R77o85k6O47p56O49j57n07K99k08M39N4R3l55
2323b3n78O45l62N95M35j187O73n18j57J142q99L93no08Q70n31R2Q7m78P32k60
2344E8J31n7o02N04j74M30M5n72L33n27N62K94o85N86p83K30P79p17N73n76m22
$$ y = [185, 188, -306, 179, -75, -413, -364, -390, 721, 749, 513, -70, -1501, -607, 21, 654, 1493, -41, -540, -715, -676, 539, 361, 424, -83, -362, 468, -280, 116, -141, -960, 643, 372, 390, 665, -1081, -604, -132, 50, 993, 277, -160, -411, -383, 122, -10, 253, -133, -36, 441, -59, 133, -484, -576, 216, 167, 886, 151, -604, -206, -789, 446, 755, -79, 438, -592, -431, 384, -129, 352, 23, -175, 51, -58, 256, -299, 45, 73, -311, 602, -252, -232, 335, -523, 399, 171, -384, 253, -332, 106, 249, -112, 130, -351, 65, 64, -39, 331, -347, 42, 34, -147, 393, -292, 66, 10, -230, 486, -291, 103, 192, -487, 490, -195, -221, 426, -330, 319, 162, -345, -46, -254, 185, 239, 332, -23, -601, 44, -318, 277, 712, -475, 198, -320, -477, 665, -234, 159, 154, -454, 416, -115, -23, 64, -414, 318, 58, 189, 132, -470, 34, -140, 290, 335, -237, 96, -431, 131, 425, -260, 326, -457, -227, 552, -165, 408, -168, -590]
2365e90P77k90N56k54n26K13l27P76j48j87K31q74Q19l7k97P11j064M79K72n41
2385c01Q41p81NM57m68O67m00k14J60j98N66k73J09k68l99Q05m72M93N9j059R07
2406B36n26J80Q52j165N75k58l63J015o84K66o9n06O71l21K84r1l52L87m13N63
2426B81j74k89N12q10O92j9n51Q92r24L58M48q23P94n51j03N72m75M88l70q0J00
2447c2k73P48n63K71L0q46J074n79J25O71j263Q48k43l80J084r96L72J23o55Q72
2467C88m76R4J80m69M39k82K74j33j62M12o28O60k44m20Q60r55O04K39q96R86
2487D71q06J42O48q31P69n18j56N20n81P45m57p3L23p18R33m70o8N97j101R02
2507B71k12m10R80j057M42K05o27Q20n37N1K11l35M22l44K66k25q6N08o78O83
$$ y = [-590, 187, -103, 453, 199, -327, -114, -441, 335, 187, 0, 231, -643, 176, 139, -158, 553, -511, -32, 240, -301, 540, -241, -236, 221, -247, 420, 20, -194, -34, -232, 334, 61, 170, -98, -497, 308, -164, 329, 388, -671, 236, -290, -110, 742, -423, 152, -106, -469, 546, -138, 128, 59, -447, 224, -97, 187, 96, -256, 131, -282, 281, 107, -182, 330, -480, 212, 193, -358, 534, -390, -32, 416, -407, 387, -164, -267, 305, -170, 318, -52, -132, -32, -305, 443, -120, 151, 181, -665, 409, -170, -45, 626, -637, 211, -32, -412, 672, -324, 48, 171, -484, 388, -88, 6, 186, -283, 156, -126, 148, 15, -147, 265, -363, 297, 53, -367, 493, -462, 142, 381, -515, 471, -335, -193, 455, -376, 393, -125, -281, 239, -342, 403, -54, -127, 196, -522, 411, -59, -127, 470, -631, 271, 59, -351, 629, -428, 14, 219, -408, 412, -125, -74, 137, -198, 224, -120, 146, -79, -165, 343, -335, 348]
2527C48l61m21R70j038P65J18j066J277r89J91R11j335J008l64n34J064q29L57
2545G2P8m55M68k80L28k84%K37n82Q16m37j30O05r63P64j33l98P75q97N67K2m83
2567c10Q08r08L98K41n95R28p17M0K57o16Q28m31J81J67p72Q53o35J55O34j043
2587e37Q85k37m74Q03p78K29K38j91L27k81J63m79K47L32n97R22o45k52Q17j053
2607e61P84m6o24R57p83M38J12q16Q52p00L33O22q74O70m68l58O40l31L08Kq6
2628G1j15j49L69n74N03J46n92R10p06j75N73p85P51J2k72L62o68L71j57NN86
2649D66p61N71k11m61Q47p57K83K49n47O90m26N1J04m91O06l44J81K74n96M29
2669A57k60j14L52k12K03j14J27k27j40M49o12O29Q3p39Q91p79mQ06q95P05j37
$$ y = [348, -13, -434, 536, -502, 263, 381, -685, 592, -397, -206, 705, -630, 378, 14, -520, 544, -285, 72, 150, -305, 163, -117, 211, -73, -73, 164, -418, 398, -39, -169, 436, -527, 237, 104, -294, 481, -416, 151, 173, -310, 498, -410, -12, 229, -366, 562, -155, -115, 142, -474, 354, -77, 104, 271, -501, 352, -283, -128, 506, -537, 348, 111, -363, 440, -338, -109, 129, -62, 265, -16, 147, -332, -85, 247, -350, 572, -73, -325, 492, -561, 223, 177, -447, 510, -273, 165, 277, -539, 313, -387, -54, 568, -306, 364, -104, -462, 178, -153, 155, 157, 71, -44, -193, 176, -398, 105, 251, -341, 569, -137, -312, 261, -524, 227, 239, -33, 329, -339, 32, -125, -120, 466, -295, 276, 65, -396, 451, -306, -23, 226, -321, 369, -57, -6, 98, -393, 213, -131, 50, 324, -272, 157, -103, -217, 135, -77, 126, 12, 139, -88, -228, 221, -391, 238, 321, -418, 473, -306, -310, 496, -399, 306, 169]
2690A69n42O90o03L39J55m25N09m79J54J93m07M54k24l7J28k09J68j31K73j91
2710a6q7K78n52N12K9l99O06o23R6L41m18N28l07o2J36l37N49l44J06K01o54O35
2732B18k50j29N72o66L16K5l23M75l51J69L7k28L22l61J88K3j83L81l09O4k2j56
2754a88L03j69K52k25k12L58m21N40L1n38M81n55J78N32m73M39l73k73L88k90
2774b15M65r4k09K02m03L14k2j64L05l07K65l4j70J06l50L37J1M3K79o26J98l7
2796a06j12N94m21N1J5k75M64k01j8n0k58M98n0J38j15n69K45l5M24K85m49K5
2818H0m84J51M39k35M06l50j91M34m50K16n7k99N45mO5j71m37oJ23N38N1j83j75
2841Fn47M41K05l4K78o28J41K32j48L79n32q8K87j02O39l02m41P0k86N02L06j80
$$ y = [169, -373, 317, -286, 53, 208, -217, 292, -187, -33, 160, -247, 207, -17, -54, 74, -135, 33, -98, 175, -16, -103, 175, -377, 135, 164, -235, 371, -252, -156, 185, -233, 295, -12, -74, 62, -275, 274, -70, 36, 237, -417, 218, -32, -161, 411, -255, 61, 86, -237, 238, -113, 56, 93, -135, 187, -174, 14, 37, -146, 235, -74, -10, -32, -188, 115, -54, 198, -27, -239, 119, -302, 238, 269, -269, 212, -343, -165, 367, -106, 333, -40, -313, 75, -215, 250, 156, -53, 149, -254, 60, 38, -126, 179, -128, 137, 103, -67, 39, -311, 26, 37, 80, 359, -267, -69, -106, -218, 376, -45, 6, 21, -254, 210, 9, -9, -59, -317, 181, 131, 269, 154, -415, -170, -205, 219, 504, 55, 80, -404, -253, 186, -49, 357, 7, -184, 250, -200, 16, -41, -340, 205, 201, 266, 95, -342, -348, -225, 313, 364, 181, 6, -541, -100, 105, 71, 349, -279, -138, 94, -54, 325, -207, -295, -8, -110, 529, 227, -214, -144, -430, 72, 378, 198]
2863A98j09l09P6Q5K43r3l11L41j81K18J69p43K55K3O7O82m93k57j15j83N93J36
2885B92l0k55l61K41Q1K64o5l72J52r5L14Q6l69Q9k37K85L31l70J31l15n1N34
2907B80k29N5j20k72L19J38j6j73j22n3J43M17l25j05j5l28O37j3k79K19n65K82
2929a25L92l26L08l73k08N04j92J55j8m02K70J08k0L6j98j55K72K09j57L9l31
2950b12j47N89r4M5oo17L21K16k0K74m93r8K15kL27k68k04K5J4L81q1j94j22j49
2974c00M02R9m5j23l83K82J72M9J07m83m0K88N4K39k00m26J04K24J48J55k59m58
2996c94K37J76Q8L33n78k03L62j76M91p7o16L30j67K07M67o18J9j2j24O23j94
3017A74k54lk60L80K54j81j08k28oL31J72j60j77j51L7L70L0j33j41k34K50J95
$$ y = [198, 89, -220, -144, -59, 184, 91, -220, 121, -60, 158, 327, -416, -161, -138, -71, 611, 118, -139, -254, -437, 156, 292, 262, 7, -354, -113, -32, 232, 167, -205, -53, -148, 166, 252, -117, -28, -265, 20, 351, -19, 112, -203, -254, 280, 51, 106, -14, -286, 33, 171, 155, -18, -140, -193, -50, 367, 42, -63, -78, -406, 231, 218, -61, 158, -407, -125, 267, -59, 249, -124, -332, 172, -20, 135, 117, -285, -15, 93, 73, 109, -89, -244, 28, 237, 80, 119, -212, -359, 230, 136, 181, 175, -442, -121, 95, 75, 349, -144, -242, -27, -29, 298, 30, -174, -149, -135, 246, 165, -29, -151, -300, 102, 201, 156, 33, -350, -68, 104, 153, 260, -223, -263, 25, 79, 318, 118, -308, -204, 20, 168, 323, 64, -394, -157, 19, 107, 440, -138, -341, 21, -155, 336, 259, -357, -27, -194, 13, 480, -138, -119, -131, -255, 368, 174, -80, -83, -343, 37, 291, 110, 2, -226, -232, 99, 271, 111, -66, -217, -180, 190, 220, 87, -54, -288, -38, 157]
3039A57Kl6l33L7J41J35J67l61l2pjM36k76j05Q6l35M81L6l15K92m33J16M12l40
3063g6J98j07l04L91k8n0J18k64l6K57n7J8P0l09J07J87j74K63j97j99L08k37
3085a21K04J15l76K32j23m4L21k67O7j3j48K07o6P5m8r6J08j38J88Mj80J97k06
3108a08O3J90k46J52l7j37J93l3m5K8n0m4J37K3j46J40j85K1K95k90J73n9l04
3131b69M57k17J7K46n17K78P2k13L99l12j15K36j68J70P3j92m5J01%LJ58k73J7
3154i4K09k24K52p5k62K98j42O5J44l27J30MM6J56j92n5o6R9J44J3j4k84J02N0
3178b3k9L08l78J6K03l03M24j66l30L73k24J99K27m22L3j7%K64M5k07j04R4n8
3201g5K05L0l71K39m3M6L23n00k7O6p7N52j33k55m4l05L20K45p7lk23j9J13J31
$$ y = [157, 159, 123, -210, -173, -32, 103, 270, -91, -123, -130, -131, 305, 29, -76, 10, -325, 156, 192, -123, 169, -264, -148, 264, -76, 122, 15, -289, 102, 74, 24, 142, -122, -158, 99, 42, 60, 130, -179, -72, 115, -59, 204, 7, -192, 116, -121, 83, 198, -178, 54, -69, -113, 208, -59, 8, -5, -153, 54, -12, 63, 15, -81, 27, -111, 77, 81, -99, 98, -108, -45, 145, -101, 51, 14, -123, 70, 37, -8, 20, -30, -74, 63, 86, -60, 80, -105, -84, 211, -79, 94, 35, -269, 188, -29, -12, 234, -283, -5, 67, -146, 253, -59, -174, 62, -106, 64, 137, -55, -100, 1, 1, 4, 162, -111, -94, 115, -109, 143, 68, -194, 104, -38, 27, 171, -156, -26, -22, 24, 180, -12, -67, -133, -34, 110, 123, 109, -175, -73, -23, -52, 256, -122, -106, 97, -206, 218, 52, -278, 95, -129, 70, 297, -125, -92, -109, -109, 155, 200, -7, -111, -17, -75, 130, 160, -211, 28, -15, 31, 354, -146, -173, -107, -184, 368, 235, -20, -64, -369, -49, 196, 119, 116, -107, -126, -13, 118]
3225A18j27j47J34p3L63J6m96R5k21K00O09l25l8k20l11M62Q3K6k8k69R8J50P2
3248A71j92j57J4Q6M50j06k77j46l26M59L03j02J22n42n2L49j12K31j54k31K85
3269G3L7J5j18k66m4L20L25r9r4m04k00N19L8J51J3n78K22J04l4K72l88j4K46
3292I6m3K21k49k70N3J12L36K1j87k81q1K47R6J50k05k10J79m1J98l7l58J66K0
3315f7K01J78l77r2p1J43L24o5r1k65LK12K7J69k73j22J95q7K52r9k96J94q1J91
3339A03J39l37J7n1P8K60j03j40j30N8J31J22kk82K6J8P4K54k66m5L8j05L09j07
3363E9j23L3j29K64L7r8qk49J85J23nO8k66J9O7J8J66j84rrJK08j59n2k2q3K59
3390A11J3q0m5j61Q3R9Q3p9n5Rj04K16o8j35K01k03J47J58l20J52j14m0L31j60
$$ y = [118, -9, -156, -22, -95, 268, 284, -212, -117, -338, -138, 471, 146, 108, -112, -423, 39, 122, 148, 120, -149, -51, 99, 171, -21, -178, -164, -78, 372, 266, -11, -157, -483, -24, 279, 177, 299, -243, -295, 54, -58, 173, 19, -212, 73, 110, 125, 7, -259, -303, 17, 342, 243, 149, -255, -455, 64, 102, 253, 266, -312, -90, 14, -20, 252, -136, -150, 96, 53, 274, 25, -245, -192, -80, 256, 277, 90, -191, -272, -25, 71, 221, 16, -194, -15, -56, 142, 105, -253, -87, -67, 134, 312, -65, -157, -228, -85, 239, 174, 83, -182, -179, 33, 60, 229, -44, -166, 29, -58, 194, 95, -201, -7, -88, 103, 242, -95, -78, -129, -51, 209, 106, -34, -164, -106, 25, 147, 145, -137, -111, -93, -19, 235, -31, -76, -38, -143, 166, 59, -64, -31, -160, 104, 141, 43, 35, -214, -29, 94, 89, 157, -109, -90, -23, -5, 161, -23, -32, -41, -40, 168, 9, -43, -65, -148, 111, 124, 44, -1, -162, -79, 20, 103, 24, -31, -22, -126, 90, 22, -113, 88, -115, 32, 190, -130, 22, -92, -132, 199, 39]
3414C9L8o1j84J79pR2jj46M8o4J02J8p2M0p9P6J2n0O5j25R9Qp3J31j65O8N2q9
3442d9J16j18K1M3m4J28j38M1j8r9K46j75P7J06l04K43q3q0K85k54O9N0j89J89
3466F3l0l0O9j01nLN8j3M3k9j39J41q9M9J17k16J59o5r9K38k33J22P3j92K40j97
3492f3k6J51j54K23o3j10M7j43J86NJJ5j96J14qN4J24k41Q7m4k0K00j51J9k5n9
3518g7J49p0N5r5l4J39j21J51j43q8K19j62K01n9k48K25j42J64J44k85J06j63
3540a34P6K32j48P1j72o0J87m1J22j20q8O9l7J57r6n0L3q9K14j13l1M9j97K50
3564H4j0r0P8k73J93P7j9J20l13N7P1pK63k37m2Nj14L04o2n9nj70J67L3J8oj59
3591i6J00k6R1Pj83J26q1J04R1k41Q5p3P3J99j81J4j37j4K51o1P9j65j56J80k2
$$ y = [39, 77, 16, -168, 11, 4, 96, 95, -51, -3, -67, 35, 53, -19, 21, -58, 18, 30, -20, 45, -80, 19, 27, -46, 85, -80, -12, 40, -49, 67, -51, -30, 13, -31, 97, -41, 0, -18, -117, 129, -46, 31, 137, -167, 76, -7, -87, 198, -56, 13, 63, -126, 63, 33, 3, 72, -29, -34, -31, 27, 14, 57, 28, -111, 30, -59, -10, 107, -109, 50, -15, -114, 124, -109, 13, 86, -106, 134, -63, -89, 62, -92, 131, 68, -42, 5, -138, 48, 53, 54, 69, -127, -13, -21, 33, 157, -84, 3, -41, -61, 139, -12, 7, -18, -77, 72, 2, 57, -38, -72, 67, -54, 97, -46, -134, 85, -77, 124, 65, -183, 42, -100, 64, 208, -77, 29, -134, -58, 174, 26, 97, -75, -135, 52, 11, 133, 13, -75, -6, -43, 114, 18, -32, 1, -88, 126, 13, -18, 31, -166, 84, 74, -16, 62, -211, -18, 59, 40, 160, -153, -96, -25, -32, 231, -6, -48, -43, -157, 147, 85, 26, 21, -149, 18, 51, 69, 63, -96, 4, -22, 69, 76, -107, 19, -62, 42, 133, -108, -23, -96, -23, 176, -5, 9, -128, -142, 109, 48, 127, -38, -194, -14, -36]
3616c6J95q1j73P6j32K16N3j60J26k14R9J58j77J14j20qJ81j00K8q3n1J10N1L0
3640A02j41k1k4L8K25j65k9m3j42L08m4k0M2l05J70O8j8J82k53NO6p0J52q9k1
3665b7L2j4P9q8jn3K4J88j14L6r8j40K43l1M0M8k51P4N8J3Q7q4p6k8J00M2k9Q
3693C8j87R5Q3o3J85j91m8J51j94K04l9j42K28j60N4Q6k38J33K8k1J55j35j14
3716i2L5PP1J09o7j47P3o9N6J81k00O9kj59K38r3n1J10j62J17K5r8Q1q9M4L8l4
3743iK2o1N4mJ1M8j34Q3k3jJ55j71K2K7j29J97k9o8P9j29K8P5l3J7Ln0k1P0m8
3772a9KJ04j50Q1Rj41J91j13PJ28j95J05j9q4J86r1j6N4j24O9L6k4M2j3m9j3O8
3799C1m8M9M5j42R7j1r2J70j13OR8j68Q7Oo1J05p4lPj5J7J3L1n5J4j2m8J14p1
$$ y = [-36, 159, 78, -95, -19, -151, 65, 118, -42, 84, -130, -31, 127, -50, 64, -56, -64, 117, 17, 45, -38, -89, 21, 72, 102, -39, -60, -84, -46, 179, 14, -15, -58, -200, 108, 64, 44, 86, -219, -49, 19, 1, 183, -70, -65, 1, -69, 83, -6, -27, 5, -9, 70, -18, -19, -72, -48, 140, 26, 62, -36, -176, 67, 36, 76, 124, -127, -53, 5, 18, 105, 21, -55, -83, 17, 59, 30, 38, -149, -54, 29, -34, 151, -40, -88, 63, -131, 73, 34, -108, 120, -40, 14, 100, -138, -5, 23, 2, 157, 22, -92, -57, -50, 21, 130, 63, -84, -11, -80, -24, 157, -43, 26, 24, -135, 103, 10, -41, 69, -93, 24, 49, -49, 32, -57, -13, 25, -9, 13, -48, 6, 2, 13, 61, -73, 10, -13, -14, 141, -30, -8, 19, -110, 87, 58, -10, 69, -60, -32, 43, 10, 27, 30, -20, -41, 29, -19, -17, 87, -63, 18, 27, -114, 77, -36, -29, 99, -96, 9, -10, -94, 92, 1, -15, 39, -85, -16, 20, -4, 38, 25, -24, -37, 31, -17, 32, 77, -65, 32, 21, -71, 99, -14, -8, 90, -78, 9, 15, -46, 59, -15, -18, -11, -26, -9, 4, 35, -20, -6, -18, -66, 48, -23]
3828b3K5N3j49J33m4o0J73j71N9N5j41J63n5n9J00r6K9K6j0K6lk1p0P5j2lJ03
3855A03j12J9Jj06J26n2K6O5j05L8o1j7R7m3R4n6n6M8r7J01Pk3R2j22M7J2p9J02
3883D9p9K3P5q8P4o1n6O9k4N4L7m3m0j1Ok2Q1m1j6R0j35N8J0j31J67m4jJ02j92
3912h9P2m3j7J81r8K3J5j42J14k8mQ9j02N2Om3L6m2QL0K2J4m8j7l6M0M0k0N2q3
3942a8NRl2R1r9M7K0p7J24r6m6J15j37J41Pj15J17j33L2R7r5J02n2o6J00o8M2
3969A5K3p1N9k1pK1k1k7K7L6l7L9k3o5R6p9N2J9j04R0o1OQ0j01P6k4o4J13j05
3998e8O4J5r4J21q0oP1r9J13k1n4P2q9K4N1n3N1j1k4J7Kj9J9Ol0N2l8m1Q1j15
4028g3P9M1j13J18r6l3J41j49Q4J7j04J50p9j2Q8j45R0Pk9P6o8j8J9j1M1J0j3
$$ y = [-23, 2, 55, -94, 39, -5, -65, 108, -63, -4, 51, -90, 73, 18, -41, 59, -37, -8, 18, 8, 34, 31, 10, -60, 15, 3, 0, 103, -9, 10, 11, -95, 31, -21, 5, 70, -35, 3, -58, -75, 22, -21, 73, 17, -39, 9, -88, 13, 20, -3, 89, -33, 14, 26, -53, 49, -30, -7, 68, -20, 54, -7, -63, 6, -18, 36, 73, 30, -10, -21, -15, -37, 44, 3, -13, 77, -58, 0, 10, -121, 46, 2, 1, 103, -89, -17, -60, -77, 104, 6, 29, 44, -98, 16, -12, -16, 73, -29, 23, 29, -14, 22, -20, -12, 18, 40, 54, 6, -11, -47, -7, 33, 13, 65, -18, -13, -4, -36, 55, -44, 3, 23, -54, 70, -26, -72, 43, -94, 47, 54, -61, 56, -77, -45, 52, -43, 59, 7, -59, 41, -27, 15, 38, -33, 26, 5, -2, 19, -2, -29, -2, 34, -3, 36, 13, -52, 44, -35, 17, 36, -68, 22, -39, -33, 47, -54, 22, -2, -66, 47, -58, 6, 21, -73, 48, -32, -38, 33, -66, 47, 26, -28, 44, -45, -21, 30, -23, 28, 17, -7, 10, 12, -7, 12, 18, -12, 40, 2, -39, 42, -73, 6, 47, -66, 52, -44, -77, 64, -85, -1, 16, -88, 62, -17, -29, 59, -86, 4, 11, -18, 58, -10, -28, -9, -20, 21, 31, 18]
4055A8k1JPj2K8m8M2%l0P7q4J4L2o4J00o7nL5j05J15l1k4O3j22O8K9p4J17r4j0
4085d5N8o2P3j6n0M7l3K1L2k9jN%j0N6o6J8K7p7J14n4n5R0j04P4N3j29J15q1k0
4115d9J16j15Q4l4p3Q9m3J4L7p7M7l1J5L7l5J4lqJ2PokL0m2M3Rp2P2m2JO4q4N4
4148B9l7m2J02q6L5K4r4J01n7QO2j12P7j4m0Q0p1K0L5o4M7j2j2K4j8mJ9qj6K4
4178@kj9N6n9K4J9m2P0n6J1M4q1O1k3k0Q0j01M9J1p3Q3n9jN3q4O4k2l1O9m7MJ8
4210dk8L0jjmpoK0%j5K2k0NK8n3M7Nn4Q2m8j4N3p7P3j6l4N4n0PL1m5N0m9PK7n5
4246d0M9j4k7L4l5L1K4n7L3k6jL9k4J9J2l8J9j0NJ4NnK0k1j9J9m6M0L9m4N6o5
4278a4k6P1o4O2L6j03O3l9l5Q6q9M6J1n7Q5m9l0M6m1N4Qk3K3l2j6J7LK6npqKJ
$$ y = [18, -3, -2, 5, -7, 21, -27, 15, 15, -15, 62, -22, -8, 24, -40, 60, -7, -12, 23, -82, 33, 2, -22, 41, -81, -13, 16, -58, 59, -35, -45, 13, -49, 24, 8, -42, 5, -28, -7, 25, -4, -5, 0, 0, -10, 46, -20, -2, 25, -52, 62, 8, -47, 43, -61, 13, 66, -63, 52, -29, -49, 67, -48, 36, 2, -71, 18, -25, -11, 26, -51, -4, -35, -20, 17, -18, -4, -7, -15, -3, 4, -2, -4, 26, -16, 27, 36, -36, 36, -6, -5, 59, -25, 29, -8, -50, 52, -34, 1, 25, -69, 32, -25, -17, 45, -67, 10, -4, -44, 36, -35, -15, 20, -44, 3, -9, -21, 3, -15, -19, 0, -8, -24, 0, -2, -21, 35, -24, 0, 19, -23, 47, -9, 2, 46, -35, 26, 3, -17, 63, -38, 11, 22, -51, 32, -27, -28, 25, -59, 5, -17, -48, 21, -26, -22, -4, -32, -2, -3, -4, -8, -15, -21, -1, -1, -16, 6, -14, -9, 19, -34, 13, 18, -36, 46, -2, -16, 37, -40, 33, 17, -17, 37, -13, -6, 25, -20, 30, -19, -12, 15, -40, 9, -5, -32, 2, -33, -2, 22, -35, -2, -28, -29, 10, -14, 5, 17, -21, -2, -12, -7, 7, 12, 7, 27, 6, -13, 6, -40, 0, 39, -5, 51, -14, -40, 31, -33, 29, 65, -38, 25, -14, -49, 37, -52, -6, 5, -52, 33, -16, -46, 0, -41, 13, 21, -2, 21, -11, -27, -10, -7, 19, 14, 7, -1, 1, 2]
4311Bk3L3qK9J9m1ql5J1L9J0K8m4l8%k8P0lpM3r7N3j2m6Q1o1K2N9r0N4n0k7Q7
4344B2n0M1J6n9L0j1KL0rj6K8kk6K6k6j1O8n6N0nr9P5m4OR6r1L4pp0P0m1K3M8
4377D2p1L2k1mK1j7L7k2J6%l9M0l2J6L1m8N5l7pL9n0N8l3j6L9m1L2j7PJ1l1K7
4409A7k6J5K5n4M3l0l0O7o7M9j5n1Q2n6RN6p4L4Oj7M4k8Pj7PjJ9L3n2J1mk9O4
4442C7n5L0L6o8P3n8j5N4o6P0Rn8L8o4J2M1j5K0k3j4k5L7K4m4N0o6J2P5o0M1m5
4473a7l7Q5k5K9Op2L5k5K5N6m9oj1PJ6%J5n6K4J3j2L3o2NK4k0P9n3l9K2m1O5J2
4506B6k1rm9K9L6J8j0m7J6j7M0L5o5K8l8MQ4o1L2j9o0Q6l2RJ6o6K6J8Qjl0j0q
4539c2M7j1Mjo3O2J5k9N4j00K3L4l0P8o0l4M3m3N9J3m6K0l7J5L4lKk8PnL3Ml7
$$ y = [2, -21, 12, 4, 33, 52, 11, 3, -32, -21, 18, 28, 56, 12, -26, -26, -54, 16, 13, 6, 49, -48, 5, -7, -53, 28, -33, -11, 48, -42, 12, -38, -65, 22, -28, 13, 29, -30, 0, -11, -9, 21, 12, -4, 24, 22, -4, 22, -4, -15, 53, -3, 47, 42, -57, 18, -26, -20, 76, -15, 19, 12, -58, 12, -29, -6, 42, -29, 3, -18, -22, -1, -18, 19, -3, 13, 13, -26, 14, -18, -2, 29, -19, 36, -1, -8, 31, -19, 39, 6, -10, 29, -12, 20, 3, 10, 21, -10, 17, -9, 6, 31, -23, 20, -10, -40, 27, -40, 9, -6, -57, 25, -31, -22, 34, -40, -6, 0, -17, 27, -1, 6, -11, -4, -5, 14, 47, -5, 6, 2, -27, 37, -18, 12, 48, -20, 53, -5, -20, 34, -32, 38, 47, -11, 27, -37, -25, 16, 1, 21, -2, -16, -41, -4, 20, -24, 26, -40, -28, 47, -13, 28, -17, -54, 31, 6, 35, 41, -31, 4, -21, 4, 60, 11, 5, -6, 1, 17, 17, 32, -24, 0, 13, 1, 34, -28, -23, 1, -19, 60, 7, -32, -10, -51, 14, 26, 5, -4, -53, -24, 12, 30, 20, -27, -11, -28, 12, 47, -18, 10, -28, -24, 60, -1, 31, 12, -48, 38, 6, 15, 31, -35, -9, 9, 17, 16, -14, -24, -32, 15, 4, 8, 7, -56, 6, 21, -8, 46, -54, -31, 3, -27, 51, -9, -43, 0, -43, 16, 29, -17, 3, -34, -19, 15, 12, 14, -14, -7, -12, 21, 25, -12]
4572a2L6m2J0N9p2M0k8k0O3l0%Om8M0j0%K4m4J0JJ6jk0K2m0L1J7l2N8o4J1L1m8
4605c6O8m0k0N9o0N0kl5M5l8MJ7j0J8j6QpkJ4k4K7l2j9M5m2M2om8M6k8LL1m5K6
4639gj0j6M9l0L2k8j5L0j2M0l6j1K9l8O6k6kj0m1N5Nj2K9p9K5K1nM0m6k6J4mL8
4672A9nk5j5k1O2k9N0m7m6O9l6M6Nq4M8j8K6N6n9Rk9KP5k9Ll7k2L4K2L0m2l2M
4705a6mO6j2m2Nn0O9J3j9Po7J0N2k2O0o3l1K2KN6l9j7%nM4Mj2k9l2O2QJ2Mq4M6
4740boK9L9p1Lk0K2O0l3j5k4j2M8j6K9m1l9K5RN0k4m1J1l4N5J7k5%l1K0K8j3J7
4773A5l7lL2pK9m1oJJ2L9j2j4j0k8N9qmJn5L9jMK3m4rJ4KK8k8jj1kK7j8J8j6j
4810a3J6l3L8j4jK2m7L6Nl3M4k4JJ3l0L6qKJ1k4J1NmJ4k9J0rPj%lj8J9oJPl0J9
$$ y = [-12, 24, -18, -8, 51, -21, 19, -9, -29, 34, 4, 4, 10, -38, 2, -8, -8, 16, -28, -18, -17, -1, -2, -22, 0, -40, -9, 8, -24, 34, -30, -19, 12, -36, 32, -8, -28, 31, -29, 21, 19, -16, 29, -9, -5, 12, 2, 20, 4, 12, 5, 3, 17, -7, 20, -12, -31, 14, -28, 14, 8, -40, 6, -22, -19, 12, -33, -7, -17, -33, 16, -14, 18, -10, -25, 5, -7, 33, -3, -14, 15, -23, 43, 17, 15, 5, -36, 19, 24, 12, 41, -38, -13, 8, 3, 43, -3, -29, -15, -19, 19, 14, -11, -26, -47, 15, -14, 36, -11, -57, 12, -24, 22, 27, -57, -9, -27, -1, 55, -4, 5, -24, -22, 53, 24, 27, -10, -32, 2, 24, 54, 12, -20, -16, -20, 46, 34, -8, -3, -53, 16, 29, 10, 17, -50, -40, 12, -10, 50, -13, -44, -22, -20, 36, -3, -20, -20, -25, 19, 23, 11, -18, -50, 12, 20, 32, 36, -48, -2, -8, 21, 60, -11, -8, -28, -6, 54, 21, 6, -18, -30, 18, 2, 31, -10, -49, -24, -15, 35, 11, -30, -19, -53, 2, 19, -6, -6, -37, -17, 11, -2, 15, -22, -25, 7, 0, 29, -12, -18, -17, -5, 34, 22, 8, -2, -30, 29, 21, 17, 18, -37, 2, 1, 5, 28, -16, -25, -11, -9, 19, -9, -10, -21, -23, 4, -14, 4, -12, -13, 3, -30, 8, -6, -7, 15, -32, 4, 9, -24, 20, -4, -3, 10, -20, 16, 8, 10, 21, -3, 8, 13, 9, 23, -6, 4, -5, 2, 1, 1, -2, -20, -1, -7, -6, 1, -29, -10]
4848a0QrL0l7nOjM3k9j1K0l1M9J5l2J3l7J5K0KJ3l7l0M5KRll3KMK8Lmk9rJ6J0
$$ y = [-10, -2, -11, 19, -18, -23, -17, -18, 25, -4, -15, 5, -26, 23, 38, 6, 19, -18, -3, 17, 19, 32, -5, -35, 10, 12, 21, 18, -15, -13, -9, 19, 22, 18, -11, -20, -4, 6]
$$ [...]
8191B
##END NTUPLES=NMR FID
##END=
