##TITLE=1H_AM_NVDICYCL_802
 CDCl3
 8 sc, 
 8.04.2022
##JCAMPDX= 6.0         $$ Bruker NMR JCAMP-DX V2.0
##DATA TYPE= NMR FID
##DATA CLASS= NTUPLES
##ORIGIN= UXNMR, Bruker Analytische Messtechnik GmbH
##OWNER= root
$$ XWIN-NMR		Version 3.5
$$ Fri Apr  8 11:05:45 2022 Russian Standard Time (UT+4h)  she@DPX200
##.OBSERVE FREQUENCY= 200.13135
##.OBSERVE NUCLEUS= ^1H
##.DELAY= (6, 6)
##.ACQUISITION MODE= SIMULTANEOUS
##.ACQUISITION SCHEME= undefined
##.AVERAGES= 8
##.DIGITISER RES= 18
##SPECTROMETER/DATA SYSTEM= spect
##.PULSE SEQUENCE= zg30
##.SOLVENT NAME= CDCl3
##.SHIFT REFERENCE= (INTERNAL, CDCl3, 0, 15.7039)
##AUDIT TRAIL= $$ (NUMBER, WHEN, WHO, WHERE, WHAT)
$$ ##TITLE= Audit trail, XWIN-NMR		Version 3.5
$$ ##JCAMPDX= 5.01
$$ ##ORIGIN= Bruker BioSpin GmbH
$$ ##OWNER= she
$$ F:/spectra/data/she/nmr/H-F/1/audita.txt
$$ ##AUDIT TRAIL=  $$ (NUMBER, WHEN, WHO, WHERE, WHAT)
(   1,<2022-04-08 11:03:56.90 +0400>,<she>,<DPX200>,
      <created by zg, POWCHK disabled, PULCHK disabled
       configuration hash MD5:
       00 E9 B6 7A A2 85 ED C7 34 08 36 98 17 FE 4E 26
       data hash MD5: 16K
       E5 BF AF 32 A7 60 55 AC 14 11 BC B4 99 B8 A1 A0>)
$$ ##END=
$$ 
$$ hash MD5
$$ 8F 2B 38 12 50 37 AE 31 1F 57 A8 59 89 62 98 12
##$RELAX= 
##$RELAX= 
##$RELAX= 
##$RELAX= 
##$RELAX= 
##$RELAX= 
$$ Bruker specific parameters
$$ --------------------------
##$DU= <F:/spectra>
##$EXPNO= 1
##$NAME= <H-F>
##$PROCNO= 1
##$TYPE= <nmr>
##$USER= <she>
##$AMP= (0..31)
100 100 100 100 100 100 100 100 100 100 100 100 100 100 100 100 100 100 
100 100 100 100 100 100 100 100 100 100 100 100 100 100 
##$AQSEQ= 0
##$AQ_mod= 1
##$AUNM= <au_zg>
##$AUTOPOS= <>
##$BF1= 200.13
##$BF2= 200.13
##$BF3= 200.13
##$BF4= 200.13
##$BF5= 200.13
##$BF6= 200.13
##$BF7= 200.13
##$BF8= 200.13
##$BYTORDA= 1
##$CFDGTYP= 0
##$CFRGTYP= 5
##$CHEMSTR= <none>
##$CNST= (0..31)
1 1 145 1 1 1 1 1 1 1 1 1 1 1 1 1 1 1 1 1 1 1 1 1 1 1 1 1 1 1 1 1 
##$CPDPRG= <>
##$CPDPRG1= <>
##$CPDPRG2= <>
##$CPDPRG3= <>
##$CPDPRG4= <mlev>
##$CPDPRG5= <mlev>
##$CPDPRG6= <mlev>
##$CPDPRG7= <mlev>
##$CPDPRG8= <mlev>
##$CPDPRGB= <>
##$CPDPRGT= <>
##$D= (0..31)
0 1.2 0 0 0 0 0 0 0 0.06 0 0.03 0 0 0 0 0.0002 0 0 0 0 0 0 0 0 0 0 0 0 
0 0 0 
##$DATE= 1649401436
##$DBL= (0..7)
120 120 120 120 120 120 120 120 
##$DBP= (0..7)
150 150 150 150 150 150 150 150 
##$DBP07= 0
##$DBPNAM0= <>
##$DBPNAM1= <>
##$DBPNAM2= <>
##$DBPNAM3= <>
##$DBPNAM4= <>
##$DBPNAM5= <>
##$DBPNAM6= <>
##$DBPNAM7= <>
##$DBPOAL= (0..7)
0.5 0.5 0.5 0.5 0.5 0.5 0.5 0.5 
##$DBPOFFS= (0..7)
0 0 0 0 0 0 0 0 
##$DE= 6
##$DECBNUC= <off>
##$DECIM= 32
##$DECNUC= <off>
##$DECSTAT= 4
##$DIGMOD= 1
##$DIGTYP= 9
##$DL= (0..7)
0 120 120 120 120 120 120 120 
##$DP= (0..7)
150 150 150 150 150 150 150 150 
##$DP07= 0
##$DPNAME0= <>
##$DPNAME1= <>
##$DPNAME2= <>
##$DPNAME3= <>
##$DPNAME4= <>
##$DPNAME5= <>
##$DPNAME6= <>
##$DPNAME7= <>
##$DPOAL= (0..7)
0.5 0.5 0.5 0.5 0.5 0.5 0.5 0.5 
##$DPOFFS= (0..7)
0 0 0 0 0 0 0 0 
##$DQDMODE= 0
##$DR= 18
##$DS= 0
##$DSLIST= <SSSSSSSSSSSSSSS>
$$ [...]
##$SUBNAM2= <"">
##$SUBNAM3= <"">
##$SUBNAM4= <"">
##$SUBNAM5= <"">
##$SUBNAM6= <"">
##$SUBNAM7= <"">
##$SUBNAM8= <"">
##$SUBNAM9= <"">
##$SW= 18.05172834244
##$SWIBOX= (0..15)
0 0 2 0 0 0 0 0 0 0 0 0 0 0 0 0 
##$SW_h= 3612.71676300578
##$TD= 16384
##$TD0= 1
##$TE= 0
##$TE2= 300
##$TE3= 300
##$TEG= 300
##$TL= (0..7)
0 120 120 120 120 120 120 120 
##$TP= (0..7)
150 150 150 150 150 150 150 150 
##$TP07= 0
##$TPNAME0= <>
##$TPNAME1= <>
##$TPNAME2= <>
##$TPNAME3= <>
##$TPNAME4= <>
##$TPNAME5= <>
##$TPNAME6= <>
##$TPNAME7= <>
##$TPOAL= (0..7)
0.5 0.5 0.5 0.5 0.5 0.5 0.5 0.5 
##$TPOFFS= (0..7)
0 0 0 0 0 0 0 0 
##$TUNHIN= 0
##$TUNHOUT= 0
##$TUNXOUT= 0
##$USERA1= <user>
##$USERA2= <user>
##$USERA3= <user>
##$USERA4= <user>
##$USERA5= <user>
##$V9= 5
##$VALIST= <valist>
##$VCLIST= <CCCCCCCCCCCCCCC>
##$VD= 0
##$VDLIST= <DDDDDDDDDDDDDDD>
##$VPLIST= <PPPPPPPPPPPPPPP>
##$VTLIST= <TTTTTTTTTTTTTTT>
##$WBST= 1024
##$WBSW= 4
##$XGAIN= (0..3)
0 0 0 0 
##$XL= 0
##$YL= 0
##$YMAX_a= 427250
##$YMIN_a= -264128
##$ZGOPTNS= <>
##$ZL1= 120
##$ZL2= 120
##$ZL3= 120
##$ZL4= 120
##$ABSF1= 10
##$ABSF2= 0
##$ABSG= 5
##$ABSL= 3
##$ALPHA= 0
##$AQORDER= 0
##$ASSFAC= 0
##$ASSFACI= 0
##$ASSFACX= 0
##$ASSWID= 0
##$AUNMP= <proc_1d>
##$AZFE= 0.1
##$AZFW= 0.1
##$BCFW= 1
##$BC_mod= 2
##$BYTORDP= 1
##$COROFFS= 0
##$CY= 11.3945322036743
##$DATMOD= 1
##$DC= 2
##$DFILT= <>
##$DTYPP= 0
##$F1P= 2.36226072786647
##$F2P= -0.459571619588291
##$FCOR= 0.5
##$FTSIZE= 0
##$FT_mod= 4
##$GAMMA= 1
##$GB= 0.15
##$INTBC= 1
##$INTSCL= 1
##$ISEN= 128
##$LB= 0.24
##$LEV0= 0
##$LPBIN= 0
##$MAXI= 10000
##$MC2= 0
##$MEAN= 0
##$ME_mod= 0
##$MI= 1.114404
##$NCOEF= 0
##$NC_proc= 0
##$NLEV= 6
##$NOISF1= 3.799351
##$NOISF2= 2.8
##$NSP= 1
##$NTH_PI= 0
##$NZP= 0
##$OFFSET= 15.70392
##$PC= 1
##$PHC0= -18549.45
##$PHC1= 13.60078
##$PH_mod= 1
##$PKNL= yes
##$PPARMOD= 0
##$PSCAL= 0
##$PSIGN= 0
##$REVERSE= no
##$SF= 200.130013532006
##$SI= 16384
##$SIGF1= 3
##$SIGF2= 2
##$SINO= 400
##$SIOLD= 16384
##$SREGLST= <1H.CDCl3>
##$SSB= 0
##$STSI= 0
##$STSR= 0
##$SW_p= 3612.71676300578
##$SYMM= 0
##$S_DEV= 0
##$TDeff= 0
##$TDoff= 0
##$TI= <>
##$TILT= no
##$TM1= 0
##$TM2= 0
##$TOPLEV= 0
##$USERP1= <user>
##$USERP2= <user>
##$USERP3= <user>
##$USERP4= <user>
##$USERP5= <user>
##$WDW= 1
##$XDIM= 8192
##$YMAX_p= 0
##$YMIN_p= 0
$$ End of Bruker specific parameters
$$ ---------------------------------
##NTUPLES= NMR FID
##VAR_NAME=  TIME,          FID/REAL,        FID/IMAG
##SYMBOL=    X,             R,               I
##VAR_TYPE=  INDEPENDENT,   DEPENDENT,       DEPENDENT
##VAR_FORM=  AFFN,          ASDF,            ASDF
##VAR_DIM=   8192,          8192,            8192
##UNITS=     SECONDS,       ARBITRARY UNITS, ARBITRARY UNITS
##FACTOR=    0.0002768,     1,               1
##FIRST=     0,             0,               0
##LAST=      2.2672688,     0,               0
##MIN=       0,             -264128,         0
##MAX=       2.2672688,     427250,          0
$$ Real data points
##PAGE= N=1
##DATA TABLE= (X++(R..R)), XYDATA
$$ [...]
931f12j312J033J916p94j282J024J553o16j900o27J053O11j032o58P27Q20P35
948F39J075l50r40J274J263j656j646N01m97j335O23N9j523N89K208k13o12J513
966I72L80j156Q06J004j894j451J102M38r81QK12p2J225J202j174j028J449O07
984A649j769j024M86j80p35l4O40N44J89J03P66J374J94j181n56O86L81j202j986
1003a655n73J750Q81j941r97K153J831o85j090L89P37L56o90j661j5J755l35k194
1021a984R56K897n00k037J377J971p80j595m06j09K00j66j831j103J858J485j317
1038a084p86J885J513l99l58J28L8j66j26o99o20J62L54r5j38N99M99k59r5O62
1058A015j38j283k64O21r07j104J002O67j093L51K159K83q89O30P04j99k10p48
$$ plain form
931 -612 -1924 -891 1025 231 -1051 -27 1526 910 -990 -1617 -564 47 -985 -1643 -916 -96 639
948 639 1714 1364 424 1698 2961 1305 -341 160 -337 -1672 -1049 -990 -2513 -1924 284 71 -541 972
966 972 1352 196 1002 2006 112 -1339 -237 201 -780 -772 -560 -632 593 1795 621 -407 1042 1649
984 1649 -120 -1144 -658 -838 -1573 -1607 -967 -423 -234 -131 635 2009 2203 1022 466 1152 1533 331 -1655
1003 -1655 -2228 -478 403 -1538 -2535 -382 1449 764 -326 63 800 1156 466 -1195 -1210 545 210 -1984
1021 -1984 -1028 1869 1369 -668 709 2680 1900 305 -101 -210 -10 -176 -2007 -3110 -1252 233 -1084
1038 -1084 -1870 15 1528 1129 771 899 937 771 645 -54 -674 -512 -158 -253 -391 208 707 448 353 1015
1058 1015 877 -406 -670 -49 -956 -2060 -1058 -391 -1484 -1133 1026 1309 420 1050 1754 1555 1345 597
1076E97j436L72R77j552j531J486J623j059m42J441M58n44M19p6r53J5N00p60
1094d65q06O85P50r7j41M92Q67K56q00m55N26k75j320o86K92M4k05o9K25J214
1114C2O86n04L38J557l13j722N98J117j886j526J564O85j951k15J917L18r57K68
1132FN73n9q2o06q42L93M30j098m13J437M59o86R51J328o79n74J132K55j619r00
1152e94P64L7j436p76J045R82p31n30J435J178r82o14R21L09r90n38M5L5J9p9
1172e00j43N92O67j60J37P01o26q71R19L02k076r05J868M41j778k40J908P65p08
1191B93j53P04N66l95r93l22N04l67j230o3J073M2m50M74Q11J61J06K74j52n33
1211C50j91L13l65j222l16J194M96j092j08J434N68m98j65N2J3m6n00p73J33L06
$$ plain form
1076 597 -839 -467 510 -1042 -2573 -1087 536 -523 -965 476 934 390 809 733 -220 -205 295 -465
1094 -465 -1271 -586 164 67 -74 418 1285 1541 741 286 812 537 -783 -1469 -1177 -1133 -1338 -1407 -1182 32
1114 32 718 214 552 2109 1796 74 672 1789 -97 -1623 -59 626 -1325 -1540 377 695 -262 6
1132 6 579 520 438 -168 -1010 -617 -187 -1285 -1698 -261 198 -488 463 1791 1112 538 1670 1925 306 -594
1152 -594 170 207 -1229 -2005 -960 22 -709 -1239 196 1374 392 -222 699 1008 18 -520 -475 -440 -421 -500
1172 -500 -643 -51 616 456 593 1294 668 -203 716 1018 -1058 -1963 -95 346 -1432 -1672 236 1001 293
1191 293 140 844 1410 1015 22 -300 204 -163 -1393 -1456 -383 -341 -791 -317 494 655 761 1035 883 350
1211 350 159 472 107 -1115 -1431 -237 259 -833 -941 493 1061 563 398 450 463 417 -83 -856 -723 -417
1231d17n87j03J010L31n47O19J020k86m16K77k92p36Q4m1r77l11O26K70k18K30
1251d64L49L56N56J74m24p8K51Pl45o04k69L89J70o32j80P11J12n45K72M38l14
1272g0l00J12R6M3J26n63P4J002J42r70L95J194n06q31P79M00j160l47Q29j24
1292C21j086l56O04K97n33o92L96J049j59p77O32J148l56m56Q65O70n91n27M68
1311I17M25n30j132k44R11k57j712n4J675l65j644J004J797q84r96J340R63r60
1329B54m10N96L46m5n02l48O56N33j071n06J250J04j714n2J523m86j866K54J610
1348A26l88j280K96J513L53o51l8J064N95o99l90N67L17j116p57O15K82j142q04
1367a537Q50Q31r91j022J234J095r21q03J295P78p27p2J039N9m43L27J85l03k64
$$ plain form
1231 -417 -1004 -1107 -97 234 -313 306 1326 1040 624 901 609 -127 -43 -84 -1061 -1372 -746 -476 -694 -464
1251 -464 -115 241 797 971 547 469 720 727 382 -222 -491 -102 68 -564 -744 -33 79 -466 -194 244 -70
1272 -70 -370 -258 -162 -119 7 -556 -482 520 662 -308 87 1281 775 -56 723 1123 -37 -384 445 321
1292 321 -765 -1121 -517 -220 -753 -1445 -1049 0 -159 -936 -304 844 488 32 897 1567 976 449 917
1311 917 1342 812 -320 -564 347 90 -1622 -1676 -1 -366 -2010 -1006 791 -93 -1089 251 1214 254
1329 254 -156 440 786 741 239 -109 547 1080 9 -497 753 857 -857 -909 614 128 -1738 -1484 126
1348 126 -262 -1542 -1246 267 620 -31 -69 995 1590 891 501 1068 1385 269 -488 127 409 -733 -1537
1367 -1537 -687 144 -847 -1869 -635 460 -461 -1264 31 809 82 10 1049 1108 665 992 1177 874 610
1386F10l22l98K98m38j405K96J492r50j626J710J858j637r09K201P94j728j67
1403c21J273j87q44j67L15O17J00j183K9K311J4k899K00K791j068l360L99K131
1421A51j078j838P37J345K19R0M79R40R95l3n89M54K18j407j057M82m08j715j20
1440b135J376k6j016J036J771j57p25R07Q89j295j257Q14M53j877j119J546J418
1457F03r40j048J547K348j24k162j79K386j8l701j425K641J52l296k97L160O33
1474B80j823J025K615K18j175J87Q12n4j464j504J16R29j184j754J100J968q03
1491e11p70J754R77j118Q1R80j014j395Q18N18j477o00J372R22m01k45N83J310
1509A784K19j570o46J520j8k732p45K189j2k393K28K702K38j667M26J860M17j512
$$ plain form
1386 610 288 -110 188 -250 -1655 -1359 133 -817 -2443 -733 1125 -512 -1421 780 1574 -154 -321
1403 -321 952 765 -79 -246 69 686 786 -397 -368 1943 1957 -942 -742 2049 981 -2379 -1980 151
1421 151 -927 -2765 -2028 -683 -464 -374 105 1045 2040 2007 1418 1872 2090 683 -374 108 -300 -2015 -2135
1440 -2135 -759 -785 -1801 -765 1006 849 124 1031 1920 625 -632 182 635 -1242 -2361 -815 603
1457 603 -337 -1385 162 2510 2386 224 45 2431 2413 -1288 -2713 -72 80 -3216 -3513 -353 280
1474 280 -1543 -518 2097 2315 1140 1327 2139 2085 621 -883 -767 162 -1022 -2776 -1676 292 -511
1491 -511 -1281 473 1450 332 413 1393 379 -1016 -198 320 -1157 -1757 -385 537 136 -109 474 1784
1509 1784 2003 433 -213 1307 1289 -1443 -2188 1 -11 -2404 -2176 526 764 -903 -477 1383 1800 288
1527B88q86J102P75j310j533R29J483o06j231Q22J386l03r28J09L99k31p99l30
1545h64J84j27k41L85M84R0K15P71J96m35R8K92n95q12l5R1n63l95N04N77o0L0
1567b10O24O57l4n50j52L22j35r85q56M79Q00o29o95R82J392k47n66O82N44o52
1587G71n24j19m90m24l2l84k84P61O27m10M01J290J8n67L23K67p27l60j67o52
1607f82l09N40r3n90P05Q48p3k5M96j92j90J54n72o90K72J35p79LR68lk14O48
1629C57N05k63K25K13p74k55N57o45j086N47O47p97o4J028J6m84P94M71r32k29
1649a69P42k84q81K19K90m54R6N56k18j13P37J47p00K43N32o65p35P17K16r10
1669f34p5R42k1n68L98M50l34j67K81k29k47K16k45l16N18J48n62K39R17l41o93
$$ plain form
1527 288 -598 504 1279 -31 -1564 -635 848 242 -989 -167 1219 916 -12 97 496 265 -534 -864
1545 -864 -680 -807 -1048 -663 -179 -89 126 897 1093 658 756 1048 453 -359 -394 -303 -866 -1261 -757 -180 -240 -210
1567 -210 414 1071 1037 487 335 657 522 -463 -1319 -840 -40 -669 -1364 -382 1010 763 197 879 1423 771
1587 771 247 128 -362 -786 -818 -1202 -1486 -725 -98 -508 -107 1183 1201 634 957 1224 497 137 -30 -682
1607 -682 -991 -451 -544 -1134 -429 419 346 321 817 625 435 589 17 -673 -401 -266 -1045 -1042 -74 -77 -291 357
1629 357 862 599 824 1037 263 8 565 -80 -1166 -619 28 -769 -833 195 211 -273 521 992 60 -169
1649 -169 573 289 -592 -373 -83 -537 -441 115 -103 -216 521 668 -32 211 743 78 -657 60 276 -634
1669 -634 -709 233 212 -356 42 492 158 -9 272 43 -204 12 -233 -549 -31 117 -445 -206 711 370 -323
1690c23N70K29q11j2M77m94k18O26n9k23P65j9o87Q28P89j517q67J574kk133J81
1711a326J627o57q38J141O00l10L99J62n53N73L30j701o76J515j65k042M44J835
1729C58l18o26J061Q18n00O8L94m26p86l48k63L4n79p43N67J274k02o54J370J528
1749B027p89r67Q55N21j275j294j26M59k7r88n28J463J579n39p19J411J312q94
1767A481j016N09j80j605k45P22q25j356J081J983o66j025J723J789j114j111
1783A45R50J83j105q25l71j73P50j85j685J104L219q23k778K042L004k191k381
1800a120J794M59k364K30J195j749n86K459L35j747R24J539o60j70N37j122l71
1817d17J333q48j959J321J732j863j042K501R13j843m47J335L26p56p05n20N14
$$ plain form
1690 -323 247 476 -335 -347 130 -364 -582 44 -15 -238 527 508 -179 649 1438 -79 -946 628 626 -1507 -1326
1711 -1326 301 -356 -1194 -53 547 237 636 798 245 818 1148 -553 -1229 286 121 -1921 -1477 358
1729 358 40 -586 475 1293 793 861 1255 829 43 -305 -568 -534 -1113 -1856 -1289 -15 -217 -871 499 2027
1749 2027 1238 271 1126 1647 372 -922 -1048 -589 -616 -1604 -2132 -669 910 371 -348 1063 2375 1481
1767 1481 465 974 794 -811 -1056 -334 -1159 -2515 -1434 549 -117 -1142 581 2370 1256 145
1783 145 1095 1278 173 -652 -1023 -1196 -446 -631 -2316 -1212 2007 1184 -1594 448 3452 1261 -1120
1800 -1120 674 1133 -1231 -1001 194 -1555 -2141 318 653 -1094 -170 1369 709 539 1076 -46 -417
1817 -417 916 68 -1891 -570 1162 -701 -1743 758 1671 -172 -619 716 1042 286 -419 -939 -425
1834d25Q49o92q74Q93R11l17l4L68n45l03R08l11j532j89J172J51q81L1R44P03
1854H27j88k32K54L99k71q80m61L77J1r23p02J040J383o07r04J409J530q73q87
1873C02O45k27j044P0n4j548j00J536p7r02J263J296n09L52J011r18r61J046l02
1892H79k246%J347j182j188J667J382j047j3J705M01o89j77j45l33k85n58q62
1910a344L3M00j02N8O45N44J63M97L78m2m76k47J34j89j183p06Q02M15j030p8
1930a328J581M65j011M15J304l39j093K42M19o68o92J81K11k02j2J61K05L16J40
1949B95j09J22K24j61m13J22J50k53n22L13P16n12o47P27P10q57o72R39N40j200
1969d88k67J103L9j020M10J084p98o91J059K99j307mR55p19o08J122m1j039J002
$$ plain form
1834 -425 424 -268 -1142 -249 662 345 311 679 134 -169 739 428 -1104 -1293 -121 30 -851 -820 124 827
1854 827 639 407 661 1060 789 -91 -552 -175 -164 -1087 -1789 -749 634 27 -877 532 2062 1189 302
1873 302 947 720 -324 -254 -308 -1856 -1956 -420 -497 -1399 -136 1160 651 1003 2014 1096 135 1181 879
1892 879 -1367 -1367 -20 -1202 -2390 -723 659 -388 -401 1304 1705 1016 839 694 361 76 -482 -1344
1910 -1344 -1311 -911 -1013 -955 -310 234 397 894 1272 1230 754 507 641 452 -731 -1437 -635 -220 -1250 -1328
1930 -1328 253 718 -293 122 1426 1087 -6 236 655 -13 -705 -524 -313 -515 -527 -366 -161 155 295
1949 295 186 308 532 371 -42 80 230 -23 -545 -232 484 -28 -675 52 762 -95 -767 172 712 -488
1969 -488 -755 348 387 -633 -223 861 63 -628 431 730 -577 -581 374 -345 -953 169 128 -911 91
1988I1J241j247m94J855k05j972P26J195j876j026J970p0k010J023J833j301n01
2005g68K081p8j814J046J166j775q83J311m01j234R20M19j123O91J658r12o38
2022c34J459J25j449M40P49j521o93J311k10j202N67R16l93J78P63m13j76Q53
2040I70k32q95K58K17j119L6J076o93r75J227J125j059m08J280J6q61K48L55q67
2059c01k70P27k50n61M30K75n96N21R00q98p38J321M57j551k22J280m38r95R40
2078C1O68j278Q0J342k92r33N13K82n94K99J83r80J28J204m50r81J024N18j154
2097c90J06J169o86j043P17L69o80J15K11n28O17Q63r71l97J383R1j293M78P60
2116H91j222m70J291l17j365O88J014o36j93Q07j94m10P97q6j166M07P87j098
$$ plain form
1988 91 1332 85 -409 1446 1241 -731 -5 1190 -686 -1712 258 188 -1822 -799 1034 -267 -768
2005 -768 1313 1235 -579 467 1633 -142 -1025 286 -115 -1349 -429 -10 -1133 -442 1216 304 -334
2022 -334 1125 1250 -199 241 990 -531 -1224 87 -123 -1325 -758 158 -235 -57 706 293 117 970
2040 970 738 -157 101 318 -801 -765 311 -382 -1357 -130 995 -64 -472 808 824 -37 211 566 -301
2059 -301 -571 156 -94 -655 -225 50 -546 -25 875 -23 -761 560 1017 -534 -756 524 86 -909 31
2078 31 699 -579 -499 843 551 -382 131 413 -181 118 301 -679 -551 653 203 -778 246 764 -390
2097 -390 -284 885 199 -844 -127 242 -438 -323 -112 -640 -23 840 -131 -528 855 946 -347 131 891
2116 891 -331 -801 490 173 -1192 -504 510 -126 -319 488 294 -116 681 595 -571 -164 623 -475
2134d75o29J366j8j380O48J578p47j001J059P81j020m30P07l42o26L76J91o78
2152f40J40O46k52l4P09k13o12O50O39j218o28J198J8j311K06J054m40o24P72
2171F0N75o16j11M61p3j31k0l64n9M83j61o97M71N71m84j39Q54j52o80L31N44
2192F63o99n02M70O6l00Q2N5j16L69K15m68J42N51l46n24N97K52r68n0R37k24
2213B02q70O17N95o24j59P87j91o45K73K36l71j63K58j94k2L93j07l79M90M33
2233E59n98j53O81j74o82K81N21n92m47P84J46o50P3O85r1m24J36K00j75j24j11
2254a55j11J85Q5l13J08M67j15l60K95M37m80k54M04J47o20j90M16J83n06p1O28
2275A80J18l49j6M05J49l41k28P8K18k21m39K22L91j24m27M13M10l23l69M49J69
$$ plain form
2134 -475 -1104 262 244 -1136 -488 1090 343 -658 401 1182 162 -268 439 97 -529 -153 38 -640
2152 -640 -500 146 -106 -140 569 356 -256 394 1033 -185 -813 385 403 -908 -702 352 -88 -712 60
2171 60 635 19 -92 369 296 165 145 -219 -278 205 44 -653 -182 389 -95 -234 620 468 -212 119 663
2192 663 -36 -538 -68 -2 -302 -220 -165 -281 88 303 -165 -23 528 182 -342 255 507 -461 -511 426 202
2213 202 -668 -51 544 -80 -239 548 357 -288 -15 221 -150 -313 -55 -249 -271 122 15 -364 126 559
2233 559 -39 -192 489 315 -367 -86 435 -157 -604 180 326 -324 -251 434 343 -81 55 255 80 -44 -155
2254 -155 -266 -81 4 -309 -201 266 151 -209 86 523 43 -211 193 340 -280 -470 -54 129 -377 -448 180
2275 180 298 -51 -67 338 487 146 -82 -4 214 -7 -446 -224 167 43 -384 29 439 116 -253 196 365
2296C65m61k83M35J1m19j33M30J06j97P1J87L64j85k55J68K03k00n00K21K97m47
2317b22k43M24K41l49n3L79J32k94m0J56K9k21k73J41K16j03k97L43L77j85k97
2338a39L59L04l63k17J85p6j79m5j04J47N5j19j1K97L3k12J17L36k95l28L66J90
2360C01n30p6L27o3j00J98n7n2L01l1m03J86L46m47k38M87n7m61K45L54l66p1
2382b07O06j78l42L44J37m71L8J92l13j16M32k15l10L91L00m57p6N43j17l22J77
2403C6J43l96P9L67l05o5L89M5l14J68J95k33j19K50k37l78L66R0l86r7M41qk03
2426a72J47K55j83K6J06j65rJ60j05k49K18J68l51j2K60J0j66J85P6k38L2J38
2448A31k83j07K65j0k26Q3J86m1J00O3j49N3K83k66k93K38K38l14k68K50J72k51
$$ plain form
2296 365 -96 -379 56 67 -352 -485 -55 51 -146 -75 112 476 291 36 204 407 207 -293 -72 225 -222
2317 -222 -465 -41 200 -149 -202 177 309 15 -25 131 160 -61 -334 -193 23 -80 -377 -34 343 158 -139
2338 -139 220 524 161 -56 129 53 -126 -171 -275 -128 -73 -192 -203 94 127 -85 32 368 73 -255 111 301
2360 301 -229 -305 22 -41 -141 57 0 -52 249 218 -185 1 347 -100 -338 149 92 -369 -124 230 -136 -207
2382 -207 399 221 -121 223 360 -111 -73 119 -194 -310 122 -93 -403 -12 288 -169 -245 298 181 -141 36
2403 36 179 -217 -138 229 -76 -141 248 293 -21 147 342 109 -10 240 3 -375 -9 81 -305 -402 39 31 -172
2426 -172 -25 230 47 73 179 14 5 165 60 -189 29 197 -154 -166 94 104 -62 123 199 -39 -7 131
2448 131 -152 -259 6 -4 -230 -147 39 -2 98 161 12 65 348 82 -211 27 265 -49 -317 -67 105 -146
2470a46J13J01j57Q7K55j70k47J44J34r0r0rO9J7J02j75p9K15J56k00k27K31K07
2493B41k59l26K75J96k42o9K24Q9j65J29J24k48M0K80j45k64J40J21j42J1l8j31
2515a59J24K78l20k05L83J01l94o3L44j61j49K40K9j19R4O0r3J81O4l08J30K69
2537C26l34k50M49j8n03K63L40l61k01M93M2m82K04K38l21n0L02j88r7K22j06
2558c2j62L83j9m36J66N82l19n46L08L38j85k33O1J04K7lk3nk4%J15P8k74k3L18
2583A96j01k72J9J98L8j91j6K02J47p5m11J07N94k16o54K22N35j57m06J73J57
2604H9j8R8k4l21O9K56l5k60l3L1K30Q5k75l15M78L81n07k75M59K15l88r1J78
2627B7J31j14j98n2L00J96l98k36M54J67k75p2Q5r3J08J57j97l29K85L15k37k68
$$ plain form
2470 -146 -33 68 -89 -2 253 83 -164 -20 114 24 -66 -75 -6 11 113 -62 -141 74 230 30 -197 34 241
2493 241 -18 -344 -69 127 -115 -184 40 129 -36 93 217 -31 9 289 144 -120 20 141 -1 10 -28 -159
2515 -159 -35 243 -77 -282 101 202 -192 -255 89 -72 -221 19 48 -71 23 83 -10 171 235 -73 57 326
2537 326 -8 -258 191 173 -330 -67 273 -88 -289 204 246 -236 -32 206 -115 -165 137 -51 -148 74 -32
2558 -32 -194 189 170 -266 -100 482 163 -383 -75 263 78 -155 -94 10 37 34 11 6 -18 -18 97 175 -99 -122 196
2583 196 95 -177 -158 40 78 -113 -129 73 220 145 -266 -159 435 219 -435 -213 322 165 -241 -68 89
2604 89 71 169 145 -176 -107 149 114 -146 -179 -148 82 167 -108 -423 55 436 -71 -346 113 328 -60 -151 27
2627 27 158 44 -154 -206 94 290 -108 -344 110 277 2 -70 15 -78 30 187 -10 -339 -54 261 24 -244
2649b44L5L34J46k25l07K10L48k36l70J96K79q2k16O0K06O3k03j13J60J97j12
2670A26k35K2J95l9p8r2k1R3J66j15k76J00L53N6l54j28K04J93j29k65Q5K70L3
2693A64k59N1J32K2JK0k12J03K09j88k87J61K49k75q8J64N%J51j30l23M42J87
2716B99m30j96M07J62l55l5J98m1l3J81j44j69J45K72k40k13P5K30o4j77j2J80
2738D0pj8p2O7O1o1J7j36N7K25j21k79J51K84j74j99J67Q1j40O1J94k51o2K69
2762A54N3l62k2L81r8j57o3J48KQ0j10j31J43J26j13j82O0J66j23j28R5J09l3
2785ej16Q1J16m3o7K01l8k40N9K82j82j87J24J91j67j56J72M1l4Lp7j5R7Jk69
2810b28J17K68k23k12L47R0k55J7K43m9j94J26M2l1j03KJ27k9j9j36J52N6j05
$$ plain form
2649 -244 -209 125 271 46 -261 -51 297 61 -309 -113 166 84 -132 -72 134 197 -6 -119 41 238 126
2670 126 -109 -87 108 69 -9 -101 -122 -29 137 22 -254 -154 199 255 -99 -227 -23 170 41 -224 -139 131 164
2693 164 -95 -44 88 110 111 131 -81 22 231 43 -244 -83 166 -109 -197 -33 -28 -28 123 -7 -330 112 299
2716 299 -131 -327 80 242 -113 -148 50 9 -24 157 13 -156 -11 261 21 -192 -117 113 49 -128 -140 40
2738 40 33 15 -57 10 71 10 27 -109 -52 173 52 -227 -76 208 34 -165 2 83 -57 4 198 -53 -115 154
2762 154 207 -155 -177 204 106 -51 -114 34 36 116 6 -125 18 144 31 -151 -91 75 -48 -176 -81 28 -5
2785 -5 -121 -40 76 33 -34 167 129 -111 -52 230 48 -139 -15 176 9 -147 25 66 32 35 -42 -57 40 41 -228
2810 -228 -111 157 -66 -278 69 159 -96 -79 164 115 -79 47 89 58 -45 -43 84 55 36 -100 52 108 3
2833Cr6J68L9o7o8J6P0r2rr7K58ol36J23L34k19k14K57J88k99r2L02q0k10J52
2858B5O4j32j5R4r2Q6J23k28n6K89pl96K30K18l04q5K76k1j82pK23O6k14oK8P0
2884D7l0j17L2K06p2k07J39J83j37j31K11K6k28QQ2J15j27j55J40Q2j49l7J22
2907CJ10j95j72L84N0k54j47L20O8k30j21J63K02m6j73q5L31n8k86Q2K29k00j52
2930a77K03J51k81r7K47N9j63q7J42K9n1r9J04J51j60j94J87K00k32j67J80K48
2952A93j23j47P1J20Pj87l6J83K0k86Q7L17k13k89L07L06l69j72L24M2k55l8J38
2975@oo1m7M4J80m3j55J4K92j8k91M3K40k8k72l1J79J7k11Q0J42K9j86J08K07
3000B26j50k06J60J59k43j71J79R0j06J6JP2O9p5k2J21R1j94j51K22K0k21p6K74
$$ plain form
2833 3 -93 75 114 47 -21 -5 65 -27 -36 -133 125 119 -217 -94 240 21 -193 64 252 -47 -139 163 83 -127 25
2858 25 89 -43 -58 36 -56 30 153 -75 -131 158 151 -245 -15 203 -101 -186 90 69 -113 -120 103 169 -45 -51 -23 47
2884 47 17 -100 -68 138 66 -141 -2 181 44 -87 124 150 -78 -70 12 127 0 -155 -15 67 -82 -119 3
2907 3 113 -82 -254 130 180 -74 -221 99 167 -63 -184 -21 181 135 -38 -123 208 150 -136 -54 175 -25 -177
2930 -177 26 177 -104 -201 46 105 -58 -145 -3 26 -25 -124 -20 131 -29 -223 -36 164 -68 -235 -55 193
2952 193 70 -77 -6 114 121 -66 -102 81 101 -185 -98 219 6 -283 24 330 -39 -211 113 155 -100 -138 0
2975 0 -6 -67 -114 -70 110 67 -88 -74 218 200 -91 -48 192 164 -108 -139 40 57 -154 -74 68 97 -89 19 226
3000 226 76 -130 30 189 -54 -225 -46 44 -62 -46 -45 27 96 21 -1 120 211 17 -134 88 108 -113 -189 85
3024H5Pk37N8J64m6n3R4K9j39J0j2J3j1p5k9J47K4p8LJ58J8n0L1nq5Kq0L1M2p2
3054e6q2J28Q2j37k5K97n7j88Q0R0j52o2R2o9q8O4Pk1R1N6j06N9J17o4p1J85q7
3081H3j03k4Qk3k2K4M7P8o6J8P2O2m1r0P8n4j51O0O7j56l1Q8K7l3J27K2k0P2J0
3110A29o0n3Q3j26n1J05q3q7R8J67j19J5R4k3m3J14m1j74J13j09p6M0Qq9O7R9
3136bM7q8J47M0j80R9R3j09j67J21Lr0n1M9qJ36L6o1N3J26j27r9J77n6k30j1Q1
3163g1p4j8M8O6P1K2l5J17L5k6j66J14P3k67j32K79k2j89Q0J93j4%k5M5O8p4j16
3190a8R0lj76j42K17J8j54%K72j4n6L2R0K2o6o9m7Q8j10k20J28J65j12j21K48
3215F2J99j91p3J65L8j53n9K3%p9j30L2K05r4j78K15K25j30j21J35J79k03j01
$$ plain form
3024 85 92 -145 -87 77 31 -22 72 101 -38 -28 -40 -27 -38 -113 -142 5 29 -49 -46 112 130 80 111 106 21 23 -57 -26 16 -56
3054 -56 -138 -10 72 -65 -90 207 150 -38 42 132 -20 -82 10 -59 -147 -83 -76 -97 -6 50 -56 3 120 56 -15 170 83
3081 83 -20 -44 -36 -59 -81 -57 -10 68 2 20 92 154 113 23 101 47 -104 -44 23 -133 -164 -76 -49 -82 45 67 47 119 129
3110 129 69 16 99 -27 -78 27 -56 -143 -45 122 3 18 112 89 46 160 119 -55 58 -51 -127 -87 -79 -168 -101 -2
3136 -2 45 -43 104 144 -36 63 156 47 -120 1 4 -86 -137 -88 -96 40 76 15 68 194 67 -32 145 89 -141 -152 -71
3163 -71 -145 -163 -115 -49 22 44 9 126 161 135 -31 83 156 -111 -243 36 14 -175 -95 98 84 84 59 104 172 98 -18
3190 -18 72 69 -107 -249 -32 -14 -168 -168 104 90 34 66 156 178 112 43 -4 84 -26 -246 -118 47 -65 -186 62
3215 62 261 70 -3 162 200 47 -12 11 11 -68 -198 -166 39 -55 -233 -18 207 77 -44 91 270 67 -34
3238c4j8P8r3j55Q1J47L6j50P6K56m5k13P7J81j22k24P7P2p8j15M7R3L3q1j0K42
3264A58K0j23mJ53j17k24R2K7lj47J00O0%J4O2P8P7j33p4J10j0j88j03J27l1j36
3290b15J02O2L8o8R0J56N3j55n8Q3P1k70n4J20J0r2N1J10r%N0Q4Kj5p3j5j9m4
3318ej57M0J02j20j9O2J18jL3O3%J8q6Lk4k4j52M5J13j18p8J80J04j49R5R7L2
3345A72n4J5p0n7K3q8j5Q0%j17N3J36l9l5L7J02k3j03J4nr4m3J0M4M6j05N9J66
3373A09k6p0PJ45o1n5Km5m0J8p0j7J03m4j5J32On4k9L4J17j95j5P7j3k4r5M7K9
3402d2O4L1m4R4n2l5P6M0j21p5R7p9j5n0J0M5J9K7j8Q3Qn0o2J66j8j73J4J13l3
3431B0j79R0J24L7m0j7K2K8%p0J5J4j30P4k5M7j09M7J00l2l4P7j8K6m9jM0K3j13
$$ plain form
3238 -34 -52 26 -67 -222 -141 6 42 -108 -32 224 179 -34 43 224 102 -122 -45 27 -51 -166 -119 -26 7 -74 -84 158
3264 158 178 55 51 204 87 -137 -45 -18 -21 -168 -68 -8 -8 6 68 146 223 90 16 126 116 -72 -175 -48 -79 -215
3290 -215 -113 -51 -13 -81 9 165 218 63 5 88 159 -111 -165 -45 -35 -127 -76 34 25 25 75 159 161 146 73 58 39 -5
3318 -5 -162 -122 -20 -140 -159 -97 21 20 53 116 116 134 48 51 27 3 -149 -104 9 -109 -187 -7 97 -52 43 140 172
3345 172 118 133 63 6 29 -59 -74 6 6 -111 -58 78 39 4 41 143 120 17 31 26 -68 -111 -101 -57 -11 -116 -57 109
3373 109 83 13 20 165 104 49 51 6 -34 -16 -86 -103 0 -44 -59 73 79 25 -4 30 147 -48 -63 14 1 -23 -118 -71 -42
3402 -42 22 53 9 103 51 16 92 132 11 -64 33 -46 -61 -111 -101 -56 -37 -10 -28 55 63 13 -49 117 99 -74 -60 53 20
3431 20 -159 -69 55 92 52 35 57 85 85 15 30 44 -86 -12 -37 10 -99 -52 48 16 -18 59 41 67 18 17 57 80 -33
3460c3q8R0O1j15o7K27Q9k43j1J69K9l1o4M9J4j1p8oK6J1j33J47N0j44L4N9O2
3487I3j20K4n7J46j26m5MJ01j6j75J25J54j08r3K02L2j44o6J14L4n4l4k3K0K9
3512A7k4p4Q5K5j18N9J48l8j56N6J89j51j18P1P7o0m9k9J92k5j51P3J31m3j90
3537a03R4J19j05p9P0L3k3m6rL0Q2p1n9J30M6j71M1J78o8j89lK24j30l2m6O2Q1
3564E6j2j13J33Q3j62m9K07l2j90j7J80m0k05Q0J29n0j10J03O3J4Kj43N8J17j33
3589c1j28K18K0j67m5J71P4j26NO0P3j0q0MQ6r6m6jM0j70rK00j6j19K0K00n8m4
3617B5ROmj1j39J5J20p3j00R7J67j20j8J39L4j09j9J7M9j28Q4p4N5l1r8L7J42
3644G2l7m7Q8Q2j59LL4K9j15K1K9n5N7k4o9Q5J14j43m1J91jj97P8J23j12q1P8
$$ plain form
3460 -33 -121 -31 30 -85 -152 75 164 -79 -90 79 108 77 13 62 76 65 -13 -19 7 18 -115 32 82 -62 -28 31 93
3487 93 -27 -3 -60 86 -40 -85 -81 20 4 -171 -46 108 0 -93 109 141 -3 -69 45 79 25 -9 -32 -12 17
3512 17 -7 -81 4 29 -89 -30 118 80 -76 -20 169 18 -100 -29 48 -12 -61 -90 102 77 -74 -1 130 87 -103
3537 -103 -9 110 5 -74 -4 29 6 -40 -49 -19 63 -8 -67 63 109 -62 -21 157 89 -100 -103 121 -9 -41 -87 -25 56
3564 56 44 -69 64 147 -15 -64 143 111 -79 -96 84 44 -161 -81 48 -2 -112 -9 54 68 70 -73 -15 102 -31
3589 -31 -159 59 79 -88 -133 38 112 -14 -9 51 124 114 34 38 124 28 -18 -19 21 -149 -158 42 26 -93 -73 127 69 25
3617 25 34 40 36 25 -114 -99 21 -52 -152 -55 112 -8 -26 113 147 38 19 36 85 -43 41 -33 22 -9 -107 -70 72
3644 72 35 -12 76 158 -1 2 36 65 -50 -29 0 -55 2 -22 -91 -6 108 -35 -76 115 114 -83 -5 118 6 -75 3
3671CK8j03J1R0J8kj2k2K4j9n0J1kJ2o1J0J8R1n8j5R4J9j1m0M1J9j30K2L9k8j4
3702a7lP2p7q4Q4N0j2k3p4Q3k1J4r1P0N8j2p3P2N7p4P8K5o4l1Pm1k5J6J1mL6j2
3734el8J10M7j02m5P7K5p6n5J06l8o3O1j3k9k7P2K0l2P3j2m9k2kOj1L9o6J4O3
3764B8O3p8k3J11n2m5O5k9k2n9M9N3j23M6k6RmqL7j0L1L4l3K1k3rN1M1q9k8Q8
3795F6p0m6O6Qm0Qm7K8n2L9j1OO2Oj3m3O4j7l2j8M5n3m0J48K7j03j4R7k6n8L8
3826B5J7k9n2QJ9q4L7L8j7PM1j5K0O7Pr6J5MN4j24ML5n0j4M1K1MP1K6n0J5J2l9
3859A8J1m2N9n6K5j9Lk3K9NJJ2K4k4j4j8Kk8Oo4K4K0nn0R3M4%OL0J2k2N1n9q9
3893c8O3mr5L8K2Mm9M9Q4m4n4N3O3r0n2L7k1K9lJ7k8QpP6l3L4m0p1J01L3j27p5
$$ plain form
3671 3 31 -72 -61 29 47 45 33 11 35 16 -34 -23 -25 -13 -74 -64 -46 45 -13 -28 66 85 74 34 75 94 -36 -14 25 -3 -17
3702 -17 -20 52 -25 -109 -25 25 13 -10 -84 -1 -22 -8 -99 -29 29 17 -56 16 73 -1 77 102 38 7 14 -27 -52 -36 -25 -29 7 -5
3734 -5 -43 67 114 12 -33 44 69 -7 -62 44 6 -57 4 -9 -38 -65 7 27 -5 68 56 7 -15 -17 -11 -22 17 -49 -35 28
3764 28 91 13 -10 101 49 4 69 40 18 -41 8 61 -62 -16 -42 -33 -37 -45 -8 -18 13 47 14 35 12 3 54 95 6 -22 66
3795 66 -4 -50 16 24 -16 -8 -55 -27 -79 -40 -51 -45 17 23 10 -33 31 14 -18 -36 9 -44 -84 64 91 -12 -26 71 45 -13 25
3826 25 42 13 -39 -31 -12 -96 -59 -21 -38 -31 10 -5 15 82 89 -7 8 12 66 -58 -54 -19 -69 -83 -42 -21 -17 54 80 30 45 57 18
3859 18 29 -13 46 -10 15 -4 -1 -24 5 10 11 23 47 23 9 -9 -7 -35 -29 -93 -69 -49 -54 -104 -11 33 33 39 69 81 59 110 51 -38
3893 -38 25 21 -74 -36 -14 -10 -59 -10 74 30 -24 29 92 2 -50 -13 -34 -5 -8 9 -19 -11 -18 58 25 59 19 -52 49 82 -45 -120
3925a20J25j4m6J6L4lRO%j7K9O3q2K9m4lMM1p7K9j8Q2k0q2J07L3j00oL6o8L9O1
3957D3p6RP2l9m6L6L4o7N2N9j5q7K6rk9o3P6k0L5LL7K4j7k9Pj5R1p9p6N7M2o8
3989c2k1J13ql5QK3k0l6l9J9M2n4m8K2N8r%P1J5n4QK1j4Mk0l0J8J8m8j1P1Rr0
4022d9L0O7jj5m4M8pm3j3J0L7l9pJ7j1j2O1m5J3J5rprj1q4R4P0r0j1J00j7m1L7
4055C4J4nq7L1M3%%l5k1O6j6j12N6L6Pl9N8Nn7L1K9ql2l2M7l2L5jn1L5P0j6k9
4088B4M9o4k4%K0l8jR1n6kN9l7n0N4j5K1o0K9j7QL4O3j46J6R6j0k6J2l3K5J1l2
4120AJ3JM1q0J%K0K0kM1l1j1j1j7K7jl3j8M2j8JQ0p4J3J8K1p6J14r0L9m4P9j04
4153c8L2L9J1j5kok7J6K7l1j9N4j9k3n6P1m8j7Q4Kn8O0QK9n5j8k1N9l7q%p2J02
$$ plain form
3925 -120 5 -9 -55 -39 -5 -8 1 7 7 -10 19 82 0 29 -15 -18 -14 27 -50 -21 -39 43 23 -59 48 81 -19 -25 11 -57 -18 43
3957 43 -33 -24 48 9 -37 -1 33 -34 18 77 62 -25 1 -8 -37 -100 -24 -44 -9 -6 31 55 38 9 16 1 92 13 -63 -6 36 -32
3989 -32 -53 60 52 17 25 48 28 -8 -47 -28 14 -40 -88 -66 -8 -17 -17 54 69 15 23 44 30 34 14 -16 2 20 -28 -39 32 41 -49
4022 -49 -19 48 47 32 -12 36 29 -14 -27 -17 20 -19 -26 -9 -20 -32 29 -16 -3 12 3 -4 -13 -24 -108 -14 56 -34 -45 55 38 -3 34
4055 34 48 43 -44 -13 30 30 30 -5 -26 40 24 -88 -32 4 11 -28 30 35 -22 9 38 30 -2 -34 13 -19 16 15 -36 -1 69 53 24
4088 24 73 9 -15 -15 5 -33 -34 57 1 -1 58 21 -29 25 10 31 -29 0 -17 -9 25 88 -58 -42 54 44 18 30 -3 22 33 1
4120 1 14 15 56 -24 -23 -23 -3 17 15 56 25 14 3 -14 13 12 -21 -39 3 -15 -14 66 -8 5 23 44 -32 82 -8 31 -13 66 -38
4153 -38 -6 33 44 29 27 21 -6 10 37 6 -13 41 22 -1 -57 14 -34 -51 33 35 -23 37 45 74 19 1 -20 39 2 -6 -6 -78 24
4186B4j0l9K9M0r4P4j4jLK6l5ok3oM1m2Q0l9M6j8j7m6L3M4o1j5Q3k7m5k3N5k6
4218io1P3K5k9rQ2q6K7Pk1j0k6L0k4K7K7j1m0O1k1kNRmq6K4R0n8ON9n8OM8m8J2
4253A5Rk3JN6o2m3N6K9m9n0N5l3N8qJ0m1L3k4m1K9L1j9K5nk5N1k7M1k3l3K7K3
4285D3n4N1k9j7RomL0l8J4L1m9QK7j9Qn3qK1K4L3p7M1kK5L0j01R9qj5K4l8m2J1
4319c1L2j4k0N1l6N6k7J00j39J24%o9k6n8J4mP7K1n6kJ7K5rK9j6J4nk4J1j20P4
4350a1O2j00K9N2l5KlJ7kQRo2J1M1l3m4O9n4K4J5K9j0K8k6j4K9j1j1M7m6K2o5
4382c3m7O8J8n9O5J4j3k3JNl9RL5k7L2K4q8O9J7J9n0N4LNq6Q1Nq5K2O4l4o2K6
4415a0J02r8k7L1L4J1p4L0l2j1M7l9jO8o1K3M0K5q7Q2k1m9Ok3L8k7N4q9M7J8K7
$$ plain form
4186 24 14 -25 4 44 -50 24 10 9 12 38 3 -3 -26 -32 9 -33 47 8 54 36 19 -27 6 50 -11 -26 57 30 -15 -38 17 -9
4218 -9 -70 3 28 -1 -10 72 -14 13 20 -1 -11 -37 -7 -31 -4 23 12 -28 33 12 10 15 24 20 -66 -42 48 -10 -4 55 -3 3 51 3 15
4253 15 24 1 2 58 -4 -47 9 38 -11 -61 -6 -39 19 11 21 -20 13 -11 -52 -23 8 -11 14 9 -16 35 8 49 26 -7 20 43
4285 43 -11 40 11 -6 3 -3 -7 23 -15 -1 30 -19 -11 16 -3 5 -48 -56 -35 -11 22 -55 -14 -16 9 39 -62 37 29 14 38 0 -42 -31
4319 -31 1 -13 -33 18 -18 38 11 111 -28 96 96 27 1 -57 -43 -47 30 51 -5 -7 10 35 26 55 39 53 48 24 35 -85 -11
4350 -11 51 -49 -20 32 -3 -1 -4 13 11 19 28 -34 -23 18 -15 -59 10 -44 -20 -5 24 14 42 16 2 31 20 9 56 10 32 -33
4382 -33 -80 -12 6 -53 12 26 13 -10 -9 -4 -43 -34 1 -26 6 30 -58 11 28 47 -3 51 54 59 -27 54 59 -26 -4 60 26 -36 -10
4415 -10 92 -6 -33 -2 32 43 -31 -1 -33 -44 3 -36 -37 31 -30 -7 33 58 -29 53 32 -17 -11 -34 4 -23 31 -58 -11 7 34
4446C4p0J6N8L5r1l5K9n0L3N9m2k8M3M0q4MJ07jj5nL8j41P6K9p9j9O8Lo3M1N3
4477D3rnl6pORrk2kM1l0j8kN5j4J5L1o0J01n8J6J7nl2p4N3j3rj1O5k4NM4o6l0
4512c5M8l6NJ1J1l7O6k8m1J7K1N0m7nK6k4l9L5m8Q1n5PPJ8om8M8J2M6k4J3pp2
4545c0RK2m1k0J53j23J7Jk7M8NM0l1o2K7l2M9m1L0m2L0O2j41Q2R8k8l5M6k7p2
4575c3M9p9K7K7K1j9n5J04j0l9J0J8m9K1kn4J6M0K%q1J20p4K4J05Lj23L9Rm7R
4606b1l1L3J9pPn6K8Q1n6L4J9j5m6jJ5o9PN1j5N2J6j6q9P3J3l6K9J4n8MJ20j38
4638c9o2J04L6r2L6L9K7r8M3mjJ5kmn2M6K3n6P8Pp4QL6j1P2n9k7L5l6N2o5m5N3
4671a7M3p2P9r1P0OL1l1PL4r4ORM7q5J06j4q7L6M5p4P5nl8M7l0nm3P5k2Jl5k6
$$ plain form
4446 34 -36 -20 38 73 -18 -53 -24 -74 -41 18 -24 -52 -9 31 -53 -49 58 57 42 37 75 -66 10 39 -40 -59 9 12 -51 -10 43
4477 43 34 29 -7 -14 -8 1 -8 -30 -32 9 -21 -39 -41 14 0 15 46 -14 87 29 45 62 57 25 -49 4 -9 -18 -29 36 12 17 61 -5 -35
4512 -35 13 -23 -18 -7 4 -33 33 5 -36 -19 2 52 5 0 26 2 -37 -2 -50 31 -24 -17 -10 8 2 -46 2 14 60 36 49 42 -30
4545 -30 -21 1 -40 -60 93 -30 -13 -12 -39 9 14 54 23 -39 -12 -44 5 -36 -6 -48 -18 44 -97 -15 83 55 20 66 39 -33
4575 -33 16 -63 -36 -9 12 -7 -62 42 32 -7 3 21 -28 -7 -9 -63 -47 -7 -5 -5 -86 34 -40 -16 89 92 -31 8 17 -30 -21
4606 -21 -52 -19 0 -7 0 -56 -28 53 -3 31 50 35 -11 -12 3 -66 -59 -8 -23 29 45 29 -60 13 26 -10 19 33 -25 -21 99 -39
4638 -39 -101 3 39 -53 -17 22 49 -49 -6 -10 -11 4 2 -2 -54 -8 15 -41 37 44 -30 -22 14 3 75 16 -11 24 -12 40 -25 -70 -17
4671 -17 26 -46 33 -58 12 18 49 18 25 59 -35 -29 -20 27 -58 48 34 -53 -17 28 -46 29 24 -14 33 3 -2 -45 30 8 9 -26 -52
4704e2Q2rk5K6k9J2l0J6j8JL0k3N1p4j5L8Qj3L6N5j11oJ06j6n7mJ6n7M4M5l0L
4736@%J0K1Mjm6oL8ml2j8O7m3K8M9k9p5O5j0m6N7jn0RM5k5m1M7L1q6J4O2n2k6
4770d4R2n6kn0R1k3k1L2Rr9P8k7oJ8MJ1l2Q5o2r4J21L0p1P3m3L9j12P6mn6K6K8
4802A1k0K7rj5Rj2J7mk9RRn0K0L9m1KJ6k9N5QL3r0J15Ko1m2O1l9j3K8m7R4q0O
4836b0k7P6Kj0l0kO8m0k1j2J7k7l6J9L9m0J9L3J9O0q6jj7jP1j34Q9pp8P5m0O1
4868A9j6OK9l8Rj0NN3m8k5j1P9Nq7L5j9PNN3l8J4LJ5j3p0M4n4JK3Kk9M2KL5j1
4903A7J5l9L6l3L9o3N9p9k6M7K7n9M7M3K2OKkm3j8N0n4J9J2o7j7P1j0K4k5L3m3
4935imQ6n7j6L8k6n7k7J03o4k6P9M4Qj1k6n6K0L6o1RL1k8RM7n2l9P5k8K0l3R8
$$ plain form
4704 -52 30 21 -4 22 -7 5 -25 -9 -27 -26 4 -19 32 -42 -57 -19 -11 -24 12 67 -44 -50 56 40 -17 -21 -5 -62 -18 27 -3 0
4736 0 0 10 31 35 34 -12 -18 20 16 -16 -34 33 -10 18 67 38 -37 28 18 -28 29 28 -22 -13 32 7 -34 13 44 -42 -28 34 -18 -44
4770 -44 48 -8 -10 -60 31 8 -13 19 28 -71 7 -20 -26 -8 -4 7 -25 60 -2 -96 25 55 -16 57 14 53 -59 17 13 -43 -17 11
4802 11 -9 18 9 -6 3 -9 8 4 -25 -16 -7 -57 -37 2 -39 -37 -21 -50 5 13 46 -44 71 73 12 -30 31 -8 -21 7 -40 54 -26 -20
4836 -20 -47 29 31 21 -9 -11 57 17 -4 -16 1 -26 -62 -43 -4 -44 -25 8 27 87 1 0 -17 -18 53 -81 8 1 -77 -2 -42 19
4868 19 3 9 38 0 9 -1 4 57 9 -16 -27 52 57 -30 5 -14 -7 -2 51 13 27 30 45 32 -38 6 -48 -47 -24 -22 -51 -9 -7 28 17
4903 17 32 -7 29 -4 35 -28 31 -48 -74 -27 0 -59 -12 31 53 59 61 59 16 -2 48 -6 13 25 -42 -59 12 2 26 1 34 -9
4935 -9 -13 73 16 0 38 12 -45 -72 31 -33 -59 20 64 72 61 35 -21 -1 35 -26 -17 14 -14 -5 42 -10 -49 26 -2 18 -15 83
4967H3k8j25R4oj02J04J7n3l4J09n3RJ8L0j23N9L4l3m2j0O6q7K9J9K6l4k3O8R
4996B1K0j4p8P8j8m5j0Q2o7k8P9p8LL6O8q1K3M3kn3L7Jl9J3N6q1mL5j0Mk7R3n2
5029EK8L1n2oj0n3L0J0j6k3J3Q7m2l4P2k1l5j1M7l8l4O4K6n7L2rq1O5Q5j28M8
5060gk5k6L4M8L7j27k0O9J5n2R6n1l4J2P3p2K8N6p7L6J9q0MK9O7r4J7O3m9j1M4
5091B2K4o6K8J0m1jJ1O7j00O3J4n9K5N4q0j9N6N7j48Q8J3n1O5J4o0l7L3jj8M1
5121Dj7j8J3P0j0jk4Rk8j7M8K1q5L0j2kJ02p8l8M9K5n0j9J02j01o3J05Mm6LQJ8
5153Bk1J6L0j8Jqn1K4L8p0L4j9J8o5P6K4J7m9N2Jk3lRo4R0K8j12K1O3r8K3N9N
5186C0n4O0Pn0L5J3k3o4O5p2k0qO6J8k0jK1K8Lj4p4Q2j3oj3J3lm6N4l1O7l5Kl8
$$ plain form
4967 83 55 -70 24 18 -84 20 37 -16 -50 59 6 15 33 63 -60 -1 33 0 -42 -52 14 -73 -44 -25 1 -33 -56 12 21
4996 21 41 27 -51 27 9 -36 -46 36 -31 -59 20 -58 -55 -19 49 -32 -9 34 32 -21 16 17 -22 -9 47 -34 -38 -3 -13 -9 -36 57 5
5029 5 33 64 12 6 -4 -57 -27 -17 -33 -56 -43 44 2 -32 40 19 -16 -27 20 -18 -52 12 38 -19 13 4 -77 -12 73 -55 -7
5060 -7 -32 -58 -24 24 61 -66 -86 -17 -2 -54 42 -9 -43 -31 42 -30 -2 54 -23 13 32 -48 -44 -15 52 -42 -25 38 -11 -22 22
5091 22 46 -20 8 18 -23 -24 -13 54 -46 17 31 -28 -3 51 -29 -48 8 65 -83 5 18 -33 32 46 -14 -51 -18 -19 -37 4
5121 4 -13 -31 -18 52 42 41 17 26 -2 -19 29 50 -35 -5 -17 -19 83 5 -33 16 41 -9 -28 74 -27 -90 15 19 -27 -24 -16 2
5153 2 -19 -3 27 9 10 2 -49 -25 13 -57 -23 -42 -24 -89 -13 11 28 -21 31 32 9 6 15 -49 41 69 -43 -22 41 -57 -34 25 30
5186 30 -24 36 43 -7 28 41 18 -46 19 -53 -73 -81 -15 3 -17 -18 3 31 34 20 -54 28 15 9 -4 9 6 -40 14 -17 50 15 17 -21
5220b1K5M6o5J7J6oj0l2K6o2M8qK8k6L6J1pm9M3m7K2J7o8Q8n1N6qRm2L9K8o6M0
5253B7k0K6l4j0OL5k7J4j6Mk9R9m9oj9Pj0m3pK9j4M0j3oL1j3N1n2K5l2j8j5M0
5286Aj9L1k7j3J2k2L1K8oj5K6l5oM6j3o8J8N7K5n1j1OM3j2lm6N7k3l9K6O3p9j0
5319b8L3J8n1MmL9PK0l7l7L0K0m1K9Ln3P7M3o6k3QO5m9m2P2j9k9N3m6J0m5M0Q
5352Ik0O6r0P1l0L6l4m2M4o2N1l8J0k3M5O2l6j9LL7l4O8o7J6l3L7o2L9Q0r6L7
5383B5l4K1l8J1L6pn0k3O0M7j23O0J6k7M0nm2N6lrj5j9R4k6ko2LNK9n2RJ4J4K4
5417B7k9j3RJ9l1l1M7M7o8j3M6Pq1M0N6o7P7%p2N5j6M6q6kP6r5J1M6l1K7J1J9
5449C1m2QL8j01K1N1J3r1J00o9N7Lk6j8K1L6j3k4K8m7J9K1Pn7K1M6n4MM6j1qk5
$$ plain form
5220 -21 4 50 -15 2 18 12 2 -30 -4 -66 -18 -26 2 -24 12 23 16 -33 10 -37 -15 2 -66 22 -29 27 19 28 -14 25 53 -13 27
5253 27 7 33 -1 -11 -5 30 3 17 1 5 -24 75 26 20 1 8 -2 -45 -52 -23 -37 3 -10 -16 15 2 53 1 26 -6 -24 -39 1
5286 1 -18 13 -14 -27 -15 -37 -6 22 16 1 27 -8 -14 32 19 -49 -31 26 51 0 -11 -5 38 26 23 -23 34 11 -28 -2 61 -18 -28
5319 -28 5 23 -28 -24 -28 11 18 38 1 -36 -6 14 -27 2 5 -48 29 72 6 -17 -9 56 7 -35 37 18 -11 42 -4 6 -39 1 9
5352 9 -11 55 -35 36 6 42 8 -34 10 -52 -1 -39 -29 -52 -7 55 19 0 3 40 6 74 7 23 -10 27 -35 4 84 -12 25
5383 25 -9 12 -26 -15 21 14 -36 -59 1 48 -75 -15 1 -26 14 9 -33 23 20 11 -4 -23 71 45 43 -19 -16 -11 18 -34 -25 -11 3 27
5417 27 -2 -15 -6 13 -18 -49 -2 45 -23 -36 10 17 -64 -24 32 -35 42 42 -30 25 9 55 -31 -33 43 -52 -41 5 -26 1 12 31
5449 31 -11 -3 35 -66 -45 6 19 -72 28 -41 16 19 -7 -25 -4 32 19 -5 23 -24 -5 16 23 -34 -13 33 -21 -17 29 18 10 -15
5481a5J9K7n9M2n3l4J31l5l0J2L6j7o5N3l3L7l6M8q2QN4m8L0oK1L4n1QJL3Pl1
5513FjnK3l5JO8n6l8QJ9mMO4p4n2Q0K1n9O3n1ppM6j6OkPPl0j1J4j3L4J7mj6pN2
5551E2K4m8p6M6L3n1j5Q2o1%J6j9K9PlqOMm4l4K9N0l3rK7L8o8O7j5l3J7l9kM7
5585A6Nl0K6POl3MO8r6k2O6m3mO1J1Kk3nK9l9nj4Qk0N3k8lJ1l7QK6o7N3jQk7J
5622b8O4pn4pJ8l3M7Pk3j3%N0k0M2m8l%K9o3O8K0Rm3l3J5NLnMN3j04MO6%n5J2
5658b3J7L5k7o8L8k1M5K7o4N7Nk0Llm7N0l2Mk1J3J0L1qJ2L2k9Opn8O1j3j3k2K5
5692emj2qOJ8j3P4n3N7m3J2l0nK6q9J6L9jJ1l4QO6n6L1J0J3ml3N0j8n4k5L0M1
5726B1l3M3m9K5J8n9K6M0n0J5J8Pm5J1J3k1m3Q2J0n3N4q2RM8l7j9L7J0j4j0L1
$$ plain form
5481 -15 4 31 -28 14 -39 -73 58 23 -7 5 41 24 -41 12 -21 16 -20 28 -54 -46 8 -40 -10 -16 5 39 -12 -4 -3 30 37 6
5513 6 5 0 23 -12 -11 57 1 -37 -29 -10 -14 -10 54 -20 -72 8 29 -30 33 -18 -25 -32 14 -2 4 2 9 16 -14 -25 -11 -24 10 27 23 7 0 52
5551 52 76 28 -48 -2 31 -20 -35 47 -14 -14 2 -17 12 19 16 8 14 18 -26 -60 -31 19 -14 -23 4 42 -26 41 26 -7 10 -29 -31 16
5585 16 21 -9 17 24 30 -3 1 69 -27 -49 17 -26 -30 31 42 44 21 16 45 6 1 -13 -5 -25 28 0 -3 8 -29 -21 5 -62 -9 -10 -2 -29 -28
5622 -28 36 29 -25 -32 -14 -47 0 7 -16 -29 -29 21 1 43 -5 -8 -8 21 -42 26 46 55 12 -21 -6 -1 2 -3 1 54 -50 -46 20 20 -35 -23
5658 -23 -6 29 2 -66 -28 -49 -4 23 -41 16 21 1 4 1 -46 4 -28 -24 -45 -32 -22 9 1 13 45 16 22 15 -43 18 5 -8 -30 -5
5692 -5 -9 -21 -29 -23 -5 -18 56 3 60 17 29 -1 -6 20 -69 -53 -14 -15 -4 -38 -30 36 -20 11 21 34 30 -3 47 29 -25 -50 -20 21
5726 21 -12 31 -18 7 25 -34 -8 32 -18 -3 15 22 -23 -12 1 -20 -63 19 29 -24 30 -52 -43 5 -32 -51 -14 -4 -18 -28 3
5757CQm0K8mJ7m3P2l4Rj1O2o9L3j9j3L5l9N7n1m7K0M6p8J08l5n3M5K0k8Jj9K4
5789Ek5RL4o1P8p7L4K4m8MO8k7j1PL8p0L9J9r5O8L9l1J5n6R4o7K7jl6k6M4j9l2
5822c6O8j5j9j7L6k4l3K6K1l7L8k6L8o7L5pk4J3pK0J6qrJ8QK7m1JK8p9Q4l5j1
5855a8L4N2m8j8K5k7oL3qk1k7%M9l4M0m2N5K9n6k3jk2K4ml2J02o8l4Q8j8J7p9
5887c8M3oQPj7J7J0m8K1K8j8J2K2J1q0LO7Rp2PL7J7n7L7l0M8m2J4m5K5pl0J0M
5921c3%L5j6k3O1pK1m5JJ9K8k5Prk3NK9l2RLK1N2n2Rl2N3n8J5L4o4J1K7Rk0Qj6
5957BJK9m8k7P1Pk4l8O2l0j9J7k3j2O8k2l6K9Jk0K6nj3mL0K9o2J4K5qP0p9NK8
5991D4k9l0L7l4J8j7J8n3M2L6m8l0N3k8K3%m2O3k4K6p8L1%K8N1o2j1j3R4l2n8
$$ plain form
5757 3 11 -29 -1 -5 12 -31 41 7 16 5 67 -2 31 12 -1 34 -5 52 1 -46 -26 20 -58 50 15 -38 7 27 -1 0 -19 5
5789 5 -20 -11 23 -38 40 -37 -3 21 -27 -23 45 18 7 14 52 -18 21 40 -55 13 52 21 36 -20 74 7 34 33 -3 -29 15 -4 -36
5822 -36 32 17 -2 -19 17 -7 -40 -14 7 -30 8 -18 20 -47 -12 -19 -43 -30 -37 -17 -1 -9 -18 0 8 35 -6 -5 23 -56 28 -7 -18
5855 -18 16 68 20 2 27 0 -6 27 19 -2 -29 -29 20 -14 26 -16 39 68 12 -11 -12 -34 -10 -14 -46 56 -12 -46 42 24 41 -38
5887 -38 5 -1 7 14 -3 14 24 -24 -3 25 7 19 41 52 -28 -25 42 51 -21 -14 23 40 -17 20 -10 38 -4 10 -35 -10 -17 -47 -37 -33
5921 -33 -33 2 -14 -37 24 17 38 -7 -6 13 41 16 23 14 -9 -4 25 -7 2 5 26 78 26 35 3 56 -2 13 47 -17 -6 21 30 10 18 2
5957 2 3 32 -16 -43 28 35 11 -27 35 5 -14 3 -20 -32 36 14 -22 7 8 -12 14 9 -4 -8 22 51 -11 3 28 20 90 11 16 44
5991 44 15 -15 22 -12 6 -11 7 -46 -4 32 -16 -46 7 -21 2 2 -40 23 -1 25 -53 -22 -22 6 57 -5 -16 -29 65 33 -25
6022b5J9P7m8l8N0n0L8nL0o5J4K7l0j0kk1O1m1l9L1mL9j2J5l5K5m8R6K7j40M7
6053a7L9RK0k5J9m7k5ROKrRJ3jk2R8n7n3N7o2K3K7Kk0N3n2RK4J4r9P2NM4n9k3
6088a7LJ4J1mM5o2K7k9J0oPL1l0k1J1K8%k3M0j1l7L9M4n7Nk1K1QLm3%J0L4p4O7
6123B3k0n8P0J3J0l4n1MJ%M9Mj4k3PKm6K8rK3O7Kn7L7j1k2L4k7M1l9Qm8NK1M4
6158C4n1k2%L0J1l1j2J2l1N0l0l3P3k0pnN7m4J8j8j6K4lK1kn2Q3l0NJl1j2jL7
6192ENPn7RP3m7mML5RJ6m9N4r0RRn2R4n2M3j9J0j8Ok3k5M4K8oj4Ok2J4kj0J2M
6229FjK1l7J1m2J8L6k4O2n4P6j25K2l1N7k0L5J9l2J2Ro4K5M5k7k1O9p2j7L9J9
6260A4J5j6k4n1L5pK8P1l8KJ7lJ0r6K6O6j03P6n3J6L2J3m1L8k4l6L0J7kj6M2j5
$$ plain form
6022 -25 -6 71 23 -15 35 -15 23 18 48 -17 -3 24 -6 -16 -18 -39 22 -19 -58 -27 -31 8 -4 11 -24 1 -47 49 76 -64 -17
6053 -17 22 31 51 26 45 -2 -27 -18 -12 -10 -19 -10 3 2 -20 78 21 -32 25 -37 -14 13 15 -5 48 -4 5 29 43 -56 16 21 65 6 -17
6088 -17 -14 0 11 7 52 -10 17 -12 -2 -8 -1 30 0 -21 -10 18 18 -5 35 24 -13 26 70 13 18 -3 18 26 29 -14 -14 -4 30 -44 23
6123 23 3 -55 15 28 38 4 -47 -43 -42 -42 7 11 -3 -26 -19 -17 -63 -35 -44 -21 46 48 -9 28 17 -5 29 2 43 4 12 -36 -31 -10 34
6158 34 -17 -39 -39 -9 2 -29 -41 -29 -60 -10 -40 -73 0 -20 -27 -32 25 -19 -1 -19 -35 -11 -14 7 5 -47 36 6 11 12 -19 -31 -32 5
6192 5 10 17 -40 -31 42 -5 -9 -5 30 39 55 6 60 -30 -21 -12 -64 30 -22 21 2 12 -6 0 -23 -48 -4 24 18 4 10 -12 2 0 -10 2 6
6229 6 5 26 -11 0 -42 -24 12 -12 50 -4 72 -53 -31 -62 -5 -25 10 29 -3 9 18 -46 -21 24 -3 -24 45 -27 -44 -5 14
6260 14 29 13 -11 -62 -27 -34 -6 65 27 29 46 43 53 -43 -17 49 -54 22 -31 -15 17 30 -11 27 3 -33 -3 14 12 -4 38 23
6292B3j8nl7Q3m6l7K7j8L4k1K4m0M2RK5l7k9N4l0j9M2J9l9k2K5P1p2j8Kl9M9o1
6324e9M6L6l4rJ7Rlj8M9p0J6K4l0Q6q3RL0k3lLK0l8K9kOJ3l2PK1J9j03P3N4n1
6358Ij0o5N4M3kk6m2MJ8M6Jj9L3k8oJ2k4k2oLN9k9K1RL8o3MJ0Kj2m8OM1lK2o7
6394c7QR2o5L9l8m8N2pL2j4j9nO0j7p4R2k6j5lPk2k7L5J4M7o6k8N3k0oL9MNj0
6428C2k9k2J2K0l1j8J2J3K6n0J4K5rk1J0l0M8K4n9Q7qJp9N0J2m4k5J5N0K7r4O3
6460B2m%J9m0qo2P3j0j7P7p6K5k4N1l4K7rkJ1qj6K0j1J1j1J1k7k2O9j5jjK2k8
6494A2j9J5K2l1J9N0r6L3P0q0M9o6P9n5j3jK0K6k7K3Or3J12l7L6l1o8O2j8K5j5
6525Irn8P9Jl2nNM8m0M6oPk8Ll1m9J00o4K7Jjj1k2J6k9L6L6L6p7l7M2l0j6M3j8
$$ plain form
6292 23 5 0 -37 46 0 -37 -10 -28 6 -15 9 -31 11 20 45 8 -21 33 3 -16 26 45 6 -16 9 80 8 -10 -8 -47 2 -59
6324 -59 -13 23 -11 -20 -3 6 3 -15 34 -36 -20 4 -26 60 -23 -14 16 -7 -10 -7 13 -25 4 2 8 21 -11 -4 17 36 -67 6 60 9
6358 9 -1 -66 -12 31 29 3 -39 -35 -17 29 30 11 44 16 10 22 -2 -24 -30 -27 32 3 24 33 71 8 12 22 24 12 -36 -30 11 8 30 -37
6394 -37 -29 63 -2 37 -1 -49 3 -4 28 14 -5 -10 50 33 -41 51 25 10 7 14 -8 -35 0 14 61 -5 -33 20 0 -6 33 37 42 32
6428 32 3 -19 -7 13 -18 -36 -24 -11 15 -35 -21 4 -5 -26 -16 -46 2 26 -33 54 46 47 -32 18 30 -14 -39 -24 26 53 -41 22
6460 22 18 18 37 -3 -11 -73 0 -10 -27 50 -26 -1 -25 26 -8 19 10 8 19 11 -5 15 4 15 4 15 -12 -34 35 20 19 18 40 12
6494 12 -7 8 30 -1 18 68 -28 5 75 -5 44 -22 57 2 -11 -12 8 34 7 30 36 -57 55 18 54 23 -45 17 -1 24 9
6525 9 0 -58 21 22 -10 -15 -10 38 -2 44 38 45 17 20 -11 -60 40 -24 3 4 3 -8 -30 -14 -43 -7 29 65 -12 -49 -7 -37 -53 -10 -28
6560b8K2RK4nK7No8l1QM0L0k6oK1nJ2m4LlM2q5P6l2J0K4l6M1k4jK1j8mn3Q3k2
6595Gj0m2N5l3RK1l1J5Lrl5J11m6Kj4QM3k1q5K7L9Lm1P6l7k8mK2J2Kkj7NL0l1
6630Dm1O5j7ql2K5k2K2mq1J13m6K3J1j6j4j0O9r3O6j8%J7k8K7Oj7J8n0L5K8l1
6662AK9J2k9l5PK1J0k3k9O1n2K4J0l7NL4J0q0J24k0J1q3M4%ol4L3m6J5nK7OPO7
6696G9r4N4j1Qk2n0M4L9j9K1l6J1j9N1o3MJ9K6n0OM7m0j4j0QL0J2k2L9J7j14R1
6728D2m0K2Mq3N6L9k3Ll6qJ4j7J0R%J3K6%k3Pk2j2k4N9j1pJ5n7O2p0M0M0o8J3
6762b7J9NJ2qk9k3J3K1K6l0L0k6M4k9O3p3J1kK1jj9j6M3l1J4l2MK9L0j8mK9r6
6795e0Q6p4P2Jj5J4k1k4j8mM8LJJ2p3K2L7J4kk8K7o2j7L3M2l4k7P1%J0k2k1nj3
$$ plain form
6560 -28 -6 3 27 22 49 54 -14 -45 -37 3 33 7 1 22 17 29 -15 -12 -15 27 -58 18 -14 -4 20 -16 25 1 0 21 3 -1 -54 29 7
6595 7 -3 -45 10 -23 -14 7 -24 -9 -6 -15 -50 61 15 17 3 11 54 33 -52 -25 14 17 -24 52 15 -13 -17 5 17 19 17 0 5 35 4
6630 4 -37 28 11 3 -29 -4 -26 -4 -8 -89 24 -22 1 12 -4 -18 -28 41 -52 14 -4 -4 13 -15 12 18 1 19 -31 4 32 1
6662 1 30 42 13 -22 -15 6 16 -7 -36 25 -27 -3 7 -30 -25 9 19 -61 63 43 54 -29 15 15 9 -25 8 -38 -23 -28 -1 5 12 79
6696 79 -15 39 28 36 14 -36 8 47 28 49 13 24 5 56 -7 -3 16 42 -8 -2 45 5 -9 -19 -11 19 31 9 48 65 -49 42
6728 42 2 24 28 -55 1 40 17 20 -16 -24 -10 -27 -17 -8 -8 5 31 31 8 15 -7 -19 -43 16 5 -2 13 -44 18 -52 -12 28 -40 -27
6762 -27 -8 -3 9 1 -28 -51 -38 -17 9 -21 9 -17 27 -2 61 -12 -1 -3 18 17 -2 -18 25 -6 8 -24 -20 9 39 21 17 46 -50
6795 -50 36 -38 34 35 20 34 13 -11 -29 -33 15 18 19 31 -42 -20 17 31 29 1 28 -34 -51 -18 24 -10 -37 34 34 44 22 1 -4 -17
6829a7N0K0rp8M7O1o8jN1p6rRNP8r1J7k0P1m0k6L5L3m9M5k0jk3O2r5L7m3L2jO
6863hL6l0j6K5K7k8J6k4K8noo8M5K6%K4k8K7%k4RJ4m9J4j3Llm8K6K8j4J4j7k8
6897d7O3l7O0l6J8n2K2j3N6k6j2j2lO5m3k2J1j4M1lK4l8m4J6j0M0J6K7p2M7rJ0
6929B3o8QQL2n8L5l8M4M1j1jnk8K8j5J6j2K9k5q5L5N4l3K1JQL2k6K4l9N7m9Ro
6963FL2o8%L9K5l4j7Q1q2L4L7k5n4J7K9k1K4m0J1l6P3J6l2l4L7L6r3K8J2L1l5
6994cOL1l2k9P9k8L1r2P2q0M1L9l4LjqL5l2L7j6m2L6j9O1p8j4J1M8l8J9m1O2q
7027A6m7L7J4m7M7n8J6L4nN6p6L2q3O5j0lJ6m2OQ4j1n7K2l2N2kl9j9M9kK4m9j4
7060b6N3K6o7N0k0l4K3J4o3M6mk8jN3K2p0L3j4J7kK2m7L7L7n1J8%o3K7J9k8NJ9
$$ plain form
6829 -17 33 53 44 -34 13 74 6 5 56 -20 -29 -20 -15 63 -28 -11 -31 40 0 -26 9 42 -7 38 18 17 -6 56 -39 -2 -45 -13 -14 -8
6863 -8 28 -2 -18 7 34 6 22 -2 26 21 15 -53 -8 18 18 42 14 41 41 17 26 40 -9 5 -8 -5 -8 -56 -30 -2 -16 -2 -19 -47
6897 -47 16 -21 39 3 21 -31 -9 -22 34 8 -4 -16 -19 46 3 -19 -8 -22 19 16 40 2 -42 -26 -36 4 20 47 -25 22 13 23
6929 23 -45 -37 -29 3 -55 -20 -58 -14 27 16 15 10 -18 10 -5 11 -1 28 3 -82 -47 7 -26 -5 -4 4 36 10 34 -5 52 3 12 6
6963 6 38 -30 -30 9 34 0 -17 64 -18 16 53 28 -26 -9 20 -1 23 -17 -6 -42 31 47 15 -19 18 54 -39 -11 1 32 -3
6994 -3 3 34 2 -27 52 24 55 -37 35 -45 -4 35 1 4 3 -5 30 -2 35 19 -23 13 -6 55 -23 -37 -26 22 -16 3 -38 24 16
7027 16 -31 6 20 -27 20 -38 -22 12 7 63 -13 19 -64 1 -9 -12 4 -38 -32 52 41 -16 6 -26 26 24 -15 -34 15 13 37 -12 -26
7060 -26 27 53 -14 36 16 -18 5 19 -44 2 -2 -30 -31 22 44 -26 7 -7 10 8 30 -17 20 57 6 24 24 -39 -12 7 -21 -16 3
7093CM2j2o2K8k3K7J3l1l1L6j5j0nK0K5oPl5K0%kk8M4m7O1K2p8L5pJ6l3QmJ4M7
7128C9p6j6Q0o3N4m8RKl1N8k7k6N3p1K5O3lj2l4L2o9O2qNQL9q3P5k3Qk3K0o3N1
7162Gl6N1Mk4J9k8j9K0lL0j7J6K9n8j0O0k3mj7jK2J2l3NLrrk3O7r3Q6M1o2L3n8
7197b2j5L6J2o3N7j5m3M7kmK2rqkj0L8l7J7L2qj3m3O8j2k0Mn2M6k2RM3l7qM5l6
7232erLlK9k0j2J3rN8m3K3o2M3nL6m0kRK3K0m2J9m8L5Pj7pPLK0l1K9k2L3m2J6
7268Glm6L2l0O0n7O4ml0L1k2n1Q3r2N3K3J9n8Mk8L8oJ6M7p8L1qK3j0k9J9j4j6
7301c2M0l6K7K2j3KL1m0l3L6m6L4RO0o8J3K0k5J7j1K8o0K5J2n8K8k1M1Q3j14O3
7332C4l3N6l6m2O3j6j0Nk9L7n9RL6j2j9N9j0l5J5k1N1p2J9mj5N3j1n5QM9Mpk5
$$ plain form
7093 3 45 33 -29 -1 -24 3 16 -15 -46 -10 -25 -35 -40 -20 5 -1 6 -29 -9 -9 -11 -39 5 -42 19 41 -37 -2 -9 7 -26 -18 -22 -8 39
7128 39 -37 -53 27 -36 18 -30 -21 -19 -50 8 -19 -45 8 -63 -38 25 22 10 -24 8 -61 1 -7 -2 6 45 -38 37 14 22 -1 19 -44 7
7162 7 -29 22 26 2 21 -7 -26 -6 -9 21 4 20 49 -9 -19 41 18 14 -3 -4 18 30 -3 2 5 -4 -13 -36 31 -62 24 65 3 36 -22
7197 -22 -37 -1 11 -52 5 -10 -53 -6 -8 -12 10 1 -7 -9 -19 19 -18 -1 31 23 10 -33 35 23 3 7 -45 1 -21 -12 31 -6 -14 31 -5
7232 -5 -14 -11 -14 15 -5 -17 -4 -13 45 2 25 -37 6 1 37 -3 -5 4 27 47 5 24 -24 11 18 1 -6 1 4 24 -7 22 0 33 -9 7
7268 7 4 -42 -10 -40 20 -37 27 23 -7 24 2 -49 34 -58 -5 18 37 -21 -17 -45 -7 -13 3 50 -28 3 -5 18 8 -21 -2 -16 -32
7301 -32 8 -28 -1 21 8 10 41 1 -32 4 -42 -8 1 61 -7 6 26 1 18 7 35 -25 0 12 -46 -18 -39 2 85 -29 34
7332 34 1 57 21 -21 42 26 16 21 -8 29 -30 -21 15 3 -16 43 33 -2 13 -8 43 -29 -10 -14 -29 24 13 -42 -34 15 19 12 -13
7365a3l2L4j1J8l9Q3o5O1l2l2L3L3n2JP4qm9J3m3J7M0m2P2j01Q6m2Jj3K0L6n0
7396bJ9lk5J3k0JJ1J4l2j9O7k6P5o0m6L3Rn2L2l5KJ8P1k9K0l9qO8o7L5j0pp8P6
7430FK6j5k2K5l9O4j19J07k0l7J00l6p3L5k2j0N4q0M6L2J4l9K8nm1QM8m1jKJ4
7461Ik8J4L4p3J4M3l9J3M6m7l9N7L9m5J6o0O6J0jmKk7k2M4lm5k7K5kJ8LRK0m1
7495b1K7lj9J0K9j8mN1rj5J1j6j6M1n9K9LJj8PK3q1K8PK9m9L4J5kpj6N0Jm0k7
7530b4K7l5M4k3pOkNK5QJ1o3R9p3N4n9q9J03k5J3J5J6NL5k0o1j1j2k5P1J3p2O8
7563A7L1l3j0j2K5m7M4Kj7l2qk8J19J3r6K4JK8k5J7lml5J3n2K2L2K3J2o5L5J5
7595FQl2K8M1n9J3L0l0mM5m0J7j8k4j5kJ7pj5RL0Nm%n0O4j6Mj5qK0j9l8J7L0j0
$$ plain form
7365 -13 -45 -11 -22 -4 -43 40 -25 36 4 -28 5 38 -14 -13 61 53 4 17 -26 -9 31 -11 61 -40 46 4 5 -8 12 48 -2
7396 -2 17 14 -11 2 -18 -17 -6 8 -24 -43 24 -2 73 13 -33 0 9 -43 -11 -46 -44 -26 45 16 36 -3 -11 57 -10 25 15 8 -70 6
7430 6 32 17 -5 20 -19 45 -74 33 13 -24 76 40 -33 2 -20 -30 24 -56 -10 22 36 -3 25 20 -21 -13 35 -6 -7 -5 9
7461 9 -19 -5 29 -44 -30 13 -26 -13 33 -14 -53 4 43 -2 14 -46 20 30 29 25 27 0 -22 22 19 -26 -53 -28 -30 -12 -9 0 20 -21
7495 -21 6 3 -16 -6 23 5 1 52 43 28 39 23 7 48 -11 18 21 22 4 11 34 -47 -19 -12 17 -32 2 17 15 8 -8 42 43 3 -24
7530 -24 3 -32 12 -11 -18 -12 -14 -9 16 24 35 -28 71 -2 52 -7 -96 7 -18 -5 10 26 31 66 46 -15 -26 -38 -63 8 21 -51 17
7563 17 48 15 5 -7 18 -29 15 17 0 -32 -40 -68 51 64 -32 -8 -7 21 -4 13 10 6 -29 -16 -68 -46 -14 9 21 -44 -9 6
7595 6 14 -18 10 51 -8 5 35 5 1 46 6 23 5 -19 -34 -36 -19 -26 -41 -32 -2 3 -1 -1 -51 13 -3 1 -14 -22 -2 -21 -59 -42 -12 -22
7631b2N7j5j2rK3j9J9k6K6l4K9j2J2L1p8L4J0m7J7K3k9J4mmL3k2j9M9k8J4j2j
7663bllRj2L0j5p8J37j21P1%oK4Rn9L0k4N0j1j7Ql5qlJ8K7k2rJ4NK1l9l1P6n5
7698b4ML9K0m0rj8K4Kk7RNlpL5M2m6m7N6n1L1n4N6J9K1o1j5L4LkJ7k0O5n4l8P
7733b7K9l8P2j3n4L9K6n7rP7%p0K3nJ0j7m9R5lj5m2mL9j3j0J3M9l0j5N9l2l6L9
7766C1k8RNj9L5n7M2O2q9L0K2m2L2o0oL1L3r4M7M1l9K0Nn2M3K3m5L4J7j7o7L6
7798a7j2MK1k8N9Mj5Qpj0J0kpk7j1QL6j9J6l5L0o5M7J2oPM3m0k1K4k3J8M0l5J8
7833B5NKlj08N8M0l4j4l4P8j0o4P5m2PjJ2RN9l6m0K8l1K9j2j9L0m2K6M6p5M8j8
7866fo1L3N8m5%m1L6L0k3J9p6L8moL6qj9j1P2Kn0L0Rk1lM0K4k3j7qm1M9K1m8L0
$$ plain form
7631 -22 35 20 8 -1 22 3 22 -4 22 -12 17 5 17 48 -30 4 14 -33 -16 7 -22 -8 -12 -16 17 -5 -24 25 -3 11 -1 -2
7663 -2 -5 -8 1 -11 19 4 -74 63 -58 13 13 7 31 40 -19 11 -13 37 26 9 17 -18 -26 -29 -11 16 -6 -15 -1 4 25 -14 -45 31 -24
7698 -24 -20 19 39 -1 -10 -28 -4 -2 -29 -20 -15 -18 -25 10 52 6 -41 15 -36 -5 -59 -3 16 37 -24 -39 -5 -2 -4 13 -7 58 4 -34 -27
7733 -27 2 -36 36 23 -31 8 34 -23 -32 45 45 -25 -2 -7 3 -14 -63 32 29 14 -28 -32 7 -6 -16 -3 46 16 1 60 28 -8 31
7766 31 3 12 17 -2 33 -24 18 80 -9 21 43 1 33 -27 -33 -2 31 -63 -16 25 -14 6 11 -41 2 25 -20 14 31 14 -53 -17
7798 -17 -29 -25 -4 -32 27 31 16 24 17 7 17 15 8 -19 -30 -22 14 -5 11 -24 6 -59 -12 0 -6 1 44 4 -17 7 -16 2 42 7 25
7833 25 30 32 29 -79 -21 19 -15 -29 -63 15 5 -59 16 -26 -19 -20 -8 1 60 24 -16 12 -19 10 -2 -21 9 -33 -7 39 -36 12 -6
7866 -6 -67 -34 24 -21 -21 -62 -26 4 -19 0 -76 -38 -42 -48 -12 -20 -39 -50 22 24 -26 4 13 -8 -11 29 53 30 13 5 -36 13 34 -14 16
7901A6M7n3l5J6K5m2M3rJM7o0j0J1qJ5K2o6J9j0Qj0K3j1j0O7l5J1k9O0p6K6J1
7933Dk7L8Mj4K4l3O8n4j5J1%j9J3m9O6j3m3L6n2L8%j2N6l2J3m6RK6J1Mk8K2q0
7966g4O2k0L8j2K3l8M3j9L9orqJ0l8K1k0L3k8K6l3L1p5L4nN8m9J6J3l1kJ6l2L7
7999AklN6n6qp2P0JL2m2L3m8M4k7L9mK3M7j05L4j6K8l7K6k0%j5P0l5pn1J12k9
8032C9n6jL6j7l5J2J2L6no7oP2o4k3O5j8J6K8o1L6qJj4M7k9J6m0K8jk3L6k0k7
8065c5pP3k3joj1N3KJ0n4kJ1k9J7Rp3M4j2n0P7Kk3M0J2m2%rR6n1p3L3k9K0K0M7
8100C6o5L6K4J9j9o0pJ2L0qJ0oK1J4m0kL9o2O3n9k1O8ok7k1m8J13m7mkJ8j3P6
8133F2p1Jk4PlpK5P1j02LR4o0L2l8L6M9l1l1Nk6K9jp1O1qL7j7m0O0j9Oq4N1K2
$$ plain form
7901 16 63 10 -25 -9 16 -26 17 8 9 56 -4 -14 -3 -11 4 26 -40 -21 -31 -23 -33 -10 -21 -31 36 1 12 -17 43 -33 -7 4
7933 4 -23 15 19 5 29 -4 64 10 -5 6 6 -13 0 -49 17 4 -39 -3 -55 -17 -17 -29 27 -5 8 -38 -29 -3 8 12 -16 6 -74
7966 -74 -12 -32 6 -6 17 -21 22 3 42 36 27 19 29 -9 12 -8 25 -3 23 -10 21 -54 -20 -25 33 -16 0 13 -18 -20 -4 -36 1
7999 1 -1 -4 52 -4 -12 -84 -14 -13 19 -23 10 -38 6 -21 18 14 37 84 -21 13 -3 25 -12 14 -6 -6 -21 49 14 7 -44 68 39
8032 39 -17 -18 18 1 -34 -22 -10 26 21 -46 -52 20 -44 -67 -2 -20 -4 24 -37 -1 -9 -8 -22 25 -4 12 -28 0 -1 -24 12 -8 -35
8065 -35 -42 31 8 7 1 -10 43 45 55 1 -1 10 -19 -2 7 -66 -22 -34 -84 -7 -5 -28 12 24 -18 -18 -27 69 18 -55 -22 -51 -31 -11 36
8100 36 -29 7 31 50 31 -29 -36 -24 6 -2 8 2 23 37 -3 -5 34 -28 35 -24 -45 23 17 -10 -31 -79 34 -13 -17 -19 -1 -14 62
8133 62 -9 -8 -32 -25 -28 -35 -10 61 -41 -38 56 -4 28 -10 26 75 44 13 18 -8 21 20 -51 10 2 39 22 -18 42 23 29 -55 -4 18
8167A8l9j6j2M3l3M6pl3N2j7J7k2M7k9j8J1l5L7j7K6m3M9o3M4
$$ plain form
8167 18 -21 -37 -49 -6 -39 7 0 -33 19 2 19 -3 44 15 -3 8 -27 10 -7 19 -24 25 -38 6
8191F
$$ Imaginary data points
##PAGE= N=2
##DATA TABLE= (X++(I..I)), XYDATA
0@%%%%%%%%%%%%%%%%%%%%%%%%%%%lPqQqJ2j8K2k4K6l0L6m3M9n4O1p2Q2r1J01j12
48e9J25j38J52j67J81j99K15k31K49k63K76k82K78k60K11j07r9N17j430L712j1227
69h546P2464L63332l73606k92358M12060J13054k80379J0233O2960j59004M7770
80c2020R5585j89014l4975K06144p1035j10774K11053L8985k27719J03910K20004
91B10144j92707j75516J88900O0462j83546j6242J09409O268q817m67q733R0011
103G9166N3294j27032k7974J39303m4817j61432N0482P1061j13897l6706J00746
114a7806k647n3332L9989M6865K4354J7973n2968j5914J06050n618j43918K2874
126c4098J16158p0761q3692Q1624K8358o5247J9012K7528k8691K8380p05r0077
$$ plain form
0 0 0 0 0 0 0 0 0 0 0 0 0 0 0 0 0 0 0 0 0 0 0 0 0 0 0 0 0 -3 4 -4 4 -4 8 -10 12 -12 14 -16 20 -23 26 -28 33 -39 43 -48 53 -59
48 -59 66 -72 80 -87 94 -105 110 -121 128 -135 141 -141 137 -123 88 -19 -118 399 -1031 2681 -8546
69 -8546 63918 427250 53644 -238714 173346 286400 6021 16254 79214 -79790 -32020
80 -32020 63565 -125449 -160424 45720 -25315 -136089 74964 113949 -113770 -9860 210144
91 210144 17437 -158079 30821 91283 -92263 -108505 904 7172 -1645 -2112 -10845 79166
103 79166 132460 5428 -22546 116757 71940 -89492 -39010 32051 -81846 -118552 -17806
114 -17806 -20453 -73785 -33796 13069 37423 55396 2428 -13486 92564 86946 -56972 -34098
126 -34098 82060 11299 -72393 9231 37589 -27658 -8646 18882 -9809 18571 17866 -72211
138g2211L6996J04361r8207r9422J31074O3794j12610J7403R2521n5859j2539
149d699R8518n0577r8278Q5480M3849j14866m510P4253o1073k9927R3783j8412
161A3541q1483P0669N8070p9186p117O2359m4517l6352O0286r100n6494M1947
173g377L3615m0364K2759M5429m4140j1719O2326j8181o3651J7832J5127m0929
185b9273l585J0948k7293J1479L8926j7926m873M9881k28k9670L5341J8125n0518
198A334o316L4409k4254l2778J6054L954r131J2862m542n811L6447M005m3825
211a7592J6307M0040l9374l2898L4413l124l1544K7103J2029l7771K1960M9214
223C8763k7485k1912L7830O09k1503K1702j4411m7564L3161L5504o4304k6787
$$ plain form
138 -72211 -35215 69146 -29061 -128483 2591 66385 -46225 -28822 63699 7840 -4699
149 -4699 93819 43242 -55036 30444 74293 -40573 -45083 29170 -31903 -61830 31953 13541
161 13541 -67942 2727 60797 -18389 -25506 36853 -7664 -44016 16270 7170 -49324 -7377
173 -7377 26238 -14126 8633 54062 9922 -1797 60529 42348 -21303 -3471 11656 -29273
185 -29273 -32858 -21910 -49203 -37724 1202 -16724 -21597 28284 28056 -1614 33727 51852 1334
198 1334 -4982 29427 5173 -27605 -11551 -7597 -16728 -3866 -8408 -14219 22228 26233 -17592
211 -17592 -1285 38755 -619 -33517 896 -2228 -33772 -6669 5360 -32411 -10451 38763
223 38763 11278 -10634 27196 27805 6302 28004 13593 -33971 -810 34694 -29610 -56397
235e6397O5105L269m6322K4978K4575l0187J3243L3350l3208j8338L9995l78k9310
248i625J2269K796j5413K4921M450m6775J3877N2389l4043m4355M2107K0702l9907
261a6607K264K1930j9060M725K5877k4306j3411L7294m934l1509K4564Q634m0448
274b4987J9470M1531m6910l0118O5246J5191o2267L907M6964j4031k3292R002
286b94p119k745J8888j6953k3580L0393J5791k9539R307K9859k0952r391L5236
299B8901o615l7720J2786K1254k0755j4763L456m48J3907O501k7282N175M4451
312B8848j0948l7892K6495K4778l6953r170L0246j6025k5637K3661Q773k2015
324a5839R946J6849j1072O944J4390k0429l505K6705j7899l3141K4494J6566l6905
$$ plain form
235 -56397 8708 11977 -34345 -9367 15208 -14979 -1736 31614 -1594 -19932 20063 19685 -9625
248 -9625 2644 5440 -9973 14948 19398 -27377 -13500 38889 4846 -39509 2598 23300 -16607
261 -16607 -14343 7587 -11473 -6748 19129 -5177 -18588 18706 13772 -17737 6827 15461 -24987
274 -24987 -5517 36014 -10896 -41014 24232 39423 -22844 -18937 28027 13996 -9296 -294
286 -294 -7413 -10158 8730 -8223 -31803 -1410 14381 -15158 -5851 24008 3056 -6335 28901
299 28901 22286 -15434 -2648 18606 -2149 -16912 -13456 -13904 3 6504 -20778 -15603 28848
312 28848 17900 -19992 6503 31281 -5672 -14842 15404 -621 -26258 -2597 6176 -15839
324 -15839 -5893 10956 -116 6828 21218 789 -2716 23989 6090 -27051 -2557 14009 -22896
337b2896n140L4191m425j7382J7473R950q040Q297J970j3762O481N335k1171k033
351a1152J6661j4130j2262K3415M633j9195J2221J7736j4809l869J4198r557j1185
364g295R855n599j2572J2386K003j6178J4059J8986j7934l867K6764m976k1317
377e685J3449N650k3854J713J5437j6858r541K0025M17j1540J3588O423j1894
390b670R986J0477j9690m220J8837j0820k0032J5020R337j8008J757J7864m854
403B984o159J0765J63p053N390p76j0830J957L393q995L54Q396m799j715J3100
418F175K718q756K798P155k530n309m588j104N613k976j1616N742J2217q972n126
433h559J5872Q25j3017Q467P750j5338k073J1825j0147q351J5026j173j2855J5443
$$ plain form
337 -22896 -28036 6155 1730 -15652 1821 11771 3731 12028 13998 236 6717 12052 -9119 -11152
351 -11152 5509 -8621 -20883 2532 7165 -12030 191 17927 3118 -751 13447 3890 -7295
364 -7295 2560 -3039 -15611 -3225 -1222 -17400 -3341 15645 -2289 -6156 20608 15632 -5685
377 -5685 7764 13414 -10440 -8727 6710 -10148 -19689 336 753 -10787 2801 9224 -2670
390 -2670 7316 17793 -1897 -6117 12720 1900 -18132 -3112 6225 -11783 -10026 7838 2984
403 2984 -3175 7590 7753 700 6090 5314 -5516 -3559 -166 -9161 -8807 -411 -5210 -6925 6175
418 6175 8893 137 2935 10090 7560 2251 -2337 -3441 2172 -804 -12420 -6678 5539 -3433 -8559
433 -8559 7313 8138 -4879 3588 11338 -4000 -6073 5752 -4395 -12746 2280 1107 -11748 3695
447C695J0267j9576L880K3125j6154j9352K2543N243k9185L302K1007j5147j0365
460a6717K0791j79j4008J5709R061j8450L861J6041j6829j1359J8711m076k0843
473a8287J3834J4363j9004j334K3659n444j5208J4977P192j7427Q21J0346j2944
486d456o959J2957m529j2135J3429R260j3637K916J7021p506j0862J2667K277
499A0443j6969J520J1121j0499q806J1695L232r002M929Q815m456o79P047l537
513D854n863M660o31q929J476N359n962k340Q434P27n523M650N686m330k270L297
529C295j094l044J01j717j292L423k05l549L995N036m070j958N455p95n828J478
545g69K421m490j259L860q96j949L336J740j306J717J087k239K63Q12l499k034
$$ plain form
447 3695 13962 -5614 -1734 21391 5237 -14115 8428 13671 -15514 -12212 8795 -6352 -16717
460 -16717 4074 3895 -10113 5596 14657 -3793 68 16109 -720 -12079 6632 2556 -18287
473 -18287 -4453 9910 -9094 -10428 13231 7787 -7421 7556 14748 -2679 -1858 8488 -4456
486 -4456 -11415 1542 -2987 -15122 -1693 7567 -6070 -3154 13867 6361 -4501 8166 10443
499 10443 -6526 -5006 6115 -4384 -13190 -1495 1737 -7265 -2336 6479 2023 1344 8391 4854
513 4854 -1009 3651 3020 -5909 -4433 926 -5036 -7376 1058 1785 -3738 912 6598 2268 -2 3295
529 3295 2201 -843 -742 -2459 -3751 -328 -533 -4082 -87 4949 879 -1079 4376 3581 -2247 -769
545 -769 1652 -2838 -4097 -237 -1133 -3082 254 1994 688 2405 3492 1253 1516 2328 -1171 -3205
561c205K380m19k388J662K432q9P42R69m50O30j90k780m41J125k899k160L385
578a696R33k837K660M911j107n73L519n83l206Q16j304m874LJ429l884p91M812
595a772J75j640M446K361k345K498K328n308j385M526l963o359M293K808n416
610d753J808O576k827j461P302q03p432L525L780q493l065O102l349n664O284
625b470K841n891M231Q159n136k756R028o80r548K705M952p534l761N755j297
640a402m143M922K045m436L609N133n538k033O872k318p791L483M373o167j752
655e143N886k72k267M057N35l239L397K707o380k233N605j457o439J706L881k376
671b032o61L235n5m92L166j70l482J438K677l759l300L029J387l410k71L120L63
$$ plain form
561 -3205 -825 -1244 -3632 -1970 462 373 1115 2084 1634 2264 2074 -706 -1147 -22 -2921 -5081 -1696
578 -1696 -763 -3600 -940 3971 2864 2291 5810 5227 2021 2837 1533 -3341 -3338 -1909 -5793 -6584 -1772
595 -1772 -1597 -3237 1209 3570 1225 3723 6051 743 -642 3884 -79 -6438 -2145 663 -4753
610 -4753 -2945 3631 804 -657 6645 5842 -1590 1935 5715 -2778 -5843 259 -3090 -8754 -2470
625 -2470 371 -5520 -1289 6870 1734 -1022 8006 7326 -2222 483 5435 -2099 -5860 -105 -1402
640 -1402 -5545 -623 1422 -3014 595 5728 190 -1843 5029 2711 -5080 -1597 2776 -3391 -5143
655 -5143 743 471 -1796 2261 2796 -443 2954 5661 -719 -2952 2653 1196 -5243 -3537 344 -2032
671 -2032 -2693 542 487 -5 3161 2991 -491 947 3624 -135 -3435 -406 981 -2429 -2700 420 783
688G83r40J343M74j169Q63N90k896j626K613M3l838M42M196m8k445K010K804q94
706B305q76L43j107j77P99k882k464L474J804m717l93O356O94m753J435M455j645
723B651k921N67k04j263N76j056k202K169K955k240j132L882J273k720M79J944
739B758j825j797J403l16k549N96K352j028j431K445K086j596j296J588M45j767
755F8j114j37p22N6N29p83k53J897J391k01O74O07o51P05J437k493l109K134K231
774B266l358k549K649K017j239p86K45J000J598j427k984J740L053l328l102L608
790e97K435k742P2K508m79N89K245k488k982L174J647m837k120K582mj146J015
807a128j079o71M257J612m307J75M577j144l455J682O63k540R83J916k682m44
$$ plain form
688 783 -157 1186 1660 491 1354 1944 -952 -2578 35 78 -3760 -3318 878 830 -1615 395 3199 2305
706 2305 1429 1772 665 488 1287 -1595 -4059 -585 1219 -3498 -3891 2465 3159 -1594 -159 4296 2651
723 2651 -270 297 93 -1170 -594 -1650 -3852 -1683 1272 -968 -2100 1782 3055 335 814 2758
739 2758 933 -864 539 223 -2326 -1730 622 -406 -1837 608 2694 1098 -198 1390 1835 68
755 68 -1046 -1183 -1905 -1849 -1320 -2103 -2356 -459 932 731 1405 2012 1361 2066 3503 1010 -2099 35 2266
774 2266 -1092 -3641 -992 1025 -214 -1000 -755 245 1843 416 -2568 -828 2225 -1103 -4205 -597
790 -597 1838 -904 -832 1676 1197 1786 4031 1543 -1439 1735 3382 -1455 -3575 -993 -997 -2143 -1128
807 -1128 -2207 -2878 1379 2991 -1316 -1141 3436 2292 -1163 519 1182 -1358 -375 1541 -1141 -1585
823a585L918l27l561J611K704k051k137J92k98O03R29l073k027N312L986m824
839f28k983N900M136l797l431J558J924o16k206k651K17K971Q6l708k04M570J030
856B168l730m51L465P63k845j395J082J466M77j772j840K707M277j540m392J551
872iM593r82m555r57J912J32j713j492q9J309J120j48jR50J044N98j62n66R9K46
892A329j063r51P72K37j089K05Q94k90O85J208j783j806K619J265l999j921K784
909i04O71j612N80N24o01K520K637k775j978L561J365l615j530J422n64j201K66
926a234l19l59J433O44r38R07J767q53j720R08J199j045j855j28J548O54q48m61
944g00J131R95Q7M9o42j227N38Q15j951j793R85N53p56P53J089p09O66K340j70
$$ plain form
823 -1585 2333 2006 -1555 56 2760 709 -1428 -1236 -1534 -931 -2 -3075 -5102 210 4196 -628
839 -628 -3611 2289 6425 2628 -803 755 2679 2063 -143 -2794 -2577 394 480 -3228 -3432 1138 2168
856 2168 -1562 -2013 1452 2215 -630 -2025 -943 523 1000 -772 -2612 95 4372 2832 -1560 -9
872 -9 4584 3602 -953 -1910 2 134 -1579 -3071 -3160 -1851 -731 -879 -880 70 1114 1712 1550 984 1083 1329
892 1329 266 -685 87 324 -765 -560 334 44 729 1937 154 -1652 967 2232 -1767 -3688 -904
909 -904 -233 -1845 -1265 -741 -1342 1178 3815 1040 -938 2623 3988 373 -1157 265 -299 -1500 -1234
926 -1234 -1553 -1912 -479 165 -773 134 1901 1048 -672 236 1435 390 -1465 -1593 -45 609 -239 -700
944 -700 431 1426 1513 1562 920 -307 231 1046 -905 -2698 -1713 -1160 -1916 -1163 -74 -783 -117 2223 2053
963B053j433Q15M13j587q6P85j658j342J430R98r70j29Q40Q1N71O11j343j334
981a285J108O43j830q76J167O19l17M58J027N32J16n1L10M96o25j616o55O10Q7
1000h2j153j225L48K114R30j605p22K284J526j495j545M13P44k19q00j001K38
1017a250J920J09j822R13K737p71k445Q07J806j393k134l1N55J44%q19k84K245
1035B87J740j368j003J743J088j191j215j8r6l63k15l94k81N25P82J1r0N33K84
1054G59l80m78L28j85j093j60R93k70o72J237J180q77Q2J753j10j660m4N67q58
1073A12q61n60p53N08J209p88j030J824J909j052p93J331M09j047k33J17q18l2
1091e48P89m26m54R20Q76l21l85K25L50l05j139o88M15o2j084j04R18N80J26K43
$$ plain form
963 2053 620 1435 1848 261 175 960 -698 -2040 -610 388 -582 -711 129 210 781 1392 49 -1285
981 -1285 -177 466 -1364 -2240 -1073 -454 -771 -313 714 1246 1362 1311 1621 2117 1492 -124 -779 -169 -82
1000 -82 -1235 -2460 -2112 2 932 -673 -1395 889 2415 920 -625 -212 532 313 -487 -1488 -1250
1017 -1250 670 779 -1043 -130 2607 1836 -609 198 2004 611 -1523 -1554 -999 -855 -855 -1674 -1958 287
1035 287 2027 659 -344 1399 2487 1296 81 63 -33 -396 -611 -1005 -1286 -761 21 32 -58 475 759
1054 759 379 -99 229 44 -1049 -1209 -216 -486 -1158 79 1259 382 464 2217 2107 447 403 970 112
1073 112 -749 -1309 -2062 -1554 -345 -1133 -2163 -339 1570 518 -275 1056 1465 418 185 302 -516 -548
1091 -548 241 -185 -639 281 1157 836 451 676 1026 721 -418 -1106 -691 -753 -1837 -1941 -1023 -443 -317 -74
1111g4N68Q68M47q31l74R18m70j979J86J287j421j347J850J245j594l11K115L10
1129A393j456j18P06l51n54l79m48N70P97o34k80J539N83q97L51R44j061j129
1147d24P38Q1j676p04J171N53r15k83J534J179o77n83J114Q38j321j038O66L16
1165E69j156n86N40L47J72L3j0M37O10m72l26K69n43r72O35N60j552n66K216J001
1185A206j670j44K167M84j321n22N05R7p67r46k12O84m6q40L48J318K36o28M48
1204C97O30j41n10j34l21n57j41L05r7o61J42J460N95r61j15J368L06j095n20
1223e0J09r1k78k56m28K95P19j88j65J068L27p21P4O74n90r39P2j30o63J24L85
1244f52m29L6J058N85k22K19L95J30J15k05p41k77J45j06m78m44R7M55K75m65
$$ plain form
1111 -74 494 1362 1809 978 604 1522 1052 -927 -741 546 -875 -2222 -372 873 -721 -1032 1083 1393
1129 1393 -63 -181 525 174 -380 -759 -1207 -637 160 -474 -754 785 1368 471 822 1766 705 -424
1147 -424 314 395 -1281 -1985 -814 -261 -1176 -1459 75 1254 577 -6 1108 1946 625 -413 253 569
1165 569 -587 -1173 -633 -286 -114 -81 -91 346 956 484 158 427 -116 -1088 -453 107 -1445 -2011 205 1206
1185 1206 -464 -608 1559 2043 722 200 705 802 35 -911 -1123 -439 -485 -1325 -977 341 577 -51 397
1204 397 1027 886 376 242 -79 -636 -777 -472 -569 -1230 -1088 372 967 6 -109 1259 1565 470 -50
1223 -50 59 -32 -310 -566 -994 -699 20 -168 -333 735 1062 341 415 1089 499 -440 -368 -498 -1161 -1037 -652
1244 -652 -1081 -1045 13 598 376 595 990 1120 1235 1030 289 12 157 51 -427 -871 -774 -319 -44 -509
1264e09j88P64K23o43J09M93l63l63K88K60J2P8k45J07Q25R0r66J26J074n57j126
1285e11N47M63j138m21R51m1r75L0Q65L67m03m07N99R79j58q04M54J017n00q12
1305A02N21M37q68p31L57L19o86r09J45R33J43j240K70J876J03j524Q25J831r04
1324A000j295J060R17j278p72N78L11m60m25k63N09M50q88o11J044L03j543m4
1342a407J664j39j633O47J854j10j322N83J488P7r99j92P41J60j095p95L81K01
1360A04j116o12Q03M23p99m79J124R09p16p41J230J234q78r36J261Q79j035m04
1378B51Q55qq42m5J12n39l69j93k72K59l7p81N04J636m86j417J560K013j657j375
1398h31J904P76k070n09J491j85j127P5O35L72o3q74l0J653j06k764k5K662q11
$$ plain form
1264 -509 -697 67 290 -353 -244 249 -114 -477 -189 71 83 161 -84 23 848 938 -28 98 1172 615 -511
1285 -511 36 499 -639 -1060 -109 -150 -1125 -1095 -230 137 -266 -673 -74 905 747 -57 397 1414 914 102
1305 102 623 1060 192 -539 -182 137 -549 -1458 -1313 -380 -237 -1477 -1207 669 772 -752 73 1904 1000
1324 1000 -295 765 1682 404 -368 210 521 61 -364 -627 -118 332 -556 -1167 -123 180 -1363 -1407
1342 -1407 257 118 -1515 -868 986 876 -446 137 1625 1702 703 511 1252 1412 317 -478 -97 104
1360 104 -1012 -1624 -821 -398 -1197 -1676 -552 357 -359 -1100 130 1364 486 -450 811 1690 655 251
1378 251 1106 1098 256 211 323 -216 -585 -778 -1050 -791 -828 -1609 -1105 531 45 -1372 188 2201 544 -831
1398 -831 1073 1849 -221 -730 761 576 -551 -476 159 531 468 -406 -436 1217 1111 -1653 -1678 984 173
1417A73l115Q03K836n92j649J258J940J01m49J29L84J13p73j213k15L7j281r24
1435b437Q44M24r30M65J970L92p91P92J493n11j414L58N54j374j340Q69Q30j253
1453a059o59J861J586j018j083J374J598j126k547l81J929k62l247p60L221J077
1469E04k617J70L834Q83k145L66K233n94k156m41N71n96j545q64O03J300l98j014
1487a906J363K208o45j275J245Q80j628o62Q51q11j362R92J115j179k60J677J013
1504A616p85n26N34O23m29j686p02J295K30k218m03K558O24k038M88K669J21k027
1522e6M1J687k23j930q57J147P62j269j091J212J723p26j269Q07J320n95j279
1539e96J7N89k40n85q4O06K86jM17N06k5q2K96j43q81k75J21n51o80K65M10j90
$$ plain form
1417 173 -2942 -2139 697 105 -1544 -286 1654 1755 1306 1435 1819 1932 1159 -54 -269 -232 -1513 -2437
1435 -2437 -1593 -1169 -2099 -1634 336 728 -63 729 2222 1711 297 655 1209 -165 -1505 -636 194 -1059
1453 -1059 -1718 143 1729 711 -372 1002 2600 1474 -1073 -1454 475 213 -3034 -3794 -573 504
1469 504 -2113 -1943 1891 2774 629 995 3228 2634 478 37 608 12 -1533 -2397 -1794 -494 -892 -1906
1487 -1906 -543 1665 1020 -255 990 1870 242 -420 431 -380 -1742 -750 365 -814 -1074 603 1616
1504 1616 831 305 839 1462 1033 -653 -1355 -60 170 -2048 -2451 107 731 -1307 -819 1850 1971 -56
1522 -56 -15 1672 1449 -481 -1338 -191 571 -698 -1789 -577 1146 420 -849 -42 1278 683 -596
1539 -596 -579 10 -230 -815 -899 -293 -7 -8 409 915 890 808 1104 961 80 -195 -74 -625 -1305 -1040 -630 -820
1561h20k4Q14O77j03j01L57K87m85p42k94L00j18o90l14Q24J034k91n88R94J081
1581A798o49j080L48K88r96q10J21q1j79M18J90J68P76P29l93N1P88k93j160%
1601C4J84p45m75K91j97K7Q46K68l23M89Q63m16m99K03k71n60l5k27o06M25O56
1622f8m47L3J073K29n52L08M65o46l26J17o86l31N99k82p29P71J019m91k76J066
1642H46Q8p41L22L08r14m69P00j35r09K82P12k87j7N83j25l03M67J36q32l7N43
1663B18m91n73O60M80p44JJ003J16p23K43M99m41l54J73j42k37K00K1k08L97K76
1684C74n67N8P61l86q18M36M27q01r6P15k62l07P62K09l69L77J59p99L43N58j237
1705d63r51J509M04j855J87K063l12j121J063Q00p93j88J85p45oL15j231o83J738
$$ plain form
1561 -820 -844 -30 647 544 443 800 1087 602 -140 -434 -134 -252 -942 -1256 -432 602 311 -277 717 1798
1581 1798 1149 69 417 705 -291 -1101 -980 -1061 -1240 -822 -632 -464 312 1041 648 699 1487 1194 34 34
1601 34 218 -527 -1002 -711 -908 -881 -35 233 -90 399 1262 846 347 550 279 -281 -316 -543 -1149 -724 -68
1622 -68 -515 -482 591 820 268 576 1041 395 69 186 -500 -831 -232 -514 -1243 -472 547 56 -220 846
1642 846 934 193 515 823 -91 -560 140 5 -904 -622 90 -197 -214 369 244 -59 408 544 -288 -325 218
1663 218 -273 -846 -186 294 -450 -449 554 670 -53 190 689 248 -106 67 -75 -312 -112 -91 -299 98 374
1684 374 -193 -135 626 240 -578 -142 285 -516 -612 103 -159 -466 296 505 136 513 672 -127 216 774 -463
1705 -463 -1414 95 499 -1356 -1169 894 582 -539 524 1324 531 343 528 -217 -223 92 -1139 -1822 -84
1724h4L77j631N15K196j53j136P02P60r39n45J81n50p17j38K48K22km6P41J375
1744A376j80r00Q17R11j267j523O09L86j416r60N43R63L10m29J14J546J343q43
1762A400j155Q73Q04j457j519K98K37j101q3J222Jp39J326J962o83j448J216J250
1780B404j709j729P71L23j275n73M02M69P66L12r24Q47K696q04l177J277K784
1797B860k338l011J826J294k165k3J886q20o39K374O05k068K59J660r14j018L45
1814A13p05n56J231k99j619J229K062j516j232K214J074k269p73J604J86j046
1830c02n94J40O26P98m75q06R18R63o60n32K75n41m24N83l1j293J33J518K51q46
1850b99J79R39M06o35n06M0Q0m24p78j43N69L53m21j92J197J353p23j101J008
$$ plain form
1724 -84 293 -1338 -823 1373 1220 84 786 1546 607 62 243 -307 -1024 -1162 -914 -692 -694 -740 1 1376
1744 1376 1196 296 1113 2024 757 -766 -157 229 -1187 -2147 -1604 -641 -331 -760 -646 900 2243 1400
1762 1400 245 1118 1922 465 -1054 -756 -519 -1620 -1703 -481 -480 -1219 107 2069 1386 -62 1154 2404
1780 2404 695 -1034 -263 60 -1215 -1788 -1386 -917 -151 161 -763 84 2780 1976 -1201 76 2860
1797 2860 522 -2489 -663 631 -1534 -1557 329 -491 -1130 1244 1849 -219 40 1700 786 -232 113
1814 113 -592 -1148 83 -216 -1835 -606 1456 -60 -1292 922 1996 -273 -1046 558 744 -302
1830 -302 -896 -756 -130 668 193 -613 305 1268 608 76 351 -190 -614 -31 -62 -1355 -1222 296 547 -299
1850 -299 -120 819 1225 590 84 124 204 -220 -998 -1141 -572 -219 -640 -832 365 1718 995 -106 902
1869I02J136j381j521N07O7j033LO12o91K24J832L42r90Q05J186r39n82N02r37
1888D4j355P99J83j788K03K113k99j076J769J555j197o09J252P5j519o49N0l45
1906g94k03k04k97N54R18K27j7O10M34k29j10o1m71q02k72J76j18o47k13J152
1926c67Q26p44LJ442N31j293j60J018n63j331K6O92n75o19M45M68N3M3K19K86
1946D00K8q4j66n5Q1j98l94K2L16j03l46L74O06l04o59N89O95o94p96Q08N73r58
1968b65m40J189J45j143K97R89o74r56Q86M57j258j25J161l30o82R68M42r74N96
1987B83J147j109j019J485N8k068L20J566j383j060K064O51j935P32K022j073
2003F81j197J671R9k159M22J405j667j060J540L11j198Q80J017r52L41J504q94
$$ plain form
1869 902 2038 657 -864 -357 -290 -1323 -1320 -708 -1399 -1175 657 999 9 814 2000 1061 479 981 44
1888 44 -1311 -512 -329 -2117 -1914 199 -100 -1176 593 2148 951 342 1594 1669 150 -499 -449 -794
1906 -794 -997 -1201 -1498 -944 -26 201 184 794 1228 999 889 828 357 -445 -717 -541 -659 -1306 -1519 -367
1926 -367 459 -285 -282 1160 1691 398 238 1256 693 -638 -612 80 -495 -1114 -669 -201 -148 -105 114 400
1946 400 428 344 178 123 204 6 -388 -366 -50 -153 -499 -125 481 177 -482 107 802 108 -688 120 693 -265
1968 -265 -705 484 629 -514 -217 772 98 -858 28 485 -773 -898 263 -67 -749 219 661 -313 283
1987 283 1430 321 -698 787 845 -1223 -903 663 -720 -1780 284 935 -1000 -268 1754 681
2003 681 -516 1155 1254 -905 -483 922 -745 -1805 -265 46 -1152 -272 745 -207 134 1638 744
2020G44j186J148K42j695jJ039j051o37J459L34j153N69J222m59k40N43m42n56
2038a20N20j73j077J60N37p21k3J157j58r20J066J180j131p44J028K00j171O8
2056c22N54o44k80Q17nn04M02M63n14K34O41p37q55J023N36j481l65J423q4j040
2076g38O62R05j102k67J259j60j235M71N39n72P3M52o85o5J214k88j095P93Q04
2095I65j150l04J095n06j096P63O07p19r0N56k14L09O81q21p07J172K82j520Q0
2114f17J033q15n94J264J43j234N42J328o42o41P49k6o61M02J22j118K07J019
2132D61q07o92J308M26j320L99J463o88j288Q53Q20j121o85Q50Mo37L34N15m55
2151b60K6P63r0l17M27l9p37L12N59j020o63J152L53j261R2J335k57q61O22O27
$$ plain form
2020 744 -442 706 948 -747 -748 291 -760 -1397 62 396 -757 -188 1034 575 335 878 436 -120
2038 -120 400 227 -850 -690 -153 -874 -897 260 102 -818 248 1428 297 -447 581 781 -390 -322
2056 -322 232 -412 -692 125 120 -384 18 481 -33 201 842 105 -750 273 809 -672 -1037 386 302 -738
2076 -738 -76 829 -273 -540 719 559 -676 -205 334 -238 -165 287 -398 -463 751 463 -632 161 965
2095 965 -185 -489 606 100 -996 -233 374 -345 -435 121 -93 216 897 76 -631 541 823 -697 -617
2114 -617 416 -399 -993 271 414 -820 -278 1050 408 -233 516 490 -171 231 353 -765 -558 461
2132 461 -346 -1038 270 696 -624 -225 1238 550 -738 115 935 -186 -871 -21 -17 -654 -320 195 -260
2151 -260 -234 529 439 122 549 510 -227 85 644 -376 -1039 113 466 -795 -703 632 375 -486 136 763
2171G63p28l46M87j7l90k0r1j9M51n0m25L68O74m54l57O61m2q00K03N69n92n20
2193f75N41L25l95P0K28jJ78P8l80j01M79k76n96M69L06p37j09R79j19q00N15
2214b1O98n98l87O37lp10J77M50m79j44M08K5j80L92j6l90L20L95o01m33O88l1
2236A97p54J73O44m25m17P07K82o00l1O89j31n33J23K16j98j62Q1O1J53O8j36
2257GL4L16j14l08J85K71m64m08M00K45n04k49O40J48m18n9O02J24m19p2K51J12
2279C20l77k50K69J62k09k17K18M63j70l36K73K79k80m68L20K69n46k79M66Q6
2299gl25QM77J40k64lK57J09k57k62L8K52k91l60K14M43k41k50M31K82l58j34
2321a01L96R2m12q6J21j8j78q9J20K99j86j68K41M36k85l46K89J58m19k65K47
$$ plain form
2171 763 35 -311 176 159 -231 -251 -342 -361 90 40 -385 -17 657 203 -154 507 465 -335 -132 437 -155 -675
2193 -675 -134 191 -204 -134 94 93 271 349 -31 -132 347 71 -525 -56 250 -487 -596 383 264 -536 -21
2214 -21 677 79 -308 329 326 -384 -207 243 -236 -380 28 53 -127 265 249 -141 179 574 -27 -460 228 197
2236 197 -557 -384 260 -165 -582 125 407 -193 -224 465 334 -199 -76 140 -58 -220 -139 -78 75 143 7
2257 7 41 357 243 -65 120 391 -73 -481 -81 164 -340 -589 51 199 -219 -278 324 448 29 -43 208 320
2279 320 -57 -307 -38 124 -85 -302 -84 379 209 -127 146 425 145 -323 -3 266 -280 -559 -93 -7
2299 -7 -332 -324 153 293 29 26 283 392 135 -127 -89 163 -128 -488 -274 169 -72 -322 109 391 33 -101
2321 -101 295 387 -25 -111 10 -8 -186 -275 -155 144 -42 -210 31 467 182 -164 125 283 -136 -401 -154
2342a54Q2j95O1R1J24N9J0jK09Q1l04o2L54k91m27L30K28l98j31M33J7k68J29
2365b3J63k48J57Q4m08J38L05k18l78M27K11m06K28L51l06j09L90m7n16K14K68
2386B77n20m2L43j82j97M39j7m23L37L76m85j45M75p0m22J12K54k86N9L51j58
2407G6k62L61J36l69KK84k56j73K52j04k93K31L07l80j04N82J7l74J08K29k12
2428E8j05J65k13p6K02j18k31K70K24k30j29L51M0l44J13J20j45l3J34j08k26
2449b81L46R1j56JK71n2j19O1j39o9J95j90m28K97L56l79j95L32K20k15M3J02
2471I2j5k4J77j90j57J46J62k01m1O1P7L8O9j52j62J60J46k45k33K03K37k37k26
2494c15K64K02j87j99M02N7k28N2J59k76q6L11o1l41K08J65j21l7L8o4N3K27k65
$$ plain form
2342 -154 -72 -267 -206 -115 9 68 78 77 286 367 63 1 355 64 -363 -33 195 -203 -334 99 116 -152 -23
2365 -23 140 -108 49 133 -275 -137 168 -50 -428 -1 210 -196 32 383 77 -32 358 311 -205 9 277
2386 277 -243 -285 58 -124 -321 118 101 -322 15 391 -94 -239 236 166 -256 -144 110 -176 -117 234 76
2407 76 -186 175 311 -58 -56 228 -28 -201 51 -53 -346 -115 192 -188 -292 290 307 -67 41 270 58
2428 58 -47 118 -95 -171 31 -87 -318 -48 176 -54 -183 168 208 -136 -23 97 -48 -81 53 -55 -281
2449 -281 65 156 0 1 272 220 101 162 23 -46 149 -41 -469 -172 184 -195 -390 -58 162 -53 -10 92
2471 92 77 53 230 40 -117 29 191 -10 -51 10 87 125 194 42 -120 40 186 -59 -292 -89 148 -89 -315
2494 -315 -51 151 -36 -235 167 224 -4 48 207 -69 -155 156 95 -246 -38 127 6 -31 7 -57 -4 223 -42
2517d2k86M16J20l51r9L63p3k73K61J29k31O4J34j68J05P2k84mL39k06k42K85
2539B9J86m54J66M76l79k96N29N7n52J61L89l49j82L80j46k58L09L3k88K01J91
2560B03m67N0N43k50n03K47M56k17l07K03J26N3l1j03JP9%Ok0j90QL05p7l36N4
2585a67K72L6k43j5J54J19j05l70J15M97j12o60J85O70k16m33J63K60Pj15J1j48
2607i5N2K63j19k19k5J00J56J02k68k61M39L68n76l75N66J84m12k06K87J35j09
2628a3j60l2K71K38l93j63L73K29m03q6J97on3J63j97k06K53K91k39l03J40K70
2650A71M7k84k03J42L18j40l96J51M09j32k48R3K15j3q0j30P8J99n5l09M9K26
2672A08L3j53p3k0J67J02j00k75J27L09l1k88k03L19K02k22k88J71L06j12k11
$$ plain form
2517 -42 -328 88 208 -143 -242 121 48 -225 36 165 -66 -2 132 -36 69 141 -143 -147 192 -14 -256 29
2539 29 215 -239 -73 403 24 -272 257 314 -238 -77 312 -37 -219 161 15 -243 66 99 -189 12 203
2560 203 -264 -214 329 79 -424 -177 279 62 -245 -42 84 137 106 3 4 83 83 89 69 -121 -113 192 115 -221 -167
2585 -167 105 141 -102 -117 37 156 51 -319 -204 293 181 -479 -294 376 160 -273 -110 150 157 42 53 -95
2607 -95 -43 220 101 -118 -143 -43 113 215 -53 -314 125 493 -83 -458 108 292 -120 -326 -39 96 -13
2628 -13 -173 -205 66 304 -89 -252 121 350 -53 -139 58 52 -1 162 -35 -241 12 303 64 -239 -99 171
2650 171 218 -66 -269 -127 191 51 -345 -194 215 83 -165 -72 143 130 50 -80 -2 197 142 -167 -118 108
2672 108 141 -12 -85 -105 62 164 64 -211 -84 225 194 -94 -297 22 224 2 -286 -115 191 79 -132
2693a32P1J42l2o8K3j58O6K10q4k50K34K11k22j58K53K0m2K9q1j72J86K28m11
2716a37k14M04K39m61p0K36J06j32K4l7j22J22J68j48j50J10K39j10p4k6J36R2
2738A95j68n2J03j6j7p1j6J7O6p4j95R5L45k11k41J96J50j29m6J65j26j34K67
2761A03R4m12K0L39J6j95j9P4J14n3n7r4N5J18o0k07P8J27m0j59M3K19m3j21Q1
2786B1R4o8q4Q0N3k79J44J80j28k05J38K78k23p9J45P2j22j3p7j2J63Pk41K2L05
2811A71j01k96K21K42k43j48K28j3j19q5J51l1j58J13O9J2p5l0J85R2j42j00J32
2834G5M5j23l8O7M4n8q0j0J21M9k71J29K73j73l12K43K39l47j49L06j3j97J58
2857b2J67j42m3Q1m0J8J01j84q1L16Rl22N4L07j81k40K49J25k91j2K55m2j91M9
$$ plain form
2693 -132 -61 81 49 -19 4 -154 -88 122 38 -212 22 233 11 -147 106 126 84 113 32 -140 46 274 -137
2716 -137 -351 53 292 -169 -239 -3 103 -29 -5 -42 -164 -42 126 -22 -172 -62 177 67 -7 -33 103 195
2738 195 27 -25 78 62 45 -26 -42 -25 41 -33 -228 -133 212 1 -240 -44 106 -23 -69 96 -30 -164 103
2761 103 197 -215 -195 144 160 -35 -54 20 134 81 24 -70 -15 103 43 -164 -86 41 1 -158 -115 104 61 -60 21
2786 21 115 47 -37 43 96 -183 -39 141 13 -192 -54 224 1 -78 67 139 17 4 -73 -85 78 85 -156 -134 171
2811 171 70 -226 -5 237 -6 -154 74 61 -58 -143 8 -23 -181 -68 1 13 -62 -92 93 185 43 -57 75
2834 75 120 -3 -41 26 70 12 -68 -78 43 92 -179 -50 223 50 -262 -19 220 -127 -276 30 17 -180 -22
2857 -22 145 3 -40 41 1 19 120 -64 -145 171 180 -142 -88 219 38 -202 47 172 -119 -131 124 82 -109 -60
2881f0N8M3m5j10n3K94r3k07J47J93j30j63J76O9j82jJ52Rj57J2J5P1j2j36J70
2906F0Q2j62j72K94Q6l77r3L71M0j69r0P4K07n3j68l9K11L1k60M3K66j47k33K25
2930B7J91k25j64L05O9k41l9J66o1o8p3oJ93j37j77K25J52k16j24K11K16j80j63
2953a19M3J00J1j33nJ53K2j70K1L24j79k49K39K81k91l05L04J48k89j15K93j4
2975G0j05o0P4Q9L7j97m2L00Ql54kL06mk63r9L89o8j32M1J16l7j67J00J57r6k47
3001a86J69J40j74j21N5J83qk1J2J4O9j35l8O4R3j84j32K25L1k33k0L04Lk01J43
3026E2J12n3r4l4J32n5j25PMP1j12m4K00P4j30k6J42l9m7n1lJ9p1J4J0P4n0p1
3054i4J58R9j41k6J95j7k28PJ15r6j24J18k9o1J42L6o4P1N8j03M3K6q0r5k0O9
$$ plain form
2881 -60 -2 41 -4 -114 -167 127 34 -173 -26 167 37 -126 50 119 -63 -64 88 97 -60 -48 -33 38 26 -110 60
2906 60 142 -20 -192 102 188 -189 -282 89 129 -40 -130 -56 151 98 -70 -109 102 133 -127 -84 182 35 -198 27
2930 27 218 -7 -171 134 203 -38 -77 89 28 -40 -113 -119 74 -63 -240 -15 137 -79 -203 8 224 44 -119
2953 -119 -76 24 35 -98 -103 50 72 -98 -77 247 68 -181 58 339 48 -257 47 195 -94 -209 84 70
2975 70 -35 -95 -21 68 105 -92 -134 166 174 -180 -182 124 120 -143 -242 147 79 -53 -12 104 67 -100 0 157 61 -186
3001 -186 -17 123 -51 -172 -117 66 58 37 49 63 132 -3 -41 23 116 -68 -200 25 56 -177 -197 107 110 -91 52
3026 52 164 111 17 -17 115 60 -65 -58 -54 17 -95 -139 61 135 5 -21 121 82 35 -16 -19 0 -71 -57 -47 27 -23 -94
3054 -94 64 163 22 -4 191 174 -54 -47 68 -28 -152 -34 -63 -124 18 54 -10 61 119 16 59 85 5 -90 -110 -41
3080d1n7k8P1nJ1R9L2J8j0J6Kj8n8o8K9Oj30N4J17j12OJ94j1j22P5M4j00j1L1
3109C4j21o1J09j33J4J07M0j00J70J09j11k6J52l3j71J22o1j78Q2k0r1O5J30p1
3133d3Q8J40n2j83J41J07j63j38J28o2j85J68L7q7Q3N2M2N4N0o4k5K3j38q1J45
3158C7o2j51O4J23p1K5R5P9o0P8j47N8L3j53j09L5J63j99p9K38J00k24J02K28
3182B03l2j31K6K0N5j51j25Q7Kk9j46J92J72k18J1K23K8j01q5O9n8o3j03k0J31
3207d3o9r1J53K24j08j37K03J67k04j40J84qk21m3Q9m0k7n6J36J97n3k13K21J35
3231B56j69j88P3J87k28j52P6Q4j5k2M9J24M7j16L8J90r0k12mK51j82j92O7N9
3255f9J1m4J00J51np9l7J70n8j98n9J43l0k28P0Q4mj03J82J25k8j6J8M4j9j31
$$ plain form
3080 -41 -98 -126 -55 -60 -49 50 82 100 90 106 108 90 32 -36 -7 -1 -131 -77 40 -72 -66 128 117 -5 70 114 14 3 34
3109 34 -87 -148 -39 -172 -158 -51 -11 -111 59 168 57 31 183 150 -21 101 40 -138 -56 -76 -167 -102 28 -43
3133 -43 45 185 133 -50 91 198 35 -103 25 -37 -222 -54 -17 -104 -21 31 73 127 177 113 88 111 -27 -108 37
3158 37 -25 -176 -112 11 -60 -35 60 139 79 157 10 68 101 -52 -161 -126 37 -162 -241 -3 97 -127 -25 203
3182 203 171 40 66 86 141 -10 -135 -48 -46 -75 -221 -29 143 -75 -64 159 187 86 1 70 12 -51 -154 -174 -43
3207 -43 -112 -203 -50 174 66 -71 132 299 95 -45 139 131 -90 -133 -44 -84 -111 -167 -31 166 113 -100 121 256
3231 256 87 -101 -28 159 -69 -221 -145 -61 -76 -98 -49 75 122 6 44 234 144 -68 -72 179 -3 -195 -128 -69
3255 -69 -58 -102 -2 149 144 65 28 198 140 -58 -117 26 -4 -232 -162 -78 -82 -185 -3 122 94 78 96 140 121 -10
3281a0j03Q2O0k01PJ52M2j23J06J19nj8q3J27o8j08r1Q0kj39m4J57Q4j32P2J76
3307A37l2n7k8L9l2%o8l5j0J0o9L2K07r1n5J35P8n8l9J1J9r6r4J9kl2o7Q1Q3j2
3337b6j3J45J06j38n9J42n9q3k0l2l0RN2p1N1J11m3mQ4K2r3j3L4p5p1p1P0K0r4
3366a49P1M5K1J3O5N8K6j72K0R4p5j35Q5l5k7Q0l2O8K4N6o0L3j9j9o6j0J41j72
3394g1n9M3J22m8j2j2R0ql3KL2l3l1J2P4j90M9QM7k0j2J45m4QJ4pn2M0j22J8K5
3425b5J0j38M0J66l8j27J06R3L1j03K4j0L3o8m6P0m1o1j4O2R7j56J06R8m0o3M3
3452D9pk6n8k5L7k0p2L4R7J24k00K1J25K1j17j30J77J10j72pKJ17o0j15Q8K3L5
3479E1r7N8P6j12k3Q7pl9j04M2J12q0p0M3J31k4j24O6J37j03j06Q2J36j50j25
$$ plain form
3281 -10 -113 -31 29 -172 -165 -13 29 -94 12 131 126 108 25 152 84 -24 -115 -35 -37 -176 -220 -63 21 -111 -39 137
3307 137 105 48 20 59 27 27 -41 -76 -86 -76 -145 -113 94 3 -52 83 161 103 64 75 94 -2 -96 -77 -79 -111 -178 -97 -14 -26
3337 -26 -39 106 212 74 15 157 98 15 -5 -37 -67 -58 -6 -77 -26 85 42 38 122 144 51 38 72 -3 -74 -145 -75 -55 -149
3366 -149 -78 -33 -12 1 66 124 150 -22 -2 92 17 -118 -33 -68 -95 -15 -47 21 45 101 41 74 55 36 -30 -40 101 -71
3394 -71 -130 -87 35 -13 -25 -37 53 45 12 14 46 13 -18 -6 68 -122 -73 -65 -18 -38 -50 95 51 59 73 66 14 54 -68 -50 -25
3425 -25 -15 -153 -113 53 15 -112 -6 87 118 15 39 29 62 -6 -52 18 -23 -84 -98 -36 61 -95 11 109 69 6 49
3452 49 42 16 -42 -67 -30 -50 -122 -88 9 133 -67 -46 79 100 -17 -147 30 140 -32 -39 -37 80 20 -95 -7 16 51
3479 51 -46 12 88 -24 -47 40 33 -6 -110 -68 44 -36 -106 -63 68 44 -80 -14 123 20 -86 -4 132 -18 -143
3504a43J58J5q9l1Q5M2P7j24j0R5%n8QQ6p8j07M6J49j81r8J07R9l9j18K3J13M2
3531F9j99K1J87oj95L9K11q1j58P0Q5m1k7L7j3J21p6n4J10qj68n6K05k3j66l3
3557a49K73r7j22N7P3Om1k0R5Lj13l6P3L6j99P9J23k0j46M1J77q0o6R8nK6n5o1
3585e0mJ52j88p2J64J09j68l7J52L5j35mJ41k1o3k4J5j3n2n1R8L0k7n4J75j2q5
3612A1m6J38m2k2j11P4J6p6o6M0Q0L8j12O7J00o8o8J00L8q7p1J04j5j34J14m5
3638d3Q4Rj00P9J08m9j42O0P6j39L2K6k0j12K3O1m9O1M5o0P5P4j06n7J30K7k13
3665a20N4J43m7j24J04N1k8o9J02k5l1K9K7q7K4J2j01N5O0j2l5P1J9k0k7K4L6
3692H5q0qJ4K5q2n6J14J0o2O0Q1r6j22J65j5l1n2K4l9O3N8p5kM4l4k3Q4l1l7L0
$$ plain form
3504 -143 15 30 -59 -90 -5 37 114 -10 -20 75 75 17 25 111 33 -74 -28 121 -60 -158 -51 48 9 -109 -86 27 69
3531 69 -130 -109 78 72 -123 -84 127 46 -112 -42 43 2 -25 12 -1 120 44 -10 100 92 -76 -132 73 50 -116 -149
3557 -149 124 27 -95 -38 35 41 0 -20 75 78 -35 -71 2 38 -161 -82 41 21 -125 -84 93 13 -53 45 40 66 11 -50
3585 -50 -54 98 -90 -162 2 111 -57 -94 58 93 -42 -46 95 74 11 -13 2 -11 -63 -114 -16 14 -13 -67 108 96 11
3612 11 -35 103 61 39 -72 2 18 -58 -124 -84 -4 34 -78 -11 89 21 -47 53 91 4 -67 37 22 -112 2 -43
3638 -43 41 50 -50 29 137 88 -54 6 82 -57 -25 1 -19 -131 -108 -47 -96 -35 10 -50 25 99 -7 -64 66 93 -120
3665 -120 -66 77 30 -94 10 61 33 -36 66 41 10 39 66 -21 3 15 -86 -31 29 17 -18 53 72 52 25 49 85
3692 85 5 -3 11 36 -46 -102 12 22 -40 20 101 5 -117 48 33 2 -50 -26 -65 -2 56 -19 -21 23 -11 -34 50 19 -18 12
3722A2k5L4r6L5K7m7K3PN2K6k9j2J6O6j07j6J13rj26j0J32j28K8K4K1k4PR5r2
3751cp6J12n6Ok0J5k2K4k4K1k3R8Q2j12l9N6K8o2K4Kj0q8J4J29k9j39O0N5n1M3
3781A5l6N1ql0RJ8j9Jk2j2j3qM1N0q0J6L6k5J8MJ0rqjjQ3o5l2K0OM0j40Q3N0m8
3816fk9O3K5r4N4N4q1o9R0J0qj8Mj0q7J18k4j0R1nN8j15M0oj25P6l0l1j00R7N7
3847a1o4K7J7L6o4J27l8j6J7j4%p3K2QK9m2P9l4rN9J2k6L0j2m6n1j7m8M2K4l0
3878f6k4J03m6L8L3L6ll1P4j17j8N7l0k1l1%J6MM5P6o4M2l5M4j24M4O7p3o4L3
3908c5RO1j8K3jJ7k7l8k7O9m0o0O4Jm2j9L3%Nk8J33k1j3Jnll8M8j11N0L7o1n9
3941i5J22J6l5JP2q0j6L5l0Q%L1p0O4K6k1p8J12o1p8J21lo0k5J21o5q9L3P5k3
$$ plain form
3722 12 -13 21 -75 -40 -13 -60 -37 -30 22 48 19 7 23 89 -18 -34 79 70 -56 -66 66 -62 -34 -10 11 -13 -6 89 -3
3751 -3 -79 33 -23 -17 -37 -22 -44 -20 -44 -23 -46 52 134 22 -17 39 67 5 29 31 21 -67 -53 76 47 -92 -32 23 -28 15
3781 15 -21 30 22 -8 1 19 0 1 -21 -33 -46 -54 -13 37 -43 -27 9 -16 2 6 16 7 -1 -2 -3 80 15 -17 3 9 49 -91 -8 42 -6
3816 -6 -35 28 53 -41 13 67 -14 -83 7 17 9 -9 -5 -15 -102 16 -8 -18 73 68 126 11 51 45 -80 -4 -34 -65 -165 -68 -11
3847 -11 -75 -48 -31 5 -59 68 30 14 31 17 17 -56 -34 -26 3 -39 40 6 -3 56 68 42 72 60 14 -37 -54 -102 -60 -36 -66
3878 -66 -90 13 -33 5 38 74 71 40 114 -3 -21 36 6 -15 -46 -46 -30 -26 19 95 31 73 38 82 -42 2 69 -4 -68 -35
3908 -35 -26 35 17 40 39 56 29 -9 -36 33 -7 -67 -3 -2 -44 -63 -30 -30 -25 -53 80 59 46 47 42 39 1 49 -62 -12 25 -36 -95
3941 -95 27 43 8 9 81 1 -15 20 -10 -2 -2 29 -41 23 49 28 -50 62 1 -77 44 41 -19 -44 77 12 -77 -44 31 8
3971Hq9J02J4n6M0N8j9j2n3K6l1K7Ro3qM9K6j14J23L0q0l5P2m5Nm8P3n0J5J3J9
4002FK9q1N3J3j1m1l4N6l3LJ6Rl6K8M3l6L6N1r9QJ08l9m2k4R9o6k7K7J5Lk7N9
4034F6m1k4pK8Kk6j0rjl4K8m3L0P6p3QM6L7p6OjK0l5K1M7k8%Kp0M8L8n1j1Q1m5
4069aj5K9%l9k7R5l5m9M0M3q2Q3j2qn0O6j7n7N5n4QO6J1mq8M2R6r6K1L9m8q7J10
4102C5l2Jj7K1j7M3J0p0j0Q5qm1J2L9p5j3JJ2j1nM1M0k6K1m4NM8ln7j2LJ4K8n8
4136d0K5L7j7K3m6M0NoJ1n6j7M1l5K2plj4P8Pl8L6l6M1l9O1r3RM3k1q5j0J31m5
4169Bm9K7N0l6j4M1m1m0L5J2k9N6M8n4o5P0l1L0J5Ql1l3O1j0l2n5R1n1K4N3m0
4200A2l%L9p7L6J8l8J8Om3j6L5Rj8J7K9Jl2K6L7k7m7L9l8k8M1l0KJ9M4k0J3N6
$$ plain form
3971 8 -81 21 35 -21 19 77 58 46 -7 19 -12 15 24 -39 -47 2 28 -86 37 67 -13 -48 24 -21 -16 -64 9 -41 -26 -13 6
4002 6 35 -46 7 20 9 -32 -66 -10 -43 -40 -24 -15 -51 -23 20 -16 20 71 -28 -20 88 49 7 -17 82 16 -11 16 31 34 7 66
4034 66 25 1 -6 22 24 -2 -12 -21 -22 -56 -28 -71 -41 35 -38 -30 16 53 -23 -17 -18 2 -33 -12 35 7 7 9 -61 -13 25 -26 -37 44 -1
4069 -1 -16 13 13 -26 -53 42 7 -42 -2 41 -41 42 30 22 -28 38 21 -36 19 -35 -27 39 50 46 -42 0 96 0 21 60 12 -75 35
4102 35 3 4 -13 8 -9 34 44 -26 -36 49 41 0 12 51 -24 -37 -36 -24 -35 -40 1 41 15 36 -8 -3 45 42 -15 -27 -24 -10 18 -40
4136 -40 -15 22 5 28 -18 22 27 21 32 -24 -41 0 -35 -13 -20 -23 -37 41 48 10 46 10 51 12 73 -20 -11 32 11 -74 -84 47 2
4169 2 -47 -20 30 -6 -20 21 -20 -60 -25 -13 -42 14 62 8 -57 13 -18 12 27 35 4 -29 32 22 -10 -65 26 -25 -1 52 12
4200 12 9 9 48 -29 7 25 -13 5 11 -32 -48 -13 -4 -22 -5 24 25 -7 19 56 29 -18 21 -17 -45 -4 -34 -32 -13 31 11 24 80
4233H0k3o8P3k3n1j9j9M6j0K4p8J8J18n5qj2L0J8m0j0mj9%N9l6qP8p3J1L7o5J8
4265a1oL2n5J0N8J0m8k6oN9l1J9rL8jL0p2OP7j16j3O6L2n1n8P6l7K8j0J3J7PJ6
4298D4o0J1lK9k9k9Q9p5m1O4K5o0J0k2M4m0L7L7n0j3N9%p7R0j0m2l0R1m8m1J3
4329b7O8p9L7j0n4L8M8n0m9J21j1n6M6K1o1m4J22j6q3K0M1q4N1O3k8n6J32Pj12
4358eqL8l3k3J4Lm4J02jl2j0O9J5j20JR3m6r9Q4o0N4Qk3n6Q4K7l1K1Rqn0K4J6
4391A3l0RnJ0j2M9K0p8J5k3J9J1L4m1l6Q0Qr8L9L2k1J4KO8m8qQl9J7o1L6N4n8
4424b0M4p0M6NRlj1j7L6k9J2l6NQNJ0J5j1J2nN0j1l5P5m8l1l2P0l6l2O0p3j6N9
4458EL2o0M5L2k9n9L7jn2kO9n9m2Q7PlK0J3l9kN6n7l1m1Q6l8JQ0n3J7j8m6Q0l8
$$ plain form
4233 80 57 -11 62 39 -12 -31 -50 -4 -14 10 -68 -50 68 13 5 -7 23 41 1 -9 -13 -32 -32 27 -9 -17 61 -12 -1 36 -29 -11
4265 -11 -17 15 -40 -30 28 38 -10 -36 -42 17 -14 5 -4 34 33 63 -9 -3 74 -42 -55 11 43 -8 -66 10 -27 1 -9 4 21 28 44
4298 44 -16 -5 -8 21 -8 -37 52 -23 -64 0 25 -35 -25 -47 -3 -43 -6 31 -19 -32 27 27 -50 40 30 -12 -42 49 1 -40 -27
4329 -27 41 -38 -1 -11 -65 -27 21 -29 -78 43 32 -24 22 43 -18 -62 60 44 -39 -19 22 -62 -11 52 24 -32 100 107 -5
4358 -5 -13 25 -8 -31 -17 -14 -58 44 43 11 1 70 85 -35 -34 59 13 -86 -2 -62 -8 0 -23 -79 5 32 1 22 31 23 -27 -3 13
4391 13 -17 -8 -13 -3 -15 34 54 -24 -9 -32 -13 -2 32 -9 -45 35 43 -55 -16 16 -5 9 11 79 31 23 31 -8 9 -52 -16 38 -20
4424 -20 24 -46 0 5 14 11 0 -17 19 -10 2 -34 -29 -21 -16 -6 9 -2 10 5 55 44 9 84 36 5 -27 43 7 -25 35 -38 -54 5
4458 5 37 -23 22 54 25 -34 3 2 -50 -52 17 -42 -84 3 10 7 27 40 1 -1 55 -2 -33 -74 12 -26 -25 55 2 19 1 -45 35 -3
4492cK2L3p1J6Om2N7p1K4K0P4q9KQ2n1k8N8m5J8Ok8o8O8J0J8k7M6m3k2P6l5lr
4525Aj9m0rL1j5K5N6r9J7J13j4k3k0K0qMk3L4n0J0K4k8M6L4n4J8NP0j33K7jq1
4557h2N7Kj8%P5k2Qm8K5L3LJ3m7K7mm1m3L0j0Q3n2L4n5J7P7j2o3j8Mol9J09j19
4590h2O4J5J3k6RM4k8m7Q5l6n8L0K9l2q0P0N5o7N9K4NRj0p5Q2j7Ko3lk1J1N6K7
4623D4o5NL5Jn6O4N0o0rj5J2m4J9N7m9L9N2j65N9N6M2n0L2Jr7K7M8m8kM8k4n2
4655d5P8N3p7l6N9k7p8O6K4m6NM4No7N0k4KO1L7p9RJ4o0l4Q4J4l8nn9K2M9jOK1
4689B7J3o6nO3J5m4l0Nl9P1K2n8K4R0o8j2P4q4K8lj2lj9M9p7L5pJ24j05L6k8n5
4721c9nO9j7p2O6Pm2J0M6m3K4l5jn2J46lp4J6K5k8K4Jk3k5j4P1r0lR8K1p5K4O
$$ plain form
4492 -3 19 52 -19 -3 3 -39 18 -53 -29 -9 65 -24 -22 60 9 -19 39 -6 12 18 -10 -78 -10 0 18 -9 37 -6 -28 48 13 10 1
4525 1 -18 -58 -67 -36 -51 -26 30 -69 -52 61 47 24 4 24 16 20 -3 31 -19 -9 15 -13 33 67 13 31 36 106 -27 0 -1 -82
4557 -82 -25 -23 -41 -41 34 12 20 -28 -3 30 33 46 -1 26 22 -19 -62 -32 -42 41 -11 23 -32 -15 62 50 -13 -31 -27 -33 -72 37 -82
4590 -82 -18 -3 10 -16 -7 37 9 -38 47 11 -47 -17 12 -20 -100 -30 25 -42 17 41 46 55 45 -30 52 35 37 -26 -29 -50 -39 17 44
4623 44 -21 -16 19 20 -36 28 78 18 9 -6 6 -38 -19 38 -11 28 80 -85 -26 30 72 22 54 55 -42 -15 33 -15 -17 31 7 -45
4655 -45 33 86 9 -27 32 5 -73 -7 17 -29 -24 20 25 -42 8 -16 -14 47 84 5 14 28 -32 -66 18 32 -6 -11 -70 -48 1 0 6 27
4689 27 40 -26 -31 32 47 3 -27 -22 -61 10 32 -26 -2 88 20 8 82 -2 26 23 11 8 -11 38 -39 -4 -11 113 8 44 16 -39
4721 -39 -44 25 8 -64 2 9 -33 -23 23 -20 4 -31 -32 -84 62 59 -15 1 26 -2 22 23 0 -25 -39 32 -58 -61 37 58 -17 7 13
4754A3m6J9N9j05K5N8m3OQ1l1q5K0R5j01QO4j7m1J6L5l0l7R1Rj31J07np8L1N9
4784D6r0L3L7J1k9l0L7J3m0O1J8q8k4J03q3qO7j5j6mPJ1jK9k8L3ml0pl0nl1j5
4817g2R6k7ON4l3j9j4l1L3l6L6j2n6M6%k0N3M5j6l2L4m1N2q6L4Qj8l1P5l7j3M1
4849A9j7j6K7J5%l1k7N7j3Mq0L9N1o5mQ1l0K2L0j0l3J9o3N4n2Mk9L0m9O9k4J0
4881a2pQ0n0mO7m3m6N7l8j6j4J5o1L8N1l1O3l4j8nqO3m3mjpj6j7jM2J9L3q3P9
4915D8M2p6L1K5q5ll6O2pm1K4O2p6J4Q9n0K0j9j9n0O0o7M5Rl6k5Q1Rl1oP3m7m1
4948b1N1j3n3J6On0O4j8jK2j1M0j4nN6p3RN2o1m5J8N7j22K3R3m6k2P1m4k4oQ5
4980C4o6N1k1J0n8j6P1n6j3M8P3k3JkL2l7Jm5l6P7m6o5P7O3m9K4Ol5k5J04o5q
$$ plain form
4754 13 -33 -14 45 -60 -35 23 -20 -14 67 36 -49 -29 66 -35 -27 37 20 -21 -5 30 0 -37 54 63 -68 39 34 -44 -13 46
4784 46 -44 -11 26 37 8 -22 15 28 -12 49 67 -21 -45 58 -25 -33 34 19 3 -1 6 17 16 45 17 50 46 16 9 -21 -26 -57 -72
4817 -72 24 -3 3 57 24 5 -9 -40 -7 -43 -7 -19 -75 -29 -29 -49 4 49 33 1 35 -6 46 -40 -6 2 -16 -47 28 -9 -22 19
4849 19 2 -14 13 28 28 -3 -30 27 14 18 -62 -23 28 -37 -41 40 10 32 62 52 19 38 -25 29 -23 -19 -48 -18 -67 2 -22 -12
4881 -12 -19 61 11 7 74 31 -15 42 4 -12 -26 -11 -72 -34 17 -14 49 15 -3 -8 -16 47 4 0 -1 -8 -24 -41 -42 0 19 52 -31 48
4915 48 90 14 45 70 -15 -18 -54 8 1 -40 -16 46 -30 -16 73 23 43 24 5 -45 15 -52 -7 2 -34 -59 22 31 0 -6 67 20 -21
4948 -21 30 17 -36 -20 -14 -64 0 -18 -19 3 -8 32 18 13 69 -4 5 57 -4 -49 -31 26 -96 -73 20 -26 -48 23 -21 -45 -51 34
4980 34 -32 19 -2 8 -50 -66 5 -51 -64 -16 57 34 35 33 65 28 29 -16 -52 25 -21 -86 -9 54 5 29 35 0 -25 79 14 6
5012FK0o9k2%N7m5JR6r0K0O3J5o2J2M5n9M0k7K7p9M2L2j24J20M2n0k6J1K4K0l5
5043EN2q4P1N5j22j3L7j1o2J42q1j4K2M4l1n6O3P4j05K7M2n9o9J33r1J5rK6l5
5072c4P2l9pj8JK0J1K9j9j0k1M6k5oM3l3k0P7j5r5P8m4mk5P6o9Q0jj3o2jO2j02
5105f8J9L1L3l0l8L6%K4k0k7j3M3L8pNK2j02N5O0j00K6L7k6kJ4Ok9L2KQj1J8K
5138C8m2O0p5m8J3Q0k5q5Q3L4r4kQ7o0MP2m0l4L4N0j20P8k1L5l5K5K6k9J0kLp
5170A3N0n2l5NL4n1K8m4L5l9R6m6k5N5M6o5mO3n3n9QK6OK4np5m0R4M9l3PL0m2
5203AN9j5p9j4N4K6l9OJ6n8P9mMO8l1o1qJ1M4l6j0m4j4O4J9k2MK6k1J4l5O1o7
5236bm5N4k5K0J9m0K4n4L4QO5l4j6pJ8l3O2q0K8j1K4l1J00l5n4K7N1k5j0m4J9
$$ plain form
5012 6 26 -43 -65 -65 -8 -53 -52 44 -46 -26 37 52 -10 2 47 -12 28 1 28 -51 -9 23 -101 19 61 11 -15 -4 20 40 5
5043 5 57 -27 44 99 -23 -36 1 -10 -72 70 -11 -25 -3 41 10 -46 17 91 -14 13 55 -4 -73 60 -31 -16 -25 1 -34
5072 -34 38 -1 -8 -26 -25 -5 6 35 16 6 -15 31 6 0 43 10 -10 67 52 -43 35 -9 -13 -38 38 -31 49 48 35 -27 -28 34 -68
5105 -68 -49 -18 15 -15 -53 -17 -17 7 -13 -40 -53 -10 28 21 26 48 -54 1 61 -39 -13 24 -2 -4 10 16 -13 19 21 29 18 36 38
5138 38 -4 56 -19 -67 -54 26 1 -84 -1 33 -61 -63 24 -36 -32 40 0 -34 0 50 -70 8 -13 22 -13 12 38 9 19 17 20 13
5170 13 63 11 -24 -19 15 -36 -8 -52 -17 -56 40 -6 -31 24 70 5 1 64 11 -48 -40 -14 -8 16 11 -64 -104 -10 39 6 13 43 1
5203 1 60 45 -34 -48 6 32 -7 -1 15 -43 36 32 36 104 73 12 4 15 59 23 13 -31 -45 19 38 16 20 46 25 39 4 65 -2
5236 -2 -47 7 -18 2 21 -19 5 -49 -15 -7 58 24 8 1 19 -14 48 -32 -4 -15 9 -22 78 43 -11 16 67 42 32 -12 7
5267GL6l9nj3J2j4mJ9L2kj7k0m8L0L6j5L5o4K9K0j7mPK3l5R1n6J0j8L9l4j7M6
5300E0n7j2K8j4K7K5m5N0n5lRl3K4j0LM0n2L9k5Lk8N3l7N2k6l4L5j7Mj7K1l2O5
5333C1j5o4O7j7L5r3Q9k5L7k1qNPokJ0k2Mj8P8pp4N7m9n8R3n3rK5k2M5l5NPJK7
5369B5p6k2K9K8L8k7j7O3n2k0Q6L2n3Lm3j0L6Mm8jJOk5N0J3J5mm2j3jL3N7q4r
5403b8J3Rl5k2L4j1O7n6M5K1k2k6k6J10m2k3k1m1O6O4j39M5LM1K5l0k8J5J5m7
5433b4O3p3KJ8l7K4j0N6k1J9J2o0J1MM1KK0j4j04K5O8k5K2lKJj8k1j0J9N1l5K3
5466B8o4O9n0J5P7p2J1j1M4n8Nm1N2Jkm2JN6kj3n7Q1l7N0J2l2r2Q7l2L4o6qN1
5499el4P6k6Mk2O7r8L3Lql9O0j6J0j8O6n3N8J5l6k8M1j6m4N7l7K7m8M1n0J8l8
$$ plain form
5267 7 43 4 -1 -14 -2 -16 -20 -1 31 29 12 -8 -56 -26 10 -5 30 -34 -5 15 -2 -6 1 24 -11 80 24 34 16 55 21 4 50
5300 50 -7 -19 9 -5 22 47 2 52 -3 -6 3 -30 -6 -16 -13 27 -25 14 -11 -8 -36 17 -20 32 6 -28 7 -10 -6 -23 -2 -34 31
5333 31 16 -48 19 2 37 -56 33 8 45 24 16 21 28 22 20 30 8 12 -6 72 65 -9 48 -1 -59 34 -19 -28 -3 -25 20 -15 -10 -3 -2 25
5369 25 -51 -73 -44 -16 22 -5 -22 41 -11 -31 55 87 34 37 -6 -16 20 24 -24 -25 -24 -18 -43 7 20 35 31 -11 -24 -25 8 65 -19 -28
5403 -28 -15 -6 -41 -63 -29 -40 27 -29 16 37 15 -11 -37 73 31 8 -13 -54 12 76 -63 -18 -15 26 51 21 -7 8 23 -24
5433 -24 39 -34 -32 -14 -51 -27 -37 19 -2 17 29 -31 -20 -16 25 27 47 33 -71 -46 22 -3 19 16 18 19 1 -20 -30 -11 40 5 28
5466 28 -36 33 -17 -2 75 3 14 3 47 -11 -6 -47 5 6 4 -38 -37 19 17 4 -53 28 -9 41 53 21 -71 16 -16 18 -48 -56 -5
5499 -5 -39 37 11 15 -7 60 -38 -5 -2 -10 -49 11 -5 5 -13 53 0 58 73 37 9 50 34 -10 47 10 37 -11 30 -20 -2 -40
5531d0j5K2J9J4j2oQ4q1k5K6K6j9J5OK9m5nm3L0J2R8r4j3O1j7Kp9Q7j7mj9L1n9
5564c1P2m8j7K3LJK9o4RnM9oo1PO9m5J2Pk7J1O3o0K3J0k2J8k6j2k6P7j3m5L0l0
5598b5Ok2N2j6JK1J7j3n7M4Lo8KO9m1J6j5J2k6L4k5ML6Oj7n8N0o3L1J5rnk0N5
5632frk3N0j0k6M1n1O9j5lk7Mk5j4M8nK5l9K8n0J9lL7k0j5k2M6j2nmJ5pl0QM7
5667A6jk9j0M5j2%K0m1j1J7J9l3ROj4QlL2L0l8OjJ3j00O0j0OJ6l4L7qm0P8o9j8
5702e4J0L1RmJ3n7N9p3M6rM2J9o6J14n5o1L6Qqk1O4%n9P7q9P9n9K9Qm6L7j4m2
5735c6nM8j5L7j5K3l8K5j3n8L9pk0O2q%J7m0rLj1J8N1n8OO1j01PN6J8j9K3Prm9
5770a0P1o0L0K9m4J5L1n4p7O5L1m3Kj6Lm8Q6lL4m2K5jpj5k4K8k7J7%PkNj2M0k6
$$ plain form
5531 -40 -55 -33 -14 0 -12 -18 66 -15 -40 -14 12 -7 8 14 43 -2 -7 -50 -20 -8 90 -4 -17 44 27 29 -50 37 20 16 -3 28 -31
5564 -31 41 -7 -24 -1 2 3 32 -32 -23 -28 21 15 -46 -39 30 -15 -3 4 -23 -12 51 -9 14 24 2 20 -6 -18 -44 33 20 -25 5 -25
5598 -25 -19 -41 11 -5 -4 17 34 21 -36 8 11 -57 -55 14 -27 -11 -26 -14 -40 -6 -31 -27 9 15 -2 -60 -10 -73 -42 -27 -36 -41 -61 -6
5632 -6 -15 -38 12 2 -24 17 -34 35 20 17 -10 -6 -31 -45 3 -2 23 -16 12 -38 -19 -22 15 -5 -20 -42 4 -8 -13 -17 -2 -9 -39 -31 16
5667 16 15 -14 -24 21 9 9 29 -12 -23 -6 13 -20 -11 -5 -19 -11 -14 18 48 10 16 15 28 -72 -12 -22 -16 0 -34 3 -5 -45 33 -36 -54
5702 -54 -44 -13 -4 -8 5 -52 7 -66 -20 -29 13 32 -34 80 25 -36 0 8 0 -21 43 43 -16 61 -28 51 -8 21 29 -17 20 6 -36
5735 -36 -41 7 -8 29 14 37 -1 24 11 -47 -8 -15 -35 27 19 19 36 -4 -13 -10 -21 -3 48 -10 -4 57 -44 -37 19 37 18 41 48 39 -10
5770 -10 61 1 31 60 16 31 62 8 -69 -4 27 -16 -14 -30 -27 -75 11 8 42 0 25 24 17 2 -22 6 -21 -4 -4 3 1 6 -6 34 8
5805HJ1M0n7J4j5L6mo3j4M0KK5k5Qj4Lkk8J8J2J7l7K2RKk1j6L6Po7P1Ln6Q3om2
5841@k3PK2l0L0l4K7N2j8p1K5OK2k3J3kJ3L7ln0O2Qn8J9m4M5m2k2L1J3l6O3l5
5874DNk2k3O4o6QoK8l3nK9L1j2q3P9L2K5j2J1n0RK7n3KOL3k2K0L1n6K1oj5K0j1
5909A0mM0p0L1L8l6m9M6J2n0K5qL0k4K2n8N5k6K1M1l0n7%K7L8J5jj9J2o1KM6j5
5942CJ6pJ4k3j0l8N3N4p3j1k3K5l2N6k9N6l4K0o3MK8Qk2O4p5K6K0j7LK1Nl7L3
5975A5nj8M5m2m4M1L3l3J7J8j8p0R5n1OK1J6j5j7JK9k3K9rm9M6k6rmQKMJ2pL4
6010C2r7Q4r6N7J3LJ0j7L0l1K1kNK6n1jR0j04M6Kn1J0K9j4J2M7l4j3LJ3J2q0L
6043d3R5p3J7m6O0m7N0k4j9pK7L6r4M4O2m0PN1n3k5K3K4m8K8k8L0j4J1L5k7K5
$$ plain form
5805 8 19 59 2 16 1 37 33 -30 -44 -4 -2 23 -2 6 -8 -5 -7 -35 -17 -5 12 -25 -3 6 8 -13 -29 7 14 -53 18 21 -35 48 42 0
5841 0 -23 -16 6 -24 6 -28 -1 51 33 -38 -13 -7 15 -8 5 3 16 53 50 0 62 70 12 31 -13 32 -10 -32 -1 12 -24 39 4
5874 4 9 -13 -36 28 -38 -30 -36 -8 -41 -46 -17 14 2 -81 -2 30 55 43 54 4 13 40 -13 -11 -5 28 6 26 57 1 22 16 1 21 10
5909 10 6 46 -24 7 45 9 -40 6 18 -32 -7 -15 15 -9 13 -45 10 -16 5 46 16 -41 -41 -14 24 39 38 19 31 -30 -28 18 3
5942 3 19 12 26 3 -7 -45 8 62 -11 -22 -45 -20 -52 4 -25 31 -3 17 -46 -42 -14 -6 -28 36 -39 -13 7 -10 -7 14 19 -18 15
5975 15 10 -8 37 -5 -49 -8 25 -8 9 27 9 -61 34 -17 -11 10 26 11 -6 -5 24 1 30 21 -28 18 -8 -17 -21 -13 -11 -7 5 -2 32
6010 32 -65 19 -77 -20 -7 -4 6 -11 19 -12 9 7 12 38 -13 -14 76 -28 18 20 -31 -21 8 -6 6 53 19 6 9 22 34 -46 -43
6043 -43 52 -21 -4 -50 10 -37 13 -11 -30 -37 -10 26 -68 -24 38 -2 5 56 3 -22 1 25 -23 5 -23 7 -7 4 39 12 37
6074C7o9L6l5LK6L1rMk3j6k5M1k5J3k2NO3m0J3k8L5k7N5m6L0k1pJ5k1K6l7mj0
6107c2L8N0q6O6kp2M6k8N2j1n7O8k4k4j8MJ5k0O2l1jl6L4PK2L7m6m9M0Ol1MJ9
6140Bml5M4nn%K6J6l0L1m7L3n2M2K8r1M3J6k9j4jL0LK8l4JnK6m1J3%KK7l1J6o
6176cK6pj5PJ8o1NO3k0k1%Rm3N3K6mj3Mm3O4Jm6ok8Qm1O6JpK9n0O9m2k3jN3k1
6213GnM5p7N3l7j9j9N4JnkOj2Ll7Q3n1L8q0N0J5J2MqRPl4mjj9L1ln3J2Q8m9o4
6250f1L7k0L4J7k9J1lL3l5K9k1Ml0P5k9k1m8P2j8k1Q0n8K5l6K6n2OK5M6j8k0k6
6282b6M5m1K2J9l0M2m2O%NML7n4J9l2L5j1J6j5J1K5l4j7JL2n0L7m2R6q6j1O6n8
6315c1K0jL9rm7Q3l8K4m9J3M0l7K5p0J22r3N5l9l6L9j1N4m0j6l2k5L3MK2KQ%l4
$$ plain form
6074 37 -32 4 -31 -28 -2 29 20 24 1 -15 -40 1 -24 -11 -33 -28 35 -5 8 -20 15 -12 43 -3 27 6 -1 14 -7 19 -18 -22 -32
6107 -32 6 56 -30 36 34 -38 8 -20 32 21 -36 32 8 -16 -34 -30 -15 -35 27 -4 -5 -41 -7 0 22 59 13 -36 4 10 -21 -17 2
6140 2 -2 -37 7 2 -3 -3 23 39 9 40 -7 26 -26 16 44 -47 -4 12 -17 -31 -32 -2 1 29 -5 -4 -9 17 -24 -11 -11 -9 18 -13 3 -3
6176 -3 23 16 1 8 26 -35 -30 33 13 -8 -8 1 -42 11 37 33 20 24 -19 45 46 0 -6 -34 -26 -67 -1 0 -7 22 -28 41 -1 -24 -25 28 7
6213 7 2 47 -30 23 -14 -33 -52 2 3 -2 -4 2 -10 -7 -44 39 -12 26 -54 -4 11 23 27 19 28 35 1 -3 -4 -23 8 5 -48 -36 52 3 -61
6250 -61 -24 -44 -10 7 -22 -11 -14 19 -16 13 -8 -4 -34 41 12 -9 -57 15 -3 -24 56 -2 23 -13 13 -39 -33 -8 38 20 0 -26
6282 -26 19 -22 0 19 -11 31 -11 -5 -5 0 4 41 -13 6 -26 9 -2 14 -1 10 35 1 -16 -15 17 -33 4 -38 58 -28 -39 27 -31
6315 -31 -11 -12 27 18 -29 54 16 40 -9 4 44 7 32 -38 84 -9 46 7 -29 10 -1 53 13 -3 -35 -60 -27 -23 -1 1 9 9 -25
6348b5M3Rj6kQk8O2l4LKJ0m1J1k6j4L3lNK8mj8L7k6k0k4qK8l1K0K8p3Q2j8JJ9
6383A8k4M6o4qN6l9L1Rl9lK1o8M3oP7q0L3pnL9o2J6j2KK5Rj8L8l0L5r1M5J0pm8
6418e8L8PLN2q5M2%M1m5jJ9Ml4j3RNj4N3m7L8l5kJ9K9o9P0%l0J3j2l3O2l8qK7
6453Glo6O8J7J9o4%k5N0L0n0j1rP0j7l7K7n0J4JK7L1Jn1K6l3Pj7J9J6m3N5j4K6
6487B1QL5o0J5lJ0Lm0pJ3L9j00P3M2l5j5j0N3o0mK9M2o2k8j1N5N0j5m3L3o6N9
6519B1k9k2l6P8jj1k5j6O8n2L1j4KK2j4L0k9L5j0p8N0l4O9p6O4km8J3m4M2JK3
6551Hj2l7O5k8oj2K4k8J1J5Kj7M7j4j4k1Pnk8P3%ok6Rl6M2K0j8j2Kj2m3R0n5L7
$$ plain form
6348 -25 18 27 11 9 17 -11 51 17 20 22 32 -9 2 -24 -38 -5 -8 -3 25 21 3 40 14 -6 -30 -38 -10 -41 -21 7 -66 16 -2 -1 18
6383 18 -6 40 -24 -32 24 -15 16 25 -14 -17 4 -64 -21 -27 50 -30 3 -4 -9 30 -32 -16 -28 -26 -1 8 -10 28 -2 33 -58 -13 -3 -10 -58
6418 -58 -20 -13 -10 42 -43 -1 -1 40 -5 -6 13 17 -17 -30 -21 -16 -30 23 -24 14 -21 -23 -4 25 -44 26 26 -4 9 -3 -36 26 -12 -20 7
6453 7 4 -62 6 23 42 -22 -22 -47 3 33 -17 -28 -37 33 16 -21 6 -44 -30 -29 -2 29 30 -21 5 -28 -21 -38 -19 -3 -46 9 -5 21
6487 21 29 64 4 19 16 26 29 -11 -18 -5 34 -66 7 49 14 -1 -11 42 -18 -22 7 49 -13 -41 -52 3 53 38 -5 28 -38 21
6519 21 -8 -30 -66 12 11 0 -25 -41 27 -25 6 -8 -6 16 2 32 3 38 28 -50 0 -34 35 -41 23 21 -27 -14 -58 -16 -15 8
6551 8 -4 -41 24 -4 -10 -22 2 -26 -15 0 2 -15 32 18 4 -17 -10 -15 -43 30 30 24 -2 7 -29 13 33 15 3 5 -7 -50 40 -15 22
$$ [...]
8191D
##END NTUPLES=NMR FID
##END=
