##TITLE=1H_AM_NVDICYCL801
 CDCl3
 8 sc, 
 7.04.2022
##JCAMPDX= 6.0         $$ Bruker NMR JCAMP-DX V2.0
##DATA TYPE= NMR FID
##DATA CLASS= NTUPLES
##ORIGIN= UXNMR, Bruker Analytische Messtechnik GmbH
##OWNER= root
$$ XWIN-NMR		Version 3.5
$$ Thu Apr  7 15:24:18 2022 Russian Standard Time (UT+4h)  she@DPX200
##.OBSERVE FREQUENCY= 200.13135
##.OBSERVE NUCLEUS= ^1H
##.DELAY= (6, 6)
##.ACQUISITION MODE= SIMULTANEOUS
##.ACQUISITION SCHEME= undefined
##.AVERAGES= 8
##.DIGITISER RES= 18
##SPECTROMETER/DATA SYSTEM= spect
##.PULSE SEQUENCE= zg30
##.SOLVENT NAME= CD2Cl2
##.SHIFT REFERENCE= (INTERNAL, CD2Cl2, 0, 15.7039)
##AUDIT TRAIL= $$ (NUMBER, WHEN, WHO, WHERE, WHAT)
$$ ##TITLE= Audit trail, XWIN-NMR		Version 3.5
$$ ##JCAMPDX= 5.01
$$ ##ORIGIN= Bruker BioSpin GmbH
$$ ##OWNER= she
$$ F:/spectra/data/she/nmr/H-F/1/audita.txt
$$ ##AUDIT TRAIL=  $$ (NUMBER, WHEN, WHO, WHERE, WHAT)
(   1,<2022-04-07 15:22:48.57 +0400>,<she>,<DPX200>,
      <created by zg, POWCHK disabled, PULCHK disabled
       configuration hash MD5:
       00 E9 B6 7A A2 85 ED C7 34 08 36 98 17 FE 4E 26
       data hash MD5: 16K
       1C 4C C6 70 A6 A0 61 77 DF A0 4F 69 E9 30 BA 73>)
$$ ##END=
$$ 
$$ hash MD5
$$ 14 73 1A 78 69 79 C3 D2 61 6A EA E9 CC A7 CB 20
##$RELAX= 
##$RELAX= 
##$RELAX= 
##$RELAX= 
##$RELAX= 
##$RELAX= 
$$ Bruker specific parameters
$$ --------------------------
##$DU= <F:/spectra>
##$EXPNO= 1
##$NAME= <H-F>
##$PROCNO= 1
##$TYPE= <nmr>
##$USER= <she>
##$AMP= (0..31)
100 100 100 100 100 100 100 100 100 100 100 100 100 100 100 100 100 100 
100 100 100 100 100 100 100 100 100 100 100 100 100 100 
##$AQSEQ= 0
##$AQ_mod= 1
##$AUNM= <au_zg>
##$AUTOPOS= <>
##$BF1= 200.13
##$BF2= 200.13
##$BF3= 200.13
##$BF4= 200.13
##$BF5= 200.13
##$BF6= 200.13
##$BF7= 200.13
##$BF8= 200.13
##$BYTORDA= 1
##$CFDGTYP= 0
##$CFRGTYP= 5
##$CHEMSTR= <none>
##$CNST= (0..31)
1 1 145 1 1 1 1 1 1 1 1 1 1 1 1 1 1 1 1 1 1 1 1 1 1 1 1 1 1 1 1 1 
##$CPDPRG= <>
##$CPDPRG1= <>
##$CPDPRG2= <>
##$CPDPRG3= <>
##$CPDPRG4= <mlev>
##$CPDPRG5= <mlev>
##$CPDPRG6= <mlev>
##$CPDPRG7= <mlev>
##$CPDPRG8= <mlev>
##$CPDPRGB= <>
##$CPDPRGT= <>
##$D= (0..31)
0 1.2 0 0 0 0 0 0 0 0.06 0 0.03 0 0 0 0 0.0002 0 0 0 0 0 0 0 0 0 0 0 0 
0 0 0 
##$DATE= 1649330568
##$DBL= (0..7)
120 120 120 120 120 120 120 120 
##$DBP= (0..7)
150 150 150 150 150 150 150 150 
##$DBP07= 0
##$DBPNAM0= <>
##$DBPNAM1= <>
##$DBPNAM2= <>
##$DBPNAM3= <>
##$DBPNAM4= <>
##$DBPNAM5= <>
##$DBPNAM6= <>
##$DBPNAM7= <>
##$DBPOAL= (0..7)
0.5 0.5 0.5 0.5 0.5 0.5 0.5 0.5 
##$DBPOFFS= (0..7)
0 0 0 0 0 0 0 0 
##$DE= 6
##$DECBNUC= <off>
##$DECIM= 32
##$DECNUC= <off>
##$DECSTAT= 4
##$DIGMOD= 1
##$DIGTYP= 9
##$DL= (0..7)
0 120 120 120 120 120 120 120 
##$DP= (0..7)
150 150 150 150 150 150 150 150 
##$DP07= 0
##$DPNAME0= <>
##$DPNAME1= <>
##$DPNAME2= <>
##$DPNAME3= <>
##$DPNAME4= <>
##$DPNAME5= <>
##$DPNAME6= <>
##$DPNAME7= <>
##$DPOAL= (0..7)
0.5 0.5 0.5 0.5 0.5 0.5 0.5 0.5 
##$DPOFFS= (0..7)
0 0 0 0 0 0 0 0 
##$DQDMODE= 0
##$DR= 18
##$DS= 0
##$DSLIST= <SSSSSSSSSSSSSSS>
$$ [...]
##$SUBNAM2= <"">
##$SUBNAM3= <"">
##$SUBNAM4= <"">
##$SUBNAM5= <"">
##$SUBNAM6= <"">
##$SUBNAM7= <"">
##$SUBNAM8= <"">
##$SUBNAM9= <"">
##$SW= 18.05172834244
##$SWIBOX= (0..15)
0 0 2 0 0 0 0 0 0 0 0 0 0 0 0 0 
##$SW_h= 3612.71676300578
##$TD= 16384
##$TD0= 1
##$TE= 0
##$TE2= 300
##$TE3= 300
##$TEG= 300
##$TL= (0..7)
0 120 120 120 120 120 120 120 
##$TP= (0..7)
150 150 150 150 150 150 150 150 
##$TP07= 0
##$TPNAME0= <>
##$TPNAME1= <>
##$TPNAME2= <>
##$TPNAME3= <>
##$TPNAME4= <>
##$TPNAME5= <>
##$TPNAME6= <>
##$TPNAME7= <>
##$TPOAL= (0..7)
0.5 0.5 0.5 0.5 0.5 0.5 0.5 0.5 
##$TPOFFS= (0..7)
0 0 0 0 0 0 0 0 
##$TUNHIN= 0
##$TUNHOUT= 0
##$TUNXOUT= 0
##$USERA1= <user>
##$USERA2= <user>
##$USERA3= <user>
##$USERA4= <user>
##$USERA5= <user>
##$V9= 5
##$VALIST= <valist>
##$VCLIST= <CCCCCCCCCCCCCCC>
##$VD= 0
##$VDLIST= <DDDDDDDDDDDDDDD>
##$VPLIST= <PPPPPPPPPPPPPPP>
##$VTLIST= <TTTTTTTTTTTTTTT>
##$WBST= 1024
##$WBSW= 4
##$XGAIN= (0..3)
0 0 0 0 
##$XL= 0
##$YL= 0
##$YMAX_a= 189604
##$YMIN_a= -91604
##$ZGOPTNS= <>
##$ZL1= 120
##$ZL2= 120
##$ZL3= 120
##$ZL4= 120
##$ABSF1= 10
##$ABSF2= 0
##$ABSG= 5
##$ABSL= 3
##$ALPHA= 0
##$AQORDER= 0
##$ASSFAC= 0
##$ASSFACI= 0
##$ASSFACX= 0
##$ASSWID= 0
##$AUNMP= <proc_1d>
##$AZFE= 0.1
##$AZFW= 0.1
##$BCFW= 1
##$BC_mod= 2
##$BYTORDP= 1
##$COROFFS= 0
##$CY= 11.3945322036743
##$DATMOD= 1
##$DC= 2
##$DFILT= <>
##$DTYPP= 0
##$F1P= 2.36226072786647
##$F2P= -0.459571619588291
##$FCOR= 0.5
##$FTSIZE= 0
##$FT_mod= 4
##$GAMMA= 1
##$GB= 0.15
##$INTBC= 1
##$INTSCL= 1
##$ISEN= 128
##$LB= 0.24
##$LEV0= 0
##$LPBIN= 0
##$MAXI= 10000
##$MC2= 0
##$MEAN= 0
##$ME_mod= 0
##$MI= 1.114404
##$NCOEF= 0
##$NC_proc= 0
##$NLEV= 6
##$NOISF1= 3.799351
##$NOISF2= 2.8
##$NSP= 1
##$NTH_PI= 0
##$NZP= 0
##$OFFSET= 15.70392
##$PC= 1
##$PHC0= -18198.5
##$PHC1= 15.80078
##$PH_mod= 1
##$PKNL= yes
##$PPARMOD= 0
##$PSCAL= 0
##$PSIGN= 0
##$REVERSE= no
##$SF= 200.130013532006
##$SI= 16384
##$SIGF1= 3
##$SIGF2= 2
##$SINO= 400
##$SIOLD= 16384
##$SREGLST= <1H.CDCl3>
##$SSB= 0
##$STSI= 0
##$STSR= 0
##$SW_p= 3612.71676300578
##$SYMM= 0
##$S_DEV= 0
##$TDeff= 0
##$TDoff= 0
##$TI= <>
##$TILT= no
##$TM1= 0
##$TM2= 0
##$TOPLEV= 0
##$USERP1= <user>
##$USERP2= <user>
##$USERP3= <user>
##$USERP4= <user>
##$USERP5= <user>
##$WDW= 1
##$XDIM= 8192
##$YMAX_p= 0
##$YMIN_p= 0
$$ End of Bruker specific parameters
$$ ---------------------------------
##NTUPLES= NMR FID
##VAR_NAME=  TIME,          FID/REAL,        FID/IMAG
##SYMBOL=    X,             R,               I
##VAR_TYPE=  INDEPENDENT,   DEPENDENT,       DEPENDENT
##VAR_FORM=  AFFN,          ASDF,            ASDF
##VAR_DIM=   8192,          8192,            8192
##UNITS=     SECONDS,       ARBITRARY UNITS, ARBITRARY UNITS
##FACTOR=    0.0002768,     1,               1
##FIRST=     0,             0,               0
##LAST=      2.2672688,     0,               0
##MIN=       0,             -91604,          0
##MAX=       2.2672688,     189604,          0
$$ Real data points
##PAGE= N=1
##DATA TABLE= (X++(R..R)), XYDATA
0@%%%%%%%%%%%%%%%%%%%qJ6j6J6j6J6k1K9l2M0m8N1n9O9p9R0j03J16j30J46j65
$$ 0 0 0 0 0 0 0 0 0 0 0 0 0 0 0 0 0 0 0 0 -8 8 -8 8 -8 8 -13 16 -16 24 -24 27 -32 37 -42 48 -55 61 -69 77 -88
40h8J87k09K33k58K86l17L51l89M30m76N24n75O33o97P65q41R26j019J122j236
$$ -88 99 -110 123 -135 151 -166 185 -204 226 -250 274 -301 332 -365 400 -441 485 -534 588 -648
60f48J365j508J661j823J976k064J890o70o629J96054k03016K2467j4537R247
$$ -648 717 -791 870 -953 1023 -1041 849 179 -6450 189604 -13412 9055 -5482 3765
74C765o610N083m087L370k830K449k142J887j645J470j359J248j118R93r18Q19
$$ 3765 -2845 2238 -1849 1521 -1309 1140 -1002 885 -760 710 -649 599 -519 474 -444 375
90C75p13O48n73N13m58M12m09M03l46L02l04K57k05J98j82J41j44J31j07O7p1
$$ 375 -338 310 -263 250 -208 204 -205 198 -148 154 -150 107 -98 100 -82 59 -85 46 -61 6 -65
111f5Q8o5P7o9K9l7L6j8QK3J1k5RLLk2J6mL7m2K4j7j8K4k3K6J0k2JpJ6j3jKJ5
$$ -65 23 -42 35 -34 -5 -42 -6 -24 -16 7 18 -7 2 5 8 -14 2 -2 35 -7 17 0 -18 6 -17 9 19 -3 -2 -9 7 -6 -7 -5 10
146A0nj0K0j7oq%K2k5j6oM2j0j5J1OqJ8J5k9K5j4Nj3J9j3K0jkj6L6n7QJK5j5q
$$ 10 5 -5 15 -2 -8 -16 -16 6 -19 -35 -41 1 -9 -24 -13 -7 -15 3 18 -11 14 0 5 -8 11 -2 18 17 15 -1 35 -22 -14 -13 12 -3 -11
183a1J2NqJ7l3jJ9ojoKk4QLJ8omk2L8j1J8k9L0KoJJ2k1J2J4j5J2k2K5k1J9k4r
$$ -11 1 6 -2 15 -18 -19 0 -6 -7 -13 -11 -35 -27 -24 -6 -12 -16 -38 0 -11 7 -22 8 10 4 5 17 -4 8 22 7 19 -3 22 1 20 -4 -13
221a3pJ9%j8NJ2nOj5M6k3k0J0Koj3J6j2K0J1j6Oj8J3j6J3K5l1QJ7pkkoL2m7L3
$$ -13 -20 -1 -1 -19 -14 -2 -7 -1 -16 30 7 -13 -3 -1 -7 -20 -4 -16 4 15 -1 5 -13 0 -16 -3 22 -9 -1 16 9 7 5 -1 31 -16 17
258A7J1JLl2MNrNlLj9LK0J4k9Lqj0M1m4jPJ5J2k7j5M1qK4k8j5JL1nJ6j3jK2rk2
$$ 17 28 29 32 0 4 9 0 5 2 5 -14 -11 9 23 -6 -3 -11 -21 20 -24 -25 -18 -3 9 -18 -33 8 0 24 -4 -19 -18 13 8 24 11 10 32 23 1
298AqJ6ppJ6J4j6Nj4QJ2rj7J8m5PM5plj4j5OoQpJNpJ7%K9k0Lj5K2r%J5KprPrM
$$ 1 -7 9 2 -5 11 25 9 14 0 8 20 11 -6 12 -33 -26 19 12 9 -5 -20 -14 -20 -12 -19 -18 -13 -20 -3 -3 26 6 9 -6 16 7 7 22 24 17 8 15 6 10
342A0oOj2M6l3j3Rj6J0Qkpj1kJ8l9K7nJK5k5onK1Nj4kqL6k5PJLOj4J3rkK1l1J6
$$ 10 4 10 -2 44 11 -2 7 -9 1 9 7 0 -11 -13 5 -34 -7 -12 -11 14 -11 -17 -22 -1 4 -10 -12 -20 16 -9 -2 -1 2 8 -6 7 -2 -4 17 -14 2
383BOJ3OKk9J2k3K6k4NJ5%Ol7pJ3%L9j8k3L2l3J1j7J1ORp%OoJ3Jk5K8m2M7j7K6
$$ 2 8 21 27 29 0 12 -11 15 -9 -4 11 11 17 -20 -27 -14 -14 25 7 -16 16 -17 -6 -23 -12 -6 3 -4 -4 2 -4 9 10 -15 13 -29 18 1 27
422B7k5ONkj8QJ5J6Pm6J7pl3K7pL7nm6J2jRLLj8kLJ9j9J1j5j3J2K0j6MJ6j0j0
$$ 27 2 8 13 11 -7 1 16 32 39 -7 10 3 -30 -3 -10 27 22 -24 -12 -13 -4 -1 2 -16 -18 -15 4 -15 -4 -19 -32 -20 0 -16 -12 4 -6 -16
460a6M4k5%J7oj9jL1mj4J6j3MPqJl4J5K8m3J4Nj1k2K3K1j2nJ1k3njKJ2pK5k6K0
$$ -16 28 3 3 20 14 -5 -6 25 21 7 23 10 14 21 13 14 -20 -5 23 -20 -6 -1 -12 -34 -11 10 -2 -7 4 -19 -24 -25 -23 -11 -18 7 -19 1
498AmpjoK8pNLjJ8k9J6Nm0M2j7k3J5J4kjJ0m6J0j6L9k5K4j4pOQJ3k0j6J0J6l2
$$ 1 -3 -10 -11 -17 11 4 9 12 11 29 0 16 21 -19 23 6 -17 -2 12 10 9 19 -27 -17 -33 6 -19 5 -9 -16 -10 -2 11 -9 -25 -15 1 -31
536c1N4l3J3KMj0j8mOL4j9JJ2oJ2KNOl2qJ6L5ok4j3J7j8mK2mk4k4M3j7kJ3k7L2
$$ -31 23 -10 3 5 9 -1 -19 -23 -17 17 -2 -1 11 5 17 19 24 30 -2 -10 6 41 35 11 -2 15 -3 -7 15 11 -13 -37 6 -11 -13 0 -27 5
574Ej0J3j2lj7L3oqj0L0mj0K2pok8K5l3K7nJoJ9j2j3K8j9J3oR%l8K9k7K7j7OQ
$$ 5 -5 8 -4 -7 -24 9 3 -5 -15 15 11 1 23 16 10 -18 7 -26 1 -4 -3 -9 10 -2 -15 13 -6 7 1 10 10 -28 1 -26 1 -16 -10 -2
612bk0J3J0j3K0Lqk2jQjNjNJ6%Mnk9L2j0lJ8l2J7j8M3l8J1jjNRj7Qj1J4r%j9J1
$$ -2 -22 -9 1 -12 8 11 3 -19 -20 -12 -13 -8 -9 -4 12 12 16 11 -18 14 4 1 19 -13 4 -14 29 -9 2 1 0 5 14 -3 5 -6 8 -1 -1 -20 -9
653iK2j5JKj7PJ4j9J8k1MJ7k5J0K4j6J4j3J1j9L2j9KlK1jplLk6J8rRnJ3k5K6j0
$$ -9 13 -2 -1 1 -16 -9 5 -14 4 -17 -13 4 -21 -11 13 -3 11 -2 9 -10 22 3 5 2 23 22 15 12 15 -11 7 -2 7 2 15 -10 16 6
691Fk1J0KklOj5K0k4Oj0J0J8Oj6J6j1Mj9J6lJ4j8J5QrqJ3Rj1Mjlkk7J6k0L2j0
$$ 6 -15 -5 -3 -5 -8 -2 -17 3 -21 -15 -25 -15 3 9 -7 9 -2 2 -17 -1 -4 10 -8 7 15 6 -2 11 20 9 13 12 9 7 -20 -4 -24 8 -2
730b%N%mj7K5k6j4J6L4k8J3l4QJ3rJ3k0K8KOKnLK0ok0j1OJ2j5K6j9K6k6J7mKR
$$ -2 -2 3 3 -1 -18 7 -19 -33 -17 17 -11 2 -32 -24 -11 -20 -7 -27 1 3 9 11 6 9 29 23 3 -8 -2 10 -5 21 2 28 2 19 15 17 26
769B6k7J2j0k2RK7jKj0l5L7j8J5k0l1M3Rj6j3QJ5j1K0j9OK2k1K8l5pK0KkMl1M3
$$ 26 -1 11 1 -21 -12 15 14 16 6 -29 8 -10 5 -15 -46 -3 6 -10 -23 -15 0 -11 9 -10 -4 18 -3 25 -10 -17 3 5 3 7 -24 19
805A9RJ0m3L7l2J7k8J2oj0NOJ7j9Oj7J5MnJ3k6J4oMj5pL3j7L0k1j3K9k9J8k3J5
$$ 19 28 38 -5 32 0 17 -11 1 -5 -15 -10 -4 13 -6 0 -17 -2 2 -3 10 -16 -2 -8 -4 -19 -26 7 -10 20 -1 -14 15 -14 4 -19 -4
841dL0j2J8l9K9rj6L0qMn4K2K8qOk7J5k4K1j5%JJKK3pk1mmNMKRk0K8J5qJ4k1J2
$$ -4 26 14 32 -7 22 13 -3 27 19 23 -31 -9 19 11 17 -10 5 -19 2 -13 -13 -12 -11 -9 14 7 -14 -18 -22 -17 -13 -11 -2 -22 6 21 13 27 6 18
881A8rk1K1J4k5MMJ2j2j6K6Jj1J2k4J1J5j2qkkPm9L8J2qpj3N%Kl5M2JQJ4k2L0
$$ 18 9 -12 9 23 -2 2 6 18 6 -10 16 17 6 18 -6 5 20 8 0 -2 -4 3 -46 -8 4 -4 -11 -24 -19 -19 -17 -52 -10 -9 -1 13 -9 21
919B1pl4K4LJ6n1L3lKK1pJ0l1K5kk9J3j8M7l3J5%k6%NnJ3l1K1j4J0RmoklpL5q
$$ 21 14 -20 4 7 23 -28 5 2 4 25 18 28 -3 22 20 -9 4 -14 33 0 15 15 -11 -11 -6 -11 2 -29 -8 -22 -12 -3 -7 -13 -15 -18 -25 10 2
958Bj2%L2j1k3K4Lj9K2k7N0k9mJ3l3J8MkJj3J5j5J5rlNj3MK1l3kJ5j7L2k6j5J1
$$ 2 -10 -10 22 11 -12 12 15 -4 18 -9 41 12 8 21 -12 6 10 8 9 -4 11 -4 11 2 -1 4 -9 -5 16 -17 -19 -4 -21 11 -15 -30 -19
995a9J5mPLJ1Kl4K1j9J9RQrjK2Ok0j0j0K8k4K9j3qj3j8K3Kjj3J2j8K2k1j6M6k1
$$ -19 -4 -8 -1 2 13 15 -19 2 -17 2 11 19 10 9 31 37 17 7 -3 25 1 30 17 9 -4 -22 1 3 2 -11 1 -17 5 -16 -32 14 -7
1032gPl1K9jJlJj%%mPMrJ1J0Mk1oKJ1K8l1pL1qmj0oL0j4knK4l1j4K5qk2L7k9L
$$ -7 0 -31 -2 -3 -2 -5 -4 -5 -5 -5 -9 -2 2 -7 4 14 18 -3 -9 -7 4 32 1 -6 25 17 13 3 -3 27 13 11 6 30 -1 -15 10 2 -20 17 -12 -9
1074iMqK5j6mlj2jK7k2mJ1J2j1LoJ3jNJK2k8K1j8J9rJ5k2J5nNoo%rlKj2K5j8J8
$$ -9 -5 -13 12 -4 -8 -11 -23 -24 3 -19 -23 -12 0 -11 -8 -14 -1 -2 3 4 26 -2 19 1 20 11 26 4 19 14 19 13 7 7 -2 -5 -3 -15 10 -8 10
1115A0%k1Jk5N3m0J6pmoJ3MQk3JQK4Nl4L7Jm0L4j5J3j3J3j1j8MJ9Nok1K0Ol7K3
$$ 10 10 -11 -10 -35 18 -22 -6 -13 -17 -23 -10 -6 2 -21 -20 -12 12 17 -17 20 21 -19 15 0 13 0 13 2 -16 -12 7 12 6 -15 5 11 -26 -3
1153cnPj7Lk4L0l3N1qrLNMj%l7J3K5j5J1J4mnk1M1Jl0RJJK5j1Pj0Kj0k3JK2Rk5
$$ -3 -8 -1 -18 -15 -39 -9 -42 9 1 -8 -5 0 4 3 3 -34 -21 4 -11 0 14 10 5 -16 25 26 -4 5 6 7 32 21 28 18 20 10 -13 -12 10 19 -6
1194fKOolJ7j4jK7m2L1k1OJ4l5QJ9nK4m0J9RmJ9m6N0k3J5j2PLj5J4j5K2j2lNk7
$$ -6 -4 2 -4 -7 10 -4 -5 22 -20 11 -10 -4 10 -25 -17 2 -3 21 -19 0 9 5 24 -22 28 5 20 8 15 18 3 17 2 24 12 9 14 -13
1232a3ML9Jpj6K1l1k2J4J0prKK4k2J1%j2M0l6L4l4K2k9J0J2QK0k4oKQJj0LRj9
$$ -13 -9 30 31 24 8 29 -2 -24 -10 0 -7 -16 -14 10 -12 -1 -1 -13 27 -9 25 -9 13 -16 -6 6 14 34 10 4 6 14 15 5 8 17 -2
1269bNjJ4j2Ok1OJJ6J0k5nnJ1J4j2J7j2Lj5j2NK7k5J1j4J2Lk7K6JoOJ2KJ4j4k3
$$ -2 3 2 16 4 10 -11 -5 -4 12 22 -3 -8 -13 -2 12 0 17 5 8 -7 -19 -14 13 -12 -1 -15 -3 0 -27 -1 0 -6 0 12 14 28 14 -9
1307iK3J5m5qM3j2QJ5k3nqM2m4PJ0k6pKJ0J7j0J3Kj9Pj1j7L1k0MM1m8K0J7Qj9
$$ -9 14 29 -16 -24 19 7 15 30 7 2 -6 36 -8 -1 9 -17 -24 -22 -12 5 -5 8 10 -9 -2 -13 -30 1 -19 -15 26 -22 -2 15 23 4
1343DmK6k4kJ7Qk8J9lj4nJ9JJ3nJ3pk8Rj5qLmj2NjL1k8K6k9K4l9L4J1j4lJ5k6
$$ 4 0 26 2 0 17 25 -3 16 13 -1 -6 13 14 27 22 35 28 0 9 -6 -14 -11 -15 -27 -22 -23 8 -20 6 -23 1 -38 -4 7 -7 -10 5 -21
1381b1L0Pk0K0qj7qM7k0JK2k6JJpQj5RORk9J1NK0l0OpJj2K4l0j7L0J5l8L5ljP
$$ -21 9 16 -4 16 8 -9 -17 30 10 11 33 7 8 9 2 10 -5 4 10 19 -10 1 6 26 -4 2 -5 -4 -16 8 -22 -39 -9 6 -32 3 0 -1 6
1420Fjj3nnK5rL3j5qqJ0jK3j4oJ3j7LKjj2K3kpm0L1jql6M4j3rk0J4K4j6j4L8j0
$$ 6 5 -8 -13 -18 7 -2 31 16 8 0 10 9 32 18 12 25 8 11 13 12 0 23 21 14 -26 5 4 -4 -40 4 -9 -18 -38 -24 0 -16 -30 8 -2
1459bJj1JJ7Rk4MONrRJ1NMj6Jj6PopK2NK0l3j0K7j9Qoj6j7RK3k6K5ol1NOJ3J3
$$ -2 -1 -12 -11 6 15 -9 -5 1 6 -3 6 17 22 26 10 11 -5 2 -4 -11 11 16 36 3 -7 20 1 9 3 -13 -30 -21 2 -24 1 -5 -36 -31 -25 -12 1
1500Al8M9j4mj5J1QPk0OqL5k5J1LJ2j7J6j1K2j7QrLj1J1j3J2j5K1%Kql9J9j2K2
$$ 1 -37 12 -2 -6 -21 -10 -2 5 -15 -9 -17 18 -7 4 7 19 2 18 7 29 12 20 11 14 3 14 1 13 -2 19 19 21 13 -26 -7 -19 3
1537Cm3J6k3M7j4PJ6k3j0L6nlJjk4M3k8K6k6JL1J4l2j1NjK7J3qom4OJ4nj0PnL
$$ 3 -40 -24 -47 0 -14 -7 9 -14 -24 12 7 4 5 4 -20 23 -5 21 -5 -4 27 41 9 -2 3 2 29 42 34 28 -16 -10 4 -1 -11 -4 -9 -6
1575frK9l8K6k3J5l2L7l2L0J1k1J0k1J5J6k3J1J0MJj0J2j7J1J5k4%J8k6L3j1l4
$$ -6 -15 14 -24 2 -21 -6 -38 -1 -33 -3 8 -13 -3 -24 -9 7 -16 -5 5 9 10 0 12 -5 6 21 -3 -3 15 -11 22 11 -23
1608b3L0j1K5pm1L2lk0JJ2plQj5J6Jok5L8j4Nj1OQrJ0J7l2J5%J1k4L7NoKPkj9
$$ -23 7 -4 21 14 -27 5 2 -18 -17 -5 -12 -15 -7 -22 -6 -5 -11 -36 2 -12 -7 -18 -12 -4 -13 -3 14 -18 -3 -3 8 -16 21 26 20 22 29 27 8
1647HqOjj0pJ5J3k7J4k4JJ9Kj6OMjk4K7k6J7j0J6K0m0K8qpNK0j3rK9k0jMO%J5
$$ 8 0 6 5 -5 -12 3 16 -11 3 -21 -20 -1 1 -15 -9 -5 -6 -30 -3 -29 -12 -22 -6 14 -26 2 -6 -13 -8 12 -1 -10 19 -1 -2 2 8 8 23
1686B3oPk1Lj1K4l8MQL9l2j0L0k1Nq%lJ0L3l4j1kpL6l8K4k1NJ9nJj2K5Ll3RK7
$$ 23 17 24 3 6 -5 19 -19 -15 -7 32 0 -10 20 -1 4 -4 -4 -7 3 36 2 -9 -11 -18 18 -20 4 -17 -12 7 2 3 -9 16 19 -14 -5 22
1724B2rRl6J6JJ9j2J1k0J2j6K6k4Qj7J0pj4J4Ol8L0JOJl8M8k9nK5k8K6j1L7l6
$$ 22 13 22 -14 2 3 22 10 21 1 13 -3 23 -1 7 -10 0 -7 -21 -7 -1 -39 -9 -8 -2 -1 -39 9 -20 -25 0 -28 -2 -13 24 -12
1759a2K8l1L0j7j5M0k2pL3k4J3k5K4Kk0K8j9J0J0l2j9K8lOK6l9J7j8mpJM2j4j9
$$ -12 16 -15 15 -2 -17 23 1 -6 27 3 16 -9 15 17 -3 25 6 16 26 -6 -25 3 0 6 32 -7 10 -8 -12 -19 -18 24 10 -9
1793iNJ6j1jJ5nJ1mk0MJ3lMj5J5nJ0Ll4PJ6j3PJ0k3K8k3J5jJk6L6k9oJ7Nj5j2
$$ -9 -4 12 1 0 15 10 21 17 -3 1 14 11 15 0 15 10 20 23 -11 -4 12 -1 6 16 -7 21 -2 13 12 13 -13 23 -6 -12 5 10 -5 -17
1831a7K6Kl0J5oj4M9k6Mj7K7J7k8OkRpkNK3k3rPjj6J3Pj4mMJ1kl2K7QJ1l4J3j8
$$ -17 9 11 -19 -4 -10 -24 25 -1 3 -14 13 30 2 8 6 15 8 6 11 34 11 2 9 8 -8 5 12 -2 -6 -2 9 7 -25 2 10 21 -13 0 -18
1870a8J8k4J9lQnl8L9L%Nj0Rj3lK8rk9J9K9j0j4J8j8J9njOk0J1k1J4Rk7J9Kj3
$$ -18 0 -24 -5 -8 0 -5 -43 -4 -1 -1 4 -6 3 -10 -13 15 6 -23 -4 25 15 1 19 1 20 15 14 20 0 11 -10 4 13 -14 5 7 -6
1907fK1k3j3K1Qmjk5L1j1oMNj9mL3j3j5K3Ml4L5k4K3nJ1j6K3m3K9J6l9NPLJ9K
$$ -6 15 -8 -21 0 8 4 3 -22 9 -2 -8 -4 1 -18 -22 11 -2 -17 6 10 -24 11 -13 10 5 16 0 23 -20 9 25 -14 -9 -2 1 20 22
1944B2k5Kj5K0PRn0L1Jj4L5m7lj1K0RkK1m0J3J6j0j1K8nk%J2jmJoqJ4kK1k2mJ2
$$ 22 -3 -1 -16 4 11 20 -30 1 2 -12 23 -24 -27 -38 -18 -9 -11 10 -30 -17 -1 -11 -22 6 1 -1 -1 11 10 6 7 1 -7 7 5 26 4 0 12
1983A2L1l7Qj2rKRj1rKK1k6L0k8NJ2k9N2l5kOOOk5J0k0M2LPk6J2J5Kj3%J0k5J7
$$ 12 43 6 14 2 -7 -5 4 -7 -16 -14 7 -19 11 -17 -12 0 -29 23 -12 -14 -8 -2 4 -21 -11 -31 11 14 21 -5 7 22 24 11 11 21 -4 13
2021A3K8k5K5m0J2l4M6Om1K4k9L4k4JJ0lj6LkPOk3J8Lj5jPJ1nnJ6m2N2j7Mj4L1
$$ 13 41 16 41 1 13 -21 25 31 -10 14 -15 19 -5 -4 6 3 -13 -10 -12 -5 1 -22 -4 -1 -16 -17 -10 1 -4 -9 7 -35 17 0 4 -10 21
2058B1l0J9K9m0J7Jk9PmJ8poK5oj2MNnk3J1JMj7J8Mj6OJ1j0mj8J3Mj0QK4Jnk3
$$ 21 -9 10 39 -1 16 17 -12 -5 -9 9 2 -4 21 15 3 7 12 7 -16 -5 -4 0 -17 1 5 -11 -5 6 -4 -8 -26 -13 -9 -19 -11 13 14 9 -14
2097a4N1j7k4KQJ4jnKj1rL2POrj6j1j1Qjj0L1l3nMj0K1pj3K4j1%j4jK6PLMqNl
$$ -14 37 20 -4 -2 6 20 19 14 16 5 -4 28 35 41 32 16 5 -6 2 1 -9 22 -11 -16 -12 -22 -1 -8 -21 3 -8 -8 -22 -23 3 10 13 17 9 14 11
2138A1J1k4MKMJ6k3K7pj6ORnl0J4LrnN%J8J4k3k1j5K8Mmj0J7Lkm%j4j5J0K9k6
$$ 11 22 -2 2 4 8 24 1 28 21 5 11 20 15 -15 -1 2 -7 -12 -7 -7 11 25 2 -19 -34 -6 -2 -6 -16 1 4 2 -2 -2 -16 -31 -21 8 -18
2177a8LNK2Nk0K0K5j2Ork4K9k6K8j4rk5M5rj2knJk5L7k5K1j4m0K5JRk3J9J5Jj1
$$ -18 -15 -10 12 17 -3 17 42 30 36 27 3 32 6 34 20 11 -14 31 22 10 8 3 4 -21 16 -9 12 -2 -42 -17 -16 -7 -30 -11 4 5 -6
2214fk8J6J6K%Lk0J0NkM%kJ7j0J7k4K7ml3K1J3jJoKk1J8J0k7J0Jk1qK4Jl4K6J0
$$ -6 -34 -18 -2 0 0 3 -17 -7 -2 -4 0 0 -2 15 5 22 -2 25 21 -12 9 22 21 22 16 18 -3 15 25 -2 8 9 -12 -20 4 5 -29 -3 7
2253Gm0J8QNOj1Jj1LM3j9Jj1PjPqJ0k0L8n3M4nql5L0J1k7qlM0k3JqMj1j0J0J8
$$ 7 -33 -15 -7 -2 4 -7 -6 -17 -14 29 10 11 0 7 6 13 5 15 -5 33 -20 24 19 11 -24 6 17 -10 -18 -21 19 -4 -3 -11 -7 -18 -28 -18 0
2292@k2oM2k3K2k3nloJ0nL1l6j1M6l1J2k1J3QLL3j5j3JPJ1j0NJ0k4j8L9k6K2j5
$$ 0 -22 -28 14 -9 13 -10 -15 -18 -24 -14 -19 12 -24 -35 11 -20 -8 -29 -16 -8 -5 28 13 0 1 8 19 9 14 24 0 -18 21 -5 17 2
2328BNpk0%pK5j0J5nj5j5K1kJ4orK4k2r%K5QKkL1l7LJ5J1j0k0p%J0l4N5k6mL1
$$ 2 7 0 -20 -20 -27 -2 -12 3 -2 -17 -32 -11 -13 1 -5 -14 10 -12 -21 -21 4 12 14 12 43 6 9 24 35 25 5 -2 -2 8 -26 29 3 -1 30
2367C0j7Kj4jj8K9Om3J7j0rQkK2k1KL0k4KPrJ9J1j6Jj9L5k3K9j9LM5m3lk8M6%
$$ 30 13 15 1 0 -18 11 17 -26 -9 -19 -28 -20 -22 0 -21 -19 11 -13 -11 -4 -13 6 17 1 2 -17 18 -5 24 5 8 53 10 7 -21 25 25
2404B5j9nj7K0j4j2mJ3j7J4J2jqOlj0J5j4L5j5k3J7oj7M0j5J2Mj3PoKj0QK0Kl2
$$ 25 6 1 -16 4 -10 -22 -26 -13 -30 -16 -4 -5 -13 -7 -10 -20 -5 -19 16 1 -22 -5 -11 -28 12 -3 9 13 0 7 1 3 -7 1 21 23 -9
2441iQJ2k3Qj0K6J1j6K4m0J7%l0J6J5rk2QlRoNpk0L6l2L0j7OK6k4k0L2Rk8L5j2
$$ -9 -1 11 -12 -4 -14 12 23 7 31 -9 8 8 -22 -6 9 0 -22 -14 -17 -8 -14 -9 -16 -36 0 -32 -2 -19 -13 13 -11 -31 1 10 -18 17 5
2478ElJ0Oj2K7l8PpPkj0NK1rl7N6m1lLNj4J2KNj5J6Pnj1j4M3j8j4J0nK5Ok7K3
$$ 5 2 12 18 6 33 -5 2 -5 2 0 -10 -5 16 7 -30 26 -15 -18 -15 -10 -24 -12 -10 -5 -20 -4 3 -2 -13 -27 16 -2 -16 -6 -11 14 20 -7 16
2517A6lrKRkrkJ4J5k5Mk3J7K3j8qNkj5OJ7k7K1j3J1j9Rj2MJ2Kj1K6l8KL0r%J2
$$ 16 13 4 6 15 13 4 2 16 31 6 10 -13 4 27 9 1 6 4 -11 -5 12 -15 6 -7 4 -15 -6 -18 -14 -2 0 -11 15 -23 -21 9 0 0 12
2556A2oj6K1J1k8nK4kJ8nj8j2j9OL6Pj1Rl%j9J0j6RloMRj0j6K3oj0%J6oK8m0L4
$$ 12 6 -10 11 22 -6 -11 13 11 29 24 6 -6 -25 -19 17 24 13 22 19 19 0 10 -6 3 0 -6 -2 7 -3 -19 4 -2 -12 -12 4 -2 26 -14 20
2595B0k6L0j2Nl5oM5k3j4J5J6l3M0mKrKJ3k6K3j6lJ6k6PJ4Mj4j0Rj8%%K1qk9J1
$$ 20 -6 24 12 17 -18 -24 21 -2 -16 -1 15 -18 22 18 20 11 13 26 0 23 7 4 20 -6 1 15 19 5 -5 4 -14 -14 -14 7 -1 -30 -19
2632a9j9L5j3mk2K3J2NKPk5L5j8OrnJ6J4j0l2J5L3Ll7L5J5n6J0J1mPrJj9LKj0
$$ -19 -38 -3 -16 -20 -42 -19 -7 -2 0 7 -18 17 -1 5 -4 -9 7 21 11 -21 -6 27 30 -7 28 43 -13 -3 8 4 11 2 3 -16 -13 -11 -21
2669b1K1LMk4J9j3RqNj0j6J4M1k4moMJ3qmjJ5j2J3KRl0QPJ4l7M5j7pj3%J1k0R
$$ -21 0 3 7 -17 2 -11 -2 -10 -5 -15 -31 -17 24 0 -4 -10 -6 7 -1 -5 -6 9 -3 10 12 21 -9 -1 6 20 -17 28 11 4 -9 -9 2 -18 -9
2708ioJ5rJ4MmkqJ8j6Rk7K4qj0Mj0mJ8jJ1K2l3J0Mjj7J1J5j2J4j1lJ6J%k2K4j9
$$ -9 -15 0 -9 5 9 5 3 -5 13 -3 6 -21 3 -5 -15 -11 -21 -25 -7 -8 3 25 -8 2 6 5 -12 -1 14 2 16 5 2 18 19 19 -3 21 2
2747BRj4NqmPJ2j1k0L0lj0J3mnj8lJ0J6Jj7j0K4Lj1L8j7rj7L8k6K2j7J0l2L6J5
$$ 2 11 -3 2 -6 -10 -3 9 -2 -22 8 5 -5 8 4 -1 -19 -22 -12 4 5 -12 -22 2 5 -6 32 15 6 -11 27 1 23 6 16 -16 20 35
2784C5j2oKl6L0j7J0Pj7J2l0J5l4L2oqKJ8lj2J5JRk8K6J2lj3J6l4K0Pj0QL2k6
$$ 35 23 17 19 -17 13 -4 6 13 -4 8 -22 -7 -41 -9 -15 -23 -21 -3 -6 -18 -3 -2 7 -21 5 17 14 1 17 -17 3 10 0 8 40 14
2820A4LMj9PJ5rQl2J3j6K1rqj0M7m2J6ojk1J4K2%kj7j4J2K4j3J5kl0jOjL9k4k
$$ 14 17 21 2 9 24 15 23 -9 4 -12 9 0 -8 -18 29 -13 3 -3 -4 -25 -11 11 11 9 -8 -22 -10 14 1 16 14 -16 -17 -11 -12 27 3 1
2858ApMl0M7j1K8j1Kmk3J2nj5J4K5j6j0k3RJ5k0J9KKlqpLmPJ5k9K9k3J7j5K0Q
$$ 1 -6 -2 -32 15 4 32 21 23 19 -4 8 3 -12 2 27 11 1 -22 -13 2 -18 1 3 5 2 -6 -13 -10 -14 -7 8 -21 8 -15 2 -13 7 15
2896A5jk4jL3kj2j4J4mK1k0K6rqk2J0Mj3NK8l1J1nJ6k7OOk3K1Kk0J6Lj4OKj3K0
$$ 15 14 -10 -11 22 20 8 -6 8 4 25 5 31 22 14 -8 2 6 -7 -2 26 -5 6 1 17 -10 -4 2 -21 0 2 -18 -2 1 -13 -7 -5 -18 2
2934Bj0J1K7o2L5%J1mMqJk5K6kK1l2K1pJ0j5POl6K0K5k6k0lJ9Qk2j1K9pJ4j7J
$$ 2 -8 3 30 -32 3 3 14 10 14 6 7 -18 8 6 27 -5 16 9 19 4 11 17 -19 1 26 0 -20 -23 -4 4 -18 -29 0 -7 7 -10 -9
2971iKJ0k2K2nk1J9J8nj5plM3j3nNQlmmj5RnJ1j0oj4%J4KKk0L4j5oNk4NJ2lLj
$$ -9 -7 3 -19 3 -2 -23 -4 14 9 -6 -13 -16 27 14 9 14 22 19 15 11 -4 5 0 11 1 -5 -19 -19 -5 -3 -1 -21 13 -2 -8 -3 -27 -22 -10 -13 -10 -11
3013a1k1J3OJ7moMK9j0k1K7Nk1LJJ4k4J4mLoj0lK2l2K0%J3oj5%mpJ5J7k2J2nj3
$$ -11 -32 -19 -13 4 0 -6 -2 27 17 -4 23 28 7 10 11 25 1 15 11 14 8 -2 -5 17 -15 5 5 18 12 -3 -3 -7 -14 1 18 -4 8 3 -10
3052a0J5jj5RK8l7KNK4k5K6j6K5l0qK0rj%j1%L9k8L2j8Mk4pK7j8J2Njnj3oJ1q
$$ -10 5 4 -11 -2 26 -11 -9 -4 20 -5 21 5 30 0 -8 12 3 2 2 -9 -9 30 2 34 16 20 -4 -11 16 -2 10 15 14 9 -4 -10 1 -7
3090gkj4J1J2j2kKJ8j7mJ3j2K0l%nJ8k4PK5j5LLNj9K4j8OOQk4j4Rk1L8J3k0rN
$$ -7 -9 -23 -12 0 -12 -14 -12 6 -11 -15 -2 -14 6 3 3 -2 16 -8 -1 24 9 12 15 20 1 25 7 13 19 27 3 -11 -2 -23 15 28 8 -1 4
3129DrQk1J5k0K5jMk8J5NKqL1j7NK2m4QK4j6k5K5mOJ9lj0Jk1J3K0k5L3k1K2j1
$$ 4 -5 3 -18 -3 -23 2 1 5 -23 -8 -3 -1 -9 22 5 10 32 -12 -4 20 4 -21 4 0 6 25 22 12 13 -8 5 25 0 33 12 34 23
3166B3Jl2J9l3L1k8J8K7j9j3k1J4K8l0K0kj1roK1lJ0Lj1pJ1jKj5K7%k7K8k7J7
$$ 23 24 -8 11 -22 9 -19 -1 26 7 -6 -27 -13 15 -15 5 3 -8 -17 -23 -2 -5 5 8 -3 -10 1 0 2 -13 14 14 -13 15 -12 5
3201EjOpk2J8j0K1j1JjJ1q%qk4J3qJ7J6l3J4j7kK6L0o1J8J1oJ2Rl2M8k2QRj3j2
$$ 5 4 10 3 -19 -1 -11 10 -1 0 -1 10 2 2 -6 -30 -17 -25 -8 8 -25 -11 -28 -30 -4 26 -35 -17 -6 -12 0 9 -23 25 3 11 20 7 -5
3239eL2kk8L5j9J4k1J2pj4K6k4j1QK0k8KK2j3J3j7K9k3k1K7k6K2Nk6lJ1NkK9k3
$$ -5 27 25 -3 32 13 27 6 18 11 -3 23 -1 -12 -4 16 -12 -10 12 -1 12 -5 24 1 -20 7 -19 3 8 -18 -21 -10 -5 -7 22 -1
3274al2M6oJ6k7M3l4RL9k2K6l2j7j7LK3j6MrK8j7j0okrnJ5j2J3kJ8jlj4J2jkM3
$$ -1 -33 13 7 23 -4 39 5 14 53 31 57 25 8 -9 -6 17 1 5 -4 24 7 -3 -9 -11 -20 -25 -10 -22 -9 -11 7 6 3 -11 1 0 -2 41
3312D1m7%K3k8J5J0l0L5j5j1L2k4rM6l7PL4k2pj3J1J0j5qJ2j3rRlK7o5L9j1OL6
$$ 41 -6 -6 17 -11 4 14 -16 19 4 -7 25 1 -8 38 1 8 42 20 13 0 11 21 6 -2 10 -3 -12 -3 -6 21 -44 -5 -16 -10 26
3347B6n5M3m3L0Lj6K0j7L0j3KJ4j9J7lk6OqJ6J2olJ1m3J7nL0Rk6Kj3QJ1mk1J2
$$ 26 -29 14 -29 1 4 -12 8 -9 21 8 10 24 5 22 19 -7 -1 -9 7 19 13 10 21 -22 -5 -10 20 29 3 5 -8 0 11 7 -14 -2
3383bj6j2L4%oj1OK3l3kJ6j1J7%nj2K4Pj8jJ3J8k3LK7k6J6k6L6k2j4K6l7QJ8p
$$ -2 -18 -30 4 4 -2 -13 -7 16 -17 -19 -3 -14 3 3 -2 -14 10 17 -1 -2 11 29 6 9 36 10 26 0 36 14 0 26 -11 -3 15 8
3419Hl1J6pJ3%j0k5L0LjPk5L5lk5J2RoK6l1LPJ1mj9qJ7kPmKJ4mlJ3j2J4k1k2O
$$ 8 -23 -7 -14 -1 -1 -11 -36 -6 -3 -4 3 -22 13 10 -15 -3 6 0 26 -5 -2 5 16 12 -7 -15 2 0 7 3 5 19 15 12 25 13 27 6 -16 -10
3459a0j2K6lj0Nk1JJ0j5K2qQJ2Lm9K1L5j6Nj4j5JK5k7L4k2K2k1kK0oJ3l0J6L6
$$ -10 -22 4 1 -9 -4 -25 -24 -14 -29 -7 -15 -7 5 8 -41 -20 15 -1 4 -10 -25 -24 1 -26 8 -14 8 -13 -15 5 -1 12 -18 -2 34
3494C4m8K4J4k0oj2J7j3j0J1J0J3k1lOKQj2j1pL9k2Mkkj2J6k1K8j6L0j7K0l1K0
$$ 34 -14 10 24 4 -2 -14 3 -10 -20 -9 1 14 -7 -10 -4 -2 6 -6 -17 -24 15 -7 -3 -5 -7 -19 -3 -24 4 -12 18 1 21 -10 10
3529A0jkL7l4j2K7j4J4Lk0rL3j4Ll0J4Mn%j2LmmqK0j8RRkpnJ0jqOK9k1jK1l7J0
$$ 10 9 7 44 10 -2 25 11 25 28 8 -1 32 18 21 -9 5 9 4 4 -8 -5 -9 -13 -21 -1 -19 -10 -1 -3 -10 -15 -5 -6 -14 -8 21 0 -1 20 -17 -7
3570gK2rJ2jk9K8J0k5K0Mj1k1J7J0j7k9L4j2J7m1L4l%Jj5kJ4k6J4J9rnJ6k2%K4
$$ -7 15 6 18 17 -12 16 26 1 21 25 14 -7 10 20 3 -26 8 -4 13 -28 6 3 3 4 -11 -13 1 -25 -11 8 -1 -6 10 -12 -12 12
3606A2mjJ3j4J1k7J2%RJ6l2L6j5j4jPJLMJ1k8rjJ5j3J6J4j8J3J%j7Rnk4L9j9P
$$ 12 8 7 20 6 17 -10 2 2 11 27 -5 31 16 2 1 8 9 12 16 27 -1 -10 -11 4 -9 7 21 3 16 17 17 0 9 4 -20 19 0 7
3644GOj2J2k9J3MqJ7j8mQL6k4mrPK9j6k4QJ7Pj9Mj9j1J6LK5l0j3Qk4L4Ooj7J3
$$ 7 13 1 13 -16 -3 1 -7 10 -8 -12 -4 32 8 4 -5 2 31 15 -9 -1 16 23 4 8 -11 -22 -6 -3 22 -8 -21 -13 -37 -3 3 -3 -20 -7
3682gnkJ9Oj2j5MJ1Pj9K6j4J0jNPj4%K3k5pjK9j3k5Qj7K2j1nK2lrnJ2j3J4mpO
$$ -7 -12 -14 5 11 -1 -16 -12 -1 6 -13 13 -1 9 8 13 20 6 6 29 4 -3 -4 25 12 -13 -5 -22 0 -11 -16 6 3 -6 -11 1 -12 2 -2 -9 -3
3722cj2Mrj0L3pmqJ1lNJ0m6N5k1KNJ7j7jJ4Ok1Omj1j1K8mLj1kjmK1j4k7K2J1l8
$$ -3 -15 -11 -20 -30 3 -4 -8 -16 -5 -8 -3 7 -39 16 -5 -3 2 19 2 1 15 21 0 6 2 -9 -20 8 4 7 -4 -6 -7 -11 10 -4 -31 -9 2 -36
3762c6J8mJ7j9J2mnL3j0j2J0j0Rj9L6j6k9K8J2mj6J3J5j5j8K8JmkrL0j9j6K5k2
$$ -36 -18 -22 -5 -24 -12 -16 -21 12 2 -10 0 -10 -1 -20 16 0 -29 -1 11 7 -9 4 19 4 -14 14 15 11 9 0 30 11 -5 20 -2
3797bj3%K1j4J1l3J0kLL3k6PJ7qrk4L9l3JJ3QJ0j5n%kJ7l0K5OK7k2nJ9j3jjk3
$$ -2 -15 -15 6 -8 3 -30 -20 -22 -19 14 -12 -5 12 4 -5 -29 10 -23 -22 -9 -1 9 -6 -11 -11 -13 4 -26 -1 5 32 10 5 24 11 10 9 -14
3835a4M0j1ojl3J1J0jJj6J7knqQPPj2oK0Lk1MJ2J0oj5ML9lk7J5j3JrL9j9J3l7
$$ -14 26 15 9 8 -25 -14 -4 -5 -4 -20 -3 -5 -10 -18 -10 -3 4 -8 -14 6 9 -12 -8 4 14 8 -7 -3 36 33 6 21 8 9 0 39 20 33 -4
3874dL0k8J4nJ3k5K7k5J6j7k6L5lJ3k4L0oj5j6J5Kj4kK5Ll5J4L1oqJ3k2Q%Nj1
$$ -4 26 -2 12 7 20 -5 22 -3 13 -4 -30 5 2 15 -9 21 15 0 -16 -1 1 -13 -15 10 13 -22 -8 23 17 9 22 0 8 8 13 2
3910BkJ9qQJ6k5qK3l%k1J2j7JJ2J8m9K3Pj1j1j2J4oQj3K5Ol5K0j3J1j0K3poRj5
$$ 2 0 19 11 19 35 10 2 25 22 22 1 13 -4 -3 9 27 -22 1 8 -3 -14 -26 -12 -18 -10 -23 2 8 -27 -7 -20 -9 -19 4 -3 -9 0 -15
3948a5K3J2k0K7Nk8K9pk3j3POJnQqK4l8K2j6rL5k6nnK1j0mJ1ppJ1k2J9J6l5J4
$$ -15 8 20 0 27 32 4 33 26 3 -10 -3 3 4 -1 7 -1 23 -15 7 -9 -18 17 -9 -14 -19 2 -8 -12 -1 -8 -15 -4 -26 -7 9 -26 -12
3985a2L7j0J3j7j7L2j0j3j0J0KqJ4j4KQK7k1j6RRk6L3k0JJ6k5Nm1M8j7PMOl3L6
$$ -12 25 15 28 11 -6 26 16 3 -7 3 5 -3 11 -3 -1 7 34 13 -3 6 15 -11 22 2 3 19 -6 -1 -42 6 -11 -4 0 6 -27 9
4021Ilj5kQj1J5J5Nk7J9O%l0J2L3k6J9j3jj0L1k6j7K4l5K8krJ0k6K3j8J7%oj3
$$ 9 6 -9 -11 -3 -14 1 16 21 -6 13 19 19 -11 1 34 8 27 14 13 3 34 8 -9 15 -20 8 6 -3 7 -19 4 -14 3 3 -3 -16
4057a6pPMK0mm0K3K7j0j5pK4Lj8mK1J8J2m5RJ1j8OjL2k1OrJ7j2l9L5J0j1mJ4j5
$$ -16 -23 -16 -12 8 4 -36 -13 14 4 -11 -18 6 9 -9 -13 8 26 38 -7 2 13 -5 1 0 32 11 17 8 25 13 -26 9 19 8 4 18 3
4094CrK1lk0J0J1j8qj0j3M4j0qPmK4Nk9MnQJJ1%jJ7l6K9k0kJ4MrjqQj4KL1k2K
$$ 3 -6 15 12 -8 2 13 -5 -13 -23 -36 8 -2 -10 -3 -7 17 22 -7 -3 -8 0 1 12 12 11 28 -8 21 1 -1 13 17 8 7 -1 7 -7 -5 26 4 6
4135Fj9J0J2k8J3jnJ7Kj3J8j6LJMj3JJ5k4L3l9L5Pk8J6j5K8k3LrJ1Qk2J6j1K5
$$ 6 -13 -3 9 -19 -6 -7 -12 5 7 -6 12 -4 -1 0 4 -9 -8 7 -17 16 -23 12 19 -9 7 -8 20 -3 0 -9 2 10 -12 4 -7 18
4171A8l4K5Jl5L2JlJ3j3j8Qlj6J3K1Ok0k5K0J0pJ1rkRlkNM4m3j1J0K4k0nL3k1
$$ 18 -16 9 10 -25 7 8 5 18 5 -13 -5 -8 -24 -11 10 16 -4 -29 -9 1 -6 5 -4 -6 3 0 -2 3 47 4 -7 3 27 7 2 35 14
4208A4j0K8j8j6J4pJ2j7j4J2nOm2M2k1L8j5k4J4j3K3l6M0j5Nmj3K8j0PJ4j4j3
$$ 14 4 32 14 -2 12 5 17 0 -14 -2 -7 -1 -43 -1 -22 16 1 -23 -9 -22 1 -35 5 -10 -5 -9 -22 6 -4 3 17 3 -10
4241a0NL0l3J3OJj1J8Jj5%l4J7RJ9j0J0j4J4k7K7kKl3jQJ5J1j7j4PMj3qM5k5J1
$$ -10 -5 25 -8 5 11 12 1 19 20 5 5 -29 -12 -3 16 6 16 2 16 -11 16 14 16 -17 -18 -10 5 16 -1 -15 -8 -4 -17 -25 20 -5 6
4278Fj3QJ1l7K9oj0L6k7K2K2m9K3kmKj0j3jNmlM2l0oPJ0j7%J3l1K9l8K1Omj2K3
$$ 6 -7 1 12 -25 4 -2 -12 24 -3 19 41 -8 15 13 9 11 1 -12 -13 -8 -12 -15 27 -3 -9 -2 8 -9 -9 4 -27 2 -36 -15 -9 -13 -25 -2
4316bj4L1j3Oj1JoL3j1k4K3k0K1j1ONj4L2j1k9J2k9K2J5J1l7J7k1J1LMk0L6k2
$$ -2 -16 15 2 8 -3 -2 -8 25 14 -10 13 -7 14 3 9 14 0 32 21 -8 4 -25 -3 12 23 -14 3 -18 -7 -4 0 -20 16 -6
4350fJk3J2NJ0j8k0K6Qk1J5J8Rk1L4k7k0K8plNQk6loM2qlmjoJ0ooL9m7J6nj7K6
$$ -6 -5 -28 -16 -11 -1 -19 -39 -13 -5 -26 -11 7 16 -5 29 2 -18 10 3 0 5 13 -13 -16 -22 20 12 9 5 4 -2 8 2 -4 35 -12 4 -1 -18 8
4390Hj7K0l3ONj1%L0n1M5nj3RJ7l4qRJ5J3k0j7J8RJ9mj1J8J1k4KLoRMkm5K9pR
$$ 8 -9 11 -22 -16 -11 -22 -22 8 -43 2 -3 -16 -7 10 -24 -32 -23 -8 5 -15 -32 -14 -5 14 10 -1 17 28 4 6 9 3 12 16 14 -31 -2 -9 0
4429@j3KjLMmL1l3J8J7l5J0J8mj5OnRk3J2moK9J5l1K0J6l5KnK4J8l0oJ0j4kOj1
$$ 0 -13 -11 -12 -9 -5 -9 22 -11 7 24 -11 -1 17 13 -2 4 -1 8 -15 -3 -7 -13 16 31 0 20 36 1 3 -2 22 40 10 4 14 0 -2 4 -7
4468gJ1j%kpPpkRJPm9K3j7N3Pl9kNqK7mj8K2qNLj0J3%J0j7j4L3j4j3nPRPj8%L
$$ -7 4 3 3 1 -6 1 -6 -8 1 2 9 -40 -17 -34 19 26 -13 -15 -10 -18 9 5 -13 9 1 6 9 -1 12 12 22 5 -9 24 10 -3 -8 -1 8 15 -3 -3 0
4511@Ok2L1Pj1j1l5K3Nj9L9k8K7j6J2k5oJ0L2n0K0J7qj5L1m0K1K1j2MJK1j4Pl
$$ 0 6 -16 15 22 11 0 -35 -12 -7 -26 13 -15 12 -4 8 -17 -23 -13 19 -31 -11 6 -2 -17 14 -26 -5 16 4 8 9 30 16 23 20
4546B0j2k1J0Rk0K6k5KL5j8j7l1L4j1L5j5j6oN1l7j2J1k2K6k2K1K9k8J7oj5Oj5
$$ 20 8 -13 -3 6 -14 12 -13 -11 24 6 -11 -42 -8 -19 16 1 -15 -21 30 -7 -19 -8 -30 -4 -26 -5 24 -4 13 7 -8 -2 -17
4579a7L2oj8K1k1L5k9KJ6kj6pL8j5j7kqOK6rk7J2Mkk7M0j6%ml4L0J0Nj5J8k6p
$$ -17 15 9 -9 12 -9 26 -3 -1 15 13 -3 -10 28 13 -4 -6 -14 -8 18 9 -18 -6 -2 -4 -31 9 -7 -7 -11 -45 -15 -5 0 -15 3 -23 -30
4616c0K9J2J0k3L6m4L6k8K6l4K2J4l9J5qNJ4j9jJ6oljj1PoJ8l1K5j9%K4k2L6k3
$$ -30 -1 11 21 -2 34 -10 26 -2 24 -10 12 26 -13 2 -6 -1 13 -6 -7 9 3 0 -1 -12 -5 -11 7 -24 1 -18 -18 6 -16 20 -3
4651cqmkNJ0Lj3j3QL1Jl0L9rJ0kj2Pj1J4Kl9L2k8J8J2qkRk0j0J0Oj8qJ4mk0M1
$$ -3 -11 -15 -17 -12 -2 1 -12 -25 -17 14 15 -15 24 15 25 23 11 18 7 21 23 -16 16 -12 6 18 10 8 17 -3 -13 -3 3 -15 -23 -9 -13 -33 8
4690Hlok0oJ6oNlJ3Rk3L1rj9K9l0M1j7lj0MJ7kk1M3l5Mj4j4J5J7k5J5k6NK1j3
$$ 8 5 -1 -21 -27 -11 -17 -12 -15 -2 7 -16 15 6 -13 16 -14 27 10 7 -3 1 18 16 -5 38 3 7 -7 -21 -6 11 -14 1 -25 -20 1 -12
4727a2J9pJl1J6kJ3KJ4j5kpK1k2LMJ2qoJ8oKkJ0k6K0j2jK5k6K9ppPj2qJ0J1k3
$$ -12 7 0 1 -30 -14 -16 -3 -1 13 -2 -4 -11 10 -12 -9 -5 7 -1 -7 11 5 7 5 15 -11 9 -3 -4 21 -5 24 17 10 17 5 -3 7 18 -5
4766ej0J5%j0MkkJ4p%KMl5L2mj0%K2k4J3J0l2L9j1K0nj9j2L5j8K8k5k4K2mjJ6
$$ -5 -15 0 0 -10 -6 -8 -10 4 -3 -3 -1 3 -32 0 -4 -14 -14 8 -16 -3 7 -25 14 3 23 18 -1 -13 22 4 32 7 -17 5 1 0 16
4803A6k5J4nk7N1m5J3nkK3k7J3Qj2MmNMKJ9k2L7k8nj9j5L3J4j4J7k3%K0j9jJ7
$$ 16 -9 5 0 -27 24 -21 -8 -13 -15 8 -19 -6 2 -10 -6 -10 -5 -1 1 20 -2 35 7 2 -17 -32 1 15 1 18 -5 -5 15 -4 -5 12
4839A2qkj8oK4j8L6k2LJ8m5QK9pk2J1k6L5k1J6qK2oKOk3LJ4j3jj1L5Pnj8kJ7k
$$ 12 4 2 -16 -22 2 -16 20 -2 1 19 -26 -18 11 4 -18 -7 -33 2 -19 -3 -11 11 5 7 13 -10 -7 7 -6 -7 -18 17 24 19 1 -1 16 14
4877A4j2Lj2L7m0J3k3L1mro%J3lrJ7j2l8K2JL3k7JOj4L2j3j6Qj3lJ9K3Lk1K3l7
$$ 14 2 5 -7 30 -10 3 -20 11 7 -2 -8 -8 5 2 -7 10 -2 -40 -18 -17 16 -11 -10 -4 -18 14 1 -15 -7 -20 -23 -4 19 22 1 24 -13
4914a3J8MK7k7MPj0Pqj0Oj0J0mJ0j3J2jk2J4Jj3KMPqRk1Pj2LOL2l1J3j4K8j8j0
$$ -13 5 9 36 9 13 20 10 17 9 -1 5 -5 5 1 11 -2 10 9 -13 1 2 -11 -9 -5 2 -6 3 -18 -11 -23 -20 -14 18 -13 0 -14 14 -4 -14
4953a4L0n0L5lqKJ1K3n3K5jK2pmOlj0oOKj1Pj9J4K2k9L7l7pJ7Nj0j2L8l6K2k4
$$ -14 16 -34 1 -2 -10 -8 3 26 -27 -2 -3 19 12 8 14 11 1 -5 1 3 -8 -1 -20 -6 16 -13 24 -13 -20 -3 2 -8 -20 18 -18 4 -20
4990b0J1kkK2pK1l4J2qj6K4j1J3j2RjJ4j3Jj1K0j9rK6jJrqJ2Mj0mJ2lnQK3m8p
$$ -20 -9 -11 -13 9 2 23 -11 1 -7 -23 1 -10 3 -9 0 -1 13 0 1 -10 10 -9 -18 8 7 8 -1 -9 3 7 -3 -7 5 2 -3 5 28 -20 -27
5029b7J8j9K3m0L6moL1k9K3KOrj9J4MK2rj6OMjj2lKJ4j0J6j4k4K0LpJk0K2m0K0
$$ -27 -9 -28 -5 -45 -9 -13 -19 12 -17 6 8 14 5 -14 0 4 26 17 1 7 11 10 -2 -5 -3 11 1 17 3 -21 -1 2 -5 -4 -24 -2 -42 -22
5067b2m%J8Jj3J3k4J3pL2Loj0J7pkqJ2J7lJ1j7JoJ7Jj7j5RK%k5OJ2j6K9j0k8N
$$ -22 -26 -26 -8 -7 -20 -7 -31 -18 -25 7 10 4 -6 11 4 2 -6 6 23 20 31 14 15 9 26 27 10 -5 4 6 6 -19 -13 -1 -17 12 2 -26 -21
5106b1J9Oj3J1k2LJ9k2L9j3pjlJ0jRLj6J8j5mL4k1n%jJ4j4j4L2k5K3pLj9J0l1
$$ -21 -2 4 -9 2 -20 -17 2 -20 19 6 -1 -2 -5 5 4 13 16 0 18 3 -1 33 12 7 7 6 20 6 -8 24 -1 22 15 18 -1 9 -22
5143b2K0L0m2kj6K5k6L0l0K5LKPrJ3rJ8j5j9K5%kJ0j3K0j4%J0j9J7Mk7J0K4k4
$$ -22 -2 28 -14 -16 -32 -7 -33 -3 -33 -8 -5 -3 4 -5 8 -1 17 2 -17 8 8 6 16 3 23 9 9 19 0 17 21 -6 4 28 4
5178DOj7J7j1K8l2pJ5j3kKqK0j4j1Qj8KlM8kl8J2J8k0O3k8k0lJK0k6K8Kl0LJ4
$$ 4 10 -7 10 -1 27 -5 -12 3 -10 -12 -10 -18 2 -12 -23 -15 -33 -31 -34 14 12 -26 -14 4 -16 47 19 -1 -4 -3 17 -9 19 21 -9 -6 8
5215HJ0k0oLj0OkOJ8LNk9J3%pj6K6oj7Ok0L0l7L7j3%J5k9lJ6KK7j4KoQK2n2M2
$$ 8 18 -2 -8 -5 -15 -9 -11 -5 13 16 21 -8 5 5 -2 -18 8 2 -15 -9 -29 1 -36 1 -12 -12 3 -26 -29 -13 -11 16 2 4 -2 6 28 -24 18
5254A8k2rJ1oK8l3K2j0l6L6Oj9L1k4J2K0k6Kl6L7rLlPj0KKk1J6j4L9j2J0k8M8
$$ 18 -4 -13 -2 -8 20 -13 9 -1 -37 -1 5 -14 17 -7 5 25 -1 1 -35 2 -7 -4 -7 0 -10 -8 -6 -27 -11 -25 14 2 12 -16 32
5289C2m0L1k7knK2J0J4k7LJ0l1RJ5JQj2oJ3l5J4Mj9K2j5j2K6rj3J7Rk6J8Pll6
$$ 32 -8 23 -4 -6 -11 11 21 35 8 11 21 -10 -1 14 15 23 11 5 18 -17 -3 1 -18 4 -11 -23 3 -6 -19 -2 7 -19 -1 6 3 -33
5325c3NRK5k1POQj0J7LqJ5NJl8J0J3Ql8RJ8k4QJ2J2k5K6j1j0j1j6K0nK0k2M3l5
$$ -33 -28 -19 6 -15 -8 -2 6 -4 13 16 8 23 28 29 -9 1 14 22 -16 -7 11 -13 -5 7 19 -6 20 9 -1 -12 -28 -8 -13 7 -15 28 -7
5362gj1J5lnJ0oNj5J4K8k8k2kL9j4oK3j6QlJ7kK5l4Rj3j9N7m6J2j3Onj0L0k0k0
$$ -7 -18 -3 -6 -11 -1 -7 -2 -17 -3 25 -3 -25 -27 12 -2 -8 15 -1 7 4 21 19 44 10 19 6 -13 44 -2 10 -3 3 -2 -12 18 -2 -22
5399b2L9l1J9klkk4K3J3j1j1j6K3K1j7j0mJ3j0QJ5l5M3nj0J1nrJ0%J1k3K0m3N0
$$ -22 17 -14 5 3 0 -2 -26 -3 10 -1 -12 -28 -5 16 -1 -11 -15 -2 -12 -4 11 -24 19 14 4 15 10 1 11 11 22 -1 19 -24 26
5434B6k1J9k6j2J2%Pj4nlpL4m2K7j1PJ0j6JpPJ9J7k7KK3l0M4l8NlK2k4K0j2J6
$$ 26 5 24 -2 -14 -2 -2 5 -9 -14 -17 -24 10 -32 -5 -16 -9 1 -15 -14 -21 -14 5 22 -5 -3 20 -10 34 -4 1 -2 20 -4 16 4 20
5470B0kl5K7oj6oL3rk4PqL6pl1L3k1j7J8J7l2J2Mj5L1nl2N5j5j1Pj0jMJ2Mpoj
$$ 20 18 -17 10 4 -12 -18 15 6 -18 -11 -19 17 10 -21 12 -9 -26 -8 9 -23 -11 -7 -22 9 4 -28 27 12 1 8 -2 -3 1 13 17 10 4 3
5508CJ6j4J1l1L0k1OJ0pmonK3k1K1l4L2Jk1J0k8M6k9J3k3J3k1K2pqM6pOJj7Pk1
$$ 3 19 5 16 -15 15 -6 0 10 3 -1 -7 -12 11 -10 11 -23 9 10 -11 -1 -29 17 -12 1 -22 -9 -30 -8 -15 -23 23 16 22 23 6 13 -8
5545hQJ8jlJ9pj9kRl2J0K9rk7J6lKk1K1kj7J8k1K2j8J3KPk0oJ6Jj3lRk2M5jj6
$$ -8 0 18 17 14 33 26 7 5 14 -18 -8 21 12 -15 1 -2 0 -21 0 -2 -19 -1 -22 0 -18 -5 -3 4 -16 -22 -6 -5 -18 -21 -12 -34 11 10 -6
5584fj1K2oqOKL1l0K1J6k4rk6K9JqPj4j5K1nlnK7l2L6k4mllj3J8K8qk1j3K6mR
$$ -6 -17 5 -1 -9 -3 -1 30 0 21 37 13 4 -22 7 8 0 7 -7 -22 -1 -6 -9 -14 13 -19 17 -7 -11 -14 -17 -30 -12 16 8 -13 -26 0 -4 5
5623EjoK3k7j1%K0%kK3j6K%Lk1J5pOj0rJ8j4J0PLj7j8J9kNKnOk1L1l8J6K1j7q
$$ 5 4 -2 21 -6 -17 -17 3 3 1 24 8 10 10 13 -8 7 0 6 -4 -13 5 -9 1 8 11 -6 -24 -5 -7 -2 0 -5 1 -20 11 -27 -11 10 -7 -15
5663a5Nj4J2J2j0L1j3j2PJKj4K1k4nJ2j7L4k4M5m0n%J3qKK0qj0Nl1J9j1K0j4J5
$$ -15 -10 -24 -12 0 -10 21 8 -4 3 4 6 -8 13 -11 -16 -4 -21 13 -11 34 -6 -11 -11 2 -6 -4 16 8 -2 3 -28 -9 -20 0 -14 1
5699Aj3njLJPj5J5KnRrJ9j7OQK5l0nJ5Rk3L5l2loKNL1j8k0M%J0j3k0jRJ6k0OJ2
$$ 1 -12 -17 -18 -15 -14 -7 -22 -7 -5 -10 -1 -10 9 -8 -2 6 31 1 -4 11 20 -3 32 0 -3 -9 -7 -2 29 11 -9 -5 -5 5 -8 -28 -29 -20 -4 -24 -18 -6
5741fkk7L7j6K6rj4k0M2k3LL4k2Pk5j1M1k8J9nj3oJ4rK2nj2K1j0Plk6K%lKK6P
$$ -6 -8 -35 2 -14 12 3 -11 -31 11 -12 -9 25 3 10 -15 -26 15 -13 6 1 -12 -18 -4 -13 9 4 -8 13 3 10 7 -19 -17 -17 -20 -18 8 15
5779A5k4%L0k7j2K6k9j8K6jRoMqJ3k5J9J8%j3J2Kk3K3j5jLM1j4l2%K8k7J6m6%
$$ 15 -9 -9 21 -6 -18 8 -21 -39 -13 -14 -5 -11 -7 -15 -2 -27 -8 10 10 -3 9 11 -12 11 -4 -5 -2 39 25 -7 -7 21 -6 10 -36 -36
5815c6L9l3K5j4L0j9pQRMnK4m3Rj1K2k8L8j2J3k3J3qjJ1pJ6KLl2K4j1NJ5k1J7
$$ -36 3 -30 -5 -19 11 -8 -15 -7 2 6 1 25 -18 -9 -20 2 -26 12 0 13 -10 3 -5 -6 5 -2 14 16 19 -13 11 0 5 20 -1 16
5851A6j7J3l0K6l4K4mj0J1JmJ1nnjonj6L7qRl3L4rRJ6k7J3nkj4L1l0L2Lj5J1j0
$$ 16 -1 12 -18 8 -26 -2 -6 -16 -5 -4 -8 3 -2 -7 -8 -14 -19 -35 2 -6 3 -30 4 -5 4 20 -7 6 1 -1 -15 16 -14 18 21 6 17 7
5889Gj3J5j4J7kk4K7j8%j1J3j2k3L5kqRkoK3k4rJ5lJ9Mm2K4j3J5p%NK0Kk0J3R
$$ 7 -6 9 -5 12 10 -14 13 -5 -5 -16 -3 -15 -38 -3 -5 -13 -4 -6 -12 11 -13 -22 -7 -10 9 13 -29 -5 -18 -3 -10 -10 -5 15 17 -3 10 19
5927A9k1J5j4J3mjj5Rkk7L7J2j0j0j7%%J1j6KOKK5k6J1njJ9j7j2J9k2K1kK7n5
$$ 19 -2 13 -1 12 8 7 -8 1 -1 -28 9 21 11 1 -16 -16 -16 -5 -21 -19 -13 -11 14 -12 -1 -6 -7 12 -5 -17 2 -20 1 -1 26 -29
5963b9M7j1k3K1j6L8m0J2M2m3J0k1KJ9K%mj1PJ2k0J3j0j6j1K3qK1%j4Lk1K5lN
$$ -29 18 7 -16 5 -11 27 -13 -1 41 -2 8 -13 -11 8 10 10 6 -5 2 14 -6 7 -3 -19 -30 -7 -15 6 6 -8 -5 -26 -1 -4 1
5998Ak1LMK2J6l1oK4j4K8j8k7M8l7K2NoOk5K8kk5j1K0Oj2k2J8j9J8lj6OqQPJ3
$$ 1 -20 -17 -13 9 25 -6 -12 12 -2 26 8 -19 29 -8 14 19 13 19 -6 22 20 -5 -16 4 10 -2 -24 -6 -25 -7 -10 -26 -20 -28 -20 -13 0
6035@rN%j0J7j0J4nnK2k6JnJ9%J2rJ3JLk9K2j6jJ2rpJ5mj8pLK4k5K1Pl7J0Kj2
$$ 0 -9 -4 -4 -14 3 -7 7 2 -3 19 -7 -6 -11 8 8 20 11 24 25 28 -1 21 5 4 16 7 0 15 11 -7 -14 -11 13 -12 9 16 -21 -11 -9 -21
6075b1J8J3j0kMj8J4knJ5k1J6j0lK4j6K3j5Joj4J7KqjRJ6k6MjMRK0l6K4j9pJ4
$$ -21 -3 10 0 -2 2 -16 -2 -4 -9 6 -15 1 -9 -12 12 -4 19 4 5 -1 -15 2 4 -4 -5 4 20 -6 -2 -3 1 10 30 -6 18 -1 -8 6
6113FNml5K1lRj8J1K6l3PRj2Qk9M1k4M4l3kOj3K1Rl0L3j4J1J8k7pNk0PJJ1Lk0
$$ 6 11 7 -28 -7 -10 -1 -19 -8 18 -15 -8 1 -11 -3 -32 9 -15 29 -4 -6 0 -13 8 17 -13 20 6 17 35 8 1 6 -14 -7 -6 5 8 -12
6151a2KnK2%Kj5OMk7MPOJ0oj1Mjj5OPL3l5K0Rl6K6Kj1J0nJ7j2Pj4jpj1J6j3QK7
$$ -12 -10 -15 7 7 9 -6 0 4 -23 -19 -12 -6 4 -2 -13 -9 -10 -25 -19 -12 21 -14 6 15 -21 5 7 -4 6 1 18 6 13 -1 -2 -9 -20 -4 -17 -9 18
6192A8j0%j7jKmpj4L9l8K3J6j7J0Mj9MpJ9J7k6JJ1j1L1l2J1Kj7K5KPrK0m1j1K4
$$ 18 8 8 -9 -10 -8 -12 -19 -33 6 -32 -9 7 -10 0 4 -15 -11 -18 1 18 -8 -7 4 -7 24 -8 3 5 -12 13 15 22 13 33 -8 -19 5
6229EK9k0j6Pk3J8%j9K8kj4j3JJPJ0mj3J5oJ5l7L0KnJj0j3L7OOl2LMJ9%OPj5l
$$ 5 34 14 -2 5 -18 0 0 -19 9 7 -7 -20 -19 -18 -11 -1 -5 -18 -3 -9 6 -31 -1 1 -4 -3 -13 -26 11 17 23 -9 -6 -2 17 17 23 30 15 12
6269A2nj9K2Qk4RJ1l5J2QpKJ9l3J0NJ0k4K1oK4j2l4K5J7m0J4J6k%KK1j6k4j1L2
$$ 12 7 -12 10 18 -6 3 14 -21 -9 -1 -8 -6 13 -20 -10 -5 5 -19 2 -4 20 8 -26 -1 16 -24 -10 6 4 4 6 27 11 -13 -24 8
6305Hnj7L8k9QKJ9k6L4k9k0L4k1K1j6M0m4jlJj2J5j6RJ1oKMj2J0lrQK2rj0j7R
$$ 8 3 -14 24 -5 3 5 24 -2 32 3 -17 17 -4 17 1 41 -3 -4 -7 -6 -18 -3 -19 -10 1 -5 -3 1 -11 -1 -4 -13 -5 17 8 -2 -19 -10
6343a0jPK3oj9NR%j3K0j1kJ1ljmrlJ2Oj7j0k3K1kJ5mK7l1K2l4J9%j7NJK0j3K2
$$ -10 -11 -4 19 13 -6 -1 8 8 -5 15 4 2 13 10 9 5 -4 -7 5 11 -6 -16 -39 -18 -20 -5 -9 18 -13 9 -25 -6 -6 -23 -18 -17 3 -10 12
6382A2l9J5jJ7NJ6k9J2j4%NnQ%rMkRkK4j3k9J2rJ3j4qK8nl4lJ5J4K1l2J1jKMl
$$ 12 -27 -12 -13 4 9 25 -4 8 -6 -6 -1 -6 2 2 -7 -3 -5 4 2 26 13 -16 -4 -13 0 -14 -22 6 1 -33 -36 -21 -7 14 -18 -7 -8 -6 -2 -5
6422epLKjJlOPqK5k4Nj6M2j7pJ0j0qj9K0MJ1j6j8PKJ4Kj4K2j5J2k1QPl9J8J6J2
$$ -5 -12 -9 -7 -8 -7 -10 -4 3 -5 20 -4 1 -15 27 10 3 13 3 -5 -24 -4 0 11 -5 -23 -16 -14 0 2 -12 10 -5 7 -14 -6 1 -38 -20 -4 8
6462Hj2Lj4J1j6L9k7K0rppK2Lk4RL3k9qJ3j8L7k8qQJ0l0L7l3J1K5j9oj1J7o0N9
$$ 8 -4 -1 -15 -4 -20 19 -8 12 3 -4 -11 11 14 -10 -1 32 3 -5 8 -10 27 -1 -9 -1 9 -21 16 -17 -6 19 0 -6 -17 0 -60 -1
6498ankK3j0nLJ3Mj0j5K3k1J5k5K1k1J5j9J3NL0j4oK8m3K5j1qJ2j2J6%j9MJ3j4
$$ -1 -6 -8 15 5 0 3 16 20 10 -5 18 -3 12 -13 8 -13 2 -17 -4 1 31 17 11 39 -4 21 10 2 14 2 18 18 -1 3 16 2
6534Bm7L2MJ5nJ3Qk1%j6J7k1L8j2k0RjJKJ5j2OOj1J4k1J7mpl3L9m7L0J4pK2rk0
$$ 2 -45 -13 -9 6 1 14 22 1 1 -15 2 -19 19 7 -13 -4 -5 -4 -2 13 1 7 13 2 16 -5 12 8 1 -32 7 -40 -10 4 -3 19 10 -10
6572a0lK3j9j1kK1j1JK5k0J6kj9NL6k8J7Pm0K2nlJ9%l4K4jJ4k9J6J8l9RJ2lnj
$$ -10 -13 10 -9 -20 -22 -1 -12 -11 14 -6 10 8 -11 -6 30 2 19 26 -14 8 3 0 19 19 -15 9 8 22 -7 9 27 -12 -3 9 6 1 0
6609@PJ8n2K0J0rj6L3j9j9K6j3KoJ0jllQLJ1l3M1m4M3J0j1j5J4J2j1k7nM4k2J4
$$ 0 7 25 -27 -7 3 -6 -22 11 -8 -27 -1 -14 -12 -18 -8 -9 -12 -15 -7 -4 7 -26 15 -29 14 24 13 -2 12 24 13 -14 -19 25 3 17
6645A7k7K1J2ok8JJ4kKj2j9J4K5l6L2rk5J6Mj0K0j9JQj5J4k0J7j0M0o8L5K9lj8
$$ 17 -10 11 23 17 -11 -10 4 2 4 -8 -27 -13 12 -24 8 -1 -26 -10 -6 -16 4 -15 -14 -6 -21 -7 -27 -10 -20 20 -48 -13 16 13 -5
6680eoJ1Qj1J4J4l0J7j2J2j5MMj3Nj0L1k6K5j3m3M7Mk4PmJ1jj7K3j6OkJ0j6NJ8
$$ -5 -11 0 8 -3 11 25 -5 12 0 12 -3 1 5 -8 -3 -13 18 -8 17 4 -39 8 12 -12 -5 -9 2 1 -16 7 -9 -3 -5 5 -11 -6 12
6717A2l4J3JMk0K8Pj0JpK0k4J8O%rk6K9k4PMQj4j2K7J7l0Rk3Llj2L1Kmm%J3Kr
$$ 12 -22 -9 -8 -4 -24 4 11 1 2 -5 15 -9 9 15 15 6 -20 9 -15 -8 -4 4 -10 -22 5 22 -8 1 -22 -19 -22 -34 -3 -1 -5 -9 -9 4 6 -3
6757cL5l8MQ%J3Lj9mL3k6j5j7M9k9J8Mj5opK4k2JJ9j4OJ2k4J3k2K7J5j2rK8l5
$$ -3 32 -6 -2 6 6 19 22 3 -1 32 6 -9 -26 23 -6 12 16 1 -5 -12 12 -10 -9 10 -4 2 14 -10 3 -19 8 23 11 2 30 -5
6793ej0K1o%%MOqLlMMpqJl2M3J7j2Kkj8mQJ7Lk6Nk3M5k1J9k4KoK4k9J3j6kL2j7
$$ -5 -15 6 0 0 0 4 10 2 5 2 6 10 3 -5 -4 -36 7 24 12 14 12 -6 -10 -2 15 18 -8 -3 -26 19 -2 17 -7 -5 -11 13 -16 -3 -19 -21 11 -6
6835fOk6L6k2J3J8k7j4L3j6J0j4RrK9j8j1K2o%NPj6%Qkj7J8j4jL0l5Rj5K7%Qj3
$$ -6 0 -26 10 -12 1 19 -8 -22 11 -5 5 -9 0 -9 20 2 -9 13 7 7 12 19 3 3 11 9 -8 10 -4 -5 25 -10 -1 -16 11 11 19 6
6873FJ%J2j3oNj7J8mMjjLj3K2l0J6J0kK8l0J9jl4j9M6pj6J4onJ7k2L9k0j1%K4
$$ 6 7 7 19 6 0 5 -12 6 2 6 5 4 7 -6 16 -14 2 12 10 38 8 27 26 -8 -27 19 12 -4 10 4 -1 16 -6 33 13 2 2 26
6911B6k5j8L1l3L6Rk2mmRj0K5l0j4QJ0J9mkkK7k5lK1j5j1K9k7K0l3Lj0L5qJ4k9
$$ 26 1 -17 14 -19 17 26 4 0 -4 5 -5 20 -10 -24 -16 -6 13 9 7 5 32 7 4 25 10 -1 28 1 21 -12 -9 -19 16 8 22 -7
6947goJ6k9L9j7J7l3lL7k7QNoMJ1j4pNqJ9qJ2kK3m6K0j0QNpK0nJj9LKKJ2j6k5
$$ -7 -13 3 -26 13 -4 13 -20 -23 14 -13 -5 0 -6 -2 9 -5 -12 -7 -15 4 -4 8 6 29 -17 3 -7 1 6 -1 19 14 15 -4 -1 1 3 15 -1 -26
6987b6L0LJJ1n4L9JJnj4j2L9k0Pj3OOJ3rj3Qk1J0J7qj6J4J3j3J9lk1J0kK6k5L0
$$ -26 4 7 8 19 -35 4 5 6 1 -13 -25 14 -6 1 -12 -6 0 13 4 -9 -1 -22 -12 5 -3 -19 -5 8 -5 14 11 -10 0 -2 24 -1 29
7024B9k5NJ1l8RJ9qPNj8QNkMj0j6j2K2pM7n2NJ3j6lK0Mk1RJ8l0JJ2Qj3K3n%j7
$$ 29 4 9 20 -18 -9 10 2 9 14 -4 4 9 7 11 1 -15 -27 -5 -12 35 -17 -12 1 -15 -18 2 6 -15 -6 12 -18 -17 -5 3 -10 13 8 8 -9
7063iJ8J3k6J8j0qjj9L3J2l3qnM5l0L0m7jNMjkL5l0K3nJj1nJ8jj2rL4l6pL7j4
$$ -9 9 22 -4 14 4 -4 -5 -24 9 21 -12 -20 -25 20 -10 20 -27 -28 -23 -19 -20 -22 13 -17 6 1 2 -9 -14 4 3 -9 -18 16 -20 -27 10 -4
7101dJ5k0%J9mMlMk9J1K7Jj6%Jj0j9J5OJ8j7onmLMOJ0Rk3J5k3J8j2J8Lk4nK4m
$$ -4 11 -9 -9 10 6 10 7 11 -18 -7 20 21 5 5 6 -4 -23 -8 -2 16 -1 -7 -12 -16 -13 -9 -3 7 16 -7 8 -15 3 -9 9 12 -12 -17 7 3
7141CJ1Ol8L7m3L4J4l6M7jk7k0RJ9Rk0%qNkK1l0OLlKJ3lk1L0l6L5k6J7LnKmRk8
$$ 3 14 20 -18 19 -24 10 24 -12 35 34 7 -13 -4 15 24 4 4 -4 1 -1 20 -10 -4 -1 -4 -2 11 8 -13 17 -19 16 -10 7 10 5 7 3 12 -16
7181a6J7K5j2KKj4J7j1k5J4K3J9l2jMQj7pOrJ2J4k2J6k9K0j6JM3m2K1k0Kj4kK5
$$ -16 1 26 14 16 18 4 21 10 -15 -1 22 41 9 8 12 20 3 -4 2 -7 5 19 -3 13 -16 4 -12 -11 32 -10 11 -9 -7 -21 -23 2
7217BJj0j9M4Rj9qK2J2l6nL6l3J8nOj1oJ9oMOmk1K2l0J7j3LJ0j5mJJ2MJ6pk9P
$$ 2 3 -7 -26 18 27 8 0 22 34 -2 -7 29 -4 14 9 15 4 -2 17 11 15 21 17 -4 18 -12 5 -8 -5 5 -10 -14 -13 -1 3 19 12 -17 -10
7256a0PKJ6k0lL1j8lK6Jl0Rj8L4l8J0M1l6K4kj6K1n1L3K8k8Rm6K8Oj0rJ2mQjj3
$$ -10 -3 -1 15 -5 -8 23 5 2 28 29 -1 8 -10 24 -14 -4 37 1 25 23 7 28 -23 10 38 10 19 -27 1 7 -3 -12 0 -4 4 3 -10
7293a0NK2j1Krnjj3J7M%pJ1j3K0j4L7l1K4j3J0rj1J7j0K0m1J1Qj1j%lK4mnrK5
$$ -10 -5 17 6 8 -1 -6 -7 -20 -3 1 1 -6 5 -8 12 -2 35 4 28 15 25 16 5 22 12 32 -9 2 10 -1 -2 -2 -5 19 15 10 1 26
7331B6j7k5J7Qj9lRK9nj3K7k3k3%lM4l6J3L2Jn4K2lj2%J1j0mL0l1K1lj0k4L4m
$$ 26 9 -16 1 9 -10 -13 -4 25 20 7 34 11 -12 -12 -15 29 -7 6 38 39 -15 7 4 -8 -8 3 -7 -11 19 -12 9 6 -4 -28 6 2
7367BjQJ3k8J3Jj1j7J6j6RnmK0NJLQm9L2KK1J1l7L5Mj8q%J3k3MjNPJ4j4J7k3K0
$$ 2 1 9 22 -6 7 8 -3 -20 -4 -20 -11 -16 -20 0 5 6 9 17 -32 0 2 23 34 -3 32 36 18 10 10 23 0 4 3 8 15 29 15 32 9 29
7407B9m0K4l0J5l2J9pJ6K2Kj5j0%k3L4J5Ql1J2Kj8LjK1k7K8j3j2%K6j5OJ0Jkj
$$ 29 -11 13 -17 -2 -34 -15 -22 -6 16 18 3 -7 -7 -30 4 19 27 -4 8 10 -8 -5 -6 15 -12 16 3 -9 -9 17 2 8 18 19 17 16
7443A6l2N4l4j8J3N%klj9K6OrJ2Pn3J9QnJ0j4nL7j9JJ4j9Ql5N4k5J4k3J8J2k7
$$ 16 -16 38 4 -14 -1 4 4 2 -1 -20 6 12 3 15 22 -31 -12 -4 -9 1 -13 -18 19 0 1 15 -4 4 -31 23 -2 12 -11 7 19 -8
7479hNJ5J2j9J5Nj6k3L3k7K2j4J9qJ6j9Oj6rQJLJj6j6K0qJ4j0J1J4Ol9L4j9K0
$$ -8 -3 12 24 5 20 25 9 -14 19 -8 14 0 19 11 27 8 14 -2 -11 -3 -2 1 2 -14 -30 -10 -18 -4 -14 -3 11 17 -22 12 -7 13
7515A3k5rJ6%J8j5Ok2J3Oj4J9J0j3j6K1j0rQk4K7k8K3J5J5j4l3J7J3l6K4Pk7K3
$$ 13 -12 -21 -5 -5 13 -2 4 -18 -5 1 -13 6 16 3 -13 8 -2 -11 -3 -27 0 -28 -5 10 25 11 -22 -5 8 -28 -4 3 -24 -1
7549aRj3K6l9K0jJJj3J0kJ7Jk0J2oRj5Pj1K4j3mJ2k2K4k1PnQJ5l1K2jj3J8k3M
$$ -1 8 -5 21 -18 2 1 2 3 -10 0 -2 15 16 -4 8 2 11 -4 3 -8 16 3 -1 11 -11 13 -8 -1 -6 2 17 -14 8 7 -6 12 -11 -7
7587g%QoRj0Pmj2Rj1RrK1jj0K0lk5J3jj8N4k2Mk4K3J9k2mj5%QJ7l3K7k5K7jqL
$$ -7 -7 1 -5 4 -6 1 -3 -15 -6 -17 -8 -17 4 3 -7 13 10 -15 -2 -3 -21 33 11 15 -9 14 33 11 7 -8 -8 0 17 -16 11 -14 13 12 4 7
7627Goj3K5J1j3j4lK3j1Mkr%K2l0nNlJ1K0l0M4l3Ql3ML7K5j9qk1J3j2LPJ2JJ0
$$ 7 1 -12 13 24 11 -3 -6 17 6 10 8 -1 -1 21 -9 -14 -9 -12 -1 19 -11 33 0 8 -25 -21 16 41 22 14 -7 6 -6 -3 4 16 17 27
7665B7k7JNjj6QJ1llRl2K3Lmj3K1j8Jj8J5J1PmkRk5J6J4j3J4nlJj3J1NjPKj4N
$$ 27 0 1 6 5 -11 -3 8 5 2 11 -21 2 5 1 -12 9 -9 -8 -26 -11 0 7 3 1 10 -15 1 15 2 16 11 8 9 -4 7 12 11 18 20 6 11
7706A1L5k0j9k4kJ2J8Kj1Qlj0j0J4%J7j8QK3k0J5onj8J4K4j8J1j5JQJl1%PKj0
$$ 11 46 26 7 -17 -19 -7 11 13 2 10 7 -3 -13 1 1 18 0 8 31 11 26 20 15 -3 11 35 17 28 13 14 22 23 -8 -8 -1 1 -9
7743iK1nkj1K4lj4Rolj4PLj4J5J2j0QLNj2lJ3pJ0l1L6J0l4mL4j9jJJrjj0OK8o
$$ -9 12 7 5 -6 18 15 1 10 4 1 -13 -6 -3 -17 -2 10 0 8 11 16 4 1 14 7 17 -14 22 32 -2 -6 28 9 8 9 10 1 0 -10 -4 24 18
7784A8ookj7M6m6NJ5mlj4JJ9k1K2mk5J0J7K1l1Kj8N5l7lM0l2pNJ9J1kj7mj1%J3
$$ 18 12 6 4 -13 33 -13 -8 7 3 0 -14 -13 6 -15 7 3 -22 -12 5 26 -5 -3 -21 34 -3 -6 34 2 -5 0 19 30 28 11 7 -4 -4 9
7822Ikj7pPJ3k1J9K5m7K6qMkJ3Jj7j2M3pl1J2Rj3k6O1nk2JrK5Rkl7L2oj6j8M1
$$ 9 7 -10 -17 -10 3 -18 1 26 -21 5 -3 1 -1 12 13 -4 -16 27 20 -11 1 10 -3 -29 32 27 5 6 -3 22 31 29 -8 24 18 2 -16 25
7860B5qj7J4l0K5qnK2j9jQQkl6L2Oj5oK3m3RK1j3j1MMJ6Pj4k0J5J2j3PJ4J0k9
$$ 25 17 0 14 -16 9 1 -4 18 -1 -2 6 14 12 -24 8 14 -1 -7 16 -27 -18 3 -10 -21 -17 -13 3 10 -4 -24 -9 3 -10 -3 11 21 -8
7897hJ7NJmpj1J5j5Jj4J6L%jJ6j0j3JM0m6J2K4ql7J9j0Rj2J8J0pLKj6K6j2k4K2
$$ -8 9 14 15 11 4 -7 8 -7 -6 -20 -4 -1 -1 -2 14 4 -9 -8 32 -14 -2 22 14 -23 -4 -14 -5 -17 1 11 4 7 9 -7 19 7 -17 5
7935EQ%J6pl1K5Nqj4j0M0l7K3k0pM2n5L3Ookj5J1K3l3K2k2K4j9qK6k6J5llQkj8
$$ 5 13 13 29 22 -9 16 21 13 -1 -11 29 -8 15 -5 -12 30 -25 8 14 8 6 -9 2 25 -8 14 -8 16 -3 -11 15 -11 4 1 -2 6 4 -14
7973a4K2j1j4jL9k1nM9o7M6ll5OrJ8NL4o1L4J0l5J2lLJ0p%nkj9J1ONLNj5kQL0
$$ -14 8 -3 -17 -18 21 0 -5 44 -23 23 20 -15 -9 -18 0 5 39 -22 12 22 -13 -1 -4 -1 9 2 2 -3 -5 -24 -13 -7 -2 1 6 -9 -11 -3 27
8012B7m1L0Ol3KPJ0q%NJk3J1L1k3K0k6M6l7qK7j9J4k1qQpJ8rpL2l4Rj4oM3j8l
$$ 27 -14 16 22 -11 -9 -2 8 0 0 5 6 -17 -6 25 2 22 -4 42 5 -3 24 5 19 -2 -10 -2 -9 9 0 -7 25 -9 0 -14 -20 23 5 2
8050BKQj2k6K1K6qok9J1k6K5J6j1K7j9pL4k0Qj4lQJ5l0MJ3J4k2PJ8l3lpJ1L3l1
$$ 2 4 12 0 -26 -5 21 13 7 -22 -11 -37 -12 4 -7 20 1 -6 28 8 16 2 -1 7 22 -8 -4 9 23 1 8 26 -7 -10 -17 -6 27 -4
8087dJJ1oQnMj5MmJ1j5K1j6J4%nJ7j2RL4n7KjkK0qrJ1ljkj0nJ3J2k4K2j1k8K6
$$ -4 -3 8 2 10 5 9 -6 -2 -6 5 -10 11 -5 9 9 4 21 9 18 52 -5 -3 -4 -6 14 6 -3 8 5 4 2 -8 -13 0 12 -12 10 -1 -29 -3
8127ck0MJ2PopKNNJRj8nj0K3J2l5K9Pj0j4J3J2l1M7k9L4j6k2PMJ3mk2K1rj5J5
$$ -3 -23 -19 -7 0 -6 -13 -11 -6 -1 0 9 -9 -14 -24 -1 11 -24 5 12 2 -12 1 13 -18 29 0 34 18 -4 3 7 20 16 -6 15 6 -9 6
8165Fj2jJ0Jj2j0OOPJ3k1LK1J8m2J1Jk4K2lK0%Oj8oL
$$ 6 -6 -7 3 4 -8 -18 -12 -6 1 14 -7 -4 17 35 -7 4 5 -19 3 0 20 20 26 8 2 5
8191E
$$ Imaginary data points
##PAGE= N=2
##DATA TABLE= (X++(I..I)), XYDATA
0@%%%%%%%%%%Qj6J6j6J6k4L2m0M8n6P2q8J04j20J36j60J92k24K56k88L28l76M28
$$ 0 0 0 0 0 0 0 0 0 0 0 8 -8 8 -8 8 -16 16 -24 24 -32 40 -48 56 -64 72 -88 104 -120 136 -152 176 -200 228
33B28m86N50o20O96p81Q73r75J087j208J340j484J642j815K004k210K434k683
$$ 228 -258 292 -328 368 -413 460 -515 572 -636 704 -780 862 -953 1051 -1159 1275 -1408
50a408K957l257L592l962M374m840N371n977O679p506Q492r696J1203j3153J5790
$$ -1408 1549 -1708 1884 -2078 2296 -2544 2827 -3150 3529 -3977 4515 -5181 6022 -7131 8659
65H659j9573K5488l6075O0448j30551N9699M9624l0592K2842j7994J4720j2402
$$ 8659 -10914 14574 -21501 38947 -91604 -31905 17719 -12873 9969 -8025 6695 -5707
77e707J0652r233Q089p173O402n766N198m672M215l829L472l169K846k548K313
$$ -5707 4945 -4288 3801 -3372 3030 -2736 2462 -2210 2005 -1824 1648 -1521 1325 -1223 1090
92A090k116J932j742J591j441J277j157J052r39Q50p67O70n55M94m96M56l54L19
$$ 1090 -1026 906 -836 755 -686 591 -566 486 -453 397 -370 300 -255 239 -257 199 -155 164
110A64k86K24k09J98j50J24j29J30q6M8n5M7k1J0l9K8nK0j3J1k1L6k3oj2QQk2
$$ 164 -122 102 -107 91 -59 65 -64 66 -20 28 -27 20 -1 9 -30 -2 -7 13 0 11 -10 26 3 -3 -15 -7 1 -21
138b1K8l2M4l3J5KK0ok8kpK4J1l0K2J7m2MLJ5l5PK8J0nj0jK2k1L2m5jL0k0j4J5
$$ -21 7 -25 19 -14 1 3 23 17 -11 -13 -20 4 15 -15 7 24 -18 -14 -11 4 -31 -24 4 14 9 -1 -2 20 -1 31 -14 -15 15 -5 -19 -4
174dRJnmJ2oNQmj9K3k7j3K5%j4J1j0NL2j2pnPoQj3K5Kj8pj9K1K1j8nj0KK1k7L6
$$ -4 5 6 1 -3 9 3 8 16 12 -7 16 -11 -24 1 1 -13 -2 -12 -7 25 13 6 1 8 2 10 -3 22 24 6 -1 -20 1 22 4 -1 -11 -9 12 -15 21
215B1l2KK5K1m5J8Oj4qJ3j9rL7l6J6J9k0j3J9J1j8K2olrOl0RM7m1M3pk2K6j2n
$$ 21 -11 -9 16 37 -8 10 16 2 -6 7 -12 -21 16 -20 -4 15 -5 -18 1 12 -6 16 10 7 -2 4 -26 -17 30 -11 32 25 3 29 17 12
251A2rQk5M0m6J1J5J4l8QK7j5oP%k1mlM3m6K1K1k4oL1k0J6k6J1Pj6J7J5j8jnJ1
$$ 12 3 11 -14 26 -20 -9 6 20 -18 -10 17 2 -4 3 3 -18 -22 -25 18 -28 -7 14 -10 -16 15 -5 11 -15 -4 3 -13 4 19 1 0 -5 6
288Fj0kj1K3oJQpJ3lomJ2l7L8oj5K9m7nK5j3J5qJ1j6QJ2ppJ1qK0Ll5RLJ5Jpj0
$$ 6 -4 -6 -17 6 0 1 9 2 15 12 6 2 14 -23 15 9 -6 23 -24 -29 -4 -17 -2 -10 1 -15 -7 5 -2 -9 2 -6 14 17 -18 -9 -6 9 10 3 -7
329gK9k3J1nm4K5K8j7J6J5k9J7k7K1j5%Kk3L8j6m0M6k9RL5Nl2J3k0K6J0k7J8k8
$$ -7 22 -1 10 5 -39 -14 14 -3 13 28 -1 16 -11 10 -5 -5 -3 -26 12 -4 -44 2 -27 -18 17 22 -10 3 -17 9 19 -8 10 -18
363a8J8J8l3jKmL1j9RmKqrRPJ3j8kPk6L6m8M2j0L4k8lJ1pqMJ1k2K8ll3J5K4k8
$$ -18 0 18 -15 -16 -14 -18 13 -6 3 -1 1 -7 -16 -7 0 13 -5 -7 0 -26 10 -38 4 -6 28 0 -3 8 1 -7 -3 8 -14 14 11 -22 -7 17 -11
402a1qQLKK0j9K1rk3L8k1Mk3j3L3JQj5j0PJL0j9%j5RQj3Rjj5L0k2%j4L4k2j4J9
$$ -11 -19 -11 -8 -6 14 -5 16 7 -16 22 1 5 -18 -31 2 3 11 -4 -14 -7 -6 24 5 5 -10 -1 7 -6 3 2 -13 17 -5 -5 -19 15 -7 -21 -2
441bl1N3mk9J4j7K8Qj4KJ5k0l0J3L4k5K5m7J1J1Kj8M0m6LM6l2OJ6j3jOjPl7J4
$$ -2 -33 20 16 -13 1 -16 12 20 6 8 23 3 -27 -14 20 -5 20 -27 -16 -5 -3 -21 19 -27 -24 22 -10 -4 12 -1 -2 4 3 10 -27 -13
477a3J5l1nK8J3k6Pj1J4J8k6JM6nm1J9k2K7mrJ7l4J9J1koRj5J0K1k8K8l4J8Pj6
$$ -13 2 -29 -34 -6 7 -19 -12 -23 -9 9 -17 -16 30 25 -16 3 -19 8 4 -5 12 -22 -3 8 6 0 9 -6 4 25 -3 25 -9 9 16 0
513@plJ9rpmJ3k0jL0j3kRrJ1J3j9J8l2RMj3LJ1J0J3Qk5poK2j7j4J7%onK6jj8j2
$$ 0 -7 -10 9 0 -7 -11 2 -18 -19 11 -2 -4 5 -4 7 20 1 19 -13 -4 0 -13 -10 1 11 24 32 7 0 -6 16 -1 -15 2 2 -4 -9 17 16 -2 -14
554a4j4K8Jj1%kJ4Pl1LK1j1J8j2j9J8OqJ1j3PJ2kjj3LK4j4j5J2LK1k6L3k7j4k1
$$ -14 -28 0 1 -10 -10 -12 2 9 -22 -19 2 -9 9 -3 -22 -4 2 -6 5 -8 -1 11 9 8 -5 -2 22 8 -7 5 8 29 3 36 9 -5 -26
591b6K9k9J9K1k2Q%J3k3J0MJ1k7rJ2K2Ok2NrnJ1k8KK5j6K7Oj5j2K8j2lMJ0j1m
$$ -26 3 -26 -7 14 -8 0 0 13 -10 0 4 15 -12 -21 -9 13 19 -3 2 -7 -12 -1 -29 -27 -2 -18 9 15 0 -12 16 4 1 5 15 4 0
628@K6m0L8j8qk2K0J3j3rLJ2j4K4k0j6K8j5jnJ1j4J6J1rJ1j6J2j2J8l1K9Qj4j1
$$ 0 26 -14 24 6 -2 -24 -4 9 -4 -13 -10 2 -12 12 -8 -24 4 -11 -12 -17 -6 -20 -4 7 -2 9 -7 5 -7 11 -20 9 17 3 -8
663hKJ2QMj3Jj8J9j6j3K2l2RK5kj0K1k2Kj8K8j1J3jnNj1OMoJ1k2jJ1J7Ok8k2K0
$$ -8 -6 6 14 18 5 6 -12 7 -9 -22 0 -32 -23 2 0 -10 11 -11 -9 -27 1 -10 3 2 -3 2 -9 -3 1 -5 6 -16 -17 -6 11 17 -11 -33 -13
702a3RmPMoPLj0qK6Nm5M9j6rk5RJ7q%J5lm1K4K9l3J7NJ1l0LOJ9k2J0%%J2k2J9
$$ -13 -4 -8 -1 3 -3 4 7 -3 -11 15 20 -25 24 8 -1 -26 -17 0 -8 -8 7 4 -37 -13 16 -17 0 5 16 -14 -11 -5 14 -8 2 2 2 14 -8 11
742A1j4ONnpJ0J0J4k1kk9J7J5k0L1j1Mk7L9k4MjJ7l0Jj1J7j8Rk3J5K3rLlJ8oM
$$ 11 -3 3 8 3 -4 6 16 30 9 7 -22 -5 10 -10 21 10 14 -13 26 2 6 5 22 -8 -7 -18 -1 -19 -10 -33 -18 5 -4 -1 -4 14 8 12
780A2j4JMKLMJLj4Jj1J6mj3RQL3o0LJ5LNj8L2J5l0kMorK6j3Nmm1O0l5MK0Kk6Q
$$ 12 -2 -1 3 5 8 12 13 16 2 3 -8 8 4 -9 0 8 41 -19 -16 -1 2 7 -11 21 36 6 4 8 2 -7 19 6 11 7 -34 26 -9 -5 15 17 -9 -1
822aJ4J8k2J7k9J8j0kK3j5j0J9q%orKJ0nJ9qk3PJ4j7RPrkLKpj9J9kKNj2oJ2J9
$$ -1 13 31 9 26 -3 15 5 3 26 11 1 20 12 12 6 -3 -1 9 4 23 15 -8 -1 13 -4 5 12 3 1 4 6 -1 -20 -1 -3 -1 4 -8 -14 -2 17
863A7k3J5K1l1rJ4Qj6lPPjrJ3lJ2k1Rj6J9nk6L4k1kjqJ4jKj6RK5j4j4K9j7l0N2
$$ 17 -6 9 30 -1 -10 4 12 -4 -7 0 7 6 -3 10 7 19 -2 7 -9 10 5 -21 13 -8 -10 -11 -19 -5 -6 -4 -20 -11 14 0 -14 15 -2 -32 20
902B0m6L1nJ3nKj1J6l0kL8qk4J7jK8k5k8K9%LopJ6j2k8K7%j0j4J3JjLkoLNmj1
$$ 20 -26 5 0 13 8 10 -1 15 -15 -17 21 13 -11 6 5 33 8 -20 9 9 12 6 -1 15 3 -25 2 2 -8 -22 -9 -8 -9 -6 -8 -14 -11 -6 -10 -21
942b1J4lj9PK4k6L3nl0K7j3J1LJ8l0J4k9J5Pk7K7oK0j9lj3J4J4k1LLpK2Mmk%M
$$ -21 -7 -10 -29 -22 2 -24 9 4 -26 1 -12 -1 2 20 -10 4 -25 -10 -3 -30 -3 -9 11 -8 -11 -24 -10 4 -17 -14 -11 -18 4 8 4 2 2 6
980FJJPj8J7k0rK9l1L3l1K2KOk3K2Qk9J9Jj0%lK1j1Nj0MnpK6j6rJ1j7K1pk6Ql
$$ 6 7 8 15 -3 14 -6 -15 14 -17 16 -15 7 9 15 -8 14 22 -7 12 13 3 3 0 21 10 15 5 9 4 -3 23 7 -2 9 -8 13 6 -20 -12 -15
1020a5L9k6oj5K9k4L5j1%pkJ5okpRKj7J2MqRNj0QQj7J6J3%l6K0m2L1j0KjJJ0j3
$$ -15 24 -2 -8 -23 6 -18 17 6 6 -1 -3 12 6 4 -3 6 8 -9 3 7 -1 8 13 3 11 19 2 18 31 31 -5 15 -27 4 -6 -4 -5 -4 6 -7
1060gnJ0nlLPJ1j4J5j6LJ6j8KK6j5k1J6RNJ6o1L9oK5j9Npj3JQJ2JNk3K8l2j3m
$$ -7 -12 -2 -7 -10 -7 0 11 -3 12 -4 -1 15 -3 -1 25 10 -11 5 14 19 35 -26 13 7 32 13 18 11 -2 -1 7 19 20 25 2 30 -2 -15 -19
1099a9K8mk9L5j3J5l2J7lkJ6jj6nK3jj3J0j2RJ0Ql5JL8j2j4j0K0j6K7qmNkm%j6
$$ -19 9 5 -24 11 -2 13 -19 -2 -5 -7 9 8 -8 -13 10 9 -4 6 -6 3 13 21 -14 -13 25 13 -1 -11 9 -7 20 12 8 13 11 7 7 -9
1137iOM1m2J1J9qj7nJ1kok0L1JpOk9J3OJ9l8J0OK1kkMLj9Pj2JK9l6K6j2K5m0K2
$$ -9 -3 38 -4 7 26 18 1 -4 7 5 -1 -21 10 11 4 10 -19 -6 0 19 -19 -9 -3 18 16 14 18 21 2 9 -3 -2 27 -9 17 5 30 -10 12
1176A2k7K1K1k3RJj2J8Nm0K0j4njJ%J2kJ6j0j4L4nj4k5K7%K6m0RPnj7J8Lj7K3
$$ 12 -15 6 27 4 13 14 2 20 25 -15 5 -9 -14 -15 -14 -14 -2 -4 12 2 -12 22 17 3 -22 5 5 31 -9 0 7 2 -15 3 6 -11 12
1213A2l6L9K5m5KQk2J2J4Mj6J3k0%RmJ4Qk4J5k4PJ6mk9L8lpMm4N7l2pK2JJMjQ
$$ 12 -24 15 40 -5 -3 5 -17 -5 9 13 -3 10 -10 -10 -1 -5 9 17 -7 8 -16 -9 7 3 -26 12 9 2 6 -38 19 -13 -20 2 3 4 8 7 15
1252A5kj1J0j0j9mL0Mqj4K5lk1J0Qj5J0qlPj3Jk%RPJ4opj5J5mj1J3j6kL8l7k1
$$ 15 13 2 12 2 -17 -21 9 13 5 -9 16 13 -8 2 10 -5 5 -3 -6 1 -12 -11 -13 -13 -4 3 17 11 4 -11 4 0 -11 2 -14 -16 22 -15 -36
1291c6L9PJ2k5oK8k3Kj5K5j2j6J2QJ6Nk7Jj1J9qLNj7PK1k6K5pqPrJ3l3J1OJ5J5
$$ -36 3 10 22 -3 -9 19 -4 -2 -17 8 -4 -20 -8 0 16 21 -6 -5 -16 3 -5 -2 3 -14 -7 14 -12 13 6 -2 5 -4 9 -24 -13 -7 8 23
1329B3k4Qj3L8k9j8L0Lk7K2Jj5K6l0J1j1JJJ3j1QJ9n0LQJ7lNmqJ9J0j3rJ1j4K0
$$ 23 -1 7 -6 32 3 -15 15 18 -9 13 14 -1 25 -5 6 -5 -4 -3 10 -1 7 26 -24 -21 -13 4 1 6 2 -6 13 23 10 1 12 -2 18
1366A8j6rJ8j9J6Qj2l6K0K1Ql1N8n3RJJ7j0j6K1lrPj1Nj0Nj6QJ0l4M6j9L0k3j
$$ 18 2 -7 11 -8 8 16 4 -32 -12 9 17 -14 44 -9 0 1 18 8 -8 13 10 1 8 -3 2 -8 -3 -19 -11 -1 -35 11 -8 22 -1 -2
1402bRRk3kOj1K0MQk3j4J1Nj6J1J8nk0K6%k9L2J1j6Rj3l0L4K2k0j0oK7l3%K0k0
$$ -2 7 16 -7 -9 -3 -14 6 10 18 -5 -19 -8 -3 -19 -8 10 5 -15 11 11 -18 14 25 9 18 5 -25 9 31 11 1 -5 22 -11 -11 9 -11
1439a1j6K8KJ6Nj2k6K7k4Rj1nL6j0NRj2Qj9RLj4L4m4MJ3J3k0qJ3pNK4k6J9kjL
$$ -11 -27 1 3 19 24 12 -14 13 -11 -2 -13 -18 18 8 13 22 10 18 -1 8 11 -3 31 -13 -9 4 17 -3 -11 2 -5 0 24 -2 17 15 14 17
1477A7qloj1Pj%JpkJ1jJ9j5QOQk4O%jrL2l1k1L0j3L6m2J0j0j5K1K6k7K7krlrK0
$$ 17 9 6 0 -11 -4 -5 -5 -4 -11 -13 -2 -3 16 1 9 15 23 -1 5 5 4 -5 27 -4 -25 5 -8 28 -14 -4 -14 -29 -8 18 -9 18 16 7 4 -5 15
1518A5J2m8J2KL0k6MQnj4k1L6rJkKj0K5Lj3mK8l7M6k3qQlRk1J5j0Mj2J1qKQQj6
$$ 15 27 -21 -9 -7 23 -3 1 9 4 -10 -31 5 -4 -3 -5 -3 -13 12 15 2 -2 26 -11 35 12 4 12 9 18 -3 12 2 6 -6 5 -3 -1 7 15 -1
1558aQpl5L4K2j2J8j7QOnj1RnJ1n5J5J4J5j5J0j3J2RPoNnj0nkK2pRj9MKj3oK1
$$ -1 7 0 -35 -1 21 9 27 10 18 24 19 8 17 12 23 -32 -17 -3 12 -3 7 -6 6 15 22 16 21 16 6 1 -1 21 14 23 4 8 10 -3 -9 12
1598A2l0L5j8L1m6J8K3j7j2J6j3j5L1qj5mL5l5J2J2l6M2j6j0J3nlJ0nJ6rpJ9k1
$$ 12 -18 17 -1 30 -16 2 25 8 -4 12 -1 -16 15 7 -8 -12 23 -12 0 12 -24 18 2 -8 5 0 -3 7 2 18 9 2 21 0
1632@J8Kk4J5MJj2j5%J5Jj0%L1k9J3lkj5PNqOjJ2l5M5k3MK3j4j7NQJ3Orm3L9j8
$$ 0 18 20 -4 11 15 16 4 -11 -11 4 5 -5 -5 26 -3 10 7 5 -10 -3 2 -6 0 -1 11 -24 21 -2 2 25 11 -6 -1 7 20 26 17 -26 13 -5
1672eK4l3J5j0kOj2J5pJ2nK0k0J1%qJ6l2J4qk0M8lk9j1N3l2J9Nkj8k0J2j1J3J3
$$ -5 19 -14 1 -9 -11 -5 -17 -2 -9 3 -2 18 -2 9 9 1 17 -15 -1 -9 -29 19 16 -13 -24 29 -3 16 21 19 1 -19 -7 -18 -5 8
1708HrKMJ6J8km2L3m2M1l1K0j3RJ5m3m%K3j3M9l5%LnNnj6QJ8l7%K2J8qmK1l4J3
$$ 8 -1 1 5 21 39 37 -5 28 -14 27 -4 16 3 12 27 -16 -20 -20 3 -10 39 4 4 7 2 7 2 -14 -6 12 -25 -25 -3 15 7 3 24 -10 3
1747Ck8J7jK0rK4k2qj0RQqRNjLj1K1%j8mJMkj7J1oPKrlKjJ3PpOlJ7qJj0J8Rm2
$$ 3 -25 -8 -9 11 2 26 4 -4 -14 -5 3 -5 4 9 8 11 0 21 21 3 -1 0 4 2 -15 -4 -10 -3 -1 -10 -13 -11 -12 1 8 1 7 4 21 13 14 4 22 31 -11
1792a1J0lJ7jjJ2qJ1k9ML4l6nK7j2J5l7L9k3rK1n0N6l2K4K2k9NqjPoNqoK5j4k9
$$ -11 -1 -4 13 12 11 23 15 26 -3 1 35 -1 -6 21 9 24 -13 26 3 -6 15 -35 21 -11 13 35 6 11 3 2 9 3 8 0 -6 19 5 -24
1830b4L6k6K9j1j1KK6l0NNnL2k9pK8j3l8K9jML2k2qj5j4K4K4Mk6J7l5K8j4J3k5
$$ -24 12 -14 15 4 -7 -5 21 -9 -4 1 -4 28 -1 -8 20 7 -31 -2 -3 1 33 11 3 -12 -26 -2 22 26 0 17 -18 10 -4 9 -16
1865a6J8Lj5J0K3j6NJ5k6j4KJ7J3j7KJ0j1QqJ5k4J1olPNj6O%K6m9M9Rm6K5K2j1
$$ -16 2 5 -10 0 23 7 12 27 1 -13 -11 6 19 2 4 14 3 11 3 18 -6 5 -1 -4 3 8 -8 -2 -2 24 -25 24 33 -13 12 34 23
1902B3k2j2J6K0j7k0JKK3ok4J0J8k9L2j7J3qj7K5j4QJ8pnk5NJ4jJ3k5K6k3JJj7
$$ 23 1 -11 5 25 8 -12 -11 -9 14 8 -16 -6 12 -17 15 -2 11 3 -14 11 -3 5 23 16 11 -14 -9 5 4 17 -8 18 -5 -4 -3 -20
1938b0K9j0Ojk9K0kJ5Qk0K8k1j9JrK1K2k5J7k7qL0j6J1Rk3nM1ql5L4jk8K8%qj
$$ -20 9 -1 5 4 -25 -5 -7 8 16 -4 24 3 -16 -15 -24 -3 19 -6 11 -16 -24 6 -10 1 10 -13 -18 23 15 -20 14 13 -15 13 13 5 4
1975Dj8J8kk5K7j0K9k9MJ0j6M8m5%k7K4K9k3J1NpOj6j2J6lj7JK7j0RMj5J2pJM
$$ 4 -14 4 2 -23 4 -6 23 -6 -2 8 -8 40 -5 -5 -32 -8 21 -2 9 14 7 13 -3 -15 1 -2 -19 -18 9 -1 8 12 -3 9 2 3 7
2012GOj2K4l1jJ5kj2NJ5j8NJ7l1Qj6K3krL7l6J9j7J6Ok9K2Krj8K3j3RrJ5knj8
$$ 7 13 1 25 -6 -7 8 6 -6 -1 14 -4 1 18 -13 -5 -21 2 0 -9 28 -8 11 -6 10 16 -13 9 11 2 -16 7 -6 3 -6 9 7 2 -16
2050a6J7j3K1MnK0j5j1nJ6j6lK6qk0M2n1%lJ1OOl1K9RlPj2j1ljPqJ7n%QPOj1k0
$$ -16 1 -12 9 13 8 28 13 2 -3 13 -3 -6 20 12 -8 34 -17 -17 -20 -9 -3 3 -28 1 10 7 14 2 -9 -12 -13 -6 -14 3 -2 -2 6 13 19 8 -12
2091a2J1J7k0J9oK6l4J0k1K2%oJ4Jmj6J5Nm1K3moJ3k0j4L0qjJ9k6K0k4K3Mj5K3
$$ -12 -1 16 -4 15 9 35 1 11 -10 12 12 6 20 21 17 1 16 21 -20 3 -1 -7 6 -14 -28 2 -6 -7 12 -14 6 -18 5 9 -6 17
2127A7qlJ1jjRk7J2j5KKJ1qML%pRj5QLj1J0k7K9K1j0k0j5kL7oqPKj6J0J3k2MO
$$ 17 9 6 17 16 15 24 -3 9 -6 -4 -2 9 1 5 8 8 1 10 -5 3 6 -5 5 -22 7 28 18 -2 -17 -19 18 12 4 11 13 -3 7 20 -2 2 8
2168HK4k5nJ3nj1RJ8kk5Jmk0N5k3J1j7k0J9j4J4jnK3j3pj2K4J0j0j7K3nk9J0q
$$ 8 32 7 2 15 10 -1 8 26 24 -1 0 -4 -24 31 8 19 2 -18 1 -13 1 0 -5 18 5 -2 -14 10 20 10 -7 16 11 -18 -8 -16
2204a6J3QOj2J4k5J3RQk5K0Qj0Qk0Mj0L5n6K5QOk9M7l1rJ7J5k3Mj3J1pNNNl3L0
$$ -16 -3 5 11 -1 13 -12 1 10 18 -7 13 21 11 19 -1 3 -7 28 -28 -3 5 11 -18 29 -2 -11 6 21 -2 2 -11 0 -7 -2 3 8 -25 5
2242EJj2J8j8J2mQj1J1k0oJ0QlK5k9K5pnmRj3J5ol5L8jk1K4j4j2j0MK8j9OJ2J0
$$ 5 6 -6 12 -6 6 2 10 -1 10 -10 -16 -6 2 -1 24 -5 20 13 8 4 13 0 15 9 -26 12 11 -10 14 0 -12 -22 -18 10 -9 -3 9 19
2280A9j8j3PQj1LnJ2j8K0qK6k9NM6k7k4nK6J0J8l9j1L1j4%ll3K7Qk3K2Mpqkj5
$$ 19 1 -12 -5 3 -8 -5 -10 2 -16 4 -4 22 -7 -2 44 17 -7 -12 14 24 42 3 -8 23 9 9 6 -27 0 8 -15 7 11 4 -4 -6 -21
2317b1OK1k2J4j4J3K3l7J8J4j3k5J6RPoKonJ4nJ5l3lmM3j1pK0j7JJ3K7o7K9ko
$$ -21 -15 6 -16 -2 -16 -3 20 -17 1 15 2 -23 -7 2 9 3 5 -1 -6 8 3 18 -15 -18 -22 21 10 3 23 6 7 20 47 -20 9 7 1
2354ArnmK0k2J8k0L4k0j0LJ8k5QK2m7N3Jk4QJj4jJ4QJ8m5K4l6K8kk1J9JJ7J1p
$$ 1 -8 -13 -17 3 -19 -1 -21 13 -7 -17 -14 4 -21 -13 9 -38 15 16 -8 0 1 -13 -14 0 8 26 -19 5 -31 -3 -5 -26 -7 -6 11 22 15
2391A5Ql2rK3K1m1KK6k6K0j4MrL1l3mJ2LRpOpj6J0J7j6J1j2J3K%j3J1j9J1Olj
$$ 15 23 -9 -18 5 26 -15 -13 13 -13 7 -7 -3 -12 19 -14 -18 -6 -3 6 -1 5 -2 -18 -8 9 -7 4 -8 5 7 7 -6 5 -14 -3 3 0 -1
2429ajQqklLJ5k7J6nJQj7J2nJ8k2j0J5l3J3J8j0OJ3kj4lJ6j1J8j1j7J7LJ8k5J
$$ -1 -2 6 -2 -4 -7 -4 11 -16 0 -5 -4 4 -13 -1 -6 12 -10 -20 -5 -38 -25 -7 -17 -11 2 0 -14 -17 -1 -12 6 -5 -22 -5 -2 16 -9 -8
2467hJ3k6M3Ol8NljlK6l4J7moK2m4J0J7J0l0J6mJ4OOk3j6K6j3K6rJ4k0J3mQj5
$$ -8 5 -21 22 28 -10 -5 -8 -9 -12 14 -20 -3 -7 -13 9 -35 -25 -8 2 -28 -12 -16 -2 4 10 -13 -29 -3 -16 10 1 15 -5 8 4 12 -3
2504cj2Mj4L8J0j3nj5KJ4j3PL3k2l3QJ2krK7k7OpK7l1J4%pJ3lqj3L%J4K0k8NK6
$$ -3 -15 -11 -25 13 23 10 5 -10 -8 6 -7 0 33 11 -22 -14 -2 -4 -13 14 -13 -7 -14 13 -18 -4 -4 -11 2 -1 -9 -22 -19 -19 -5 15 -13 -8 18
2543A8k3k3J0J8Kj8MNM2n0L6ok8K2l7K8PMNpm5L4j9J9%Nj1J9k5J1pK7ll7j8K6
$$ 18 -5 -28 -18 0 2 -16 -12 -7 35 -15 21 15 -13 9 -28 0 7 11 16 9 -36 -2 -21 -2 -2 3 -8 11 -14 -3 -10 17 14 -23 -41 -15
2579a5J8J2m6M1oJ5qj4LqpL2k8L0k2pK0k3Mj2L8j9NJ3ll2l7M2Lj5J0K5mk3MnJ8
$$ -15 3 15 -31 10 4 19 11 -3 0 -8 -15 17 -11 19 -3 -10 10 -13 -9 -21 17 -2 3 16 13 -19 -56 -14 -11 -26 -16 9 5 -18 -14 -19 -1
2616amqlN1l6kJ5J0l4nlJrJ5K4k0nM2k8jJ6j4rL2Mok0nj5J4K7k4l0J6J4j1mM1
$$ -1 -5 -13 -16 35 -1 -3 12 22 -12 -17 -20 -19 -28 -13 11 -9 -14 28 0 -1 15 1 -8 24 28 22 2 -3 -18 -4 23 -1 -31 -15 -1 -12 -16 25
2654B5k1kj3L6j3j7K2j7Pj4j7K8lLlkjK2k4M%qkj3L6mkj8OOLk0%K7j3L1j9k2k
$$ 25 4 2 -11 25 12 -5 17 0 7 -7 -24 4 1 4 1 -1 -2 20 -4 0 0 -8 -10 -23 13 9 7 -11 -5 1 4 -16 -16 11 -2 29 10 -12 -14
2693a4J0pNQJ3j3P%kll2J7K1k3mJ1NLk5L5J2k6j0K3k5J1j6K2j0NJ8j2Lk1M5k4
$$ -14 -4 -11 -6 2 15 2 9 9 7 4 -28 -11 10 -13 -17 -6 -1 2 -23 12 24 -2 -12 11 -14 -3 -19 3 -7 -2 16 4 7 -14 31 7
2729GLj6OjKjJ1j9L%KJ2k1NKRnLJ8j5j7K5k7J0Nmj6jj2N0k0J5KnPk0LmPj9J5j0
$$ 7 10 -6 0 -1 1 0 11 -8 -5 -5 -3 9 -12 -7 -5 4 -1 2 20 5 -12 13 -14 -4 1 -3 -19 -20 -32 18 -2 13 15 10 17 -3 0 -4 3 -16 -1 -11
2771a1j2L0kl2L6pmJ1l1J1jrJ7jOMlj7L5k4J9l9L9m2K8J%Jm0M2jnlqK5j6%K3J
$$ -11 -23 7 5 -27 9 2 -2 9 -22 -11 -12 -21 -4 -5 1 5 2 -15 20 -4 15 -24 15 -27 1 2 2 3 -37 5 4 -1 -4 -12 13 -3 -3 20 21
2810B1k1K1j5k3nM8k9J7k9NqkK6j3MJ3j4LJ7j4pNJ6l0NJ4k7J6Mk2L4kkjJ7qo%
$$ 21 0 21 6 -17 -22 26 -3 14 -15 -10 -18 -20 6 -7 -3 10 -4 -1 16 2 -5 0 16 -14 -9 5 -22 -6 -2 -24 10 8 6 5 22 14 8 8
2848HkO%k6J7mj9J0J8Rj1j8RRqoJ9p%pn%k9L4Pj3rOj3J8LRMl9J3K2jk1%L5k5k
$$ 8 6 12 12 -14 3 -1 -20 -10 8 17 6 -12 -3 6 -2 -8 11 4 4 -3 -8 -8 -37 -3 4 -9 -18 -12 -25 -7 -4 5 9 -30 -17 5 4 -17 -17 18 -7 -9
2890iJ8k4%K4j9J5qnNqJ3jMjonJ4k3J7oK2j9j4RJ8k2kLj1L4m8M5k8K1Mj6J1LR
$$ -9 9 -15 -15 9 -10 5 -3 -8 -3 -11 2 1 5 4 -2 -7 7 -16 1 -5 17 -2 -16 -7 11 -11 -13 -10 -21 13 -35 10 -18 3 7 -9 2 5 14
2929A4k0J0j5LOnK3k3J4Jj3Oj4mK5J7m8NJ6lJ2l2Nj7K7J4Jk5K7mk3L1k4L2j9k8
$$ 14 -6 4 -11 -8 -2 -7 16 -7 7 8 -5 1 -13 -17 8 25 -23 -18 -2 -5 7 -25 -20 -37 -10 4 5 -20 7 3 -20 11 -13 19 0 -28
2965b8K2k0L4lk0K7NMl8LK4oK4k2NJk8JOLMjk3J3JK8l6MKOjj9K3lj5NK6l3K2k1
$$ -28 -6 -26 8 5 -15 12 17 21 -17 -14 10 4 28 6 11 12 -16 -15 -9 -6 -2 -3 -26 -13 -12 16 -20 -16 -14 -8 -9 -28 -5 -8 -23 -18 8 -25 -3 -24
3005b4kJ0RJLQj9j1L4l1LJ2K2m3J2J8k8L9k7mL4j5%Pj2MRj6OkJ1j8J3j8KmJ6J0
$$ -24 -26 -16 -7 -6 -3 5 -14 -25 9 -22 -19 -7 15 -28 -16 2 -26 13 -14 -18 16 1 1 8 -4 0 9 -7 -1 -3 8 -10 3 -15 -13 -17 -1 9
3043Il4MJ2j1K0J2kk0kPqPJK1nj1Lj2Nj2lK6qPnj4nJ6oOlK9l8J8j3KJ6m%lj3%
$$ 9 -25 -21 -9 -20 0 12 10 -10 -12 -5 -13 -6 -5 16 11 0 3 -9 -4 -16 -19 7 -1 6 1 -13 -18 -2 -8 -2 -5 24 -14 4 -9 -7 9 5 5 2 -11 -11
3085a1J8pl3K9J8j6j3MpL0k5L6l6J8j2L3k2J1oj4LNRnj3J3j4nQoJ9j0j0J7Kk7
$$ -11 7 0 -33 -4 14 -2 -15 -11 -18 12 -13 23 -13 5 -7 26 4 15 9 -5 -2 3 12 7 -6 7 -7 -12 -4 -10 9 -1 -11 6 8 -19
3121a9PkJ7qQJ4j2oQj2j8K7Ml0J4Rl6M3jJ2lj1%J6j7Okj3j3J2nK6j4jqMOj0Ql
$$ -19 -12 -14 3 -5 3 17 5 -1 7 -5 -23 4 8 -22 -8 1 -35 8 7 19 16 5 5 21 4 10 8 -5 -18 -6 -11 15 1 0 -8 -4 2 -8 0 -3
3161cl8L2KJ4j2K3j8J6k3QJ6l5L7j4j5j3K2JkJ1Nl0J9nKRPoj8Oj7J4LKJ0j7kJ1
$$ -3 -41 -9 -7 7 -5 18 0 16 -7 1 17 -18 19 5 -10 -23 -1 0 -2 9 14 -16 3 -2 0 9 16 10 -8 -2 -19 -5 -2 0 10 -7 -9 2
3199BmjJ0nj0j0OrK4lK7j0kkm2J6jkJ7%J9m2K3k5K3RNkk2K1Rk8J1j3L2oqj4J4
$$ 2 -2 -3 7 2 -8 -18 -12 -21 3 0 27 17 15 13 -29 -13 -14 -16 1 1 20 -22 1 -24 -1 8 13 11 -11 10 19 -9 2 -11 21 15 7 -7 7
3238GRm4K6Rkj1KqL8k7j3Jj8L8mj2J9j2OK2l4J3Jj4K5j4LJ0j4Rk1rM2l2PJK7j0
$$ 7 16 -28 -2 7 5 -6 -4 -12 26 -1 -14 -13 -31 7 3 -9 10 -2 4 26 -8 5 6 -8 17 3 6 16 2 11 -10 -19 23 -9 -2 -1 26 16
3276A6Pj9KpklK4j5j5J2rj4mL4j2k7L3j1kMJRJ3j0Oj4K8l2lK1qK3j8pM3m7QJJ
$$ 16 23 4 6 -1 -3 -6 18 3 -12 0 -9 -23 -27 7 -5 -32 1 -10 -12 -8 -7 2 15 5 11 -3 25 -7 -10 11 3 26 8 1 44 -3 5 6 7
3315Gj8%M0l5J3J9l2J1j2jjNQj9K1j4Mj7K6J1k6L2j9Pj7J7jj5j8J0K6pk3QOnJ8
$$ 7 -11 -11 29 -6 7 26 -6 5 -7 -8 -9 -4 4 -15 6 -8 -4 -21 5 16 -10 22 3 10 -7 10 9 -6 -24 -14 12 5 -18 -10 -4 -9 9
3352Ij3J1%j3j8J3QJ1J0j3j1JlkJ0%Jj0J4J5m2K3J2%j8j6J9Op%j9J9L3l3MMoL
$$ 9 -4 7 7 -6 -24 -11 -3 8 18 5 -6 -5 -8 -10 0 0 1 -9 5 20 -22 1 13 13 -5 -21 -2 4 -3 -3 -22 -3 30 -3 1 5 -1 2
3390BJ2k0K0j3k2RoL4j8pjJ4j0%JK0k7K3k4J3J7k0jkNRKj6K7l9J2jMKmKnK7k7
$$ 2 14 -6 14 1 -21 -12 -18 16 -2 -9 -10 4 -6 -6 -5 15 -12 11 -13 0 17 -3 -4 -6 -1 8 10 -6 21 -18 -6 -7 -3 -1 -5 -3 -8 19 -8
3429hJ8%Mj6j2lJ0lK5lnJ2j0qqpK7l4O1m1j0j1J9%MJ6k1Qkj3K3m0Mj3M6jmKJr
$$ -8 10 10 14 -2 -14 -17 -7 -10 15 12 7 19 9 1 -7 -14 13 -21 40 -1 -11 -22 -3 -3 1 17 -4 4 2 -11 12 -28 -24 -37 9 8 4 6 7 -2
3469bJ4j4lL2k4K1rOk1pKM5l9J4k0K1j4j3J0PJ4j3m4M0j4J3K2k7J6j8K1j4J3j5
$$ -2 12 -2 -5 27 3 24 15 21 0 -7 -5 40 1 15 -5 16 2 -11 -1 6 20 7 -37 3 -11 2 24 -3 13 -5 16 2 15 0
3503@J0Jj5K3k1k0K5MlpLPK7k0Pk6K3j4k6J6j2K0LK2j5l4L1j0OJ3j7Nrp%Nk4K0
$$ 0 10 11 -4 19 -2 -22 3 7 4 -3 0 7 34 14 21 -5 18 4 -22 -6 -18 2 5 27 12 -22 9 -1 5 18 1 6 -3 -10 -10 -5 -29 -9
3541iMoLj0J3Oj2K7nj9PLj8Qj6J8lK4nJ4j9j1QJ1j0jl1L4Qj6J7k6LK0K9o1K3k7
$$ -9 -5 -11 -8 -18 -5 1 -11 16 11 -8 -1 2 -16 -8 -24 -6 -9 15 10 24 5 -6 2 13 3 2 -29 5 13 -3 14 -12 -9 11 40 -21 2 -25
3579b5L6j5J1k2pM2k7J9kj1k6JN6m5J4mK6l3nL1k5QJ3qj4L2k7pOK4Kk9NJmL1m3
$$ -25 11 -4 7 -15 -22 20 -7 12 10 -1 -27 -26 30 -15 -1 -5 21 -12 -17 14 -11 -3 10 2 -12 20 -7 -14 -8 16 18 -11 -6 -5 -9 22 -21
3616b1M5qj0Kk6J2RK3k7K7j8k3JK6k1%K7k4NJj0MLJ3lK1l9J6k8JL6J5j7k4L3m3
$$ -21 24 16 6 8 -18 -6 3 26 -1 26 8 -15 -14 12 -9 -9 18 -6 -1 0 -10 -6 -3 10 7 28 -11 5 -23 -22 14 29 12 -12 21 -22
3652b2L2Monm1K6OK2k0kqJ7%Qk6k1M2Qnnk9K1kJ6k9L6k4J5pK3k9pJ6pPj2JL2o
$$ -22 10 14 8 3 -38 -12 -6 16 -4 -6 -14 3 3 11 -15 -36 6 14 9 4 -25 -4 -6 10 -19 17 -7 8 1 24 -5 -12 4 -3 4 -8 -7 25 19
3691A9j1j5Rk4kL7l6K1j6J4J3j4Mj3K2qJJ6l5K3OrN%rj1J2pJ1JMJkjj2PJ6l2Q
$$ 19 8 -7 2 -22 -24 13 -23 -2 -18 -4 9 -5 -1 -14 8 0 1 17 -18 5 11 2 7 7 -2 -13 -1 -8 3 4 8 9 7 6 -6 1 17 -15 -7
3730gK1j4J4pQl3M3k4MJ1rj3oNOLk9L0j2Rk5J9K6j9Omj1NkpLJ8%jLk5J5%J5k4
$$ -7 14 0 14 7 15 -18 25 1 5 16 7 -6 -12 -7 -1 2 -27 3 -9 0 -25 -6 20 1 7 3 -8 -3 -5 -12 -9 9 9 8 11 -14 1 1 16 -8
3770hK1j4LJkj5K0l0RJ7jOj2lPnoL2k4NJk1L3k9MK7Ql0j8J1mK5J1j3LkMJ1m2K0
$$ -8 13 -1 2 3 1 -14 6 -24 -15 2 1 7 -5 -8 -1 -6 -12 20 -4 1 2 -19 14 -15 -11 16 24 -6 -24 -13 -17 8 19 6 9 7 11 22 -20 0
3810@qpJ9PKk5J2mnPKQKj0k6K4NJ0Qk0qj4J3PrMmKJNPNoj6K8jj0J0l2K5roj7L8
$$ 0 -8 -15 4 11 13 -12 0 -4 -9 -2 0 8 10 0 -26 -2 3 13 21 1 -7 -21 -8 -1 -10 -6 -10 -8 -7 -2 5 10 4 -12 16 15 5 15 -17 8 -1 -7 -24 14
3854A4j5rMNqJ1K7j8j2qkjoK6j9j9L9k5j5L0mj9QQPrK1kl3L6l3K7lo%k0J0Nk8
$$ 14 -1 -10 -6 -1 -9 2 29 11 -1 -9 -11 -12 -18 8 -11 -30 9 -16 -31 -1 -5 -24 -16 -8 -1 -10 11 9 -24 12 -21 6 3 -3 -3 -23 -13 -8 -36
3893c6M6j3pJ1oQqK6l0Rj7K1l0L8l1N0l3k1OJ6mjJ7k2Pj3J6K0n4jK1j8K6K4k0
$$ -36 10 -3 -10 1 -5 3 -5 21 -9 0 -17 4 -26 12 -19 31 -2 -23 -17 -1 -5 -6 11 -11 -4 -17 -1 19 -35 -36 -15 -33 -7 17 -3
3928cK8j4%j3j8kJ1J2%j0J3j4J9Rk1nJ1qJkj5J5LK9k8lJ4l2K0K0j5oJ8k3J5Jk5
$$ -3 25 11 11 -2 -20 -22 -11 1 1 -9 4 -10 9 18 -3 -8 3 -5 -4 -6 -21 -6 -3 26 -2 -5 9 -23 -3 17 2 -4 14 -9 6 7 -18
3965a8J2J6j1j7kKJ7k5K1j2J4J5j0J2k4J1%j6M1j3k2%J0k4NJ4j7J6Nj0J4Lkj0
$$ -18 -6 10 -1 -18 -20 -18 -1 -26 -5 -17 -3 12 2 14 -10 1 1 -15 26 13 -9 -9 1 -23 -18 -4 -21 -5 0 -10 4 7 5 -5
3999ej3K6k4nJ1J4MlMkLQl9J7qJmK2%mj0j1J0j1K0kNnRPokj0oK3k3j6J8J5j0J5
$$ -5 -18 8 -16 -21 -10 4 8 5 9 7 10 18 -21 -4 -12 -11 -15 7 7 3 -7 -18 -8 -19 1 -1 4 -1 8 15 9 7 -3 -9 14 -9 -25 -7 8 -2 13
4040A3KjLj4J0j1QPj3J8k9Ok7K7J6j8%jk6NK6j2jj1L9k3M4l9OJ3l5MJ0J7J1j9
$$ 13 15 14 17 3 13 2 10 17 4 22 -7 -1 -28 -1 15 -3 -3 -4 -30 -25 1 -11 -12 -23 16 -7 37 -2 4 17 -18 -14 -4 13 24 5
4076Em1K5J3J4k5lKJ4j4nj2M1j3Qkrj7K9k6J5j2mK7j4qjJ3oNk2K2oJ8j6J2J0k1
$$ 5 -36 -11 2 16 -9 -12 -10 4 -10 -15 -27 14 1 9 7 -2 -19 10 -16 -1 -13 -17 10 -4 -12 -13 0 -6 -1 -23 -1 -7 11 -5 7 17 -4
4113dRj5J8Nk0J3jm2M6j0j0LJ1j8J9Lk8J5QJ1k6K0qQk4LJ4rnj2K5jj1K5k0J6j3
$$ -4 5 -10 8 13 -7 6 5 -37 9 -1 -11 -8 3 -15 4 7 -21 -6 2 13 -13 7 -1 7 -17 -14 0 -9 -14 -26 -1 -2 -13 12 -8 8 -5
4150eNOk4L0k3JJ7j1mMNj1K5k0oNJ0Qk7K9l8K5M%j9L4l7K8rj0K1l8M0j3j4j0J1
$$ -5 0 6 -18 12 -11 -10 7 -4 -8 -4 1 -10 15 -5 -11 -6 4 12 -15 14 -24 1 5 5 -14 20 -17 11 2 -8 13 -25 15 2 -12 -22 -11
4187a1pK4k3K7QK3m5j4J3JJkJK3k3J6j8lpJ0L5l0K4j6qJmJ2j3j3nJ1L7k6j3K7
$$ -11 -18 6 -17 10 18 41 -4 -18 -5 -4 -3 -5 -4 19 -4 12 -6 -9 -16 -6 29 -1 23 7 -1 0 -4 8 -5 -18 -23 -12 25 -1 -14 13
4223A3k2kJ0k1J9J7j3l%k6L2NopjQRk6NK0j3J5Lj2oj8J7nJ7lRj4J7k6MPmMK4n7
$$ 13 -9 -11 -1 -22 -3 14 1 -2 -2 -28 4 9 3 -4 -5 3 12 -14 -9 11 -2 13 16 4 -2 -20 -3 -8 9 6 15 1 18 -8 -4 3 -1 3 27 -30
4263c0PkK9J1m1J9Ol5N5knj1J2j5rK3j1j4J9L%Mj0Pl0J2Qj1K6%k2j7L4j8j3J2
$$ -30 -23 -25 4 15 -26 -7 -1 -36 19 17 12 1 13 -2 -11 12 1 -13 6 9 9 13 3 10 -20 -8 0 -11 15 15 -7 -24 10 -8 -21 -9
4299ij1K5%rOj0j1J5mqK9Qmk2k0N2l5%J4qJ1KqroK3qJ6k8QQk2LPQj3KJ1J2k5L4
$$ -9 -20 5 5 -4 2 -8 -19 -4 -8 -16 13 21 17 -5 -25 27 -8 -8 6 -2 9 11 3 -6 -12 11 3 19 -9 -1 7 -15 -12 -5 3 -10 -8 3 15 -10 24
4340B4j0l5L1K%k3j9QL7rJ1rQj4qJ1j8K2lkjPj0K3j4j9K3Jj4PlKJpNK5l4k3K4
$$ 24 14 -21 10 12 12 -11 -30 -22 15 6 17 8 16 2 -6 5 -13 9 6 4 3 10 0 23 9 -10 13 14 0 7 4 6 7 0 5 30 -4 -27 -3
4379clQj0pnJ4J6j0J6jk0k9NK0K1mOj2kJ0j4PmK7l6K3j2J5kJ2l7K7Rj4j3klJ8
$$ -3 -6 2 -8 -15 -20 -6 10 0 16 15 -5 -34 -29 -9 12 8 14 2 0 10 -4 3 -1 26 -10 13 1 16 14 26 -11 16 25 11 -2 -4 -7 11
4417A1j7J1mNklK8k1LK4k3Q%l6kK8j5JJ4Kj3j9J2J5k3K9k8olM5k7J%J2k5K4k1
$$ 11 -6 5 1 6 4 1 29 8 11 35 12 20 20 -16 -18 10 -5 -4 10 12 -1 -20 -8 7 -16 13 -15 -21 -24 21 -6 -5 -5 7 -18 6 -15
4454a5K3qQj6%lMoJ1oPLlK9l2J5l4L3kj0qL3k0J0qj6QKJ0rpQmJ0k0J3JPJj6j8
$$ -15 8 0 8 -8 -8 -11 -7 -13 -2 -8 -1 2 -1 28 -4 11 -23 10 8 -2 -10 23 3 13 5 -11 -3 -1 9 0 -7 1 -3 7 -13 0 1 8 9 -7 -25
4495b5L1j8kMJ4l3J8mK9m1J7nNj1%J4L%j5J7PpPJ8mpmMPk1j4K6k5L4l0pK6l5R
$$ -25 6 -12 -14 -10 4 -29 -11 -15 14 -27 -10 -15 -10 -21 -21 -7 -4 -4 -19 -2 5 -2 5 23 19 12 8 12 19 -2 -16 10 -15 19 -11 -18 8 -27 -18
4534a8J8jj0k3J7K9l1M1j9qJ6qK1n3N0j1mj4J5Mj8J5Pnj5J4Pj2j7Lk1K9rL8Kl2
$$ -18 0 -1 -11 -34 -17 12 -19 22 3 -5 11 3 24 -29 21 10 6 -8 7 11 -7 8 15 10 -5 9 16 4 -13 -10 -31 -2 -11 27 29 -3
4570cL0j3jj4kPQMj8lJ3m0L1kMj4J7j4RrJ3k3J0J7kJ5l3M1k6J0j6j5QJ4j3k0K4
$$ -3 27 14 13 -1 -3 4 12 16 -2 -5 8 -32 -1 -3 1 -13 4 -10 -1 -10 3 -20 -10 7 5 20 -13 28 2 12 -4 -19 -11 3 -10 -30 -6
4607fK8ok2K3j7%k3%J7kJ0j0K0qOj3j2K0kJ0k0Pj7J4%J8j7j4J9J8pqj6qJ6Oj3
$$ -6 22 16 -6 17 0 0 -23 -23 -6 -8 2 -8 12 4 10 -3 -15 5 3 13 -7 0 -17 -3 -3 15 -2 -16 3 21 14 6 -10 -18 -2 4 -9
4644iJ5KNmNk9PkJ6lj3j0L9l8KL0j7j6L6qpQ%okj7K5k2oONJ2pMJ0k5J8j0m%j0
$$ -9 6 8 13 9 14 -15 -8 -10 6 3 -10 -20 19 -19 -17 13 -4 -20 16 8 1 9 9 3 1 -16 9 -13 -19 -13 -8 4 -3 1 11 -14 4 -6 -10 -10 -20
4685b0K9Rnnj7J6k4J6j3Noj8L2j3J4k4M5l5K5k7J4J3j9K4k7kQJqoK1Jj8RpJ6J
$$ -20 9 18 13 8 -9 7 -17 -1 -14 -9 -15 -33 -1 -14 0 -24 21 -14 11 -16 -2 11 -8 16 -11 -13 -5 -4 -12 -18 3 4 -14 -5 -12 4 5
4722EJJ2Nk3pK2j1l3K3kpRj5M0k0j1J5Lj3L8k6j3NjRj0nJ9j5qL1k3%OmonNMK1
$$ 5 6 18 23 0 -7 15 4 -29 -6 -8 -15 -6 -21 19 -1 -12 3 6 -7 31 5 -8 -3 -4 5 -5 -10 9 -6 -14 17 -6 -6 0 -4 -10 -15 -10 -6 15
4762A5k1OJ0l1M1m7L7rj1J3Kl4M7l3%KJ9qqJ8k0J4JJ0j1K6k9J8j2l1K2J8j9JK9
$$ 15 -6 0 10 -21 20 -27 10 1 -10 3 5 -29 18 -15 -15 -13 6 -2 -10 8 -12 2 3 13 2 28 -1 17 5 -26 -4 14 -5 -4 25
4797B5k5K4k4j6qL2Lnj8L4l4KK4m2K5PPj0jJmJ7j2Mnj1%J2qOmj2J6Jj3PK0j1j1
$$ 25 0 24 0 -16 -24 8 11 6 -12 22 -12 -10 14 -28 -3 4 11 1 0 1 -3 14 2 6 1 -10 -10 2 -6 0 -4 -16 0 1 -12 -5 15 4 -7
4836gJ0pj6L0k5LK2j3j0KK1%k9L0j5NOlj3QJ2k0J6m1L2jj9J5J4j8L5k7j1J3l5
$$ -7 3 -4 -20 10 -15 -12 10 -3 -13 -11 10 10 -19 11 -4 1 7 4 -9 -1 11 -9 7 -34 -2 -3 -22 -7 7 -11 24 -3 -14 -1 -36
4871c6M3pK6orj0k2J4K0k7PN1m5MLj9J6jMpk1M1Ml3LK6mk0pOJ1J0j9J3m%Kj5J5
$$ -36 7 0 26 20 11 1 -21 -7 13 -14 -7 44 -1 3 6 -13 3 2 6 -1 -22 19 23 -10 -7 19 15 -5 -12 -6 5 15 -4 9 5 5 7 -8 7
4910GPokNk0qL6j3rrK6Om2M7k0qJ9rJ1m3K6K3j9RkKJ9j9j7J5J1l8J3J0lJ7k3j
$$ 7 14 8 6 11 -9 -17 19 6 -3 -12 14 20 -22 25 5 -3 16 7 18 -25 1 24 5 14 12 14 33 14 -3 12 23 -15 -2 8 5 22 -1 -2
4948bJK1k4J6l7J0L0k9K4k1L5Rl0qk0J9OJ0lplJK3k4LNk0pL0J3l2L8m2nL0Mk7
$$ -2 -1 20 -4 12 -25 -15 15 -14 10 -11 24 33 3 -5 -25 -6 0 10 7 0 -3 -2 21 -3 0 5 -15 -22 8 21 -11 27 -15 -20 10 14 -13
4985a3j2L4Mj1Rj7J3j7K2O%j3k3J6nj5M2k1j1MJ9Lj7QLkj7pP%K2j5J4J5j8J8k0
$$ -13 -25 9 13 2 11 -6 7 -10 12 18 18 5 -18 -2 -7 -22 20 -1 -12 -8 11 14 -3 5 8 6 -11 -18 -11 -11 11 -4 10 25 7 25 5
5022EPj0nKK1mk1k1L3K3j3j9NmJJ0k2K0LJ3m0L0j2RLk2K0j2loJ2K9n2J1K0j3%
$$ 5 12 2 -3 -1 20 16 -5 -26 7 30 17 -2 3 -1 0 10 -12 8 11 24 -16 14 2 11 14 -8 12 0 -3 -9 3 32 -20 -9 11 -2 -2
5059bmJJ1Nj6jJ5jPMj0jNk0K0j6PjMPj4j2J0%J9lK%j3joNQK0j8k5J4oj1J0J7k3
$$ -2 -6 -5 6 11 -5 -6 9 8 15 19 9 8 13 -7 13 -3 4 3 7 14 0 -12 -2 -2 17 14 16 16 3 2 -4 1 9 29 11 -14 0 -6 -17 -7 10 -13
5101a3J3j9K0J4Qk0J9mj9mK3pKj3j3J2J6l0K2l8J5J0J9Knk3M3m7RLj0J0OOnK6
$$ -13 0 -19 1 15 23 3 22 18 -1 -5 18 11 13 0 -13 -1 15 -15 7 -31 -16 -6 13 15 10 -13 30 -17 -8 -5 -15 -5 1 7 2 28
5137B8k0K2k5J0j8J6onoqLK5k4J9j1J4j5MJ6jj8KPlqQqQkj6K5k5rK4j7K9k0K1
$$ 28 8 30 5 15 -3 13 7 2 -4 -12 -9 16 -8 11 0 14 -1 3 19 18 0 2 9 6 -2 6 -2 6 4 -12 13 -12 -21 3 -14 15 -5 16
5175A6k2NlJ2k7L7kj6JMJ4k5J4k3L9qPj3k1J2qMRl8M3PMk9nL1nol9L8nJj5Rj0
$$ 16 -6 -1 -4 8 -19 18 16 0 1 5 19 -6 8 -15 24 16 23 10 -11 1 -7 -3 6 -32 11 18 22 -7 -12 19 14 8 -31 7 2 3 -12 -3 -13
5214a3J8OJ4j1l4K6Jj6JJ1j3K6Kj7RJ0k2j0K2j7J5pJOJ0j9PK0k4J0j7lPklj6K7
$$ -13 5 11 25 14 -20 6 7 -9 -8 3 -10 16 18 1 10 20 -2 -12 10 -7 8 1 2 8 18 -1 6 26 2 12 -5 -8 -1 -3 -6 -22 5
5251EkPj4jnK0j4j7M0j4j2NJ9n6K8nN%%LJ0k9J8K1j9kJ5J9j4MJpj3j7J2QPj8%
$$ 5 3 10 -4 -5 -10 10 -4 -21 19 5 -7 -2 17 -39 -11 -16 -11 -11 -11 -8 2 -27 -9 12 -7 -9 6 25 11 15 16 9 -4 -21 -9 -1 6 -12 -12
5290a2K4J7j9l0J2MJ4Ml3J6%J1Qj0MLj1%j1PQk4L8k6J7j5k7L3mn%L2l4qK7K4o5
$$ -12 12 29 10 -20 -8 -4 10 14 -19 -3 -3 8 16 6 10 13 2 2 -9 -2 6 -18 20 -6 11 -4 -31 2 -2 -7 -7 25 -9 -17 10 34 -31
5327c1J6J8j2LrOMJJj1J3NOj8MPoj7J6K7m2L0l4M9l3K3pqj0L0j2j3oK9k1K9k1
$$ -31 -15 3 -9 -6 -15 -9 -5 -4 -3 -14 -1 4 10 -8 -4 3 -3 -20 -4 23 -19 11 -23 26 -7 16 9 1 -9 21 9 -4 -10 19 -2 27 6
5364Fj1J7l8L5J8k6J1j6LKPj5J9Rk5J8lJ1k6k4K4PJ6Mjk5K5k2mk0K6J5n0L7j8
$$ 6 -5 12 -26 9 27 1 12 -4 -1 1 8 -7 12 21 -4 14 11 22 -4 -28 -4 3 19 23 22 -3 22 0 -4 -24 2 17 -33 4 -14
5399a4J4j4K4l2NM0j3j1KRJ5j9j2J6m0L1J4k1K3l9J0K4Lj7LK0Jk6K1K7l5J3j2
$$ -14 0 -14 10 -22 -17 23 10 -1 1 10 25 6 -6 10 -30 1 15 -6 17 -22 -12 12 15 -2 1 21 22 -4 17 44 9 22 10
5432A0Lk1K8k1J6k8LNnPMMjjmmL1j7j0nK2Pk8oPJ2k7J6PJ7k8j6J4J0j5K1j1J2
$$ 10 13 -8 20 -1 15 -13 -10 -5 -10 -3 1 5 4 3 -1 -5 26 9 -1 -6 16 23 -5 -11 -4 8 -19 -3 4 21 -7 -23 -9 1 -14 7 -4 8
5470HJ1j4pqK9%k9%j0K0K8m1MJ3J0k2K3j4rK2k9L6j3jlPk5J4pjkL8k0j6lL1o0
$$ 8 19 5 -2 -10 19 19 -10 -10 -20 0 28 -13 -9 4 14 -8 15 1 -8 14 -15 21 8 7 4 11 -14 0 -7 -8 -10 28 8 -8 -11 20 -40
5507d0M3J9m6L3Poj4pK4k8J4Oj9J1NrjjJ5L4l3LjqPk7J9lK2k3L3l7J4J3m2L1j1
$$ -40 3 22 -24 9 16 10 -4 -11 13 -15 -1 5 -14 -3 2 -7 -8 -9 6 40 7 10 9 1 8 -19 0 -3 19 -4 29 -8 6 19 -23 8 -3
5544cJ0Rj6J0Lj4J1k9M2j5j1NLk1J2QlMOl1J1RmKRk0K5j5J0Lj8K7k8J3Lkl%OQ
$$ -3 7 16 0 10 13 -1 10 -19 23 8 -3 2 5 -16 -4 4 1 5 11 -20 -9 0 -4 -2 7 -13 12 -3 7 10 -8 19 -9 4 7 5 2 2 8 16
5584A6j0j2J3kj4PL9l6oPQKk4ljpM2rmqJ2j3klj7K4j7L6k9QL4oj6j7kl2L2J7o
$$ 16 6 -6 7 5 -9 -2 37 1 -5 2 10 12 -12 -15 -16 -23 19 10 6 -2 10 -3 -5 -8 -25 -1 -18 18 -11 -3 31 25 9 -8 -10 -42 -10 7 1
5623Aj1KK9o5N2j4oK6j3mj9OK3j5P%K5j1%k7K4pJk3K6pQj1KO%k7L5k1OQJ0noj7
$$ 1 -10 -8 21 -44 8 -6 -12 14 1 -3 -22 -16 7 -8 -1 -1 24 13 13 -14 10 3 4 -19 7 0 8 -3 -1 5 5 -22 13 -8 -2 6 16 11 5 -12
5663a2K2j0PKj8Ok5K6Qj5K4j2pJ5j1j3J9%l1jL3Mj5L2l9Rj8L2j5K9k2j2LQJK1
$$ -12 10 0 7 9 -9 -3 -28 -2 6 -9 15 3 -4 11 0 -13 6 6 -25 -26 7 11 -4 28 -11 -2 -20 12 -3 26 4 -8 -5 3 4 25
5699B5mj8J3j1Lqj1K5j7k2L1kk%Ll5M3k7PK9k6K4j5lk1J9Oj2K4j3jj0OJpJ1ll
$$ 25 21 3 16 5 8 0 -11 14 -3 -25 6 4 2 2 5 -30 13 -14 -7 22 -4 20 5 2 -19 0 6 -6 18 5 4 -6 0 1 -6 5 2 -1
5737aJ1kRk4kK7j5kK1pJ3k9%l2L7k2K0%mQNMl1J3nK9m1L0k9J7JJ1l8JM6k6K7r
$$ -1 10 8 17 -7 -9 18 3 1 22 15 28 -1 -1 -33 4 -18 2 2 -2 6 11 15 -16 -3 -8 21 -20 10 -19 -2 -1 10 -28 -27 19 -7 20 11
5775A1j2pMMJ6oj6J3qKJ5Ok7J7mLK1j8j7koK0j4J6l7M2Om3L6l9K5qK2k5M0l0k7
$$ 11 -1 -8 -4 0 16 10 -6 7 -1 1 16 22 -5 12 8 11 32 14 -3 -5 -11 9 -5 11 -26 16 22 -21 15 -24 1 -7 15 -10 30 0 -27
5812b7N7Jn6K0J1nL6j8k4ONj2K7j3J5m3K0KJ8j5l%k9L3qqkK5j1Qk9L3l4PNj2J6
$$ -27 30 31 -25 -5 6 1 37 19 -5 1 6 -6 21 8 23 -20 0 2 20 5 2 2 -27 6 -2 -10 -12 13 2 10 -19 14 -20 -13 -8 -20 -4
5849dj0K6k3J5JMmQJopJ9j4k8J0K5j8QJj2K1j9L%J0Qj5mnlRjJ3lkLk4%O2m1nq
$$ -4 -14 12 -11 4 5 9 5 13 14 8 1 20 6 -22 -12 13 -5 3 4 -8 13 -6 -3 -3 7 15 0 -4 -9 -12 -3 -4 9 6 4 7 -17 -17 45 4 -1 -9
5891ilJ1MrL5j5j5j1qM1j7J8j3j7J6rLPk1K3l3K9LjPJ7j7j9J4J6prj3K5l1J7K6
$$ -9 -12 -1 3 -6 29 14 -1 -12 -20 21 4 22 9 -8 8 -1 2 9 -12 11 -22 7 10 9 16 33 16 -3 11 27 20 11 -2 23 -8 9 35
5928C5k9j8pLJ0K0oLNJ4j6j2j1Nk1K8k0J2QRjj5J1j7QmJ2mj7K7jk1QjrNJ9Qj7
$$ 35 6 -12 -19 -16 -6 14 8 11 16 30 14 2 -9 -4 -25 3 -17 -5 3 12 11 -4 7 -10 -2 -6 6 2 -15 12 11 -10 -2 -3 -12 -7 12 20 3
5967Ck7K4J3Jk7K5k4RMJ9j3j7J2L4k1k8OQnQj6L9m3J1QQj4J3j0J6l0J0jNNJnQ
$$ 3 -24 0 13 14 -13 12 -12 -3 1 20 7 -10 2 36 15 -13 -7 1 -4 4 -12 27 -16 -5 3 11 -3 10 0 16 -14 -4 -5 0 5 6 1 9
6005IPk9J6j0L9k0j7K7mj2K2l0OqJ7j0pK9k3PJ9l7K1pJ0k6NJ2Kj3J5l3K6nj5K2
$$ 9 16 -13 3 -7 32 12 -5 22 18 6 28 -2 4 -4 13 3 -4 25 2 9 28 -9 12 5 15 -11 -6 6 8 -5 10 -23 3 -2 -17 5
6041El8J3M9l0Lj5OJ3Pmj8Rj4K8Oql1K2KPj9KJ0mJj7PJ2J5oRlk9J7Mqj0QJNrq
$$ 5 -33 -20 29 -1 2 -13 -7 6 13 9 -9 0 -14 14 20 12 -19 3 5 12 -7 -5 5 1 2 -15 -8 4 19 13 22 19 -10 7 11 3 -7 1 2 7 -2 -10
6083a0J0J1nLJ0k5J0j9J5Pj4Nj1K0lLOj1J1lK7l7J6Rj6LJ0j5oJ6k6K3k3K3pj0
$$ -10 0 11 6 9 19 -6 4 -15 0 7 -7 -2 -13 7 4 7 13 2 13 10 37 0 16 25 9 12 22 7 1 17 -9 14 -9 14 7 -3
6119ckj2L1k3L4j0J0j5mMj6J4j4J5L0o0K4LJj0J3j1pnQj5J0J0kJ7Pj8kJ1j9J3
$$ -3 -5 -17 14 -9 25 15 25 10 6 10 -6 8 -6 9 39 -21 3 6 7 -3 10 -1 -8 -13 -5 -20 -10 0 -2 15 22 4 2 13 -6 7
6155Gj1mJ1K4l3ONpj8J1jK5pnnJ3l1QL6k6j%L7l5jJ2k1QQJ4jk1LOKl0J8J4Pj0
$$ 7 -4 -8 3 27 -6 0 5 -2 -20 -9 -10 15 8 3 -2 11 -20 -12 24 -2 -3 -3 34 -1 -2 10 -11 -3 5 19 18 -3 0 6 8 -22 -4 10 17 7
6195GQjj9L0jj3J7k0JrJ1OrK0k8J4J6m5J8j6J6Pl6K8j2%%J8j5Qmqj0K2J3j0Lj4
$$ 7 15 14 -5 25 24 11 28 8 9 0 11 17 8 28 0 14 30 -15 3 -13 3 10 -26 2 -10 -10 -10 8 -7 1 -3 -11 -21 1 14 4 7 -7
6233goJ6M0m2KJ5l0K4J9m0L8k7NlJk4L0Jl8J5L5j9%jj2J3o%j1J8j4kjK5pJj3L
$$ -7 -13 3 43 1 3 18 -12 12 31 -9 29 2 7 4 5 -19 11 12 -26 -11 24 5 5 4 -8 5 -1 -1 -12 6 -8 -10 -11 14 7 8 -5 -2
6271bJJ0kj5Ljk6N3j5K%qpJ8k3J0rJ1nJ5k8J8%MOooj5K1ML6o1J5oJ6J1l4K3rj7
$$ -2 -1 9 7 -8 -5 -6 -32 21 6 8 8 0 -7 11 -12 -2 -11 0 -5 10 -18 0 0 4 10 4 -2 -17 4 8 44 -17 -2 -8 8 19 -15 8 -1 -18
6311a8J9L1pl8J4j7J0j9M3j4j5K3j6RPMqlrQk8L2j3K7l7K9k5K0Qj0K4j9nk9L6
$$ -18 1 32 25 -13 1 -16 -6 -25 18 4 -11 12 -4 5 12 16 8 5 -4 4 -24 8 -5 22 -15 14 -11 9 17 7 31 12 7 -22 14
6346A4j4J2j9nJ7j0L2Pm2J6J%PJ3j5l2K3kJ1mLj8JpK6k2M1m6K2jj8MRj8J6J3j6
$$ 14 0 12 -7 -12 5 -5 27 34 -8 8 9 9 16 29 14 -18 5 3 14 10 13 -5 -4 -11 15 -7 34 -12 10 9 -9 -5 4 -14 2 15 -1
6383arJ8oLjj1L9l4j2NL5j5j7J6Rk8K0j1Rj8NJ1j2J8k7pJ5%%J8J0qk1L0k2j1P
$$ -1 -10 8 2 5 4 -7 32 -2 -14 -9 26 11 -6 10 19 -9 11 0 9 -9 -4 7 -5 13 -14 -21 -6 -6 -6 12 22 14 -7 23 1 -10 -3
6420cRj8Mj5L8o4M5j7RJ0K1l4J2J8k1qK6ml0J0K9Nk1POk4QPj7J8j1j5KL6k7J5
$$ -3 6 -12 -8 -23 15 -49 -4 -21 -12 -2 19 -15 -3 15 -6 -14 12 8 -22 -12 17 22 1 8 14 -10 -2 5 -12 6 -5 -20 -18 18 -9 6
6456FKLkPl0mL1qRj7O%k2K4Pj2N%j8J7PJ7l2NjmK2l5PjK0qQm6N3k2j6K3JJJ4l0
$$ 6 8 11 9 16 -14 -18 13 5 14 -3 3 3 -19 5 12 0 5 5 -13 4 11 28 -4 1 0 -4 18 -17 -10 -11 9 1 9 -37 16 -6 -22 1 2 3 17 -13
6498a3J6j3%JKlL6rk0rJJ2j1jOQkj6K6rkm0L6j5L0K1l6%j8M8l1KJ7Mj8j6J4j1
$$ -13 3 -10 -10 -9 -7 -10 26 17 -3 -12 -11 1 -10 -11 -5 3 1 -15 11 2 0 -40 -4 -19 11 32 -4 -4 -22 26 -5 -3 14 18 0 -16 -2 -13
6536a3RK1j7qLJ2m5K8QK0m1K8%J3k9J2pKOj0LLPRjj8RJ3k2qQK2j9K4k5J1K1l6
$$ -13 -4 17 0 -8 -5 7 -38 -10 -2 18 -23 5 5 18 -11 1 -6 -4 2 -8 -5 -2 5 14 13 -5 4 17 -5 -13 -5 17 -2 22 -3 8 29 -7
6574gJ3k4j0L9j0rKpJ9JJlj5K2k5OJJPkJ3rk1jL1Oj4k5J2kK%pPJ6qJ2Mj6J4rp
$$ -7 6 -18 -28 11 1 -8 -6 -13 6 7 8 5 -10 12 -13 -7 -6 -5 2 0 13 4 -17 -18 13 19 5 -20 -8 -10 -8 -8 -15 -8 8 0 12 16 0 14 5 -2
6616bJ5J1j4km3M7l6M1pl9QJ3K3k6LJ5m6J2L2k5LK1m4L5kJ3j9rK4KRj7J6pj3K8
$$ -2 13 24 10 8 -35 12 -24 17 10 -29 -21 -8 15 -11 -8 7 -39 -27 5 -20 -17 4 -40 -5 -7 6 -13 -22 2 4 13 -4 12 5 -8 20
6652B0Jj2%joj9L3l4K8mlPj4J2Qk8OpL7l6Lo%K6j9J4j1K6j3j5j3J6jPnQjLnL1
$$ 20 21 9 9 8 2 -17 16 -18 10 6 3 10 -4 8 16 -12 -6 -13 24 -12 -9 -15 -15 11 -8 6 -5 21 8 -7 -20 -4 -5 2 -3 5 4 7 2 33
6692C3m1rK1j7L2Jl1jQrJ2Q%Lj9K4j9Pj2nJ2PJlqPNk3K5j7jmjK0j2Mk8K1j3RJ0
$$ 33 -8 -17 4 -13 19 20 -11 -12 -4 -13 -1 7 7 10 -9 15 -4 3 -9 -14 -2 5 6 3 -5 2 7 -16 9 -8 -9 -13 -14 6 -6 -2 -30 -9 -22 -13 -3
6733cj2J3J2j1Rj4KlRj8J6k4J8J5J2rk8L3m8K6RlpRooJ2Nj9K0J2l6J8j8qL3rj6
$$ -3 -15 -2 10 -1 8 -6 -4 -7 2 -16 0 -24 -6 9 21 12 -16 17 -31 -5 4 1 -6 3 -3 -9 3 8 -11 9 21 -15 3 -15 -23 10 1 -15
6771a5K9lJ7j6J5m8MMK2k0K5lk4K6j0J7j4kk3K2oJ6l7L2k8oL9k2PNj6j1M4m5k
$$ -15 14 11 28 12 27 -21 -17 -13 9 -11 14 11 -13 13 3 20 6 4 -19 3 -3 13 -24 8 -20 -26 13 -9 -2 3 -13 -24 20 -25 -27
6806b7J9jOnqJ1PoQNj2PkqjM0p6N7j8Jkj4L5jk5J9j3JJ3k6KJ2J9rj2%%QpjJ3j3
$$ -27 -8 -9 -3 -8 -16 -5 2 -4 4 9 -3 4 2 -6 -7 33 -43 14 -4 -3 -5 -19 16 15 -10 9 -4 -3 10 -16 -14 -2 17 8 -4 -4 -4 4 -3 -4 9 -4
6848dK9qOn0J7k0M4l2K5%j5LmPoJ8j6J8j2jmj7J3J4j0KJoj1J8qK7j6k5OK6jk0
$$ -4 25 17 23 -27 -10 -30 14 -18 7 7 -8 -5 -9 -2 -8 10 -6 12 0 -1 -5 -22 -9 5 -5 -3 -2 -8 -19 -1 -9 18 2 -23 -17 9 8 -12
6886a2M8n2L4l4J4OnPj8J4Rj9jK3j5J4j5%j0Pj3K2%oK1k5j4K3%k2K8KjooJ1j8
$$ -12 36 -16 18 -16 -2 4 -1 6 -12 2 11 -8 -9 14 -1 13 -2 -2 -12 -5 -18 4 4 -2 19 -6 -20 3 3 -19 9 11 10 4 -2 9 -9
6923iL0k9j4J6kNJ5Pk7lPjj0K3n%J4j5Pl9M2k0J2mRJ0Pk3J1jkk2K1Kj5lprL0n
$$ -9 21 -8 -22 -6 -8 -3 12 19 -8 -11 -4 -5 -15 8 3 3 17 2 9 -30 12 -8 4 0 9 19 26 3 14 13 11 -11 10 12 -3 -6 -13 -22 8 3
6963Cjllj2jJ8j5jJ1j4J5Rl3K5Lj3J0mj9L2k1QpJ5KK1m0KK4m5L6jK0j5%nJ6k2
$$ 3 2 -1 -4 -16 -17 1 -14 -15 -4 -18 -3 6 -27 -2 1 -12 -2 -6 -25 7 -14 -6 -13 2 4 25 -15 -13 11 -34 2 1 21 6 6 1 17 -5
7001eRj9J7nl0N4l3j2K7pljj6J1kj7K2J9j6L7k9%oqk3K7K8Ok7L1rl5NJ8j8j1J4
$$ -5 4 -15 2 -3 -33 21 -12 -24 3 -4 -7 -8 -24 -13 -15 -32 -10 9 -7 30 1 1 -5 -13 -36 -9 19 25 -2 29 20 -15 -10 8 -10 -21 -7
7038gL4j8j4jnJ7j2jLrK7k8K8k3j8J1K3k5J8Lk3L3m1M3pjk9L1qjL8m9Nmj5L2l5
$$ -7 27 9 -5 -6 -11 6 -6 -7 -4 -13 14 -14 14 -9 -27 -16 7 -18 0 3 -20 13 -28 15 8 7 -22 9 1 0 38 -11 -6 -10 -25 7 -28
7075b8L0k0J1K3j8lk%J0mj7K3l3L9j7NKkJ4j7Pj1oJ9J2j4qK4k5MK2J3j7j1krK3
$$ -28 2 -18 -7 16 -2 -5 -7 -7 3 -1 -18 5 -28 11 -6 -1 1 -1 13 -4 3 -8 -14 5 17 3 -5 19 -6 -2 20 33 16 5 3 -6 17
7112A7l1OqOL2l4K3j7nJ6J1nl7L8j8OQj1j5K5pKnJ8rmj0l3K6K3jpJ4kj2j4J0K6
$$ 17 -14 -8 -16 -10 22 -12 11 -6 -11 5 16 11 -26 12 -6 0 8 -3 -18 7 0 2 -3 15 6 2 -8 -41 -15 8 7 0 14 12 0 -14 -4 22
7150B2pl5L3j5jPMlk1L2nj2K9j3k5KQk4L6j2pLj0J4LRMqqklj9M6l4J8JOk7%K3
$$ 22 15 -20 13 -2 -3 4 8 5 -16 16 11 -1 28 15 -10 -8 0 -24 12 0 -7 -4 -14 0 3 12 16 8 0 -2 -5 -24 22 -12 6 7 13 -14 -14 9
7190Ij7Rk4K6KnRk1%K2j0K8l3rJ4j5LqOMLj5K0K1pk6PJ2k9M0nml1PJ4j9J7lj7
$$ 9 -8 1 -23 3 5 0 9 -12 -12 10 0 28 -5 -14 0 -15 -12 -20 -14 -10 -7 -22 -2 19 12 -14 -7 5 -24 16 11 7 -24 -17 -3 -22 -5 -8 -25
7229b5K7Qj9K1rkj2QRl8L4j6M5k4j7M1pqj4JMk4oJ5oK0k1K4j0NqJ0mj%nKKrLK
$$ -25 2 10 -9 12 3 1 -11 -3 6 -32 2 -14 31 7 -10 31 24 16 2 3 7 -17 -23 -8 -14 6 -15 9 -1 4 -4 6 2 1 1 -4 -2 0 -9 -6 -4
7270dJ7Pj0oJJJ2j8J1j4J0NlJj3oNL6l4J7J2j6J0l4qL9Jj8J8J1k7l1J7mJ4qJ9
$$ -4 13 20 10 4 5 6 18 0 11 -3 7 12 9 10 -3 -9 -4 32 -2 15 27 11 21 -13 -21 18 19 1 19 30 3 -28 -11 -15 -1 -9 10
7307A0oj9M8k6l1J3J5nLj4NNj7K2rK0l5K3J9l7L1j7PMrJ6j1k3K3Jkj4pK9oj8%
$$ 10 4 -15 33 7 -24 -11 4 -1 2 -12 -7 -2 -19 3 -6 14 -21 2 21 -16 15 -2 5 9 0 16 5 -18 5 6 4 -10 -17 12 6 -12 -12
7344a2L6k9RqmPj1J1J2l2mK9qj3L3Lj8lJ9rOonLOpNj8OmL0j0j0Ll5K0J7LJ2n0
$$ -12 24 -5 4 -4 -8 -1 -12 -1 11 -21 -25 4 -4 -17 16 19 1 -2 17 8 14 8 3 6 12 5 10 -8 -2 -6 24 14 4 7 -28 -8 9 12 24 -26
7384b6J3LK0k1oL2k0l1M4j9KnkL8k5K6qj5J5rlqJ3J0k8J0LjK6pm6M8k3J6m2N8
$$ -26 -13 -10 10 -11 -17 15 -5 -36 8 -11 -9 -14 -16 22 -3 23 15 0 15 6 3 -5 8 18 -10 0 3 2 28 21 -25 23 0 16 -26 32
7420C2m0J5pK1j7kkJ6k0QK3k2j4lkK0J3mkl4J4J0K1j4j0j0J9qLJ8qk4J7nqJ0P
$$ 32 -8 7 0 21 4 2 0 16 -4 4 27 5 -9 -12 -14 6 19 15 13 -21 -7 3 24 10 0 -10 9 1 4 22 14 -10 7 2 -6 4 11
7457A1J3k1oOK1j3MLl8J3OK2j7j7J1jpK3k6RQRj1j2J4J5%l2N0l5j2oL3Pj5LPJ4
$$ 11 24 3 -3 3 24 11 15 18 -20 -7 -1 21 4 -13 -2 -3 -10 13 -13 -4 4 13 2 -10 4 19 19 -13 37 2 -10 -16 17 24 9 12 19 33
7495C3Nl3JJ0J3l2J0j5L8k5J7l2mOL2k7KK9k9j5L4j2RoqJ2Om%jj8K8k0k5K7lp
$$ 33 38 5 6 16 29 -3 7 -8 30 5 22 -10 -14 -8 24 -3 -1 28 -1 -16 18 6 15 9 1 13 19 15 15 14 -4 24 4 -21 6 3 -4
7532dNJ1J5j4nRJ2k0K6n1M0j5Rmonl0J6kK7KJk3L8l9J8lk2L4k7RqLLO%j2J7k%
$$ -4 1 12 27 13 8 17 29 9 35 -16 24 9 18 14 8 3 -27 -11 -13 14 16 17 -6 32 -7 11 8 -14 20 -7 2 -6 -3 0 6 6 -6 11 9 9
7572Ij6K2j5KK5m4K0j4J8MmK5k3k0pJJ3knK6J9m7K1ojK9l4j1J6jJJ4k5ProkL1
$$ 9 -7 15 0 2 27 -17 3 -11 7 11 7 32 9 -11 -18 -17 -4 -6 -11 15 34 -13 8 2 1 30 -4 -15 1 0 1 15 -10 -3 -12 -18 -20 11
7610A1Oj7J2j9pK4l3J5L2jk7K4Nk7J7qjj2j6J4LPj4NL2j8j4J7mk2L0j6L2j0j9
$$ 11 17 0 12 -7 -14 10 -23 -8 24 23 -4 20 25 -2 15 7 6 -6 -22 -8 -5 2 -12 -7 25 7 -7 10 6 -16 14 -2 30 20 1
7645AqRJ6j0k0J5NNj9OK7j5qJ2llOk7nJ8Nk1J8PLm7K6lPJ0j0j6%J7K2qoj6nQK7
$$ 1 -7 2 18 8 -12 3 8 13 -6 0 27 12 4 16 13 10 16 -11 -16 2 7 -14 4 11 14 -33 -7 -10 -3 7 -3 -19 -19 -2 20 12 6 -10 -15 -7 20
7686B0m6J7L7l6RJ0l1J7qK7pmj7J3K1j2nnlk1J2K5j8J5j8LK3Kk2oNjkNNj7J7l2
$$ 20 -26 -9 28 -8 1 11 -20 -3 -11 16 9 5 -12 1 22 10 5 0 -3 -24 -12 13 -5 10 -8 -5 18 20 -2 -8 -3 -4 -6 -1 4 -13 4 -28
7724b8PL5Kpj2k2L3Ol1J3Pj3MkK9j1qk9L8Ll6N1Pl8qL9l8Mk4K8qMK2j4j6J8K1
$$ -28 -21 14 16 9 -3 -25 8 14 -17 -4 3 -10 -6 -8 21 10 2 -27 11 14 -22 29 36 -2 -10 29 -9 -5 -29 -1 -9 -5 17 3 -13 5 26
7761B6l3J5%nj1RKJNj0J5jj1J9l6K2J9k1J8j8pj9K8Rqj2RK1Nj2Ml2MMK3jkqkj1
$$ 26 -7 8 8 3 -8 1 3 4 9 -1 14 13 2 21 -15 7 26 5 23 5 -2 -21 7 16 8 -4 5 26 31 19 23 -9 -5 -1 22 21 19 11 9 -2
7801bpJ3j8K8pJ7l7J9j3lJ9j3K3l1J3oJ9j3K8l5j3M4mLl0LK0j4J2oJ0k8J1pK1
$$ -2 -9 4 -14 14 7 24 -13 6 -7 -10 9 -4 19 -12 1 -5 14 1 29 -6 -19 25 21 24 -6 -3 17 3 15 9 19 -9 2 -5 16
7836A6k0PJ3jk1OJ3j3pK3k4pKK5klKk4qL1j2J6Pj1J1j0Rk1%K1Rk1J4k0L5k7J2
$$ 16 -4 3 16 15 -6 0 13 0 -7 16 -8 -15 -13 12 10 7 9 -15 -23 8 -4 12 19 8 19 9 18 -3 -3 18 27 6 20 0 35 8 20
7873B0k8j1K0Lk1K0J6j2l6N3k6J2k6L1K5m1j1K8k0LjlK5k4LjQj2%lJ2RMRmj7k6
$$ 20 -8 -19 1 4 -17 3 19 7 -29 24 -2 10 -16 15 40 -1 -12 16 -4 -1 -2 -5 20 -4 -1 -2 6 -6 -6 -9 3 12 16 25 21 4 -22
7910b2K8J4Ml3RJ3k4J1j1L3ok2K2jqkoKnJ0j7kKJ0pmK4oNRj6j6%J8j1OK7k6j6
$$ -22 6 20 24 -9 0 13 -11 0 -11 22 16 -6 16 15 7 5 -1 1 -4 6 -11 -13 -11 -1 -8 -12 12 6 11 20 4 -12 -12 6 -5 1 28 2 -14
7949a4j6L6j7oL0k5%j1M0k0J2kpk3K3K5Pl2J5mj8lj2L2kJ3j5j5%K1oj3L3l6RK1
$$ -14 -30 6 -11 -17 13 -12 -12 -23 17 -3 9 7 0 -23 0 25 32 0 15 11 -7 -10 -22 10 8 21 6 -9 -9 12 6 -7 26 -10 -1 20
7985B0l9L3k0K0l9L8k6J7kqj1J7Jj1J7PJl1L2lj6pK8l2L2j5Qj9MK4l5MK0J3j2
$$ 20 -19 14 -6 14 -25 13 -13 4 2 -6 -17 0 1 -10 7 14 15 -16 16 13 -3 -10 18 -14 18 3 11 -8 -4 20 -15 -11 9 22 10
8020A0NJj9J0k5K1j7L4l3PLOj5JK2pj1QPKj3romRJ7J4k9%J5m8M1K6j0l0j4J7R
$$ 10 15 16 -3 7 -18 3 -14 20 -13 -6 -3 3 -12 -11 11 4 -7 1 8 10 -3 -12 -18 -22 -13 4 18 -11 -11 4 -44 -3 23 13 -17 -31 -14 -5
8058enoJ9J5k7nK1Rj2j4PlmJ0J6nnOj9J4Npj4J8J7k5j6J6ooJjK6k1J4k0JK7l7
$$ -5 -10 -16 3 18 -9 -14 7 16 4 -10 -3 -6 -10 0 16 11 6 12 -7 7 12 5 -9 9 26 1 -15 1 -5 -11 -10 -11 15 -6 8 -12 -11 16 -21
8097b1M6l0j6K4k1L3k8J3K0k6KJ5j4kJ1rPjKj0j6RRRlj1K0k1%J1rrRMK2k1JL2
$$ -21 25 -5 -21 3 -18 15 -13 0 20 -6 -4 11 -3 -5 6 -3 4 3 5 -5 -21 -12 -3 6 3 -8 12 -9 -9 2 -7 -16 -7 -3 19 -2 -1 31
8135C1k9J9k0Mk1K1k3Jj0nL7j5kMrL1l3J4J4rPJ5l6KL4l9L0oJ0nnOpj0J7K0m2
$$ 31 2 21 1 5 -16 5 -18 -17 -27 -32 5 -10 -12 -8 -17 14 -19 -5 9 0 7 22 -14 -12 22 -17 13 7 17 12 7 13 6 -4 13 33 -9
8172iRk4L4nJ0Nj0K3m6L1k3J4l0M0k5J9qjo
$$ -9 0 -24 10 5 15 20 10 33 -13 18 -5 9 -21 19 -6 13 5 4 -2
8191b
##END NTUPLES=NMR FID
##END=
