##TITLE=1H_AM_NVDICYCL695
 CDCl3
 8 sc, 
 13.04.2022
##JCAMPDX= 6.0         $$ Bruker NMR JCAMP-DX V2.0
##DATA TYPE= NMR FID
##DATA CLASS= NTUPLES
##ORIGIN= UXNMR, Bruker Analytische Messtechnik GmbH
##OWNER= root
$$ XWIN-NMR		Version 3.5
$$ Wed Apr 13 13:48:33 2022 Russian Standard Time (UT+4h)  she@DPX200
##.OBSERVE FREQUENCY= 200.13135
##.OBSERVE NUCLEUS= ^1H
##.DELAY= (6, 6)
##.ACQUISITION MODE= SIMULTANEOUS
##.ACQUISITION SCHEME= undefined
##.AVERAGES= 8
##.DIGITISER RES= 18
##SPECTROMETER/DATA SYSTEM= spect
##.PULSE SEQUENCE= zg30
##.SOLVENT NAME= CDCl3
##.SHIFT REFERENCE= (INTERNAL, CDCl3, 0, 15.7039)
##AUDIT TRAIL= $$ (NUMBER, WHEN, WHO, WHERE, WHAT)
$$ ##TITLE= Audit trail, XWIN-NMR		Version 3.5
$$ ##JCAMPDX= 5.01
$$ ##ORIGIN= Bruker BioSpin GmbH
$$ ##OWNER= she
$$ F:/spectra/data/she/nmr/H-F/1/audita.txt
$$ ##AUDIT TRAIL=  $$ (NUMBER, WHEN, WHO, WHERE, WHAT)
(   1,<2022-04-13 13:46:56.34 +0400>,<she>,<DPX200>,
      <created by zg, POWCHK disabled, PULCHK disabled
       configuration hash MD5:
       00 E9 B6 7A A2 85 ED C7 34 08 36 98 17 FE 4E 26
       data hash MD5: 16K
       96 10 92 64 75 09 B2 BA 1B B5 26 85 87 14 DB 99>)
$$ ##END=
$$ 
$$ hash MD5
$$ 6E 2C F8 16 6B BD E2 ED 50 A8 DC E3 CA 56 C3 BE
##$RELAX= 
##$RELAX= 
##$RELAX= 
##$RELAX= 
##$RELAX= 
##$RELAX= 
$$ Bruker specific parameters
$$ --------------------------
##$DU= <F:/spectra>
##$EXPNO= 1
##$NAME= <H-F>
##$PROCNO= 1
##$TYPE= <nmr>
##$USER= <she>
##$AMP= (0..31)
100 100 100 100 100 100 100 100 100 100 100 100 100 100 100 100 100 100 
100 100 100 100 100 100 100 100 100 100 100 100 100 100 
##$AQSEQ= 0
##$AQ_mod= 1
##$AUNM= <au_zg>
##$AUTOPOS= <>
##$BF1= 200.13
##$BF2= 200.13
##$BF3= 200.13
##$BF4= 200.13
##$BF5= 200.13
##$BF6= 200.13
##$BF7= 200.13
##$BF8= 200.13
##$BYTORDA= 1
##$CFDGTYP= 0
##$CFRGTYP= 5
##$CHEMSTR= <none>
##$CNST= (0..31)
1 1 145 1 1 1 1 1 1 1 1 1 1 1 1 1 1 1 1 1 1 1 1 1 1 1 1 1 1 1 1 1 
##$CPDPRG= <>
##$CPDPRG1= <>
##$CPDPRG2= <>
##$CPDPRG3= <>
##$CPDPRG4= <mlev>
##$CPDPRG5= <mlev>
##$CPDPRG6= <mlev>
##$CPDPRG7= <mlev>
##$CPDPRG8= <mlev>
##$CPDPRGB= <>
##$CPDPRGT= <>
##$D= (0..31)
0 1.2 0 0 0 0 0 0 0 0.06 0 0.03 0 0 0 0 0.0002 0 0 0 0 0 0 0 0 0 0 0 0 
0 0 0 
##$DATE= 1649843215
##$DBL= (0..7)
120 120 120 120 120 120 120 120 
##$DBP= (0..7)
150 150 150 150 150 150 150 150 
##$DBP07= 0
##$DBPNAM0= <>
##$DBPNAM1= <>
##$DBPNAM2= <>
##$DBPNAM3= <>
##$DBPNAM4= <>
##$DBPNAM5= <>
##$DBPNAM6= <>
##$DBPNAM7= <>
##$DBPOAL= (0..7)
0.5 0.5 0.5 0.5 0.5 0.5 0.5 0.5 
##$DBPOFFS= (0..7)
0 0 0 0 0 0 0 0 
##$DE= 6
##$DECBNUC= <off>
##$DECIM= 32
##$DECNUC= <off>
##$DECSTAT= 4
##$DIGMOD= 1
##$DIGTYP= 9
##$DL= (0..7)
0 120 120 120 120 120 120 120 
##$DP= (0..7)
150 150 150 150 150 150 150 150 
##$DP07= 0
##$DPNAME0= <>
##$DPNAME1= <>
##$DPNAME2= <>
##$DPNAME3= <>
##$DPNAME4= <>
##$DPNAME5= <>
##$DPNAME6= <>
##$DPNAME7= <>
##$DPOAL= (0..7)
0.5 0.5 0.5 0.5 0.5 0.5 0.5 0.5 
##$DPOFFS= (0..7)
0 0 0 0 0 0 0 0 
##$DQDMODE= 0
##$DR= 18
##$DS= 0
##$DSLIST= <SSSSSSSSSSSSSSS>
$$ [...]
##$SUBNAM2= <"">
##$SUBNAM3= <"">
##$SUBNAM4= <"">
##$SUBNAM5= <"">
##$SUBNAM6= <"">
##$SUBNAM7= <"">
##$SUBNAM8= <"">
##$SUBNAM9= <"">
##$SW= 18.05172834244
##$SWIBOX= (0..15)
0 0 2 0 0 0 0 0 0 0 0 0 0 0 0 0 
##$SW_h= 3612.71676300578
##$TD= 16384
##$TD0= 1
##$TE= 0
##$TE2= 300
##$TE3= 300
##$TEG= 300
##$TL= (0..7)
0 120 120 120 120 120 120 120 
##$TP= (0..7)
150 150 150 150 150 150 150 150 
##$TP07= 0
##$TPNAME0= <>
##$TPNAME1= <>
##$TPNAME2= <>
##$TPNAME3= <>
##$TPNAME4= <>
##$TPNAME5= <>
##$TPNAME6= <>
##$TPNAME7= <>
##$TPOAL= (0..7)
0.5 0.5 0.5 0.5 0.5 0.5 0.5 0.5 
##$TPOFFS= (0..7)
0 0 0 0 0 0 0 0 
##$TUNHIN= 0
##$TUNHOUT= 0
##$TUNXOUT= 0
##$USERA1= <user>
##$USERA2= <user>
##$USERA3= <user>
##$USERA4= <user>
##$USERA5= <user>
##$V9= 5
##$VALIST= <valist>
##$VCLIST= <CCCCCCCCCCCCCCC>
##$VD= 0
##$VDLIST= <DDDDDDDDDDDDDDD>
##$VPLIST= <PPPPPPPPPPPPPPP>
##$VTLIST= <TTTTTTTTTTTTTTT>
##$WBST= 1024
##$WBSW= 4
##$XGAIN= (0..3)
0 0 0 0 
##$XL= 0
##$YL= 0
##$YMAX_a= 389848
##$YMIN_a= -905901
##$ZGOPTNS= <>
##$ZL1= 120
##$ZL2= 120
##$ZL3= 120
##$ZL4= 120
##$ABSF1= 10
##$ABSF2= 0
##$ABSG= 5
##$ABSL= 3
##$ALPHA= 0
##$AQORDER= 0
##$ASSFAC= 0
##$ASSFACI= 0
##$ASSFACX= 0
##$ASSWID= 0
##$AUNMP= <proc_1d>
##$AZFE= 0.1
##$AZFW= 0.1
##$BCFW= 1
##$BC_mod= 2
##$BYTORDP= 1
##$COROFFS= 0
##$CY= 11.3945322036743
##$DATMOD= 1
##$DC= 2
##$DFILT= <>
##$DTYPP= 0
##$F1P= 2.36226072786647
##$F2P= -0.459571619588291
##$FCOR= 0.5
##$FTSIZE= 0
##$FT_mod= 4
##$GAMMA= 1
##$GB= 0.15
##$INTBC= 1
##$INTSCL= 1
##$ISEN= 128
##$LB= 0.24
##$LEV0= 0
##$LPBIN= 0
##$MAXI= 10000
##$MC2= 0
##$MEAN= 0
##$ME_mod= 0
##$MI= 1.114404
##$NCOEF= 0
##$NC_proc= 0
##$NLEV= 6
##$NOISF1= 3.799351
##$NOISF2= 2.8
##$NSP= 1
##$NTH_PI= 0
##$NZP= 0
##$OFFSET= 15.70392
##$PC= 1
##$PHC0= -18385.55
##$PHC1= 6.40078
##$PH_mod= 1
##$PKNL= yes
##$PPARMOD= 0
##$PSCAL= 0
##$PSIGN= 0
##$REVERSE= no
##$SF= 200.130013532006
##$SI= 16384
##$SIGF1= 3
##$SIGF2= 2
##$SINO= 400
##$SIOLD= 16384
##$SREGLST= <1H.CDCl3>
##$SSB= 0
##$STSI= 0
##$STSR= 0
##$SW_p= 3612.71676300578
##$SYMM= 0
##$S_DEV= 0
##$TDeff= 0
##$TDoff= 0
##$TI= <>
##$TILT= no
##$TM1= 0
##$TM2= 0
##$TOPLEV= 0
##$USERP1= <user>
##$USERP2= <user>
##$USERP3= <user>
##$USERP4= <user>
##$USERP5= <user>
##$WDW= 1
##$XDIM= 8192
##$YMAX_p= 0
##$YMIN_p= 0
$$ End of Bruker specific parameters
$$ ---------------------------------
##NTUPLES= NMR FID
##VAR_NAME=  TIME,          FID/REAL,        FID/IMAG
##SYMBOL=    X,             R,               I
##VAR_TYPE=  INDEPENDENT,   DEPENDENT,       DEPENDENT
##VAR_FORM=  AFFN,          ASDF,            ASDF
##VAR_DIM=   8192,          8192,            8192
##UNITS=     SECONDS,       ARBITRARY UNITS, ARBITRARY UNITS
##FACTOR=    0.0002768,     1,               1
##FIRST=     0,             0,               0
##LAST=      2.2672688,     0,               0
##MIN=       0,             -905901,         0
##MAX=       2.2672688,     389848,          0
$$ Real data points
##PAGE= N=1
##DATA TABLE= (X++(R..R)), XYDATA
0@%%%%%%%Qj6J6j6K4l4M2n6P2q8J10j36J63j95K35k83L37l96M62n38O25p23Q29
$$ 0 0 0 0 0 0 0 0 8 -8 8 -8 16 -18 24 -32 40 -48 62 -74 89 -106 129 -154 183 -213 249 -289 336 -387 442
30D42r48J085j238J405j589J793k016K261k530K824l147L500l888M311m770N274
$$ 442 -506 579 -659 746 -843 950 -1066 1195 -1335 1489 -1658 1842 -2046 2265 -2505 2769
46B769n823O424p083P803q594R467j0433J1506j2705J4048j5567J7305j9308K1647
$$ 2769 -3054 3370 -3713 4090 -4504 4963 -5470 6036 -6669 7379 -8188 9117 -10191 11456
60A1456k4429K7797l1970L7303m4395N4335o9378R5069j50432M73971m59170o36089
$$ 11456 -12973 14824 -17146 20157 -24238 30097 -39281 55788 -94644 379327 -79843 -715932
72g15932R84468r0002m45501L42963J43040n89450J10994L24760p1085J62274
$$ -715932 268536 178534 -266967 75996 219036 -370414 -259420 65340 -5745 156529
82A56529J98099n57135j30620O29184J9148m71077K30544J10044n58664j5389
$$ 156529 354628 -202507 -333127 296057 315205 -155872 74672 184716 -373948 -389337
92c89337O63574L540m68718k4292J51201J5085K19612J09932k51006j21745N9549
$$ -389337 274237 277777 -190941 -215233 -64032 -48947 170665 280597 29591 -92154 -32605
103c2605m1475J54279J90455k99695k97872K31577J43828j32946J46589J45483
$$ -32605 -74080 80199 270654 -29041 -326913 -95336 48492 -84454 62135 207618
113B07618k91539j58723K40681J92983M4043j23572l19851j6237L27979K1663
$$ 207618 -83921 -242644 -1963 191020 235063 111491 -208360 -224597 103382 125045
123A25045j66808Q2101o5637k61131J81911L57865j09074j97654K7807o4336K0428
$$ 125045 -41763 40338 -25299 -286430 -104519 253346 144272 -53382 -25575 -89911 -69483
134f9483K60494j9909k49889K0398K0315j39143J90945K76203k56555l02029J77172
$$ -69483 191011 171102 -78787 -58389 -38074 -177217 13728 289931 33376 -268653 -91481
145i1481J52535l4441J34814k8885l38931K1074L15145l2944j07445J08974j34157
$$ -91481 61054 26613 161427 132542 -206389 -185315 129830 96886 -10559 98415 -35742
156c5742k23216K38895K43924j80422q4869O6692j69421k897L32645M839k73985
$$ -35742 -258958 -20063 223861 43439 -41430 25262 -144159 -147056 185589 190428 -83557
167h3557l362M1351n9629J93732J62397k61253j81814J60065N0358j2858J51880
$$ -83557 -86919 -45568 -105197 88535 250932 -10321 -192135 -32070 18288 5430 157310
178A57310p4644k91016M8705K31377o804k9687L7892j33503r8690J66674J29802
$$ 157310 82666 -208350 -159645 71732 64928 35241 73133 -60370 -159060 7614 137416
189A37416m5637l8114j02597j38082J36973K22347q9440j62621J2709j6992q1
$$ 137416 91779 53665 -48932 -187014 -50041 172306 82866 -79755 -67046 -84038 -84119
200h4119J83664Q0311j75552j09708N4585N4594Q5837N4462j44446j36135N4593
$$ -84119 99545 179856 4304 -105404 -50819 3775 89612 144074 -372 -136507 -81914
211h1914N1046L7996J08092o2211k10835K3595J94536M5032k5166j0435j23190
$$ -81914 -30868 7128 115220 53009 -157826 -134231 60305 105337 80171 69736 -53454
222e3454q1473J40836J15248n5642p0602q6855o8399J29244J56035n9875q9460
$$ -53454 -134927 5909 121157 65515 -5087 -91942 -160341 -31097 124938 65063 -24397
233b4397L415m6399J3578J86392M9029k00707r8467O9065K8121N0107P2057j03951
$$ -24397 -20982 -67381 -53803 132589 181618 -19089 -117556 -48491 -20370 29737 101794 -2157
245b157j42935M6963J03156N4170N7186n7713j65848J4333J63091J8884m7732
$$ -2157 -145092 -98129 5027 59197 116383 58670 -107178 -92845 70246 89130 41398
256D1398O935j09896j15448J44142J64484p4085j02819j4029k0051N8930J41407
$$ 41398 48333 -61563 -177011 -32869 131615 57530 -45289 -59318 -79369 -20439 120968
267A20968j871j23562m8891j0251K2122J34782L7755j80039r2345R1853M4565
$$ 120968 119097 -4465 -53356 -63607 -41485 93297 131052 -48987 -141332 -49479 -4914
278d914K1474Q2496m4497j62919J117J47876O5734k2789o4101j08989j2401J18644
$$ -4914 16560 99056 54559 -108360 -107243 40633 106367 83578 19477 -89512 -101913 16731
290A6731N6665l1514l0561q0334o0461J17971J43510m8347j12080k2206K386L2023
$$ 16731 73396 41882 11321 -69013 -129474 -11503 132007 83660 -28420 -50626 -48240 -16217
302a6217R8730K0284j07080q4479l260O5486J13328J1901j31072p1316N6676N4668
$$ -16217 82513 102797 -4283 -88762 -92022 -26536 86792 98693 -32379 -103695 -47019 7649
314G649M6960M9829p3242j38470J8673J22513M1444j7720n1024r5589o831J10606
$$ 7649 54609 104438 31196 -107274 -88601 33912 75356 57636 6612 -88977 -95808 14798
326A4798O0963j9651l5375p9656n0205J13487J25063n9287j04681j8041j2018
$$ 14798 75761 56110 20735 -58921 -109126 4361 129424 70137 -34544 -52585 -64603
337f4603L3247J17299J1171j28776o1887L6952N0690P4825K9323j06347r1883
$$ -64603 -31356 85943 97114 -31662 -93549 -56597 -5907 68918 98241 -8106 -99989
348i9989N2186O8770K6266L2247n4318j28953R351J25721M3599k7289l7970p8505
$$ -99989 -47803 20967 47233 79480 25162 -103791 -94440 31281 74880 47591 9621 -68884
360f8884k6825J09729R0268m3880p1654m4750k1986P2910J03503l0093r9944l5694
$$ -68884 -95709 14020 104288 60408 -11246 -55996 -77982 -5072 98431 68338 -31606 -67300
372f7300M381M5397R5607J1985j12257o6632M2215N6053N1417K3956q3253r8370
$$ -67300 -62919 -17522 78085 90070 -22187 -88819 -46604 9449 60866 84822 1569 -96801
384i6801L1336Q5459M0484N187o1176r7236J3662J11012M7118l1740m1226o3005
$$ -96801 -65465 19994 60478 65665 4489 -92747 -79085 31927 79045 47305 6079 -56926
396e6926k7485R3333R1471m2233q2696l7661m197N9211Q7728j0951r4753m9389
$$ -56926 -84411 8922 100393 58160 -24536 -62197 -66394 -7183 80545 69594 -25159 -74548
408g4548K1165N4749P1144R884r5247p6347L6766P2848M1071j258o4196p6199
$$ -74548 -53383 1366 72510 82394 -12853 -89200 -52434 20414 61485 60227 -3969 -80168
420h0168R020Q3588O3814j3164p4343o4156J7349P9948N1875j5314o2320o7648
$$ -80168 -71148 12440 76254 63090 -11253 -75409 -58060 21888 73763 58449 -3871 -71519
432g1519J447Q4675O2002k3656o7305n9217N416Q5079O5493l2483o8797l7578
$$ -71519 -70072 14603 76605 52949 -14356 -73573 -68157 16922 82415 49932 -18865 -56443
444e6443l832N6071Q9859j0868j09362m5699M1048M6555N0647J4078q3121p6586
$$ -56443 -60275 -4204 85655 74787 -34575 -80274 -39226 7329 57976 72054 -11067 -87653
456h7653L8258P5818L1521Q05n4595q9173J5837J09698L3998m4063l4746m7383
$$ -87653 -49395 26423 57944 58749 4154 -85019 -69182 40516 74514 30451 -4295 -51678
468e1678k5370Q2773Q8471m1514q8856k5458J3760M6298P5471n703r9045m5495
$$ -51678 -77048 5725 94196 52682 -36174 -61632 -47872 -1574 73897 68194 -30851 -76346
480g6346L9844M7892M6309J2593p8671q1041L7168Q8284K4455k2507m1932o1901
$$ -76346 -36502 11390 57699 70292 -8379 -89420 -52252 36032 60487 37980 -3952 -65853
492f5853k939Q8681O2233l4810o8294l9928J0321O4766O3179j9765q4192m5710
$$ -65853 -68792 19889 82122 47312 -20982 -60910 -50589 14177 77356 57591 -26601 -72311
504g2311K7541N7015M6408n334p0659o1899K6279Q1107M1666k6217n4568m6869
$$ -72311 -44770 12245 58653 53319 -17340 -79239 -52960 28147 69813 43596 -10972 -57841
516e7841K835P3827O1222l3572p6309l4751J7343N3423N8905o919q3037n0871
$$ -57841 -55006 18821 80043 46471 -29838 -64589 -47246 6177 65082 58163 -24874 -75745
528g5745M0537O2541L3428m719o3203o7650K4347Q0288L0182k8284m6945n0397
$$ -75745 -35208 27333 60761 56042 -7161 -74811 -50464 29824 60006 31722 -15223 -65620
540f5620n73Q3811O2722m1722o6071k1513Q492N1469O6771j8863r0687l9199L6787
$$ -65620 -66193 17618 80340 38618 -27453 -48966 -40474 10995 77766 58903 -31784 -70983 -34196
553c4196M6977L7683K492p1410o3074L9364P5375K5870j4406m9169n8941J2875
$$ -34196 12781 50464 52956 -18454 -81528 -42164 33211 59081 44675 -4494 -63435 -50560
565e0560Q1727M0213m0283n5472l3804L641O3565O1362k7636p4743l0108K6874
$$ -50560 31167 71380 31097 -24375 -58179 -54538 9027 70389 42753 -31990 -62098 -35224
577c5224N4950M6717j3677p2656m7196L1316N9745L0852j3815n9321n3843K3965
$$ -35224 19726 66443 52766 -19890 -67086 -35770 23975 54827 41012 -18309 -72152 -48187
589d8187P4577L7587k6239n6320l8768J7355O5899M3892k9730o5119l5457J8559
$$ -48187 26390 63977 37738 -18582 -57350 -39995 25904 69796 40066 -25053 -60510 -41951
601d1951N8666M3716k2090o5215m0407K6418O6918L7212k4527n7487l9667J9137
$$ -41951 16715 60431 38341 -26874 -67281 -40863 26055 63267 38740 -18747 -58414 -39277
613c9277O4864M0161k9519o3471l2770K2135N5976M3581k1189o8286l3947K9663
$$ -39277 25587 65748 36229 -27242 -60012 -37877 18099 61680 40491 -27795 -61742 -32079
625c2079N5885L7908j8898o7078m1279L2814O2002K4820k3552m8923m2652J4880
$$ -32079 23806 61714 42816 -24262 -65541 -32727 29275 54095 30543 -18380 -61032 -46152
637d6152P1276M0850l4705n9685k7964K1840N8176M0475k9620o4254k3805K4827
$$ -46152 25124 65974 31269 -28416 -56380 -34540 23636 64111 34491 -29763 -53568 -28741
649b8741M4586M2391j2673p4987l9968M2495N7983K1355j8974n3335m2301K7500
$$ -28741 15845 58236 45563 -29424 -69392 -26897 31086 52441 33467 -19868 -62169 -34669
661c4669O6836K4772k9398m7274l6722J5676O7317L7236l5689n8753k5081K3807
$$ -34669 32167 56939 27541 -19733 -56455 -40779 26538 63774 28085 -30668 -55749 -31942
673c1942N4705L7376k6689o5591k5572L4163M7954K8278j5649n9302m0141L0293
$$ -31942 22763 60139 33450 -32141 -57713 -23550 24404 52682 37033 -22269 -62410 -32117
685c2117O4052K6550l0842n4852l0255K7480N9809K4759k9877m7475k9118J7807
$$ -32117 31935 58485 27643 -27209 -57464 -29984 29825 54584 24707 -22768 -51886 -34079
697c4079N9173L6109l0490o2500k7154L2524N5284K4506k7917n4010k6230K7013
$$ -34079 25094 61203 30713 -31787 -58941 -26417 28867 53373 25456 -28554 -54784 -27771
709b7771N3586K9597k4955n5971l0323K6824N9469K9001l4019n5981k2380K7053
$$ -27771 25815 55412 30457 -25514 -55837 -29013 30456 59457 25438 -30543 -52923 -25870
721b5870N2794K6994k7728n4284k6364K8063N4397K6871k6538n6597k9648L1680
$$ -25870 26924 53918 26190 -28094 -54458 -26395 28002 54873 28335 -28262 -57910 -26230
733b6230N7865K2348l2519n1072k1933K4837N1614L0244k9233n6078k1168K7264
$$ -26230 31635 53983 21464 -29608 -51541 -26704 24910 55154 25921 -30157 -51325 -24061
745b4061N0333L0336k8794o0112k1408L5164M7594J8866k2435n0983l0595L1343
$$ -24061 26272 56608 27814 -32298 -53706 -18542 29052 47918 25483 -25500 -56095 -24752
757b4752N6728J8919k8809m8380k7068K7608N7304K2119l4881m9374j7298K3488
$$ -24752 31976 50895 22086 -26294 -53362 -25754 31550 53669 18788 -30586 -47884 -24396
769b4396M8296L0679l0261n8384j7298L3004M5682K3172k4843n5556k3863L6472
$$ -24396 23900 54579 24318 -34066 -51364 -18360 27322 50494 25651 -29905 -53768 -17296
781a7296M9003J4080k2787m6926l1075L1411N9559J3770l3872m2603k1545K4120
$$ -17296 31707 45787 23000 -23926 -55001 -23590 35969 49739 15867 -26736 -48281 -24161
793b4161N4154K2387l5217m8063j4961K3403M7766K8317l2631n6516j3098L3090
$$ -24161 29993 52380 17163 -30900 -45861 -22458 25308 53625 20994 -35522 -48620 -15530
805a5530M2856J9326k5536n0367k0850L3281M8066J4743k5457m7201k5493L3055
$$ -15530 27326 46652 21116 -29251 -50101 -16820 31246 45989 20532 -26669 -52162 -19107
817a9107N4665J2824l4289m3139j7283K6953M9311J9110l2904m6258j5385K5107
$$ -19107 35558 48382 14093 -29046 -46329 -19376 29935 49045 16141 -30117 -45502 -20395
829b0395M7712K4206l4032n2858j1726L3229M3209J5728k9049m6048j5519K9840
$$ -20395 27317 51523 17491 -35367 -47093 -13864 29345 45073 16024 -30024 -45543 -15703
841a5703M4494J7394k6282m9518k0533L5069M9258J1584l1308m5049j4348L1578
$$ -15703 28791 46185 19903 -29615 -50148 -15079 34179 45763 14455 -30594 -44942 -13364
853a3364M3072J3157k6738m3348j9746K7903N0742J6721l6215m4827j1205K8514
$$ -13364 29708 42865 16127 -27221 -46967 -19064 31678 48399 12184 -32643 -43848 -15334
865a5334M6072J5029l4371m2979r798K7138M1202J9213k8191n0810j4593L7219
$$ -15334 30738 45767 11396 -31583 -41381 -14243 26959 46172 17981 -32829 -47422 -10203
877a0203M2502J0435k7582m6101j4938L5691M2624P669k7212l9479j7742K7524
$$ -10203 32299 42734 15152 -30949 -45887 -10196 32428 40097 12885 -26594 -44336 -16812
889a6812M9348J3649l6356m1765j0273K8136M5480J2770l5637m0353p293K6681
$$ -16812 32536 46185 9829 -31936 -42209 -14073 31407 44177 8540 -31813 -39106 -12425
901a2425L9022J7146k8458m8008j1696L5531L9866J0411k7945m4666j2451L5364
$$ -12425 26597 43743 15285 -32723 -44419 -8888 30978 41389 13444 -31222 -43673 -8309
913h309M0330P110k7552l8939j5446K9122M6519J0362l5432l8838r321K7867M3388
$$ -8309 32021 39131 11579 -27360 -42806 -13684 32835 43197 7765 -31073 -40394 -12527 30861
926C0861J1934l4599m0549p390K9293L9538J2353k9904m3987r307L3504L8431
$$ 30861 42795 8196 -32353 -39743 -10450 29088 41441 11537 -32450 -41757 -8253 30178
938C0178R833k8409m2638r864L3082L8925Q584k9639m0120j0287L1263M0927P510
$$ 30178 40011 11602 -31036 -40900 -7818 31107 39691 10052 -30068 -40355 -9092 31835 39345
951C9345l1409l7245j0365K8950M2221Q435l2769l8144q491K9907M0419Q380l2165
$$ 39345 7936 -29309 -39674 -10724 31497 39932 7163 -30981 -39472 -9565 30854 39234 7069
964G069l9133n868L0992L6105R139k8749m0772p814L2602L7971P485l1231l9547
$$ 7069 -32064 -37932 -6940 29165 38304 9555 -31217 -39031 -6429 31542 39027 7796 -31751
977c1751p124L3276L8601M057l1301l4825q341K8717M0297O969l2547l7313p352
$$ -31751 -38875 -5599 33002 37059 5758 -29067 -37408 -8691 31606 38575 6028 -31285 -38637
990c8637L1591L8986N455l3345l6419l184L0502L4102P327k9350l8615n786L1990
$$ -38637 -7046 31940 37395 4050 -32369 -35553 -5051 29051 36378 7028 -31587 -37373 -5383
1003e383L6896O327l2026l8223l915L2985L5489K954l1040l3455o059K9658L7000
$$ -5383 31513 37840 5814 -32409 -36324 -3339 32150 35104 4064 -29391 -35450 -5792 31208
1016C1208M713l1390l5507n797L1975L7290L399l4014l5477n27L1522L2028M746
$$ 31208 35921 4531 -30976 -36773 -4798 32492 35891 1877 -33600 -34127 -2605 29423 34169
1029C4169k9652l6209l385L1613L4579N081l2149l6931k340L4254L4185l80l1234
$$ 34169 4517 -31692 -35077 -3464 31115 36196 4047 -32884 -35224 -970 33215 32835 1601
1042A601l0873l600K9542L4547L278l1364l4766l608L3565L4735n74l2432l2266
$$ 1601 -29272 -32872 -3330 31217 34495 3131 -31635 -35243 -1678 33057 32483 51 -32215
1055c2215l67L1114L1587K415l0343l3771k162L1603L3789K287l3038l3195K41
$$ -32215 -32582 -1468 30119 32534 2191 -31580 -33742 -2139 31650 33937 899 -32296 -32055
1068c2055L1806L1924J67l0566l1683j858L1917L2717r40l0540l0835k707L1205
$$ -32055 -249 31675 31842 1276 -30407 -32265 -348 32369 31429 889 -29946 -32653 -1448
1081a448L3857Q4l2796l1983P19L1416L0993j12l1292l0509J51K9213L1945K383
$$ -1448 32409 32493 -303 -32286 -31567 -151 30842 30730 -562 -31071 -30920 -1707 30238 32621
1095C2621l2523l2589J475L2453L0615j869l1541k8687M13K9499L1163M17l1140
$$ 32621 98 -32491 -31016 1437 32052 30183 -1358 -30045 -29632 -133 31030 31447 307
1108C07l2027M71L3372L0372k855l1325k9216J592K9648K9200P18l1238l1249
$$ 307 -31720 -31249 2123 32495 29640 -1685 -30901 -29309 339 29539 30257 -981 -32230
1121c2230K173L1099K9646q71l2220k8672K980K9511K8506j65l0596l0296J263
$$ -32230 -30057 1042 30688 29817 -2403 -31075 -28095 1416 29922 29757 -839 -31135 -29872
1134b9872L2825K8575l431k9632k8519J139L1323K8490k116k9934k9677J778L1631
$$ -29872 2953 31528 28097 -1535 -30054 -28915 2408 30898 28782 -1152 -30829 -29051 2580
1147B580K8183l094l0992k7698L267K9474K8127j692l1493k7999L510L1292K7438
$$ 2580 30763 27669 -3323 -31021 -27754 1720 29847 28155 -3338 -31337 -27827 3465 30903
1160C0903l845l0377k6926K651L0919K7526l737k9585k8010K784L2437K7027n435
$$ 30903 27058 -3319 -30245 -27594 3325 30851 27114 -2471 -30481 -27697 4740 31767 26332
1173B6332k9823k5732K765K9430K7277l264l1630k6028M659K9035K7117l211l1992
$$ 26332 -3491 -29223 -26458 2972 30249 26985 -4645 -30673 -26014 3021 30138 26927 -5065
1186e065k5510N501K8731K5425k941k9921k7261M042L1674K5685n333k9014k5539
$$ -5065 -30575 -25074 3657 29082 26141 -3780 -31041 -26999 4675 30360 25027 -3987 -29526
1199b9526M060L1217K5002n178k9156k5466L512K9797K5889n083l1237k4090N757
$$ -29526 -25466 5751 30753 25575 -3581 -29047 -25535 4262 30151 25068 -6169 -30259 -24502
1212b4502K8383K5919l971l1141k4196N617K8691K4994m519l1183k5400O276L0258
$$ -24502 3881 29800 25829 -5312 -29508 -23891 4800 29794 25275 -5908 -31308 -25032 5226
1225E226K2761m884k7289k5476N180L1632K3546o046k8503k4535M859K9694K3149
$$ 5226 27987 23103 -4186 -29662 -24482 7150 30696 24650 -3853 -28388 -23529 6165 29314
1238B9314o927k9125k2646M872K8501K6111n434l1833k1972Q077K8169K2402o092
$$ 29314 22387 -6738 -29384 -24512 3989 30100 24666 -7167 -29139 -21062 7107 29509 23417
1251B3417k9541k3653N824K9152K2261n524k9068k4349Q763L1651K0292o834k6116
$$ 23417 -6124 -29777 -23953 5199 27460 21936 -7132 -31481 -22718 8933 29225 22391 -3725
1264c725k3454M934K9870K3059q394l0589k1927O864K9657K2622q782k8232j8485
$$ -3725 -27179 -22245 7625 30684 22290 -8299 -30226 -23362 6295 28917 20135 -8097 -26582
1277b6582N473K7196K5201p016l2430k1698R838K7584J8626o931k7315k2291P899
$$ -26582 -21109 6087 31288 24272 -8158 -29856 -20018 7566 26192 19261 -8054 -30345 -22446
1290b2446K9936K0964n869k8803k2906R514L1392J8001j1074k6272j9166M494
$$ -22446 7490 28454 22585 -6218 -29124 -19610 11782 29783 18709 -7563 -26729 -22235
1302b2235K7470K4273q684l1644j8645J0495K8604J9850r465k8205j8543P180
$$ -22235 5235 29508 20824 -10820 -29465 -18970 9634 29484 20019 -8186 -26729 -19549
1314a9549K6467K0859o630l1335k2057J2845K9950J5722q485k5112j9542P904
$$ -19549 6918 27777 21147 -10188 -32245 -19400 10550 26272 17787 -7325 -26867 -18963
1326a8963K7768K0146p693k9687k1180R901L0529J7333j2166k4880j6030N280
$$ -18963 8805 28951 21258 -8429 -29609 -19708 10821 28154 15988 -8892 -24922 -19642
1338a9642K6767K2724r057l1364j8791J1463K8412J6049j0566k6193j6411Q848
$$ -19642 7125 29849 20792 -10572 -29363 -17900 10512 26561 15995 -10198 -26609 -17761
1350a7761K5371J9382n873k9674k1737J2642L0250J4613j1739k5344j6544P554
$$ -17761 7610 26992 21119 -8555 -30292 -17650 12600 27213 15474 -9870 -26414 -18860
1362a8860K6927J9966q994k8216j8518J0694L0369J6210j4353k5505j4125O398
$$ -18860 8067 28033 19039 -9177 -27695 -17001 13368 29578 15225 -10280 -24405 -18007
1374a8007K4452J9819q681k9853j7498J3131K7394J6350q903k6966j6581J0267
$$ -18007 6445 26264 17583 -12270 -29768 -16637 10757 27107 18204 -8762 -25343 -15076
1386a5076K4762J7047p888l0096k0334J3558L0378J2402j2969k0703j3433N898
$$ -15076 9686 26733 18845 -11251 -31585 -18027 12351 24753 11784 -8919 -22352 -16454
1398a6454K6816K0076j0962k8844j7527J0800K7568J4346j4318k5853j2005R781
$$ -16454 10362 30438 19476 -9368 -26895 -16095 11473 25819 11501 -14352 -26357 -16576
1410a6576K2555J9898n279l0550j8632J5951K9021J1483j4013k5645j3965R925
$$ -16576 5979 25877 20598 -9952 -28584 -12633 16388 27871 13858 -11787 -25752 -15827
1422a5827K3814J4237q844k4456j6794J1578L0817J4716j3914k3653j3492P837
$$ -15827 7987 22224 13380 -11076 -27870 -16292 14525 29241 15327 -8326 -21818 -13981
1434a3981K5024J6295j2763k9634j4888J4209K5949J2993j1094k3475j1938J0970
$$ -13981 11043 27338 14575 -15059 -29947 -15738 10211 23204 12110 -11365 -23303 -12333
1446a2333K3895J7009j0034l0216j5956J5439K5830P912j3275k0066j2460P289
$$ -12333 11562 28571 18537 -11679 -27635 -12196 13634 21546 8271 -11795 -24255 -16966
1458a6966K5734J8706r205k8353j7543J5849L0759Q652j8782k2135q580P741K0407
$$ -16966 8768 27474 18269 -10084 -27627 -11778 18981 27633 8851 -13284 -21864 -14123 6284
1471F284J6786q636k8040j4462J5263K7318J2702j4403k5475r580J1899K0885
$$ 6284 23070 14434 -13606 -28068 -12805 14513 27215 12812 -12663 -22243 -10344 10541
1483A0541J2615r150k6471j6760J4522K9063J0275j4265k1809j1897J1359K6078
$$ 10541 23156 14006 -12465 -29225 -14703 14360 24635 10370 -11439 -23336 -11977 14101
1495A4101J2851j4088k5633j1417J3084K3475J0486j3019k2843r986R926K2310
$$ 14101 26952 12864 -12769 -24186 -11102 12373 22859 9840 -13003 -22989 -13063 9247
1507I247J6997j0641l0070j2961J7842K5928O788j4426k0752j0545J0507K2825
$$ 9247 26244 15603 -14467 -27428 -9586 16342 23130 8704 -12048 -22593 -12086 10739
1519A0739J3023j0265k5538j4741J5248K8358Q183j7143k1446o938J0488K0112
$$ 10739 23762 13497 -12041 -26782 -11534 16824 25007 7864 -13582 -20520 -10032 10080
1531A0080J3266r940k6104j2971J4107K6092J1099j5959k5085q486J4557K2038
$$ 10080 23346 13406 -12698 -25669 -11562 14530 25629 9670 -15415 -23901 -9344 12694
1543A2694R193j2070k2541j1532J3224K5451R902j4335k2648r672J2832K2753
$$ 12694 21887 9817 -12724 -24256 -11032 14419 24321 9986 -12662 -22334 -9502 13251
1555A3251J0123j2906k4703j0442J5131K3489Q837j3696k2171q966J2838K3115
$$ 13251 23374 10468 -14235 -24677 -9546 13943 22780 9084 -13087 -22053 -9215 13900
1567A3900J0615j4195k4102j0416J4100K4454Q473j6247k2121o513J2922K0677
$$ 13900 24515 10320 -13782 -24198 -10098 14356 22829 6582 -15539 -22052 -9130 11547
1579A1547J0777j0586k4472j1448J6154K4299P149j5132k2592q858J4727K2079
$$ 11547 22324 11738 -12734 -24182 -8028 16271 23420 8288 -14304 -23162 -8435 13644
1591A3644P723j3318k1269r228J2670K4815J0082j6618k3076o082J2857K0388
$$ 13644 21367 8049 -13220 -22448 -9778 15037 25119 8501 -14575 -20657 -7800 12588
1603A2588R274j3129k3885q826J5140K2029P823j2374k2221r116J5779K2382O563
$$ 12588 21862 8733 -15152 -23978 -8838 13191 21014 8640 -13581 -22697 -6918 15464 22027
1616B2027j3293k1508r766J3549K3791P643j6598k0876n745J2776K1023R820j4102
$$ 22027 8734 -12774 -22540 -8991 14800 22443 5845 -15031 -20776 -8000 13023 22843 8741
1629H741k2681p345J4650K1448P346j4845k2722p279J5453K1066N837j3057k0473
$$ 8741 -13940 -21285 -6635 14813 22159 7314 -15408 -22687 -7234 13832 19669 6612 -13861
1642a3861q472J4721K3477O685j5611k0956n982J3218K0769P763j5340k1945n572
$$ -13861 -22333 -7612 15865 22550 6939 -14017 -19999 -6781 13988 21751 6411 -15534 -21106
1655b1106J4169K0493P833j4125k1977o110J5895K0583N134j3882k0598q117J4506
$$ -21106 -6937 13556 21389 7264 -14713 -20823 -4928 15655 20789 6907 -13691 -21808 -7302
1668g302K2201N312j6096j9773n298J4504K0587P278j4589k1117n108J4309J9859
$$ -7302 14899 20211 4115 -15658 -20956 -6452 14135 21413 6824 -14293 -19401 -5092 14767
1681A4767P057j5432k2756n222J6803J9246L880j3347j9064o510J5076K2282N025
$$ 14767 21824 6392 -16364 -21586 -4783 14463 18343 4996 -14068 -20578 -5502 16780 21805
1694B1805j5658k0123n959J4804K0438L883j6019j9198m519J3264K0248P578j4421
$$ 21805 6147 -13976 -19935 -5131 15307 19190 3171 -16027 -20546 -7282 12966 20544 6123
1707F123k1913l936J6994J9227L730j4466j9778n673J3977J9507N038j5151j9741
$$ 6123 -15790 -19726 -2732 16495 20225 5759 -14019 -19692 -5715 13792 18830 3679 -16062
1720a6062n122J6406K1243L802j5632j7639m080J3586J8844N071j5714k1575m833
$$ -16062 -21184 -4778 16465 20267 4635 -13004 -17084 -3498 15346 20417 4703 -16872 -21705
1733b1705J6419J9187L349j4793j8198k826J5158J9470M738j5183j9851m172J5188
$$ -21705 -5286 13901 17250 2457 -15741 -18567 -3409 16061 20799 5616 -14235 -18407 -3219
1746c219J9354K173j6897j7940k723J4195J8637N441j4063k0043l336J7557J8547
$$ -3219 16135 18308 1411 -16529 -19252 -5057 13580 19021 4958 -15085 -18421 -864 17683
1759A7683J694j5546j8346m060J4446J7487L160j4607j8820l638J6823K0636K068
$$ 17683 19377 3831 -14515 -18575 -4129 13358 16518 1911 -16909 -20547 -3724 16912 18980
1772A8980j6935j5896r06J2920J7116M184j6033k0323k879J6560J8221J925j5639
$$ 18980 2045 -13851 -14757 -1837 15279 19463 3430 -16893 -19772 -3212 15009 16934 1295
1785A295j7784o05J6663J6237K459j3253j8904m700J6815J8852k65j7183j6413
$$ 1295 -16489 -17094 -431 15806 18265 5012 -13892 -18592 -1777 17075 16810 -373 -16786
1798a6786j103J4453J7461L151j5460j7155j539J5517J8421J852j6757j7590q56
$$ -16786 -17889 -3436 14025 17176 1716 -15439 -16978 -1461 16960 18812 2055 -15535 -16391
1811a6391J5276J5574J787j3819j8627k736J7702J7773L35j5765j5854j033J4783
$$ -16391 -1115 14459 16246 2427 -16200 -18936 -1234 16539 16874 1109 -14745 -15778 -995
1824i95J6576J973j5644j7331j942J5684J7608N78j7234j5567L5J4859J5913K014
$$ -995 15581 17554 1910 -15421 -17363 -1679 15929 16507 -727 -16294 -16259 -1400 14513 16527
1838A6527j5030j7032j762J6935J7797m27j6558j5663n5J4959J5044J270j5212
$$ 16527 1497 -15535 -17297 -362 17435 17008 450 -15213 -15268 -309 14735 16005 793
1851G93j7376r28J6626J6682N17j6244j5681J125J5345J4921N63j4742j6801j891
$$ 793 -16583 -17511 -885 15797 16314 70 -15611 -14486 859 15780 16343 1601 -15200 -17091
1865a7091J6023J6764j284j6553j4232L03J5212J5805J293j4867j5818p8J6170
$$ -17091 -1068 15696 14412 -2141 -16373 -16070 -858 14947 16240 1373 -14445 -14523 1647
1878A647J5616o28j6946j6123J280J4707J3556R06j4484j6158PJ7936J6268j484
$$ 1647 17263 16635 -311 -16434 -15154 -447 13109 14015 -469 -16627 -16620 1316 17584 16100
1892A6100j5675j3822m20J4519J4993j015j6035j5557l44J5743J6317o11j6199
$$ 16100 425 -13397 -13817 702 15695 14680 -1355 -16912 -17256 -1513 14804 14193 -2006
1905b006j3798L133J4973J3719R39j4877j7174Q4J6438J4049k442j5774j4217
$$ -2006 -15804 -12671 2302 16021 16960 2083 -15091 -15007 1431 15480 13038 -2736 -16953
1918a6953J131J5658J4846j62j4240j4043J01J5834J5968k437j7657j3824J640
$$ -16953 -15822 -164 14682 14520 280 -13763 -13662 2172 18140 15703 -1954 -15778 -14138
1931a4138J4028J2952k41j4710j5034J903J7019J4805j578j4827j4087J703J5267
$$ -14138 -110 12842 12601 -2109 -17143 -15240 1779 16584 15006 179 -13908 -12205 3062
1944C062J2916j962j5537j4508J24J5574J5537k085j6556j1845L058J4147J3845
$$ 3062 15978 14016 -1521 -16029 -15905 -331 15206 13121 -3435 -15280 -12222 1925 15770
1957A5770m9j5651j5473J907J6239J2175k887j4868j4063J558J6687J3331k252
$$ 15770 15721 70 -15403 -13496 2743 14918 12031 -2837 -16900 -15342 1345 14676 12424
1970A2424j3862j2661P27J5983J5619l518j7766j1509K969J2220J3172J42j6631
$$ 12424 -1438 -14099 -13372 2611 18230 14712 -3054 -14563 -11594 626 13798 13940 -2691
1983b691j4720M026J6293J1586j510j3923j4481K232J7342J1553l830j3188j3692
$$ -2691 -17411 -13385 2908 14494 12984 -939 -15420 -13188 4154 15707 11877 -1311 -15003
1996a5003j15J6688J4675m728j6243r831K401J2866J4763n84j7431j2890M571
$$ -15003 -15118 1570 16245 11517 -4726 -14557 -12156 710 15473 14889 -2542 -15432 -10861
2009a0861J4407J1415j579j5667j3904L811J5691J0738k685j3248j3675J209J8029
$$ -10861 3546 14961 13382 -2285 -16189 -12378 3313 14051 11366 -1882 -15557 -14348 3681
2022C681J3156n464j4734j0188J900J3543J3647k423j6926j2236M002J4518J1892
$$ 3681 16837 11373 -3361 -13549 -11649 1894 15541 13118 -3808 -16044 -12042 2476 14368
2035A4368k471j5531j2010M378J5265J1011k476j4164j3056K174J6916J2143o031
$$ 14368 11897 -3634 -15644 -11266 3999 15010 12534 -1630 -14686 -12512 4404 16547 10516
2048A0516j5139r689K245J3659J3111k174j6813j1950N820J4650J0192k113j5094
$$ 10516 -4623 -14312 -12067 1592 14703 12529 -4284 -16234 -10414 4236 14428 12315 -2779
2061b779j2950M781J5318R276l376j3202j2758K070J8118J2045p089j3740q146
$$ -2779 -15729 -10948 4370 13646 10270 -2932 -15690 -13620 4498 16543 9454 -4286 -12432
2074a2432J857J3458J3801l858j7688j0162N142J2915J0628k006j6466j1932O976
$$ -12432 -10575 2883 16684 12826 -4862 -15024 -9882 3033 13661 11655 -4811 -16743 -9767
2087i767J4272Q210j485j3035j3993M045J8029R443p299j2341r475J063J5069
$$ -9767 4505 12715 11230 -1805 -15798 -11753 6276 15719 8420 -3921 -13396 -12333 2736
2100B736J3182n775j5845q129L909J3433J2296l644j6999r761O218J2565R125
$$ 2736 15918 10143 -5702 -13831 -9922 3511 15807 12163 -4836 -14597 -8379 4186 13311
2113A3311k095j5167j2738N882J6276Q115m920j2509j0294L133J5680J1103n963
$$ 13311 11216 -3951 -16689 -10807 5469 13584 8664 -3845 -14139 -11006 4674 15777 9814
2126I814j4698r027L702J4202J0959n328j5315q797N012J3641R951l284j4835
$$ 9814 -4884 -13911 -10209 3993 14952 9624 -5691 -14488 -9476 4165 14116 10832 -4003
2139d003j0935N600J5461Q562n463j3533r603L766J4465J0494n405j5342q767
$$ -4003 -14938 -9338 6123 14685 9222 -4311 -13914 -10148 4317 14811 9406 -5936 -14703
2152a4703N499J3832R788m685j5055r071N638J3733Q836m415j4160j0770N844
$$ -14703 -9204 4628 14416 9731 -5324 -14395 -8757 4976 13812 9397 -4763 -15533 -9689
2165i689J6082P565o179j2118r026L533J5182J0377o481j5305p753N657J2992
$$ -9689 6393 13958 7779 -4339 -13365 -9832 5350 15727 9246 -6059 -13812 -8155 4837
2178D837R497n146j5409q036N925J3050R028m154j5161j0040P288J5174O388n604
$$ 4837 14334 9188 -6221 -14257 -8332 4718 13746 9592 -5569 -15609 -8321 6853 13241 7637
2192G637j1945r561L992J5781Q904p022j4031p412N422J3965Q747o135j4428p247
$$ 7637 -4308 -13869 -9877 5904 14808 7786 -6245 -13657 -8235 5730 14477 8342 -6086 -13333
2206a3333N644J2766R388n166j5768q390P551J3732O379n366j2750q889N321J4889
$$ -13333 -7689 5077 14465 9299 -6469 -14859 -7308 6424 12803 7437 -5313 -14202 -8881 6008
2220F008Q360o948j3912p537O294J4151P218o458j3257p250N647J3237Q565n830
$$ 6008 14368 7420 -6492 -14029 -7735 6416 13634 7176 -6081 -13331 -7684 5553 14118 8288
2234H288j4905p541P627J3219O573n928j2874p797N416J4257P964p161j3877o816
$$ 8288 -6617 -14158 -6531 6688 13261 7333 -5541 -13338 -7922 6335 14299 7138 -6739 -13555
2248a3555O409J3382P300o893j3146o842O169J2847P911n842j4724p430Q041J3406
$$ -13555 -7146 6236 13536 6643 -6503 -13345 -7176 5671 13582 7740 -6984 -14414 -6373 7033
2262G033N686o012j2460p671O074J4020P461p177j3643o478O402J3695O713p691
$$ 7033 12719 6707 -5753 -13424 -7350 6670 14131 6954 -6689 -13167 -6765 6930 13643 5952
2276E952j2856n579N863J2332P670o278j4442o865Q235J3403N068o428j2411o982
$$ 5952 -6904 -12483 -6620 5712 13382 7104 -7338 -14203 -5968 7435 12503 6075 -6336 -13318
2290a3318O706J3491O311p065j3109o324P084J3626O124p926j2732m881O332J1976
$$ -13318 -6612 6879 13190 6125 -6984 -13308 -6224 7402 13526 5600 -7132 -12013 -5681 6295
2304F295P125o740j3946o317P928J3425M770p243j2091o114O873J3269N573p148
$$ 6295 13420 6680 -7266 -13583 -5655 7770 12540 5297 -6794 -12908 -6035 7234 12807 5659
2318E659j2809n956P352J3273N478p733j2890m573O706J1984O556o779j3899n485
$$ 5659 -7150 -13106 -5754 7519 12997 5264 -7626 -12199 -5493 6491 13047 6268 -7631 -13116
2332a3116Q464J2599M602p227j2250n748P428J2964N017p749j2204n884P583J3494
$$ -13116 -4652 7947 12549 5322 -6928 -12676 -5248 7716 12733 4984 -7220 -13104 -5521 7973
2346G973M636q306j1931m429O773J2219N925p666j3451m291P862J2098M807p231
$$ 7973 12609 4303 -7628 -12057 -5284 6935 12860 5194 -8257 -12548 -4686 7412 12219 4988
2360D988j2673m691P934J2100M569p278j2277n379Q226J2833L766p906j1277n092
$$ 4988 -7685 -12376 -4442 7658 12227 4949 -7328 -12707 -4481 8352 12118 4212 -7065 -12157
2374a2157P093J2894M609q340j1924m097P181J2030N248q357j2429l600P818J1460
$$ -12157 -5064 7830 12439 4099 -7825 -11922 -4741 7289 12537 4180 -8249 -11849 -4031 7429
2388G429M618p730j2633l941Q612J1437L687p186j1769m873Q380J2515L406q127
$$ 7429 12047 4317 -8316 -12257 -3645 7792 11479 4293 -7476 -12349 -3969 8546 11952 3825
2402C825j1183m373P500J2079M105q114j1822l767P860J1586M223p980j2195l558
$$ 3825 -7358 -11731 -4231 7848 11953 3839 -7983 -11750 -3890 7696 11919 3939 -8256 -11814
2416a1814Q241J1286L605p474j1731l958P974J2069L340p933j1408l631P644J1783
$$ -11814 -3573 7713 11318 3844 -7887 -11845 -3871 8198 11538 3605 -7803 -11434 -3790 7993
2430G993M046q234j1862l353Q213J1266L418p772j1904l501Q677J0902L013p536
$$ 7993 12039 3805 -8057 -11410 -3197 8069 11487 3715 -8189 -11690 -3013 7889 10902 3366
2444C366j1287l930Q279J2271K769q940j0513k908P170J1639L901q760j1417k714
$$ 3366 -7921 -11851 -3572 8699 11468 2528 -7985 -10893 -3723 7916 11817 3057 -8360 -11074
2458a1074Q036J0938L633p919j2245k503Q717J0520K628p204j1340l791Q667J1447
$$ -11074 -3038 7900 11533 3614 -8631 -11134 -2417 8103 10731 3527 -7813 -11604 -2937 8510
2472H510K208q039j0443l478P810J1890K741q873j0378k612P288J1359L385q768
$$ 8510 10718 2679 -7764 -11242 -3432 8458 11199 2326 -8052 -10664 -3376 7983 11368 2600
2486B600j1401j809Q366J0100K802p610j1142k817Q869J0616K187q017j0775k743
$$ 2600 -8801 -10610 -2244 7856 10658 3048 -8094 -10911 -2042 8574 10761 2744 -8031 -10774
2500a0774Q315J1206K040q486j0579k480P989J0719L140q895j0921j919Q654R917
$$ -10774 -2459 8747 10787 2301 -8278 -10758 -2769 7950 11090 2195 -8726 -10645 -1991 7926
2514G926K438p851j0925k313Q593J0751J749q213j0385k382Q542J0789J716q494
$$ 7926 10364 2513 -8412 -10725 -2132 8619 10368 2155 -8230 -10612 -2070 8719 10435 1941
2528A941j0219j782Q093J0161K745q833j0927j205Q508R786J915q258j0642j830
$$ 1941 -8278 -10060 -1967 8194 10939 2106 -8821 -10026 -1518 8268 10183 1925 -8717 -10547
2542a0547R050J0031J160q062r987k104Q811J0444J097q623r525j730Q340J0349
$$ -10547 -1497 8534 9694 1632 -8355 -10459 -1648 8796 9893 1270 -8255 -9985 -1645 8704
2556H704J566q910j0046j034Q300R977J596q577j0137j219Q332R927J487q480
$$ 8704 10270 1360 -8686 -9720 -1420 8557 10153 1576 -8561 -9780 -1448 8479 9966 1486
2570A486j0130j483Q679R971J220q747r656j291Q842R471J297q455r907j306R072
$$ 1486 -8644 -10127 -1448 8523 9743 996 -8660 -9951 -1109 8362 9659 1204 -8703 -10009 -937
2585i37R497J148q424r701r21Q348R677J074q695r491r34Q400R809Q32r055r278
$$ -937 8560 9708 1284 -8417 -9338 -990 8687 9761 1066 -8425 -9359 -959 8850 9682 627 -8651
2601h651p27Q375R551Q07q562r607p97Q897R042J143q684r391j040Q930R223M23
$$ -8651 -9378 -1003 8548 9355 793 -8814 -9611 -714 8328 9471 787 -8604 -9644 -714 8509 8932
2617H932p999r324q31Q723R318N80q657r101p16Q355R615M95r130q710m80Q316
$$ 8932 933 -8391 -9222 -499 8819 9399 742 -8359 -9075 -720 8895 9390 260 -8450 -8930 -614
2633f14R119P17q775r303j45Q717Q683M93q397r506o9Q867Q757K18q622q677k92
$$ -614 8505 9222 447 -8856 -9001 -284 8399 8892 495 -9011 -9080 -213 8544 8762 140 -8537 -8829
2650h829Q771Q840L2q879q600N1Q527Q889O7q659q848n9Q715Q785j39q638q824
$$ -8829 -58 8782 8814 -65 -8665 -8614 -87 8802 8869 210 -8638 -8697 18 8803 8664 26 -8798
2667h798R1Q523Q943k87q597q666R5Q558Q608J7q546q810L53Q999Q158l5q798
$$ -8798 -8707 -184 8759 8472 -125 -8791 -8696 -138 8470 8487 -59 -8869 -8516 483 8641 8606 -192
2684a92q566L70Q749Q382k61q539q548J38Q940Q577q76q545q073L23Q359Q451
$$ -192 -8758 -8388 361 8743 8482 -57 -8605 -8467 473 9050 8174 -371 -8444 -8121 238 8689
2700H689m25q945q094O37Q539Q122l72q980q082R51Q541P999m23q896q075P15
$$ 8689 8264 -681 -8775 -8138 401 8523 8151 -829 -8911 -7960 581 8580 8157 -739 -8814 -8099
2716h099R119P844r43q414p961O70Q637P894q66q603p886P08Q792P793j096q494
$$ -8099 1020 8864 7921 -493 -8454 -7784 853 8747 7881 -722 -8608 -7900 892 8685 7589 -905
2732i05p782R57Q540P729q59q691p610Q53Q770P689j143q789p283J057Q402P748
$$ -905 -8687 -7730 810 8539 7680 -1011 -8621 -7768 1002 8691 7548 -1241 -8524 -7467 935 8683
2748H683r33q657p597J013Q814P446j214q515p483J195Q490P228j088q501p534
$$ 8683 7750 -907 -8504 -7491 1323 8769 7555 -960 -8443 -7248 1242 8470 7382 -1119 -8653
2763h653J288Q661P235j441q736o816J235Q204P362r28q870p295J636Q486P174
$$ -8653 -7365 1296 8531 7090 -1646 -8462 -7227 977 8339 7411 -1459 -8754 -7118 1368 8542
2778H542j488q432p116J485Q544P001j485q193p426J530Q734P088j867q528o728
$$ 8542 7054 -1378 -8494 -7009 1535 8536 7051 -1142 -8568 -7038 1696 8784 6917 -1611 -8339
2793h339J557Q280P122j561q712p054J581Q712P027j993q521o427J518Q229O862
$$ -8339 -6782 1498 8620 7059 -1653 -8707 -7126 1586 8613 6620 -1901 -8328 -6810 1419 8281
2808H281j490q412p106J953Q651O507j766q565o554K044Q375O469j772q281o965
$$ 8281 6791 -1621 -8727 -6774 1877 8384 6618 -1947 -8501 -6457 1918 8387 6615 -1666 -8631
2823h631J826R011O398k408q311o107J606Q247O770j817q941o172K287Q303O424
$$ -8631 -6805 2206 8604 6196 -2115 -8222 -6616 1631 8401 6584 -2357 -8529 -6242 2061 8485
2838H485k321q343o185K414P856O271j637q490o564K299R020N583k486p839n955
$$ 8485 6164 -2179 -8364 -5950 1906 8177 6540 -1950 -8514 -6215 2805 8388 5902 -1937 -7892
2853g892J875Q023O393k070q621o318K338Q748N992k866q233n368J966Q039O299
$$ -7892 -6017 2006 8399 6329 -2292 -8610 -6272 2476 8468 5602 -2631 -7999 -6033 2006 8305
2868H305k133q867n977K788Q529N485k347q132n756K460Q008N814k066q391o218
$$ 8305 6172 -2695 -8672 -5884 2645 8130 5783 -2349 -8105 -5645 2363 8177 6111 -2280 -8498
2883h498L077Q386N430l143p600n545J913Q353O101k846q437n459K750Q307N507
$$ -8498 -5421 2965 8395 5252 -2348 -7893 -5980 2373 8474 5628 -2809 -8268 -5518 2789 8296
2898H296l136p923n104K172P839N852k178q428o049L378Q380M773k754p576n446
$$ 8296 5160 -2763 -7867 -5695 2144 7996 5818 -2610 -8659 -5281 3099 7872 5118 -2458 -7904
2913g904K552P908N535k431q446n562K953Q660M800l419p460m667K029Q112N677
$$ -7904 -5352 2556 8091 5660 -2786 -8348 -5395 3265 8065 4646 -2814 -7481 -5452 2660 8337
2928H337k937q585n042L089Q189M901l211p958m602K881P456N332k221q450n761
$$ 8337 5400 -3185 -8227 -5138 3051 7952 4741 -3217 -7819 -4938 2518 7850 5629 -2821 -8582
2943h582L920Q289M296l109p508m772K318Q116N214l154q186m931L353Q383M403
$$ -8582 -4662 3627 7923 4814 -2694 -7466 -5148 2968 8182 5028 -3158 -8089 -4736 3647 8050
2958H050l741p566m044K576P507N282k915q607m928L793Q091M213l562p388m347
$$ 8050 4309 -3257 -7301 -4725 2782 8064 5149 -3458 -8386 -4593 3498 7711 4149 -3239 -7586
2973g586L018P473M918k794q253m992L751Q385L601l545p044m415K806P749M816
$$ -7586 -4568 2905 7823 5029 -3224 -8216 -4465 3920 7521 3976 -3068 -7483 -4677 3072 7888
2988G888l235p964m569L405Q055M026l579p522m040L151P285M771l232q002m536
$$ 7888 4653 -3311 -7880 -4475 3580 7606 4027 -3495 -7535 -4384 2901 7672 4440 -3562 -8098
3003h098M293P625L942l700p470m044L254P603M177l099q019m421L973Q060L550
$$ -8098 -3805 3820 7762 4062 -3408 -7452 -4198 3405 7582 4483 -3536 -7957 -3984 4076 7626
3018G626l829p119l896L248P383M013l474p865l735L615P603L776l793p588l230
$$ 7626 3797 -3322 -7218 -3970 3413 7426 3952 -3913 -7648 -4033 3570 7346 3553 -4035 -7265
3033g265L525P144M181l507p706l982M046P566L283l698p189l919L647P790L376
$$ -7265 -3740 3404 7585 4078 -3628 -7610 -3564 4002 7285 3587 -3602 -7521 -3874 3916 7292
3048G292l567p299l780L910P760L123m092p284l358L435P330L657l629p656l186
$$ 7292 3725 -3574 -7354 -3444 4316 7439 3347 -3937 -7295 -3860 3470 7127 3498 -4158 -7344
3063g344M050P064L738m015p271l459L895P124L342l778p494l568M379P413L040
$$ -7344 -3294 3770 7508 3493 -3778 -7237 -3342 3782 7124 3346 -4148 -7716 -3337 4076 7116
3078G116l640p150l286L710P412L178m234p095l192L768P323L102m181p099k851
$$ 7116 3476 -3674 -6960 -3250 4162 7340 3106 -3989 -7181 -3413 3910 7012 2831 -4268 -7119
3093g119L947O961L698m183p350k912M141O791K977l903p307k979M015P244K884
$$ -7119 -3172 3789 7487 3304 -4046 -6958 -2817 3974 6951 3048 -4259 -7238 -3223 4021 6905
3108F905l673p157k909M284O939K715m029o936l158L905P168K612m037o750k943
$$ 6905 3232 -3925 -6834 -2550 4389 7104 3075 -3861 -7019 -3114 4054 6666 2629 -4121 -7064
3123g064M091P061K918m018p089k666M024O801K777m281o931k623M301O513K909
$$ -7064 -2973 4088 7006 2988 -4101 -6767 -2743 4058 6835 2554 -4377 -7000 -2699 3814 6723
3138F723l729p168k676M630O630K578m006o936k978M450O517K498m163o676k701
$$ 6723 2994 -4174 -6850 -2220 4410 6988 2982 -3954 -6932 -2482 4035 6533 2370 -4306 -7007
3153g007M323P058K462m359o348k349L589O691K811m565o740k623M195O873K605
$$ -7007 -2684 4374 6836 2477 -3871 -6220 -2631 4060 6871 2306 -4434 -7057 -2862 4011 6616
3168F616m321o569j982M077O498K731m174p044k491M471O549J961m456o301k291
$$ 6616 2295 -4274 -6256 -2179 4319 7050 2876 -4168 -6659 -2188 4361 6322 1866 -4435 -6726
3183f726M228O535K534l933o659k606M568O928J563m592o128k319L868O570K390
$$ -6726 -2498 4037 6571 2638 -4021 -6627 -2059 4869 6432 1840 -4288 -6607 -2739 3831 6221
3198F221l996o588k206M691O661J934m533o154j907L873O094K389m316o891k315
$$ 6221 2225 -4363 -6569 -1878 4783 6717 2184 -3970 -5877 -2004 4090 6479 2163 -4728 -7043
3213g043M876O748J681m350n834j931M070O172K008m153o736k617M746O774J509
$$ -7043 -2167 4581 6262 1912 -3922 -5853 -1783 4389 6397 2244 -4492 -7109 -2363 4411 5920
3228E920m562n739j594M112O118K504m432o483k073M641O314J304m739o041j274
$$ 5920 1358 -4381 -5975 -1863 4255 6759 2327 -4156 -6229 -1588 4726 6030 1291 -4750 -6024
3243f024L960N989K323m148o363j953N071O156J064m455o110j653M113N912J667
$$ -6024 -2064 3925 6248 2100 -4263 -6216 -1145 5011 6075 1620 -4490 -6143 -2030 3882 5549
3258E549l910o294j803N092O254J369m589n688j300L905N662J758m592o278j429
$$ 5549 1639 -4655 -6458 -1366 4888 6257 1668 -4020 -5320 -1415 4247 6005 1413 -4865 -6294
3273f294M618O100J434m582n526j120M171N826J574m451o361j594M516O033J079
$$ -6294 -1676 4424 5858 1276 -4250 -5370 -1199 4627 6201 1750 -4611 -6205 -1689 4344 5423
3288E423m697n488j088M418N830J677m219o122j397M649N912R05n092n304j095
$$ 5423 726 -4762 -5850 -1432 4398 6075 1856 -4266 -5663 -1014 4898 5803 711 -4593 -5688
3303e688M065N975J348m300n885j168M747N917R78m901n500j131M107N411J439
$$ -5688 -1623 4352 5700 1400 -4485 -5653 -906 5011 5989 1088 -4412 -5543 -1436 3975 5414
3318E414m526n837r44M814N635R98m187n480j105M337N372J197m617n682j377
$$ 5414 888 -4949 -5893 -1079 4556 5554 1367 -4113 -5218 -881 4491 5688 1071 -4611 -5988
3333e988M724N716O33m287n139q55M529N367R92m413n681r51M551N156P01m637
$$ -5988 -1264 4452 5085 798 -4341 -5196 -667 4700 5692 1279 -4402 -5353 -802 4354 5055 418
3349D18n214o53M465N120J255m325n390r35M682N366P34m726n303p47M230N349
$$ 418 -4796 -5449 -984 4136 5391 1066 -4324 -5259 -577 4789 5523 797 -4506 -5253 -1023 4326
3365D326Q70m440n200q63M723N573N26m789n145o04M503M979O10m604n368p54
$$ 4326 5196 756 -4444 -5307 -584 4989 5515 726 -4419 -5023 -520 4459 5069 465 -4903 -5657
3381e657M861N309O48m594n210m6M413M922N23m458n284q79M779N053N98m491
$$ -5657 -796 4513 5161 567 -4643 -4689 -276 4646 5169 711 -4573 -5452 -673 4380 4978 487
3397D87n154k43M857M722N27m355n224o14M620N074K87m850m930j27M277N076
$$ 487 -4667 -4910 -53 4669 5196 841 -4383 -4997 -377 4697 4984 134 -4796 -4923 -646 4430
3413D430N23m477m968m08M656N014M83m807n336NM551M737N2l968n046l59M640
$$ 4430 4953 476 -4492 -4900 -244 4770 5253 446 -4890 -4885 -334 4403 4455 487 -4559 -4918 -278
3430b78N089L47m835m778k77M956M486q7m336m986k32M617M735K94m684m706k8
$$ -278 4811 5158 323 -4455 -4732 224 4710 4623 287 -4699 -4931 -314 4421 4715 31 -4675 -4703
3447d703M765M595j2m417m750j44M340M837J22m837m636L4N061M508j91m329m461
$$ -4703 62 4657 4645 228 -4522 -4666 -326 4511 4633 -204 -4840 -4806 255 4763 4572 243 -4218
3464d218k44M392M810L6m824m953L82M817M284j40m426m194j44M363M775k3m917
$$ -4218 -4462 -70 4740 4776 -48 -5001 -4619 198 4482 4342 -84 -4278 -4422 -59 4716 4693 -224
3481b24m669L62M642M638n93m588m117j1M487M509J48m555m839M16M964M198n50
$$ -224 -4893 -4531 111 4749 4156 -432 -4549 -4560 -73 4436 4584 29 -4810 -4394 570 4768 4218
3498D218m333m352M8M514M545j91m832m314K33M882M178n86m360l982K94M110
$$ 4218 -115 -4467 -4419 95 4640 4449 -383 -4697 -4464 418 4596 4010 -350 -4332 -4038 72
3514G2M577j35n172m377Q63M793L957p12m155m062M26M338M100M0m768m472M20
$$ 72 4649 4514 -658 -5035 -4172 621 4578 3866 -289 -4351 -3925 413 4513 4553 -215 -4687 -4267
3531d267N044L919q21m349m001L24M360M379m73m700m151P11M874L874j007m277
$$ -4267 777 4696 3875 -474 -4475 -4151 209 4588 4115 -585 -4736 -4025 849 4723 3716 -561
3547e61l880L84M330M259l67m853m155J028M592L821n82m534l734N08M390L870
$$ -561 -4441 -4057 273 4532 4165 -688 -4843 -3815 777 4598 4016 -518 -4252 -3744 646 4516
3563D516l67m756m346R68M847L505r50m158l647M68M581L970p99m364m101P65
$$ 4516 4149 -607 -4953 -3985 862 4367 3417 -741 -4388 -3920 661 4631 3832 -532 -4633 -3868
3579c868M570L827j073m464l424N18M286M261n61m884l755J123M479L461q22m401
$$ -3868 702 4529 3456 -1008 -4432 -3914 372 4633 4072 -812 -4567 -3444 1035 4496 3674 -727
3595g27l609N66M390L783p03m700l886J273M777L390j340l945l526O27M578L672
$$ -727 -4336 -3770 620 4403 3700 -1000 -4886 -3613 1164 4554 3214 -731 -4257 -3630 948 4620
3611D620j025m784l621J120M848L140j012m260l264R91M075L911q77n008l543
$$ 4620 3595 -1189 -4810 -3690 1158 4298 3286 -974 -4238 -3247 828 4739 3862 -1146 -4689
3626d689J235M604L197j087m433l321R21M593L503r50m654l491J412M573K887
$$ -4689 -3454 1150 4347 3260 -1173 -4494 -3573 1020 4523 3573 -1081 -4572 -3160 1413 4300
3641D300j438l996l161N95M688L577j282m551l118J213M414L422j446m216l227
$$ 4300 2862 -1134 -4295 -3700 988 4565 3283 -1268 -4386 -3173 1241 4663 3217 -999 -4226
3656d226J061M274L315j042m797l310J530M605K867j172m278l260J241M372L139
$$ -4226 -3165 1109 4424 3382 -1415 -4725 -3195 1410 4277 3105 -1173 -4433 -3192 1180 4319
3671D319j280m438l273J421M540L007j319m129l163J184M466L268j355m743k827
$$ 4319 3039 -1399 -4672 -3251 1289 4296 2977 -1152 -4315 -3131 1335 4603 3248 -1495 -4322
3686d322J312M505K944j553m223k882J201M120L288j187m785k689J542M310K593
$$ -4322 -3010 1495 4439 2886 -1337 -4219 -3018 1102 4390 3203 -1582 -4271 -2729 1581 4174
3701D174j222m301l111J421M316K791j054m457l002J530M689K567j708m033k603
$$ 4174 2952 -1349 -4460 -3039 1277 4068 3014 -1443 -4445 -2915 1774 4341 2633 -1400 -4003
3716d003J072M068L315j562m549k526J346M303K810j296m387k553J316M116K751
$$ -4003 -2931 1137 4452 2890 -1659 -4185 -2839 1464 4274 2978 -1409 -3962 -2646 1470 4221
3731D221j351m495k988J910M308K418j489m082k772J636M369K556j587m214k698
$$ 4221 2870 -1625 -4613 -2703 1605 4023 2534 -1548 -4320 -2684 1685 4241 2654 -1560 -4258
3746d258J662M399K267j490m315k577J684M205K754j449m644k392J936M053K347
$$ -4258 -2596 1803 4070 2580 -1735 -4312 -2628 1577 4331 2882 -1762 -4154 -2218 1835 4182
3761D182j536m325k645J809M198K357j761l998k369J643M281K401j715m282k372
$$ 4182 2646 -1679 -4324 -2515 1683 4040 2279 -1719 -4088 -2445 1836 4237 2522 -1760 -4132
3776d132J789M126K438j881m350k109J789M078K352k059l884j906J601L892K662
$$ -4132 -2343 1783 4221 2340 -2010 -4119 -2330 1748 4100 2041 -1843 -3749 -2148 1744 4406
3791D406j937m290k256J894L797K481j845m175k400J894M272K203j766m198k295
$$ 4406 2469 -1821 -4077 -2183 1614 4095 2250 -1925 -4325 -2431 1841 4044 2278 -1920 -4215
3806d215K216L879K189j789m097k339J829M109K355k131l969j913J891L781K291
$$ -4215 -1999 1880 4069 2280 -1817 -4156 -2327 1782 4137 2006 -1963 -3876 -1985 1796 4087
3821D087j755m190k107J921M114K010k021m011k034J941L956K026j968m016k014
$$ 4087 2332 -1858 -3965 -2044 2070 4080 2059 -1952 -3986 -2045 1911 3937 1969 -2047 -4061
3836d061K088M088J936k070l934j953J822M119J882j924m053j926K089M055J728
$$ -4061 -1973 2115 4051 1981 -1953 -3906 -2084 2035 3917 1993 -2060 -3986 -1897 2158 3886
3851C886j774m073j940K064L880J890j827m164j887K144L874J743j883l892k082
$$ 3886 2112 -1961 -3901 -1837 2043 3933 2106 -2058 -3945 -1801 2073 3816 1933 -1959 -4041
3866d041J994M023J779k018l931j655J952L934J998k235l751k100K186L816J959
$$ -4041 -2047 1976 3755 1737 -2194 -3849 -1897 2037 4035 1800 -1951 -4051 -1865 1951 3910
3881C910k331l777j595K079L943J681k139l824j479J877L764J752k108l946j675
$$ 3910 1579 -2198 -3793 -1714 2229 3910 1771 -2053 -3532 -1655 2109 3861 1753 -2193 -3868
3896c868K437L297J828k010l787j683K134L803J564j955l712j858K064L968J512
$$ -3868 -1431 1866 3694 1684 -2103 -3786 -1652 2151 3715 1760 -1952 -3810 -1746 2222 3734
3911C734k257l638j552J855L908J962k470l819j191K026L537J717k058l864j586
$$ 3734 1477 -2161 -3713 -1858 2050 4012 1542 -2277 -3468 -1442 2095 3812 1754 -2110 -3696
3926c696K218L563J602k163l739j643K185L913J206k019l476j585K275L532J512
$$ -3696 -1478 2085 3687 1524 -2215 -3858 -1673 2240 3446 1427 -2049 -3634 -1359 2173 3685
3941C685k368l410j524K193L669J392k223l517j384K132L504J628k336l625j346
$$ 3685 1317 -2093 -3617 -1424 2245 3637 1414 -2103 -3487 -1355 2149 3777 1441 -2184 -3530
3956c530K160L460J330j874l817j337K206L596J279k148l563j326K073L761J259
$$ -3530 -1370 2090 3420 1546 -2271 -3608 -1402 2194 3473 1325 -2238 -3564 -1491 2270 3529
3971C529k195l410j573K251L588J446k159l676j241K310L394J411k450l393j287
$$ 3529 1334 -2076 -3649 -1398 2190 3636 1477 -2199 -3440 -1130 2264 3675 1225 -2168 -3455
3986c455K146L516J313k237l662r75K270L369J124k163l508j231K390L390J095
$$ -3455 -1309 2207 3520 1283 -2379 -3354 -1084 2285 3409 1246 -2262 -3493 -1103 2287 3382
4001C382k343l342j175K208L706R83k350l245j171K210L610J139k687l152j009
$$ 3382 1039 -2303 -3478 -1270 2436 3419 1069 -2176 -3347 -1137 2473 3612 925 -2227 -3236
4016c236K141L403J013k287l255j091K307L197J097k299l473p68K395L049Q77
$$ -3236 -1095 2308 3321 1034 -2221 -3312 -1005 2192 3289 990 -2483 -3251 -856 2193 3070
4031C070k121l279j113K596L189Q41k136l354j089K499L605M82k427l203o13K107
$$ 3070 949 -2330 -3443 -847 2342 3183 1047 -2307 -3396 -897 2708 3190 763 -2440 -3053 -946
4047i46L292R57k502l401n71K326L097J078k526l201r06K537L212P12k308l095
$$ -946 2346 3303 801 -2600 -3171 -845 2252 3330 804 -2397 -3303 -766 2446 3158 850 -2245
4063b245j074K580L216N25k293k908j007K416L379O28k647k742r20K351L308O91
$$ -2245 -3319 -739 2477 3002 709 -2199 -3206 -790 2589 3217 570 -2172 -3092 -741 2567 3258
4079C258k533l062p00K449K827J012k479l265o15K282L181N96k269l078o93K345
$$ 3258 725 -2337 -3037 -588 2239 3251 772 -2493 -3108 -826 2355 2951 682 -2396 -3089 -744
4095g44L217O57k486k999p53K453L257M41k371l048p04K497L002N61k451k934
$$ -744 2473 3130 644 -2355 -3108 -655 2602 3043 672 -2376 -3080 -583 2419 2980 529 -2405
4111b405o24K310L136N80k555k952l75K239L103O00k615k934n30K416L004M96
$$ -2405 -3029 -719 2417 2997 442 -2510 -2885 -646 2457 3057 442 -2492 -3022 -606 2398 2894
4127B894k587k700n73K386K750O23k387k884m46K412L059J47k181k790o73K578
$$ 2894 307 -2393 -2966 -580 2170 2793 406 -2478 -2924 -512 2547 2694 513 -2277 -2950 -372
4143c72K879M45k630k775m18K445K953M60k665k874l14K521K683O16k576l038
$$ -372 2507 2952 322 -2453 -2871 -426 2527 2987 322 -2552 -2866 -345 2338 2954 378 -2660
4159b660j56K528K631M58k544k682l36K428K731K77k272k788m38K477K830K95
$$ -2660 -2816 -288 2343 2801 257 -2425 -2761 -333 2398 2675 403 -2385 -2823 -346 2484 2779
4175B779k577k652l18K365K793L62k501k712k43K433K995k5k492k686j66K403
$$ 2779 202 -2450 -2768 -403 2390 2752 251 -2461 -2704 -271 2724 2699 207 -2479 -2645 -242
4191b42K760K37k605k603k77K431K840J80k557k623k25K677K355L54k414k682
$$ -242 2518 2755 150 -2453 -2730 -299 2541 2721 164 -2459 -2684 -7 2348 2702 288 -2394
4207b394j87K381K763j3k415k529j84K498K723N1k575k564k09K465K509K65k637
$$ -2394 -2581 -200 2563 2550 135 -2394 -2578 -80 2643 2694 119 -2445 -2654 -189 2320 2585 -52
4224e2k567L42K218K493J63k507k545m7K513K582M0k515k684J57K580K432j31
$$ -52 -2619 -2277 -59 2434 2597 90 -2455 -2502 11 2593 2633 118 -2566 -2409 171 2603 2472
4241B472k563k480J20K457K533j70k397k477J30K242K608J6k649k467J38K475
$$ 2472 -91 -2571 -2451 6 2539 2369 -28 -2505 -2375 -133 2475 2491 -158 -2625 -2487 -12
4257a2K400J82k460k623k3K596K466j20k356k586J14K547K439j40k618k259J83
$$ -12 2388 2570 110 -2513 -2536 60 2526 2406 50 -2536 -2422 125 2564 2424 -194 -2453 -2270
4274b270K615K204j26k440k517K15K487K307j62k552k130j74K557K429k23k480
$$ -2270 345 2549 2423 -17 -2534 -2319 168 2475 2313 -239 -2369 -2543 14 2443 2220 -260
4290b60k369K63K535K418k95k749j924J60K505K106m0k480k392K08K620K230m19
$$ -260 -2629 -2366 169 2587 2292 -457 -2381 -2221 284 2390 2350 -130 -2522 -2314 306 2536 2117
4307B117k328k221K42K535K185m98k255k252Q5K750K287n33k556k142L75K370
$$ 2117 -211 -2432 -2190 345 2530 2032 -223 -2475 -2390 360 2647 2114 -442 -2584 -2209 161
4323A61K310k56k474k282M38K469J973k6k594k292M27K723J862o15k179k172L23
$$ 161 2471 2215 -259 -2541 -2103 366 2339 2313 -281 -2573 -2146 577 2439 1824 -355 -2527 -2204
4340b204K759J999n71k353k102M18K423K166m33k578k039L58K421K121l44k506
$$ -2204 555 2554 1983 -370 -2472 -2054 369 2535 2102 -476 -2515 -2157 264 2385 2041 -465
4356d65j997O32K313J974m58k338k230M68K563K146n57k532j961L74K615J991
$$ -465 -2462 -1830 483 2457 1999 -339 -2569 -2101 462 2608 2051 -481 -2442 -2068 547 2538
4372B538m87k562j710L78K341J882l60k538k014O30K430J911n60k444j757M40
$$ 2538 2051 -511 -2221 -1843 498 2380 2020 -518 -2532 -1902 528 2439 1879 -565 -2322 -1882
4388a882K362J835n08k493j651M75K342J939o16k208j994M92K462K059p02k569
$$ -1882 480 2315 1807 -686 -2337 -1862 480 2419 1803 -405 -2399 -1907 555 2614 1912 -657
4404f57k004P65K720J406l59k487j686N15K406J975p58k273k026P22K428J754
$$ -657 -2661 -1896 824 2230 1871 -616 -2302 -1787 619 2594 1836 -437 -2463 -1741 687 2441
4420B441o20k492j725N71K581J533n40k482j711Q17K489J509o60k440j772Q28
$$ 2441 1821 -671 -2396 -1825 756 2289 1749 -733 -2444 -1627 862 2371 1711 -729 -2501 -1673
4436a673K502J540p14k414j535N91K408J799r57k275j667O43K449J716p54k541
$$ -1673 829 2369 1655 -759 -2294 -1703 705 2504 1547 -728 -2395 -1752 697 2413 1659 -882
4452h82j648P95K497J689r09k655j511J034K477J386o14k395j715P97K641J283
$$ -882 -2530 -1735 762 2451 1542 -1113 -2624 -1590 887 2273 1659 -736 -2451 -1654 987 2270
4468B270q04k158j724R07K420J558r01k444j313N15K439J621p78k505j595R07
$$ 2270 1466 -692 -2416 -1509 911 2469 1568 -876 -2189 -1674 765 2386 1608 -897 -2492 -1585
4484a585K472J407r05k234j546Q76K498J369p75k514j282P84K224J657q81k576
$$ -1585 887 2294 1389 -845 -2391 -1515 983 2352 1577 -937 -2219 -1435 789 2446 1565 -1011
4500a011j337Q63K366J541j019k313j548J046K224J343p44k234j531R86K310J330
$$ -1011 -2348 -1485 881 2422 1403 -910 -2458 -1412 812 2155 1411 -823 -2354 -1368 942 2272
4516B272j075k092j514R76K267J608j199k292j228P17K571J380r46k441j329J157
$$ 2272 1197 -895 -2409 -1433 834 2442 1243 -1049 -2277 -1560 1011 2391 1445 -996 -2325 -1168
4532a168K116J266q08k363j372J058K212J311r19k231j249O72K424J351j185k151
$$ -1168 948 2214 1406 -957 -2329 -1271 941 2252 1333 -898 -2147 -1475 949 2300 1115 -1036
4548a036j247J116K115J198r90k231j126J167K088J156r14k379j179J024K252
$$ -1036 -2283 -1167 948 2146 1156 -1075 -2201 -1034 1054 2210 1296 -1083 -2262 -1238 1014
4563A014J431j090k252j276J011K413J034j165k165j173Q66K384J132j040k296
$$ 1014 2445 1355 -897 -2173 -1162 1251 2285 1120 -1045 -2218 -1352 1032 2164 1124 -1172
4578a172j071J109K136J250j125k230j058J088K148J144j213k111r41P85K291
$$ -1172 -2243 -1134 1002 2252 1127 -1103 -2161 -1073 1075 2219 1006 -1105 -2046 -1261 1030
4593A030J231j234k137j133J101K164J086r72k123j163J014K334R85j195k159
$$ 1030 2261 1027 -1110 -2243 -1142 1022 2108 1136 -987 -2150 -1136 1198 2183 988 -1171
4608a171q74J118K152R45j241k053j125J145K146J131j282j948j149J323J901
$$ -1171 -2045 -927 1225 2170 929 -1124 -2249 -1104 1042 2173 891 -1057 -2206 -883 1018
4623A018J121j008k346r24J219K230R58j158k296r64J317K010Q14j100k001j060
$$ 1018 2139 1131 -1215 -2139 -920 1310 2268 1110 -1186 -2150 -833 1177 1991 891 -1110 -2170
4639b170J353K125Q15j333j892r48J013K403P44j331k111q45J196K079J116j349
$$ -2170 -817 1308 2123 790 -1102 -2050 -1037 1366 2110 779 -1332 -2177 -981 1098 2214 865
4655H65k080p59J067K000R68j091k241q60J184K056J038j236k126r64J297K151
$$ 865 -1215 -1974 -907 1093 2061 970 -1271 -2131 -947 1109 2147 911 -1215 -2179 -882 1269
4671A269P53j309j942o55R98K063Q78j514j778r76J450K051O55j083k029q56J290
$$ 1269 2022 713 -1229 -1884 -886 1177 2055 541 -1237 -2213 -763 1288 1943 860 -1169 -2025 -735
4688g35K094O79j224k099p03J121K007Q32j227j941r15J439J810Q90j034k456
$$ -735 1359 2038 814 -1285 -1988 -867 1140 1972 745 -1196 -2111 -672 1138 2028 994 -1462
4704a462m84J304J905O68j258j764j245J540K068Q20j341k108o15J289J909P61
$$ -1462 -1946 -642 1263 1931 673 -1091 -2336 -796 1272 2092 751 -1357 -1972 -683 1226 1987
4720A987j230k047o59J313J908P07j162j901p06J150K126L97j236j937n49J446
$$ 1987 757 -1290 -1949 -636 1272 1979 817 -1084 -1790 -640 1486 1883 647 -1290 -1839 -393
4736c93J709N45j108j904j011J588J975M70j230j972o39J198K074O86j355j949
$$ -393 1316 1861 753 -1151 -2162 -574 1401 1871 641 -1331 -1970 -772 1302 1988 633 -1316
4752a316n17J372J914N13j362j887n61J384J800M73j172j901o95J500J811N96
$$ -1316 -1833 -461 1453 1966 604 -1283 -1844 -460 1340 1813 641 -1260 -1955 -455 1356 1952
4768A952j540j795m68J249J926N81j474j952m31J323J875N35j239j872n59J315
$$ 1952 412 -1383 -1851 -602 1324 1905 431 -1521 -1952 -629 1246 1781 542 -1330 -1889 -574
4784e74J856M35j285j812n10J526J768L70j313j809l64J229J847L63j245j986
$$ -574 1282 1717 432 -1380 -1890 -364 1404 1774 461 -1348 -1712 -483 1364 1727 482 -1504
4800a504l48J526J796K92j391j917l20J371J666O15j319j698o51J503J924J07
$$ -1504 -1852 -326 1470 1762 371 -1546 -1866 -495 1171 1786 467 -1231 -1882 -379 1545 1652
4816A652j230j743n28J449J828L65j392j947lJ281J795J26j267j788k58J482J501
$$ 1652 422 -1321 -1849 -400 1428 1793 401 -1546 -1549 -268 1527 1653 386 -1402 -1660 -178 1323
4833A323M13j347j808l72J485J883Q1j344j724k58J402J780L85j547j803k06J312
$$ 1323 1736 389 -1419 -1791 -306 1577 1658 314 -1410 -1668 -266 1514 1899 352 -1451 -1657 -345
4850c45J680L28j418j722k78J475J775J77j397j559l88J477J662J83j373j793
$$ -345 1335 1663 245 -1477 -1755 -280 1495 1672 275 -1284 -1672 -195 1467 1650 277 -1516
4866a516j61J378J571K56j476j489k88J579J702nj443j596L2J333J596K72j550
$$ -1516 -1677 -299 1272 1528 52 -1437 -1725 -146 1556 1551 108 -1488 -1456 -123 1473 1745 195
4883A95j632k14J530J621J15j420j498j79J266J661J16j449j601j20J578J486
$$ 195 -1437 -1651 -121 1500 1615 195 -1303 -1482 -216 1445 1561 112 -1489 -1609 -31 1455
4899A455q6j130j706j91J499J518K49j354j658r3J372J550m0j407j345k81J517
$$ 1455 1369 239 -1467 -1658 -159 1359 1608 254 -1404 -1497 -125 1425 1385 -22 -1367 -1648 -131
4916a31J586J08j409j505p2J359J630R9j511j556M7J267J454J49j399j662j06
$$ -131 1455 1563 154 -1351 -1423 -64 1566 1665 154 -1402 -1355 -88 1366 1515 116 -1546 -1652
4933a652J671J505j6j371j509k23J658J341L4j572j520J82J465J613k15j320j557
$$ -1652 19 1524 1508 137 -1372 -1595 63 1404 1438 -134 -1654 -1472 -7 1606 1391 71 -1486
4950a486J21J400J496N4j580j359j03J504J339n7j325j520P3J410J490j4j555
$$ -1486 -1365 35 1531 1585 5 -1354 -1457 47 1386 1329 4 -1516 -1443 -33 1457 1443 -112
4967a12j309j80J659J485j63j530j377J37J217J658j63j428j291Q9J537J411n9
$$ -112 -1421 -1601 58 1543 1380 -150 -1527 -1390 -173 1485 1322 -106 -1397 -1308 229 1640 1581
4984A581j553j534J24J487J427j1j903j194J66J502J303L1j399j507K49J407J337
$$ 1581 28 -1506 -1382 105 1532 1521 -382 -1576 -1410 92 1395 1426 27 -1480 -1231 176 1513
5001A513r0j407j600J26J615J307l18j282j348J16J471J472r2j422j532J70J455
$$ 1513 1423 16 -1584 -1458 157 1464 1146 -136 -1484 -1368 103 1575 1483 61 -1471 -1301 154
5018A54J209kj655j228J78J442J341k2j452j442J84J569J331k16j660j332L39
$$ 154 1363 1361 -294 -1522 -1344 98 1439 1417 -35 -1477 -1293 276 1607 1391 -269 -1601 -1262
5035a262J390J250j62j337j456J79J657J246j33j439j256O2J577J292l92j467
$$ -1262 128 1378 1216 -121 -1577 -1398 259 1505 1372 -67 -1323 -1261 316 1608 1216 -251
5051b51j247J53J598J192j05j442j304K54J424J116j07j336j504K85J548J119
$$ -251 -1498 -1345 253 1445 1340 -102 -1406 -1152 272 1388 1281 -55 -1559 -1274 274 1393
5067A393k05j561j207M85J256J224k72j268j415M84J381J211l49j510j158K63
$$ 1393 1188 -373 -1580 -1095 161 1385 1113 -155 -1570 -1086 295 1506 1157 -353 -1511 -1248
5083a248J603J301l85j519j275L66J540J190l31j634j167K87J580J262n40j299
$$ -1248 355 1656 1271 -248 -1523 -1157 383 1573 1242 -392 -1559 -1272 308 1570 1030 -269
5099b69j397M56J469J242m48j297j201L90J373J045l08j568r36K00J688J049l48
$$ -269 -1666 -1210 259 1501 1053 -244 -1445 -1055 318 1363 1055 -513 -1449 -1249 439 1488 1140
5116A140j493r83K36J525J052l98j347j161M70J178J200n20j394r04K28J561R84
$$ 1140 -353 -1336 -1100 425 1477 1079 -268 -1429 -959 219 1419 899 -495 -1399 -1171 390 1374
5133A374l34j484j020N24J482J020m58j485j076M14J407J045m53j379j043M76
$$ 1374 1040 -444 -1464 -940 542 1562 1104 -381 -1457 -1043 364 1409 956 -423 -1466 -990
5149i90J499J026m07j556r32M42J288R40o44j141j015M52J405J031l31j537r95
$$ -990 509 1535 1128 -428 -1360 -918 370 1310 666 -475 -1490 -1038 367 1398 1067 -470 -1465
5166a465L57J484J004l68j418r87M07J447R41o62j235r03M03J528Q96n01j377
$$ -1465 -1108 376 1380 1012 -406 -1393 -986 461 1402 740 -495 -1398 -995 533 1429 928 -449
5183d49j000M35J547R51m88j566q19N39J332J013o31j371r19N17J389Q72n38j450
$$ -449 -1449 -1014 533 1484 996 -570 -1389 -850 482 1495 864 -507 -1426 -909 480 1352 814 -636
5201f36p95N87J437O59l23j598o68N73J234Q85o00j271q36N41J296R11n78j392
$$ -636 -1431 -844 593 1252 929 -669 -1337 -764 470 1355 755 -516 -1352 -811 485 1396 818 -574
5219e74q25N93J364Q07m66j514p80L72J509R35o81j352r84P89J446P81n91j377
$$ -574 -1399 -806 558 1365 899 -615 -1395 -1023 486 1421 740 -612 -1596 -807 639 1420 829 -548
5237e48q94O88J474P25n88j428q09P61J190Q48n84j357r37O59J440Q21p20j473
$$ -548 -1442 -754 720 1445 857 -571 -1380 -619 571 1419 835 -522 -1459 -800 640 1461 741 -732
5255g32o15M66J323P55l53j597m09L43J430R11p69j252q86O48J332Q38p31j363
$$ -732 -1347 -881 442 1197 844 -753 -1162 -819 611 1522 753 -499 -1385 -737 595 1433 702 -661
5273f61n63N18J500N03n90j435p57Q30J376O59o70j412p04O91J284O99m79j554
$$ -661 -1224 -706 794 1297 707 -728 -1485 -655 721 1380 710 -702 -1406 -715 569 1268 789 -765
5291g65p93Q96J300P20o14j542o34P58J513M51n02j510n86O14J310P76o13j510
$$ -765 -1558 -662 638 1358 744 -798 -1432 -674 839 1290 788 -722 -1308 -694 616 1392 779 -731
5309g31p12P45J455P45p48j446o45P10J201Q98p36j562m39O62J229P09p99j363
$$ -731 -1443 -698 757 1502 754 -692 -1337 -627 574 1472 736 -826 -1265 -603 626 1335 536 -827
5327h27n57Q16J273O15p10j317m02N34J422N56q01j354m55O82J301N91q46j282
$$ -827 -1384 -568 705 1320 610 -707 -1109 -575 847 1403 602 -752 -1207 -525 776 1367 521 -761
5345g61n54R57J182N85r25j404m97Q44J374N94o96j366p21Q21J221O84q08j202
$$ -761 -1315 -358 824 1409 484 -920 -1417 -573 801 1395 699 -667 -1388 -567 654 1338 530 -672
5363f72m89M94J418M70p74j314m09N86J593M29p51j262n64P72J414K87p52j238
$$ -672 -1161 -667 751 1221 447 -867 -1276 -690 903 1332 581 -681 -1245 -473 941 1228 476 -762
5381g62m16P81J233M78p28j490l33P38J205N83o33j540l69P70J256O81r90j266
$$ -762 -1178 -397 836 1314 586 -904 -1237 -499 706 1289 656 -884 -1253 -483 773 1454 464 -802
5399h02k83O22J254N12q50j314l63O56J388M25q26j105n55P01J321O95j101j282
$$ -802 -1085 -463 791 1303 453 -861 -1224 -568 820 1245 419 -686 -1241 -540 781 1476 375 -907
5417i07m95R40J235L47p72j163n75Q99J255L16o60j182n54R73J099M49p30j255
$$ -907 -1402 -462 773 1120 348 -815 -1390 -491 764 1080 420 -762 -1316 -343 756 1205 475 -780
5435g80m49R74J063M96r65j107m72R72J253K75j005j130k90Q20J188L69r15j206
$$ -780 -1229 -255 808 1304 339 -768 -1240 -268 985 1260 255 -875 -1165 -345 843 1212 297 -909
5453i09k50P79J168N73r91j284l98J053J144L66q76j411q3J036J115L00j166j044
$$ -909 -1159 -380 788 1361 370 -914 -1312 -259 885 1251 375 -1036 -1119 -83 1032 1332 166 -878
5471h78l78J038J229J89q61j227k84J000J030L26r77j174l54J102J076L14r24
$$ -878 -1256 -218 1011 1200 339 -888 -1172 -172 858 1184 207 -967 -1321 -219 857 1171 247
5488B47j192k46R19J271J25q70j087l18P94J297K49r89j115j34P96J101L77r94
$$ 247 -945 -1191 -272 999 1124 254 -833 -1151 -357 940 1189 200 -915 -1049 -253 848 1225 231
5506B31j041k41Q62R69L86q31j275k28R75J092K29p90j101m20J058J133J01q44
$$ 231 -810 -1051 -189 780 1166 335 -940 -1168 -193 899 1128 338 -763 -1183 -125 1008 1109 265
5524B65j166l44J032J105K27q16j101k94R62R40K82r69q27m31R74J067J66r26
$$ 265 -901 -1245 -213 892 1119 303 -798 -1092 -130 810 1092 123 -704 -1135 -161 906 1072 146
5542A46j179k1P91J265J90j068j076j94Q87J247J63r92j120j24Q50J275O8r40
$$ 146 -1033 -1054 -263 1002 1192 124 -952 -1146 -259 988 1151 159 -961 -1085 -235 1040 1108 168
5560A68j054p9Q44J169K0q58j251q7J186Q86J31r89r88k67J007J010K58j071q84
$$ 168 -886 -965 -121 1048 1068 210 -1041 -1128 58 944 1075 86 -902 -1169 -162 848 1106 35 -849
5579h49k09R03J036K04r02j250n1J148Q37J74r24j123K4Q25J250l4j022q92j74
$$ -849 -1058 -155 881 1085 183 -1067 -1118 30 867 1041 117 -1006 -982 -157 1093 1059 37 -855 -1029
5598a029J091R74m6r16r75j91J014J105Q8j168j023J01R74Q96J68j037j004M1
$$ -1029 62 1036 990 74 -901 -1092 -78 1027 1115 -53 -1076 -975 -1 895 1063 26 -978 -937
5616i37R53R77o8q74j054p1J005J117m6r88j032N7R88R62j60q38j090P2R62J056
$$ -937 16 993 925 51 -1003 -1074 -69 1048 1002 14 -1018 -961 27 989 829 -9 -1099 -1027 -65 991
5636I91j03q28r24j44J075R46M3j031j042m7R55J233l03r22q58J50P90J109p2
$$ 991 888 60 -864 -1008 67 1013 1056 25 -1017 -1064 -109 1124 821 -101 -959 -809 -19 1090 1018
5655A018j153r11J57R06J012J35j156r99j20J346P80j42r30r93J52J058Q54o3
$$ 1018 -135 -1046 -889 17 1029 1164 8 -991 -1111 235 1015 873 -57 -1050 -898 160 1014 951
5673I51j125r54J60R56J054l24q68r63K20J045O81Q0r50q32j31J142Q98k02r65
$$ 951 -174 -1128 -968 -12 1042 718 -150 -1113 -893 152 833 913 -37 -869 -1000 142 1040 838 -127
5692a27q09J33R87Q44k6r93j087K41R59R15j71r61r90K73J112P40j45j255o59
$$ -127 -936 -803 184 1028 1002 9 -1078 -837 122 1037 866 -95 -1085 -812 300 1040 895 -360 -1019
5711a019J33J050P92l1j179p93Q1J065R57k88r68p22J31Q67R54l07q83r48L22
$$ -1019 -886 164 956 925 -254 -1047 -966 99 1056 768 -200 -922 -791 76 1030 723 -160 -1108 -786
5730g86J004Q47j32j087q42J01J199P61j18j102r76M04Q87P19j5r99p43M4J077
$$ -786 218 1065 933 -154 -996 -895 304 1065 947 -155 -1131 -727 160 879 864 -135 -878 -834 243
5749B43P01q7j020r37L53Q20J063l64r03r66L18J041P12j06r79r62L25J023P85
$$ 243 944 857 -163 -1100 -747 73 1136 772 -131 -1097 -779 262 974 868 -111 -1073 -748 275 1060
5768A060j87j158o47J7J201Q98m43j021q88N08R92O35j91j213n67L06R75Q62k58
$$ 1060 873 -285 -932 -915 286 1184 741 -280 -1168 -660 332 967 776 -437 -1004 -698 277 1139 881
5787H81j210o08J14J236O61m27p98q08K39R58Q98m45j089p25M01J078O14j09j137
$$ 881 -329 -937 -823 413 1074 647 -151 -959 -720 238 1136 691 -398 -1123 -722 356 970 861 -276
5806b76p78K96J004O08j06j041r48N16R17Q35l00j072p34L38J057O79j99r77p61
$$ -276 -1054 -758 246 854 748 -293 -1241 -725 192 1027 727 -345 -1079 -741 316 995 796 -181 -942
5825i42L52R57N48l45o98q33K49R21Q02j59j280m43Q3J023P15k34j132n35L47
$$ -942 -590 367 915 570 -128 -961 -712 209 1011 852 -428 -871 -788 235 950 716 -416 -951 -604
5844f04R15Q42m25j117n32K09J133O49m20j051n83L30J057O85l94j182l85K01
$$ -604 311 1153 728 -389 -921 -712 421 1070 650 -401 -984 -654 403 1088 694 -488 -873 -672
5862f72R96P64m03j113n56L82Q77Q52m94j095o16M51J128M29l46r72p17M85R07
$$ -672 324 1088 685 -428 -984 -602 275 1127 633 -462 -1078 -627 501 930 584 -388 -1105 -620 287
5881B87O41l61j063m97M01R86P34m45j219n97N80J017P56n74j067n13J52J366
$$ 287 928 567 -496 -993 -592 394 1128 683 -536 -1133 -553 464 1220 646 -421 -934 -782 584
5899E84M69n03q30r15O45R93M43l34j029m88K74J078M41l29r70m40L70J107N23
$$ 584 1053 550 -280 -1195 -550 443 886 552 -477 -965 -691 387 828 499 -471 -911 -541 566 1089
5918A089m13j059p20M44J167L53m31p55o02L81J044M86m81q71n54K69J113M60
$$ 1089 676 -383 -1103 -659 508 861 430 -325 -927 -546 498 984 503 -368 -922 -653 460 920
5936I20l89j080m47N77R21O85o18j015o01O75Q24N05l64j001n85N53R94N29n61
$$ 920 531 -549 -996 -419 502 1187 569 -446 -1047 -372 452 957 593 -408 -993 -440 554 1083 522
5955E22r81n69N47J046M91n27r19o14L10J082N86k66j268m18L26J396L93o62j061
$$ 522 -459 -1028 -481 565 1056 529 -390 -1004 -694 388 974 708 -560 -978 -652 744 1137 475 -586
5974e86l60L28J073N02l93j081n19N66J152L68o07q34n57N66R73L40m98q21o07
$$ -586 -946 -618 455 957 564 -517 -1036 -470 682 1050 443 -391 -948 -382 591 931 433 -388 -995
5993i95O15J027L47n92r24m61L96J098N25n54j091m81P23Q62M81n35r84m79N46
$$ -995 -380 647 994 402 -522 -983 -587 511 1036 482 -609 -1090 -367 495 976 441 -543 -1022 -476
6012d76R17M27m19j056l65N37J157K13m69j034m11O30P48N45m80j119l43O66Q73
$$ -476 441 868 449 -607 -972 -435 722 935 466 -568 -979 -349 399 944 464 -655 -998 -332 541
6031E41N70q28r16l68O97R55L35p35q29l35M95J002L50n31j094l11P63P85M34
$$ 541 1111 283 -633 -1001 -304 651 986 251 -578 -913 -418 584 934 403 -691 -1002 -239 546 980
6050I80n47j162j90N22J029K75o53p84k40M56Q61M19m99j040m79P96J122O4o11
$$ 980 433 -729 -919 -397 632 907 254 -530 -770 -314 547 966 467 -573 -1052 -256 866 930 319
6069C19r17l23N09J133K58o30q85m31O84R23M29p55j121j10O87P99M93p40j063
$$ 319 -598 -921 -412 721 979 349 -536 -967 -283 640 1069 314 -807 -917 -230 569 1062 322 -741
6088g41l4N69O87M72m60j122k93N65R41J80o11q66k63N07J053M01q08q25k70N15
$$ -741 -775 -206 481 953 493 -629 -922 -357 584 764 153 -713 -976 -469 584 985 177 -648 -918 -403
6108d03J090K60o82j038r4P25Q71J28n70q35m55O87J002L99p46j134p4P91R16
$$ -403 687 947 265 -773 -867 -142 729 857 287 -548 -1003 -316 686 1085 339 -795 -869 -78 838
6127H38J98p86j061k27Q29R79J72p23r23k62P17J043J78p52j050j61P99R01R2
$$ 838 1036 250 -811 -1038 -209 770 942 219 -704 -966 -249 794 972 220 -830 -991 -192 709 801
6146H01m94j025j85P55Q26K81p97p45k26O81P87K09n61r98k18P66Q95L12r57p49
$$ 801 307 -718 -903 -148 678 959 162 -583 -809 -128 659 868 307 -691 -909 -143 752 1064 107 -642
6166f42k28O84Q67J67o49r52j99O87R22J99q36o81n5M26J030J54p13p96k54P59
$$ -642 -870 -186 681 848 199 -753 -952 -265 657 856 20 -661 -716 -290 740 894 181 -615 -869 -110
6186a10R04J02p90p61k20O82R97J1o74q99j54Q09Q97J9n81q04l70P09J096J69
$$ -110 794 896 106 -655 -875 -193 804 815 141 -758 -912 -103 794 813 232 -572 -942 -233 863 1032
6206A032q26r13j85Q56O98K14p16q01j56N61R86R9o88r57k83R31R80l3o98r28
$$ 1032 206 -707 -892 -36 662 876 160 -641 -797 -236 750 849 161 -796 -1079 -148 832 799 101 -827
6226h27J46P07O27L99j094q35j00J040P27J18r09p32j59Q60Q01J34q53r31N9P62
$$ -827 -681 26 653 1052 -42 -877 -977 63 790 908 -1 -733 -892 -32 769 903 50 -881 -822 -60
6246f0Q24P8p13q29o9N18R34P6o94q24m9O93Q91Q4p29q28j59O94J000m8p25q73
$$ -60 764 842 129 -700 -769 -251 683 759 65 -759 -808 -115 776 860 131 -697 -856 -162 838 790 65 -808
6268h08j16P26Q51J15q64p98J5Q57Q41N2q67p50rO95P98k7n86r63n9Q43P78N9
$$ -808 -924 -198 653 768 -96 -894 -879 -22 819 871 4 -746 -755 -60 738 711 125 -838 -897 -54 724 783
6290G83o71q14j13Q39Q32Q2r56q16J71O23Q95l6q81p79K3P23R25J2o86r78jN95
$$ 783 112 -702 -815 24 856 938 -18 -834 -663 -40 855 819 -62 -841 -818 -95 830 842 156 -822 -823 -228
6312b28J065K7r38q11j1R53O59j07n96q83P4O20J034j36q33o10j19Q40Q32Mq13
$$ -228 837 864 -74 -885 -896 57 716 609 13 -870 -796 -176 858 722 -111 -721 -840 0 832 836 23
6333B3q95R8O98J048j0j072p07L9P43R12l07p74m85q1R55O67r1o99p86MO68R83
$$ 23 -872 -774 -76 972 962 -110 -817 -778 -35 877 570 -204 -689 -770 185 852 761 62 -724 -720 -52 931
6355I31k71o91q32K6R40O36Mr04o68qR06O94l0p46q11J65Q80M52J13p81p69R6
$$ 931 660 -31 -863 -837 103 739 743 -161 -829 -837 69 763 733 -13 -824 -659 221 673 786 5 -764 -668
6377f68O59P85J59j105o25J49N54R95lr78o53J43M79J095l3j067q28N8J037O57
$$ -668 -9 776 935 -170 -795 -646 -92 903 900 -78 -731 -588 -109 986 953 -114 -942 -884 153 810
6397H10l3q31o48QR51O47j26p79o64J8O86Q08r5q28p83J80P79O66p7p64p62J01
$$ 810 777 -54 -702 -694 257 904 778 -1 -665 -647 39 847 752 -76 -859 -679 100 766 689 -75 -837 -736
6419g36Q64O85j1r60o84P5Q32P52q4r56m53p4R40P17j76r74o13K21P52O25k01
$$ -736 128 813 802 -158 -842 -767 65 817 733 -223 -676 -750 190 907 731 -243 -856 -635 117 742 541
6440E41p47o85J94R23O74k78p31n33J54N64Q07k10q96o16P8J002O72l22p77p16
$$ 541 -206 -891 -697 226 900 622 -109 -642 -488 76 883 673 -223 -839 -761 241 913 591 -186 -902
6460i02K17Q78N37j08o88p52J55R52O09k21q22o71J36R33O24n3j071n32J39P50
$$ -902 -685 193 730 622 -66 -818 -663 289 898 677 -145 -816 -680 253 877 824 -247 -779 -640 110
6480A10Q38l36p53p28K23Q64O83k11q56q01L06Q30O83k79q36o86L55Q04P35l36
$$ 110 948 612 -141 -869 -646 218 901 690 -166 -967 -661 169 852 573 -263 -949 -594 210 945 609
6500F09q80o25L34Q50N66j63r31o99K96R01M95o6r15o22K36Q89M63n3j042m87
$$ 609 -271 -896 -562 288 854 691 -240 -939 -643 258 753 687 -228 -850 -614 275 738 685 -357 -844
6520h44K22Q13O11k95q07o47L86P99Q15n97q34n41K99R36M98k73r98m32K72J017
$$ -844 -622 191 802 507 -300 -947 -561 238 1053 456 -378 -919 -620 316 814 541 -457 -889 -617 400
6540D00N49k43j127m11L50Q09M51k53q25m73J94R55L54j58p86p02K97Q71P67l22
$$ 400 949 706 -421 -832 -482 327 778 525 -300 -773 -579 376 730 572 -214 -916 -619 252 1019 697
6560F97j063m16J37Q76P18k98r43o13L02J023O65m08j051m22K37Q60N18j98q06
$$ 697 -366 -782 -645 231 949 651 -292 -905 -603 420 1085 677 -374 -796 -559 301 819 621 -185
6579a85p01L59Q98M85m36p97n52M23O57Q32m39r80n29M18R67O06m82j116j89K66
$$ -185 -886 -527 371 856 420 -377 -929 -506 151 983 544 -436 -965 -547 420 1026 544 -572 -761 -495
6599d95Q28N38l38q80n96L56R52M40l25q37n47M20P22P20n60q39n40M50P94N94
$$ -495 333 871 533 -347 -943 -587 365 805 480 -357 -904 -484 238 958 398 -441 -981 -531 263 857
6619H57m09q05n42K80Q51O87m87q42m60M23Q87M47k55j108l88K26J065M33k63
$$ 857 448 -357 -899 -619 232 919 432 -410 -870 -447 440 887 632 -476 -864 -638 427 860 597
6638E97r33n24M22P94M86k70r62n18M47R08M77m15q47n28K27Q23P49m35q44m39
$$ 597 -336 -860 -438 356 842 572 -390 -908 -461 447 924 509 -338 -866 -639 184 933 498 -346 -785
6658g85K42J024N26o66p03m52K21R30N21l81r48l68L49Q62L79l88p81l99K91J086
$$ -785 -543 481 1007 341 -362 -814 -593 337 858 477 -471 -839 -490 372 751 363 -418 -817 -526 560
6678E60M27n56p27n06K59R51M93n28q67l88M68Q19L96l47q88o26N37Q87M46l46
$$ 560 987 431 -296 -802 -543 408 901 373 -494 -882 -414 405 801 454 -434 -1060 -523 364 810 464
6698D64r05m38L60Q93M86m74q04n24L72R55N41m92r24n76N06J031M91n06r66l75
$$ 464 -441 -879 -519 374 860 386 -418 -942 -570 385 926 434 -490 -1066 -560 471 962 456 -510 -885
6718h85N20Q31N27n78p80m17K39J097N35n81j085k06K16J119M12p48p21m80N27
$$ -885 -365 466 993 415 -365 -782 -543 554 1089 508 -577 -783 -567 552 964 216 -505 -985 -458
6737d58J039L35m25j027m14N38Q18M74m96r12l67N86N52O63n62r73j23M82Q30
$$ -458 581 916 491 -536 -950 -412 406 880 384 -528 -895 -309 243 906 344 -629 -752 -270 560
6756E60L19m89q87l72M55R14M91n82p01o86P68P62M64o38q68k94M54R34J14m53
$$ 560 879 390 -497 -869 -414 500 991 409 -292 -978 -210 552 1016 378 -490 -784 -330 604 718 265
6776B65q86k55M47R10L48n56p32m98O42P83L98n51q77k72N44P87L24n30q56m22
$$ 265 -621 -876 -429 481 829 273 -459 -957 -315 468 866 315 -562 -834 -290 497 821 291 -565 -987
6796i87P08P44L49l38j011m00O35P34O05n65j038k82P13P59K18n56q49l81O27
$$ -987 -279 465 814 476 -535 -935 -300 434 1039 474 -564 -846 -133 626 844 288 -561 -942 -315
6815c15R77J33m93j036n6M22R54K57l46j026l71P65O62J85n47o99m57P47P67N22
$$ -315 662 795 302 -734 -790 -368 586 843 497 -529 -900 -135 527 712 165 -534 -991 -244 523 1045
6835A045q37p45m12O07J054J22n06r11j37M53R53J07m12j085j86N77Q37L76p13
$$ 1045 208 -537 -949 -342 712 834 328 -583 -720 -267 686 793 381 -704 -890 -313 524 900 187
6854A87p02m03O79R05M37q35q11l61Q54O51K22n36r33j47N42P04K76n19p00k80
$$ 187 -515 -918 -239 666 1103 268 -543 -904 -50 601 823 287 -646 -793 -251 453 729 210 -490 -770
6874g70N18P83K97n59q90k28M82J000J47o00p70k59N93R30K05o18q20k42N75R12
$$ -770 -252 531 828 269 -621 -849 -367 633 780 180 -590 -849 -256 674 879 261 -559 -801 -226 686
6894F86J52n28j017J1M02Q83K74p14q68j32M56R87J64n81p23l23O70Q24L61q27
$$ 686 838 310 -707 -696 -294 589 863 149 -719 -851 -395 592 756 175 -548 -871 -201 623 984 157
6914A57p92j46O17O53L62n67r25k39P68P62K65p36q77p0P44Q04j79m38q21k28
$$ 157 -635 -781 -164 489 851 284 -641 -880 -112 650 915 179 -698 -768 -24 780 601 163 -658 -886
6934h86O95Q20J46n35r69j98P94Q74O3n66r10p8N35Q87J08n94p83l40P30P28L93
$$ -886 -191 629 775 240 -729 -927 -133 741 804 238 -672 -750 -215 672 780 186 -597 -937 -207 521 914
6955I14p58r50PO82P82N0n82p15k93Q23O67K95p79q32r2N44Q94L20q96p92j88
$$ 914 156 -794 -787 -105 677 727 145 -570 -863 -40 627 922 143 -689 -781 -237 657 977 81 -711 -899
6976h99P66P42K19o97q21j78O60Q60J16n25r77KO74N93J38n83o35k23O40Q33R8
$$ -899 -133 609 828 131 -690 -868 -208 652 768 243 -734 -732 -58 535 673 90 -545 -768 -128 705 803
6997H03o58r06j06Q01Q46p0o75o57j21P27Q07j17n77q40p0P47Q69m2o32p56j14
$$ 803 145 -761 -867 -66 780 710 35 -622 -743 -16 791 674 97 -743 -813 -66 803 761 129 -627 -741
7018g41O04R38k0n95q94j0P11P94Nn57r02j23O29Q35J77p99r15J59N61P93K08
$$ -741 -137 801 781 186 -708 -718 -7 787 792 235 -667 -790 -161 674 851 52 -863 -704 -143 650 858
7039H58r63o14j08P83Q17J12p88p10j67P18Q36m7n71r52l5Q15P21L3o94q02J20
$$ 858 -105 -719 -827 -44 773 885 97 -613 -780 -62 774 727 156 -796 -831 -16 705 738 44 -758 -638
7060f38L56J024k4p33p70q2O45Q33N4p82n68j66P53P65R9p38r68J85O52Q73p9
$$ -638 -282 742 718 -15 -785 -867 -222 611 665 -117 -685 -851 -98 667 766 28 -940 -755 -103 770 691
7081F91p12p63o9R85O25K7p45p07j57O90Q74L7q42p66l2R68Q08k42p23p07o5R56
$$ 691 -21 -784 -853 132 757 784 39 -668 -825 -135 739 776 -66 -832 -864 104 912 670 -53 -760 -825 131
7103A31P56j60p71q03J30O51R60p2r07n88r3O59P89K26q88p49J71M64R77j21o50
$$ 131 887 727 -44 -847 -717 -66 894 822 -85 -673 -766 -107 682 908 20 -729 -558 -94 883 762 112
7124A12p83j42O92Q50J13q24p38j23Q73N53J16p33p79LQ12O99o0o12o97k2P33
$$ 112 -671 -813 -121 729 842 18 -720 -843 30 583 699 -34 -813 -810 2 701 641 29 -668 -690 43
7145D3Q14k14p10o21qQ37O63M6r62o11K68P59N35j15p93o56LO35P30J9p62p63
$$ 43 857 643 -67 -688 -696 141 804 850 -112 -723 -455 304 839 724 -69 -725 -722 -87 643 662 -100 -863
7167h63J26P89N86M2p54p81J23Q78O53n9q52p84K75P29O39Rp72p45k3P70Q64j7
$$ -863 -737 52 638 680 -74 -855 -732 146 799 740 -112 -896 -621 108 747 756 -16 -761 -784 -14 850 833
7189H33q05q44K09P72Q44k94q50n86o6P19Q97j84o64p07J3Q94O52k25o84q48K64
$$ 833 28 -816 -607 165 1009 715 -135 -721 -787 -68 829 645 -19 -726 -713 181 833 608 -76 -924 -660
7210f60Q89O50k08p28q25J45P85R02k80p67p38L20P72N82j46p86o87K26P06O57
$$ -660 229 879 671 -57 -882 -737 48 950 670 -97 -835 -515 257 839 693 -93 -780 -554 152 809
7230H09p5r77n05N2Q18P97j73r20p71K10Q94Q07l24p48p90J67Q35Q04k27p45p54
$$ 809 734 -243 -748 -696 122 919 746 -174 -945 -735 159 966 642 -106 -896 -729 106 910 683 -62 -816
7251h16J84P16P77j34j020l86J33P24Q34l73o90q47K60P02N95k9q20p31K02Q96
$$ -816 -632 84 861 727 -293 -679 -546 178 1012 639 -51 -898 -638 64 659 630 -190 -921 -719 177
7271A77O17p4r31n95N6Q30P49j43q29o86R6J003M90j08q37n93P0Q90N19Nj034
$$ 177 794 720 -211 -806 -750 80 829 686 -143 -829 -733 270 760 652 -185 -778 -708 182 701 706 -328
7292c28o63L58P79P69k51q91o63K23Q71N20J3r03n94J94P67M55j04p89n39l0R31
$$ -328 -991 -633 146 915 664 -227 -890 -667 204 724 737 -166 -760 -566 201 656 552 -237 -776 -806 125
7313A25O81k10q79n03J98P53P26j99p91p97J81P85P76r1q48p85M34N79O26q3r73
$$ 125 806 596 -283 -786 -588 165 891 692 -99 -896 -715 70 846 755 -93 -878 -444 135 761 678 -295
7334b95n04L8J103M94k67p47o85Q9J027O42l44r00n08L29P51P06l37r10o22M44
$$ -295 -799 -761 342 836 569 -178 -863 -774 253 895 551 -349 -857 -528 223 929 592 -318 -940 -496
7354d96P35M46q7q59n27L03Q84N63m45p52p03L67Q57P90n79p59o10K72R20M30
$$ -496 239 685 598 -261 -788 -485 399 962 517 -235 -938 -571 286 1076 497 -262 -872 -600 320 750
7374G50j15r29n64J48Q36P95l91q32o06K86R29M67l07p71o46K78R71M82k53r03
$$ 750 635 -294 -858 -710 126 921 530 -302 -908 -622 307 774 467 -304 -950 -672 299 781 528 -375
7394c75n28L37Q31N95k98r05n96M50Q31M92k11r41m69K29Q98M07j80r36m95L03
$$ -375 -903 -566 265 860 562 -343 -939 -489 342 834 623 -318 -787 -558 340 747 567 -369 -864 -561
7414e61R88M64m89o40o62L62R31N24m42p96m88K65R07M83l18o64o89K58R80O48
$$ -561 427 891 402 -238 -900 -538 393 917 475 -321 -809 -544 363 846 528 -136 -825 -567 413 1061
7434A061m47j169k46L62P67M47l53q22m30L30P65O74m10q01n39J86R99N72l78
$$ 1061 614 -555 -801 -439 328 775 422 -400 -830 -500 265 939 529 -272 -811 -625 374 946 568
7453E68q97o26L97J057L34l41q28n11L39R58L81l02q73n23L37Q50M57l62q38l98
$$ 568 -329 -955 -558 499 833 492 -336 -847 -508 450 831 529 -344 -867 -530 320 777 415 -423 -821
7473h21L72O95O78l43j075l69L57P93O74n18q61m29L10R45L17l39q67l37L09O63
$$ -821 -449 246 924 581 -494 -863 -506 287 961 443 -418 -847 -537 408 725 386 -481 -818 -509 154
7493A54O75m70q21l14K64Q30M89k28j085m69P23P31N19o72o64n09L36Q37N77n90
$$ 154 829 359 -462 -776 -512 318 807 579 -506 -975 -252 479 998 326 -338 -847 -511 326 903 313
7513C13p12l74J65J003N19m53r93k75L37P49M93l26r55m64M52Q88N79m47r00l63
$$ 313 -399 -773 -608 395 914 461 -532 -807 -470 279 772 446 -509 -973 -521 367 946 499 -401 -764
7533g64L74Q32M56l69q96n22O28P53K93l60r30k53K86Q79N00n92r65k49L77R96
$$ -764 -390 442 898 529 -367 -889 -261 492 785 425 -505 -758 -472 407 907 315 -650 -899 -522 474
7553D74L06m73q37l83N34P15N46n67p56m94M29Q20O19o18o94n34M74R02L97l15
$$ 474 780 307 -530 -913 -379 336 882 315 -441 -935 -506 314 933 315 -379 -913 -439 463 860 545
7573E45j162nL96O79K86j70r64m61L03R87L34m91o20l95J81R19M09n14r28k78
$$ 545 -617 -622 -226 453 739 569 -395 -856 -553 434 768 277 -343 -738 -557 362 771 257 -671 -949
7593i49O32P85M51o16q21k74N41O52N24n29p03n19M04Q16L90l37q03l77L24Q63
$$ -949 -317 468 919 303 -518 -792 -251 401 925 396 -307 -826 -422 394 784 447 -356 -733 -409 454
7613D54K78l21r62k91M18Q39O39m98j042n25O70Q93K81o07q11l13N07Q55L03l77
$$ 454 732 411 -551 -842 -424 415 1054 556 -486 -1011 -341 552 833 226 -585 -898 -391 464 767 390
7633C90p81m15M18R38K95m63r77k81N36R33J79l83q32n33O32O97M06m06j010k26
$$ 390 -391 -806 -388 550 845 382 -595 -876 -340 593 772 389 -443 -976 -344 353 759 353 -657 -883
7653h83L33R74K97m62o94m93M79R14N58p45q65k23M69R13K60m71j005k39N69Q99
$$ -883 -550 424 721 259 -435 -928 -449 465 1023 278 -587 -810 -341 572 832 361 -644 -883 -314 585
7673E85K21n94p78k93M51R74L87o75p01m63O10Q94R0m19q10m28O60Q52K86o25
$$ 585 806 212 -566 -859 -408 566 953 278 -423 -886 -276 618 708 289 -521 -949 -289 563 849 224
7693B24q02k88N92P89K88m74j007q3M53J126J40n84q82l43O32Q02L23p28q78j23
$$ 224 -578 -866 -274 515 803 329 -678 -761 -308 818 958 374 -508 -851 -219 583 906 178 -700 -823
7713h23N07R65J58n77q89j8M57O63L54n07q40l81O71P79K31n07q21j76N65Q12
$$ -823 -316 649 807 230 -659 -677 -220 443 797 290 -550 -931 -260 519 750 243 -578 -754 -189 623
7733F23K04n30q81l29O41Q25K75o56o80k15N72Q00N4m13p70l19N62Q38K62p09
$$ 623 827 297 -584 -913 -272 553 828 172 -508 -723 -151 649 703 290 -480 -799 -237 601 863 154
7753A54q97q6O85Q13L65r01n65k86L07J007P3m09r17j20N76P72K86p29p01r2M21
$$ 154 -743 -829 -144 669 1034 133 -432 -718 -411 596 669 260 -657 -777 -201 571 857 128 -573 -665 -244
7774b44Q37K62n69o92n21O03Q58L44o33r41j13P23Q28Q1n13q98j20N86O71J30
$$ -244 593 855 286 -406 -927 -324 534 878 245 -696 -809 -86 742 823 310 -588 -708 -122 549 679
7794F79m10j001K4N95P49J60o70o95k56O38P77Q3m83p71k97O80P46K27n31p59
$$ 679 269 -732 -708 -113 636 796 126 -569 -825 -187 590 673 190 -581 -878 -198 548 775 244 -515
7814e15m18P30J007K1o64p74k01O79Q38K15o35r30k39Q72O21K48o36p79k12O16
$$ -515 -933 -203 804 825 161 -613 -814 -135 703 918 283 -647 -886 -14 607 855 219 -560 -772 -156
7834a56Q61J29o15p54k38M83Q50J62o84o37j05N15P93J24n15q61j81O56P87J33
$$ -156 705 834 219 -535 -773 -290 560 722 38 -599 -704 -189 604 728 213 -648 -829 -173 614 747
7854G47p61o68j86R19M88R4n23q02l3N80R07K39p32q31k64O21Q70N8n89p21m50
$$ 747 -14 -682 -868 51 539 633 110 -692 -725 -145 762 1001 269 -562 -826 -205 665 723 134 -587 -1037
7875a037Q59P67K33o22j081L6P01Q01J93p27p78j27P56M65L83n53j007kO10P31
$$ -1037 -178 589 822 200 -881 -845 -144 657 850 123 -655 -782 -26 439 822 269 -738 -740 -130 601
7895F01J76n55q81j99P96N86K05n17q56j87Q33O00L5m80p35k43O80Q88K91q59
$$ 601 777 222 -659 -858 -62 524 729 212 -644 -831 2 602 637 157 -578 -821 -141 747 1038 179
7915A79q51j3N56P14J21m89q71j54P20P03J19n55q39j96O67O64K82o13q19j0O19
$$ 179 -672 -685 -129 585 706 217 -654 -808 -88 615 734 179 -660 -856 -189 475 757 144 -675 -685 -66
7936f6P95N5p49o32k15P18P46mo83p13M4O89P90j96n09q37lO48P50J58p83n94
$$ -66 729 784 35 -597 -812 -94 652 648 -35 -748 -704 -15 775 579 70 -767 -770 -122 628 786 3 -591
7958e91q9O02P51jo24q22J6Q45O60j09n79p14m5Q22N62J20n98j072K7O64Q14L4
$$ -591 -680 -78 673 672 48 -774 -758 87 747 638 59 -655 -700 122 684 804 206 -866 -839 -175 639 673
7980F73p07o26j49P06Q45r9n10p14j42N70R94j41o66p41L1P99N69M9o70o72r9
$$ 673 -34 -660 -809 -103 742 643 133 -581 -723 -153 841 700 34 -707 -676 123 692 741 71 -601 -700
8001g00O83Q18Mq55p01o1P33P97l2o47p82J07N94O17J77p18o01j24N57P16Q6o46
$$ -700 -17 801 805 -50 -751 -812 -79 718 686 39 -743 -636 -42 575 752 34 -567 -691 -134 582 668 22
8023B2p51Q8O72P70Mo92q75P9P67O28L0p45o60j38Q53P06j87p71m14j76P65P38
$$ 22 -729 -641 31 801 805 113 -762 -683 84 712 742 -3 -663 -801 52 758 571 -200 -614 -790 -25 713
8045G13n6m83p34k4N88O86O7q12n03k24O68Q35m1p58p29J88N83Q79k62o96p56
$$ 713 657 174 -560 -584 4 690 757 -55 -558 -782 -114 721 680 -78 -807 -619 -36 843 581 -115 -871
8066h71J40Q54O31r5p98n39J3P21Q05k26n14p17n2O86O37j5p28o43j09R54N57
$$ -871 -731 123 754 659 -139 -678 -665 56 861 635 121 -596 -648 38 675 660 -68 -711 -820 134 691
8087F91n4o82o71N7P55Q21j70q26o20J8R43M05K2q09n39m3Q21N08M3q13o85J01
$$ 691 637 -45 -716 -659 96 917 747 -79 -699 -681 262 667 689 -120 -659 -702 119 627 670 -143 -828 -727
8109g27R21O20j82p54m03j25P14P76k52o10p76K09O74P44j47q33n11J36Q26M73
$$ -727 194 814 632 -122 -525 -650 64 840 588 -22 -798 -589 85 829 682 -151 -662 -526 300 773
8129G73k01p62m86j2P82N06J11q38o72J55P37O18p1p18o19J00P70N71K2j006n63
$$ 773 572 -190 -676 -688 94 600 711 -127 -799 -644 93 711 640 -78 -697 -597 173 744 766 -240 -803
8150h03L07O02N68j57p85n41J69Q70M63N7r82m30J1Q43N40m3p46p75K22Q55N03
$$ -803 -496 106 674 517 -268 -809 -640 230 693 750 -232 -662 -651 192 732 689 -57 -832 -610 245 748
8171G48j75o75n95J88O52N73r0q00m91K64O76N23k39p73n50L9Q62N86j67o22
$$ 748 573 -102 -697 -509 143 716 626 -174 -665 -401 275 798 559 -214 -764 -725 137 723 556 -66
8191f6
$$ Imaginary data points
##PAGE= N=2
##DATA TABLE= (X++(I..I)), XYDATA
0@%%%%%%Oo%%Qj6J6j6K4l2L8m6N6o7P7r5J15j33J54j79K09k42K75l14L61m11M64
$$ 0 0 0 0 0 0 0 6 0 0 0 8 -8 8 -8 16 -16 22 -24 32 -35 42 -53 62 -71 83 -96 113 -129 146 -168 193 -218 246
33B46n23N87o60P43q31R27j033J147j271J411j561J722j901K096k313K546k800
$$ 246 -277 310 -350 393 -438 489 -544 603 -668 743 -818 904 -997 1099 -1214 1332 -1468
50a468L086l402L750m139M582n080N649o311P084q003R120j0509J2287j4649J7941
$$ -1468 1618 -1784 1966 -2173 2409 -2671 2978 -3333 3751 -4252 4868 -5641 6646 -8003 9938
65I938k2849L0900m6254Q5095l50565o12166J071668K24081o80219K19945L08875
$$ 9938 -12911 17989 -28265 56830 -293735 -905901 165767 389848 -290371 -70426 238449
76B38449n10124L7768N07650p8166r7602J40062m04849j83431O15588Q1562n96659
$$ 238449 -271675 -233907 273743 195577 97975 238037 -166812 -350243 265345 346907 -249752
87b49752Q5104K76137l98689l3397O60367Q580n83611q524L31435L3466N5719
$$ -249752 -164648 111489 -287200 -320597 339770 348350 -235261 -243785 87650 121116 176835
98A76835L9770k83694j48686J64043M3928M8150J16395k46768k62111K91774K59234
$$ 176835 216605 -67089 -215775 -51732 -7804 40346 156741 -90027 -352138 -60364 198870
109A98870j65198Q469J34899k42700j51473K93598J76269j22781j80000k09539
$$ 198870 33672 42141 177040 -65660 -217133 76465 252734 129953 -50047 -259586
119b59586M5447L55147L8338k61458K0614N1324j65373J51560L37285j58393l06011
$$ -259586 -214139 141008 179346 -82112 -61498 -10174 -175547 -23987 313298 154905 -151106
130a51106O2678O5953k5J78945k7152k88579J0531J50038o5931J01294K16086
$$ -151106 -88428 -22475 -22500 156445 129293 -159286 -148755 1283 -64648 36646 252732
141B52732k42687l07595K33214K51407j03499j4583j1272k61734K7172L55716
$$ 252732 10045 -297550 -64336 187071 83572 68989 57717 -204017 -176845 178871
151A78871k1203k27530O1133k1929j68618K09465K54059k24729j85123J23150
$$ 178871 157668 -69862 -8729 -30658 -199276 10189 264248 39519 -145604 -22454
161b2454m0815k4488K74633o78l32169r146J70663j8760Q8790J12417k52882j90273
$$ -22454 -63269 -87757 186876 186198 -145971 -155117 15546 -3214 85576 197993 -54889 -245162
173b45162K24979J32480q4988M9684m4158k40134P2649K88355k1034j36378J4161
$$ -245162 -20183 112297 27309 76993 32835 -207299 -134650 153705 132671 -3707 10454
184A0454o5256o8161J69784J23294j22026j03114l8184n1465J34639J98448j19593
$$ 10454 -54802 -122963 46821 170115 48089 -55025 -93209 -144674 -10035 188413 68820
195F8820k09706N1187Q4455R301J16534L7456k01600j07299J21365Q9949J7112
$$ 68820 -140886 -89699 -5244 4057 120591 158047 -43553 -150852 -29487 60462 77574
206G7574n663j34583j10395J11852J14379R88L0708n6907j70008N2067K23071
$$ 77574 71911 -62672 -173067 -61215 53164 54152 84860 27953 -142055 -89988 133083
217A33083J5013j22431m4773o4702l9150J46444J06991j10128j05310j6584Q476
$$ 133083 148096 25665 -19108 -83810 -122960 23484 130475 20347 -84963 -101547 -93071
228i3071J28909J31468r8893j37799K7610K6112J2516J22111Q856k17391q6754
$$ -93071 35838 167306 68413 -69386 -41776 -15664 -3148 118963 127819 -89572 -176326
239a76326J43174P4995k151K3961q7287j14207R0133J43014R835k8325o9316j26058
$$ -176326 -33152 41843 39692 63653 -23634 -137841 -47708 95306 105141 76816 7500 -118558
251a18558L5596J77625M283j19764j9057l7680n8038J46840J55934j14881j43409
$$ -118558 -82962 94663 98946 -20818 -39875 -77555 -135593 11247 167181 52300 -91109
262i1109L0072M8055M8514R0330l9653j54013l3321O1808M2312P8158N465j72740
$$ -91109 -61037 -12982 35532 125862 86209 -67804 -101125 -39317 2995 81153 86618 -86122
274h6122p1253J50072Q5321k7290J7800m4721j33405K8488J68975L3746r7009
$$ -86122 -157375 -7303 78018 50728 68528 23807 -109598 -81110 87865 121611 24602
285B4602p8667n3503K8024J30696M3315q2410n2055k6441q371J14949J12068r1310
$$ 24602 -54065 -107568 -79544 51152 94467 12057 -39998 -66439 -74810 40139 152207 60897
297F0897j43015O918O1360L5390N4429j2497j19550n7737O1635Q6742O6930k8911
$$ 60897 -82118 -75200 -13840 21550 75979 63482 -56068 -113805 -52170 34572 101502 72591
309G2591j35283m7722J02931P5550j439r277p3725j04547N1081J44241J4643p7912
$$ 72591 -62692 -110414 -7483 68067 66628 57351 -16374 -120921 -69840 74401 89044 11132
321A1132n5279m4893K8305J19770M1486p2960n8385l4377l412J08100R4749r5546
$$ 11132 -44147 -89040 -60735 59035 100521 27561 -30824 -65201 -68613 39487 134236 38690
333C8690j30133J6743N2545L5438P3153j5749j37112m0125R2587O7091K4000j5573
$$ 38690 -91443 -74700 -22155 13283 86436 70687 -66425 -106550 -13963 53128 77128 61555
345F1555j03994o8930Q6442R1938j1152k4632n0183q8791L8855J42631K1858q3496
$$ 61555 -42439 -111369 -24927 67011 55859 31227 -18956 -107747 -68892 73739 95597 12101
357A2101m9839l0541J0800J07389O4486q5748r3429l785K9400O9181O9877n8636
$$ 12101 -37738 -68279 -57479 49910 114396 28648 -64781 -68566 -39166 30015 99892 41256
369D1256j14770n348O0012N0385N1957k1669j16811m4744Q5087P1605P200k1876
$$ 41256 -73514 -78862 -18850 31535 83492 61823 -54988 -99732 -14645 56960 64160 42284
381D2284p9292o8711O4759J04255P392m5875n9747n6425M4579J17621K1408p9220
$$ 42284 -37008 -105719 -40960 63295 70687 24812 -34935 -91360 -46781 70840 92248 13028
393A3028n4620j9690J1383Q9055O4822p6499r8441j85M5033N9245N2491m0994
$$ 13028 -41592 -61282 -49899 39156 103978 27479 -70962 -71147 -26114 33131 85622 44628
405D4628j02666k2392O5252O1902K8010k8756r5257m9234P3271Q4844M710m2636
$$ 44628 -58038 -80430 -15178 46724 74734 45978 -49279 -98513 -25242 59602 64312 21676
417B1676o2824m1934M4567R1804L1398n4765p8974k9601N1916Q2823K0849n5579
$$ 21676 -41148 -83082 -38515 53289 84687 29922 -49052 -78653 -26737 56086 76935 21356
429B1356o7070l0000L7593Q7560L4617o1391p4191k0315M2282Q2908L4510o6377
$$ 21356 -45714 -75714 -38121 49439 84056 22665 -51526 -71841 -29559 53349 87859 21482
441B1482p8569n479L9175N5178N0498l9508j11949k0979Q3578N5399P867k1141
$$ 21482 -57087 -62566 -23391 31787 82285 42777 -69172 -90151 -6573 48826 56693 35552
453C5552p6706m9717O8631Q7088j229m4101n1557m9251M0743J11093J2232q5511
$$ 35552 -41154 -90871 -22240 64848 63619 19518 -32039 -81290 -40547 70546 82778 -2733
465b733m2915m145J0152P5682O1341p0001r9413O025N8190M4093L4341l1704r8609
$$ -2733 -45648 -49793 -39641 36041 97382 27381 -72032 -66007 -7817 36276 70617 38913 -59696
478e9696k2903P7523N5149N335k3412p2483n0659O4845R4353m104o2069m1336
$$ -59696 -82599 -5076 50073 55408 31996 -40487 -91146 -26301 68052 63948 1879 -39457
490c9457k2065K5973Q6668L5759o9096p4281m743M5267O1081K8759m9768q4288
$$ -39457 -61522 -35549 51119 86878 17782 -56499 -61242 -15975 45106 73865 24097 -60191
502f0191j6009O3377O0560J2330l6844o7270l0464N5842Q0747J0334o1319n8135
$$ -60191 -76200 -12823 47737 60067 23223 -44047 -74511 -18669 62078 72412 11093 -47042
514d7042j3197L3999O8809L1615o1083p7843j872N4423N3824K4390l5541p9305
$$ -47042 -60239 -26240 42569 74184 13101 -64742 -66614 -12191 41633 66023 30482 -48823
526d8823k4585O9345O5520l084m0619n7794l5391M9673Q3016M741o0959m6405
$$ -48823 -73408 -4063 61457 58373 17754 -40040 -75431 -25758 57258 61999 1040 -45365
538d5365j2155L0162P6833L5304p0043p4029R091M2673M3229L0847m2575q9160
$$ -45365 -57520 -27358 49475 84779 14736 -59293 -50202 -7529 35700 66547 23972 -65188
550f5188j2393P1348N1785L035k6839o2005l4308O3416P9126n519n1765m5941
$$ -65188 -77581 -6233 45552 48587 21748 -40257 -74565 -11149 67977 62458 10693 -35248
562c5248k6073L6165P8463J4393o8524n6090K154L6565N7738L2527n1780p6521
$$ -35248 -61321 -25156 53307 67700 -824 -56914 -54760 -18195 39543 72070 20290 -56231
574e6231j793N7159M9928J0848m1940o9049j9692N8253O1571J072m2497n2015
$$ -56231 -58024 -865 49063 59911 17971 -51078 -70770 -12517 49054 50126 7629 -44386
586d4386k1177M9467P3796Q516n6942n4577p935M2691N9751J4079n5457o2883
$$ -44386 -65563 -16096 57700 66216 9274 -45303 -53238 -10547 49204 63283 7826 -55057
598e5057m202M8211N4921J4794m6760o1888r521N2406O1816O639n2772n5529r199
$$ -55057 -59259 -11048 43873 58667 11907 -49981 -59502 -7096 54720 61359 8587 -46942 -56141
611e6141M3736N9497J1512n4106n9584k510M9966N2239J2641m4145o3510o921
$$ -56141 -12405 47092 58604 4498 -55086 -57596 -7630 44609 57250 13105 -50405 -57326
623e7326N6420N1970M807m4054o0668j2643N6077N9123l426m9546m3694j0228
$$ -57326 -906 51064 55871 11817 -48851 -61494 -5417 53706 50280 734 -42960 -53188
635e3188L8131O5211J4080o0123n7537K693M6821N0157R783n0438o0132J856N1956
$$ -53188 -15057 50154 64234 4111 -53426 -50733 -3912 46245 56028 5590 -54542 -52686 -730
648g30M0866R432l4009o6011j4529O6174N6184j0252m4457m4277j2678M6995O2172
$$ -730 40136 49568 15559 -50452 -64981 1193 57377 47125 2668 -41609 -54287 -7292 54880
661E4880j052n5322m2650m272L7232N9198J1388n8577n5018M926M7708M6945P264
$$ 54880 53828 -1494 -44144 -48416 -11184 48014 59402 825 -54193 -49267 -1559 45386 52650
674E2650m6992n8548r8N6958M3302l014l8121n0594j3006N1759N9013j473n3945
$$ 52650 5658 -52890 -52988 3970 47272 44258 6137 -44457 -57463 -5704 53309 51836 -2109
687b109m6771K84M7269N2424q23n1883m2368J59L8454N1194Q850n1955n5602J225
$$ -2109 -48880 -48596 -1327 51097 50274 -1609 -43977 -43818 -5364 45830 54680 2725 -52877 -51652
701e1652N3743M7758l899m7897m5926P20M7339M6194J387m5492m9541k710M7911
$$ -51652 2091 49849 45950 -1947 -47873 -47153 186 46380 47767 2275 -47266 -49976 -2065
714b065N0890J564n3342m8860O200M7990M4010K44m6730m6518J226M7433M6677
$$ -2065 48825 50389 -2953 -51813 -45613 2377 46387 46631 -99 -46617 -45391 2042 48719
727D8719j005m7073m8079j904N0625M9908n371n1524m3222N596M4620M2737K810
$$ 48719 47714 641 -47438 -49342 1283 51191 45820 -5704 -48926 -43330 1290 44027 46837
740D6837m6546m9625M538M7898M1565J293m5842n1512M251N4010M0701q239m1213
$$ 46837 291 -49334 -44796 3102 44667 45960 118 -51394 -47143 6867 47568 39329 -1884
$$ [...]
8191h06
##END NTUPLES=NMR FID
##END=
