##TITLE=1H_AM_NVDICYCL
 
 8 sc, 
 6.04.2022
##JCAMPDX= 6.0         $$ Bruker NMR JCAMP-DX V2.0
##DATA TYPE= NMR FID
##DATA CLASS= NTUPLES
##ORIGIN= UXNMR, Bruker Analytische Messtechnik GmbH
##OWNER= root
$$ XWIN-NMR		Version 3.5
$$ Wed Apr  6 11:31:37 2022 Russian Standard Time (UT+4h)  she@DPX200
##.OBSERVE FREQUENCY= 200.131346
##.OBSERVE NUCLEUS= ^1H
##.DELAY= (6, 6)
##.ACQUISITION MODE= SIMULTANEOUS
##.ACQUISITION SCHEME= undefined
##.AVERAGES= 8
##.DIGITISER RES= 18
##SPECTROMETER/DATA SYSTEM= spect
##.PULSE SEQUENCE= zg30
##.SOLVENT NAME= CDCl3
##.SHIFT REFERENCE= (INTERNAL, CDCl3, 0, 15.7039)
##AUDIT TRAIL= $$ (NUMBER, WHEN, WHO, WHERE, WHAT)
$$ ##TITLE= Audit trail, XWIN-NMR		Version 3.5
$$ ##JCAMPDX= 5.01
$$ ##ORIGIN= Bruker BioSpin GmbH
$$ ##OWNER= she
$$ F:/spectra/data/she/nmr/H-F/1/audita.txt
$$ ##AUDIT TRAIL=  $$ (NUMBER, WHEN, WHO, WHERE, WHAT)
(   1,<2022-04-06 11:30:22.51 +0400>,<she>,<DPX200>,
      <created by zg, POWCHK disabled, PULCHK disabled
       configuration hash MD5:
       00 E9 B6 7A A2 85 ED C7 34 08 36 98 17 FE 4E 26
       data hash MD5: 16K
       9F 13 B3 95 9A B9 9C 56 A9 95 09 B9 03 5E BA 94>)
$$ ##END=
$$ 
$$ hash MD5
$$ 71 1B E7 E5 EB ED FF 5C B7 72 DD 76 D8 35 3F 11
##$RELAX= 
##$RELAX= 
##$RELAX= 
##$RELAX= 
##$RELAX= 
##$RELAX= 
$$ Bruker specific parameters
$$ --------------------------
##$DU= <F:/spectra>
##$EXPNO= 1
##$NAME= <H-F>
##$PROCNO= 1
##$TYPE= <nmr>
##$USER= <she>
##$AMP= (0..31)
100 100 100 100 100 100 100 100 100 100 100 100 100 100 100 100 100 100 
100 100 100 100 100 100 100 100 100 100 100 100 100 100 
##$AQSEQ= 0
##$AQ_mod= 1
##$AUNM= <au_zg>
##$AUTOPOS= <>
##$BF1= 200.13
##$BF2= 200.13
##$BF3= 200.13
##$BF4= 200.13
##$BF5= 200.13
##$BF6= 200.13
##$BF7= 200.13
##$BF8= 200.13
##$BYTORDA= 1
##$CFDGTYP= 0
##$CFRGTYP= 5
##$CHEMSTR= <none>
##$CNST= (0..31)
1 1 145 1 1 1 1 1 1 1 1 1 1 1 1 1 1 1 1 1 1 1 1 1 1 1 1 1 1 1 1 1 
##$CPDPRG= <>
##$CPDPRG1= <>
##$CPDPRG2= <>
##$CPDPRG3= <>
##$CPDPRG4= <mlev>
##$CPDPRG5= <mlev>
##$CPDPRG6= <mlev>
##$CPDPRG7= <mlev>
##$CPDPRG8= <mlev>
##$CPDPRGB= <>
##$CPDPRGT= <>
##$D= (0..31)
0 1.2 0 0 0 0 0 0 0 0.06 0 0.03 0 0 0 0 0.0002 0 0 0 0 0 0 0 0 0 0 0 0 
0 0 0 
##$DATE= 1649230221
##$DBL= (0..7)
120 120 120 120 120 120 120 120 
##$DBP= (0..7)
150 150 150 150 150 150 150 150 
##$DBP07= 0
##$DBPNAM0= <>
##$DBPNAM1= <>
##$DBPNAM2= <>
##$DBPNAM3= <>
##$DBPNAM4= <>
##$DBPNAM5= <>
##$DBPNAM6= <>
##$DBPNAM7= <>
##$DBPOAL= (0..7)
0.5 0.5 0.5 0.5 0.5 0.5 0.5 0.5 
##$DBPOFFS= (0..7)
0 0 0 0 0 0 0 0 
##$DE= 6
##$DECBNUC= <off>
##$DECIM= 32
##$DECNUC= <off>
##$DECSTAT= 4
##$DIGMOD= 1
##$DIGTYP= 9
##$DL= (0..7)
0 120 120 120 120 120 120 120 
##$DP= (0..7)
150 150 150 150 150 150 150 150 
##$DP07= 0
##$DPNAME0= <>
##$DPNAME1= <>
##$DPNAME2= <>
##$DPNAME3= <>
##$DPNAME4= <>
##$DPNAME5= <>
##$DPNAME6= <>
##$DPNAME7= <>
##$DPOAL= (0..7)
0.5 0.5 0.5 0.5 0.5 0.5 0.5 0.5 
##$DPOFFS= (0..7)
0 0 0 0 0 0 0 0 
##$DQDMODE= 0
##$DR= 18
##$DS= 0
##$DSLIST= <SSSSSSSSSSSSSSS>
$$ [...]
##$SUBNAM2= <"">
##$SUBNAM3= <"">
##$SUBNAM4= <"">
##$SUBNAM5= <"">
##$SUBNAM6= <"">
##$SUBNAM7= <"">
##$SUBNAM8= <"">
##$SUBNAM9= <"">
##$SW= 18.0517287032376
##$SWIBOX= (0..15)
0 0 2 0 0 0 0 0 0 0 0 0 0 0 0 0 
##$SW_h= 3612.71676300578
##$TD= 16384
##$TD0= 1
##$TE= 0
##$TE2= 300
##$TE3= 300
##$TEG= 300
##$TL= (0..7)
0 120 120 120 120 120 120 120 
##$TP= (0..7)
150 150 150 150 150 150 150 150 
##$TP07= 0
##$TPNAME0= <>
##$TPNAME1= <>
##$TPNAME2= <>
##$TPNAME3= <>
##$TPNAME4= <>
##$TPNAME5= <>
##$TPNAME6= <>
##$TPNAME7= <>
##$TPOAL= (0..7)
0.5 0.5 0.5 0.5 0.5 0.5 0.5 0.5 
##$TPOFFS= (0..7)
0 0 0 0 0 0 0 0 
##$TUNHIN= 0
##$TUNHOUT= 0
##$TUNXOUT= 0
##$USERA1= <user>
##$USERA2= <user>
##$USERA3= <user>
##$USERA4= <user>
##$USERA5= <user>
##$V9= 5
##$VALIST= <valist>
##$VCLIST= <CCCCCCCCCCCCCCC>
##$VD= 0
##$VDLIST= <DDDDDDDDDDDDDDD>
##$VPLIST= <PPPPPPPPPPPPPPP>
##$VTLIST= <TTTTTTTTTTTTTTT>
##$WBST= 1024
##$WBSW= 4
##$XGAIN= (0..3)
0 0 0 0 
##$XL= 0
##$YL= 0
##$YMAX_a= 180478
##$YMIN_a= -213067
##$ZGOPTNS= <>
##$ZL1= 120
##$ZL2= 120
##$ZL3= 120
##$ZL4= 120
##$ABSF1= 10
##$ABSF2= 0
##$ABSG= 5
##$ABSL= 3
##$ALPHA= 0
##$AQORDER= 0
##$ASSFAC= 0
##$ASSFACI= 0
##$ASSFACX= 0
##$ASSWID= 0
##$AUNMP= <proc_1d>
##$AZFE= 0.1
##$AZFW= 0.1
##$BCFW= 1
##$BC_mod= 2
##$BYTORDP= 1
##$COROFFS= 0
##$CY= 11.3945322036743
##$DATMOD= 1
##$DC= 2
##$DFILT= <>
##$DTYPP= 0
##$F1P= 2.36226072786647
##$F2P= -0.459571619588291
##$FCOR= 0.5
##$FTSIZE= 0
##$FT_mod= 4
##$GAMMA= 1
##$GB= 0.15
##$INTBC= 1
##$INTSCL= 1
##$ISEN= 128
##$LB= 0.24
##$LEV0= 0
##$LPBIN= 0
##$MAXI= 10000
##$MC2= 0
##$MEAN= 0
##$ME_mod= 0
##$MI= 1.114404
##$NCOEF= 0
##$NC_proc= 0
##$NLEV= 6
##$NOISF1= 3.799351
##$NOISF2= 2.8
##$NSP= 1
##$NTH_PI= 0
##$NZP= 0
##$OFFSET= 15.70392
##$PC= 1
##$PHC0= -18103.01
##$PHC1= 6.00078
##$PH_mod= 1
##$PKNL= yes
##$PPARMOD= 0
##$PSCAL= 0
##$PSIGN= 0
##$REVERSE= no
##$SF= 200.130013532006
##$SI= 16384
##$SIGF1= 3
##$SIGF2= 2
##$SINO= 400
##$SIOLD= 16384
##$SREGLST= <1H.CDCl3>
##$SSB= 0
##$STSI= 0
##$STSR= 0
##$SW_p= 3612.71676300578
##$SYMM= 0
##$S_DEV= 0
##$TDeff= 0
##$TDoff= 0
##$TI= <>
##$TILT= no
##$TM1= 0
##$TM2= 0
##$TOPLEV= 0
##$USERP1= <user>
##$USERP2= <user>
##$USERP3= <user>
##$USERP4= <user>
##$USERP5= <user>
##$WDW= 1
##$XDIM= 8192
##$YMAX_p= 0
##$YMIN_p= 0
$$ End of Bruker specific parameters
$$ ---------------------------------
##NTUPLES= NMR FID
##VAR_NAME=  TIME,          FID/REAL,        FID/IMAG
##SYMBOL=    X,             R,               I
##VAR_TYPE=  INDEPENDENT,   DEPENDENT,       DEPENDENT
##VAR_FORM=  AFFN,          ASDF,            ASDF
##VAR_DIM=   8192,          8192,            8192
##UNITS=     SECONDS,       ARBITRARY UNITS, ARBITRARY UNITS
##FACTOR=    0.0002768,     1,               1
##FIRST=     0,             0,               0
##LAST=      2.2672688,     0,               0
##MIN=       0,             -213067,         0
##MAX=       2.2672688,     180478,          0
$$ Real data points
##PAGE= N=1
##DATA TABLE= (X++(R..R)), XYDATA
0@%%%%%%%%%%%%%%Qj6J6j6J6j6K2l0L2l2M0m8N2o0O8p6Q7r9J12j26J37j51J69
$$ 0 0 0 0 0 0 0 0 0 0 0 0 0 0 0 8 -8 8 -8 8 -8 14 -16 16 -16 24 -24 28 -32 36 -40 47 -52 60 -66 71 -80 89
37H9j87K06k26K47k73L01l30L61l96M35m76N22n73O29o94P69q50R42j052J183
$$ 89 -98 108 -118 129 -144 157 -173 188 -208 227 -249 273 -300 329 -365 404 -446 496 -556 627
57F27j339J526j757K049k427K933l635M656o237Q912j4084K6906j02587j28610
$$ 627 -712 814 -943 1106 -1321 1612 -2023 2633 -3604 5308 -8776 18130 -84457 -213067
71b13067L46585k30621J42477R3908k13297L8461l2881J22602m7663L1566N554
$$ -213067 133518 -97103 45374 139282 -74015 -35554 -68435 54167 6504 38070 43624
82D3624j57698J41369l4387K5835J7756q2782Q1161q5705Q4481q988r6297J28068
$$ 43624 -114074 27295 -7092 18743 36499 -46283 34878 -50827 33654 24666 -71631 56437
94E6437q4480L9893M6789j29830N6219L1608k6787N7119l393j24423N0065O1533
$$ 56437 -28043 11850 58639 -71191 -14972 16636 -10151 46968 43575 -80848 -30783 30750
106C0750n4119J02462n9787r1244N3800K23N9003q966j8950l2984m3102P6161
$$ 30750 -23369 79093 19306 -71938 -18138 -17915 41088 32122 13172 -19812 -62914 13247
118A3247J0627j069j7149j4311j4699m595P6740o3957J6999K9375p7348P0255
$$ 13247 23874 22805 5656 -8655 -23354 -27949 48791 -15166 1833 31208 -46140 24115
130B4115l6225p038M9980m1783L3551k4057k2453L234K9512K1331l3854L6713
$$ 24115 -12110 -19148 30832 -10951 22600 -1457 -23910 -20676 8836 30167 -3687 33026
142C3026p7373J574Q1141m1079M3168l9351l5244J4307J501P4507n5106Q25j104
$$ 33026 -44347 -42773 38368 -2711 40457 1106 -34138 -19831 -18330 56177 1071 1896 792
155G92n6126P7954j2665O012o581l9281M2243l4127L3914N737l7732L5671k3995
$$ 792 -55334 22620 9955 15967 9386 -29895 12348 -21779 12135 17872 -19860 15811 -8184
168h184J4938j6074n435L5141l2349L4544j2960m1418K3114Q420J8771o038j50
$$ -8184 6754 -9320 -14755 20386 -11963 22581 9621 -31797 -8683 -263 18508 12470 12320
181A2320l1254k1243N6044R78k965J384l7364j0039L3192K5217j7567L493k4842
$$ 12320 -18934 -40177 15867 16845 13880 15264 -22100 -32139 1053 26270 8703 12196 -12646
194a2646j9234L9153L14Q658r866j9516Q484q432K5538p250q881J6827k6755J3082
$$ -12646 -31880 7273 7587 16245 6379 -13137 -4653 -13085 12453 5203 -3678 13149 -13606 -524
208e24L242j4605J9030K781o677q978M584j2592O601L5611k6762o511N429k4374
$$ -524 2718 -11887 7143 9924 3247 -5731 -1147 -13739 -7138 28473 1711 -4800 629 -23745
222b3745K1551K4384j0547j7751O3n151p26L1791m946k3116M198q20o267J8133
$$ -23745 -2194 22190 11643 -6108 -6045 -11196 -11922 19869 14923 -8193 -3995 -4815 -11082 7051
236G051J1711k9761J0065Q201k5901K6317j410j5202J9488p769q087j784N527
$$ 7051 18762 -10999 -934 7267 -18634 7683 6273 -8929 10559 2790 -5297 -7081 -1554
249a554J914L769J4044k6231o946J4350n241J8502N743k3525j2359J0636P992
$$ -1554 360 4129 18173 -8058 -15004 -654 -5895 12607 18350 -5175 -17534 -6898 1094
262A094N221J6070k4790k0665K2446j506P088J6685k6482j1764J6190j561O784
$$ 1094 6315 22385 -2405 -23070 -624 -2130 4958 21643 -4839 -16603 -413 -1974 4810
275D810P276j5300m655N294O044k510k197O512j2201Q270Q813k1384R144M931
$$ 4810 12086 -3214 -7869 -2575 3469 959 -1238 5274 -6927 1343 10156 -11228 -2084 2847
289B847n981J3570n146j5361j49J2065L115L702N90k3789K172J5314J275R418
$$ 2847 -3134 10436 5290 -10071 -10220 1845 4960 8662 9252 -14537 -12365 2949 4224 13642
303A3642r516j5607O21Q070J2882q90o737p924q153J3777R139o806K398r567n463
$$ 13642 4126 -11481 -10860 -2790 10092 9202 2465 -5459 -13612 165 9304 2498 4896 -4671 -10134
318a0134J5202l933r16M437q897L863K057k989r65J550N086m160K800m585p811
$$ -10134 5068 1135 219 4656 -4241 -378 1679 -1310 -2275 -725 4361 201 3001 -1584 -9395
333i395J0184L583J922m246o653k743J103J7118l958p881M87j1596R843J0169
$$ -9395 789 4372 6294 2048 -4605 -7348 -6245 10873 6915 -966 -479 -12075 -2232 7937
347G937k145l240p651k96J830Q155J207n113k366l366N837j581L311M41p096Q000
$$ 7937 5792 2552 -5099 -5395 -3565 4590 5797 684 -1682 -5048 789 -792 2519 2960 -4136 3864
363C864o062K24K702m558J0347n490o79j604p483J1280P15K667m413q387L405
$$ 3864 -2198 -1974 728 -3830 6517 1027 348 -1256 -8739 2541 3256 5923 1510 -6877 -3472
378c472j275J3042j841q092Q04j0006J1793M897k772J813j2840M382L739J491
$$ -3472 -4747 8295 6454 -1638 -834 -10840 953 5850 3078 4891 -7949 -3567 172 1663
392A663M307q074J663k431J758N202p048M364l2k843L735l841j496J941M443P94
$$ 1663 5970 -2104 -441 -2872 -1114 4088 -2960 1404 1372 -1471 2264 -1577 -3073 -1132 3311 4105
408D105m309j661m057L175R304q47n307m668k710N225P602J706p216o662J990
$$ 4105 -204 -1865 -5922 -2747 6557 5710 403 -4265 -6975 -1750 5852 7558 342 -6320 -4330
423d330J246Q615L022j1836J211k816J450J1888p516q88j117m284Q194j704n1
$$ -4330 -3084 5531 8553 -3283 -2072 -4888 -3438 8450 934 46 -1071 -5355 2839 1135 1084
438A084j787j292M639l537K374m011m10O501k430L278q600q00O175l326J2458
$$ 1084 -703 -1995 2644 -893 1481 -2530 -2940 3561 1131 4409 -4191 -4991 1184 -2142 10316
453A0316r387q331P711p752J3112L014j1028J749p219N786P466j092j888p388
$$ 10316 929 -7402 309 -7443 5669 8683 -2345 -596 -7815 -2029 5437 4345 2457 -4931
467d931J282J637N814O23o215K340n244M927L549o626O230n395O21N882q666M446
$$ -4931 -3649 -2012 3802 4425 -1790 550 -4694 233 3782 -2844 3386 -2009 -1388 4494 -4172 274
483B74q7k146P409m970l648J240l21M208L596m343n530J411J88N768L830p998
$$ 274 187 -1959 5450 480 -3168 -1928 -2249 1959 5555 1212 -4318 -2907 -2719 3049 6879 -1119
499a119r82k343J560Q664l179j742k620l558N955K278j409n48k663j352M747k78
$$ -1119 -2101 -4444 -2884 5780 2601 859 -1761 -5319 636 2914 1505 957 -1706 -3058 1689 1411
515A411k623L012m136K683K799n874K957k002J684M311m389j50l445K002M476
$$ 1411 -1212 1800 -2336 347 3146 -2728 229 -1773 -89 4222 -167 -317 -3762 -1760 2716
530B716N9oo281N06Q10M260L994p435J292m952K202R117o522L528n504l436Q537
$$ 2716 2775 2769 -3512 -3006 -2196 2064 6058 -1377 -85 -5037 -2835 6282 -240 3288 -2216 -5652 2885
547B885l693M614l166l981M067l176N320k306j759K236l288M628l017j32J218
$$ 2885 -808 3806 640 -3341 726 -2450 2870 564 -1195 1041 -2247 2381 -636 -768 450
562D50k479N666l978n39Q35l408O222j106j470J14l826L097J695N56l30l199j66
$$ 450 -2029 3637 -341 -880 -45 -3453 2769 1663 193 307 -3519 -422 1273 1829 1499 -1700 -1866
579a866R46J784J389j627j999L99J17J340J267k036M1k64L32K57l32J280k199
$$ -1866 -920 864 2253 626 -1373 -974 -857 483 1750 -286 -245 -509 -177 80 -252 1028 -1171
596a171K428o71k932L759k933K302J458l740K161l204K966J091j637K597n996
$$ -1171 1257 586 -2346 1413 -1520 782 2240 -1500 661 -2543 423 1514 -123 2474 -3522
611c522L387M73j040M741o596K513p16o73N088n518L419l042l57N227n890M841
$$ -3522 -135 338 -702 4039 -2557 -44 -760 -1433 3655 -1863 1556 -1486 -1843 3384 -2506 2335
627B335l122j425M894m432L825l248NK571l075N037n089O75J965l222O070m680
$$ 2335 -787 -2212 2682 -1750 2075 -1173 -1168 1403 -1672 3365 -1724 -1049 916 -2306 3764 -916
643i16L61R90l576O183k989M6N69l434L608o90J261j197j711J716j610L314j282
$$ -916 -555 435 -3141 3042 53 99 668 -2766 842 152 1413 216 -1495 221 -1389 1925 643
660F43j752J567k158K658m6j272O14j577J646J41j73J69j729J154N50m26Q61j137
$$ 643 -1109 458 -1700 958 912 -360 254 -1323 323 464 291 460 -1269 -115 435 9 870 -267
678b67j043J796j59m06J150k110L50J423q97P23m89o88K90R03m44m19R86k052
$$ -267 -1310 486 327 -79 1071 -1039 -689 734 -163 560 71 -617 -327 576 132 -287 699 -1353
696a353J974J94k223K944k849R80J999l097K615j890j51J969j727J862k137M47
$$ -1353 621 815 -1408 1536 -1313 -333 1666 -1431 1184 -706 -857 1112 -615 1247 -890 -443
712d43Q38j344K784k471J84P49j295K112j351P13r85k09K063k709K596j120j839
$$ -443 395 -949 1835 -636 -452 297 -998 1114 -237 476 -509 -718 1345 -1364 1232 112 -1727
729a727L540k741J038R00k543K047k00m50N75p60k61N91P74q63J70l84n28J380
$$ -1727 1813 -928 110 1010 -1533 514 314 -136 439 -321 -582 9 783 -80 90 -294 -822 558
747E58k39J23o55o48J146n76Q72K76j999R03N50o86J054j16j571P09Q62q13O76
$$ 558 319 442 -213 -861 285 -291 581 857 -1142 -239 311 -375 679 563 -1008 -299 563 -250 426
766D26q9j264R94K84l18K42o30J88L9M90Q3j145J108q81Q7K024k687Q22J082k336
$$ 426 337 -927 67 351 33 275 -355 -167 -128 362 445 -700 408 -473 -386 1638 -1049 -227 855 -1481
786a481K311K32k245R53Q31j171N38J642l015O07K365k765J822L01k318J382J74
$$ -1481 830 1062 -1183 -230 601 -570 -32 1610 -1405 -798 1567 -1198 624 925 -1393 -11 163
803A63L06n90L49k67j393K835j272q07J875k623J194J554j852M71N88j298J66
$$ 163 469 -121 228 -39 -1432 1403 131 -676 1199 -1424 -230 1324 -528 -57 531 -767 -601
820f01K297k216n74K792k955Q08K442l192M75J751j277j83J418j131j497K611
$$ -601 1696 -520 -1094 1698 -1257 -449 1993 -1199 -724 1027 -250 -433 985 -146 -1643 968
836I68j09j870J882r72j738L033j74k054J932j481r75L163j231r34J347j646l07
$$ 968 859 -1011 871 -101 -1839 1194 1020 -1034 898 -583 -1558 1605 374 -560 787 -859 -1166
853a166K680r44j824K550j964j054M149k755q11K525k101P4J540m56j756J614
$$ -1166 1514 570 -1254 1296 -668 -1722 2427 -328 -1139 1386 -715 -641 899 443 -1313 301
869C01J060l027K521k86k762L579p57j333J393j430j42J517L23j162K93n72r70
$$ 301 1361 -1666 855 569 -2193 1386 629 -704 689 -741 -883 634 957 -205 88 -484 -1454
886a454K831n99j398J441j907n2K562q54j068Q79p20p70J903J27j660O77O58j464
$$ -1454 1377 778 -620 821 -1086 -1138 1424 570 -498 381 -339 -1109 794 921 -739 -62 596 -868
904h68Q29J213k305J081J248k047J060k19p99J257Q9j34r02J4p8O91J346j841
$$ -868 -39 1174 -1131 -50 1198 -849 211 -8 -807 450 539 405 -497 -483 -561 130 1476 -365
922c65L91n34j055K995p28q15L04j207M66P38J267j543q03J533j895J475J231
$$ -365 26 -508 -1563 1432 704 -111 193 -1014 -548 190 1457 -86 -889 644 -1251 224 1455
939A455k240Q08%k93L56k8J71o70P75M6q12L22l19P14K79m70R7j144K72J512l04
$$ 1455 -785 23 23 -270 86 58 229 -441 334 380 -432 -110 -429 285 564 94 191 -953 -681 831 527
960E27k39k98j030L81J233L71o28p91q9n1Q35Q85r40n44j16J72O60j46L34p20
$$ 527 288 -10 -1040 -659 574 945 317 -474 -563 -614 221 1106 166 -378 -494 -322 338 192 526 -194
980a94n16J233o39j01N73m81K52q0J79p19j91J654q92J3L46j625P73R94J01l42
$$ -194 -710 523 -116 -217 356 -125 127 47 226 -493 -684 970 78 91 437 -1188 -415 579 680 338
1000C38o79k10l77J526M53j060O0j056M79J208l56K42p87o30P54M15kk74J15m98
$$ 338 -341 -551 -928 598 1051 -9 51 -1005 -526 682 326 568 -219 -849 -95 320 318 44 159 -339
1020c39p9J125q65l90J312q41l09J116j298k34J681n35m65M34r92j75J551P6q01
$$ -339 -418 707 -158 -548 764 -77 -386 730 -568 -802 879 344 -121 313 -679 -854 697 773 -28
1039b8J55r68L3J615l06j72l19j052O82Q20O7k99l24l81j87J265j53q66R15q08
$$ -28 127 -841 -808 807 501 329 10 -1042 -360 460 527 228 -96 -477 -664 601 448 -418 497 -311
1059c11k90J333q87k47Q91m13k21L10l65l98J021J71o74K33q46J80J059j49K11
$$ -311 -601 732 -155 -402 489 76 -145 165 -200 -598 423 594 -80 153 -693 -513 546 397 608
1078F08j008l79O07R1J175q61o98K62p38J472K05q54K90p54J58O99J23l94p9J31
$$ 608 -400 -779 -172 -81 1094 233 -465 -203 -941 531 736 -118 172 -582 -424 275 398 4 -75 56
1098E6n07O48q4m43O86l30O2q7m91M73J10K94J07r39j01M50L4Q43k04j293M27
$$ 56 -451 197 113 -330 356 26 88 1 -490 -17 93 387 494 -445 -546 -96 -62 781 577 -716 -289
1119b89j68M27J184j156j63k74k88J276k25M7l94o72O42PL48r9k12j20j49N62
$$ -289 -457 -30 1154 -2 -165 -439 -727 549 324 371 -23 -695 -53 -46 302 203 -9 -129 -278 284
1139B84o93N64K85q62J065j042k95J240q40R15j05j301N37n1N10N67m89o09m31
$$ 284 -409 155 440 -422 643 -399 -694 546 -294 621 516 -785 -248 -299 211 778 289 -320 -751
1158g51N16N86J92p7o98n84N38P04k11K26l96q72P52L30l64N11k34p02O66j55
$$ -751 -235 351 543 466 -232 -816 -278 426 215 441 45 -827 -75 255 -109 402 168 -534 132 -23
1178b3m31R04m36K4M16j059L17K81L6O95n42n02l23L04Q52k0j5o98p41O55P83
$$ -23 -454 450 14 38 454 -605 -288 -7 29 724 182 -320 -643 -339 513 493 478 -220 -961 -306 477
1199D77N0j21l41j093N71J080n10M23l96j041P71K18J0L61m66j89P3r0J88J48
$$ 477 527 406 65 -1028 -457 623 113 536 140 -901 -130 88 98 459 -7 -196 -123 -213 -25 123
1219A23L9P1k31k86r2K45N04O9k42l92n32L87Q82k7k50k65r36M11J206l20P3l53
$$ 123 162 233 2 -284 -376 -131 373 442 200 -192 -724 -337 545 518 268 3 -933 -522 684 364 437 84
1241H4j066O89N29J65J52p29k01lK70N49k06j54j70j99J15J34J79J03n3k27k11
$$ 84 -982 -293 236 401 553 -176 -377 -380 -110 439 233 79 -91 -290 -175 -41 138 241 188 -39 -250
1262b50j49K14O71l9l58j71p06L69J053j13j44m72q47M94Q21K62Or20m72L43L17
$$ -250 -399 -185 486 447 89 -82 -788 -419 634 521 377 -95 -942 -448 373 635 641 -279 -751 -408 -91
1283i1R14k29r07L2l27N04O91k77j71m23q1K31J77K55j36n1l15QP1j80Q25k12
$$ -91 823 594 -313 -281 -608 -104 587 310 139 -284 -365 -134 43 298 162 111 -204 -196 -125 -305 520 308
1305C08l71K01r06N10O76j61L94q77m95M70J37P68L9r20k66L6K63P27J66p44l10
$$ 308 -63 138 -768 -258 418 257 651 -226 -721 -251 -114 654 693 -227 -493 -457 -194 533 699 -45 -355
1326c55l7K2P59J38m44m1n53J61N91k47M96k39q22N51l23K04Q86o47p5j94n36
$$ -355 -392 -370 389 527 83 42 -511 -350 241 -6 490 251 -571 -20 -343 -139 747 100 25 -169 -705
1347g05P11L64J5p1o13l60N02M72qK83q85m15Q47l77P23J44j204O77l71m9R69
$$ -705 6 370 385 314 -299 -659 -157 315 307 590 -295 -710 137 -240 483 627 -577 100 -271 -320 649
1368F49p65J82J53o04L79K5j90M06J52n59P6j53k71J118j97m08J83j139O67R11
$$ 649 -116 66 219 -385 -6 19 -171 235 387 -172 -96 -249 -520 598 401 -7 176 -963 -296 615
1388F15m22M89r27p88R66J73M88J27j230p5L23K44Q07l91q05J59p8K71P52o12
$$ 615 193 682 -245 -1033 -67 106 594 721 -509 -584 -261 -17 790 399 -406 -247 -325 -54 698 86
1408H6m38N68o29M38N47j149Q03N1p06R72r08j31J003n60L90j50r21M66M86M0
$$ 86 -352 216 -413 25 572 -577 226 277 -429 543 -365 -496 507 -53 337 187 -734 -268 218 258
1428B58K64m92r13O42M69m9O82j149n26Q97l35Q18O3j204M39j24J85P11o69r1
$$ 258 522 30 -883 -241 228 179 861 -288 -814 83 -252 566 629 -575 -136 -260 -75 636 -33 -124
1448a24P8k28N24j01m27L52J2j25L16m82k80P29n7j9J64j063L42P41l30P48q19
$$ -124 -46 -274 250 149 -278 74 86 -39 277 -205 -485 244 187 168 332 -731 -389 352 22 770 -49
1469d9r87J157k74N28O23j705J87M90k06J020l24j028J58L71L2N87k49j113Q41
$$ -49 -1036 121 -153 375 998 -707 -520 -30 -236 784 460 -568 -410 -39 -7 580 331 -782 59
1488E9p8o8R97j529L18O44p80J214p77p14R16l87N84M9q38o8L18M00J21J3r80
$$ 59 -19 -87 910 -619 -301 343 -437 777 0 -714 202 -185 399 448 -390 -458 -140 260 381 394 -586
1509e86K4P37j58Q06q12q13Q20m18R67J64j330N23k98J28J172q82l83L76n33O59
$$ -586 -562 175 17 823 11 -802 18 -400 567 731 -599 -76 -374 -246 926 44 -339 37 -496 163
1529A63N22r62J43J79m61Q62q8q69O50k13j95J006r55k54Q90q88P69K86j323Q78
$$ 163 685 -277 -134 45 -416 446 358 -511 139 -74 -269 737 -218 -472 418 -470 299 585 -738 140
1549A40k08k17J018q97j26L26l03M70J47m55j64L33k44L51K49r35P14k43k79J040
$$ 140 -68 -285 733 -164 -290 36 -267 203 350 -105 -269 64 -180 171 420 -515 199 -44 -323 717
1569G17j170M06M20r28J123o42l27P76o68N25l4m71K39k1J90l8O9n18J98M61n80
$$ 717 -453 -47 373 -555 568 -74 -401 375 -293 232 198 -273 -34 -55 135 97 166 -352 -154 307 -273
1590b73P99o43n22J165q62N03L38j222Q21m4k05O18n89j87K94N5R4P2l78j53M50
$$ -273 526 -117 -639 526 -336 167 505 -717 104 60 -145 473 -116 -303 -9 46 140 212 -166 -319 131
1611A31p1J29j8n75L55J36OK58n90lK83r1M46l06m79L88p3J70L17n48k23L90j6
$$ 131 60 189 171 -404 -49 87 93 351 -239 -242 41 -50 396 90 -389 -1 -74 96 413 -135 -358 32 16
1634A6J13K37p07J5M99k44M23k42n77M56n7L04P3n33N2o0L86J82l05r1k65L10
$$ 16 129 366 -341 -326 173 -71 352 110 -467 -11 -68 236 309 -224 -172 -232 154 336 31 -60 -325 -15
1656a5K42j2j35l83K43J9K55J23o81K66M1m9N44n32j86K50j31L65j0l68m8J13
$$ -15 227 215 80 -303 -60 -41 214 337 -344 -78 -37 -86 458 -74 -260 -10 -141 224 214 -154 -202 -89
1678h9J81J06q9l26rK44J05J29k95k06J36R2K73r0k81q7J07K27J3nk74r2L16j8
$$ -89 92 198 109 -217 -226 18 123 252 -43 -249 -113 -21 252 162 -119 -206 -99 128 141 136 -138 -230 86 68
1702F8O7j32j52J25MK51k63j45K98l07L82j5m95L68j78K07K06m83J65j93K02L60
$$ 68 135 3 -149 -24 -20 231 -32 -177 121 -186 196 181 -314 54 -124 83 289 -194 -29 -222 -20 340
1724C40m05J64m15J19N53m72M04l62m26P59k32J03nl14O3J6N76n79o6M90q79Q96
$$ 340 -65 99 -316 -197 356 -116 288 -74 -500 259 27 130 125 -189 -126 -110 466 -113 -179 311 -568 328
1746C28P9q94P51n09J57N56o38K24l04R1M97l35J74m04j17N48j77K57k06n62L92
$$ 328 407 -487 264 -245 -88 468 -170 54 -250 -159 338 3 177 -227 -344 204 27 284 78 -484 -92
1767i2K03j0J12j50m71J42P39n03mM35j070N97O91j026O49j03p06Q90k53j23K08
$$ -92 111 101 213 63 -408 -266 473 -30 -34 401 -669 -72 619 -407 242 139 -567 323 70 -53 155
1788A55m02L16k9j2O3l10K73m9N8R7l99J80J25o3P2M6k92j31O97m60j48P39j001
$$ 155 -247 69 40 28 91 -219 54 5 63 160 -239 -59 66 3 75 121 -171 -302 395 -65 -213 526 -475
1811d75K35Q50r75L01M56p67L24M10n95J16L82m12K27O9m09K70QJ23K5l06Q5j83
$$ -475 -240 610 -365 -64 392 -375 -51 359 -236 -120 262 -150 77 146 -263 7 15 138 163 -143 -58 -241
1833b41M08J23m04K92n84J47P71n09K4K2m50J92O34j36o52M94l03l09J226o69
$$ -241 167 290 -114 178 -406 -259 512 3 27 49 -401 -209 425 289 -363 131 -172 -481 745 76
1853G6n11O88o30L64M87n65Kj39K19K29j53J08n23K03L97k63L79n70k01O20l15
$$ 76 -435 253 -377 -13 474 -91 -89 -228 -9 220 67 175 -348 -145 252 -11 368 -202 -403 217 -98
1874i8M60j87n71K98r0O22l04k39K67r36J037K40q38P66p97n2P35j92J12m03J00
$$ -98 362 175 -396 -98 -188 434 130 -109 158 -778 259 499 -339 427 -370 -422 313 121 233 -170 -70
1895g0j47J39N93p43L04j48k72P56n21J87K7m79N96k28K5R7l10K61q0P7L8k09
$$ -70 -217 -78 515 -228 76 -72 -344 412 -109 78 105 -374 222 -6 19 116 -194 67 -13 64 102 -107
1917a07L2J48l8q5K63m07J5M98n55L57P7n84M93q6j02K72k26m1PM2L7Q3k4k14
$$ -107 -75 73 35 -50 213 -194 -179 319 -236 121 198 -386 107 21 -81 191 -35 -76 -69 -27 10 93 69 -145
1941a45J71j41R8K81m15K40p5l32O30l61J3L58p64N69j2l93P66p37J42L67o62
$$ -145 26 -115 -17 264 -151 89 14 -318 312 -49 -36 322 -442 127 115 -278 488 -249 -107 260 -402
1962d02P18l13j21L11m73M51k84J57J11m61O33o13K98K45o69Q78p60K40L84q90
$$ -402 316 3 -118 193 -280 171 -113 44 155 -306 327 -286 12 257 -412 466 -294 -54 330 -560
1982e60J091o76j24P83j026P28p7m34O01n19L12n4j57K87l83L41q2j01J83l61
$$ -560 531 -145 -269 514 -512 216 139 -295 306 -213 99 45 -112 175 -208 133 51 -50 133 -228
2002b28L24q6m6L05m90J31J70k13L81k20j94J79k35M09Kl85L36l91Q9N21m00Q5
$$ -228 96 10 -36 269 -221 -90 80 -133 248 28 -166 13 -222 187 189 -196 140 -251 -162 359 -41 44
2024D4j00j83K98KJ66l12r3K28j62L40j35k08Q1j33L99j86j00J70m01L80P1j74
$$ 44 -56 -239 59 61 227 -85 -178 50 -112 228 93 -115 -34 -167 232 46 -54 116 -285 95 166 -8
2046hN1k41K24jO5P2l75J06J27Q0k1n7o6k30M06K2k00J48l19J62R8M6Q6l95K13
$$ -8 43 -198 26 25 90 162 -213 -107 20 100 79 22 -44 -274 132 154 -46 102 -217 -55 43 89 175 -220 -7
2071glm7K49k05j4q1J53P4k48K78k18n7L01k21O8o3J9J34k21K39j49k20M57k25
$$ -7 -10 -57 192 -13 -27 -108 45 119 -129 149 -69 -126 175 -46 22 -41 -22 112 -109 130 -19 -239 218 -7
2095gp4K10k81J08J11o2O9k06J00O6q4J53j21n4KJ13M9k04K30j78p2L52k79N5
$$ -7 -81 129 -152 -44 67 5 74 -132 -32 34 -50 103 -18 -72 -70 43 92 -112 118 -60 -132 220 -59 -4
2119dKj08K72k27J33jl57M70q6j86K36k44o3K86l1j09M0j31OK40j23O6j15j98
$$ -4 -2 -110 162 -65 68 67 -290 180 94 -92 144 -100 -163 123 92 -17 23 -108 -102 138 15 81 -34 -232
2143b32L59j21k7J73l31P5J86p0K3pj13PJ58o9P2j34r8L46l10J51J91n97N40m0
$$ -232 127 6 -21 152 -179 -104 82 12 35 28 -85 -78 80 11 83 -51 -149 197 -113 38 229 -368 172 132
2167A32l24M82m54M6K67k56K70j73j14J41m6Q0Ol6j90J69J05k50L48k95j15M28
$$ 132 -192 290 -164 -118 149 -107 163 -10 -124 17 -29 51 57 21 -169 0 105 -145 203 -92 -207 221
2189B21m07L07l4l46M74l47J08K54m79L34j2k08K78j61n7J00K0k8Qoj34K18r8
$$ 221 -186 121 87 -259 215 -132 -24 230 -249 85 73 -135 143 -18 -75 25 45 17 25 19 -115 103 5
2212Ek5J64l53K51N2k39L45k83o1K71k28J66Ok03J38j9j0R2q8n7J17m8m3J41j61
$$ 5 -20 144 -209 42 94 -145 200 -83 -144 127 -101 65 71 -132 6 -13 -23 69 -19 -76 41 -7 -50 91 -70
2237g0K3J60j92J33k3j56K07r6L2M8j84J33lJO6j21J0KO3J6l8J6j36J37Nn9J37
$$ -70 -47 113 -79 54 31 -125 82 -14 18 66 -118 15 12 13 79 -42 -32 -30 33 49 11 27 -109 28 33 -26 111
2264A11k17P6Q0j21J86j65mQ6j12J79j43MP2j27K12j45j8Q4j57K36j18k6P8j97
$$ 111 -106 -30 50 -71 115 -50 -54 32 -80 99 -44 -40 32 -95 117 -28 -46 38 -119 117 -1 -27 51 -146
2288a46K20m4j9P2k18J66l6M0P0k12J30r3R9Q2j94J70k04Q1J58k20K06j65l8J97
$$ -146 74 30 11 83 -135 31 -5 35 105 -107 23 -70 29 111 -83 87 -117 -36 122 -98 108 -57 -95 102
2312A02j82J52q9o9J40q9Q9q3j1M0j3J03j35N1ko9J82j25J8Kj24J94n5j3M7j66
$$ 102 -80 72 -17 -86 54 -35 54 -29 -40 0 -13 90 -45 6 4 -65 117 -8 10 12 -112 82 27 14 61 -105
2338a05R0N6l9L7n7l6M6M2k2j0j7l3N2J1k0Pl3K4N1p5L5l7k5J25n7m2L4r9J24
$$ -105 -15 41 2 39 -18 -54 -8 34 12 2 -15 -48 4 15 -5 2 -31 -7 44 -31 4 -33 -58 67 10 -32 2 -97 27
2367B7M3o6L4j07M0O4J5Oj00K4j5O0N9r5J9o9N6N7m3J8q7M5L3l8N5p7jO0mml5
$$ 27 70 4 38 -69 -29 35 50 56 -44 -20 -35 25 84 -11 8 -61 -5 52 9 27 -60 -15 18 -20 35 -42 -43 17 13 9 -26
2398b6j3j0R3Np3lm7O6P9k0p6l9N3mJ08j6j50N0rM8O2m7l8o0Q6J6j6M1j27M7M0
$$ -26 -39 -49 44 49 -24 -27 -74 -8 71 51 -25 -64 -11 -15 93 77 -73 -23 -32 16 78 31 -7 -67 19 35 19 60 -67 -20 20
2429B0k5L3o1J8j3N9j0r9J15r3N6J02j85P3nk5R6l3k2r0P8K7j5J11j59k4P9jM3
$$ 20 -5 28 -33 -15 -28 31 21 -78 37 -56 0 102 -83 -10 -15 -40 56 23 1 -89 -11 16 1 112 -47 -71 8 7 50
2458E0l5K1j01M1J27j46R5k3j30J64n0m7O8n5J9K5k1n4J8N9m8P3m4r5P9QJ6L9
$$ 50 15 36 -65 -24 103 -43 52 29 -101 63 13 -34 34 -21 -2 23 2 -52 -34 25 -23 50 6 -89 -10 -2 14 53
2486E3q0m2K7P8Ol6K0j14L6J55j20N0Rj51J23K8m8L4l0j2jO5n7j1O7r1P2Kj09
$$ 53 -27 -69 -42 36 42 6 26 -88 -52 103 -17 33 42 -109 14 42 -6 28 -2 -14 -15 50 -7 -18 49 -42 30 32 -77
2515g7Q2j1J9K1n0l6j0J14k0k7K6j45N9J22p5N4m2j03O6O9k0kPp2J4R2l6NRo1
$$ -77 5 -6 13 34 -16 -52 -62 52 32 5 31 -114 -55 67 -8 46 4 -99 -33 36 16 14 21 -51 -37 55 19 24 33 -28
2545b8OP4n7j6Q0q9L0N5j17N6M2m5K9lp1KJ05n6MN1j69P5R7r0R4o8m8L2K1N7m7
$$ -28 -22 52 -5 -21 59 -30 0 55 -62 -6 36 -9 20 17 -54 -52 53 -3 1 52 -117 -42 55 -35 59 -9 -57 -25 -4 53 6
2576FOk5o3J30l2l9Q1q8oP0l6kM7m4k7N4n9LQ2o4kL5j03M7P2m8M2m8o7P0mL3Q
$$ 6 12 -13 -76 54 22 -17 64 -24 -30 40 4 2 49 5 -22 32 -27 -24 58 -6 -8 27 -76 -29 43 -5 37 -11 -78 -8 -12 21 29
2609B9o2J4m1M8O1n4J4k4m4Q4k8ML1n3pM1k1J8M6p4J1M0r7R0K5r1R6n2o9Q1Kj6
$$ 29 -33 -19 -60 -12 49 -5 9 -15 -59 25 -3 1 32 -21 -28 13 -8 10 56 -18 -7 33 -64 26 51 -40 56 4 -65 16 18 2
2641BL1k8p0N8J6j9M4m9k3j1O4J6l8M4p7k1J09p1L7L8j12L5O5q0M7N9j16M3O2
$$ 2 33 5 -65 -7 9 -10 34 -15 -38 -49 15 31 -7 37 -40 -61 48 -23 14 52 -60 -25 40 -40 7 66 -50 -7 55
2670E5j06P1M7r0L0L1r6M4O9o5J6M4j16K5P6m0J3J1m6m2Q7mm1P9j05k5J21q5M5
$$ 55 -51 20 67 -23 7 38 -58 -14 55 -10 6 50 -66 -41 35 -5 8 19 -27 -69 18 14 -27 52 -53 -78 43 -42 3
2699CN2r6J0M8k5LM9m8l2P4m3j3P4o2j2O4n2qO1k3j8J3j7l1K5M0n3L3j3q8J09
$$ 3 55 -41 -31 17 -8 -5 44 -4 -36 38 -5 -18 56 -6 -18 46 -6 -14 47 24 6 19 2 -29 -4 36 -17 16 3 -85 24
2730B4ll6O1r3QL9KRj0kn5M9L6o7R0n0m4P3m4RL5k7Lk4L3k5MN2p0M3oo1O1Nk1
$$ 24 21 -15 46 -47 -39 0 2 11 1 -1 -56 -7 29 -38 52 2 -42 31 -13 -4 31 4 7 -17 16 -9 -5 47 -23 20 14 -47 14 19 -2
2765bK6l3j3RL7k0oJ2o3K3O8n3J6J5p5N8K0k6K4k9nQJ5Lk7M2k5j4N0p0L5K5k3
$$ -2 24 -9 -22 -13 24 4 -2 10 -53 -30 38 -15 1 16 -59 -1 19 -7 17 -12 -17 -9 6 9 -18 24 -1 -15 35 -35 0 25 2
2798BJ7k7J8k3K1L8p3M4l2k7Q1l6j6K2m2J9K8ll6J5Pm0O0lm8M3l2k4N6pk8M6k3
$$ 2 19 -8 10 -13 8 46 -27 17 -15 -42 39 3 -13 9 -33 -14 14 11 -25 -10 -3 -43 17 14 -34 9 -23 -47 9 2 -26 20 -3
2831cjMPj4J2K8n1J0L7o9N4K4o8M5k1nK6J1k8rQk4J9M6p7K0K8n5P0j8k8K3l2J4
$$ -3 -4 0 7 -7 5 33 -18 -8 29 -40 14 38 -30 15 -6 -11 15 26 -2 -11 -3 -27 -8 38 -39 -19 9 -46 24 6 -22 1 -31 -17
2865a7J8Ok5oL1j5JJ9k6J3K7l5oK7k7J8K1k2j1K0k1PM4n1j3L9m0K4K4m3J2mqJ5
$$ -17 1 7 -18 -24 7 -8 -7 12 -14 -1 26 -9 -15 12 -15 3 24 2 -9 11 -10 -3 41 -10 -23 16 -24 0 24 -19 -7 -11 -19 -4
2899dQk1oJ0oJ1K1m1J3J9l2K1lj1J5K5j4k4M9m2KO7p2lL2m0L4K9l2mMj2LL6l9
$$ -4 4 -17 -23 -13 -19 -8 13 -28 -15 4 -28 -7 -10 -21 -6 19 5 -19 30 -12 -10 57 -15 -18 14 -26 8 37 5 1 5 -7 -4 32 -7
2934gj2K2k9L1Mk8RnjJ4j5J6k5L8j9k1L5j8oL5k6j0K0j5LL9k3j4J8j2kM2l5j7
$$ -7 -19 3 -26 5 9 -19 -10 -15 -16 -2 -17 -1 -26 12 -7 -28 7 -11 -17 18 -8 -18 2 -13 -10 29 6 -8 10 -2 -4 38 3 -14
2968a4K5k6K5Rk5J2k1lK4j3J6j6j4K5l4J8K3m1L1j4j7K6qj4J8J0k9K5Kl3M4ok8
$$ -14 11 -15 10 19 -6 6 -15 -18 6 -7 9 -7 -21 4 -30 -12 11 -30 1 -13 -30 -4 -12 -26 -8 2 -27 -2 0 -33 11 5 -23
3001b3M5m4K0L5l9L0j6k7M2prnrmRqK4ok2K7k8jJ8k5K8kk9PJ9k8K9Pn1M1mj0M0
$$ -23 22 -22 -2 33 -6 24 8 -19 23 16 7 2 -7 -11 -2 -10 14 8 -14 13 -15 -16 2 -23 5 3 -26 -19 0 -28 1 8 -43 -2 -6 -16 24
3038B4m6J5K0m5M8pk1K9k6J4J9j1j8K4k3RK3m0J6J4l8L1rl0L9k2PK4m3NRpRLk1
$$ 24 -22 -7 13 -32 16 9 -12 17 -9 5 24 13 -5 19 -4 5 28 -12 4 18 -20 11 2 -28 11 -11 -4 20 -23 -18 -9 -16 -7 -4 -25
3073b5Rj2J4L2l0mJ1j6K9jj6J0%j2K3Qj7%lMK9k6jPk5L2ml3K9j7J4J5k7loJJ3
$$ -25 -16 -28 -14 18 -12 -16 -5 -21 8 7 -9 1 1 -11 12 20 3 3 0 4 33 7 6 13 -12 20 16 -17 12 -5 9 24 -3 -6 -12 -11 2
3110Bjj2Mk0OL6k5njj7L4Oj5lJKMJ2j5QqJK1lk0J2k4L1Oj9Pj7J0L2k6kJ2k9J5
$$ 2 1 -11 -7 -27 -21 15 -10 -15 -16 -33 1 7 -8 -11 -10 -8 -4 8 -7 1 -7 -6 15 12 -8 4 -20 11 17 -2 5 -12 -2 30 4 2 14 -15 0
3149@J1qj2onJ7J6l1Rk1JL6ooOl0K6K1k3Qj0lK8j3Rkl3K3K1k2J1j5j0K9Nj1jj5
$$ 0 11 3 -9 -15 -20 -3 13 -18 -9 -30 -29 7 1 -5 1 -29 -3 18 -5 3 -7 -10 18 5 14 12 -21 2 23 1 12 -3 -13 16 21 10 9 -6
3187fj1K8Pk6MpKK7j3Lj8k6K7PJ0lk5JK9j6J8qk1J3J3lpnMJ3j0RKk1PK4j4Okl4
$$ -6 -17 11 18 -8 -4 -11 -9 18 5 8 -10 -36 -9 -2 8 5 -20 -19 10 -6 12 4 -17 -4 9 6 -1 -6 -2 11 1 10 12 -9 -2 22 8 14 12 -22
3227b2K4NpMqj2J5oJ1Lk0jJ2kmJ9l2J4lOJ9k6jJ5j5K1Rk6OKj1K7J2k4JJj4L0k0
$$ -22 2 7 0 4 -4 -16 -1 -7 4 7 -13 -14 -2 -4 -8 11 -21 -7 -10 -4 15 -11 -12 3 -12 9 18 -8 -2 0 -11 16 28 4 5 6 -8 22 2
3266BKQk7K5J7l0J3j5mK3j6lNk2J5J2k3J6nk0M0j2j3J8k8LM2k5jQk6K1K0j4Mk3
$$ 2 4 12 -15 10 27 -3 10 -5 -9 14 -2 -5 0 -22 -7 5 -18 -2 -7 -27 13 1 -12 6 -22 -19 23 -2 -3 5 -21 0 20 6 10 -13
3302a3j2L8%j4J4m5L1J6k2L4k9j6K8J3pkm6J4L5k9L5k6l2L0LML0o3mM3j5K2ql6
$$ -13 -25 13 13 -1 13 -32 -1 15 -7 27 -2 -18 10 23 16 14 -32 -18 17 -12 23 -3 -35 -5 -2 2 32 -31 -35 8 -7 15 7 -29
3336b9J8K2j1K1j3l4L9j1RL3p0J9J4oL1k3l8L8nJ7ql0lNKL7k7l6K8m%M4n3nK4
$$ -29 -11 11 0 21 8 -26 13 2 11 44 -26 -7 7 1 32 9 -29 9 4 21 13 -17 -20 -15 -13 24 -3 -39 -11 -15 -15 29 -24 -29 -5
3371ej6L3Mm0PPPK0j2k3K0oJ9K5n6PJ0jK3qj6Jj7L4J1l4J3j2j2K8Lk7RnjL2m0
$$ -5 -21 12 16 -24 -17 -10 -3 17 5 -18 2 -4 15 40 -16 -9 1 0 23 15 -1 0 -17 17 28 -6 7 -5 -17 11 14 -13 -4 -9 -10 22 -18
3408a8lK7k2K1J5k7lLj4L6rk8K6j2%M0l1NJj7K8Lj0j0mKK7j9nKoPJ2k9Q%j9K7
$$ -18 -21 6 -16 5 20 -7 -10 -7 -21 15 6 -22 4 -8 -8 32 1 6 7 -10 18 21 11 1 -3 -1 26 7 2 4 -2 5 17 -12 -4 -4 -23 4
3446Dqk3J0%J5J6k6OKj7K9roJ4k5K5JpkoLJ6j0QqqJ5JrLJ1npJ5k2NJKjrNkpOR
$$ 4 -4 -27 -17 -17 -2 14 -12 -6 -4 -21 8 -1 -7 7 -18 7 8 1 -1 -7 -4 12 2 10 2 -6 9 10 1 4 15 10 3 18 -4 1 2 4 3 -6 -1 -3 -10 -4 5
3491Ek0K2k2oL0k4KQj6J7lJ1k1LK6j1mNpJ7qOj8MJ9j1J5j3j5NmK7%l4K4j1j7M6
$$ 5 -15 7 -15 -21 9 -15 -13 -5 -21 -4 -7 4 -17 -14 12 1 -3 2 -5 12 4 10 -8 -4 15 4 19 6 -9 -4 -8 19 19 -15 9 -2 -19 27
3529B7k9pJ7k1J6Nk7J0jpK4pj1j5J7KlL0m3J3J3jJ5qoOkK4k0k2K5k7L8mk6J0j0
$$ 27 -2 -9 8 -13 3 8 -19 -9 -10 -17 7 0 -11 -26 -9 -7 -10 20 -23 -10 3 2 17 9 3 9 7 31 11 -11 14 -13 25 21 -5 5 -5
3566eNK7j3j2mKqJ9nj7KlkK3j8oMKJ4jjqlnK8l0K1nnL1k0rJ1k0K7Rk4MMk7K6J5
$$ -5 0 27 14 2 -2 0 -8 11 6 -11 -9 -12 -14 9 -9 -15 -11 -9 5 4 3 -5 -8 -13 15 -15 6 1 -4 27 7 -2 9 -11 16 25 1 5 9 -18 8 23
3608B3j9JnmJ9pnqj3%K7k0PJ1k1J1Qj4J9k8J8J5l5K9j9j8M3mj0Lj8J4J6j3ONj0
$$ 23 4 5 0 -4 15 8 3 -5 -18 -18 9 -11 -4 7 -14 -3 5 -9 10 -18 0 15 -20 9 -10 -28 15 11 1 4 -14 0 16 3 9 14 4
3645DJQj0pMj4L2k3OPk2JJ8k5L4k7j3L4k9K0J1l8K5Mk6L7j3rJ7k1PQkLJ5j6qJ6
$$ 4 5 13 3 -4 0 -14 18 -5 1 8 -14 -13 5 -20 14 -13 -26 8 -21 -1 10 -28 -3 1 -25 12 -1 -10 7 -14 -7 1 -1 2 17 1 -7 9
3683IqNLj6J8j8OK1k8KJ5k6L3jk2J5j1j4J8k1QNrJ6qjmkJ1qMNj4J9rJ5qnNj7L3
$$ 9 1 6 9 -7 11 -7 -1 20 -8 -6 9 -17 16 15 -7 8 -3 -17 1 -20 -12 -7 -16 0 -8 -9 -13 -15 -4 -12 -8 -3 -17 2 -7 8 0 -5 0 -17 16
3724A6kk7L0k6J1J5j7J6j8k5L1Mmlj3J5j1QommJ4mJ0j6%j0J6Rj1Pj7K2qrJ1k1
$$ 16 14 -13 17 -9 2 17 0 16 -2 -27 4 8 4 1 -12 3 -8 0 -6 -10 -14 0 -4 6 -10 -10 -20 -4 5 -6 1 -16 6 -2 -11 0 -21
3761b1J6J3kJlj6PK6%j3Jj1OJ5j1pJk0K0%mJmj1PJ6j5%j2jK1lj0Oj1K5j1Lkj5
$$ -21 -5 8 6 7 4 -12 -5 21 21 8 9 -2 4 19 8 1 2 -18 2 2 -2 -1 -5 -16 -9 7 -8 -8 -20 -21 0 -3 -13 -7 -18 7 -4 -1 -3 -18
3801a8K8J%pj4QRKOj3j2K0kK2ol2J5j9L4k3JKk4K9mnLk3J7J6j7K3m0J0LJ3Jk0
$$ -18 10 11 11 4 -10 -2 7 9 15 2 -10 10 8 30 24 -8 7 -12 22 -1 0 2 -22 7 3 -2 1 -22 -5 11 -6 17 -23 -13 -10 3 4 -16
3839a6J0QmK5k8KJ0j9K2Jj6Rj3J5J3j6Qj7jK3lOk7lLOQj2JNj1J7lj2KpJ9oj7J3
$$ -16 -6 2 -2 23 -5 -3 7 -12 10 11 -5 4 -9 6 19 3 11 -6 -7 16 13 19 -8 -11 -8 -2 6 -6 -5 0 -11 6 3 -9 -7 -14 5 -1 -18 -5
3879ej1%J1j1KJ6rJ4JqmoK3%Mrq%LJ5lk0QoJ3nj2J0roK0onLqQj0JOrQ%j6J4Ko
$$ -5 -16 -16 -5 -16 -14 2 -7 7 8 0 -4 -10 13 13 17 8 0 0 3 18 15 -5 3 -3 10 5 -7 3 -6 -12 8 2 -3 0 -8 0 -10 -9 -3 -12 -4 -4 -20 -6 -4 -10
3925a0J0Qj7NJjK1nj3j7RQJ5lj6J3jRJjj3j6P%J6j0j3mJ2%nKOjKmJj2MRJ0j4r
$$ -10 0 8 -9 -4 -3 -4 17 12 -1 -18 -9 -1 14 11 -5 8 7 16 17 16 3 -13 -6 -6 10 0 -13 -17 -5 -5 -10 -8 -2 -3 -1 -5 -4 -16 -12 -3 7 -7 -16
3968a6LJ0OKllLpJ5J1k1PrKJ9j4Pj6nRJ0nJ%j2llLJ2j7kJ5k1J0llJ4j1j2J7J1
$$ -16 -13 -3 3 5 2 -1 2 -5 10 21 0 7 -2 0 19 5 12 -4 -9 0 10 5 6 6 -6 -9 -12 -9 3 -14 -16 -1 -22 -12 -15 -18 -4 -15 -27 -10 1
4009AoPk2J8Rj8K2ojn%jQPj5JnJ0J4j9JJ4l3K7kj4K5j7j0J5j9J2Lj9P%%K%J1j1
$$ 1 -5 2 -20 -2 7 -11 11 5 4 -1 -1 -2 6 13 -2 -1 -6 4 18 -1 0 14 -19 8 6 -8 17 0 -10 5 -14 -2 1 -18 -11 -11 -11 -9 -9 2 -9
4050inKKjJ2mmJ1Oj7K1j1kRk0K3lj1NloJ1%pqL%MqRj1qJ1LojlQMnlNJOJ1j9RK
$$ -9 -14 -12 -10 -11 1 -3 -7 4 10 -7 14 3 1 10 -10 13 10 -1 4 1 -5 6 6 -1 -9 -6 -6 -2 -10 -1 -12 -20 -9 -6 -12 -13 -16 -8 -4 -9 -12 -7 -6 0 11 -8 1 3
4098CrPRj7J2nPMnONk1J0qJ0koJ0oqJ5j4JOpkpP%kQj0Lj0K3j1K%kJ3Pj0OplQn
$$ 3 -6 1 10 -7 5 0 7 11 6 12 17 -4 6 -2 8 6 0 10 4 -4 11 -3 -2 4 -3 -5 -12 -5 -5 -7 1 -9 -6 -16 7 -4 -2 -2 -4 9 16 6 12 5 2 10 5
4145EMOj2MLjnlQQlj2MmnJ1Nj4j0J5KoqJqMKJ2j1m%PoJ3nKKKRj1Rj%%jLjkQj1
$$ 5 9 15 3 7 10 9 4 1 9 17 14 2 6 2 -3 8 13 -1 -11 4 6 0 -8 -7 -15 -11 -9 3 -8 -12 -12 -5 -11 2 -3 -1 1 3 12 1 10 9 9 9 8 11 10 8 16 5
4195EoNjMqPlpRkOj2KqKlJ6j0pPoLJ0j3%JOKLnKrJ4%QrkRlLpOJo%KNj2J0nj2P
$$ 5 -1 4 3 7 -1 6 3 -4 5 3 9 -3 -1 -9 -7 -10 6 -4 -11 -4 -10 -7 3 -10 -10 -9 -3 -1 2 -3 -1 -10 4 4 12 3 1 10 7 10 3 9 10 4 4 6 11 -1 9 4 -8 -1
4247aqLjlO%nmKJ2mnKlkRJ0j1llJ6Rk1K4j1j9J6Nj3J3jlQpoJ0qJ6k1mJ4mj0mQ
$$ -1 -9 -6 -7 -10 -4 -4 -9 -13 -11 1 -3 -8 -6 -9 -11 -2 8 -3 -6 -9 7 16 -5 19 8 -11 5 10 -3 10 9 6 14 7 1 11 3 19 -2 -6 8 4 -6 -10 -2
4292bm%j7K2j8J0llQPqJJ4rpK2k4QMmJ1loJ0j0K0j9rJ7MlkNj0mJ4j5J0j7MKj1
$$ -2 -6 -6 -23 -1 -19 -9 -12 -15 -7 0 -8 -7 7 -2 -9 13 -11 -3 1 -3 8 5 -1 9 -1 19 0 -9 8 12 9 7 12 2 -2 12 -3 7 -10 -6 -4 -15
4334a5J9kj4J5j8QOj6J0rPmJ6rNMjk%mmOJ5j7J0QrkJ0j7J1Pj4J1Jpl%oJ2ooKN
$$ -15 4 2 -12 3 -15 -7 -1 -17 -7 -16 -9 -13 3 -6 -1 3 2 0 0 -4 -8 -2 13 -4 6 14 5 3 13 -4 7 14 0 11 12 5 2 2 -4 8 2 -4 -2 3
4378C%j1NJooOlJ1rjJ0pJ1Lj0nROMkj3MNJJJpNjOQj0pkmLl%J0k4K6j9JNnOj1P
$$ 3 3 -8 -3 -2 -8 -14 -8 -11 0 -9 -10 0 -7 4 7 -3 -8 1 7 11 9 -4 0 5 6 7 8 1 6 5 11 19 9 2 0 -4 -1 -4 -4 6 -18 8 -11 -10 -5 -10 -4 -15 -8
4427hkR%njNj4NRnKpJ1J0%mrNRomNKj0JNpkQj0pJ0rKmNNJlJMjLj3N%kRlMoKJ2
$$ -8 -10 -1 -1 -6 -7 -2 -16 -11 -2 -7 -5 -12 -1 9 9 5 -4 1 10 4 0 5 7 -3 -2 3 -4 -6 2 -8 -15 -5 -14 -12 -16 -11 -6 -5 -8 -7 -3 -4 -1 -14 -9 -9 -11 -2 -5 -1 -7 -5 7
4480GlOj0LKjJ5k2JkQJ1j0Oj2oRNj3L%nKMpqK1j0nMjmM%MlPjlJ0j2J9p%JlKOP
$$ 7 4 10 0 3 5 4 19 -3 -2 -4 4 15 5 11 -1 -7 2 7 -6 -3 -3 -8 -6 -2 -9 -17 4 -6 -11 -7 -8 -12 -8 -8 -4 -7 0 -1 -4 6 -6 13 6 6 7 4 6 12 19
4529A9k8K0k%lJ1Nk0NloNkNj3QlrRMj6JOJ2jn%njnMJ0kLrJ6jKppJ6j0MPkmL%q
$$ 19 -9 11 9 9 6 17 22 2 7 4 -2 3 1 6 -7 1 -2 -11 -2 2 -14 -13 -7 5 4 -1 -1 -6 -7 -12 -8 2 0 3 -6 10 9 11 4 -3 13 3 7 14 12 8 11 11 3
4578CQnkJ0rj1NJKJk2J1mJ0llpjlJ2mRj0J3qnJ1lJ6j8J4klJ0j8J8poMjNnlQqJ2
$$ 3 11 6 4 14 5 -6 -1 0 2 3 -19 -8 -12 -2 -5 -8 -15 -16 -19 -7 -11 -2 -12 1 -7 -12 -1 -4 12 -6 8 6 3 13 -5 13 6 0 4 3 8 3 0 8 0 12
4624A2j5Mj0KOj5%MKOpNJ1j7QpNLkq%J4jlJ1j7K1qjkOj0OPpMLj0NjnJ2j5%MMj3
$$ 12 -3 1 -9 -7 -1 -16 -16 -12 -10 -4 -11 -6 5 -12 -4 -11 -6 -3 -5 -13 -13 1 0 -3 8 -9 12 4 3 1 7 -3 3 10 3 7 10 0 5 4 -1 11 -4 -4 0 4 -9
4671i%Lj0PMopLOj0J2koJ3pJ2kqOj2K3lkJ0k0J9j2jMj5J4OKqrjOJmqNnMJ0k0J9
$$ -9 -9 -6 -16 -9 -5 -11 -18 -15 -9 -19 -7 -9 -15 -2 -9 3 1 -7 -1 -13 10 7 5 15 -5 14 2 1 5 -10 4 10 12 4 -5 -6 0 1 -3 -11 -6 -11 -7 3 -17 2
4717Bj4Rj0J1rKJMlN%qKJ1j9OJ1oJ0mjJ0j1PJjNpKMj0J7k2Rj3J7lj9J5j7J5Rj6
$$ 2 -12 -3 -13 -2 -11 -9 -8 -4 -7 -2 -2 -10 -8 3 -16 -10 1 -5 5 1 0 10 -1 6 7 6 11 4 6 10 0 17 -5 4 -9 8 5 -14 1 -16 -1 8 -8
4760hJ9k0LLj5K2j0Kj3QjKlLpLOJ5j5J1NqNJRj5JJLmPjpLj1lNnJOj7PQnpJ6lL
$$ -8 11 -9 -6 -3 -18 4 -6 -4 -17 -9 -10 -8 -11 -8 -15 -12 -6 9 -6 5 10 2 7 8 17 2 3 4 7 3 10 9 2 5 -6 -9 -4 -9 -8 -2 -19 -12 -4 -9 -16 0 -3 0
4808@lmMjpNNlQqJQ%mjNPqKj3J5j1J7j3Mj1JJ0j0KKp%kPknnJ1Lkj0NlJ0JqJ3j1
$$ 0 -3 -7 -3 -4 -11 -6 -1 -4 4 -4 -3 5 5 1 0 5 12 4 6 -7 8 -3 14 1 5 -6 -5 5 -5 -3 -1 -8 -8 -10 -3 -5 -10 -15 -4 -1 -3 -13 -8 -11 -1 0 -8 5 -6
4857fjNnJ4rPpJ4j6J0Mk3K7pkKj8LJ8j9J3j8JJ0mQj8LJ1kj1Rqj0PJPLP%j7J8j0
$$ -6 -7 -2 -7 7 -2 5 -2 12 -4 6 10 -13 14 7 5 7 -11 -8 10 -9 4 -14 -13 -3 -7 1 -17 -14 -3 -5 -16 -7 -15 -25 -18 -17 -10 -7 0 0 -17 1 -9
4900iJ8j9RJ0kJ1j7%jj%OqNLOo%j1J1qPqoRpJ5rprLQJomNRMrRj1J2oJ1m%lKnJ4
$$ -9 9 -10 -1 9 7 18 1 1 0 -1 -1 5 -3 2 5 11 5 5 -6 5 -3 4 -4 -10 -1 -8 7 -2 -9 -18 -15 -7 -6 -12 -16 -11 -2 2 -7 2 -9 3 -3 8 4 4 1 3 -2 12
4950A2okoJ2MpRj3Lj0%QMk2J0jpJ2pmPkkJ5j2j3LrK2ll%lJ1QqjJJ4jj4J0j3J2
$$ 12 6 4 -2 10 14 7 16 3 6 -4 -4 4 8 -14 -4 -5 -12 0 -7 -11 -4 -6 -8 7 -5 -18 -15 -24 -2 -5 -8 -8 -11 0 8 0 -1 0 14 13 -1 9 -4 8
4994HMjoPmkkkMjk0J9j2O%njjKqkK2k1J5j5J2kjRj5PRj4K3j2jQj7J7kOpKmkJ4
$$ 8 12 11 5 12 8 6 4 2 6 5 -15 4 -8 -2 -2 -7 -8 -9 -7 -15 -17 5 -16 -1 -16 -4 -6 -7 2 -13 -6 3 -11 12 0 -1 7 -10 7 5 11 4 6 2 0 14
5040A4mpJ0k4J5nQMj5J3k0QlpJ1j0J0j3JJ3j4J3j3QPj5J9j0qJ2%J0k1J2J2qjK
$$ 14 10 3 13 -11 4 -1 7 11 -4 9 -11 -3 -6 -13 -2 -12 -2 -15 -14 -1 -15 -2 -15 -7 0 -15 4 -6 -14 -2 -2 8 -13 -1 11 3 2 4
5078DQj0MKj0Rlj1OlJ3j9jJkO%pkJJ3j4Qj6JJ1mJ8j2qPLJ2k0K1j1LOmJ0oj1J2
$$ 4 12 2 6 8 -2 7 4 -7 -1 -4 9 -10 -11 -10 -12 -6 -6 -13 -15 -14 -1 -15 -7 -23 -22 -11 -15 3 -9 -17 -10 -7 5 -15 6 -5 -2 4 0 10 4 -7 5
5121ElJ6j9nQJKJlokJ3j8mjkQkJ2j0rPjJ3mj1OqK1j6%Oj0K4qQoj5J7lJ%jNnOj5
$$ 5 2 18 -1 -6 2 3 5 6 3 -3 -5 8 -10 -14 -15 -17 -9 -11 1 -9 -18 -11 -12 1 -3 -14 -8 -16 5 -11 -11 -5 -15 9 1 9 3 -12 5 2 3 3 2 7 2 8 -7
5168gJ2kPj2MKkj4J6nj4%MMmRj4NPj9J0J2qqoK2j0QOoJ0qJ8j4qJ3j3J1qM%j1J8
$$ -7 5 3 10 -2 2 4 2 -12 4 -1 -15 -15 -11 -7 -11 -2 -16 -11 -4 -23 -13 -1 -9 -17 -23 -1 -11 -3 3 -3 7 -1 17 3 -5 8 -5 6 -2 2 2 -9 9
5211IrLmnOj7J7Qj1Jj2KJ2rkmL%J0j0pJ7kJ1j3lQnJ7qjO%l%JJj0PQj2M%PnNKj4
$$ 9 0 3 -1 -6 0 -17 0 8 -3 -2 -14 -12 0 -9 -11 -15 -12 -12 -2 -12 -19 -2 -4 7 -6 -9 -1 -6 11 3 2 8 8 5 5 6 7 -3 4 12 0 4 4 11 6 11 13 -1
5259aokONrMj4J1lKoQM%pjpJ3j3NJ2j0J4k1J1J0jjj1J7j3NJpO%KJj2LkKLmjNm
$$ -1 -7 -9 -3 2 -7 -3 -17 -6 -9 -7 -13 -5 -1 -1 -8 -9 -16 -3 -16 -11 1 -9 5 -16 -5 5 4 3 -8 9 -4 1 2 -5 1 1 3 4 -8 -5 -7 -5 -2 -6 -7 -2 -6
5306flRKk4LJ1kKpRqRj0kJ1nJ2nOJ1k2J6nk%MJJLopOlmPnJKLqJkLonJ0Jj4NQm
$$ -6 -9 0 2 -22 -19 -8 -10 -8 -15 -6 -14 -5 -15 -17 -6 -11 1 -4 2 13 -9 7 2 0 0 4 5 6 9 3 -4 2 -1 -5 2 -3 -2 0 3 -5 -4 -6 -3 -9 -14 -4 -3 -17 -12 -4 -8
5357hJj0oJ5NjKkOlMmlMoNKQojKkpKJ2mj%qPjnJOqlJoOMj0Oj2J4klJ1kj1PPqP
$$ -8 -7 -17 -23 -8 -3 -4 -2 -4 2 -1 3 -1 -4 0 -6 -1 1 9 3 2 4 2 -5 -3 9 5 4 4 -4 3 2 -3 -2 4 -4 -7 -6 -12 -6 -2 -12 -6 -18 -4 -6 -9 2 0 -11 -4 3 -5 2
5410Bl%kMRj2MKljLLj1J1j0kPqJ4oqpJ1JorMJJ0ljJJrMkOJ2ppNPj8J7j8J5N%o
$$ 2 -1 -1 -3 1 10 -2 2 4 1 0 3 6 -5 6 -4 -6 1 -7 7 1 -7 -14 -3 -2 -8 -17 -13 -12 -2 -5 -6 -5 -4 -13 -9 -11 -5 7 0 -7 -2 5 -13 4 -14 1 6 6 0
5459@JMnJ2kmOj1qMoQ%Lqj7J2lOJ2j5Pql%QkllJ8JrLOj7JJ9j4PqJ4j3K1prJ0q
$$ 0 1 5 0 12 10 6 12 1 -7 -3 -9 -1 -1 2 -6 -23 -11 -14 -8 4 -11 -4 -12 -15 -15 -7 -9 -12 -15 3 4 -5 -2 4 -13 -12 7 -7 0 -8 6 -7 14 7 -2 8 0
5506@Oj2PLkqN%kqj2J0kJ1j7PJM%j3J7j3KNJJ1k%jkkJJ4j6LQmJ5j4RlJlrQqmL
$$ 0 6 -6 1 4 2 -6 -1 -1 -3 -11 -23 -13 -15 -4 -21 -14 -13 -9 -9 -22 -5 -18 -16 -11 -10 1 -1 -1 -2 -4 -6 -5 9 -7 -4 4 0 15 1 10 7 8 5 -4 4 -4 -8 -5
5554enPllkQoQj0kjJMj3MkJ8nJJj5J6pJ8nrJ1j1J2NqpKRLj1LqK2popoJ5oj3Rj
$$ -5 -10 -3 -6 -9 -11 -3 -9 -1 -11 -13 -14 -13 -9 -22 -18 -20 -2 -7 -6 -5 -20 -4 -11 7 2 -7 4 -7 5 10 2 -5 -3 6 9 -2 1 -7 15 8 2 -5 -11 4 -2 -15 -6 -7
5602gQj3KMnRj7RpJ1lj1J6j4J5okJ0j0J4NmPj3PpKLNk%KoLmpNRj8MKj2RnjmK0
$$ -7 1 -12 -10 -6 -11 -2 -19 -10 -17 -6 -9 -20 -4 -18 -3 -9 -11 -1 -11 3 8 4 11 -2 5 -2 0 3 8 6 6 8 2 5 1 -6 -1 8 -10 -6 -4 -16 -7 -12 -13 -17 3
5649CmpLj2PkmOPkk%J0lJnLKJLkLMj2J3j3OKpRj0kqJ8j2pNojJ2j3mMQKnjPPro
$$ 3 -1 -8 -5 -17 -10 -12 -16 -10 -3 -5 -7 -7 3 0 1 -4 -1 1 2 5 3 6 10 -2 11 -2 4 6 -1 8 -2 -4 -12 6 -6 -13 -8 -14 -15 -3 -16 -20 -16 -8 -6 -11 -12 -5 2 -7 -13
5700a3J1LloPJ0j2lORj5NKJOLonpJ0jKjnpQmqkKmNL%lkKMRoJpMLjLjpJ6%KpRp
$$ -13 -2 1 -2 -8 -1 9 -3 -6 0 9 -6 -1 1 2 8 11 5 0 -7 3 2 4 3 -2 -9 -1 -5 -13 -15 -13 -17 -12 -9 -9 -12 -14 -12 -8 1 -5 -4 -11 -7 -4 -5 -2 -3 -10 6 6 8 1 10 3
5754Ck%NqMkkK%rMlMjJ4j6pR%pRj6PNqQj1NmJ5qL%QkkmLK0rPj3J0nJoPM%nppR
$$ 3 1 1 6 -2 2 0 -2 0 0 -9 -5 -8 -4 -5 9 -7 -14 -5 -5 -12 -3 -19 -12 -7 -15 -7 -18 -13 -17 -2 -10 -7 -7 1 -1 -3 -7 -4 16 7 14 1 11 6 7 1 8 12 12 7 0 -7 2
5807BRk2J8k6RJ0j3LmnJ7npqJ0nOLj3J7noJ2mmQnJ1j0J0l%nJ0rJ3KpOj1pJ4qn
$$ 2 11 -11 7 -19 -10 0 -13 -10 -14 -19 -2 -7 -14 -22 -12 -17 -11 -8 -21 -4 -9 -15 -3 -7 -11 -3 -8 3 -7 3 0 0 -5 5 -4 9 11 4 10 -1 -8 6 -2 -7
5851gJ1j5Rk2MJ4j0JmNjpPJ0mkQoJ1j7NJKMqJ2j0J3nKkJ2kj0JJ0j0o%LNnRj4%
$$ -7 4 -11 -2 -24 -20 -6 -16 -15 -19 -14 -15 -22 -15 -5 -9 -11 -3 -9 2 -15 -10 -9 -7 -3 -11 1 -9 4 -1 1 -1 11 9 -1 0 10 0 -6 -6 -3 2 -3 6 -8 -8
5896hllj%NJ0j6lJ0j1J4oNjj4J3mJ1KpQRqpJ8j1Kl%Qr%KjnkLMj5%NMnnO%qNkJ
$$ -8 -11 -14 -15 -15 -10 0 -16 -19 -9 -20 -6 -12 -7 -8 -22 -9 -13 -2 0 -7 1 10 2 -5 13 2 4 1 1 9 0 0 2 1 -4 -6 -3 1 -14 -14 -9 -5 -10 -15 -9 -9 -17 -12 -14 -13
5946a3MnRm%Pj3J8j2J0mLKj0mK4oK%mNqJ2j8LJ3Jj3J0plnR%j1lJpR%j3J5Ok0K
$$ -13 -9 -14 -5 -9 -9 -2 -15 3 -9 1 -3 0 2 -8 -12 12 6 8 8 4 9 1 13 -5 -2 11 12 -1 9 2 -1 -6 3 3 -8 -11 -10 -17 -8 -8 -21 -6 0 -20 -18
5991a8J3q%lJ0lRoOL%qNJ0mj1NJ2llqJ3j3%nLNNj4JPLj0O%j0KlRj4J1nJ0j5kL
$$ -18 -5 -13 -13 -16 -6 -9 0 -6 0 3 3 -5 0 10 6 -5 0 12 9 6 -2 11 -2 -2 -7 -4 1 6 -8 -7 0 3 -7 -1 -1 -11 -9 -12 -3 -17 -6 -11 -1 -16 -18 -15
6037a5PNpRJnMJL%lJ3j6lkJ3okMlpPQq%kj3J5j2jlJ0mKj8J4LkOj1J4jQmj5OKL
$$ -15 -8 -3 -10 -1 0 -5 -1 0 3 3 0 13 -3 -6 -8 5 -1 -3 1 -2 -9 -2 6 -2 -2 -4 -17 -2 -14 -15 -18 -8 -12 -10 -28 -14 -11 -13 -7 -18 -4 -5 3 -1 -16 -10 -8 -5
6085eLmrJ0J4j1kLQpKKjnJlmMkKj0PnJ0knjmMplJJ1j3RQrRkPLrJ3qKqJ5j4J0%
$$ -5 -2 -6 -15 -5 9 -2 -4 -1 7 0 2 4 3 -2 -1 -4 -8 -4 -6 -4 -14 -7 -12 -2 -4 -9 -10 -14 -10 -17 -20 -19 -8 -21 -12 -4 -13 -4 -6 1 4 -5 8 0 2 -6 9 -5 5 5
6135EpRjjqNLj2Pj2LknJ2Rj6lOQmj3nJ5k%rJ0J0j1OOj4QOnPlnjJ4rLnqJ9kJJr
$$ 5 -2 7 6 5 -3 2 5 -7 0 -12 -9 -11 -16 -4 5 -11 -14 -8 0 -4 -17 -22 -7 -9 -9 -18 -8 2 -9 -3 3 -11 -3 3 -2 5 2 -3 -4 10 1 4 -1 -9 10 8 9 10 1
6184A%Nj0OnoKLojnNJQMj1joMJ2jllOKlqJ3PpOlrJ0qP%PkolLJjQkj0Oj5LNj5J3
$$ 1 1 6 -4 2 -3 -9 -7 -4 -10 -11 -16 -11 -10 -2 2 -9 -10 -16 -12 0 -1 -4 -7 -1 1 -2 -10 3 10 3 9 6 -3 7 -1 6 6 13 11 5 2 5 6 5 13 11 1 7 -8 -5 0 -15 -2
6237brnLjLLLLj3LNpJ0MnLLlkJJRJo%MkKOj1lJ2%j7KNMj3nlJ3j2J5j4OPj0Pkj0
$$ -2 -11 -16 -13 -14 -11 -8 -5 -2 -15 -12 -7 -14 -4 0 -5 -2 1 -2 -4 -3 -2 7 8 2 2 6 4 6 12 1 -2 10 10 -7 -5 0 4 -9 -14 -17 -4 -16 -1 -15 -9 -2 -12 -5 -7 -17
6287a7J3j0J3j6MMmRkQPJpOj0NJ6roJJlJjNnPoojkpJNmrJ0KnRkQk6J2kJ0mqOR
$$ -17 -4 -14 -1 -17 -13 -9 -13 -4 -6 2 9 10 3 9 -1 4 20 11 5 6 7 4 5 4 9 4 11 5 -1 -2 -4 -11 -10 -5 -9 -18 -8 -6 -11 -2 -4 4 -22 -10 -12 -2 -6 -14 -8 1
6337APoPj0J7j5MkJ2j4%KkjPojlMKkoJmmKn%RlOjlJ2rjQqj0J9pLPj4QQkjj%Rq
$$ 1 8 2 9 -1 16 1 5 3 15 1 1 3 1 0 7 1 0 -3 1 3 1 -5 -4 -8 -12 -10 -15 -15 -6 -9 -3 -4 -7 5 -4 -5 3 -5 -15 4 -3 0 7 -7 1 9 7 6 5 5 14 6
6389FnPlLqMmlKNpjjmJnL%lKjoPj%OLpJ0nMJMKpJ%QnQlj0J1mmMr%MNlpj3J0KQ
$$ 6 1 8 5 8 0 4 0 -3 -1 4 -3 -4 -5 -9 -8 -13 -10 -10 -13 -11 -12 -18 -11 -12 -12 -6 -3 -10 0 -5 -1 0 4 6 -1 0 0 8 3 11 8 -2 9 5 1 5 -4 -4 0 5 2 -5 -18 -8 -6 2
6445BNk0oLjJ0Kj5RPkqJJ0nPonJ0%MrMOMnkRj5J2pJ0j0kPkkjKlPj5kKoNqJ3rj
$$ 2 7 -13 -19 -16 -17 -7 -5 -20 -11 -4 -6 -14 -13 -3 -8 -1 -7 -12 -2 -2 2 -7 -3 3 7 2 0 9 -6 6 -1 9 -1 -3 4 2 0 -1 1 -2 5 -10 -12 -10 -16 -11 -19 -6 -15 -16
6495a6LlNQj0%KMnkMkMm%J4jOqJMj1J3lnk%jMKLqQpoNqjRnKOk2J1j0J6mpJ8Ll
$$ -16 -13 -16 -11 -3 -13 -13 -11 -7 -12 -14 -10 -12 -8 -12 -12 2 1 7 -1 0 4 -7 6 3 -2 -4 -4 -5 -1 1 4 -4 4 -3 -9 -4 -12 -13 -4 -9 -7 -1 -23 -12 -22 -6 -10 -17 1 4 1
6546ArLnJ4olJlJ2Nk%nRj3JkkNJjJj2Pj3RLLj2pN%%mNkJMK%omJ1L%JLPrJ0ll%
$$ 1 -8 -5 -10 4 -2 -5 -4 -7 5 10 8 8 3 12 -1 0 -2 -4 1 2 1 2 -10 -3 -16 -7 -4 -1 -13 -20 -15 -15 -15 -19 -14 -16 -15 -11 -9 -9 -15 -19 -8 -5 -5 -4 -1 6 -3 7 4 1 1
6599ANLnj2J8j0qlJ0oMnpJ0lOjj1kJoKjJ2krRnMKPj0J1p%Rj0M%J1mnJ6qpKMjJ
$$ 1 6 9 4 -8 10 0 -8 -11 -1 -7 -3 -8 -15 -5 -8 -2 -3 -14 -16 -15 -21 -19 -20 -8 -10 -19 -10 -15 -11 -9 -2 -12 -1 -8 -8 1 -9 -5 -5 6 2 -3 13 5 -2 0 4 3 4
6648DMj9RpLrJ1%pKmlkOjpJ5j6jKMlMJ0%JmkPOrJ0j1mKRmMp%KnJ3mpLRj7J0j0
$$ 4 8 -11 -2 -9 -6 -15 -4 -4 -11 -9 -13 -16 -18 -12 -13 -20 -5 -21 -22 -20 -16 -19 -15 -5 -5 -4 -8 -10 -3 3 -6 4 -7 -11 -9 0 -4 0 -7 -7 -5 -10 3 -1 -8 -5 4 -13 -3 -13
6698a3J%LJj5MMJokmJ1KRj8LJ8okrJ1OkNnPkoRj%o%RnJnLj7PLj2J4rOkpMllLO
$$ -13 -12 -12 -9 -8 -23 -19 -15 -14 -20 -22 -26 -15 -13 -4 -22 -19 -1 -7 -9 -18 -7 -1 -3 2 -3 4 2 -4 5 4 4 -2 -2 7 2 3 -2 1 -16 -9 -6 -18 -4 -13 -7 -9 -16 -12 -15 -18 -15 -9
6750illJ0j4mK1j3J4nj6K6j1J0rJ3%LmLnLLj9J0%NrNOj1%qmNQj2lRLpPj0RjoQ
$$ -9 -12 -15 -5 -19 -23 -2 -15 -1 -6 -22 4 -7 3 -6 7 7 10 6 9 4 7 10 -9 1 1 6 -3 2 8 -3 -3 -11 -15 -10 -2 -14 -17 -8 -5 -12 -5 -15 -6 -7 -13 -5
6796ejrMPQnJjLnRrJkKMj1J8plOjj8nK1okPrNOrLJ%nj1K1j1Kj1J7pNkj5J4Qj0
$$ -5 -6 -15 -11 -4 4 -1 0 -1 2 -3 6 -3 -2 -4 -2 2 -9 9 2 -1 5 4 -14 -19 2 -4 -6 1 -8 -3 3 -6 -3 -2 -2 -7 -18 3 -8 -6 -17 0 -7 -2 -4 -19 -5 3 -7
6845gPkqJ7%pJoJQMnnpK%%KnjJ4j6jlPlmjRPorOjPjJKkMJrM%%J1p%LJ4j2J1j2
$$ -7 0 -2 -10 7 7 0 1 -5 -4 4 8 3 -2 -9 -7 -7 -7 -5 -10 -11 3 -13 -14 -17 -10 -13 -17 -18 -9 -2 -8 -17 -11 -12 -5 -6 -5 -3 -5 -1 0 -9 -5 -5 -5 6 -1 -1 2 16 4 15 3
6898CpJ0%Rj3lJ3j0nj3NkkKOM%j2PqR%j2J0kjNqJ5k%LqNNJjJNkjPrJ1j1Lnj5J1
$$ 3 -4 6 6 15 2 -1 12 2 -3 -16 -11 -13 -15 -13 -7 -3 -3 -15 -8 -16 -7 -7 -19 -9 -11 -12 -7 -15 0 -2 -2 1 -7 -2 3 4 3 4 9 7 6 13 4 15 4 7 2 -13 -2
6947bOopJj0OMj0J4kj1Rj2ROkjkJ2k0MnJ5lP%Nj5J5kmPnknMmJ0qmQj0MJJKKj8
$$ -2 4 -2 -9 -8 -18 -12 -8 -18 -4 -6 -17 -8 -20 -11 -5 -7 -8 -10 2 -18 -14 -19 -4 -7 0 0 5 -10 5 3 -1 6 1 -1 -6 -2 -6 4 -4 -8 0 -10 -6 -5 -4 -2 0 -18
6995a8PmlMj6J0J2n%j2oQLJ3%qLJ6j0n%KPKOj1OlPj8PLkKljoO%qnNm%jrJ3j1J6
$$ -18 -11 -15 -18 -14 -30 -20 -8 -13 -13 -25 -31 -23 -20 -7 -7 -15 -12 4 -6 -11 -11 -9 -2 0 6 -5 1 -2 5 -13 -6 -3 -5 -3 -6 -7 -13 -7 -7 -15 -20 -15 -19 -19 -20 -29 -16 -27 -11
7044a1pOmoJ3j1J0j%jkJ5j9J7pRMnkKk%J1j2J3qj1LRj8J0jqJ1%plj0K4j0Jpjk
$$ -11 -18 -12 -16 -22 -9 -20 -10 -11 -11 -12 -14 1 -18 -1 -8 1 5 0 -2 0 -2 -2 9 -3 10 2 -9 -6 3 -15 -5 -6 -14 -3 -3 -10 -13 -23 1 -9 -8 -15 -16 -18
7088a8%Rj4J6j%lJkkJ1Mj2J4%MpoJJmPP%j2jJ4oj1kjOj2J7qrJ4j0JJRj2MNj3J3
$$ -18 -18 -9 -23 -7 -8 -8 -11 -10 -12 -14 -3 1 -11 3 3 7 0 -6 -5 -4 -8 -1 6 6 -6 -7 7 1 -10 -12 -13 -7 -19 -2 -10 -19 -5 -15 -14 -13 -4 -16 -12 -7 -20 -7
7134grJ3j1NmPNj1PJ2nMl%J2j1pOrJ1nM%j6LpLJQj2PoQo%jo%RkmlJ6qKMM%Mj3
$$ -7 -16 -3 -14 -9 -13 -6 -1 -12 -5 7 2 6 3 3 15 4 -3 3 -6 5 0 4 4 -12 -9 -16 -13 -12 -4 -16 -9 -15 -7 -13 -13 -14 -20 -20 -11 -13 -17 -20 -4 -12 -10 -6 -2 -2 2 -11
7184a1PJ1jj5J5nJ0mNpKj0J2lLrkqMjpJ0rkKk%qQPj2PMJPj3J3%MoJOoJ2qKQoo
$$ -11 -4 7 6 -9 6 1 11 7 12 5 7 -3 9 6 9 0 -2 -10 -6 -7 -14 -4 -13 -15 -13 -15 -15 -23 -15 -8 -20 -13 -9 -8 -1 -14 -1 -1 3 -3 -2 4 -2 10 2 4 12 6 0
7233@PojPNj4NoPoNqknJ0rrKKRnnQoJ1j2JjkJ4rQjOkJNj8J0RmLj0RNknPj4jPo
$$ 0 7 1 0 7 12 -2 3 -3 4 -2 3 -5 -7 -12 -2 -11 -20 -18 -16 -7 -12 -17 -9 -15 -4 -16 -15 -16 -18 -4 -13 -5 -6 0 -2 -1 4 -14 -4 5 1 4 -6 3 8 6 1 8 -6 -7 0 -6
7285fKJmrlmK0j0J0mQpkmNj3%OJ1nQ%j1ROpMLrPJ6j1jLj0J0j3jPlKK%kj1K%oO
$$ -6 -4 -3 -7 -16 -19 -23 -3 -13 -3 -7 1 -6 -8 -12 -7 -20 -20 -14 -3 -8 0 0 -11 -2 4 -3 1 4 -5 2 18 7 6 9 -1 9 -4 -5 2 -1 1 3 3 1 -10 -8 -8 -14 -8
7334hkmlJ1m%jnQj4J7nj%JQk%J1rLNnJ2j0KPKj6Kkl%nOkJ%kq%Rq%Klk%JKLqLj
$$ -8 -10 -14 -17 -6 -10 -10 -11 -16 -8 -22 -5 -10 -11 -11 -10 -2 -4 -4 7 -2 1 6 1 13 3 5 12 14 -2 0 -2 -5 -5 -10 -4 -6 -5 -5 -7 -15 -15 -6 -14 -14 -12 -15 -17 -17 -16 -14 -11 -19 -16 -17
7388a7JPJ0j6QN%k%J0oQnqLKj%lPrJ2l%oj5Mjj%JrPLLqpJ0j%KjP%j7QJ5Qrjjj5
$$ -17 -16 -9 1 -15 -7 -2 -2 -4 -4 6 0 8 3 -5 -2 0 -1 -1 -4 3 -6 6 3 3 -3 -18 -14 -15 -16 -16 -15 -24 -17 -14 -11 -19 -26 -16 -17 -17 -15 -16 -9 -9 -26 -18 -3 5 -4 -5 -6 -21
7440b1J1J3kpj0J6knNMj7J3pJ0%j0Mj0rkNoRpJ0oKkjpPJ6jMojM%jLJ4opkQllJ0
$$ -21 -10 3 1 -6 -16 0 -2 -7 -2 2 -15 -2 -9 1 1 -9 -5 -15 -24 -26 -21 -27 -18 -25 -15 -21 -19 -21 -22 -29 -22 -6 -7 -3 -9 -10 -6 -6 -7 -4 10 4 -3 -5 3 0 -3 7
7488GlLrLnJjLj3%NNoNj2rJMkNjJkkJ3pqjKMJ8p%oJ2KljJ1knjkLlKrJNpj0J3K
$$ 7 4 7 -2 1 -4 -3 -4 -1 -14 -14 -9 -4 -10 -5 -17 -26 -25 -21 -23 -18 -19 -18 -20 -22 -9 -16 -24 -25 -23 -19 -1 -8 -8 -14 -2 0 -3 -4 7 5 0 -1 -3 0 -3 -1 -10 -9 -4 -11 -21 -8 -6
7541fjoQonj5K6j5nNJ5jj7J0kOj0NO%PqLkjMNpMK%J1j7ONjRj5j1OJPj8RkMkql
$$ -6 -7 -13 -5 -11 -16 -31 -5 -20 -25 -20 -5 -6 -23 -13 -15 -9 -19 -14 -8 -8 -1 -9 -6 -8 -9 -5 0 -7 -3 -1 -1 10 -7 -1 4 3 12 -3 -14 -8 -7 0 -18 -9 -11 -7 -9 -17 -20
7590b0%jn%nOjQjJ3pjj0J5qOlMLL%LkoRkMj7J0KKmj0JJoONqLoNlJLp%OoNnQmN
$$ -20 -20 -21 -26 -26 -31 -25 -26 -18 -19 -6 -13 -14 -24 -9 -17 -11 -14 -10 -7 -4 -4 -1 -3 -9 0 -2 2 -15 -5 -3 -1 -5 -15 -14 -13 -19 -13 -8 -16 -13 -19 -14 -17 -16 -13 -20 -20 -14 -20 -15 -20 -12 -16 -11
7644a1%kPMjrJ0NkKqjLQop%kpPQ%j1QKrlJmRl%jjKrLKj0J2Qj0pNKOJ1lj2J6j4
$$ -11 -11 -13 -6 -2 -3 -12 -2 3 1 3 -5 -6 -3 5 -1 -8 -8 -10 -17 -10 -2 -2 -13 -5 -3 -12 -15 -14 -18 -9 -12 -12 -13 -14 -12 -21 -18 -16 -26 -14 -6 -16 -23 -18 -16 -10 1 -2 -14 2 -12
7695a2KNNJrOQJnj2Rj3oOJJrJ1kpq%J1JmjJLKpQPj3MJ1JjmK%oJNKJLp%RllLLn
$$ -12 -10 -5 0 1 -8 -2 6 7 2 -10 -1 -14 -20 -14 -13 -12 -21 -10 -12 -19 -27 -27 -16 -15 -19 -20 -19 -16 -14 -21 -13 -6 -19 -15 -4 -3 -4 -8 -6 -6 -12 -11 -6 -4 -3 0 -7 -7 2 -1 -4 -1 2 -3
7749cJoq%PolkLJKnKqNKJKo%Rj0J1LPnmjNKkOj1NQpKJ3rOj1kOk2J1J7j9lknJ1
$$ -3 -2 -8 -16 -16 -9 -15 -18 -20 -17 -16 -14 -19 -17 -25 -20 -18 -17 -15 -21 -21 -12 -22 -11 -8 -1 -6 -10 -11 -6 -4 -6 0 -11 -6 2 -5 -3 10 1 7 -4 -6 0 -22 -11 6 -13 -16 -18 -23 -12
7800a2kmKnMKj9JQJ2%kjKOQokJ3rlNMpJJ1j8KMjqJ5njkjpNjjmkNNmmNk5K6nqK
$$ -12 -14 -18 -16 -21 -17 -15 -34 -33 -25 -13 -13 -15 -16 -14 -8 0 -6 -8 5 -4 -7 -2 2 -5 -4 7 -11 -9 -5 -6 -14 1 -4 -5 -7 -8 -15 -10 -11 -12 -16 -18 -13 -8 -12 -16 -11 -36 -10 -15 -23 -21
7852b1NOkjJMKpJ1lRkMj7J4L%j0PnM%omkLmJKJjnrLLlJ1qnMQj2J5j4KQnPoJ1o
$$ -21 -16 -10 -12 -13 -12 -8 -6 -13 -2 -5 4 2 6 -11 3 6 6 -4 3 -2 2 2 -4 -8 -10 -7 -11 -10 -8 -7 -8 -13 -22 -19 -16 -19 -8 -16 -21 -17 -9 -21 -6 -20 -18 -10 -15 -8 -14 -3 -9
7903iNMJ3j6MlPlmjJojM%lKNj0kQj2jlJ0kj1QnLKMmNjlNpJ4Oj6J2mJ1lQj4KjJ4
$$ -9 -4 0 13 -3 1 -2 5 2 -2 -3 -2 -8 -9 -5 -5 -8 -6 -1 -11 -13 -5 -17 -18 -21 -11 -13 -24 -16 -21 -18 -16 -12 -16 -11 -12 -15 -10 -17 -3 3 -13 -1 -5 6 3 11 -3 -1 -2 12
7953A2k4J0J6j4ljMkKonqNLOmonQjk%j6K4okoJ2MjjMJk%J0j5J6kmJ5j8lK%KOp
$$ 12 -12 -2 14 0 -3 -4 0 -2 0 -6 -11 -19 -14 -11 -5 -9 -15 -20 -12 -13 -15 -15 -31 -7 -13 -15 -21 -9 -5 -6 -7 -3 -2 -4 -4 6 -9 7 5 1 16 -2 -5 -3 -3 -1 5 -2
8001b%Oj6Ok%J1j2oLPj0LlPkqPLllPj3J6j0OmJ3k%MnKRokMj0J7j0kMjpQrKj1J1
$$ -2 -2 4 -12 -6 -8 -8 3 -9 -15 -12 -5 -15 -12 -15 -8 -10 -18 -11 -8 -11 -14 -7 -20 -4 -14 -8 -12 1 -1 -1 3 -2 0 9 3 1 5 -5 12 2 0 4 3 -4 4 -5 -3 -14 -3
8050ck1J4j8QJmJ1OrrPJKOpJLlNKLJNkJJ4j9KKMjLj0LJ0rkknQlj2MljrJ1j2N%
$$ -3 -24 -10 -28 -20 -19 -23 -12 -6 -15 -24 -17 -16 -14 -8 -15 -14 -11 -14 -9 -7 -4 -3 2 0 1 15 -4 -2 0 4 3 6 -4 -1 9 0 -2 -4 -9 -1 -4 -16 -12 -15 -16 -25 -14 -26 -21 -21
8100b1OLpmJ0jqMRkkMOoJJJ1oJJmOj0%QnpJ1OknLpMj1L%pPj0JJ1j0KMnLPqLoP
$$ -21 -15 -12 -19 -23 -13 -14 -22 -18 -9 -11 -13 -9 -3 -9 -8 -7 4 -2 -1 0 -4 2 -8 -8 0 -5 -12 -1 5 3 -2 1 -6 -2 -13 -10 -10 -17 -10 -20 -19 -8 -18 -16 -12 -17 -14 -7 -15 -12 -18 -11
8152a1JOLLOk0J2rJ4roJ4oj4RNKm%j4J6j7J4jj0OmNOj2Oj1nRlQoMJ2
$$ -11 -10 -4 -1 2 8 -12 0 -9 5 -4 -10 4 -2 -16 -7 -2 0 -4 -4 -18 -2 -19 -5 -6 -16 -10 -14 -9 -3 -15 -9 -20 -25 -16 -19 -11 -17 -13 -1
8191a
$$ Imaginary data points
##PAGE= N=2
##DATA TABLE= (X++(I..I)), XYDATA
0@%%%%%%%%%%Qj6J6j6K4l2M0m8N6p2Q8j05J29j53J77k08K43k83L28l77M34m98
$$ 0 0 0 0 0 0 0 0 0 0 0 8 -8 8 -8 16 -16 24 -24 32 -40 48 -57 72 -81 96 -112 131 -152 176 -201 233 -265
32b65N66o42P26q19R22j036J162j298J444j607J786j979K192k423K675k952L253
$$ -265 301 -341 385 -434 488 -548 614 -684 760 -847 939 -1040 1152 -1271 1404 -1548 1705
49A705l584L946m345M788n277N822o432P123p908Q810r862J1101j2594J4427j6740
$$ 1705 -1879 2067 -2278 2510 -2767 3055 -3377 3746 -4162 4648 -5214 5887 -6707 7720 -9020
64i020J9771k3930L0034m0009O0084j64179K10593j791j60526K59451k95483N1119
$$ -9020 10751 -13179 16855 -23154 36930 -127249 83344 81553 -78973 180478 -115005 -63886
76f3886M7816O4967P003p8728O0150j34704Q7423P8602r3139P6452j07911O5712
$$ -63886 -16070 48897 55900 -22828 37322 -97382 -9959 68643 -24496 51956 -55955 9757
88I757j3084j1433P4432j32328J00061J014o7357J00314j19446K2178Q7253m9294
$$ 9757 -3327 -14760 59672 -72656 27405 28419 -38938 61376 -58070 -35892 51361 2067
100B067J5681R434r6987K2629J17108o8679K6307J512j25527Q5083L5354J0374
$$ 2067 17748 27182 -69805 -47176 69932 1253 27560 29072 -96455 -11372 23982 34356
112C4356J285n9482P88k6090O9154K9855m5488p616k2839J5011n462N7338k6727
$$ 34356 35641 -23841 -23053 -49143 20011 49866 4378 -3238 -26077 -11066 -16528 40810 14083
125A4083m7693O9730p2499L2367K8354n7071O8565l7185k714R994l7763K8623
$$ 14083 -33610 36120 -36379 -4012 24342 -32729 35836 -1349 -4063 5931 -31832 -3209
137c209J5722K3054m5643Q350j5851l3700J07314l8116j5885M896n9688N0546
$$ -3209 12513 35567 -10076 -1726 -17577 -51277 56037 17921 2036 6932 -52756 -2210
149b210M457M2716k8639n4866M6701m9263N6585K4036m9212J9767m4482L8408
$$ -2210 2247 44963 16324 -38542 8159 -41104 15481 39517 -9695 10072 -34410 3998
161C998R23j0048L5951n4759K7793L45j3901J5415k3746M0633k1840k055J6083
$$ 3998 4921 -5127 30824 -23935 3858 4203 -9698 5717 -18029 22604 764 -1291 14792
174A4792n0656L0396K1377L95o910j7505o751j7217N3192J2236l5548L235k4593
$$ 14792 -35864 -5468 15909 16304 9394 -8111 -14862 -32079 21113 33349 -2199 1036 -23557
187b3557j861L7630K1388k7661j5164j200j8071M1366R507j8080j046k3708J5582
$$ -23557 -25418 12212 33600 5939 -9225 -10425 -28496 12870 22377 4297 3251 -20457 -4875
200d875L574R584O108k5997J8551j4097k690K1199j9477J3493O069j4003o123
$$ -4875 -1301 8283 14391 -11606 6945 -7152 -9842 11357 -8120 5373 11442 -2561 -8684
213h684L812L040k547K9302j9451k6331K1582j3109J2218K6610j9384k1642K734
$$ -8684 -4872 -1832 -4379 24923 5472 -20859 723 -12386 -168 26442 7058 -14584 -11850
226a1850R240p66K1202j833l2066N736J0505l512R809J0887k6042m199K4172k3086
$$ -11850 -2610 -3376 17826 15993 -16073 -10337 168 -3344 6465 17352 -8690 -12889 11283 -11803
240a1803J2115J5779k6945J5416K84j4769N579N117N789m022P088j6290j3714
$$ -11803 312 16091 -10854 4562 4846 -9923 -4344 773 6562 2540 9628 -6662 -20376
253b0376K6100r40L408N719k5181q304J7489J3518l503L616j5618k2888K8038
$$ -20376 5724 4784 8192 13911 -11270 -19574 -2085 11433 7930 11546 -4072 -26960 1078
266A078J0925r117J1650k0295j6317K4575N064m469O005j4032o125J1237M743
$$ 1078 12003 2886 14536 -5759 -22076 2499 7563 3094 9099 -4933 -11058 179 4922
279D922j722o030N656n150j605J4133j7954R66J6122j0880O461j100j5775L980
$$ 4922 3200 -2830 2826 -2324 -3929 10204 -7750 -6784 9338 -1542 4919 3819 -11956 -7976
293g976J4309L273o380q69j5558L09K3858k153k220o421j5488P502J2205P651
$$ -7976 6333 9606 3226 2357 -13201 -12892 10966 8813 6593 172 -15316 -7814 4391 12042
307A2042m434j2420l261j334J1959J1020j2153l738j207o117J5109J122r614O318
$$ 12042 7608 -4812 -8073 -9407 2552 13572 1419 -2319 -3526 -9643 5466 6588 -3026 3292
321C292o403J8O429m730K95J241L924l456k407J280o986R682N744n246l433o668
$$ 3292 -3111 -3093 3336 -1394 -1099 142 4066 610 -1797 -517 -7503 2179 7923 2677 -756 -7424
337g424K925L519J1093j696j6184M286l397N716J3399q432n870m658J893N849
$$ -7424 -4499 -980 10113 8417 -7767 -3481 -6878 -1162 12237 3805 -2065 -6723 -4830 1019
351A019M300Q44q777r84l27M905K042k735L229p974M883Q24n816P863n075N516
$$ 1019 5319 6163 -2614 -3598 -3925 980 3022 287 3516 -4458 425 1249 -4567 3296 -1779 3737
367C737o48q062M850n979R039M229o139r51q764O659L291M969J398j4671L836
$$ 3737 3089 -4973 -123 -6102 2937 7166 1027 76 -8688 -2029 1262 6231 7629 -7042 -3206
382c206k474O181J0285j0803O49p312J259J0794l505K668o856j554L932j712O376
$$ -3206 -5680 501 10786 -17 632 -6680 -5421 5373 1868 4536 -2320 -3874 58 -1654 4722
397D722n824k97M426n526L270j248k381L735K409j24n604j116N90K517P816k740
$$ 4722 -1102 -1399 3027 -2499 771 -477 -2858 877 3286 3162 -2442 -3558 -2968 -451 7365 4625
413D625q279k004J283O005N852k375p975n302N337N001L012K113j2448j193N986
$$ 4625 -3654 -5658 -4375 1630 7482 5107 -2868 -8170 -2833 2168 5180 7293 -5155 -6348 -362
428c62j487J0107n636p707M870l993O709J165m982J394k611M767k009j281J008
$$ -362 -1849 8258 2622 -5085 -215 -4208 2501 3666 -1316 78 -2533 2234 225 -1056 -48
443d8l131P553k710j553k391m209J0901l262L649k093j4362J2497j193K968P794
$$ -48 -3179 4374 1664 111 -2280 -6489 4412 1150 4799 2706 -11656 841 -352 2616 10410
458A0410j6333J497J035K031R848n630l816m621J853N706J585J050q188J583M85
$$ 10410 -5923 -4426 -3391 -1360 8488 2858 -958 -5579 -3726 1980 3565 4615 -3573 -1990 -1505
473a505K66P010q039K387R67m928Q219o489l13N805n312N309k333o252M296J279
$$ -1505 -1239 5771 -2268 119 1086 -3842 4377 -2112 -2425 3380 -1932 3377 1044 -5208 -912 367
489C67K138J759m740n274L349L639J839K803q461k699L761M30P365l110o186R55
$$ 367 2505 4264 -476 -5750 -2401 1238 3077 5880 -2581 -5280 -1519 -1089 6276 3166 -3020 -2065
505b065j959N431L265m149j373j014m69L883J243m578K301q76j096N005n824Q09
$$ -2065 -4024 1407 4672 523 -850 -1864 -2333 1550 2793 -1785 516 -360 -1456 3549 -2275 -1466
521a466K566j841M740m659j920Q35M93N567k273j800l885L6N022Q00L120p568
$$ -1466 1100 -741 3999 -660 -2580 -1745 -1252 4315 2042 242 -3643 -3607 1415 2215 5335 -2233
537b233j572K422j271J0008o196l124J739o090J0060j382k019J465o902N914q22
$$ -2233 -3805 -1383 -2654 7354 1158 -1966 -227 -6317 3743 2361 342 1807 -5095 819 -3
552cJ046J388n464M179k344J878N77l692L980k796L173p71m397M180k834L682
$$ -3 1043 2431 -3033 1146 -1198 680 1257 -2435 1545 -1251 1922 1151 -3246 934 -1900 1782
568A782J314n093J710k197K164L221j886o04k617K72K397J026L99j977j979J054
$$ 1782 3096 -1997 -287 -2484 -320 2901 1015 411 -2206 -1934 463 1489 1888 -89 -2068 -1014
584a014J324L91R75k088p30J069j97Q70q08R25j064Q3J651l875L200m3j452L533
$$ -1014 310 701 1676 -412 -1142 -73 -270 600 -208 717 -347 -264 1387 -2488 712 669 -783 2750
602B750m687J315J74j66L683m097J990k893l0M979m192L911l896j581M577l640
$$ 2750 -1937 -622 -448 -614 3069 -1028 962 -1931 -1961 3018 -1174 2737 -1159 -2740 1837 -1803
618a803N091l803r57K502m064O631m397M6K501n324O438l183o8J327l632N116
$$ -1803 3288 -515 -1472 1030 -3034 3597 -800 -754 1747 -3577 2861 -322 -390 937 -2695 2421
634B421l373K189q90l607N741l929L350q32m259M852l835L943K15m214L294l290
$$ 2421 -952 1237 347 -3260 2481 -1448 1902 1070 -3189 1663 -2172 1771 1986 -2228 1066 -2224
650b224K645J247j672N66k727K518m40Q87P13l654K436q46P36J548k820J033o44
$$ -2224 421 1668 -4 562 -2165 353 -87 800 1513 -2141 295 -551 185 1733 -1087 -54 -698
667f98O92J159j386M29j156O08J389j054L07m29j099J630O12j426R13r97o17K291
$$ -698 -6 1153 -233 196 -960 -352 1037 -17 290 -139 -1238 392 1004 -422 491 -506 -1123 1168
685A168j018j77K11r31O18O43j03j048J030q99J75J902l036J982k89j701L611
$$ 1168 150 -27 184 -747 -129 514 411 -637 393 -506 -331 1571 -1465 517 228 -1473 2138
702B138l148Q00Q44k218L092j719L56j01j390K518j810J592o49j901K531j628
$$ 2138 -1010 -210 634 -1584 1508 -211 145 44 -1346 1172 -638 954 305 -1596 935 -693
718f93J383k43j020Q27j363K443j751J49J523l351L334q34j601K654k677J092
$$ -693 690 447 -573 254 -1109 1334 -417 -268 1255 -2096 1238 404 -1197 1457 -1220 -128
734a28J188j600P70m87k26O42N99p79m66M61o10J188Q0q10K6p24J218L9l33P15
$$ -128 1060 -540 230 -257 -483 159 758 -21 -487 -26 -636 552 632 -178 -152 -876 342 381 48 763
754G63j788M07J462r57L53K83j460M57J359q48j27M93j196O70Q84q68J69k99l0
$$ 763 -1025 -618 844 -113 240 523 -937 -480 879 31 -96 397 -799 -129 755 -113 56 -243 -273
773b73M84m7K68j080N52M11r80J961j614r07K505k124Q54J470k738O63J458r69
$$ -273 211 164 432 -648 -96 315 -665 1296 -318 -1225 1280 -844 10 1480 -1258 -595 863 -106
791a06k98J565j803q94L377k162k62J974k785J103J092o14j22m44O42j276J778
$$ -106 -404 1161 -642 -1536 1841 -321 -583 1391 -1394 -291 801 187 65 -379 263 -1013 765
808G65L38k535K248j285m16K589k027l42J176q73k65J875j035j946L054j378j294
$$ 765 1103 -1432 816 -469 -885 1704 -323 -665 511 -362 -627 1248 213 -1733 1321 -57 -1351
825a351L337k547q84K735j148q46J279l92j602J983Q80k602J144N50k079K274
$$ -1351 1986 -561 -1445 1290 142 -704 575 183 -1419 564 1444 -1158 -14 536 -1543 731
841G31R40k983J258L86j832K838k45k368J585n39q28K335k16k611J867J78k389
$$ 731 1671 -1312 -54 332 -1500 1338 1093 -1275 310 -229 -1057 1278 1062 -1549 318 496 -1893
858a893L721r92k979L320j171j081K004m86j433P18J860k704O61J932l397K518
$$ -1893 1828 836 -2143 1177 6 -1075 929 443 -990 -272 1588 -1116 -455 1477 -1920 598
874E98J015l007J615l94o63J679J27j374k10N57q63J925L85k660J358l76q75K654
$$ 598 1613 -1394 221 -173 -836 843 970 -404 -614 -57 -920 1005 1390 -1270 88 -288 -1163 1491
892A491n79j924R05J59q91J483N00j952K82J185j076j5J608j722k12K180k041
$$ 1491 912 -1012 -107 52 -839 644 1144 -808 -526 659 -417 -432 1176 -546 -758 1422 -619
909f19P4J103j272J152K32p32m85p7P36R7J017j510p14J119j195K253J63k339
$$ -619 -545 558 -714 438 670 -62 -547 -624 112 209 1226 -284 -998 121 -1074 1179 1342 -997
927i97Q86n88L87J021L02r14j597J970o66j61K097k456K4J148q06N42j12Q3l84
$$ -997 -111 -699 -312 709 1011 97 -1500 470 -196 -357 1740 -716 -692 456 -350 192 80 163 -221
946b21K03N22j069L72K13J52M93q89Kl43L9J601m23r78J3m90M60J277n6r82p18
$$ -221 -18 504 -565 -193 20 172 665 -224 -222 -565 -526 1075 652 -326 -313 -803 -343 934 878 -104 -822
967h22K67M98M77N94j031q22N09K57O05k22k31j73o91J187o5q01Q66m14p5J86
$$ -822 -555 -57 420 1014 -17 -839 -330 -73 532 310 79 -94 -785 402 337 -464 402 -12 -87 99
987I9j70r8m02J435l95j088Q96j098L80J502n36n63o37J71K01Q90O29j650r7k4
$$ 99 -71 -169 -571 864 469 -619 277 -821 -441 1061 525 -38 -675 -504 -303 587 1216 -434 -531 -555
1007e55J22J500o38m65k36n96R80M94l20l89k6l9k14R45l54r08J239k65r79J146
$$ -555 -433 1067 429 -36 -272 -868 112 606 286 -103 -129 -168 -382 563 209 -699 540 275 -704 442
1027D42n30p63J706k46j192N58l32k63J396J48j357M1n8j30J570k43j063R1o25
$$ 442 -88 -851 855 609 -583 -25 -357 -620 776 924 -433 -392 -450 -580 990 747 -316 -225 -850
1046h50O55J052l61n50l56J7N6Q89J67j302O13O7q11J328l58q78J057k29n55L83
$$ -850 -195 857 496 -54 -410 -393 -337 552 719 -583 30 97 -714 614 256 -622 435 206 -349 34
1066C4p5l39P23L69j068Q6m6j21J256l62m29m36n12J143R9L81m32j301Q61j72
$$ 34 -41 -380 343 712 -356 -270 -316 -437 819 457 28 -408 -920 223 322 703 271 -1030 -169 -341
1086c41P16O76j513K29q4m3Q87j18m58k52L38k67K53L72p29N52m0l86K48m19M18
$$ -341 375 1051 -462 -233 -317 -360 527 409 -49 -301 37 -230 23 395 -334 218 178 -208 40 -379 39
1107C9L33j78M2p26j28Q58O7J66p7j308L85P47j53R39j003q19O34k63J073k1p77
$$ 39 372 194 236 -490 -618 240 307 473 396 -912 -527 220 67 1006 3 -816 -182 -445 628 607 -170
1128a70P7o20P17L41j64N3m79J24j38M88k17j59P75j048N17mr88J594m96j91N30
$$ -170 -93 -713 4 345 181 234 -245 -121 -259 229 12 -147 628 -420 97 93 -895 699 203 12 542
1149E42j471N73O44n7M56p19n77J0O11O42k10l83n29k58O60P94m23l05p2o94O66
$$ 542 -929 -356 288 231 687 -32 -609 -599 12 654 444 61 -468 -726 -66 728 305 0 -72 -766 -100
1170a00P22o27J17O6p38M93L77o71O86no41O15p23lQ80l06L28m26o91K44L57P67
$$ -100 622 -5 112 178 -560 -67 310 -361 325 320 -321 294 -429 -432 448 142 470 44 -647 -403 -46 721
1192G21k32n31l60m63Q54Q36l01n79k30n11M29J348o56l82J27r84P62P11m58J80
$$ 721 489 -42 -402 -865 -11 825 524 -55 -285 -796 -367 981 325 -57 70 -914 -152 559 101 281
1212B81l49l42L22M1J39J40j20n0j96j87J22L10L44j25m55k47j37M43Q11k22p05
$$ 281 -68 -410 -88 -47 92 232 112 62 -134 -321 -199 111 455 330 -125 -372 -509 -66 745 523 -182
1233a82j38l47L43J278m22o84L1p52O59R32l61r4o22k27M63K30L99k99m15J8q3
$$ -182 -320 -667 -324 954 532 -152 -121 -873 -214 718 357 263 -359 -586 -123 107 506 207 -208 -190 -273
1254b73K20J97N5rj75k03j10J19K41M49j20o67m8j55K93J043l06p06j87m36N88
$$ -273 -53 144 199 190 15 -188 -298 -179 62 511 391 -276 -324 -479 -186 857 551 -155 -342 -778 -190
1275a90R74j65m45o96l40Q07M37L21k50j151J96L11K49O96n23m67j06k4M61J20
$$ -190 784 619 174 -522 -862 -55 382 703 453 -698 -502 -191 58 754 231 -236 -342 -366 95 215
1295B15O4k00k00j00m5L60j35M08L9q37L58l43J65J037n34r7m18n83R05K94J88
$$ 215 279 79 -121 -221 -266 94 -41 367 406 -431 -73 -416 -251 786 252 155 -263 -846 59 353 541
1316E41m6j027j50N28L42L99p1q40l16M21J99M73J09p60r7o4O4P79k59r4N4q80
$$ 541 495 -532 -682 -154 188 587 516 -324 -640 -219 -20 453 562 -198 -295 -359 -295 484 225 131 185 -695
1338f95N23L14k58Q13n75n96L56l58O17N00m29k25m22j12O16N20k90j55m31n10
$$ -695 -172 142 -116 697 122 -474 -118 -476 141 641 212 -13 -435 -547 69 589 299 144 -287 -797
1358g97J081Rj50M78j297L59N29n42R47n08m65N87n74K18L53l10K28J44n39q8
$$ -797 284 293 143 621 -676 -317 212 -330 617 109 -356 231 -343 -125 228 -82 146 290 -249 -337
1378c37L29k46P52P7j028L58m58K47J318p79j89k59q49J215N06l10M7j057j14
$$ -337 -8 -254 498 575 -453 -95 -553 -306 1012 233 44 -215 -1064 151 657 347 394 -663 -777
1397g77R50J20L31l53r63L21M12O3M74m41p53O80r8j62Q15r55J15P84j061O66
$$ -777 173 293 624 271 -692 -371 41 104 578 137 -616 64 -34 -196 619 -336 -221 563 -498 168
1417A68r6p28J259m12l24K95q45M64P70k45j44l04o55O18Q63m76J77o19p99J317
$$ 168 72 -656 603 191 -133 162 -683 -219 551 306 162 -142 -797 -179 684 208 385 -234 -1033 284
1437B84L7q2L54j307K96O07k31O20n55m47M55j79L08J03n57K80K22k98J70j51
$$ 284 321 239 593 -714 -418 189 -42 578 23 -424 31 -148 160 263 -294 -14 208 -90 80 -71
1457g1l63O93J39n06J89n94O4J117m79J0j84j129J247M05m88O80j392k26J335
$$ -71 -434 259 398 -108 81 -513 -449 668 189 199 15 -1114 133 538 50 730 -662 -888 447
1476D47l59M11r1j179L05P40l5R0o5j041N96O96p27Q01q63m98J458q96M71M2j270
$$ 447 88 499 408 -771 -466 274 239 329 264 -777 -181 515 -212 589 -274 -772 686 -210 261 303 -967
1497i67J205pj58L46r42O4N73L07j39k56n25j14J114k05M9k72j115J109J54K0
$$ -967 238 231 73 419 -523 -459 114 421 282 26 -499 -613 501 296 345 73 -1042 67 221 241
1517B41N26j506K98O15l41R67o35q90P80j74J60O75r64k11O68l97M01K52j039
$$ 241 767 -739 -441 174 -167 800 165 -725 55 -119 41 716 -248 -459 209 -188 213 465 -574
1536e74M57L96n81P61l98q19J171m25j38Q39j362M31O95q00Q73m77o74P98k21
$$ -574 -117 279 -302 459 61 -758 413 -12 -150 689 -673 -242 453 -347 526 49 -625 173 -48
1555d8J70K07n09j54L98K2q9L97p92K41N28p93R28n54m77J121j006N61J94r89
$$ -48 122 329 -180 -334 64 86 -3 394 -398 -157 371 -422 506 -48 -525 596 -410 151 345 -644
1575f44J026l91p8M20p02L12J34K4j9j11j66p5P00n39J86J16r71J208k64m45Q67
$$ -644 382 -9 -87 333 -369 -57 77 101 82 -29 -195 -270 430 -109 77 193 -778 430 166 -279 588
1596E88j185L94O73o83N18l23m10N31O6n6k8k25j68M79O7k40J14m61K22M35k68
$$ 588 -597 -203 470 -213 305 -18 -428 103 169 113 85 -140 -308 171 238 -2 112 -349 -127 308 40
1617D0J34l61j57N41j25J28j00n74M48K00j52K67m36k92N35J18j76J63m46j94
$$ 40 174 -187 -344 197 72 200 100 -474 -26 174 22 289 -147 -439 96 214 38 201 -245 -439
1637d39P65k16l2O5o73M95K68j31J66n62N3K63J24K16m53j05LJ98L41k37j64k42
$$ -439 326 110 78 143 -530 -35 233 102 268 -294 -241 22 146 362 -91 -196 -193 5 346 109 -55 -297
1659b97K09K86r8J64n69O3M55k79L69k90m40N04m3Q5P5m36K4K41J43j0j60k09
$$ -297 -88 198 100 264 -305 -242 213 -66 303 13 -427 77 34 119 194 -242 -218 23 166 156 -4 -213
1681b13NL49L8m7k06k26K78J40R0q7l35L5J77J94m3j44j33q9L65K3j43l0j78J73
$$ -213 -208 141 179 132 -74 -300 -22 118 208 121 -214 -179 -2 192 149 5 -128 -217 148 171 28 -2 -180 -7
1705gO3P0j15k82L85j20JK46n90K93J82j71L32m93K6J95p8M36m38p8O2j58O88
$$ -7 56 126 11 -271 114 -6 -5 241 -349 -56 126 -45 287 -206 -180 15 -63 373 -65 -143 -81 -239 449
1728D49m30q2J63o02P42L6l72K23l74J76P5L03k24n32P70n58J92O78j190N34J79
$$ 449 19 -63 100 -502 240 276 -96 127 -247 -71 4 307 83 -449 321 -237 -45 633 -557 -23 156
1749A56m40P68o04j02K12k13O12l53j65K3k55O45r9j62M2n43M03M09k23k9j35
$$ 156 -284 484 -120 -222 -10 -223 389 36 -129 -106 -361 284 185 23 65 -478 -75 334 111 82 -53
1770e3k57J02O88k96n02N96o26J9J126j015J1N72r03O79K20o36L93k64R8K38k68
$$ -53 -310 -208 480 184 -318 278 -348 -329 797 -218 -207 365 -538 141 361 -275 118 -146 -48 190 -78
1791g8J68k61J36J83j94J59l04O1L04j63J3Kj42j41N49j04n88P49m76l57J146
$$ -78 90 -171 -35 148 -46 113 -191 -130 174 11 24 26 -116 -257 292 188 -400 349 -127 -484 662
1812F62p60k76Q27o70j7O57n39j40N66l31q8L03m08J79J96j27Q9l31J04P1J17
$$ 662 -98 -374 453 -217 -234 423 -116 -256 310 -21 -109 194 -214 -35 161 34 123 -208 -104 -33 84
1833H4K70n80J51m5j84Q57m32m07L22l19J76N18j16p23K75L02n40R21j88j064
$$ 84 354 -226 -75 -120 -304 553 121 -286 36 -283 -107 411 295 -428 -153 149 -391 530 342 -722
1853g22Q94j82j77P26o43j80K29N2L02k87j3k03j8O15l59L5j12m62P97j40r0J49
$$ -722 172 -10 -187 539 -104 -284 -55 -3 299 12 -1 -204 -222 393 34 69 -43 -505 292 152 62 211
1875B11p24M04J96J66J7o93M96m76L86Q44j275M60k3n46J042k87k07j39q5K79
$$ 211 -513 -109 87 253 270 -423 73 -403 -17 827 -448 12 -11 -557 485 198 -9 -148 -233 46
1895D6j36N52n61k05M79n22O81j89l81M50n46M40J08l74K97k93J47J11j36J23
$$ 46 -90 462 -99 -304 175 -347 334 145 -236 214 -332 108 216 -158 139 -154 -7 104 -32 91
1915I1k06L9J56rj55J65j33k22N95l60j10M39o41L15K67l86L02j66j42J52L2N1
$$ 91 -115 -76 80 71 -84 81 -52 -274 321 -39 -149 290 -351 -36 231 -155 147 -19 -161 -9 23 74
1937G4l1lj84J17Q1j10L02l21o4K79m09M58Nm51N29n25J02N51p20N89k23m75Q07
$$ 74 43 40 -144 -27 54 -56 246 -75 -139 140 -269 189 194 -257 272 -253 -151 400 -320 269 46 -429 378
1960C78o16K87K22o24N61l67J48J40l15M46n53M00o5l39P35p79M95n3n24R22q87
$$ 378 -238 49 271 -353 208 -159 -11 129 -186 260 -293 107 42 -297 438 -341 154 101 -423 499 -388
1981c88N08K05r11J099p16K5O57q91O18j97j56L62m18L46k19M2K25l67K86k48
$$ -388 120 325 -586 513 -203 -178 479 -412 206 9 -147 215 -203 143 -76 -34 191 -176 110 -138
2001a38R7K15l09L06k86j09M44k86J69kl89L18o5J00K11n36K25Rj94O21l63k26
$$ -138 -41 174 -135 171 -115 -224 220 -66 103 101 -288 30 -35 65 276 -260 -35 -26 -220 401 38 -188
2023a88K23k33L06N5q9j15k24L86j01Q2N0l83K23m7K00K1l70K83k32J39L07m16
$$ -188 35 -198 108 163 74 -41 -265 121 20 102 152 -231 -8 -55 145 166 -204 79 -153 -14 293 -123
2045a23Q9r6J00J66j50J17l04M9K90n3k8j35J9j20K65J85m13J39j00LK90j52Q2
$$ -123 -34 -130 -30 136 -14 103 -201 -152 138 85 57 -78 -59 -179 86 271 -142 -3 -103 -100 190 38 120
2068A20l02O9K62k09K20j58j25R5L1J71k66J18L6k48L54j43j13J16r3J81j83M9
$$ 120 -182 -113 149 -60 160 2 -123 -28 3 174 -92 26 62 -186 168 25 -88 28 -65 116 -67 -18
2090a8J09l31L77Kl27K70j52k5K47j43Pr9NJ91j38Q8l6j36R4N5P1j95Q0O0k13
$$ -18 91 -240 137 139 -188 82 -70 -95 152 9 16 -83 -78 113 -25 63 27 -109 -15 40 111 -84 -4 56 -157
2115a57L46j60j75K30j87K20p3j34K01l38L07J50m14K42p8j68L31j8k02K1jl5
$$ -157 189 29 -146 84 -103 117 44 -90 111 -227 80 230 -184 58 -20 -188 143 125 -77 -56 -57 -92
2137i2K36q9j14N4k00K89P0k61J99j97n2L12j01o4K6p7J6J63p2n3K0j57K95j15
$$ -92 144 55 -59 -5 -205 84 154 -107 92 -105 -157 155 54 -10 16 -61 -45 118 46 -7 13 -144 151 36
2161C6j77L80m85J97L79n80L89j16k74M81k73O4L5k52K40j1K%o8p3N1K52k91J26
$$ 36 -141 239 -246 -49 330 -250 139 23 -251 230 -43 21 56 -196 44 33 35 35 -33 -106 -55 197 -94 32
2185C2L7l57M86k05q6L03m80L75j9k74M50m19Q4K90l78K33j1j83J73J1n2m5O1
$$ 32 69 -288 198 -7 -93 210 -270 105 86 -188 262 -157 -73 217 -161 72 61 -122 51 62 10 -35 26
2208B6j07J20N1j99J96k03M6K70l37K13l9k72L84j45m2J54k39R5R4r0O8l4r3J08
$$ 26 -81 39 90 -109 87 -116 -70 200 -137 76 37 -235 149 4 -38 116 -123 -28 66 -24 44 10 -83 25
2232B5J9j03J22p1q8K24j45l2J36j94J65J2j25J29j47O0R5r4P8r9k8Q1QK7q3K2
$$ 25 44 -59 63 -8 -96 128 -17 -49 87 -107 58 70 -55 74 -73 -13 82 -12 66 -33 -61 20 28 55 -28 -6
2258fo5N1J10j51J10r7o0K14j59P9nj44J93j05Q1pj29J61j05Q9pj51J81j28J09
$$ -6 -71 -20 90 -61 49 -48 -108 106 -53 26 21 -123 70 -35 46 39 -90 71 -34 55 48 -103 78 -50 59
2283E9L0j91J65j48J10R6j99J50j71P7J25j36J34j92M9P6o0J61k16O8Rj06K80
$$ 59 89 -102 63 -85 25 121 -78 72 -99 -22 103 -33 101 -91 -42 34 -26 135 -81 -13 -4 -110 170
2306A70k37M8O2j87K67j21k7Q9j89J95o0KK2r6J10n3P5o9n8J20j10J33l3j18J07
$$ 170 -67 -19 43 -144 123 2 -25 64 -125 70 10 12 34 -62 48 -5 70 1 -57 63 -47 86 53 -65 42
2331D2j26J26M2j34R5j24L8J35r0Pl6k8N0N4m4k9Pj0M9km0MoJ5M9o0j2L6m2R3
$$ 42 -84 42 84 -50 45 -79 -41 94 4 11 -25 -53 -3 51 7 -22 -15 -25 24 22 -18 -14 -20 -5 44 -16 -28 8 -34 59
2361E9j5j03P0n8O3R4j30OqmR8k3j3q3K0M0J7N1j06k2L5oQ1n1j8l4J1R1p2K2l4
$$ 59 44 -59 11 -47 16 110 -20 -14 -22 -26 72 49 36 -47 -27 13 30 81 -25 -47 -12 -18 63 12 -6 -40 -29 62 -10 12 -22
2392b2k1Q6j7k3j9pK0N1Or5J0J1K5P1m7o5l1R1J8JL2j58M7O8j4O0p8l1j9O6O2
$$ -22 -43 43 26 3 -16 -23 -3 48 54 -41 -31 -20 5 76 29 -36 -67 24 42 43 75 -83 -36 32 18 78 0 -31 -50 16 78
2423G8q4L6q7PJ13p0J8l9rM5%K9r9N9K1n0J41j55qJ01o7R1m0o7l2N0J04q4M9p5
$$ 78 -6 30 -57 -50 63 -7 11 -28 -37 8 8 37 -62 -3 18 -32 109 -46 -54 47 -20 71 31 -36 -68 -18 86 2 51 -24
2453b4q8J65k5J8l8l8nrJ50j16j9R2j66J28M7j40R1j9j9M1j5n5J0Q7o9J2J8j09
$$ -24 -112 53 28 46 8 -30 -35 -44 106 -10 -29 63 -103 25 72 -68 23 4 -15 26 11 -44 -34 53 -16 -4 14 -95
2481i5Q7O5o2N2p6k6N7O0Rp8Nm1j2J85j06n1Q4j44Q8R5j17L8k3k5L5J7ro4Q6n6
$$ -95 -8 57 -5 47 -29 -55 2 62 71 -7 -2 -43 -55 130 24 -27 57 -87 1 96 -21 17 -6 -31 4 21 12 -52 34 -22
2511b2j6P6j06P1M0m8L9o8j7J9O6J8q5L5p3J4J67r8k8K8r6P7Q7m3l5km0J7R6l3
$$ -22 -38 38 -68 3 43 -5 34 -34 -51 -32 34 52 -33 2 -71 -57 110 12 -16 12 -84 -7 80 37 2 0 -40 -23 73 40
2541D0m4J2l0rP3k3o1P7n1l4J03r5MR0p3PJ6n2NJ02k2q8P8r8LJ78j19KK2r3P8
$$ 40 -4 8 -22 -31 42 19 -42 35 -16 -50 53 -42 -38 52 -21 -14 2 -50 -45 57 35 -53 25 -73 -70 108 -11 -9 13 -80 -2
2572bL2K8m0n0N1p9R7M4j10N3l1m3Q6rm5M9l1l1M5j2k1O1l0n8N5m7MJ00p5j2K5
$$ -2 30 58 18 -32 19 -60 37 81 -29 24 -7 -50 36 27 -18 31 0 -31 14 2 -19 42 12 -46 9 -38 -34 66 -9 -21 4
2603Dp9P5K6j7K6p2QJ4J3P1p6k1J8k5O6J2l7Ql3j1L8J2k5L5m4j8O9p0K7P8j12
$$ 4 -75 0 26 9 35 -37 -29 -15 -2 69 -7 -28 -10 -35 31 43 6 14 -19 -30 8 20 -5 30 -14 -32 37 -33 -6 72 -40
2634d0M6K1j01R2L4o9L0k2n4M3O2m4J1j8m3L4L7J8m1Rl1m2J33m2m0P3j03LR4n7
$$ -40 6 27 -74 18 52 -17 13 -9 -63 -20 42 -2 9 -9 -52 -18 19 37 -4 5 -26 -68 65 23 -17 56 -47 -44 50 -7
2664gJ5N0r3lJ02r5J2Q7j00J2N2p8J1R5o0l5N3n9j7R8k5l6J7k3k6P5K7r2N0j8
$$ -7 8 58 -35 -38 64 -31 -19 68 -32 -20 32 -46 -35 60 0 -35 18 -41 -58 40 15 -21 -4 -27 -53 22 49 -43 7 -11
2694a1p4J45m4m6Q2r0j4R0j9j5M4m5m3P2j9m1P0l0m6O0k4l1O1j4m0J8rk2L0M7
$$ -11 -85 60 16 -30 52 -38 -52 38 19 4 48 3 -40 32 13 -28 42 12 -34 26 2 -29 32 18 -22 -4 -13 -35 -5 42
2724D2o5JK5o9O8M2q2N1m4k7R0l1Prj7k0J9O0o8K8K1r0R9j9m9P4l6oKjJ7k3M9
$$ 42 -23 -22 3 -66 2 44 -38 13 -31 -58 32 1 8 -1 -18 -38 -19 41 -27 1 22 -68 31 12 -37 37 1 -5 -3 -4 13 -10 39
2757C9l8k0N5p7M3L4n2Pj5rJ8L9j9l2J4j7NO4l9j5L0o3M2N5o4L1j2k7K1J2Nl4
$$ 39 1 -19 36 -41 2 36 -16 -9 -24 -33 -15 24 5 -27 -13 -30 -25 39 0 -15 15 -48 -6 49 -15 16 4 -23 -2 10 15 -19
2789a9L2pl7O2l0j3M4l8J1k1J1kJ4L2o7KM5o7P3Lp0N4l9RL0Ll7jK8l3L2K1o7L5
$$ -19 13 6 -31 31 1 -12 32 -6 5 -16 -5 -7 7 39 -28 -26 19 -48 25 28 -42 12 -27 -18 12 15 -22 -23 5 -28 4 25 -42 -7
2823gJ6l5L7J0m2L1Nk0J8npjK9k7l2N2l1QO0q5J0L0m0N0Ll6j1K6j3oN9n8k6N9
$$ -7 9 -26 11 21 -21 10 15 -5 13 8 1 0 29 2 -30 22 -9 -1 59 -26 -16 14 -26 24 27 -9 -20 6 -7 -13 46 -12 -38 21
2857B1n8L9J7o2K7J7j2J7nJ1j8J7pj8M0k9J0K1l0JJ4rkM6l6l5L6j6j7N5l9l4N2
$$ 21 -37 2 19 -43 -16 1 -11 6 1 12 -6 11 4 -14 26 -3 7 28 -2 -1 13 4 2 48 12 -23 13 -3 -20 35 -4 -38 14
2890A4k7lM8n5pL1k2J5Rj5j2PJ1jJ6j5nL1k9lK5j8J0M%k8K3J0l3O8m8m3O5l2J3
$$ 14 -13 -16 32 -23 -30 1 -21 -6 3 -12 -24 -17 -6 -7 9 -6 -11 20 -9 -12 13 -5 5 9 9 -19 4 14 -19 49 1 -42 23 -9 4
2925DJ7k2j7QJ1nJ6j1k7K9j4qM0n1J6LrJ3JjnJ2K0m4M0j2k7N2j9k6K7j6qL5j2
$$ 4 21 -1 -18 -10 1 -4 12 1 -26 3 -11 -19 21 -30 -14 -11 -20 -7 -6 -7 -12 0 20 -24 16 4 -23 29 10 -16 11 -5 -13 22 10
2960A0j9QJ6k1L9k9l1K8j1J5J6k6nQk4K6MnrMKj7rM1m5K6J1m3M1Lk5J6K0l0QK4
$$ 10 -9 -1 15 -6 33 4 -27 1 -10 5 21 -5 -10 -2 -26 0 4 -1 -10 -6 -4 -21 -30 11 -34 -8 3 -40 1 4 -21 -5 15 -15 -7 17
2996A7l8L9Pm3M2j8j6M8l3kJ5k2J4Jk6K2mj6J3Pj2J3l1K5j2j3L4j2j6K3k3%K4
$$ 17 -21 18 25 -18 24 6 -10 38 5 3 18 -4 10 11 -15 7 3 -13 0 7 -5 8 -23 2 -10 -23 11 -1 -17 6 -17 -17 7
3029Gj5pK0k2J0K2l4L8j7k9M7k7K0J5m6L3o%J4rk2J9nj6K7k0j2K9k6J0Rm2L6%
$$ 7 -8 -15 5 -17 -7 15 -19 19 2 -27 20 -7 13 28 -18 15 9 9 23 14 -8 11 6 -10 17 -3 -15 14 -12 -2 7 -35 1 1
3063Aj8M2l2k0K7j1K2Pl9LK7j4K6j5j6JJJ4J7k3JJ6j8K6mk7J0J5j2J1kl3L2j7
$$ 1 -17 25 -7 -27 0 -11 11 18 -21 -18 9 -5 21 6 -10 -9 -8 6 23 0 1 17 -1 25 21 -6 4 19 7 18 16 -17 15 -2
3097bJ0J3m1J2lqK2kj7nQOJ6k2nOkL2pk8J8j6J8J4j9RkoJ4J0k3jM%J9j4k5K6j4
$$ -2 8 21 -20 -8 -11 -19 3 1 -16 -21 -13 -7 9 -13 -18 -12 -14 18 11 -17 1 -15 3 17 -2 7 5 -1 13 23 0 -1 3 3 22 8 -17 9 -5
3136eJ4K7l5%nLK6rk9QmRJ9pk8pMJ3J6k3qJ4rL0kk8J9oOK1j3j1Pj3L4jk9J5j9
$$ -5 9 36 1 1 -4 -1 25 16 -13 -5 -9 0 19 12 -16 -23 -19 -6 10 -13 -21 -7 -16 14 12 -16 3 -3 3 24 11 0 7 -6 28 27 -2 13 -6
3175fJL0k0Nrj0J8J1k5Pj3qL0jk2j%j0L7lj3Rl3K9OqLk0NJ8Mj3J6k2J9PplqJK0
$$ -6 -5 25 5 10 1 -9 9 20 -5 2 -11 -19 11 10 -12 -13 -13 -23 14 11 -2 7 -26 3 9 1 4 -16 -11 7 11 -2 14 -8 11 18 11 8 0 1 21
3216B1j0qJ3k1jJ9j1Mkj0J4Jj9lJ0k5K3J3%kj0j0J6j5QQj2KJ1j4J5mk3L3j0NJ5
$$ 21 11 3 16 -5 -6 13 2 6 4 -6 8 9 -10 -13 -3 -28 -5 8 8 6 -4 -14 2 -13 -5 3 -9 -7 4 -10 5 1 -22 11 1 6 21
3253B1j7j0K3rKJ2k3KLrK4%k5J6j5jK2l9K0Mk5K9Jk5J6j4%K7j3lPk1K3J4k4Ql
$$ 21 4 -6 17 8 10 22 -1 1 4 -5 19 19 -6 10 -5 -6 16 -23 -3 1 -24 5 6 -19 -3 -17 -17 10 -3 -6 1 -20 3 17 -7 1 -2
3290blK4j0j1mj1NM6l0rNk6M8j0l6L5k9PM0l9J4mm0M1Qj9Kk1oM6j3jLm0M3Rk0
$$ -2 -5 19 9 -2 -6 -17 -12 34 4 -5 0 -26 22 12 -24 11 -18 -11 29 -10 4 0 -40 1 9 -10 -8 -29 -35 11 -2 -3 0 -40 3 12 -8
3327hK0l1j5N8pj8K1m1LO0k4J0j2n1N3lj4Ql5J3L6k2J1ml5J9J2%Ok9kK2LMMn5
$$ -8 12 -19 -34 24 17 -1 20 -21 -18 42 18 28 16 -35 18 15 1 9 -26 -13 23 1 12 8 -27 -8 4 4 10 -19 -21 1 4 8 12 -43
3363d3K6J9mJ5l2k0M4%oJ6m1OL1nMPm7M3OnK3k9k0L6j6J2j6k4LK0%J4l1qK2kP
$$ -43 -17 2 -2 13 -19 -39 5 5 -1 15 -26 -20 11 6 10 17 -30 13 19 14 37 8 -12 24 8 20 4 -20 -17 3 3 17 -14 -22 0 -2 5
3400EPm1LK3j3K7ql4K7jMJ7m7J1J7lK1j2k3J5J2jJ5j2j4RkK2j1j2lj3K2KoJkn
$$ 5 12 -29 -26 -3 -16 11 3 -31 -4 -5 -1 16 -31 -20 -3 -6 15 3 -20 -5 7 6 21 9 -5 4 2 24 13 1 -2 -15 7 9 3 4 2 -3
3438cKJ1k1pK6k6PJ7k1lRnK3k0j0K6kQlk0K2oj3K8j7lKpJ6jmknJ4%j6RJ1j5JP
$$ -3 -1 10 -11 -18 8 -18 -11 6 -15 -18 -9 -14 9 -11 -21 5 3 11 8 -12 10 4 -9 19 2 -1 1 -6 10 9 5 3 -2 12 12 -4 5 16 1 2 9
3479Ij8%J9k7NJ2k0K8j7nJ6k5J3KrJ4Oj3K2okMj4J9j0K0rNj6QRmnJ8k7J5oRqk6
$$ 9 -9 -9 10 -17 -12 0 -20 8 -9 -14 2 -23 -10 -8 -17 -3 3 -10 12 6 4 8 -6 13 3 23 14 19 3 11 20 16 11 29 2 17 11 20 12 -14
3519a4QQpK4k8oJ3j1K9ok9K6j5RRk4j3K0OlNrkRJ7j3MnMJ4j1Lnj8K1mJ3j4j8J0
$$ -14 -6 2 -5 19 -9 -15 -2 -13 16 10 -19 7 -8 1 10 -14 -27 -7 -1 -4 1 -8 -10 -1 16 3 7 2 6 20 9 12 7 -11 10 6 19 5 -13 -3
3559cNJ1K0m7lJ9j3K2mk5KJ6j6K6j2j8ROJ1oMj0qJ8NKqkkQJ8l4RJ6k7L7mk6K0
$$ -3 2 13 33 -14 -17 2 -11 11 7 -18 -16 0 -16 10 -2 -20 -11 -5 6 0 4 -6 -14 4 9 11 3 1 -1 7 25 -9 0 16 -11 26 22 -4 16
3598A6j8LL3l7MJ2k1J6Nk8qK0mnJ1k5J2lJ2J2jj3NKKJ1j9L0l0PK8l8J3Rk2K3L
$$ 16 -2 1 34 -3 1 13 -8 8 13 -15 -23 -3 -7 -12 -1 -26 -14 -17 -5 7 6 -7 -2 0 2 13 -6 24 -6 1 29 -9 4 13 -9 14 17
3635A7l0K7j0KJ7j2QpoJLrOJk1J9Ok6J6j6lM1l7K0Pl6K2nqK1k6J1K6l6K9jpN%
$$ 17 -13 14 4 6 23 11 19 12 6 7 10 1 7 8 -13 6 12 -14 2 -14 -17 24 -13 7 14 -22 0 -5 -13 8 -18 -7 19 -17 12 11 4 9 9
3674IJlNlnj0J0MjLLk5K6j6qK4pk1K4k1QJ8k9K0jk8L2k0jJ8j2OojMj0J2%kMoJ0
$$ 9 10 7 12 9 4 -6 4 8 7 10 13 -12 14 -2 -10 14 7 -14 10 -11 -3 15 -14 6 5 -23 9 -11 -12 6 -6 0 -6 -7 -3 -13 -1 -1 -3 1 -5 5
3716EKJ0j9nJ3%J0ok2K9j4j1L2j6j0Ok2K3nj6J9k3LJ3nLljJ0oJ9k3PoKJ0KnoQ
$$ 5 7 17 -2 -7 6 6 16 10 -12 17 3 -8 24 8 -2 4 -18 5 0 -16 3 -20 -17 -4 -9 -6 -9 -10 0 -6 13 -10 -3 -9 -7 3 5 0 -6 2
3756BJ6j1j3J5j2J7Lj3mP%J0oj5J3j4kJ4j0nk2J6KJRj6nPMJ4oj3J3jRkj2J5rR
$$ 2 18 7 -6 9 -3 14 17 4 0 7 7 17 11 -4 9 -5 -7 7 -3 -8 -30 -14 -12 -11 -2 -18 -23 -16 -12 2 -4 -17 -4 -5 4 2 -10 5 -4 5
3796ELj8R%PJ1j6KJrJ2OqooNRkRk2NJJ1qj6J0k2K4J2k5Qj9J1K6j8K1l3KK6j2K2
$$ 5 8 -10 -1 -1 6 17 1 3 4 -5 7 13 5 -1 -7 -2 7 5 14 -8 -3 -2 9 1 -15 -5 -27 -3 9 -16 -8 -27 -16 10 -8 13 -20 -18 8 -4 18
3837A8j8j3L5k0OJk7K3OJ2ml0J0JNJ4k4Lj2ML1oj2j1lJ9j1J4k0lOj3L0qj5NkL
$$ 18 0 -13 22 2 8 9 -18 5 11 23 19 -11 -1 0 5 19 -5 -2 -14 -10 21 15 3 -8 -11 8 -3 11 -9 -12 -6 -19 11 3 -12 -7 -9 -6
3875fJ5j7jJ1pJ2nmJ8rRJ7k5o%J8Kj0mj5POlJ0k9J4qJ1J2k4pMKJ8%j2QJ%Kjj4
$$ -6 9 -8 -9 2 -5 7 2 -2 16 7 16 33 8 2 2 20 22 12 8 -7 0 6 3 13 -16 -2 -10 1 13 -11 -18 -14 -12 6 6 -6 2 3 3 5 4 -10
3917a0lJ2Jnj4K1kNNk1QlJ6lJ2k1%J5KRok0OpJ0Qk0MqlORmj1kNMj4PJ1jMjMmn
$$ -10 -13 -1 0 -5 -19 2 0 5 10 -11 -3 -6 10 7 19 -2 -2 13 15 24 18 -2 4 -3 7 15 -5 -1 -9 -12 -6 3 -1 -12 -14 -9 -5 -19 -12 -1 -2 2 1 5 1 -4
3963dmJ1oqJ5J5j7MLj6QJRJj7jJ9nJ1j5j1jRMJqnjj1QKj0NJ4j2J0okJ2MmNpj0
$$ -4 -8 3 -3 -11 4 19 2 6 9 -7 1 2 11 12 -5 -6 13 8 19 4 -7 -8 1 5 6 -2 -7 -8 -19 -11 -9 -19 -14 0 -12 -2 -8 -10 2 6 2 7 0 -10
4007a0J3mJ1pj2J6JjJ0k0%LMJ6k4Qj4OjNLj2J4j0Pkj3J4jj8K9k7j5K4j0NQj6K0
$$ -10 3 -1 10 3 -9 7 8 7 17 -3 -3 0 4 20 -4 4 -10 -4 -5 0 3 -9 5 -5 2 0 -13 1 0 -18 11 -16 -31 -7 -17 -12 -4 -20 0
4046@mqJ0MnOKmJ2j4rJ6nPNj6Qj6J1Pj5J2lk3J7KoKolJ3lkMj7J0MpJ2Nj2J6j6
$$ 0 -4 -12 -2 2 -3 3 5 1 13 -1 -10 6 1 8 13 -3 5 -11 0 7 -8 4 1 -22 -5 -3 -9 -7 -13 -16 -3 -6 -8 -4 -21 -11 -7 -14 -2 3 -9 7 -9
4089ikK1j5Rrj2J7POm%nOlNQk1Qpj2K4%j6Nj2lJ5j9J5lrRnmMKnJ5j4lJ1kMNMl
$$ -9 -11 10 -5 4 -5 -17 0 7 13 9 9 4 10 7 12 20 -1 7 0 -12 12 12 -4 1 -11 -14 1 -18 -3 -6 -15 -6 -11 -15 -11 -9 -14 1 -13 -16 -5 -7 -3 2 6 3
4135CjJ%mJnjPPJnklJ0mJ1j7mJmPj8K2prJ2rqJ0Kl%nOPJ0j9J4j3KK2j5NmJJnJ1
$$ 3 2 3 3 -1 0 -5 -6 1 8 9 4 2 -1 9 5 16 -1 -5 -4 -8 -1 -19 3 -4 -13 -1 -10 -18 -8 -6 -9 -9 -14 -8 -1 9 -10 4 -9 -7 15 0 5 1 2 3 -2 9
4183Ijj3J2nLLOk0QJl%mLKLj9J1Mj1LRmlkkRqlmkJ2jQj5MNJ3%JlpRLnJ4k2NLn
$$ 9 8 -5 7 2 5 8 14 -6 2 3 0 0 -4 -1 1 4 -15 -4 0 -11 -8 1 -3 -6 -8 -10 -1 -9 -12 -16 -18 -6 -7 1 -14 -10 -5 8 8 9 6 -1 8 11 6 20 -2 3 6 1
4233APkpJnrlJ8j2NPj7J0mmJ3j4Qm%J0Qk5J4qmJ1jKjLknORnOKqnOlQLJk1Q%lM
$$ 1 8 6 -1 0 -5 -14 -17 1 -11 -6 1 -16 -6 -10 -14 -1 -15 -7 -11 -11 -1 7 -18 -4 -12 -16 -5 -6 -4 -5 -2 -4 -9 -3 6 1 7 9 1 -4 2 -1 7 10 11 -10 -2 -2 -5 -1
4283aj3Rq%Qj2J2j0JJ1oQnrMJ3jNJj2J1pJJ1j4MLnMMj0Oj1J9j9nJ6pPrQm%%lp
$$ -1 -14 -5 -13 -13 -5 -17 -5 -15 -14 -3 -9 -1 -6 -15 -11 2 1 6 7 -5 6 -1 0 11 -3 1 4 -1 3 7 -3 3 -8 11 -8 -13 3 -4 3 -6 2 -2 -2 -2 -5 -12
4329a2Pj9J7j5J7j1j5K7n%KlljOJLPllK2j3noN%%LnJ0j1oJ1ljPj0RJqJ2j0lLj
$$ -12 -5 -24 -7 -22 -5 -16 -31 -4 -9 -9 -7 -10 -13 -14 -8 -7 -4 3 0 -3 19 6 1 -5 0 0 0 3 -2 8 -3 -9 2 -1 -2 5 -5 4 5 -3 9 -1 -4 -1 -2
4374bolMkJ0j5mmJ3Pj2LLLmJ4%jKjjPonMomJ1mjNlkj1J7j4oJ7j0jJoRnMPj1Qo
$$ -2 -8 -11 -7 -9 1 -14 -18 -22 -9 -2 -14 -11 -8 -5 -9 5 5 4 6 5 4 11 5 0 4 -2 -6 5 1 0 5 2 0 -11 6 -8 -14 3 -7 -8 -7 -13 -4 -9 -5 2 -9 -1 -7
4423glMjK%jJ6rjpJ0RoMqkJ5j1J5j4pOnNj0pJ5oM%rrJ1j3ROnOQk%nJlM%Nj2jO
$$ -7 -10 -6 -7 -5 -5 -6 10 1 0 -7 3 12 6 10 2 0 15 4 19 5 -2 4 -1 4 -6 -13 2 -4 0 0 -9 -18 -7 -20 -11 -5 -10 -4 4 2 2 -3 -2 -5 -1 -1 4 -8 -9 -3
4473c%JQj0MJ0j0Nj4OjJ2jj0ORj0Mlj8K2pMmj1lrJ4lNjKlQl%OKrOjJpJ1l%L%r
$$ -3 -3 -2 6 -4 0 10 0 5 -9 -3 -4 8 7 -3 3 12 2 6 3 -15 7 0 4 0 -11 -14 -23 -9 -12 -7 -8 -6 -9 -1 -4 -4 2 4 -5 1 0 1 -6 5 2 2 5 5 -4
4522dJ3kJnpPoQ%pKKJLj5OkJ4kj1%j1J1LnjLLqJ7oj9K3j4OlPJ%OPj3lj1J9pJ2
$$ -4 9 7 8 3 -4 3 -3 5 5 -2 0 2 3 6 -9 -3 -5 9 7 -4 -4 -15 -4 -1 -6 -7 -4 -1 -9 8 2 -17 6 -8 -2 -5 2 3 3 9 16 3 0 -11 8 1 13
4569A3j1j1QjooJ9olnR%Jj7K1lpRj5J3Lj6J0j1J3Lj0J2mmnMQ%nLJ1qKLqQk3J6
$$ 13 2 -9 -1 -2 -8 -14 5 -1 -4 -9 0 0 1 -16 5 2 -5 4 -11 2 5 -11 -1 -12 1 4 -6 6 2 -2 -7 -3 5 5 0 3 14 6 8 11 3 11 -12 4
4613D%rJ2Nj5Rj5MjM%oJojLMPj3J3lRLj4J0qPRj9lJ4pmMNljMLoMMMJj0j4J5qJ9
$$ 4 4 -5 7 12 -3 6 -9 -5 -6 -2 -2 -8 -7 -13 -14 -11 -7 0 -13 0 -3 6 9 -5 5 -3 4 13 -6 -9 5 -2 -6 -2 3 0 -1 3 6 0 4 8 12 13 3 -11 4 -4 15
4662A5j5rJ6qNj2NPj5J0j0LkmJ1%PJ6j3j0MN%pQnJJlJ1nPqlJ7k8NJ4j1J0rJ1n
$$ 15 0 -9 7 -1 4 -8 -3 4 -11 -1 -11 -8 -10 -14 -3 -3 4 20 7 -3 1 6 6 -1 7 2 3 4 1 12 7 14 6 3 20 -8 -3 11 0 10 1 12 7
4705Gj2KLknQokJ2j6LpOQrOqNJ6qKNPrMKlOp%J3j9JlLQklj5%J3mQj6QpJ3Oj7P
$$ 7 -5 -3 0 -2 -7 1 -5 -7 5 -11 -8 -15 -9 -1 -10 -4 -12 -7 9 1 3 8 15 6 10 12 9 15 8 8 21 2 3 0 3 11 9 6 -9 -9 4 0 8 -8 0 -7 6 12 -5 2
4755BrqJ4nJ0okOpl%J6j1%J1ljlNkm%LJ0KqNpkPj1Kj0J0kNj1lqJ7JmpJ6j7NJ0
$$ 2 -7 -15 -1 -6 4 -2 -4 2 -5 -8 -8 8 -3 -3 8 5 4 1 6 4 0 0 3 13 15 7 12 5 3 10 -1 1 -9 1 -1 4 -7 -10 -18 -1 0 -4 -11 5 -12 -7 3
4802Cj2J%mPOK%ljlOmJ3j2J2L%j0OmPl%nlKlRj6mmMl%RmqK2j6nOMMj1PNjJ1j6
$$ 3 -9 -8 -8 -12 -5 1 3 3 0 -1 -4 2 -2 11 -1 11 14 14 4 10 6 13 10 10 5 2 4 1 10 -6 -10 -14 -10 -13 -13 -4 -8 -16 6 -10 -15 -9 -5 -1 -12 -5 0 -1 10 -6
4852fJ5moJJ1Qj4koM%MKj0nRkJJMkLkj0OmjjJj0%MRqJ0Mj9MOKJ4j4LRl%JQj4J1
$$ -6 9 5 -1 0 11 19 5 3 -3 1 1 5 7 -3 -8 1 -1 0 1 5 3 6 4 -6 0 -4 -5 -6 -5 -15 -15 -11 -2 -10 0 4 -15 -11 -5 -3 11 -3 0 9 6 6 7 15 1 12
4902A2nkpMmlRKj4J0rJ2kj3lKMj2J9JppOLkJrJ4j8J6KqqJ7qJ0%j3JKJ9lrMMjk
$$ 12 7 5 -2 2 -2 -5 4 6 -8 2 -7 5 3 -10 -13 -11 -7 -19 0 1 -6 -13 -7 -4 -6 -5 -14 0 -18 -2 0 -8 -16 1 -7 3 3 -10 -9 -7 12 9 0 4 8 7 5
4949EmjjkqQPkjRj6NroNQrMj2J6mQj4PNKJkMj2OJ5k0NJ3k1K1j8J6mjnJQ%j0ML
$$ 5 1 0 -1 -3 -11 -3 4 2 1 10 -6 -1 -10 -16 -11 -3 -12 -8 -20 -4 -8 0 -14 -7 -2 0 1 -1 3 -9 -3 12 -8 -3 10 -11 10 -8 8 4 3 -2 -1 7 7 -3 1 4
4997DPpmj0Lkj5J6kmLlPqlJ4j0J3KkjJNj0LjJJ2Lj4KqJ8rj%nMoLKpJ7ojnJ3j1
$$ 4 11 4 0 -10 -7 -9 -24 -8 -10 -14 -11 -14 -7 -15 -18 -4 -14 -1 1 -1 -2 -1 4 -6 -3 -4 -3 9 12 -2 0 -8 10 1 0 0 -5 -1 -7 -4 -2 -9 8 2 1 -4 9 -2
5045brJ9j6JqLlJJ0ojNlL%jMrK0p%%kJ6k0K3j7mJ2j1Nj1Qj4J0JMkKj4J1mNlj9
$$ -2 -11 8 -8 -7 -15 -12 -15 -14 -4 -10 -11 -6 -9 -6 -6 -7 -3 -12 8 1 1 1 -1 15 -5 18 1 -3 9 -2 3 -8 0 -14 -4 -3 1 -1 1 -13 -2 -6 -1 -4 -23
5090b3K1rRqkNkJ7j5LnpJ6plJ0JJ0j7MNj1K9j5KKj5J4nRqLk1kJ4oJ4nj5J7j1J2
$$ -23 -2 -11 -2 -10 -12 -7 -9 8 -7 -4 -9 -16 0 -7 -10 0 1 11 -6 -2 3 -8 21 6 8 10 -5 9 4 13 5 8 -13 -15 -1 -7 7 2 -13 4 -7 5
5132Erj5QnJ8j8PPj3J4lJ0qrK5k2POoLlPmJQk6K3J3j2pnRMpKj0J1Mrjj3LkKNq
$$ 5 -4 -19 -11 -16 2 -16 -9 -2 -15 -1 -4 6 -2 -11 14 -8 -1 5 -1 2 -1 6 2 3 11 -15 8 21 9 2 -3 6 10 3 5 -5 6 10 1 0 -13 -10 -12 -10 -5 -13
5178a3QqRqK2kj4Rj2J8j0Qpj1J3Rj5RkPj1QpN%jlRj5QJ%mn%j6K6lj2NjmQokoP
$$ -13 -5 -13 -4 -12 10 8 -6 3 -9 9 -1 7 0 -11 2 11 -4 5 3 10 -1 7 0 5 5 4 1 10 -5 3 4 4 0 -5 -5 -21 5 2 -10 -5 -6 -10 -2 -8 -10 -16 -9
5225ikRMj3QmjK7k2J3qjJ1j3J1N%KpqRnJj0j%MpjNj0J8j7J3%jkj8K3j1%Mj0lJ9
$$ -9 -11 -2 2 -11 -3 -7 -8 19 -3 10 2 1 12 -1 10 15 15 17 10 2 11 6 7 -3 -4 -4 0 -7 -8 -3 -13 5 -12 1 1 0 -2 -20 3 -8 -8 -4 -14 -17 2
5270Bj2J0j3J4ljMpQMqLJ4j0pJ4j3LJKkkpoJOjJmjJlJ1Lj6OJ0mKrJ1j0J8j2oJ4
$$ 2 -10 0 -13 1 -2 -3 1 -6 2 6 -2 1 15 5 -2 12 -1 2 3 5 3 1 -6 -12 -11 -5 -6 -5 -9 -10 -9 -12 -1 2 -14 -8 2 -2 0 -9 2 -8 10 -2 -8 6
5316FmqMOJrJ0pQqkJ6j4K0j4qJ9j7LJ0j5mkJqNONqLrKQqmPJ4njk%nJ0OoNj3J1
$$ 6 2 -6 -2 4 5 -4 6 -1 7 -1 -3 13 -1 19 5 -3 16 -1 2 12 -3 -7 -9 -8 -16 -11 -5 0 -8 -5 -14 -12 -4 -12 -16 -9 5 0 -1 -3 -3 -8 2 8 2 7 -6 5
5364ElmNjOKj3MJ6j7mRPk2KJ0kpJoMmOj1oK2j0mMOJnPQj0JRjkJ0pnMj0QkjKMj0
$$ 5 2 -2 3 2 8 10 -3 1 17 0 -4 5 12 -10 -8 2 0 -7 -6 -12 -8 -12 -6 -17 -23 -1 -11 -15 -11 -5 -4 -9 -2 6 -4 -3 6 5 3 13 6 1 5 -5 3 1 0 2 6 -4
5414dOjRoj5J1j5J3mLlJ1oj6MJ3Jj2kJ2Mj1%pJmJ2kkOnROj0KNPj5J1mN%j0J2r
$$ -4 2 1 10 4 -11 0 -15 -2 -6 -3 -6 5 -1 -17 -13 0 1 -11 -13 -1 3 -8 -8 -15 -14 -18 -6 -8 -10 -4 -9 0 6 -4 -2 3 10 -5 6 2 7 7 -3 9 0
5459@lJoJ2kmkj1RjlMRloJnMMKpLRnrLjR%mPj2QoKJ5j1pJ2PqmJ2j2NnoM%lkrK
$$ 0 -3 -2 -8 4 2 -2 -4 -15 -6 -7 -10 -6 3 0 -6 -5 -10 -6 -2 0 -7 -4 5 0 -9 -6 -7 2 2 -2 5 -7 1 -5 -3 12 1 -6 6 13 5 1 13 1 6 1 -5 -1 -1 -4 -6 -15 -13
5512a3nO%rJ7qJ3p%PpjLPJlOj0J2Ok2J6j9J2%K%nJ1rMlKNokqJ3j5LOmoJ3k2RP
$$ -13 -18 -12 -12 -21 -4 -12 1 -6 -6 1 -6 -7 -4 3 4 1 7 -3 9 15 -7 9 -10 2 2 4 4 -1 10 1 5 2 4 9 3 1 -7 6 -9 -6 0 -4 -10 3 -19 -10 -3
5559cj2R%OpJ5k2KJ6j8K2rpJ3OooJ1jj9J3kJ4qoL%%lj2OoJ0j2J4j4NJKj2J5j7
$$ -3 -15 -6 -6 0 -7 8 -14 -12 4 -14 8 -1 -8 5 11 5 -1 10 9 -10 3 1 15 7 1 4 4 4 1 -11 -5 -11 -1 -13 1 -13 -8 -7 -5 -17 -2 -19
5601a9NQpLqOnJ7kmMpkK1mKnLrMJ2pj0J1Qk1qJ7j1QkpkmRj1J5jrnK0k7J1%kJ4
$$ -19 -14 -6 -13 -10 -18 -12 -17 0 -2 -6 -2 -9 -11 10 6 8 3 6 -3 1 13 6 -4 7 15 -6 -14 3 -8 0 -2 -9 -11 -15 -6 -17 -2 -3 -12 -17 3 -24 -13 -13 -15 -1
5647a%pNJKj3J4moLOqJ0Pj7J0mRmjOnnJ0kJmj6J3mLroNONj4mONjjLkM%MNJnmJ2
$$ -1 -1 -8 -3 -2 0 -13 1 -3 -9 -6 0 -8 2 9 -8 2 -2 7 3 2 8 3 -2 8 6 7 3 -13 0 -4 -1 -10 -16 -11 -5 0 -14 -18 -12 -7 -8 -9 -6 -8 -4 -4 0 5 6 1 -3 9
5699Ikj8J1nJ3qnQj9J8qJ4mljKpLnRq%Pj5RmKnkkMjOk1J1PJ4Mmj1Oj0J6j0J2j
$$ 9 7 -11 0 -5 8 0 -5 3 -16 2 -6 8 4 1 0 2 -5 -2 -7 2 -6 -6 1 -14 -5 -9 -7 -12 -14 -16 -12 -13 -7 -28 -17 -10 4 8 4 -7 -1 -11 5 -5 7 6
5745Fj4J4rOqKJ1kq%jQj3MN%j2J6j0KJj2LQkjokJOJ0lj5N%lJ2pQqQNnJ3j3lKM
$$ 6 -8 6 -3 3 -5 -3 8 6 -2 -2 -3 5 -8 -4 1 1 -11 5 -5 -3 -2 -14 -11 -3 -5 -6 -12 -14 -13 -7 3 0 -15 -10 -10 -13 -1 -8 0 -8 0 5 0 13 0 -3 -1 3
5793COPk3JjLjoMJoLjQlqJ3mlMrJ0nLJoMRrLmkRrOpJ3j0OLRpNloJ8j2pkKLpoL
$$ 3 9 16 -7 -6 -7 -4 -5 -11 -7 -6 -12 -9 -10 -2 -5 -13 0 -4 -7 -3 -12 -2 -7 -4 -3 -9 -5 4 -5 -2 -6 -8 1 -8 -2 -9 4 -6 0 3 12 5 10 7 1 19 7 0 -2 0 3 -4 -10 -7
5847gJOj7nJ1JlJJ1rkMpK3j5NkqJ3mR%rPkLKPj0mlJrRLoJlLJ4j8OoRojJjq%Rm
$$ -7 -6 0 -17 -22 -11 -10 -13 -12 -1 -10 -12 -8 -15 8 -7 -2 -4 -12 1 -3 6 6 -3 4 2 5 7 14 4 0 -3 -2 -11 -2 1 -5 -4 -7 -4 10 -8 -2 -8 1 -5 -6 -5 -6 -14 -14 -5 -9
5899iLqJ1moJ2kPjoJJ1kjrRknNmlKJK%oJ4j2Kj2QNrMjjQqmJ0j3J3j3PkkR%pLK
$$ -9 -6 -14 -3 -7 -13 -1 -3 4 3 -3 -2 9 7 6 -3 6 4 -1 4 0 -3 -1 0 2 2 -4 10 -2 0 -12 -4 1 -8 -4 -5 -6 2 -6 -10 0 -13 0 -13 -6 -8 -10 -1 -1 -8 -5 -3
5950cLkQoJ6j3J0j3j0J5LRj4LmLjj0kOkj0kJ6j7J2J0j1lJ0j2Rj3J5kmjL%l%J0
$$ -3 0 -2 6 0 16 3 13 0 -10 5 8 17 3 6 2 5 4 -6 -8 -2 -4 -14 -16 0 -17 -5 5 -6 -9 1 -11 -2 -15 0 -2 -6 -7 -4 -4 -7 -7 3
5992CqPJnMj0NLrK7rpJMJ2j7J1qkQrmkQj9J0lJ0j0NnP%LojjNNj5J3K%pMJJ5oj0
$$ 3 -5 2 3 -2 2 -8 -3 0 -9 18 9 2 3 7 19 2 13 5 3 11 2 -2 -4 4 -15 -5 -8 2 -8 -3 -8 -1 -1 2 -4 -5 -6 -1 4 -11 2 4 4 -3 1 2 17 11 1
6041ANknmJ2Qj1%JjLnjMnMkj0JOooJ3krQNj0KQpnJ3KlnOL%LLj3NjJMj4RJnJjP
$$ 1 6 4 -1 -5 7 15 4 4 5 4 7 2 1 5 0 4 2 -8 -7 -1 -7 -13 0 -2 -11 -3 2 -8 -6 2 -5 -10 3 5 2 -3 3 6 6 9 12 -1 4 3 4 8 -6 3 4 -1 0 -1 6
6094Fj1nQKLNj3lnNmP%oJNKnkLnlMQj9J1J3lkoJ3n%oJ2qJ4j7PJnOqrRLqmLpMP
$$ 6 -5 -10 -2 0 3 8 -5 -8 -13 -8 -12 -5 -5 -11 -10 -5 -3 -8 -10 -7 -12 -15 -11 -3 -22 -11 2 -1 -3 -9 4 -1 -1 -7 5 -3 11 -6 1 2 -3 3 -5 -14 -5 -2 -10 -14 -11 -18 -14 -7
6146gPlrMKnMjKQp%nNJrQkQNqRoPkNklomJMrNJ5j2kqPnJj1J%MpQJj1J0J0lNLp
$$ -7 0 -3 -12 -8 -6 -11 -7 -8 -6 2 -5 -5 -10 -5 -4 -13 -5 -7 1 6 -2 7 1 8 6 11 9 6 0 -4 -3 1 -8 -3 12 0 -2 -10 -3 -8 -7 -18 -17 -17 -13 -20 -12 -11 -22 -12 -2 -5 0 3 -4
6201dnJ0Kjjj2PRljkKLkNj3MONqnPpKkplMJJOnpLqP%KQMNlplJ6rkJ1kj0NLl%q
$$ -4 -9 1 3 2 1 -11 -4 5 2 1 -1 1 4 2 7 -6 -2 4 9 1 -4 3 -4 -2 -4 -11 -14 -10 -9 -8 -2 -7 -14 -11 -19 -12 -12 -10 -2 2 7 4 -3 -6 10 1 -1 10 8 -2 3 6 3 3 -5
6256eJ4okoNlrJ3jmlJNnj4J3J2k0J2mppJ1joPoJ3rJ3OkqJ1JmMj8J8j0PNopPRj7
$$ -5 9 3 1 -5 0 -3 -12 1 0 -4 -7 -6 -1 -6 -20 -7 5 -15 -3 -7 -14 -21 -10 -11 -17 -10 -16 -3 -12 1 7 5 -3 8 9 5 9 -9 9 -1 6 11 5 -2 5 14 -3
6303cQj0oQnJ5j0njLMMj1JjmPkJ3j4JL%jLMPj2QNJj9kMJ3qJ9jj3J4rjPoJrPnj2
$$ -3 5 -5 -11 -3 -8 7 -3 -8 -9 -6 -2 2 -9 -8 -9 -13 -6 -8 5 -9 -8 -5 -5 -6 -3 1 8 -4 4 9 10 -9 -11 -7 6 -2 17 16 3 17 8 7 14 8 9 0 7 2 -10
6352a0J9mknqNnOmNRqOolOmnNLMj0Poj0OPLpJ1j3MLOo%J1nlnlJmLPmrJolR%Oj2
$$ -10 9 5 3 -2 -10 -5 -10 -4 -8 -3 6 -2 4 -2 -5 1 -3 -8 -3 0 4 -6 1 -5 -15 -9 -2 1 -6 5 -8 -4 -1 5 -1 -1 10 5 2 -3 -6 -5 -9 -6 1 -3 -12 -11 -17 -20 -11 -11 -5 -17
6406a7KOJ2j8J4ljNkKOnKmNlJMj0QNj6NnMj%jN%Kkkqjj%J4kj1Jj0J1qKJMNkML
$$ -17 -15 -9 3 -15 -1 -4 -5 0 -2 0 6 1 3 -1 4 1 2 6 -4 4 9 -7 -2 -7 -3 -4 -4 -5 0 0 2 0 -2 -10 -11 -12 -12 2 0 -11 -10 -20 -9 -17 -15 -14 -10 -5 -7 -3 0
6457@kMJlJjMLqJ5qNkoLlmNoj5LPkOqMmJ0jKopJ1j3J0njlNMJ1jj4OKnKMLlLnJ
$$ 0 -2 2 3 0 1 0 4 7 -1 14 6 11 9 3 6 3 -1 4 -2 -17 -14 -7 -9 -3 -11 -7 -11 -1 -2 0 -6 -13 -2 -15 -5 -10 -11 -14 -9 -5 6 5 -9 -3 -1 -6 -4 0 3 0 3 -2 -1
6510aK2k3J3n%ljmKmj0J0lj0pJ9koNj2K1%j1jNqMJPKqJ8qJNoj0J1kml%OJmJ1j
$$ -1 21 -2 11 6 6 3 2 -2 0 -4 -14 -4 -7 -17 -24 -5 -7 -13 -8 -20 1 1 -10 -11 -6 -14 -10 -9 -2 0 -8 10 2 3 8 2 -8 3 1 -3 -6 -6 0 1 -3 8 7
6557GnQqlLonO%klqnJ0Lkj1J2KJqJ3j2OnJ4mOj1J1NLj0LpmQKkMmkkkQjj2oRNp
$$ 7 2 10 2 -1 2 -4 -9 -3 -3 -5 -8 -16 -21 -11 -8 -10 -21 -9 -7 -6 -14 -1 -13 -7 -12 2 -2 4 -7 4 9 12 2 5 -2 -6 2 4 2 6 2 0 -2 -4 4 3 -9 -15 -6 -1 -8
6608hLoJ4mmmRnKOrM%kojLKMjQJKOrJkMMj4%qQ%kLoMoNLnJoLklL%LlPqL%OJj6
$$ -8 -5 -11 3 -1 -5 -9 0 -5 -3 3 -6 -2 -2 -4 -10 -11 -8 -6 -2 -3 5 6 8 14 5 6 4 8 12 -2 -2 -10 -2 -2 -4 -1 -7 -3 -9 -4 -1 -6 -5 -11 -8 -10 -13 -10 -10 -7 -10 -3 -11 -8 -8 -2 -1 -17
6666a7RM%J1j3J3loJ3jmqPOj2mJ1Mrj3J0Qj8rJ0LlOnmKljNkP%mK0rkK%lk%j4J0
$$ -17 -8 -4 -4 7 -6 7 4 -2 11 10 6 -2 5 11 -1 -5 6 10 1 -12 -2 6 -12 -21 -11 -8 -11 -5 -10 -14 -12 -15 -16 -11 -13 -6 -6 -10 10 1 -1 1 1 -2 -4 -4 -18 -8
6714hJ8j4NjLmjNpJ2Mj6jKLPr%jj0OKo%klLpKlJ1LknROj3K2j4%P%j1KkJ4nj2%
$$ -8 10 -4 1 0 3 -1 -2 3 -4 8 12 -4 -5 -3 0 7 -2 -2 -3 -13 -7 -5 -11 -11 -13 -16 -13 -20 -18 -21 -10 -7 -9 -14 -5 1 -12 10 -4 -4 3 3 -8 -6 -8 6 1 -11 -11
6763a1J8j2qRk%n%J0koMjJKkjJ0k4mJ2KnMpRMplJ5j7J3LpQJOnoJ2mPnRoj8OlK
$$ -11 7 -5 -13 -4 -6 -6 -11 -11 -1 -3 -9 -5 -6 -5 -3 -5 -6 4 -20 -24 -12 -10 -15 -11 -18 -9 -5 -12 -15 0 -17 -4 -1 -8 0 1 7 2 -4 8 4 11 6 15 9 -9 -3 -6 -4
6812dj0J7q%JpPjqNoOqNLlkKJ0kmmJ1Pj0qJ2q%QlNKjJNnrJ2oOjonMj2KPj1QqL
$$ -4 -14 3 -5 -5 -4 -11 -4 -5 -13 -8 -14 -8 -16 -11 -8 -11 -13 -11 -1 -3 -7 -11 0 7 -3 -11 1 -7 -7 1 -2 3 5 4 5 10 5 -4 8 2 8 7 1 -4 0 -12 -10 -3 -14 -6 -14 -11
6864a1lJPjrJ5oNrjLJ0KpmjQKooQnPOKJnj6J8%j1OJJ0j3PJppPnlMnJ2j7J6j1K
$$ -11 -14 -13 -6 -7 -16 -1 -7 -2 -11 -12 -9 1 3 -4 -8 -9 -1 1 -5 -11 -3 -8 -1 5 7 8 3 -13 5 5 -6 0 1 11 -2 5 6 -1 -8 -1 -6 -9 -5 -10 2 -15 1 -10 -8
6913hpJJ2pR%j1PJ1rjJ0mNkj4lJ1j1J2JrNPLj1qRLNlqPj3J4lnkLOppk%MLj2J2
$$ -8 -15 -14 -2 -9 0 0 -11 -4 7 -2 -3 7 3 8 6 -8 -11 0 -11 1 2 -7 -2 5 8 -3 -11 -2 1 6 3 -5 2 -11 3 0 -5 -7 -4 2 -5 -12 -14 -14 -10 -7 -19 -7
6961gJ1mkLLj3LPJkRpKRj3LrOlQonlPqKlMRqLK%jJ%j4jRoJ5qQrLQj1OJ2j1Po%
$$ -7 4 0 -2 1 4 -9 -6 1 2 0 9 2 4 13 0 3 -6 0 -3 5 -1 -6 -9 -2 -10 -8 -11 -7 2 -6 -3 -1 -1 -2 -1 -1 -15 -16 -7 -13 2 -6 2 -7 -4 4 -7 -1 11 0 7 1 1
7014ALj1J4pRJj3J9j9%nNJj1QmOj0NMj1NMjqJ2pJNjJ1rRrrPKLQo%JpP%J%kK2k1
$$ 1 4 -7 7 0 9 10 -3 16 -3 -3 -8 -3 -2 -13 -5 -9 -3 -13 -8 -4 -15 -10 -6 -7 -15 -3 -10 -9 -4 -5 6 -3 6 -3 -12 -5 -3 0 8 2 2 3 -4 3 3 4 4 2 24 3
7064CqJ3j1JJ2jj3pMOmnpNnPJ0Qj8LmJ1kJnKQj5K4o%pNp%MoOk%NmPoj0J0pRj1
$$ 3 -5 8 -3 -2 10 9 -4 -11 -7 -1 -5 -10 -17 -12 -17 -10 0 8 -10 -7 -11 0 -2 -1 -6 -4 4 -11 13 7 7 0 5 -2 -2 2 -4 2 0 0 5 1 8 2 -8 2 -5 4 -7
7113gn%J3JnknKLrPmJ2j2lRmKNkQj0J8j1lJ5j3OOoJMj6QjnnJ0kkljnlNqOJ0ml
$$ -7 -12 -12 1 2 -3 -5 -10 -8 -5 -14 -7 -11 1 -11 -14 -5 -9 -7 -2 -4 4 -6 12 1 -2 13 0 6 12 6 7 11 -5 3 2 -3 -8 2 0 -2 -5 -6 -11 -14 -9 -17 -11 -1 -5 -8
7163hNoJ0j1PmK%nPj4QJPNj1J2oJ2ln%J8k1ORlrPmrl%J0qpJ0kj6QKKlOmPoJ1O
$$ -8 -3 -9 1 -10 -3 -7 -5 -5 -10 -3 -17 -9 -8 -1 4 -7 5 -1 11 8 3 3 21 0 6 15 12 3 10 6 -3 -6 -6 4 -4 -11 -1 -3 -19 -11 -9 -7 -10 -4 -8 -1 -7 4 10
7212A0j7jNjjQj5NRJmJnNoOO%j2R%lRkj6J5qj%l%jmlJ5lrJ0j0JOnON%J2omjoJ4
$$ 10 -7 -8 -3 -4 -5 3 -12 -7 2 3 -1 0 -5 0 -6 0 6 6 -6 3 3 0 9 7 -9 6 -2 -3 -3 -6 -6 -7 -11 -14 1 -2 -11 -1 -11 -10 -4 -9 -3 2 2 14 8 4 3 -3 11
7263A1nMpkKmjO%Kkj0J6rOlrJ2j1J2j7RL%j4RmpLKJKrL%%PlM%K0j2KlmJ1mpjJ0
$$ 11 6 10 3 1 3 -1 -2 4 4 6 4 -6 10 1 7 4 -5 7 -4 8 -9 0 3 3 -11 -2 -6 -13 -10 -8 -7 -5 -14 -11 -11 -11 -4 -7 -3 -3 17 5 7 4 0 11 7 0 -1 9
7313IklKklNLj1Kno%J1npJ7onRNj4kJ0noRKnJ0k0QMqNOMqKO%l%LoJ2%pj1Lknm
$$ 9 7 4 6 4 1 6 9 -2 0 -5 -11 -11 0 -5 -12 5 -1 -6 3 8 -6 -8 2 -3 -9 0 2 -3 7 -13 -5 -1 -9 -4 2 6 -2 0 6 6 3 3 6 0 12 12 5 -6 -3 -5 -10 -14
7365a4J5moMJj3qJ4mKJ2lJ1j2MjmjNPj0NoNMj5J1Qj1RmO%rMpJ0kj2J0mJnRooJ
$$ -14 1 -3 -9 -5 -4 -17 -25 -11 -15 -13 -1 -4 7 -5 -1 -2 -6 -7 -2 5 -5 0 -6 -1 3 -12 -1 7 -4 5 1 7 7 -2 2 -5 5 3 -9 1 -3 -2 -7 2 -4 -10 -9
7412ij1J2OloPmkN%jLOMnoJ0jmNMj0Rj4J4Kj3OmRj0PnNqj0PQ%Kj1MnRnKmpmJ3
$$ -9 -20 -8 -2 -5 -11 -4 -8 -10 -5 -5 -6 -3 3 7 2 -4 6 5 1 6 10 0 9 -5 9 11 -2 4 0 9 -1 6 1 6 -2 -12 -5 3 3 5 -6 -2 -7 2 -3 -1 -5 -12 -16 -3
7462colPJ%j0J3jkJ3j2P%JMKQj4J3j5lJMpJjnRqLqPjJJkJj1Qj1K4j5QnKMj5J0
$$ -3 -9 -12 -5 -4 -4 -14 -1 -2 -4 9 -3 4 4 5 9 11 19 5 18 3 0 1 5 -2 -1 -2 -7 2 -6 -3 -11 -4 -5 -4 -3 -5 -4 -15 -7 -18 6 -9 -1 -6 -4 0 -15 -5
7510eLmRjNNj3J7j0lJ1j0jkmJNJ0j5JOoJj4LPn%%KpNMMmkjRpJ3j2Pkj3MMKQL%
$$ -5 -2 -6 3 2 7 12 -1 16 6 3 14 4 3 1 -3 -2 3 13 -2 -1 5 -1 0 -14 -11 -4 -9 -9 -9 -7 -14 -9 -5 -1 -5 -7 -8 1 -6 7 -5 2 0 -13 -9 -5 -3 5 8 8
7560HljJ1j6%jRlqJ2mNj8PkNJj4MoJ2j0rJ0KNKj0NKNmk%J1Nj3%LoJ5j0J0j4J2
$$ 8 5 4 15 -1 -1 -2 7 4 -4 8 4 9 -9 -2 -4 1 2 -12 -8 -14 -2 -12 -21 -11 -9 -4 -2 -12 -7 -5 0 -4 -6 -6 5 10 -3 -3 0 -6 9 -1 9 -5 7
7605Gj2J2j3J0jj0RkjlJ4j3J0mkjmqJnOnJ5qjJRqj5J3J0NpjOLNmJj2QjJ7%lj3
$$ 7 -5 7 -6 4 3 -7 2 0 -1 -4 10 -3 7 3 1 0 -4 -12 -11 -16 -10 -15 0 -8 -9 -8 1 -7 -22 -9 1 6 -1 -2 4 7 12 8 9 -3 5 4 21 21 18 5
7651ElLJLJnrjRLlnLrMJ0mjj4RljJ1lj1Ol%JlLJ5j6J2qK0qj0J6nlLqO%J0j7oJ0
$$ 5 2 5 6 9 10 5 -4 -5 4 7 4 -1 2 -7 -3 7 3 2 -12 -3 -6 -7 4 1 -10 -4 -7 -7 -6 -9 -6 9 -7 5 -3 17 9 -1 15 10 7 10 2 8 8 18 1 -5 5
7700EQk5J1Qj6J4j6KlJ6kj1PjkJ1j2J0llMMj2PMpOrOLjrRKJ5opr%J4lnmoNKon
$$ 5 13 -12 -1 7 -9 5 -11 -9 -12 4 2 -9 -2 -3 -5 6 -6 4 1 -2 2 6 -6 1 5 -2 4 -5 1 4 3 -6 3 5 20 14 7 -2 -2 12 9 4 0 -6 -1 1 -5 -10
7748a0J1j3oONJ2j2PKJoJLmrJ6%JqLJ2onOlLknmkK%OJmNj6J1rJ4jKqlJ7nj0rM
$$ -10 1 -12 -18 -12 -7 5 -7 0 2 3 -3 -2 1 -3 -12 4 4 5 -3 0 12 6 1 7 4 7 5 0 -4 -6 -4 -4 2 3 -1 4 -12 -1 -10 4 3 5 -3 -6 11 6 -4 -13 -9
7797ioPoRl%jLQnLNnPjmRqJLoMrKPkmlKJllOlJ0j1OknLklMmMlOpKJJNj0QlMJ0
$$ -9 -15 -8 -14 -5 -8 -8 -9 -6 2 -3 0 5 0 7 6 2 11 3 4 7 1 5 -4 -2 5 3 -1 -4 -2 -1 -4 -7 -1 -4 6 -5 1 -1 -6 -3 -5 -8 -4 -8 -4 -7 -1 -8 -6 -5 -4 1 -9 -1 -4 0 10
7854A0k1J7%j%LLKj5J5j5qMmNJJRj2Mj2qJ5%NjljjJqJ5llnJ9rnmMOKKjm%MNlM
$$ 10 -11 6 6 5 5 8 11 13 -2 13 -2 -10 -6 -10 -5 -4 -3 6 -6 -2 -14 -22 -7 -7 -2 -3 -6 -7 -8 -7 -15 0 -3 -6 -11 8 -1 -6 -10 -6 0 2 4 3 -1 -1 3 8 5 9
$$ [...]
8191a0
##END NTUPLES=NMR FID
##END=
