##TITLE=1H_AM_NVCYClOHU695
 CDCl3
 8 sc, 
 14.04.2022
##JCAMPDX= 6.0         $$ Bruker NMR JCAMP-DX V2.0
##DATA TYPE= NMR FID
##DATA CLASS= NTUPLES
##ORIGIN= UXNMR, Bruker Analytische Messtechnik GmbH
##OWNER= root
$$ XWIN-NMR		Version 3.5
$$ Thu Apr 14 15:54:57 2022 Russian Standard Time (UT+4h)  she@DPX200
##.OBSERVE FREQUENCY= 200.13135
##.OBSERVE NUCLEUS= ^1H
##.DELAY= (6, 6)
##.ACQUISITION MODE= SIMULTANEOUS
##.ACQUISITION SCHEME= undefined
##.AVERAGES= 8
##.DIGITISER RES= 18
##SPECTROMETER/DATA SYSTEM= spect
##.PULSE SEQUENCE= zg30
##.SOLVENT NAME= CDCl3
##.SHIFT REFERENCE= (INTERNAL, CDCl3, 0, 15.7039)
##AUDIT TRAIL= $$ (NUMBER, WHEN, WHO, WHERE, WHAT)
$$ ##TITLE= Audit trail, XWIN-NMR		Version 3.5
$$ ##JCAMPDX= 5.01
$$ ##ORIGIN= Bruker BioSpin GmbH
$$ ##OWNER= she
$$ F:/spectra/data/she/nmr/H-F/1/audita.txt
$$ ##AUDIT TRAIL=  $$ (NUMBER, WHEN, WHO, WHERE, WHAT)
(   1,<2022-04-14 15:53:36.35 +0400>,<she>,<DPX200>,
      <created by zg, POWCHK disabled, PULCHK disabled
       configuration hash MD5:
       00 E9 B6 7A A2 85 ED C7 34 08 36 98 17 FE 4E 26
       data hash MD5: 16K
       62 A5 B0 21 61 75 E1 12 DA 0F 72 9D 22 52 CD 32>)
$$ ##END=
$$ 
$$ hash MD5
$$ 2F 7C B7 E7 45 86 9E 83 EE CA DF ED 6E 47 F6 48
##$RELAX= 
##$RELAX= 
##$RELAX= 
##$RELAX= 
##$RELAX= 
##$RELAX= 
$$ Bruker specific parameters
$$ --------------------------
##$DU= <F:/spectra>
##$EXPNO= 1
##$NAME= <H-F>
##$PROCNO= 1
##$TYPE= <nmr>
##$USER= <she>
##$AMP= (0..31)
100 100 100 100 100 100 100 100 100 100 100 100 100 100 100 100 100 100 
100 100 100 100 100 100 100 100 100 100 100 100 100 100 
##$AQSEQ= 0
##$AQ_mod= 1
##$AUNM= <au_zg>
##$AUTOPOS= <>
##$BF1= 200.13
##$BF2= 200.13
##$BF3= 200.13
##$BF4= 200.13
##$BF5= 200.13
##$BF6= 200.13
##$BF7= 200.13
##$BF8= 200.13
##$BYTORDA= 1
##$CFDGTYP= 0
##$CFRGTYP= 5
##$CHEMSTR= <none>
##$CNST= (0..31)
1 1 145 1 1 1 1 1 1 1 1 1 1 1 1 1 1 1 1 1 1 1 1 1 1 1 1 1 1 1 1 1 
##$CPDPRG= <>
##$CPDPRG1= <>
##$CPDPRG2= <>
##$CPDPRG3= <>
##$CPDPRG4= <mlev>
##$CPDPRG5= <mlev>
##$CPDPRG6= <mlev>
##$CPDPRG7= <mlev>
##$CPDPRG8= <mlev>
##$CPDPRGB= <>
##$CPDPRGT= <>
##$D= (0..31)
0 1.2 0 0 0 0 0 0 0 0.06 0 0.03 0 0 0 0 0.0002 0 0 0 0 0 0 0 0 0 0 0 0 
0 0 0 
##$DATE= 1649937215
##$DBL= (0..7)
120 120 120 120 120 120 120 120 
##$DBP= (0..7)
150 150 150 150 150 150 150 150 
##$DBP07= 0
##$DBPNAM0= <>
##$DBPNAM1= <>
##$DBPNAM2= <>
##$DBPNAM3= <>
##$DBPNAM4= <>
##$DBPNAM5= <>
##$DBPNAM6= <>
##$DBPNAM7= <>
##$DBPOAL= (0..7)
0.5 0.5 0.5 0.5 0.5 0.5 0.5 0.5 
##$DBPOFFS= (0..7)
0 0 0 0 0 0 0 0 
##$DE= 6
##$DECBNUC= <off>
##$DECIM= 32
##$DECNUC= <off>
##$DECSTAT= 4
##$DIGMOD= 1
##$DIGTYP= 9
##$DL= (0..7)
0 120 120 120 120 120 120 120 
##$DP= (0..7)
150 150 150 150 150 150 150 150 
##$DP07= 0
##$DPNAME0= <>
##$DPNAME1= <>
##$DPNAME2= <>
##$DPNAME3= <>
##$DPNAME4= <>
##$DPNAME5= <>
##$DPNAME6= <>
##$DPNAME7= <>
##$DPOAL= (0..7)
0.5 0.5 0.5 0.5 0.5 0.5 0.5 0.5 
##$DPOFFS= (0..7)
0 0 0 0 0 0 0 0 
##$DQDMODE= 0
##$DR= 18
##$DS= 0
##$DSLIST= <SSSSSSSSSSSSSSS>
$$ [...]
##$SUBNAM2= <"">
##$SUBNAM3= <"">
##$SUBNAM4= <"">
##$SUBNAM5= <"">
##$SUBNAM6= <"">
##$SUBNAM7= <"">
##$SUBNAM8= <"">
##$SUBNAM9= <"">
##$SW= 18.05172834244
##$SWIBOX= (0..15)
0 0 2 0 0 0 0 0 0 0 0 0 0 0 0 0 
##$SW_h= 3612.71676300578
##$TD= 16384
##$TD0= 1
##$TE= 0
##$TE2= 300
##$TE3= 300
##$TEG= 300
##$TL= (0..7)
0 120 120 120 120 120 120 120 
##$TP= (0..7)
150 150 150 150 150 150 150 150 
##$TP07= 0
##$TPNAME0= <>
##$TPNAME1= <>
##$TPNAME2= <>
##$TPNAME3= <>
##$TPNAME4= <>
##$TPNAME5= <>
##$TPNAME6= <>
##$TPNAME7= <>
##$TPOAL= (0..7)
0.5 0.5 0.5 0.5 0.5 0.5 0.5 0.5 
##$TPOFFS= (0..7)
0 0 0 0 0 0 0 0 
##$TUNHIN= 0
##$TUNHOUT= 0
##$TUNXOUT= 0
##$USERA1= <user>
##$USERA2= <user>
##$USERA3= <user>
##$USERA4= <user>
##$USERA5= <user>
##$V9= 5
##$VALIST= <valist>
##$VCLIST= <CCCCCCCCCCCCCCC>
##$VD= 0
##$VDLIST= <DDDDDDDDDDDDDDD>
##$VPLIST= <PPPPPPPPPPPPPPP>
##$VTLIST= <TTTTTTTTTTTTTTT>
##$WBST= 1024
##$WBSW= 4
##$XGAIN= (0..3)
0 0 0 0 
##$XL= 0
##$YL= 0
##$YMAX_a= 91538
##$YMIN_a= -87302
##$ZGOPTNS= <>
##$ZL1= 120
##$ZL2= 120
##$ZL3= 120
##$ZL4= 120
##$ABSF1= 10
##$ABSF2= 0
##$ABSG= 5
##$ABSL= 3
##$ALPHA= 0
##$AQORDER= 0
##$ASSFAC= 0
##$ASSFACI= 0
##$ASSFACX= 0
##$ASSWID= 0
##$AUNMP= <proc_1d>
##$AZFE= 0.1
##$AZFW= 0.1
##$BCFW= 1
##$BC_mod= 2
##$BYTORDP= 1
##$COROFFS= 0
##$CY= 11.3945322036743
##$DATMOD= 1
##$DC= 2
##$DFILT= <>
##$DTYPP= 0
##$F1P= 2.36226072786647
##$F2P= -0.459571619588291
##$FCOR= 0.5
##$FTSIZE= 0
##$FT_mod= 4
##$GAMMA= 1
##$GB= 0.15
##$INTBC= 1
##$INTSCL= 1
##$ISEN= 128
##$LB= 0.24
##$LEV0= 0
##$LPBIN= 0
##$MAXI= 10000
##$MC2= 0
##$MEAN= 0
##$ME_mod= 0
##$MI= 1.114404
##$NCOEF= 0
##$NC_proc= 0
##$NLEV= 6
##$NOISF1= 3.799351
##$NOISF2= 2.8
##$NSP= 1
##$NTH_PI= 0
##$NZP= 0
##$OFFSET= 15.70392
##$PC= 1
##$PHC0= -18294.01
##$PHC1= 1.200737
##$PH_mod= 1
##$PKNL= yes
##$PPARMOD= 0
##$PSCAL= 0
##$PSIGN= 0
##$REVERSE= no
##$SF= 200.130013532006
##$SI= 16384
##$SIGF1= 3
##$SIGF2= 2
##$SINO= 400
##$SIOLD= 16384
##$SREGLST= <1H.CDCl3>
##$SSB= 0
##$STSI= 0
##$STSR= 0
##$SW_p= 3612.71676300578
##$SYMM= 0
##$S_DEV= 0
##$TDeff= 0
##$TDoff= 0
##$TI= <>
##$TILT= no
##$TM1= 0
##$TM2= 0
##$TOPLEV= 0
##$USERP1= <user>
##$USERP2= <user>
##$USERP3= <user>
##$USERP4= <user>
##$USERP5= <user>
##$WDW= 1
##$XDIM= 8192
##$YMAX_p= 0
##$YMIN_p= 0
$$ End of Bruker specific parameters
$$ ---------------------------------
##NTUPLES= NMR FID
##VAR_NAME=  TIME,          FID/REAL,        FID/IMAG
##SYMBOL=    X,             R,               I
##VAR_TYPE=  INDEPENDENT,   DEPENDENT,       DEPENDENT
##VAR_FORM=  AFFN,          ASDF,            ASDF
##VAR_DIM=   8192,          8192,            8192
##UNITS=     SECONDS,       ARBITRARY UNITS, ARBITRARY UNITS
##FACTOR=    0.0002768,     1,               1
##FIRST=     0,             0,               0
##LAST=      2.2672688,     0,               0
##MIN=       0,             -87302,          0
##MAX=       2.2672688,     91538,           0
$$ Real data points
##PAGE= N=1
##DATA TABLE= (X++(R..R)), XYDATA
$$ [...]
$$ plain form
1519 1181 1413 252 -938 -1225 -479 868 1557 412 -1313 -1514 -125 1237 1294 132 -1217 -1454 -171
1536 -171 1291 1266 18 -1168 -1306 -132 1345 1426 -125 -1476 -1031 373 1219 1002 -15 -1217 -1270 162
1554 162 1668 1180 -621 -1529 -833 424 1198 922 -374 -1464 -1097 502 1510 820 -679 -1462 -763
1571 -763 689 1426 645 -715 -1328 -630 705 1435 816 -785 -1567 -500 1126 1469 316 -963 -1191
1588 -1191 -400 788 1371 569 -1062 -1619 -305 1268 1306 -10 -1097 -1163 -230 938 1274 276 -1205 -1412
1606 -1412 -2 1366 1191 -84 -1195 -1006 169 1195 1118 -77 -1180 -1118 83 1352 1222 -352 -1484
1623 -1484 -948 502 1222 741 -325 -1115 -1063 186 1397 992 -663 -1544 -676 758 1223 566 -528 -1223
1641 -1223 -729 605 1422 787 -708 -1420 -543 923 1409 384 -892 -1129 -340 723 1160 530 -834
$$ packed form
1519A181K32j161j190k87P46J347O89j145j725k01J389J362N7j162j349k37J283
1536a71J462k5j248j186j38J174J477Q1j551j351M45J404Q46k17j017j202n3J432
1554A62J506m88j801r08O96J257P74k76j296j090L67J599J008o90j499p83O99
1571g63J452P37p81j360o13O98J335P30o19j601p82J067J626L43j153j279k28
1588a191P91J188N83q02j631n57J314J573L8j316j087o6R33J168L36r98j481k07
1606a412J410J368j75j275j111J89J175J026p7j195j103O2J201J269j30j574j132
1623a484N36J450P20m81j066p90N2J249J211m05j655q81Q68J434M65o57j094o95
1641a223M94J334Q17o35j495p12Q77J466M86j025j276k37P89J063M37o30j364
$$ plain form
1658 -834 -1500 -431 1197 1286 -4 -1091 -1070 -158 842 1193 271 -1072 -1327 -80 1228 1212 -17 -1202
1676 -1202 -1029 186 1143 982 -67 -1061 -1039 34 1247 1165 -286 -1412 -951 431 1188 705 -328 -1073
1694 -1073 -958 179 1274 974 -499 -1411 -748 635 1209 686 -459 -1175 -663 535 1264 718 -534
1711 -534 -1251 -620 783 1331 480 -800 -1168 -359 712 1117 432 -751 -1320 -518 916 1308 162 -1056
1729 -1056 -1114 -142 820 1045 295 -894 -1219 -156 1068 1176 35 -1063 -983 103 1077 1009 -36 -1037
1747 -1037 -1006 89 1158 1018 -186 -1214 -987 224 1146 879 -292 -1136 -864 191 1100 853 -330
1764 -330 -1243 -791 459 1174 712 -444 -1133 -611 532 1194 667 -544 -1178 -612 645 1272 553 -702
1782 -702 -1192 -475 661 1127 449 -699 -1193 -435 744 1141 305 -856 -1069 -222 801 1067 247 -902
$$ packed form
1658h34o66J069J628Q9j290j087K1R12J000L51r22j343k55J247J308j6j229j185
1676a202J73J215R57j61j049r94K2J073J213q2j451j126M61J382P57m83j033p45
1694a073J15J137J095l00j473r12O63J383N74n23j145p16N12J198P29n46j252
1711e34p17O31J403N48q51j280l68Q09J071M05o85j183n69Q02J434L92j146j218
1729a056n8R72R62K25p50j189l25J063J224J08j141j098Q0J086R74o8j045j001
1747a037L1J095J069j40j204j028K27J211R22k67j171q44K72J055R09k47j183
1764c30r13M52J250P15m62j156o89N22J143O62n27j211o34N66J257O27p19j255
1782g02m90P17J136M66o78j148m94P58J179L97q36j161k13Q47J023K66q20j149
$$ plain form
1800 -902 -1115 -99 959 1010 107 -885 -1026 -105 1033 1091 -30 -1000 -932 36 952 931 -65 -1035 -943 136
1820 136 1057 785 -244 -1093 -859 218 1102 835 -376 -1168 -721 424 1090 721 -297 -1114 -769 520
1838 520 1289 654 -588 -1055 -493 500 1066 600 -528 -1191 -570 700 1130 363 -726 -1075 -418 656
1856 656 1051 368 -795 -1158 -293 795 1038 285 -752 -1077 -223 880 1030 149 -825 -891 -126 812 1039
1875 1039 169 -937 -1018 76 1038 846 -136 -918 -882 -8 909 961 -99 -1124 -921 249 1036 740 -228
1894 -228 -974 -759 242 1057 764 -330 -1029 -691 383 1127 727 -471 -1089 -576 532 1072 536 -450
1912 -450 -1054 -631 466 1156 567 -660 -1150 -376 653 908 356 -531 -1012 -471 698 1125 293 -807
1930 -807 -963 -165 738 984 251 -725 -984 -199 840 983 133 -794 -918 -128 845 964 13 -953 -867 87
$$ packed form
1800i02k13J016J058N1r03r92j41R21J138N8j121r70O8R68R16k1r96r70R2J079
1820A36R21k72j029q49K34J077Q84k67j211p92M47J145O66l69j018q17L45J289
1838E20P69o35j242m67N62R93N66m66j128o63O21J270M30p67j089l49O57J074
1856F56L95o83j163l63Q65J088K43p53j037l25Q54J103J50q81r74o6P65R38K27
1875A039q70j106q1J094R62j92r82p82L6Q74R17N2j060j025K03J170P87k96r68
1894b28p46K15J001Q15k93j094o99L38J074P44m00j198o18N13J108N40n36r86
1912d50o04M23J097O90n89j227m90P74J029K55n52q87m81N41J169M27q32j100
1930h07j56P98R03K46p33r76k59P85J039J43q50r27j24P90R73J19r51r66Q6R54
$$ plain form
1950 87 798 769 15 -915 -987 104 1060 762 -330 -924 -600 165 893 841 -171 -1060 -782 468 1080 571
1970 571 -362 -872 -608 310 1051 624 -505 -1044 -496 465 913 517 -493 -1132 -495 637 989 283 -584
1989 -584 -890 -457 544 1118 453 -783 -1012 -185 737 887 257 -565 -944 -304 779 1039 156 -846 -902
2008 -902 -62 787 841 74 -826 -906 -9 816 799 -26 -881 -867 49 910 770 -179 -844 -698 158 852 753 -157
2030 -157 -890 -715 296 1002 654 -322 -927 -530 352 847 561 -289 -956 -643 434 1015 451 -575 -943
2049 -943 -370 441 803 437 -460 -988 -492 585 1018 286 -639 -878 -249 598 933 273 -629 -898 -205 676
2069 676 896 214 -771 -980 -88 839 777 -23 -699 -769 -123 680 894 91 -923 -886 123 874 703 -136
2089 -136 -726 -667 58 822 766 -139 -865 -701 254 909 621 -313 -887 -533 345 794 525 -224 -911 -640 347
$$ packed form
1950H7P11k9p54r30p2J091R56k98j092n94L24P65P28n2j012q89K78J250O12n09
1970E71r33n10K64R18P41m27j129n39N48R61M48l96j010o39O37J132L52p06q67
1989e84l06M33J001N74o65j236k29Q27R22J50o30q22l79O40J083K60q83j002n6
2008i02Q40Q49N4p67r00q0Q97Q25j7q25q55J4R16Q61j40r49o65J46Q56O94r9r10
2030a57p33J75J011P06l48r76o05L97Q82M95k86q50o67L13J077N81n64j026l68
2049i43N73Q11L62l66q97n28M96J077M33p32r25k39O29Q47L35o60r02k69O93Q81
2069F76K20o82r85k09Q92R27o2q00o76p0O46Q03K14q03j014L7J009P51j71q39
2089a36n90N9P25P64n6r05p26J64R55O55k88r34n74L54Q78M49k69p49o87K71R87
$$ plain form
2110 347 955 487 -541 -933 -355 390 757 397 -425 -845 -466 478 964 380 -577 -880 -202 660 824 214
2130 214 -504 -775 -287 599 943 281 -718 -919 -74 734 683 47 -657 -783 -189 659 808 11 -836 -802 17
2151 17 772 724 -118 -823 -642 117 741 668 -36 -740 -762 148 972 702 -317 -841 -431 263 682 565 -178
2172 -178 -863 -627 349 932 425 -462 -840 -409 325 809 413 -451 -840 -393 402 851 400 -505 -922 -290
2192 -290 649 798 172 -510 -681 -276 491 885 309 -684 -888 -68 697 700 90 -603 -744 -161 640 796 69
2213 69 -741 -740 -8 744 725 -50 -754 -652 108 732 632 -28 -694 -673 97 878 674 -251 -808 -490 240 693
2235 693 531 -167 -820 -625 245 837 459 -360 -791 -439 323 776 415 -390 -768 -376 382 774 448 -401
2255 -401 -826 -334 584 841 246 -481 -703 -268 449 820 298 -614 -810 -133 610 655 80 -575 -701 -177
$$ packed form
2110C47O08m68j028l92N78P45L67l60q22m20L79R44M86n84r57l03O78Q62J64o10
2130B14p18k71M88Q86L44o62r99k01Q45Q08n1o36p04j26N94Q48J49p97q47L4Q19
2151A7P55m8q42p05J81P59O24p3p04p04k2R10Q24k70j019n24M10O94M19j17p43
2172a78o85K36R76N83n07q87l78M31P34M84l96q64l89M47P95M49m51r05m17O32
2192b90R39J49o26o82j71M05P67L94n76r93k04Q20P65Lo10o93j41N83Q01J56p27
2213F9q10JP32P52j9p75p04J02P60O24j00o60o66K1P70P81k04r25n57L18P30M53
2235F93j62o98o53J95Q70N92l78q19m31L52P62M53l61q05l78L92P58L92l26q49
2255d01m25M92R18K57n95p27k22M35P17L71n22r12j96O77P43M5n75o55j26N24
$$ plain form
2275 -177 581 739 44 -673 -693 -22 651 700 16 -694 -674 94 726 603 -35 -641 -610 87 782 649 -178
2296 -178 -766 -498 186 653 543 -166 -773 -576 281 773 407 -374 -730 -453 279 729 459 -344 -817 -402
2316 -402 426 755 361 -345 -724 -361 465 785 295 -443 -687 -209 464 723 260 -541 -792 -154 575 665
2336 665 118 -546 -681 -170 557 730 86 -632 -681 -37 635 615 18 -593 -621 17 678 619 -27 -686 -576
2357 -576 152 719 566 -137 -687 -538 145 702 556 -187 -731 -531 191 709 455 -245 -733 -460 267 704
2377 704 393 -293 -691 -403 341 751 393 -382 -737 -260 415 680 327 -352 -708 -348 454 758 206 -519
2397 -519 -653 -186 435 631 171 -514 -713 -155 562 630 55 -542 -646 -100 582 647 18 -603 -573 37 556
2418 556 626 80 -626 -601 95 718 560 -123 -611 -505 62 576 551 -145 -720 -531 218 694 387 -232 -661
$$ packed form
2275a77P58J58o95p17k0O71O73M9o84p10K0P68O32j23o38o06L1O97O95j33q27
2296a78n88K68O84M67j10p09o07J97Q57M92l66p81l56K77P32M50k70q03m73M15
2316d02Q28L29l94p06l79L63Q26L20m90p38k44M78O73K59m63q01k51O38P29R0
2336F65n47o64j35N11P27J73o44p18m9O44O72k0n97o11k8O38O61n9o46o59J10
2357e76P28N67j53p03n50J49O83N57j46p43n44K00P22N18k54p00m88K73P27M37
2377G04l11o86l98K88P44M10l58p75l55M77O75K65l53o79l56L60Q02L04n52p25
2397e19j34M67O21J96m60o85j99N58P17O8n75n97j04N46O82O5o29o21L0O10N19
2418E56P0n46p06K5O96O23j58o83m88J06N67N14k5o96n75J89P49M76l07o19m29
$$ plain form
2439 -661 -487 217 676 433 -298 -706 -360 317 686 370 -312 -697 -302 383 697 309 -356 -642 -298 401
2459 401 703 282 -460 -672 -186 474 605 161 -422 -621 -239 500 660 108 -552 -613 -72 479 592 97
2479 97 -532 -623 -2 577 583 30 -559 -563 49 614 548 -76 -590 -454 79 576 519 -89 -655 -533 159 659 428
2502 428 -220 -618 -452 140 624 443 -244 -661 -381 307 648 359 -269 -638 -307 356 644 299 -317 -643
2522 -643 -312 352 688 281 -458 -645 -186 373 567 175 -356 -663 -260 453 664 91 -514 -577 -92 460
2542 460 592 154 -478 -586 -16 567 570 59 -492 -554 -16 595 534 -54 -547 -455 23 505 513 -40 -631 -539 143
2565 143 613 381 -213 -531 -417 98 596 472 -214 -689 -390 300 587 365 -210 -609 -351 316 632 316
2585 316 -270 -581 -319 312 657 253 -387 -601 -251 347 536 200 -365 -614 -272 437 625 124 -492 -603
$$ packed form
2439f61J74P04M59k43p31m08L46O77L69l16o82l85L95O85L14l88o65k86L44O99
2459D01L02m21p42k12M86O60J31m44n83j99L82P39J60n52o60o1N41N51J13m95
2479I7o29r1O21N79On53n89mO12N65o6o24n14J36N33M97n7o08n66J22O92N00k31
2502D28o48l98J66N92M84j81o87m17K80O88L41k89o28l69L31O63K88l45o16l26
2522f43L31O64L36m07p39j87M59N59J94l92n31l07M03P13K11n73o05o3M85N52
2542D60J32m38o32j08N70N83Ln11n51o2N38O11o1n88m93R2M78M82Qn53n91R2O82
2565A43M70k32n94l18J14N15M98j24o86m75K99O90K87k22n75l99K58O67L16l16
2585C16n86l11K62O31L45m04o40k14L50N98J89l36n65k49L42P09J88n01o16j11
$$ plain form
2605 -603 -123 447 545 114 -437 -562 -117 459 590 119 -477 -573 -6 524 496 -33 -478 -466 -38 483 514 -21
2627 -21 -573 -490 80 562 427 -129 -549 -425 82 530 441 -103 -595 -427 219 585 379 -223 -570 -293 230
2648 230 548 357 -239 -573 -346 266 641 284 -371 -588 -202 310 541 215 -310 -601 -262 361 604 207
2668 207 -427 -546 -103 431 537 159 -368 -524 -116 440 570 115 -471 -527 -40 525 506 7 -480 -473 -32
2689 -32 449 514 21 -535 -542 6 526 443 -97 -503 -385 76 485 430 -69 -502 -431 167 591 405 -180 -535
2711 -535 -313 207 523 360 -177 -499 -368 235 598 332 -301 -550 -253 259 499 216 -292 -536 -255 279
2731 279 530 209 -368 -575 -136 393 541 147 -369 -526 -160 400 552 173 -419 -537 -63 484 515 33
2751 33 -423 -461 -49 414 469 35 -509 -483 15 509 456 -47 -524 -444 80 501 432 -68 -463 -424 73 527 420
$$ packed form
2605f03M80N70R8m31n51j25M45N76J31m71n96r6N67N30k8n29m45J2M28N21L1n35
2627b1n52Q3N70M82j35n56m20J24N07M48q9n44m92J68O46L66k06o02l47K77N23
2648B30L18j91n96l34K27O12L75l57o55k17L86N12K31l26n25k91L39O23K43l97
2668B07o34j19M43N34J06l78n27j56M08N56J30m55n86n6M87N65j9m99m87PM41
2689c2M81O5m93n56pN48N20q3n40m06J18M61M09n5m99m33P1N98M24j86n85l55
2711e35K22N20L16j63n37l22J31O03L63k66o33k49K97N12K40k83n08k44K81N34
2731B79K51l21n77k07M39N29J48l94n16j57L66N60J52l79n92j18M74N47L1m82
2751C3m56l8M12M63N5m34n44K6M98M94n3n03m77Q0N24M21o9n00l95L9M97M54j07
$$ plain form
2774 420 -142 -549 -362 214 491 332 -131 -464 -349 178 555 330 -239 -547 -269 261 488 246 -217 -539
2794 -539 -289 288 540 250 -307 -523 -217 315 542 192 -329 -489 -121 380 493 180 -342 -502 -88 434
2814 434 527 61 -418 -485 -62 408 484 45 -462 -500 -29 448 443 -22 -466 -445 15 454 446 -69 -445 -380 116
2837 116 535 404 -76 -456 -353 160 493 365 -111 -513 -332 174 491 336 -145 -507 -336 193 498 234
2857 234 -272 -504 -291 208 476 254 -264 -517 -202 303 514 190 -302 -449 -182 341 534 147 -351 -424
2877 -424 -88 360 441 137 -325 -493 -121 417 462 16 -397 -429 -46 387 421 60 -417 -426 33 447 427 -29
2899 -29 -415 -381 36 465 422 -58 -441 -367 120 426 329 -89 -449 -366 115 487 315 -157 -460 -300 152 483
2921 483 298 -198 -501 -320 234 484 235 -239 -451 -231 207 486 267 -273 -500 -165 313 461 169 -275
$$ packed form
2774D20n62m07J87N76K77j59m63l33J15N27L77k25n69l08K78N30K27k42m63l22
2794e39K50N77K52k90n57k16L06N32K27l50n21j60L68N01J13l13n22j60M14N22
2814D34R3m66m79o7M23M70P6m39n07l8M71M77nm65m44K1M60M39qn15l76O5M96
2837A16M19j31m80l80J03N13L33j28m76m02J81N06L17j55m81l62J71N29L05k64
2857B34n06k32K13M99K68k22n18k53L15N05K11l24m92j47K67N23J93l87m98p3
2877d24L36M48Q1l04m62j68L72N38M5m46m13l2L83M33L4l61m77rM59M14k0m56
2899b9l86L4M17M29m3m80l83P4M87L06r7m18l60Q3M81L72j72m72l03J60M52L31
2921D83j85m96l03J81N54K50k49m74k12K20M38K79k19n40k27L35M78J48k92m44
$$ plain form
2941 -275 -450 -174 319 475 132 -326 -455 -103 319 412 99 -372 -477 -69 370 433 34 -363 -408 -58 367
2962 367 433 27 -416 -363 69 429 354 -21 -351 -398 33 479 401 -100 -428 -314 89 388 337 -104 -489 -366
2984 -366 115 444 255 -153 -428 -293 146 460 301 -213 -460 -205 220 410 251 -188 -408 -224 278 509
3004 509 193 -268 -401 -133 261 397 189 -253 -464 -128 333 415 91 -308 -408 -115 308 412 83 -367
3024 -367 -393 -46 345 377 66 -331 -381 7 415 395 -15 -390 -335 36 396 374 -24 -444 -336 75 429 299
3046 299 -89 -393 -321 79 402 339 -149 -468 -274 177 408 280 -174 -419 -243 182 439 263 -181 -429 -235
3067 -235 195 453 221 -247 -429 -191 258 413 158 -261 -436 -156 265 410 129 -298 -419 -112 302 352
3087 352 104 -285 -371 -82 336 418 53 -317 -370 1 384 383 26 -340 -343 18 392 361 -54 -410 -345 55 385
$$ packed form
2941b75j75K76M93J56l43m58j29L52M22R3l13m71j05M08M39O3l99l97m5L50M25
2962C67O6m06m43N3M32L60p5l75l30m7M31M46p8n01l28J14M03K99n1m41l85J23
2984c66M81L29j89m08k75J35M39L14j59n14k47K55M25J90j59m39k20J84N02K31
3004E09l16m61j33K68L94J36k08m42k11L36M61Q2l24l99j00K93M23J04l29m50
3024c67k6L47L91L2l11l97n0L88M08k0m10l75N5L71L60k2l98m20J08M11L54j30
3046B99l88l04P2M00L23o3m88l19J94M51K31j28m54k45J76M25K57j76m44k48J94
3067b35M30K58k32m68j82K38M49J55k55m19j75K80M21J45k81m27j21L07M14N0
3087C52k48l89q6K89M18Q2l65l70n3L71L83jl57l66lL61L74l1m15l56O5M00L30
$$ plain form
3110 385 310 -85 -403 -341 71 400 298 -125 -417 -297 134 433 258 -156 -396 -233 139 427 261 -155 -414
3131 -414 -222 216 444 214 -218 -388 -168 228 403 193 -256 -428 -161 265 409 139 -323 -380 -127 274
3151 274 367 94 -276 -381 -83 322 379 81 -340 -379 -33 328 383 39 -293 -335 -31 358 384 40 -362 -346
3173 -346 24 367 333 -54 -358 -281 5 324 309 -80 -380 -307 123 399 241 -119 -349 -234 149 383 283
3194 283 -160 -423 -221 178 400 226 -177 -395 -199 209 372 158 -203 -386 -184 218 388 186 -235 -411
3214 -411 -107 287 367 105 -224 -350 -145 270 418 102 -285 -375 -75 287 343 97 -279 -340 -55 305 323 3
3236 3 -324 -333 -12 340 338 -31 -377 -298 44 294 287 -30 -317 -317 62 400 287 -125 -334 -208 95 336 292 -82
3260 -82 -364 -248 156 363 216 -124 -352 -213 175 389 159 -190 -378 -190 146 328 202 -217 -402 -185
$$ packed form
3110C85p5l95l18O2M12L29j02m23k92J20M31K99j75m14k40J63L72K88j66m16k59
3131d14J92M38K28k30m32j70K20L96J75k10m49j72K67M26J44k70m62n7K53M01
3151B74R3k73l70j05K98M05N7k98m21l9L46L61N5l44l32m2L04L89K6l44m02J6
3173c46L70L43l4l87l04P7K86L19j5l89l00P3M30K76j58l60k30J15L83K34j00
3194B83m43k63K02L99K22j74m03k18J96M08J63k14l61j83K02M02J70k02m21j76
3214d11L04L94Q0k62l29j26K05M15J48l16l87r0L00L62N6k46l76o1K85L60J8l20
3236Cl27rL21L52kl69l46P9L42K50pl17k87%L79L38j13m12k09J26L03K41m4l74
3260h2k82J16M04K07j47l40k28J39L88K14k30l49j88J88L36J82j26m19j85K17
$$ plain form
3280 -185 221 375 115 -241 -315 -112 203 372 117 -264 -370 -78 305 374 84 -258 -331 -35 302 315 48
3301 48 -300 -318 -51 321 354 -7 -315 -313 8 300 258 12 -315 -335 24 338 271 -58 -362 -265 75 330 264
3324 264 -75 -350 -225 82 343 236 -115 -348 -228 156 366 193 -149 -299 -203 146 341 190 -161 -360
3344 -360 -183 212 333 155 -198 -312 -124 206 369 125 -237 -343 -78 247 371 127 -275 -340 -86 264
3364 264 284 37 -245 -345 -93 263 350 -4 -308 -317 14 296 265 6 -283 -282 -5 304 300 -24 -319 -271 76
3387 76 318 266 -39 -321 -210 111 336 250 -102 -326 -249 101 328 205 -157 -333 -184 121 313 179 -152
3408 -152 -331 -203 159 364 174 -193 -348 -141 209 353 136 -198 -292 -110 222 338 113 -237 -308 -58 243
3429 243 290 62 -259 -287 -40 228 298 26 -291 -323 -26 265 267 -22 -300 -285 -6 279 289 8 -307 -270 26
$$ packed form
3280a85M06J54k60l56p4K03L15J69k55l81j06K92L83O9k90l42p3K96L37J3k67
3301D8l48j8K67L72L3l61l08KL21K92m2k46l27k0L59L14o7l29l04R7L40K55o6
3324B64l39k75J25L07K61j07l51k33J20L84K10j73l42j50R6L49J95j51l51j99
3344c60J77L95J21j78l53j14J88L30J63k44l62j06K65L25J24k44m02o5K54L50
3364B64K0k47k82j00K52L56Q7l54l04rL31K82l1k59k89JK77L09ml24k95M8L47
3387G6K42n2l05k82J11L21K25q6l52k24P7L50K27j23l62j76J49L05J92j34l31
3408a52j79J28L62K05j90l67j55K07L50J44k17l34r4J82L32J16k25l50p1K50L01
3429B43M7k28l21k8K47K68P0k72l17l2K97K91Kk89k78J5K79K85J0k81l15L7K96
$$ plain form
3452 26 336 263 -55 -313 -252 86 268 209 -70 -305 -262 95 320 224 -137 -318 -192 126 315 195 -130 -312
3474 -312 -177 148 317 152 -130 -302 -127 185 331 140 -210 -312 -131 175 304 111 -213 -328 -93 233
3494 233 289 39 -244 -270 -74 198 285 59 -269 -314 -21 267 252 5 -255 -289 4 264 284 -6 -240 -243 40
3517 40 305 257 -13 -327 -257 49 275 216 -37 -279 -243 47 307 189 -108 -306 -178 89 278 173 -116 -326
3539 -326 -196 158 306 166 -119 -301 -189 165 318 173 -143 -296 -109 161 296 175 -198 -300 -102 208
3559 208 296 62 -188 -268 -105 190 310 90 -278 -305 -46 237 251 54 -223 -293 -32 254 272 -9 -243 -249 5
3582 5 256 280 -20 -289 -231 39 257 229 -30 -270 -266 42 333 224 -100 -292 -187 87 262 222 -77 -312 -215
3605 -215 96 309 159 -139 -276 -143 125 311 175 -153 -293 -136 147 277 115 -167 -309 -138 184 288
$$ packed form
3452B6L10p3l18k58O1L38J82n9k79k35M3L57K25r6l61j81J26L18J89j20l25j82
3474c12J35L25J69j65k82j72J75L12J46j91l50j02J81L06J29j93l24j15K35L26
3494B33N6k50k83k6J96K72Q7k26l28m5K93K88j5k47k60l4K93K60K0k90k34lK83
3517D0K65m8k70l14P0L06K26n9k53k42L6K90K60j18k97j98J28K67J89j05k89k10
3539c26J30L54J48j40k85j82J12L54J53j45l16j53J87K70J35j21l73j02J98L10
3559B08Q8k34k50q0J63K95J20k20l68k7K59K83J4j97k77p0K61K86J8k81k34oK54
3582EK51K4l00k69N8K70K18k8k59k40ML08K91j09l24j92J05K74J75m0k99k35R7
3605b15L11K13j50k98j37J33K68J86j36l28j40J57K83J30j62k82j42J71L22J04
$$ plain form
3625 288 103 -199 -269 -113 141 268 85 -148 -318 -46 242 259 56 -231 -248 -25 200 298 52 -224 -257 3
3647 3 243 240 5 -245 -237 -4 257 233 -14 -271 -230 15 247 201 -35 -279 -229 65 275 203 -90 -260 -181 53
3671 53 267 215 -95 -290 -151 142 284 170 -120 -240 -124 157 312 145 -133 -300 -135 146 252 113 -151
3692 -151 -273 -106 180 252 76 -198 -255 -88 205 264 59 -203 -244 -20 207 255 41 -165 -234 -49 224 272
3714 272 25 -240 -213 -1 248 213 23 -247 -247 0 266 216 -50 -241 -212 39 254 206 -57 -275 -221 73 262
3737 262 214 -109 -272 -203 81 261 202 -117 -278 -143 132 243 164 -115 -259 -168 149 270 115 -143 -288 -133
3759 -133 129 246 97 -160 -265 -79 162 257 60 -168 -269 -71 207 243 44 -192 -252 -19 195 238 30
3780 30 -196 -270 -22 254 206 -14 -236 -236 -22 219 205 -45 -278 -237 20 262 186 -39 -222 -171 68 233 187
$$ packed form
3625B88j85l02p0J56K54J27j83k33j70K72K88J7k03k87j7K23K25R8k46k76l3K60
3647CK40lk35k50QK33K61k4k47k57M1K45K32m6k36k44N0K94K10p2k93j70P9K34
3671E3K14n2l10j95J39K93J42j14k90j20J16K81J55j67k78j67J65K81J06j39k64
3692a51j22J67K86P2j76k74n7J67K93N9k05k62m1K24K27M8k14k06o9J85K73M8
3714B72k47k65K7K12K49l5j90k70%K47K66n0k66j91K9K51K15m8k63k18N4K94J89
3737B62m8l23j63O9K84J80n9l19j61J35K75J11p9k79j44R1L17J21j55k58j45J55
3759a33K62J17j49k57j05J86K41R5j97k28j01J98K78L6j99k36o0K33K14M3k08
3780C0k26p4K48K76m8k20k22%K14K41j4k50k33M1K57K42p6k25j83N1K39J65m6
$$ plain form
3803 187 -63 -244 -170 82 264 173 -67 -280 -143 108 270 118 -127 -239 -148 85 257 120 -153 -257 -120
3824 -120 147 258 84 -171 -269 -123 129 253 92 -150 -251 -70 202 276 102 -169 -229 -42 163 226 38
3845 38 -140 -249 -43 216 249 12 -230 -208 -2 189 181 25 -209 -230 9 216 203 -42 -230 -218 32 222 211
3868 211 -51 -228 -157 53 226 175 -27 -232 -142 65 235 139 -104 -229 -153 82 236 167 -97 -257 -153 121
3890 121 251 123 -136 -224 -104 115 262 126 -124 -241 -82 149 263 97 -168 -243 -48 179 238 38 -191
3911 -191 -222 -60 153 221 50 -198 -246 0 198 221 21 -163 -214 -13 176 225 -11 -217 -208 13 221 204 -6
3934 -6 -173 -178 22 233 190 -34 -257 -184 54 220 190 -61 -245 -163 61 229 150 -88 -245 -164 79 217 126 -97
3958 -97 -247 -134 122 235 114 -101 -222 -108 128 252 117 -115 -231 -37 199 218 94 -151 -225 -70 159
$$ packed form
3803A87k50j81P4K52J82r1k40k13J37K51J62j52k45j12R1K33J72j37k73j04J37
3824a20K67J11j74k55r8J46K52J24j61k42j01J81K72P4j74k71o0J87K05O3j88
3845C8j78j09K06K59L3k37k42K2K06J91qj56k34k1K39K07j3k45j88J2K50J90j1
3868B11k62j77P1K10J73n1k02k05R0K07J70r6k43j25P6K35J54o9k64j60J04K74
3890A21J30j28k59q8J20K19J47j36k50j17J59K31J14j66k65p5J95K27N9k00k29
3911a91l1J62K13O8j71k48m8K46J98K3k00j84n1K01J89M9k36k06RK21K08j7k10
3934fj67nK00K11m3k24k23P3K38J66l0k51j84Q2K24J68p9k38j57Q1K43J38r1k23
3958i7j50J13K56J13j21k15j21J14K36J24j35k32j16J94K36J9j24k45p4J55K29
$$ plain form
3979 159 223 37 -184 -222 -45 165 229 26 -200 -226 -46 180 200 -9 -210 -203 -13 208 192 -6 -218 -188 48
4002 48 205 198 -6 -186 -165 20 235 171 -72 -233 -179 66 219 177 -73 -243 -173 77 226 135 -72 -214 -151
4025 -151 79 235 138 -126 -222 -95 106 218 108 -100 -237 -98 151 216 83 -147 -221 -66 144 215 87 -162
4047 -162 -217 -78 164 206 41 -145 -220 -33 204 234 41 -180 -207 10 180 205 21 -177 -217 19 190 189 11
4070 11 -233 -183 34 219 167 -39 -226 -203 37 222 157 -56 -212 -145 57 203 158 -74 -227 -126 75 225
4092 225 118 -80 -206 -132 117 259 110 -87 -189 -92 109 226 91 -106 -206 -90 142 224 73 -150 -183
4113 -183 -82 155 204 63 -177 -206 -59 157 193 29 -155 -215 -50 179 218 -12 -176 -156 1 175 207 11
4135 11 -179 -157 40 176 178 -31 -160 -163 46 192 171 -32 -185 -143 44 163 169 -57 -209 -159 72 207 119 -62
$$ packed form
3979A59O4j86k21l8J77K10O4k03k26k6J80K26K0k09k01PJ90K21j6j98k12L0K36
4002D8J57pk04j80K1J85K15o4k43j61N4K45J53m2k50j70P0K50J49r1k07j42O3
4025a51K30J56r7k64r6J27K01J12j10k08j37J39K49O5j33k30p4J55K10P1j28k49
4047a62n5J39K42M2j65j86p5J87K37L0j93k21k7K17J70K5j84j98m0K36J71jj78
4070A1k44N0K17J85n2k06j87K3K40J85o5k13j56O7K02J46m5k32j53J01K01J50
4092B25j07j98j26P4K49J42j49j97j02R7K01J17j35j97j00J16K32Q2j51k23l3
4113a83J01K37M9j41k40k9J47K16L6j64j84o0J65K29L9k30j64K0J57J74L2j96
4135A1j90K2J97J36Kk09j29lK09J46k1k03j53M2J87J19Ok26j52N0K31J35q8j81
$$ plain form
4159 -62 -210 -134 61 201 153 -91 -213 -96 107 182 89 -122 -220 -82 125 209 71 -116 -210 -38 129 206 61
4182 61 -126 -216 -68 146 220 44 -170 -202 -21 170 200 52 -157 -165 -13 168 189 -4 -176 -191 -7 168 170 -2
4206 -2 -196 -194 21 184 140 -22 -199 -162 42 185 186 -19 -200 -122 62 192 142 -30 -203 -121 71 193 138 -51
4230 -51 -187 -108 86 186 117 -100 -214 -95 83 191 100 -108 -223 -90 105 194 65 -141 -192 -67 125 177
4252 177 55 -109 -182 -56 168 204 61 -151 -173 -32 154 197 25 -151 -165 -21 175 163 15 -185 -181 -6 172
4275 172 157 -22 -171 -175 11 174 137 -48 -163 -164 26 198 141 -57 -185 -136 70 188 151 -40 -168 -142 90
4298 90 210 127 -56 -181 -116 75 204 115 -65 -183 -113 92 201 70 -123 -186 -86 140 211 89 -137 -182 -51
4321 -51 143 187 60 -114 -205 -59 158 176 7 -168 -184 -36 124 180 38 -183 -162 -21 167 185 -34 -164 -140
$$ packed form
4159f2j48P6J95J40m8k44j22J17K03P5r3k11r8J38K07Q4j38j87r4J72J67P7j45
4182F1j87r0J48K14P4j76k14l2J81J91L0j48k09qJ52J81K1j93j72j5J84J75Kj72
4206bj94KK15J63m4j62j77L7K04J43Jk05j81P8J84J30n0j72j73Q2J92J22n5j89
4230e1j36P9J94J00o9k17j14J19J78J08r1k08j15J33J95Q9j29k06n1J25J92N2
4252A77j22j64p3J26K24L6j43k12k2J41J86M3j72j76j4J44J96j2j48k00MJ75J78
4275A72j5j79j49mJ86J63l7j85j15jJ90J72n7j98j28M9K06J18l7j91j28K6K32
4298I0J20q3j83j25O5J91J29q9j80j18P0K05J09j31j93o3J00K26P1j22k26m5J31
4321e1J94M4j27j74r1J46K17J8j69j75j6J48J60N6j42k21K1J41J88J8k19j30K4
$$ plain form
4344 -140 7 182 171 -19 -166 -139 28 216 159 -15 -171 -128 43 211 142 -62 -177 -106 49 168 135 -66
4366 -66 -196 -129 78 150 91 -111 -158 -129 61 200 120 -89 -203 -85 100 184 84 -137 -194 -73 111 187 81
4389 81 -90 -164 -56 106 209 48 -134 -174 -26 128 185 18 -131 -168 -44 120 177 44 -162 -170 -6 164 154
4412 154 -7 -173 -150 21 169 166 -8 -168 -165 36 178 143 -4 -159 -133 48 187 135 -60 -192 -103 52 190
4435 190 125 -38 -186 -90 68 162 128 -79 -172 -106 101 161 84 -91 -165 -56 109 182 83 -78 -180 -84 120 179
4459 179 54 -129 -198 -42 134 149 31 -112 -177 -53 144 166 24 -140 -143 -32 160 184 3 -180 -172 2 135
4482 135 149 9 -130 -147 18 179 163 -41 -172 -134 39 171 124 -25 -180 -136 62 152 85 -63 -181 -121 77
4505 77 171 98 -61 -191 -123 74 165 115 -80 -182 -98 108 194 91 -64 -164 -63 129 208 59 -114 -208 -34
$$ packed form
4344a40J47J75j1j90j47K7J67J88n7j74j56M3J71J68o9k04j15P1J55J19l3k01
4366f6j30O7K07P2n9k02m7K9J90J39q0k09j14J18J85Q4j00k21n7J21J84P6j06
4389H1j71p4J08J62J03j61j82m0J48J54N7j67j49l7J24J64N7j33k06qJ64J70j0
4412A54j61j66K3J71J48lj74j60LK01J42l5j47j55K6J81J39n2j95j32Q9J55J38
4435A90o5j63j48R6J58R4l4k07r3O6K07O0p7j75p4J09J65P3r9j61j02R6K04N9
4459A79j25j83o9J56J76J5j18j43o5J24J97K2j42j64lJ11J92K4j81j83QJ74J33
4482A35J4j40j39j7J65J61j6k04j31L8J73J32m7j49j55M4J98R0o7j48j18O0J98
4505G7R4p3j59j30O8J97R1n0j95j02Q4K06Q6j03j55j00J01J92P9j49j73r4J74
$$ plain form
4528 -34 120 147 50 -134 -167 -75 161 166 15 -130 -164 -44 107 167 27 -135 -162 -23 147 140 22 -138 -136 9 194
4553 194 175 21 -166 -127 13 161 159 -11 -142 -148 47 165 125 -76 -144 -104 58 155 134 -41 -192 -91 81 179
4577 179 103 -78 -177 -103 78 192 77 -93 -169 -68 88 157 71 -90 -175 -88 123 165 56 -89 -174 -54 95
4600 95 171 57 -135 -127 -5 143 151 31 -130 -140 -14 160 198 -3 -122 -137 -3 126 144 -41 -146 -166 -11 150
4624 150 106 -27 -173 -152 7 147 152 -26 -152 -122 24 169 111 -64 -143 -119 69 193 107 -63 -184 -90 56
4647 56 148 97 -58 -152 -117 94 152 83 -81 -164 -95 69 133 64 -115 -170 -28 103 138 18 -121 -145 -64 115 143
4672 143 41 -132 -167 -34 130 167 24 -124 -148 6 157 190 15 -154 -141 -5 139 126 9 -157 -154 30 132
4695 132 121 -12 -192 -154 29 144 123 -55 -174 -130 47 174 125 -26 -165 -118 55 175 121 -45 -169 -76 90
$$ packed form
4528c4J54K7r7j84l3R2K36Nj51j45l4J20J51O0j40j62k7J39J70pj18j60KJ45J85
4553A94j9j54j87L9J40J48kj70j31oJ95J18m0k01o8M0J62R7k1j75j51J01J72R8
4577A79p6j81r9P4J81J14j15j70p6J01J56O9q6j61q5Q7K11M2j09j45q5J20J49
4600I5P6j14j92QJ22J48Qj20j61j0J26J74L8k01j19j5J34J29J8j85j05k0J55J61
4624A50m4j33j46K1J59J40Nj78j26L0J46J45n8j75p9K4J88J24q6j70j21R4J46
4647E6R2n1j55r4L5K11N8o9j64q3O9J64O4o9j79n5J42J31L5j20j39k4Q1J79K8
4672A43j02j73l5J33J64L7j43j48k4J54J51L3j75j69J3J36J44j3j17j66LJ84J02
4695A32j1j33j80L8J83J15k1j78j19M4J77J27m9j51j39M7J73J20n4j66j24R3J66
$$ plain form
4718 90 142 91 -71 -161 -74 91 165 89 -73 -166 -86 99 151 60 -98 -162 -47 96 172 36 -96 -132 -29 117 140
4743 140 23 -111 -144 -41 119 157 -13 -130 -137 -2 133 151 -4 -117 -141 -7 141 131 -23 -160 -113 38 141
4766 141 129 -25 -145 -108 6 142 124 -43 -146 -94 44 158 90 -42 -121 -108 39 148 93 -84 -158 -85 74
4789 74 133 80 -108 -198 -69 81 138 63 -85 -138 -73 71 176 85 -83 -154 -33 104 164 61 -84 -155 -31 112
4813 112 158 26 -123 -141 -20 116 115 -2 -120 -135 -24 123 163 -20 -149 -142 -8 132 145 -45 -144 -105 21 142
4837 142 125 -21 -147 -127 37 133 126 -60 -159 -114 26 129 89 -58 -139 -97 54 170 86 -53 -160 -91 94 171
4861 171 70 -83 -165 -72 84 160 65 -109 -163 -45 83 151 46 -101 -119 -27 90 144 21 -90 -150 -21 143
4884 143 130 15 -117 -137 -11 123 138 24 -121 -135 6 144 129 1 -110 -119 47 129 143 -32 -125 -126 42 157
$$ packed form
4718I0N2n1j62r0Q7J65P4p6j62r3Q0J85N2r1j58o4J15J43P6j36j32l6J03J46K3
4743A40j17j34l3J03J60L8j70j17pJ35J35J8j55j13k4J34J48j0j54j37M7J51J03
4766A41j2j54j20L7J14J36j8j67j03N2J38J14o8j32p9J3J47J09n5j77p4P3J59
4789G4N9n3j88r0J29J50N7p5j48n3O5J44J05r1j68p1J21J37O0j03j45p1J24J43
4813A12M6j32j49j8J21J36jj17j18j5J11J47M0j83j29PJ34J40J3j90r9L9J26J21
4837A42j7j46j26K0J64R6pj86r9M5J40J03m0j47q1M2J51J16q4j39j07O9J85P7
4861A71j01j53q2R3J56P6r5j74n4J18J28O8j05j47j8R2J17N4j23j11o0J29J64
4884A43j3j15j32k0J26J34J5j14j45j4J41J38j5j28j11rJ66Q2J4j75r3jJ68J15
$$ plain form
4908 157 101 -49 -142 -107 42 118 80 -26 -165 -113 54 144 74 -79 -126 -65 74 130 81 -74 -146 -84 87 144 69
4933 69 -80 -144 -82 94 147 42 -99 -127 -39 56 152 29 -97 -133 -52 119 145 4 -120 -135 8 105 130 3 -114
4958 -114 -133 -20 127 121 8 -141 -109 5 138 107 -18 -131 -116 44 139 117 -17 -147 -88 48 136 105 -48 -140
4982 -140 -112 29 143 84 -54 -122 -114 76 134 67 -66 -144 -83 64 172 72 -54 -157 -66 58 137 55 -84 -147
5006 -147 -37 86 128 66 -102 -146 -42 84 130 32 -118 -122 -19 109 124 17 -77 -116 -10 99 136 11 -95 -121
5030 -121 13 133 102 -14 -126 -115 2 109 107 -9 -123 -116 28 119 101 -35 -159 -97 30 134 93 -57 -144 -64
5054 -64 45 134 76 -40 -141 -64 69 158 97 -52 -133 -78 64 152 68 -82 -138 -23 76 136 56 -91 -137 -63 80
5079 80 114 34 -100 -137 -41 88 117 36 -117 -148 -40 116 139 -29 -106 -133 -20 100 117 23 -105 -117 -22 128 121 4
$$ packed form
4908A57n6j50r3L5J49P6l8j06j39N2J67R0p0j53m7O1J39N6m9j55p2O2J71N7p5
4933F9j49o4O2J76N3j05j41k8Q8R5R6j23j26l6Q1J71K6j41j24j5J43R7K5j27j17
4958a14j9J13J47oj13j49L2J14J33l1j25j13J5J60R5k2j34j30N9J36Q8l1j53r2
4982a40K8J41J14n9j38o8QJ90N8o7j33p8O1J47J08j00j26j03R1J24P9q2j39o3
5006a47J10J23M2o2j68m4J04J26M6r8j50mJ03J28J5j07r4l9J06J09L7j25j06k6
5030a21J34J20l1j16j12J1J17J07kj16j14PJ44R1j8j36j24O2J27J04m1j50q7Q0
5054f4J09Q9n8j16j01P7J33Q9o1j49q1N5J42Q8q4j50n6J15R9O0q0j47m6P4J43
5079H0L4q0j34l7R6J29K9q1j53l1J08J56K3j68p7k7J13J20J7r4j28j2R5J50pj17
$$ plain form
5105 4 -120 -113 0 139 100 -47 -94 -97 39 116 85 -47 -137 -96 23 129 118 -44 -142 -60 30 133 100 -61 -151 -63
5131 -63 61 126 69 -60 -151 -71 80 132 50 -72 -151 -49 70 143 78 -65 -128 -39 73 129 36 -107 -127 -23 97
5156 97 136 30 -100 -123 -31 83 110 15 -99 -125 -10 80 107 -1 -104 -100 -12 119 105 -27 -118 -137 11 104 114 -24
5182 -24 -105 -100 26 108 90 -32 -111 -98 44 141 104 -22 -135 -84 64 112 83 -72 -172 -67 38 123 80 -52 -122
5207 -122 -55 57 114 57 -85 -152 -62 66 134 28 -88 -105 -9 99 146 25 -86 -138 -33 95 132 48 -99 -108 -18
5232 -18 89 134 22 -116 -120 -6 105 114 19 -117 -109 16 109 103 24 -123 -66 21 125 81 -24 -114 -94 20 105 90 -17
5259 -17 -124 -74 46 136 103 -31 -135 -71 55 121 45 -46 -131 -92 98 125 53 -61 -135 -41 93 106 60 -80 -122 -40
5285 -40 74 114 57 -96 -142 -15 93 127 50 -105 -135 -47 83 119 18 -102 -113 -45 82 100 -5 -113 -110 -13 101
$$ packed form
5105Dj24PJ13J39l9j47m7lJ36P7l1j32r0M1J19J06j1j62r8Q2R0J03l3j61r0Q8
5131f3J24O5n7j29r1Q0J51N2q2j22p9J02J19P3o5j43o3Q9J12N6r3j43k0J04J20
5156I7L9j06j30k3R2J14K7r5j14k6J15R0K7j08j03MQ8J31j4j32r1j9J48R3J0j38
5182b4q1NJ26Q2j8j22p9J3J42R7l7j26j13N1J48M8k9j55j00J05J05Q5m3j32p0
5207a22O7J12N7n7j42o7R0J28O8j06j16j7R6J08M7j21j11n2J05J28L7q4j47rR0
5232a8J07M5j12j38mJ14J11Rr5j36QJ25R3op9j47N7Q7J04m4j05r0K0J14Q5j5j07
5259a7j07N0J20R0l3j34j04O4J26O6p6r1q5L9J90K7p2j14p4R4J34J3m6j40m2Q2
5285d0J14M0n7j53m6J27J08L4p7j55l0Q8J30L6j01j20j1O8J27J8j05j08LR7J14
$$ plain form
5310 101 103 3 -88 -99 -4 129 90 16 -118 -110 9 121 98 -24 -96 -97 52 98 76 -48 -112 -94 25 130 90 -80
5336 -80 -122 -64 9 117 60 -42 -128 -66 68 101 78 -76 -115 -52 85 105 34 -65 -109 -43 99 130 47 -83 -124 -34 96
5363 96 119 14 -91 -124 -26 75 93 -3 -84 -136 -3 66 78 0 -115 -120 1 78 108 22 -120 -91 5 124 75 -23 -115
5390 -115 -73 15 102 96 -22 -106 -48 17 96 69 -32 -120 -76 36 108 58 -27 -116 -92 27 135 69 -48 -118 -68 70 98
5417 98 82 -70 -119 -81 72 127 28 -86 -122 -78 95 122 19 -86 -118 -20 91 120 45 -69 -122 -25 108 85 -14 -110
5443 -110 -119 2 103 105 20 -93 -115 5 96 123 -22 -125 -106 14 111 75 -41 -99 -126 -5 93 104 -42 -106 -80 2
5469 2 121 91 -34 -107 -55 33 118 106 -52 -136 -63 60 114 70 -48 -100 -50 69 104 66 -82 -102 -22 70 140 10 -78
5496 -78 -97 -19 67 98 5 -68 -118 -20 82 113 18 -108 -99 -19 98 96 18 -94 -88 -6 120 103 4 -96 -69 36 129 97
$$ packed form
5310A01Kj00r1j1R5J33l9p4j34QJ19J12k3j22p2jJ49M6k2j24o4J8J19J05m0j70
5336h0m2N8P3J08n7j02q6O2J34L3k3j54l9O3J37K0p1r9m4O6J42L1q3j30m1R0J30
5363I6K3j05j05l3R8J01J8r6q1n2J33O9J2p8j15nJ21P7L0q6j42K9R6J19m9r8r2
5390a15M2Q8Q7oj18q4N8O5P9k7j01q8M4J12P2n0q5q9K4J19J08o6j17p0N0J38K8
5417I8j6j52m9L8J53N5r9j14l6M4J73K7j03j05l2R8J11K9p5j14n3R7J33k3r9r6
5443a10rJ21J01Kq5j13k2J20R1K7j45j03J9J20R7l6j16n8k7J21R8J1j46o4K6Q2
5469BJ19l0j25p3N2Q8Q5j2j58q4P3J23N4m4j18n2N0J19L5l8j48k0Q0R2P0j30q8
5496g8j9P8Q6L1r3p3n0R8J02L1r5j26RQ0J17kp8j12OQ2J26j7r9j00K7J05R3l2
$$ plain form
5524 97 -21 -103 -93 -1 95 94 -13 -113 -73 51 98 93 -47 -96 -108 26 126 86 -30 -113 -62 46 94 42 -60 -103
5550 -103 -59 49 130 48 -47 -117 -47 44 110 40 -65 -114 -41 56 105 25 -61 -94 -33 80 104 12 -112 -102 -18 99 100 26
5578 26 -69 -102 -2 98 96 11 -92 -105 21 106 77 4 -96 -101 -9 69 90 -48 -77 -77 31 108 77 -29 -98 -84 47
5605 47 102 75 -24 -107 -40 51 117 69 -69 -129 -44 37 119 43 -57 -101 -41 62 98 50 -107 -117 -56 66 130 16 -71
5632 -71 -108 -21 83 95 49 -78 -86 -3 84 90 12 -76 -74 8 91 97 18 -86 -102 25 108 85 -24 -98 -108 18 81 69 -20
5661 -20 -93 -114 -2 100 86 -33 -95 -79 3 79 79 -28 -144 -89 34 77 40 -31 -111 -52 65 116 61 -64 -103 -66 48
5688 48 116 42 -52 -112 -52 34 95 57 -42 -94 -56 62 78 17 -69 -82 -26 55 76 20 -102 -109 10 62 73 16 -97 -72 -31
5717 -31 74 75 -12 -99 -115 -8 91 84 -21 -114 -77 2 92 86 -13 -100 -54 4 92 77 -57 -115 -88 -6 80 74 -29 -96 -53 20
$$ packed form
5524I7j18q2J0R2R6jj07j00M0J24M7nj40m9j2J34J00m0j16q3N1J08M8n2j02m3
5550a03M4J08Q1q2r5p0P0R1O6p0j05m9P3R7M9q0q6l3O1J13K4r2j24J0Q4J17Jp4
5578B6r5l3J00J00kq5j03j3J26Q5k9p3j00nR2P8K1j38k9%J08P7l1j06o9J4J31
5605D7N5k7r9q3O7R1O6m8j38o0Q5Q1Q2p6j00m4O0J03L6m8j57j0O1J22O4j14q7
5632g1l7Q7J04J2m6j27qQ3Q7Op8q8KQ2Q3Op9j04j6J27Q3k3j09p4j0J26O3j2q9
5661b0p3k1J12J02j4j19o2J6Q2P6%j07j16N5J23M3l7p1q0N9J17N1n5j25l9L7J14
5688D8O8p4r4o0O0Q6O1l8r9n2L8J18J6o1q6j3N6Q1K1n6j22pJ19N2J1n7j13K5M1
5717c1J05Jq7q7j6J07R9pj05r3L7P9R0or9q7M6N8Q8j5j34n8K7Q2Q6oj03o7M3P3
$$ plain form
5747 20 101 53 -47 -115 -56 37 92 44 -60 -94 -65 55 111 37 -55 -111 -32 52 60 25 -62 -76 -35 77 90 25 -73 -86 -21
5776 -21 91 95 43 -70 -91 18 69 93 17 -88 -82 -25 85 93 -50 -76 -76 4 86 71 -24 -100 -86 2 89 82 -9 -104 -81 16
5806 16 89 68 -21 -120 -84 26 92 59 -51 -111 -70 44 122 71 -53 -84 -57 44 99 43 -40 -112 -21 67 91 29 -60 -137
5834 -137 -39 68 77 43 -50 -97 -23 38 94 30 -53 -70 -22 42 78 16 -79 -72 -11 78 77 -18 -75 -92 -12 82 69 1 -108 -96
5864 -96 -18 90 75 -15 -100 -98 12 101 71 -10 -97 -52 10 91 76 -54 -102 -76 35 85 27 -57 -89 -60 26 89 33 -52 -105
5893 -105 -53 59 94 51 -20 -72 -42 65 105 31 -35 -100 -10 73 99 25 -101 -84 -15 53 101 6 -60 -110 -47 61 85 -15
5921 -15 -91 -79 -24 69 38 7 -70 -87 -14 83 95 -8 -57 -58 -10 62 84 -13 -62 -71 8 109 69 -20 -67 -39 35 84 40 0
5951 0 -95 -54 32 54 31 -41 -115 -59 54 70 29 -76 -83 -44 35 94 45 -51 -109 -36 53 88 32 -50 -84 -49 64 126 37 -71
$$ packed form
5747B0Q1m8j00o8N9R3N5m8j04l4K9J20N6p4r2n6P9Q4Ql5q7j4M1J12J3o5r8j3O5
5776b1J12Mn2j13k1J09N1K4p6j05ON7J10Qj43k6%Q0Q2j5r5p6J4Q8Q7pr1r5K3R7
5806A6P3k1q9r9L6J10O6l3j10o0M1J14P8n1j24l1K7J01N5n6q3p2R1Q8K4o2q9p7
5834a37R8J07Rl4r3m7P4O1N6o4q3j7M8O4L6o2r5PO1Q9jr5n7j7Q0R4j3o8j09J2
5864i6P8J08j5r0q5KJ10Q9l0q1q7M5O2Q1j5j30m8K6J11N0n8q4l2K9Q6O3n6q5n3
5893a05N2J12L5m3p1n2L0J07M0p4o6o5R0Q3K6p4j26J7O9O8M8r5o6n0O3J08K4j00
5921a5p6J2N5R3l1l1p7j7P3R7J2j03m9jM8P2K2r7m9rP9J01m0q9m7K8P4M9m4m0
5951@r5M1Q6K2k3p2p4N6J13J6m1j05pL9P9N9m9r6n8P3Q9L5n6q2l4L5J13O2q9j08
$$ plain form
5981 -71 -99 -3 91 89 4 -95 -68 -2 74 63 -7 -70 -65 -14 62 84 2 -83 -58 -3 63 70 -8 -75 -86 -23 96 80 -19 -105 -83
6012 -83 16 96 52 -18 -79 -85 45 110 62 -50 -87 -64 39 95 39 -22 -77 -43 38 81 59 -29 -69 -7 57 70 44 -50 -86
6041 -86 -26 72 86 4 -37 -102 -42 56 53 6 -72 -93 -21 68 84 21 -89 -76 8 91 77 6 -67 -92 -18 84 98 -8 -84
6070 -84 -71 21 95 83 -24 -102 -85 24 78 47 -5 -70 -56 20 61 51 -35 -86 -43 27 84 57 -50 -83 -65 39 74 56
6098 56 -44 -104 -33 33 85 42 -37 -119 -21 63 88 14 -60 -102 -17 78 107 42 -65 -72 -18 47 72 32 -76 -76 -32 77 66
6127 66 -1 -65 -75 8 61 75 -13 -63 -75 15 85 67 -20 -73 -77 11 59 57 14 -66 -65 -1 79 72 -19 -68 -51 59 102 54 -24 -58
6159 -58 -45 46 90 31 -51 -112 -37 25 106 39 -47 -99 -23 44 85 30 -58 -92 -12 60 83 8 -73 -93 -20 85 77 23 -60 -67 -3
6190 -3 90 73 0 -54 -67 -17 95 69 -2 -60 -58 4 76 66 -7 -91 -55 -16 72 68 -15 -67 -53 6 93 79 -13 -71 -71 32 84
$$ packed form
5981g1k8R6R4kq5r9K7O6P6j1p0o3NN1P6K2q2q5K5N5O6Pp8o7j1O3J19j6r9q6K2
6012h3R9Q0m4p0o1oJ30O5m8j12l7K3J03N6n6o1n5L4Q1M3k2q8m0O2O4J3k6r4l6
6041h6O0R8J4q2m1o5O0R8lm7p8k1P2Q9J6o3j10J3Q4Q3j4p1p3k5P4J02J4j06p6
6070h4J3R2P4j2j07p8J7J09N4l1n2o5J4P6M1j0q6n1M3P0N7k7j07l3J8J04L5j8
6098E6j00o0P1O6N2m3p9q2R8Q4K5p4p4m2Q5R5K9o5j07pN4O5K5m0j08%M4J09j1
6127F6o7o4j0Q3N3J4q8n0j2R0P0j8q7n3mQ8M8km3q0JO4Q0pr1m9J7J10M3m8p8l4
6159e8J3R1M4n9q2o1P5O2Q1o7q6n2P6O7M1n5q8l4Q0P2K3p5q1k0P3J05qn4q3pO4
6190cR3j7p3n4j3N0J12k6p1n8KO2P2j0p3q4L6L9Q8mq3n2J4N9Q7j4r2n8%J03N2
$$ plain form
6221 84 54 -39 -79 -45 35 104 64 -29 -87 -30 47 85 59 -25 -60 -30 41 103 35 -39 -87 -43 63 83 26 -26 -90 -35 47 82
6251 82 22 -53 -79 -32 83 80 -15 -75 -81 -1 50 54 14 -88 -67 8 48 65 7 -71 -75 -5 98 77 -2 -48 -56 19 57 41 -17
6282 -17 -65 -55 43 66 62 -22 -86 -64 25 93 58 -14 -77 -58 34 90 49 -35 -82 -73 29 52 39 -30 -74 -24 34 89 42 -63
6312 -63 -53 -36 57 80 30 -32 -51 -49 53 79 43 -33 -62 -13 69 100 37 -70 -66 -16 73 54 -4 -71 -82 6 62 93 -9 -66
6342 -66 -75 -5 57 62 -4 -69 -81 14 72 72 -12 -90 -63 6 55 81 -30 -77 -48 32 75 32 -30 -84 -40 33 94 38 -43 -51 -53 48
6374 48 75 19 -44 -65 -46 36 63 17 -61 -70 -31 55 73 17 -57 -62 -5 55 66 11 -52 -77 -19 50 90 54 -71 -64 -3 71 45
6405 45 12 -79 -57 7 77 43 -30 -62 -70 24 107 57 -27 -76 -72 11 91 72 -10 -68 -60 35 76 44 -29 -58 -46 48 76 30 -46 -77
6437 -77 -45 46 82 34 -46 -67 -11 40 79 55 -27 -70 -43 24 69 18 -57 -83 -15 42 89 31 -24 -63 -21 72 53 8 -52 -85
$$ packed form
6221H4l0r3m0L4Q0O9m0r3n8N7P7L8k6q4l5L0P1O2o8p4m8M4J06K0n7n2o4N5Q2L5
6251H2o0p5k6M7J15lr5o0oQ0N1Mm0j02K1P5M0J7n8p8mP0J03k1p9m6qP5L8j6n8
6282a7m8J0R8K3mq4o4K2Q9O8l5p2o3J9R2N6m1q4m7RJ02K3j3o9m4N0N8N5m7j05
6312f3J0J7R3K3n0o2j9KJ02K6l6p6k9M9Q2L1o3j07MN0Q9j9n8o7j1Q8N6L1j02n7
6342f6rP0O2No6o5j2R5N8%q4p8K7O9M9K6j11m7K9Q0M3m3o2n4M4P3O1n6q1qkJ01
6374D8K7n6o3k1J9Q2K7m6p8rL9Q6J8n6p4nN7O0J1n5o3k5N8O9M0l6j25PO1P4k6
6405D5l3r1K2O4P0l4p3l2qR4Q3n0q4m9MQ3Q0j9q2n8QR5M1l2p3k9J2R4K8m6p6l1
6437g7L2R1L6m8q0k1N6N1L9k4q2m3K7O7M5n1p5k6O8N7M7n8n5l9M2R3j9m5o0l3
$$ plain form
6467 -85 -21 59 74 24 -75 -68 13 70 76 18 -67 -75 21 68 77 -20 -34 -34 23 103 82 -7 -67 -37 8 57 44 -38 -79 -35 9 77 58
6500 58 -32 -49 -22 38 61 26 -37 -72 -26 27 86 16 -25 -46 -14 61 74 31 -47 -88 -19 38 63 8 -53 -50 -23 72 82 22 -42
6531 -42 -80 -11 79 60 -10 -80 -65 14 63 44 -21 -62 -66 32 68 53 -28 -56 -58 30 57 53 -8 -77 -58 22 74 41 -35 -79 -60 29
6563 29 66 47 -14 -85 -57 31 90 28 -41 -80 -20 73 81 11 -22 -32 -42 73 83 34 -52 -87 -25 43 73 25 -27 -81 -33 51
6593 51 59 8 -48 -89 -10 55 59 10 -34 -50 8 69 56 11 -61 -64 2 77 68 -15 -77 -54 8 77 64 -20 -58 -21 29 87 56 -16
6625 -16 -70 -44 31 62 48 -18 -76 -31 6 91 35 -32 -69 -35 26 73 42 -56 -49 -32 35 51 36 -45 -79 -25 77 61 33 -53
6655 -53 -74 3 52 61 24 -54 -76 12 59 68 16 -65 -61 -20 73 55 -10 -58 -60 5 35 87 15 -89 -66 -16 48 32 -2 -65 -47 32
6687 32 56 36 -12 -44 -17 20 73 59 -27 -80 -60 33 78 54 -28 -71 -20 28 75 45 -26 -72 -54 55 74 24 -28 -82 -53 32
$$ packed form
6467h5O4Q0J5n0r9PQ1N7On8q5qR6M7Rr7j4%N7Q0k1q9o0L0M5M9j3q2m1M4M4O8j9
6500E8r0j7K7O0K3l5o3l5M6N3N9p0m1k1L2P5J3m3p8m1O9N7K5n5o1LK7R5J0o0o4
6531d2l8O9R0j9p0p0J5P9M9j9o5m1mR8L6j5q1k8kQ8K7mo1o9J9Q0N2l3p6m4J9Q9
6563B9L7j9o1p1K8Q8N9o2o9l9O0R3Qp0l3j0j0J15J0m9q6l5O2O8L0m8n2n4M8Q4
6593E1Qn1n6m1P9O5Mm9m4j6N8O1j3m5p2lO6P5rq3o2K3O2O9j3q4l8L7N0N8l1p2
6625a6n4K6P5L1j4o6n8M5L7Q5n6o7l7L4O1M7l1r8PJ7O7J6j5q1l4N4J02j6k8q6
6655e3k1P7M9Rl7p8k2Q8M7Rn2q1MM1R3j8o5m8kO5L0N2p2j04K3N0O4j6l4o3J8P9
6687C2K4k0m8l2K7L7N3j4q6n3K0R3M5k4q2m3N1M8M7l0p1m6J8J09J9n0n2n4K9Q5
$$ plain form
6717 32 59 21 -55 -69 -41 34 77 21 -31 -61 -7 44 73 -6 -73 -51 -2 46 68 13 -50 -70 -28 63 70 -15 -43 -57 7 69 50
6748 50 -4 -37 -49 22 39 59 -22 -62 -43 38 77 39 -19 -50 -46 16 52 47 -7 -93 -47 21 87 55 8 -63 -3 35 63 45 -33
6779 -33 -39 -25 43 68 29 -43 -58 -19 32 59 33 -42 -59 -8 38 54 -1 -54 -55 -29 57 54 -11 -53 -83 -5 32 55 12 -64 -75 10
6811 10 37 47 13 -58 -57 2 70 37 -5 -49 -42 22 96 44 -14 -77 -49 6 41 43 -25 -62 -51 15 85 31 1 -79 -51 22 52 48
6843 48 -40 -87 -41 7 70 5 -16 -60 -21 51 84 21 -12 -75 4 31 51 22 -27 -80 -16 71 25 23 -26 -38 -16 45 74 7 -51
6874 -51 -45 6 37 64 -4 -49 -39 -16 69 45 -12 -66 -68 -9 38 43 -8 -76 -46 15 70 39 -10 -44 -52 32 66 61 -22 -67 -3 31 96
6907 96 40 -28 -57 -29 47 61 22 -38 -74 -31 42 60 17 -39 -84 -35 30 42 21 -21 -52 -15 46 30 23 -35 -79 -13 44 43 22
6938 22 -51 -58 20 39 46 -17 -32 -49 -10 53 48 -6 -50 -59 4 48 63 -14 -59 -58 4 51 49 -21 -65 -46 19 46 34 -47 -84 -9 17
$$ packed form
6717C2K7l8p6j4K8P5M3n6n2l0N4N1K9p9o7K2M9M8K2n5o3k0M2R1Pq5k8j4O4O2j9
6748E0n4l3j2P1J7K0q1m0J9Q1L9l8n8l1MO2L6nn4q6M6O8O6l2m7p1O0L8K8j8p8
6779c3oJ4O8K5l9p2j5L9N1K7k6p5j7N1M6J6n5n3jK6Q6lo5m2l0P8L7K3m3p6j1Q5
6811A0K7J0l4p1JN9O8l3m2m4PO4P4n2n8o3K8N5L5Ko8l7J1O6P0n4l0q0K8P3L0m
6843D8q8m7M6M8O3o5k1m4L9P2L3o3l3o3P9K7K0k9m9n3O4Q7m6km9j2K2O1K9o7n8
6874e1ON1L1K7o8m5J0K3Q5k4n7n4kN9M7Nn1o8L0O1N5l1m9l4qQ4L4nq3m5O4L4O5
6907I6n6o8k9K8P6J4l9o0l6M3P3J8m3n6m5M9O5J2k1m2l1L7O1j6pn8m4O6N7jk1
6938B2p3pP8J9Po3j5j7L9O3nn4m4rO3M4J5p7m5JO2M7kp0m4J9O5K7j2q1l7P5K6
$$ plain form
6971 17 59 11 -7 -58 -44 -12 62 28 -13 -49 -28 8 55 56 -15 -75 -26 62 57 21 -48 -45 4 23 66 30 -52 -61 -8 66 66 9 -45
7004 -45 -62 -25 66 37 -5 -26 -56 -17 38 52 -19 -69 -82 -4 24 40 -16 -53 -52 4 65 35 18 -54 -29 32 51 68 -7 -38 -47
7035 -47 18 63 43 -25 -43 -30 10 59 70 -19 -36 -12 45 54 43 -17 -80 -24 11 60 10 -40 -59 -17 35 57 24 -29 -51 -7 35
7066 35 42 34 -4 -60 -18 25 24 -4 -53 -54 6 73 75 -9 -57 -38 17 50 41 3 -45 -21 1 58 61 8 -52 -51 11 48 14 7 -40 -56 32
7101 32 57 15 -7 -41 -45 10 35 21 -7 -55 -32 30 65 30 -22 -69 -59 37 41 44 -43 -48 -24 41 48 15 -47 -46 -36 32 55 36 -45
7134 -45 -41 -15 52 51 28 -39 -14 -1 48 47 -9 -43 -75 -4 25 48 4 -69 -37 -7 58 51 30 -53 -50 10 83 19 -7 -51 -47 4 59
7167 59 37 -26 -48 -28 29 68 32 -6 -52 -55 21 79 37 -24 -59 -26 28 37 37 -46 -45 -21 48 44 23 -30 -57 -41 43 77 21 -11 -52
7200 -52 -14 61 65 35 -35 -39 4 59 63 11 -41 -59 1 21 47 -3 -58 -53 -10 58 45 -12 -61 -35 8 40 38 -8 -30 -56 30 44 46
$$ packed form
6971A7M2m8j8n1J4L2P4l4m1l6K1L6M7Jp1o0M9Q8nl6o9LM9J9M3l6q2rN3P4%n7n4
7004d5j7L7R1k9m2k1l0L9N5J4p1n0j3P8K8J6n6l7JN6O1l0j7p2K5O1J9J7p5l1r
7035d7O5M5k0o8j8J3M0M9J1q9j7K4N7Rj1o0o3N6L5M9n0n0j9M2N2K2l3n3k2M4M2
7066C5Pql8n6M2M3jk8m9jO0O7Kq4m8J9N5L3rl8m8K4K2N7Ln3o0JO2L7l4pm7j6Q8
7101C2K5m2k2l4mN5K5j4k8m8K3O2L5l5n2m7J0R6MLq7nK4O5Pl3o2JJ0O8K3j9q1
7134d5MK6O7jk3o7K5J3M9jn6l4l2P1K9K3m4p3L2L0O5pk1q3LO0P3o4k6m4MN1N5
7167E9k2o3k2K0N7L9l6l8m6lP6N8m2o1l5L3N4R%q3JK4O9mk1n3k7J6Q4L4n6l2m1
7200e2L8P5Ml0p0mM3N5Mn2n2j8O0K0K6n0n5NM3O8j3n7m9K6M3L2km6k2k6Q6J4K
$$ plain form
7233 46 -22 -62 -50 19 74 25 -24 -49 -2 12 59 31 -9 -40 -38 27 49 34 -29 -51 -35 26 48 39 -21 -45 -17 34 40 0 -54 -74
7265 -74 -16 11 51 29 -29 -61 -19 9 65 14 -49 -48 0 53 47 10 -42 -52 -17 55 59 8 -54 -56 22 64 51 5 -44 -44 20 39 46
7298 46 -15 -72 -50 21 53 18 -17 -75 -50 17 19 33 -34 -40 -42 5 32 12 -37 -30 -12 26 44 8 -32 -14 -9 39 59 59 -23 -45 -13
7331 -13 29 50 19 -45 -54 -34 43 52 -15 -45 -50 13 43 60 0 -52 -42 3 63 49 -18 -43 -34 2 52 45 -22 -50 -18 -12 45 35 7
7364 7 -35 -30 -12 64 37 -32 -32 -15 8 45 39 -24 -43 -45 14 59 20 -29 -61 -40 15 34 28 -48 -60 -19 5 53 33 -30 -55 3 27
7397 27 49 26 -57 -39 -16 27 35 -4 -57 -67 -13 22 35 8 -24 -60 -24 61 52 -1 -36 -47 10 40 61 -17 -53 -46 19 46 36 -11
7429 -11 -39 -45 14 21 36 -28 -60 -27 -12 55 30 -19 -53 -13 36 53 41 -12 -69 -25 18 65 59 -11 -52 0 55 24 26 -35 -49 -19
7461 -19 25 53 17 -36 -39 -28 27 53 15 -34 -58 -24 38 47 2 -42 -43 -11 25 57 24 -27 -20 -30 55 45 -3 -36 -31 39 39 53 6
$$ packed form
7233D6o8m0J2O9N5m9m9k5M7J4M7k8m0l1KO5K2j5o3k2J6O1K2ro0k4K8N1Om0n4k0
7265g4N8K7M0k2n8l2M2K8N6n1o3JM8N3ol7n2j0L5P2Mn1o2kP8M2j3m6m9%O4J9P
7298D6o1n7K2P1L2l5l5n8K5O7KJ4o7okM7K7k0m9PJ8L8J8l6m0J8NM8K0%q2k2L2
7331a3M2K1l1o4rK0P7Ro7l0nO3L0J7o0n2J0M5O0j4o7k5RL6N0po7k8L2ON7j0k8
7364Gm2NJ8P6k7o9%J7K3L7oo3j9kN9M5l9m9l2K1N5J9op6j2M1K4M8k0o3k5N8K4
7397B7K2k3q3J8K3M3Ql9n3j0N4L5J3k7l2l6L6Q5rn3l5j1N7L0K1p8l6PO5K7j0m7
7429a1k8oN9PJ5o4l2L3J5O7k5m9l4M0M9J7j2n3n7M4M3M7op0m1N2N5l1Ko1j4L0
7461a9M4K8l6n3lJ1N5K6l8m9k4L4O2Rm5m4jL2L6L2l3n1Pj0Q5j0m8l3NP0%J4m7
$$ plain form
7494 6 -19 -42 13 63 39 -14 -48 -28 34 41 18 -12 -50 1 46 51 39 -13 -33 -26 7 48 33 -25 -34 -10 37 52 41 -51 -54 -22 15
7527 15 42 36 -21 -47 -35 6 40 34 -23 -37 2 25 42 2 -38 -28 8 43 22 31 -37 -48 -8 49 22 -31 -49 -45 21 20 44 -20 -59
7560 -59 -43 -4 49 26 -7 -75 -44 18 35 33 -38 -44 -1 18 29 38 1 -40 -19 37 34 8 -20 -46 -5 27 45 17 -41 -45 -10 9 31
7593 31 -7 -13 -55 -35 9 41 17 -23 -34 4 20 9 26 -41 -64 -15 25 32 2 -38 -30 13 40 43 21 -36 -50 -2 42 42 -28 -36 -42 15
7627 15 47 12 0 -30 2 16 34 29 -34 -71 -41 6 24 30 2 -48 -1 19 45 12 -40 -65 -11 -1 25 44 -35 -29 -18 26 38 29
7659 29 -31 -23 -17 35 48 21 -6 -38 -10 33 54 -2 -45 -24 -6 42 40 31 -25 -51 8 37 39 -3 -35 -33 18 51 63 -12 -67 -45 14
7692 14 31 19 3 -68 -16 0 77 21 -16 -52 -13 2 46 52 -8 -26 -20 33 32 45 -15 -57 -20 24 39 25 -3 -63 -10 8 23 29
7724 29 -30 -12 -56 12 34 -11 -41 -46 -9 14 42 21 -21 -30 -27 34 28 29 -17 -11 -8 54 42 17 -33 -48 -7 39 30 -26 -33 -28 12 47 37
$$ packed form
7494Fk5k3N5N0k4n3l4K0O2Pk3l0l8N1M5Nj2n2k0PL3M1j5n8rK4M7J5j1r2lL2L7
7527A5K7on7k6J2M1L4on7j4L9K3J7m0m0J0L6L5k1Ro8j1M0N7k7n3j8MO6jK4o4l9
7560e9J6L9N3k3l3o8L1O2J7kp1oM3J9J1Rl7m1K1N6lk6k8k6M1L2J8k8n8mL5J9K2
7593C1l8om2K0M4L2k4m0j1L8J6j1J7o7k3M9M0Pl0m0QM3K7Lk2n7j4M8M4%p0qoN7
7627A5L2l5j2l0L2J4J8no3l7L0M7J8Ok8n0M7K0K6l3n2k5N4J0K6J9p9OJ1M4J2r
7659B9o0QON2J3k7k7l2K8M3K1n6m3K1J8M8krn6k6N9K9Km2l2KN1L3J2p5n5K2N9
7692A4J7j2j6p1N2J6P7n6l7l6L9J5M4Oo0j8ON3jJ3o0m2L7M4J5j4k8o0N3J8J5O
7724B9n9J8m4O8K2m5l0nL7K3K8k1m2rLO1oJm6OLO2j2k5n0j5M1M6rn6pNM0L5j0
$$ plain form
7759 37 -5 -41 -17 -10 26 25 -27 -67 -15 2 47 51 -1 -39 -22 24 35 35 -23 -6 -18 22 30 29 -9 -18 -4 24 23 14 -18 -22 -26 40 36 18
7795 18 -6 -40 0 17 26 16 -24 -49 -17 42 53 12 -23 -41 -2 26 41 34 -36 -31 -12 16 25 10 -29 -54 -5 49 40 2 -29 -42 18
7828 18 50 43 8 -26 -15 0 52 48 10 -21 -43 15 13 27 -1 -36 -44 13 41 22 -13 -19 -18 25 28 -26 -12 -27 -29 15 44 12 -15 -48
7862 -48 -15 37 77 27 -8 -23 -5 53 57 37 -16 -49 5 28 55 16 -22 -21 -14 40 39 -12 -38 -24 -11 23 47 30 -35 -32 6 50 20
7895 20 7 -22 -41 -17 44 46 -16 -18 -2 8 52 51 -4 -12 -10 13 62 22 -5 -30 -11 23 49 26 -2 3 20 26 57 2 -8 -28 9 40
7929 40 40 11 -25 -42 -8 24 55 -3 -45 -42 0 28 55 4 -29 -13 -5 36 46 1 -7 4 10 19 44 -20 -34 -32 19 39 37 -2 -29 -9
7963 -9 -13 72 15 9 -60 -14 10 13 5 -24 -37 -24 38 35 41 -10 -25 -34 6 28 32 -10 -53 -44 39 33 24 6 -23 -15 39 46 36 -21 -45 -17 32
8000 32 33 19 -14 -39 -13 47 40 20 3 -23 -2 31 22 26 -12 -63 4 17 24 -16 -52 -25 -9 33 35 9 -13 -12 32 41 44 24 -40 -22 13
$$ packed form
7759C7m2l6K4PL6jn2m0N2J7M5Mn2l8J7M6J1%n8J7j2M0Qjl8rJ4K8jrl2mmO6mj8
7795A8k4l4M0J7Rj0m0k5L2N9J1m1l5j8L9K8J5pp0NJ9K8Rj5l9k5M9N4rl8l1j3O0
7828A8L2pl5l4J1J5N2ml8l1k2N8kJ4k8l5qN7K8j9l5oJM3Ln4J4j5kM4K9l2k7l3
7862d8L3N2M0n0l5j5J8N8Mk0n3l3N4K3K7l9l8JPN4jn1k6J4J3L4K4j7o5LL8M4l0
7895B0j3k9j9K4O1Ko2kJ6J0M4jn5qKK3M9m0k7k5J9L4K6k3k8NJ7OL1n5j0k0L7L1
7929D0%k9l6j7L4L2L1n8m2LM2K8K7n1l3J6QM1J0m5qJ1ORK5o4j4KN1K0kl9k7K0
7963imQ5n7oo9M6K4Lqk9j3J3O2lOn1j5rM0K2Mm2m3RQ3orj8k9QN4Pj0n7k4K8M9
8000C2Jj4l3k5K6O0pk0j7k6K1L3rMl8n1O7J3Pm0l6K7J6M2Kk6k2JM4RLk0o4J8L5
$$ plain form
8035 13 37 54 0 -6 7 -2 43 14 -27 -41 -42 14 46 13 -20 -30 -15 46 34 -4 -29 -42 -30 28 38 21 -16 -37 0 -12 29 22
8067 22 -22 -15 -18 55 35 14 -8 -29 12 10 40 -6 -18 -12 11 32 46 -4 -31 -9 22 27 34 -9 -53 -29 27 37 37 -8 -42 -15 0 31
8101 31 17 9 -26 1 20 32 34 -15 -57 -11 14 30 10 -27 -39 -18 20 56 20 -22 -27 3 49 62 33 -3 -42 -9 13 48 3 -15
8133 -15 -45 -11 17 51 1 -42 2 0 25 26 -6 -44 -40 -15 5 15 25 -47 -33 -17 24 16 -9 -6 -21 3 22 42 0 -17 -35 -2 38
8166 38 42 -2 -43 -36 4 32 20 -3 -48 -41 -10 20 -10 -10 -48 -29 4 34 23 -17 -30 -32 3 33 11
$$ packed form
8035A3K4J7n4oJ3rM5k9m1j4jN6L2l3l3j0J5O1j2l8k5j3J2N8J0j7l7k1L7j2M1p
8067B2m4PlP3k0k1k2k1M1kL0m6j2OK3K1J4n0k7K2L1NPm3m4K4N6J0%m5l4K7J5L1
8101C1j4ql5K7J9J2Km9m2M6K5J6k0l7j2K1L8L6l6m2nL0M6J3k9l6l9L3K2L5m5j8
8133a5l0L4K8L4n0m3M4kK5Jl2l8MK5K0J0J0p2J4J6M1qk5Lj5K4J9K0m2j7j8L3M0
8166C8Mm4m1PM0K8j2k3m5PL1L0l0%l8J9L3L0j1m0j3kL5L0k2
8191A1
$$ Imaginary data points
##PAGE= N=2
##DATA TABLE= (X++(I..I)), XYDATA
$$ plain form
0 0 0 0 0 0 0 0 0 0 0 0 0 0 0 0 0 1 -8 8 -8 8 -8 16 -16 16 -24 24 -26 32 -40 41 -48 56 -64 72 -81 90 -104 114
38 114 -129 145 -160 177 -196 218 -240 267 -294 323 -356 392 -433 475 -525 579 -640 708 -786
57 -786 875 -978 1100 -1244 1422 -1646 1934 -2326 2888 -3766 5343 -9033 36137 -18585 -87302
72 -87302 32370 51757 -33193 -30975 51115 15083 -55363 -17250 49460 15757 -26846 -9571
84 -9571 6716 -7207 6717 19472 -8903 -23226 9158 9714 -16705 5779 33151 -15273 -48274
97 -48274 13873 53945 -9762 -44500 13726 31651 -26389 -24506 38982 26765 -42291 -30298
109 -30298 35089 29290 -21638 -18803 12930 5932 -14217 -134 19257 3220 -21210 -13199 11984
122 11984 18562 2334 -14693 -12221 5245 11725 -258 -5035 5002 664 -16388 -4900 24575
$$ packed form
0@%%%%%%%%%%%%%%%JrJ6j6J6j6K4l2L2m0M8n0N8p2Q1q9J04j20J36j53J71j94K18
38A14k43K74l05L37l73M14m58N07n61O17o79P48q25R08j000J104j219J348j494
57g86J661j853K078k344K666l068L580m260N214o654R109j4376M5170n4722o8717
72h7302J19672J9387q4950K218Q2090l6032p0446L8113O6710l3703m2603J7275
84i571J6287j3923J3924J2755k8375j4323L2384N56k6419K2484K7372m8424l3001
97d8274O2147M0072o3707l4738N8226J7925n8040J883O3488j2217o9056J1993
109c0298O5387n799n0928K835L1733o998k0149J4083J9391j6037k4430Q011K5183
122A1984O578j6228j7027K472J7466O480j1983m777J0037m338j7052J1488K9475
$$ plain form
135 24575 15773 -21994 -22567 14258 22063 -7263 -13802 8651 6519 -17330 -7789 24730 15544 -24935
149 -24935 -22804 17293 21776 -9264 -13064 7784 2803 -14929 -788 21070 5948 -19780 -12748
162 -12748 10114 13535 1396 -5822 -5180 -1938 2203 3785 2978 2912 -2682 -12232 -5030 16736 15515
177 15515 -13046 -19706 7006 14740 -6189 -6272 11963 807 -21670 -3965 25475 9774 -21008
190 -21008 -11601 11883 6302 -5448 2626 6301 -7806 -11269 5505 13586 2436 -8379 -8035 -523
204 -523 7802 7930 -1713 -7492 -2135 1457 -1109 3430 9004 -3290 -16321 -2697 16496 7708 -10697
219 -10697 -6722 4133 -727 -3452 7490 7981 -8339 -13195 2615 13039 4332 -5978 -5313 -997
233 -997 1314 3355 4537 1161 -5478 -6979 430 8494 6669 -4005 -9678 -2501 6110 5015 -21
$$ packed form
135B4575q802l7767n73L6825P805k9326o539K2453k132k3849R541L2519r186m0479
149b4935K131M0097M483l1040l800K0848m981j7732J4141K1858j5122k5728P032
162a2748K2862L421j2139p218O42L242M141J582q07o6n594r550P202K1766j221
177A5515k8561o660K6712P734k0929q3J8235j1156k2477J7705K9440j5701l0782
190b1008R407K3484n581j1750Q074L675j4107l463J6774Q081j1150j0815L44P512
204e23Q325J28r643n779N357L592k566M539N574j2294j3031J3624J9193q788j8405
219a0697L975J0855m860k725J0942M91j6320m856J5810J0424q707j0310O65M316
233i97K311K041J182l376o639j501P409Q064j825j0674n673P177Q611j095n036
$$ plain form
248 -21 -1630 -3096 -5644 -1030 8641 7189 -5599 -10120 -1024 6680 4901 167 -2251 -3997 -3592 2140
264 2140 7359 4146 -4721 -8062 -1284 6490 6135 60 -4792 -4838 -861 3681 5300 1956 -4542 -7279
280 -7279 -1809 6448 6901 -1239 -6525 -3964 577 3762 4916 1267 -5354 -6478 510 6705 5035
295 5035 -1147 -5427 -4440 1179 5839 4621 -1129 -5802 -4402 1646 5803 4148 -1679 -6103 -4403
310 -4403 2023 6422 3576 -3022 -5806 -3222 1842 5704 3772 -2939 -6409 -2609 3307 5360 2743
325 2743 -2420 -6025 -2988 4237 6321 1442 -3869 -4851 -1485 3294 5441 2311 -3835 -6260 -1673
340 -1673 4750 5641 304 -4734 -4603 -815 3508 5060 1114 -4694 -5501 -346 4954 4928 -97 -5035
356 -5035 -4717 853 5257 3959 -427 -4065 -4487 -31 5596 5338 -1212 -6177 -3834 2109 5032 3135
$$ packed form
248b1j609j466k548M614R671j452j2788m521R096P704j779m734k418j746M05N732
264B140N219l213q867l341O778P774l55o075m852m6L977M542J619l344o498k737
280g279N470Q257M53q140n286K561M541L185J154l649o621j124O988O195j670
295E035o182m280R87N619M660j218n750m673J400O048M157j655n827m424J700
310d403O426M399k846o598k784K584N064L862j932o711l470L800N916K053k617
325B743n163l605L037P225K084m879n311r82L366M779K147l130o146k425M587
340a673O423Q91n337n038J31L788M323J552l946n808q07N155N300k6n025m938
356e035L18N570M404j298m386l638m22M456N627k58o550m965K343N943K923j897
$$ plain form
372 3135 -1342 -4508 -3988 468 5560 4572 -2701 -6580 -2635 2863 4466 2513 -1664 -5119 -3426 2564
388 2564 5762 2806 -2668 -5551 -2568 3597 5553 1741 -3088 -4457 -1782 2604 5027 2562 -3235
403 -3235 -5882 -1738 4297 5085 83 -4134 -3761 -909 2560 4637 1935 -4152 -6089 -516 5502 4402
419 4402 -943 -4035 -3326 -153 3504 4443 1019 -4193 -5072 306 5694 4320 -1802 -4982 -2521 1280
435 1280 3446 3345 -50 -4512 -4676 794 5897 3979 -2892 -5931 -2165 2665 3660 1891 -605 -3702
451 -3702 -4235 979 6342 3906 -3467 -6095 -1136 4018 3704 708 -1465 -2965 -2955 966 5868 3960
467 3960 -4125 -6946 -588 5190 3595 -911 -2515 -2447 -2174 1009 5142 3301 -4001 -6826 -480 6079
483 6079 4067 -1947 -3609 -1709 -103 1598 3800 2643 -3275 -6246 -581 6660 5113 -2919 -5753
$$ packed form
372C135m477l166N20M456N092r88p273l879L945N498J603j953m177l455J693N990
388B564L198k956n474k883K983O165J956l812m829j369K675M386K423k465n797
403c235k647M144O035P88n002m217L73K852L469K077k702o087j937N573O018j100
419D402n345l092P09L173L657R39l424n212q79N378N388j374o122l180K461L801
435A280K166j01l395m462j64N470N103j918o871l039L766M830R95j769k496l097
451c702n33N214N363k436p373k628M959N154l14k996k173j500J0L921M902j908
467C960q085k821O358N778j595m506j604O8K73L183M133j841p302k825O346O559
483F079k012o014j662J900J606J701K202j157n918k971N665P241j547q032k834
$$ plain form
498 -5753 -1052 2221 1414 1820 1964 -2560 -6217 -971 7001 5062 -3927 -6536 -803 3590 2210 346
514 346 371 -1746 -4458 -866 6199 5593 -3338 -7503 -1012 5515 3486 -1152 -1474 -767 -2517 -1360 4810
531 4810 5831 -2857 -8369 -1495 6656 4062 -2684 -3016 -537 -1190 -664 3681 4407 -2352 -7429 -2073
547 -2073 6481 5507 -2429 -5075 -875 1611 528 1671 3367 -887 -6274 -2751 6197 6768 -2499 -7142
563 -7142 -1095 3958 1367 -596 1709 64 -5527 -3360 6111 6952 -3039 -7862 -1321 4774 2480
578 2480 -1061 -110 -273 -3435 -2198 4611 6183 -1745 -7488 -2254 5267 4571 -1037 -3006 -942 -387
594 -387 -948 2092 5028 118 -7356 -4536 5881 7084 -2253 -5889 -414 1765 -1149 578 4784
609 4784 548 -7448 -4219 6462 6995 -2561 -6092 -518 2419 310 988 3004 -691 -5383 -2414
$$ packed form
498e753M701L273q07M06J44m524l657N246P972j939q989k609N733M393j380j864
514C46K5k117k712L592P065o06q931m165O491O527k029m638l22P07j750J157O170
531D810J021q688n512O874Q151k594o746l32K479o53N26M345P26o759n077N356
547b073Q554r74p936k646M200K486j083J143J696m254n387L523Q948N71r267m643
563g142O047N053k591j963K305j645n591K167R471Q41r991m823O541O095k294
578B480l541R51j63l162J237O809J572p928n743N234P521o96n608j969K064N55
594c87n61L040K936m910p474K820J0417J203r337l636N475K179k914J727M206
609D784m236p996L229J0681N33r556l531N574K937k109O78K016l695m692K969
$$ plain form
624 -2414 4665 5779 -537 -5721 -3464 2475 4054 379 -1612 -387 -1602 -3206 1559 6730 1437
639 1437 -7656 -5116 5104 5746 -1978 -3124 1092 -549 -3537 1989 7218 238 -8019 -3266 5473
654 5473 4574 -1086 -2255 -1072 -1303 -229 2772 3134 -625 -4405 -3489 2278 5789 1360 -4919 -3917
670 -3917 1528 2572 151 832 1193 -3349 -4915 2386 7626 1143 -6652 -3503 3292 2574 -325 998
686 998 794 -3539 -3490 3171 6036 162 -5315 -3282 1886 3486 1216 -985 -1584 -2061 -1419 1927 4186
703 4186 1001 -4532 -4436 1613 4951 1636 -2485 -2447 -574 63 1311 3269 1186 -3972 -4227 1825 5527
720 5527 1725 -3320 -3051 -57 1188 1480 2018 331 -3484 -3826 1674 5427 1564 -3913 -3511 346
736 346 1902 1588 1354 -561 -3424 -2449 2207 4438 1253 -3214 -3536 43 2957 2639 122 -2030 -2359
$$ packed form
624b414P079J114o316n184K257N939J579l675j991J225j215j604M765N171n293
639A437r093K540J0220O42p724j146M216j641k988N526N229o980q257M753Q739
654E473q99n660j169J183k31J074L001L62l759l780R16N767L511m429o279J002
670c917N445J044k421O81L61m542j566P301N240o483p795L149O795p18k899J323
686I98k04m333M9O661K865n874n477K033N168J600k270k201n99m77O42L346K259
703D186l185n533R6O049L338l315m121L8J873O37J248J958k083n158k55O052L702
720E527l802n045K69K994J245K92N38j687l815l42N500L753l863n477M02L857
736C46J556l14k34j915k863R75M656K231l185m467l22L579K914l18k517k152l29
$$ plain form
753 -2359 -856 1852 3442 1283 -2985 -4090 -50 4002 2572 -1344 -2588 -1654 -482 1545 3258
768 3258 1011 -3539 -3786 945 3840 1974 -1168 -2527 -1779 326 2602 2655 -346 -3153 -2389 1101
784 1101 3497 2120 -1344 -3196 -1832 1309 3062 1637 -1311 -2895 -1923 1019 3177 1892 -1791
799 -1791 -3524 -1241 1965 2652 919 -1614 -2815 -1190 1868 3126 1104 -2158 -3010 -610 2437 3006
815 3006 558 -2215 -2778 -626 2377 3122 357 -2628 -2755 -183 2336 2503 259 -2497 -2985 -247
831 -247 2788 2605 -442 -2912 -2223 445 2368 2201 52 -2623 -2780 423 3386 2399 -1056 -2822 -1699
848 -1699 772 2679 2133 -616 -2799 -2163 784 2967 2025 -1132 -3201 -1778 1499 2788 1100 -1388
864 -1388 -2474 -1444 905 2712 1898 -1591 -3554 -1157 2474 2871 401 -1726 -2058 -1027 1259 3006
$$ packed form
753b359J503K708J590k159m268j105M040M052j430l916j244R34J172K027J713
768C258k247m550k47M731K895j866l142j359P48K105K276N3l001k807P64L490
784A101K396j377l464j852J364L141J753j425k948j584R72K942K158j285l683
799a791j733K283L206O87j733k533j201J625L058J258k022l262q52K400L047N69
815C006k448k773n63K152L003P45k765k985j27K572K519J67k244k756m88K738
831b47L035j83l047k470O89K668J923j67k149k675j57L203K963r87l455j766J123
848a699K471J907n46k749k183O36K947K183r42l157k069J423L277J289j688k488
864a388j086J030K349J807q14l489j963K397L631L97k470k127l32J031K286J747
$$ plain form
880 3006 1437 -2056 -3134 -655 2427 2714 199 -2208 -2286 -161 1855 2048 532 -1903 -2924 -650
896 -650 2682 2894 -414 -3081 -1971 738 1956 1724 378 -1888 -2812 -184 3230 2589 -1005 -2769
912 -2769 -1459 814 2306 1847 -571 -2561 -1884 748 2509 1941 -702 -3161 -2153 1544 3109 870
928 870 -1678 -1998 -1127 301 2298 2327 -1204 -3667 -1179 2499 2589 159 -1328 -1650 -1232 1055 3072
945 3072 1354 -2140 -2800 -379 1930 2335 754 -1840 -2747 -402 2169 1923 166 -1486 -2364 -1048
961 -1048 2023 3026 -60 -3060 -1892 849 1778 1443 426 -1624 -2702 -320 3133 2597 -988 -2665
977 -2665 -1314 700 1976 1869 -116 -2413 -2148 665 2569 1712 -828 -2664 -1725 1115 2515 1134
993 1134 -1175 -2163 -1343 654 2457 1772 -1324 -3007 -1124 1787 2442 757 -1222 -2021 -1163 1162 2611
$$ packed form
880C006j569l493j078K479L082K87k515k407p8K125K016J93j516k435j021K274
896f50L332K12l308k667J110K709J218k32j346k266r24K628L414o41l594j764
912b769J310K273J492m59k418j990O77K632J761n68k643k459J008L697J565k239
928H70k548l20Q71J428J997K9l531k463K488L678R0k430j487l22M18K287K017
945C072j718l494o60K421K309M05j581k594r07K345K571k46j757j652q78J316
961a048L071J003l086l000J168K741R29l35j017k050j078K382L453n36l585j677
977b665J351K014J276j07j985k297K65K813J904q57k540j836R39K840J400j381
993A134k309r88Q20J997J803o85l096j683J883K911O55j685j979p99Q58K325J449
$$ plain form
1010 2611 1255 -1586 -2647 -782 1887 2368 396 -1784 -2072 -418 1457 1970 721 -1705 -2754 -608
1026 -608 2415 2445 -405 -2277 -1531 71 1413 2095 663 -1997 -2594 103 2684 1974 -651 -2091 -1443
1043 -1443 417 1935 1717 -177 -2075 -1984 343 2432 1885 -932 -2808 -1414 1216 2053 939 -674
1059 -674 -1808 -1669 283 2595 2007 -1388 -2953 -848 1790 2041 518 -813 -1603 -1252 841 2594
1075 2594 1493 -1524 -2860 -696 2139 2159 63 -1526 -1662 -677 946 2173 1153 -1750 -2837 -552
1091 -552 2211 2172 -223 -1986 -1543 7 1359 1777 590 -1496 -2335 -377 2447 2432 -514 -2541 -1430
1108 -1430 929 1709 1072 112 -1325 -2260 -390 2647 2369 -1152 -2945 -1030 1223 1539 851 -272 -1665
1125 -1665 -1770 279 2448 1787 -1127 -2664 -1116 1532 2274 645 -1146 -1585 -840 657 1932 1634
$$ packed form
1010B611j356k841j061J865K669M81j972k180k88J654J875N13j249k426j049K146
1026f08L023L0k850j872P46J602J342O82j432k660n97K697K581p10k625j440O48
1043a443J860J518k18j894j898R1K327K089n47k817j876J394K630Q37j114j613
1059f74j134J39J952K312n88l395j565K105K638K51j523j331p90L51K093J753
1075B594j101l017j336K164K835K0k096j589j36R85J623J227j020k903j087K285
1091e52K763l9k395j763M43J550J352M18j187k086q39J958K824j5k946k027J111
1108a430K359P80o37r60j437r35J870L037k78l521j793J915K253L16o88j123j393
1125a665j05K049K169o61k914j537J548K648P42j629j791m39P45J497J275k98
$$ plain form
1141 1634 -786 -2860 -1367 2058 2559 -50 -1807 -1260 -310 512 1707 1410 -1293 -2825 -760 2200
1157 2200 2242 -236 -1983 -1504 53 1333 1601 523 -1292 -2120 -522 2055 2351 -138 -2350 -1679 742
1174 742 1850 994 -218 -1170 -1634 -466 1881 2307 -526 -2806 -1449 1248 1855 625 -657 -1408 -1319
1191 -1319 122 2003 1825 -724 -2544 -1329 1405 2288 676 -1150 -1571 -748 744 1761 1302 -728
1207 -728 -2314 -1287 1476 2456 463 -1874 -1782 -105 993 1370 851 -970 -2298 -1039 1705 2426 163
1224 163 -2059 -1744 100 1454 1457 422 -1116 -1904 -498 1798 2127 92 -1928 -1693 342 1844 1379
1241 1379 -304 -1555 -1352 -17 1474 1755 -78 -2223 -1807 655 2123 1057 -838 -1622 -1042 256
1257 256 1552 1506 -372 -2089 -1441 1038 2201 836 -1037 -1622 -757 813 1784 1038 -872 -1941 -912
$$ packed form
1141A634k420k074J493L425N01k609j757N47R50Q22J195k97k703j532K065K960
1157B200M2k478j747M79J557J280K68j078j815q28J598K577K96k489k212O71K421
1174G42J108q56j212r52m64J168K347M26k833k280J357K697O07j230j282p51Q9
1191a319J441J881j78k549j820J215K734Q83j612j826m21Q23J492J017m59k030
1207g28j586J027K763R80j993k337R2J677J098L77n19j821j328J259K744P21k263
1224A63k222L15J844J354Lj035j538p88J406K296L29k035k020K35K035J502m65
1241A379j683j251K03J335J491K81j833k145M16K462J468j066j895p84N80J298
1257B56J296m6j878j717O48K479J163j365j873n85Q65J570R71p46j910j069J029
$$ plain form
1274 -912 1072 2005 842 -1362 -2048 -538 1268 1618 450 -1123 -1727 -738 1175 2001 530 -1568 -1923
1291 -1923 -190 1630 1615 121 -1319 -1592 -293 1515 1846 220 -1688 -1729 78 1678 1563 -82 -1695
1308 -1695 -1517 159 1571 1410 -191 -1700 -1511 196 1769 1389 -535 -1815 -1270 548 1751 1154
1324 1154 -508 -1651 -1240 600 1872 1179 -676 -1762 -974 830 1781 949 -903 -1736 -753 848 1568
1341 1568 842 -914 -1877 -840 1140 1812 443 -1241 -1641 -555 1068 1727 536 -1244 -1690 -399
1357 -399 1287 1663 434 -1259 -1682 -207 1568 1584 -31 -1321 -1262 -187 1188 1717 233 -1821 -1683
1374 -1683 353 1630 1057 -284 -1317 -1465 -122 1630 1519 -414 -1723 -1229 327 1536 1266 -355
1390 -355 -1707 -1118 707 1615 922 -379 -1423 -1207 509 1978 1168 -1076 -1844 -524 852 1296 838
$$ packed form
1274i12J984R33j163k204o86J510J806L50j168j573o04R89J913Q26j471k098l55
1291a923J733J820j5j494j440k73J299J808L31j626j908m1J807J600j15j645j613
1308a695J78J676J412j61j601j509J89J707J573l80j924j280N45J818J203n97
1324A154j662j143M11J840J272o93j855j086P88J804R51q32j852q33R83J601P20
1341A568p26j756r63J037J980O72j369j684m00J086J623O59j191j780m46J291
1357c99J686L76j229j693m23J475J775J6j615j290N9J075J375N29j484k054J38
1374a683K036J277n73j341j033j48J343J752j11j933j309M94J556J209k70j621
1390c55j352N89J825R08o93j301j044K16J716J469q10k244p68J320J376M44m58
$$ plain form
1407 838 -542 -1750 -1100 989 1881 505 -1175 -1533 -581 933 1585 463 -1165 -1505 -386 1067 1532
1424 1532 573 -1201 -1769 -170 1574 1475 -28 -1223 -1231 -240 1086 1626 276 -1578 -1598 159 1513 1181
1442 1181 -223 -1358 -1284 33 1445 1245 -249 -1455 -1273 213 1633 1315 -485 -1706 -968 655
1458 655 1407 996 -229 -1492 -1275 529 1840 1034 -847 -1600 -716 675 1431 833 -711 -1641 -879 816
1476 816 1585 633 -956 -1611 -645 1049 1559 445 -976 -1390 -512 933 1600 666 -1108 -1616 -188 1318
1494 1318 1329 165 -1050 -1305 -224 1154 1429 108 -1359 -1437 -74 1362 1328 -176 -1400 -1226 77
1511 77 1188 1188 -8 -1384 -1442 228 1626 1121 -480 -1333 -851 300 1296 1179 -257 -1578 -1079 710
1529 710 1593 837 -596 -1422 -945 583 1529 771 -771 -1462 -831 550 1487 835 -876 -1681 -583 1006
$$ packed form
1407H38j380j208O50K089Q92j376j680l58R52J514O52j122j628l40J119J453M65
1424A532r59j774n68J599J744r9j503j195qR91J326N40j350j854k0J757J354l32
1442A181j404j135P4J317J412k00j494j206J82J486J420l18j800j221P38J623
1458F55P52m11j225j263K17J804J311q06j881p53Q84J391P56n98j544r30P62J695
1476H16P69r52j589o55R66J694N10j114j421m14Q78J445O67r34j774n08J428J506
1494A318J1j164j215k55J081J378K75j321j467p8J363J436l4j504j224J74J303
1511G7J111%j196j376n8J670J398n05j601q53M82J151R96j17j436j321M99J789
1529G10Q83p56j433q26M77J528R46p58j542o91O31J381R37o52j711q05J098J589
$$ plain form
1547 1006 1303 348 -729 -1254 -672 835 1663 600 -1197 -1500 -100 1167 1222 331 -854 -1389 -401 1157
1565 1157 1432 185 -1256 -1333 -83 1218 1224 -59 -1271 -1197 21 1148 1156 -1 -1277 -1333 134 1495
1583 1495 1153 -409 -1345 -838 367 1180 1058 -141 -1386 -1189 441 1651 927 -716 -1361 -669 481
1600 481 1201 829 -437 -1440 -978 641 1520 663 -826 -1387 -576 754 1287 568 -717 -1301 -563 761
1618 761 1433 648 -929 -1482 -334 1130 1266 194 -864 -1060 -395 778 1364 399 -1211 -1446 -55
1635 -55 1251 1045 -114 -1079 -1093 -124 1021 1196 66 -1221 -1229 102 1348 1140 -274 -1263 -834 313
1653 313 1106 962 -84 -1138 -1102 290 1503 1001 -645 -1360 -644 534 1105 732 -379 -1311 -925 510
1671 510 1410 707 -750 -1394 -619 753 1228 473 -688 -1148 -544 643 1323 645 -844 -1405 -341 1055
$$ packed form
1547A006K97r55j077n25N82J507Q28j063j797l03J400J267N5q91j185n35R88J558
1565A157K75j247j441p7J250J301Oj283j212P4J218J127Qj157j276n6J467J361
1583A495l42j562r36N07J205Q13j22j199j245J97J630J210p24j643o45O92J150
1600D81P20l72j266j003M62J619Q79q57j489n61Q11J330N33p19j285n84P38J324
1618G61O72p85j577n53J148J464J36j072j058j96O65J173N86r65j610k35J391
1635e5J306k06j159r65j4R69J145J75j130j287qJ331J246k08j414r89M29J147
1653C13P93j44j046j054L6J392J213n02j646p15P16J178N71l73j111r32L86J435
1671E10R00p03j457o44P75J372M75p55j161m60O04J187O80o78j489n61J064J396
$$ plain form
1689 1055 1274 216 -883 -1052 -368 766 1281 415 -1017 -1374 -190 1112 1095 14 -1021 -1086 -142 966
1707 966 1082 77 -1021 -1149 -19 1158 1123 -121 -1196 -917 294 1094 901 -125 -1072 -963 150
1724 150 1285 1003 -414 -1341 -814 462 1109 672 -368 -1156 -841 399 1260 741 -622 -1276 -588 647
1742 647 1148 529 -623 -1171 -507 655 1229 587 -749 -1247 -427 802 1237 384 -848 -1155 -334 775
1760 775 1113 327 -841 -1229 -324 913 1097 89 -971 -1106 -129 934 1055 70 -985 -1034 -24 1048
1778 1048 1096 -13 -1105 -984 190 1103 930 -136 -1031 -890 182 1111 881 -296 -1148 -820 319 1054
1796 1054 700 -367 -1174 -805 431 1146 614 -526 -1126 -667 442 1180 669 -570 -1161 -496 631 1144
1814 1144 542 -574 -1114 -495 730 1187 409 -737 -1081 -346 755 1101 314 -863 -1173 -245 892 1017
$$ packed form
1689A055K19j058j099j69O84J134N15q66j432l57J184J302j7j081j035o5R44J108
1707I66J16j005j098j28J130J177l5j244j075K79J211Q00j93j026r47J09J113
1724A50J135k82j417r27N27J276O47m37j040p88L15J240Q61n19j363o54O88J235
1742F47N01o19j152n48O64J162N74o42j336m98Q20J229M35q53j232l07Q21J109
1760G75L38p86j168l88R05J237J84j008j060j35R77J063J21r85j055m9J010J072
1778A048M8j109j092J21J174R13j73j066q95J41J072R29k30j177q52L28J139P35
1796A054l54j067q07L69J236P15n32j140o00M59J109P38n11j239n91O65J127N13
1814A144o02j116n40O19J225M57p78j146l44P35J101L46p87j177l10R28J137J25
$$ plain form
1832 1017 159 -860 -1100 -291 907 1156 87 -1071 -983 44 886 909 89 -917 -989 21 1075 979
1850 979 -127 -1053 -823 167 997 853 -160 -1049 -907 235 1077 747 -302 -1083 -831 321 1102 694
1868 694 -458 -1078 -600 393 988 663 -369 -1104 -624 583 1194 463 -647 -1016 -419 561 1052 543 -599
1887 -599 -1189 -521 749 1093 261 -760 -1015 -319 665 1010 284 -814 -1065 -234 831 1034 207 -889
1905 -889 -1009 -66 930 984 48 -853 -916 -69 893 993 76 -1013 -975 144 1033 741 -179 -888 -834 31 929
1926 929 860 -262 -1125 -769 314 939 618 -302 -1001 -696 315 1059 687 -416 -1006 -570 419 1037 640
1945 640 -438 -1069 -480 621 946 405 -451 -980 -585 568 1104 359 -806 -1021 -243 603 818 329 -639
1964 -639 -1123 -330 842 1016 93 -834 -878 -120 694 990 195 -843 -935 -7 868 845 23 -775 -904 -26
$$ packed form
1832A017q58j019k40Q09J198K49j069j158Q8J027Q42K3q20j006p2J010J054r6
1850I79j106r26K30R90Q30j44j013q89J42J142Q42l30j049p81K52J152P81m08
1868F94j152o20M78R93N95l25j032p35M80J207O11p31j110l69N97R80M91n09j142
1887e99n90O68J270L44q32j021k55O96R84L45p26j098k51Q31J065K03q27j096
1905h89j20R43R96N4r36r01o3Q47R62J00r17j089L8J119Q89k92r20p09N4Q65Q98
1926I29o9j122q63L56J083O25l21r20o99L05J011P44l72j103n90M36R89O18l97
1945F40j078o31N89J101L25n41q56n29L95J153N36p45j165k15P78Q46K15m89r68
1964f39m84P93J172J74r23r27m4P58Q14K96p95j038r2R28Q75k3q22p98j29Q78
$$ plain form
1984 -26 1019 808 -195 -890 -721 59 837 859 -122 -1102 -832 324 962 601 -284 -857 -701 170 991 744
2004 744 -342 -1031 -569 473 968 526 -395 -943 -561 437 989 460 -484 -949 -497 537 993 406 -643
2023 -643 -945 -325 568 862 355 -602 -960 -309 693 953 210 -727 -896 -112 768 810 133 -639 -848 -156
2043 -156 808 962 32 -885 -808 94 794 671 -29 -764 -853 -29 864 840 -183 -980 -686 203 817 669 -173
2064 -173 -885 -660 242 908 644 -227 -911 -652 403 1051 544 -445 -830 -428 355 840 567 -355 -1039 -538
2084 -538 572 974 316 -595 -842 -326 422 821 380 -604 -954 -326 636 892 235 -679 -877 -147 717 792
2104 792 117 -573 -782 -206 726 929 85 -822 -795 76 760 692 7 -707 -745 -29 750 784 -93 -916 -753
2125 -753 206 868 592 -252 -794 -577 145 814 685 -163 -948 -646 391 967 477 -358 -762 -479 250 840
$$ packed form
1984b6J045k11j003o95J69P80P78K2r81r80K70J156O38l61q85n73J56Q71Q21k47
2004G44j086o89M62J042M95m42r21n48L82R98N52n29r44m65M52J034M56n87j049
2023f43l02O20Q93K94n07r57l58O51J002K60p43r37j69P84Q80M2o77p72k09O92
2043a56R64J54r30r17P7R02P00j23p00p35q9Q24Q93k4j023p97K94Q89O14j48q42
2064a73p12K25R02O66k64q71o84K59J055O48n07r89l85M02P83M85k73r22o84N01
2084e38J110M02o58r11k47N16P48L99m41r84l50O28R62K56o57r14j98P30Q64P5
2104G92o75o90k09N76R32K03q44r07K7Q71O84o8o85p14l8P16P79L4q77q23J63
2125g53R59O62k76q44n42K17P22O69j29q48p85L02J037N76m90q35m04K83P29N90
$$ plain form
2145 840 562 -376 -950 -458 473 859 376 -534 -904 -356 499 805 284 -469 -819 -376 482 979 304 -693
2165 -693 -839 -58 639 681 204 -474 -803 -251 697 882 71 -772 -778 0 674 657 -19 -743 -743 -14 665 698
2187 698 -30 -796 -770 83 862 624 -253 -737 -509 143 704 649 -100 -869 -643 395 919 458 -340 -746
2207 -746 -432 273 780 543 -357 -889 -460 366 830 386 -481 -896 -379 427 770 284 -498 -794 -367 467
2227 467 876 300 -623 -835 -157 624 722 211 -475 -777 -219 621 843 150 -671 -725 -52 627 698 54 -683
2248 -683 -716 7 656 648 6 -717 -719 46 796 623 -183 -758 -546 97 670 624 -82 -788 -600 276 805 492
2270 492 -263 -726 -458 254 790 492 -315 -796 -440 380 748 395 -400 -827 -406 421 761 294 -468 -716
2290 -716 -353 427 795 330 -534 -801 -179 545 674 199 -475 -722 -211 599 759 78 -642 -671 -62 571
$$ packed form
2145H40k78r38n74M92R31L86m83r10l70N48Q55L06n21p53l50M43Q58M97o75r97
2165f93j46P81O97M2m77o78l29N52R48J85q11q43oP78O74j7o76p24%P29O79L3
2187F98p28p66K6Q53P79k38q77m84K28O52N61n5p49p69K26J038N24m61p98m06
2207g46L14P05N07k37r00n32M29Q26M64m44q67m15N17Q06L43m86p82k96M27Q34
2227D67M09n76r23k12O78P81R8n11o86l02N58Q40K22o93q21n4O73O79P1o44p37
2248f83l3P23O49qo42p23kP65P50j73q06n75K12O43N73m6p06p06J88Q76N29l13
2270D92p55m63K68P12N36k98q07m81L56Q20L68l53p95m27M21Q27L40m67p62k48
2290g16L63P80L68m65q64k67O22P24J29m75o74k47N11Q10J60o81p20k9O09O33
$$ plain form
2310 571 652 54 -664 -739 -61 644 647 -64 -661 -620 10 664 644 -88 -709 -542 153 672 554 -89 -693 -578
2332 -578 238 768 480 -240 -722 -450 223 703 476 -308 -811 -471 319 709 336 -413 -752 -391 326 706
2352 706 339 -426 -748 -312 471 758 255 -427 -717 -199 507 756 251 -461 -728 -182 568 715 175 -560
2372 -560 -682 -125 552 640 45 -605 -671 -116 563 628 9 -711 -659 83 646 530 -43 -592 -571 10 684 620
2394 620 -132 -702 -495 225 646 474 -124 -652 -497 204 677 432 -293 -674 -410 239 690 406 -345 -736
2414 -736 -349 361 649 330 -332 -679 -354 410 729 244 -450 -654 -203 400 644 262 -424 -733 -227 549
2434 549 693 95 -540 -633 -144 472 628 118 -584 -674 -73 559 592 26 -607 -646 1 625 595 -39 -575 -535
2456 -535 47 585 566 -37 -645 -542 161 651 456 -172 -598 -466 87 637 483 -273 -734 -439 217 587
$$ packed form
2310E71Q1n98p18p5O78P05Lp11n97M1O30O54k0p32o21J67O95N19j18o43o04J15
2332e78Q16N30k88p20m82K72O73M80k27p84n03L40P90L90l73p49l39L61P17L80
2352G06l67p65l22M36P83K87n03o82k90N18P06K49n05p12k67N46P50J47n40p35
2372e60j22N57O77Q8n95o50o6N55O79O5o19p20N2P42N63j16n73n49K1N81O74o4
2394F20p52n70K07P20M21j72n98n28J55P01M73k45p25l81K64O49M51k84p51l91
2414g36L87P10K88l19o62l47L25P64L19m85o94k04M51O03K44l82o86l09N06P76
2434E49J44n98o35r3M89O16J56n10p02r0O01O32L3n66o33l9O47O24l0o34n36M0
2456e35N82N38j9o03o08J03P03M90j95o28m26J32N53N50j54p56m61K95O56L70
$$ plain form
2476 587 338 -262 -666 -431 246 654 346 -308 -660 -337 339 672 299 -354 -644 -208 402 624 262 -372
2496 -372 -662 -238 505 660 126 -519 -599 -157 427 593 156 -530 -679 -94 539 549 7 -557 -580 -42 576
2517 576 554 -19 -568 -505 15 593 590 -24 -647 -499 168 621 457 -102 -537 -453 80 637 521 -226 -672 -405
2539 -405 224 563 348 -209 -619 -426 285 657 320 -291 -604 -343 279 656 291 -375 -614 -226 330 578
2559 578 302 -312 -621 -265 457 663 132 -452 -560 -145 349 568 172 -490 -646 -122 519 545 50 -484
2579 -484 -563 -62 520 577 20 -484 -555 -38 544 553 -35 -569 -511 103 565 433 -103 -539 -453 55 577 461
2601 461 -167 -648 -434 181 567 365 -207 -580 -451 192 588 409 -199 -595 -364 253 649 335 -276 -534
2621 -534 -221 265 567 332 -271 -640 -249 399 636 173 -416 -563 -194 331 524 176 -405 -616 -191 411
$$ packed form
2476E87k49o00m04K35O77M08l08o54l52L23O76L33l73o53k90M36O10K22l62o34
2496c72k90M24P43J55n34o45q0M42N84J66m37o86j49N85O33J0n42n64k3N38O18
2517E76k2n73n49O3N20N78lo14o23J48O67M53j64n59m35Q4N33N57j16p47m46K67
2539d05O29L39k15n57m10J93P11L72l37o11l13K61O22L77l65o66k39L88N56K48
2559E78k76o14l09L56P22K06n31n84j08M15M94K19l96o62j56N24O41K6m95n34
2579d84p9N01N82N7n57n04p1N17N82Rn88n34N8O14M62j32n36m36Q6N08N22j16
2601D61o28m81K14O15L86k02n72l73J29O43L96j79o08l96K31O17L96l14o11k58
2621e34L13M86L02k35o03l69L91O48K37m63n89j47L69N25J93l48n81k11M25O02
$$ plain form
2641 411 557 105 -458 -545 -76 435 467 48 -415 -496 -69 483 595 19 -551 -486 98 526 454 -52 -483 -475
2663 -475 45 549 485 -108 -598 -456 149 552 363 -160 -541 -412 110 517 381 -179 -565 -370 246 589
2683 589 315 -270 -562 -286 252 577 364 -252 -606 -320 341 627 251 -358 -552 -188 316 506 172 -352
2703 -352 -565 -223 379 560 128 -454 -541 -81 420 502 82 -388 -507 -128 436 545 53 -498 -467 18 473
2724 473 436 -35 -462 -454 -4 469 461 -67 -520 -478 104 498 390 -143 -522 -368 122 509 423 -145 -558 -401
2746 -401 195 591 325 -241 -495 -251 237 514 297 -243 -559 -286 286 554 219 -331 -534 -264 328 516
2766 516 173 -349 -561 -214 292 561 185 -398 -556 -109 420 477 70 -381 -431 -113 371 550 100 -452 -486
2787 -486 -5 454 444 -6 -412 -433 -34 437 433 -64 -478 -448 23 428 414 -114 -546 -397 116 453 327 -110
$$ packed form
2641D11J46m52n63q7M69N11L2m19m63q1M27N52J12n76n70O5N84M28p2n06m31Q
2663d75N20N04o4n93m90J42O05M03j89n23l81J29N22M07j36n60l86J95O16L43
2683E89k74n85k92K76N38L25k13o16l54K86O61K86l76o09j94L64N04J90l34n24
2703c52k13L42O02J81m32n82q7M60N01Q2m20m70j19L79N64J09m92n51L1M85M55
2724D73l7m71m27QM50M73qn28m53M2N82L94j08n33l79J54M90L87q6n68m13J57
2746d01N96L96k66n66k54K44M88K77k17n40l16K73N72K68l35n50k03K70N92J88
2766E16l43n22k12L47N06K69l76n83j58M47N29N7m07m51n0L18M84J79m50n52l4
2787d86M81M59j0m50m06k1L99M71mm97m14L0M71M05j4n28m32J49N13L37j26m37
$$ plain form
2809 -110 -471 -381 140 547 383 -205 -530 -291 215 532 300 -175 -531 -300 246 530 252 -280 -517 -253
2829 -253 280 485 220 -311 -512 -224 294 515 159 -370 -510 -159 347 514 165 -378 -499 -119 380 491
2849 491 106 -365 -446 -74 403 491 35 -413 -448 -10 414 408 3 -438 -462 24 442 382 -103 -442 -397 74 463
2872 463 421 -76 -473 -353 149 469 323 -122 -450 -331 144 523 299 -213 -476 -281 185 479 267 -224
2892 -224 -520 -320 225 480 183 -274 -482 -241 250 481 196 -295 -514 -149 315 465 169 -294 -440 -135
2912 -135 357 496 132 -351 -452 -66 363 437 75 -397 -481 -89 385 433 -8 -420 -423 -16 359 406 -9 -454
2934 -454 -437 47 458 374 -100 -414 -353 78 438 376 -101 -444 -303 174 459 304 -123 -454 -307 177 497
2955 497 293 -210 -456 -249 168 430 264 -200 -496 -257 282 452 156 -268 -438 -212 240 490 212 -308
$$ packed form
2809a10l61R0N21M07j64n88l25K39N06L17k32m75l56K31N46K84k78n32k37K64
2829b53N33K05k65n31k01K88N18K21l56n29j40L51N06J67l49n43j21L80M99J11
2849D91l85m71q1L72M77Q8m56m48l5M38M24om05m41k4M86M18o0m85l39M5M71L89
2872D63m2m97l97J20N02L20j46m45l28J19M75L79k24n12k63J95M66K94k12m91
2892b24k96K00N45K55k97m57k08K41M91K31k85m91k19L65M64J50k96m63j46L05
2912a35M92J39l64m83j01L86M29P4l62m72q4L92M74M8m41m12lM07L75M7m15m45
2934d54J7M84M11q4m74l14O1M31L60o2m77l43J41M77K85j55m27l31J47M84L20
2955D97k04n03k46K07M17K62j66m64k96K39N39J70k96m24j70K26M52K50k78n20
$$ plain form
2975 -308 -473 -115 308 413 103 -276 -447 -149 333 461 65 -369 -394 -60 314 426 96 -389 -456 -36 384
2996 384 368 30 -361 -376 -36 402 409 -38 -446 -324 90 381 328 -54 -401 -390 54 482 314 -146 -413 -309
3018 -309 116 439 275 -152 -458 -322 169 412 247 -184 -443 -242 203 460 249 -240 -441 -190 239 440
3038 440 217 -221 -419 -159 309 477 151 -292 -421 -129 271 415 141 -314 -459 -87 317 372 55 -381
3058 -381 -427 -58 328 376 35 -368 -401 -37 374 405 26 -362 -322 67 386 370 -44 -350 -324 79 413 333 -85
3081 -85 -417 -318 118 414 270 -118 -407 -290 118 405 271 -154 -429 -255 178 409 182 -195 -367 -212 183
3102 183 404 214 -208 -437 -185 261 393 155 -257 -400 -134 253 409 135 -257 -409 -99 308 378 75
3122 75 -341 -388 -98 324 376 51 -334 -399 -55 385 386 -6 -378 -349 23 360 342 -13 -348 -330 31 386 310
$$ packed form
2975c08j65L58M23J05l10l79j71K98M82J28l96m34k5L34L74J12l30m85o7M20M20
2996C84j6l38l91j5L40M38Pm47m08J22M14K91n3l82l47J1M44M28j68m60k67J04
3018c09M25L23j64m27l06J36M91K43j65m31k59K01M45K57k11m89k01K51M29K01
3038D40k23m38j98K60M68J68l26m43j29K92M00J44k74m55j45L72M04N5l17m36
3058c81m6L69L86M8l41m03l3L64M11L1l79l88M0L89L19j6m14l06K6M03L34q0m18
3081h5l32R9M36K96j44l88k89J17M08K87j34m25k75J74M33K31k27l77j72J55L95
3102A83K21j90m22k29K52M46J32k38m12j43K66L87J56k74l92j52L10M07P0l03
3122G5m16m7K90M22N2l25l85o5L44M40Jl92l72K9L72L37j8l55l35J8L61L55p6
$$ plain form
3145 310 -90 -387 -349 102 371 281 -108 -388 -289 86 381 260 -154 -399 -246 151 409 246 -173 -377 -203
3166 -203 198 368 216 -179 -427 -179 238 396 170 -227 -371 -161 231 351 132 -216 -408 -137 263 371
3186 371 69 -327 -341 -54 267 374 58 -310 -352 -38 326 391 34 -333 -342 1 328 336 14 -311 -307 38 328
3209 328 321 -29 -398 -307 63 360 266 -84 -385 -289 44 364 307 -107 -430 -267 127 353 217 -143 -358 -237
3231 -237 151 402 191 -113 -363 -208 204 415 219 -193 -388 -157 239 361 172 -187 -354 -167 230 399
3251 399 114 -284 -367 -69 229 339 105 -255 -377 -64 312 352 56 -286 -338 -45 298 358 16 -319 -314 -6
3273 -6 307 302 29 -312 -315 26 363 306 -64 -353 -265 54 313 291 -71 -360 -269 126 380 261 -102 -348 -243
3296 -243 119 370 220 -136 -354 -241 139 370 227 -173 -403 -201 211 345 135 -190 -342 -180 183 345
$$ packed form
3145C10m00k97L8M51K69r0l89k80R9L75K95j21m14k45J53L97K58j63m19k04J74
3166b03M01J70j52l95k48K48M17J58k26l97j44K10L92J20k19l48j92K71M00J08
3186C71l02l96j4K87L21J07l16l68m2L14L64O5l57l67rL43L27Ql22l25ML45K90
3209C28pl50l69R1L70K97r4l50l01R6L33L20n7m14l23J63L94K26j36l60k15J21
3231b37L88K51k11l04k50J55M12K11j96m12j95K31L96J22j89l59j67J87L97J69
3251C99k85l98q3K98K98J10k34l60j22L13L76M0k96l42n2K93L43O0l42l35NL08
3273fL13nk73l41lL41L37n7l70k89Q8L19K59k2l62k89R1L95K54j19l63k46J05
3296b43L62K51j50l56k18J13L80K31j43m00k30K02M12J34k10l25j52J62L63J62
$$ plain form
3316 345 138 -226 -374 -122 237 357 104 -236 -330 -81 261 353 105 -250 -338 -44 293 356 48 -288 -295 -9
3338 -9 266 314 15 -312 -318 -2 310 298 -78 -326 -307 -1 319 233 -59 -335 -274 47 340 237 -52 -346 -277
3361 -277 112 358 211 -109 -310 -206 115 352 250 -138 -380 -197 190 352 143 -154 -329 -192 181 355
3381 355 158 -202 -364 -174 199 334 93 -205 -317 -102 232 305 97 -250 -312 -85 258 324 59 -272 -292
3402 -292 -3 269 272 37 -234 -291 -25 298 299 -2 -297 -282 38 306 259 -46 -302 -246 53 295 274 -74 -310
3425 -310 -231 95 321 218 -103 -337 -196 129 314 214 -131 -318 -211 144 317 179 -184 -329 -182 151
3445 151 312 138 -184 -326 -132 186 333 154 -205 -313 -88 230 322 117 -223 -314 -70 228 340 80 -243
3466 -243 -291 -52 242 274 33 -302 -308 -48 267 256 3 -259 -299 -6 272 280 -32 -293 -238 34 284 256 -26
$$ packed form
3316C45k07l64j48K52L59J20k53l40r4K49L42R2k48l55q8K94L37O3l08l36pK86
3338iK75M8k99l27oL16L12j2l76k48J9L06L20q6k92k76O1L21K93j03k89k94O9
3361b77L89K46j47l20k01J04L21K37j02l88k42J83L87J62k09k97j75J37L73J74
3381C55j97l60j62J90L73J35k41k98j12K15L34P3k08l47o2K27L43O6k65l31k0
3402b92K89K72Lk35k71n7K66L23Jl01k95J5L20K68m7l05k56N6K99K42k1l48k36
3425c10P9L26K26j03l21k34J41L25J85j00l45j87J07L55J73j38l63j45J47L33
3445A51J61j74l22j42J94L18J47j79l59j08K25L18R2k05l40r1K44K98J12k60l23
3466b43m8K39K94L2k41l35oK60L15j1k53k62m0K93K78Ql12k61N5K72K50k8k82
$$ plain form
3489 -26 -301 -234 63 305 261 -63 -289 -225 95 300 221 -67 -310 -207 112 314 150 -167 -311 -176 105 312
3511 312 145 -172 -330 -148 159 304 106 -193 -325 -113 195 296 77 -193 -299 -115 197 315 74 -223
3531 -223 -273 -52 225 304 57 -242 -298 -41 265 250 -26 -228 -283 -30 253 273 -8 -269 -255 25 266 239 -2
3554 -2 -273 -279 25 296 218 -91 -254 -200 34 275 229 -98 -316 -202 112 273 136 -102 -306 -234 103 291 175
3577 175 -147 -299 -137 132 265 138 -120 -300 -106 192 300 81 -157 -287 -118 189 320 85 -273 -295
3597 -295 -78 206 273 70 -215 -320 -83 205 263 9 -254 -276 -36 210 256 17 -232 -280 23 278 222 2
3619 2 -226 -226 16 294 261 -44 -266 -210 57 257 188 -58 -256 -218 57 306 171 -122 -296 -168 78 250 163
3642 163 -101 -331 -201 131 277 148 -173 -289 -142 150 276 149 -151 -293 -110 162 295 100 -171 -281
$$ packed form
3489b6k75O7K97K42m4l24k26O4L20K05p9k88k43J03L19K02j64l17j44J35K81K07
3511C12j67l17j58J82L07J45j98k99j32K12L08J01k19k70j06J84L12J18k41k97
3531b23n0K21K77P9k47k99n6K57L06j5k76k02n5K53K83K0k81k61J4K80K41k7k41
3554bk71oL04K71p8l09j63N4K34K41m6l27k18J14L14J61j37k38k04P2L37J88j16
3577A75l22j52J62K69J33j27k58j80J94K98J08k19k38j30J69L07J31k35l58k2
3597b95K17K84O7k03k85j05K37K88N8k54k63k2K40K46M6k39k49m8L03K55n6k20
3619Bk28%K42K78l3l05k22N6K67K00o9k46j98L8K75K49j35k93j74J28K46J72q7
3642A63k64k30J30L32J46j29l21j16J47K92J26j27l00j42J83K72J33j95k71j10
$$ plain form
3662 -281 -97 196 285 79 -192 -226 -77 194 244 51 -216 -283 -29 236 220 17 -233 -237 -11 212 257 21 -262
3685 -262 -240 2 241 215 -44 -257 -218 44 248 203 -81 -261 -191 42 241 207 -66 -267 -202 102 299 182
3707 182 -103 -246 -166 109 279 170 -132 -273 -143 148 247 120 -129 -247 -143 139 255 112 -197 -288 -106
3728 -106 161 256 60 -186 -281 -112 169 234 51 -202 -267 -62 180 237 59 -201 -266 18 238 234 31 -205 -232
3751 -232 4 246 265 -28 -262 -231 42 207 196 -18 -254 -215 28 262 190 -97 -266 -253 54 226 163 -64
3773 -64 -278 -176 86 230 147 -84 -276 -154 117 274 180 -104 -244 -112 141 270 143 -147 -279 -106 143
3794 143 258 92 -171 -246 -87 162 250 86 -206 -263 -56 182 237 67 -208 -281 -44 196 248 -8 -217 -205
3816 -205 -11 200 254 23 -259 -247 37 252 188 -15 -235 -212 34 230 207 -27 -212 -172 38 259 201 -44
$$ packed form
3662b81J84K93Q9k06k71l4J49K71N0j93k67o7K54K65j6k03k50mK26K23M5k36k83
3685b62K2K42K39k6k59k13L9K62K04m5k84j80P0K33J99l4k73k01O5L04J97j17
3707A82k85j43Q0K75J70j09l02j41J30K91R9j27k49j18J04K82J16j43l09r1J82
3728a06K67R5j96k46r5J69K81O5j83k53o5K05K42N7j78k60o5K84K20mk03k36k7
3751b32K36K42J9k93k34L1K73J65j1k14k36L9K43K34p2k87j69J3L07J72o3k27
3773f4k14J02K62J44q3k31j92J22K71J57r4k84j40J32K53J29j27k90j32J73K49
3794A43J15j66k63p5J59K49Q8j64k92n7K07K38N5j70k75p3K37K40N2k56k09J2
3816b05J94K11N4k31k82J2K84K15o4k03k20K3K46J96k3k34j85M0K10K21n8k45
$$ plain form
3838 -44 -261 -160 103 246 150 -66 -223 -171 53 263 171 -105 -277 -150 107 222 110 -70 -265 -145 121
3859 121 243 93 -135 -245 -123 135 215 83 -151 -258 -81 156 249 73 -162 -244 -56 183 243 34 -198
3880 -198 -194 -12 167 225 45 -185 -226 -23 211 209 -40 -223 -221 -18 192 193 -26 -236 -191 17 237 203 -36 -241
3904 -241 -170 51 231 192 -56 -207 -130 62 246 199 -71 -237 -162 127 263 123 -120 -232 -142 92 228 114
3926 114 -109 -245 -134 120 241 79 -153 -234 -101 122 223 83 -122 -231 -70 171 238 89 -163 -244 -75
3947 -75 185 222 51 -155 -218 -32 175 235 12 -191 -220 -14 217 214 -14 -199 -184 -5 209 201 -9 -201 -180 16
3971 16 239 155 -79 -226 -179 62 232 170 -76 -254 -188 91 221 134 -74 -244 -131 87 232 126 -114 -227
3993 -227 -124 84 235 136 -119 -236 -110 153 223 77 -105 -227 -95 147 229 89 -171 -202 -57 158 216 48
$$ packed form
3838d4k17J01K63J43r6k16j57N2K24K10r2k76j72J27K57J15j12j80j95J20K66
3859A21J22j50k28j10J22K58Q0j32k34j07J77K37R3j76k35q2J88K39O0k09k32
3880a98MJ82J79N8j80k30m1K03K34kk49j83KK03K10Jk19k10M5K08K20l4k39k05
3904b41P1K21J80l9k48j51P7J92J84m7k70j66P5K89J36j40k43j12R0K34J36j14
3926A14k23j36J11K54J21j62k32q1J33K23J01j40k05j09J61K41O7j49k52q1J69
3947g5K60L7j71k06o3J86K07O0k23k03k9K06K31lk28j85J5J79K14qk10j92K1J96
3971A6K23q4k34j47M7K41J70o2k46j78O6K79J30q7k08j70J13K18J45j06k40j13
3993b27J03K08J51r9k55j17J26K63P0j46j82j22J32K42Q2j40k60l1J45K15N8j68
$$ plain form
4015 48 -158 -202 -73 145 215 7 -178 -216 -57 163 191 7 -200 -200 -26 177 173 -7 -188 -190 25 210 181 -13
4039 -13 -190 -155 37 223 182 -43 -220 -192 56 238 152 -51 -233 -147 79 185 128 -100 -263 -145 72 192
4061 192 106 -91 -212 -104 95 189 105 -123 -222 -77 128 209 85 -111 -201 -80 135 227 108 -149 -207 -60 156
4084 156 202 56 -167 -194 -44 194 205 26 -180 -194 -49 169 197 3 -200 -182 15 186 171 -39 -209 -193 2
4107 2 196 158 -49 -177 -160 34 173 146 -59 -214 -157 49 207 145 -47 -216 -133 74 228 129 -86 -235 -117
4130 -117 101 217 101 -101 -209 -109 100 215 92 -118 -178 -80 113 214 77 -173 -236 -71 130 180 43
4151 43 -132 -227 -52 154 200 47 -165 -196 -34 141 175 30 -185 -178 2 187 214 31 -172 -162 17 179 184 -3
4175 -3 -185 -161 25 203 131 -35 -207 -163 20 201 132 -51 -218 -153 68 182 93 -50 -199 -143 70 180 128
$$ packed form
4015D8k06m4J29K18P0k08j85l8J59K20K8j84k07%J74K03mj80j81kK15J85k9j94
4039a3j77L5J92J86m1k25j77K8K48J82q6k03j82Q6K26J06n7k28j63J18K17J20
4061A92q6j97j21J08J99R4q4k28r9J45K05Q1j24j96r0J21K15R2j19k57n8J47K16
4084A56M6j46k23k7J50K38J1j79k06j4J45K18K8j94k03J8J97J71j5k10j70J6J95
4107BJ94l8k07j28J7J94J39k7k05j55N7K06J58o2j92j69Q3K07J54r9k15j49J18
4130a17K18J16j16k02j08J00K09J15j23k10o0R8J93J01j37k50o3J65K01N0j37
4151D3j75r5J75K06M6j53k12l1J62J75L4j45k15PJ80J85K7j83k03J0J79J62Nj87
4175cj82K4J86J78p2j66j72M4J83J81o9j83j67O5K21J14q9j43j49N6K13J10n2
$$ plain form
4198 128 -98 -205 -104 105 205 119 -103 -225 -78 113 211 69 -137 -204 -86 105 195 88 -138 -204 -54 152
4220 152 200 26 -152 -210 -63 139 152 0 -186 -157 -34 142 190 -33 -197 -180 24 180 155 -19 -171 -152 8
4243 8 179 193 -27 -196 -135 33 171 145 -35 -188 -135 66 174 145 -47 -204 -128 67 196 138 -92 -193 -116
4266 -116 68 189 105 -96 -196 -111 99 206 74 -122 -195 -113 90 184 68 -127 -217 -82 118 200 62 -144
4288 -144 -175 -38 148 209 40 -131 -184 -42 144 208 55 -136 -180 -8 160 162 11 -161 -186 1 176 152 -23
4311 -23 -171 -161 16 155 143 -28 -224 -145 29 143 116 -34 -166 -166 37 207 132 -45 -203 -88 94 190 135
4334 135 -54 -194 -115 96 189 129 -97 -190 -102 113 175 68 -109 -193 -90 100 165 50 -134 -203 -64 127 191
4357 191 27 -163 -193 -63 107 195 46 -153 -204 -52 151 191 27 -167 -174 -28 153 151 16 -176 -172 -12 155
$$ packed form
4198A28k26j07J01K09J00q6k22j22J47J91R8j42k06o7J18J91R0j07k26o6J50K06
4220A52M8j74j78n8J47K02J3j52j86K9J23J76M8k23j64J7K04J56k5j74j52J9J60
4243HJ71J4k20j69O1J68J38k6j80j53N3K01J08k9j92j57P6J95J29n8k30j01P7
4266a16J84J21q4k01j00Q5K10J07j32j96p3Q2K03R4j16j95r0J35K00Q2j38k06
4288a44l1J37J86O1j69j71n3J42J86O4j53j91m4J72J68Kj51j72k5J87J75k4j75
4311b3j48J0J77J39j2j71j96P9J74J14k7j50j32%K03J70p5j77j58J15J82R6n5
4334A35j89j40P9K11R3o0k26r3Q8K15O2j07j77q4J03J90O5j15j84o9J39J91O4
4357A91j64j90l0J30J70Q8j49j99n1J52K03M0j64j94pJ46J81kj35j92MJ60J67
$$ plain form
4380 155 161 -11 -157 -149 -4 145 152 -21 -171 -174 29 173 151 -40 -206 -134 35 168 119 -79 -189 -127 54 177
4404 177 113 -84 -199 -110 93 189 66 -82 -186 -97 85 169 99 -89 -176 -71 114 187 66 -114 -176 -67 122
4427 122 205 54 -129 -195 -44 138 174 38 -160 -168 -65 125 162 43 -187 -199 3 126 157 12 -209 -177 -5
4450 -5 157 150 -10 -136 -157 18 170 173 -6 -179 -111 63 181 108 -43 -164 -125 34 185 78 -73 -183 -136 60
4474 60 175 81 -113 -200 -93 81 171 72 -97 -183 -121 91 178 73 -106 -149 -43 98 154 57 -105 -154 -41 133
4498 133 170 30 -105 -156 -17 154 186 25 -146 -175 -1 138 153 42 -151 -153 -22 162 158 -12 -160 -113 2
4521 2 164 148 -22 -195 -129 24 158 115 -54 -147 -103 28 164 142 -61 -157 -126 49 155 103 -60 -166 -85 92
4545 92 200 110 -69 -144 -95 102 185 104 -125 -158 -59 96 177 56 -99 -168 -86 85 150 45 -130 -182 -73 120
$$ packed form
4380A55Oj72j46QJ45J49Pj73j50lK03J44k2j91j66P2J69J33m9j98j10O2J81J23
4404A77o4j97j15Q9K03R6j23j48j04Q9J82Q4p0j88q7J05J85P3j21j80o2J09J89
4427A22Q3j51j83o6J51J82L6j36j98qJ03J90L7j19k30j2K02J23L1j45k21L2J72
4450eJ62pj60j26k1J75J52Lj79j73O8J74J18p3j51j21L9J59J51j07j51j10M7J96
4474F0J15r4j94q7J07J74R0r9j69q6O2K12Q7j05j79m3J06J41N6r7j62m9J13J74
4498A33L7j40j35n1J39J71L2j61j71k9J74J39J5j11j93kJ31J84mj70j48M7J15
4521BJ62j6j70j73O6J53J34m3j69r3M4J31J36k2k03r6L1J75J06n2j63j06Q1J77
4545I2J08r0j79p5M9J97Q3q1k29l3R9J55Q1j21j55o9Q2J71O5j05j75n2J09J93
$$ plain form
4569 120 172 44 -140 -168 -44 147 113 0 -150 -156 -16 149 167 -7 -162 -140 18 168 151 -6 -129 -126 25
4592 25 175 134 -28 -154 -123 42 139 109 -76 -188 -143 27 143 95 -66 -171 -105 42 152 114 -74 -179 -73
4615 -73 53 162 78 -62 -151 -75 80 182 70 -82 -143 -74 115 150 37 -113 -162 -35 101 166 50 -111 -152
4638 -152 -41 100 161 32 -135 -157 -19 112 140 -7 -147 -172 -10 116 154 10 -165 -173 -18 143 139 -20 -131
4661 -131 -122 18 156 101 -46 -173 -106 30 166 145 -45 -165 -104 55 147 104 -33 -165 -124 61 150 85 -86 -167
4685 -167 -82 64 173 66 -112 -180 -105 97 134 49 -123 -176 -93 97 144 49 -92 -189 -42 103 157 37 -112 -144
4709 -144 -20 124 155 18 -95 -132 -5 123 148 3 -147 -137 -21 147 105 -6 -153 -153 -2 105 125 -34 -150
4732 -150 -126 13 133 105 -40 -168 -145 27 169 96 -50 -161 -101 64 166 118 -67 -149 -80 60 163 68 -67
$$ packed form
4569A20N2j28j84k8J24J91l4j13j50oJ40J65J8j74j55K2J58J50j7j57j23LJ51
4592B5J50m1j62j26L1J65R7l0j85j12M5J70J16m8j61j05O6J47J10l8j88j05J06
4615g3J26J09q4j40q9P6J55J02j12j52o1O9J89L5j13j50m9J27J36O5j16j61m1
4638a52J11J41O1j29j67k2J38J31K8j47j40k5J62J26L8j44j75qJ55J61mj59j11
4661a31RJ40J38n5j47j27O7J36J36k1j90j20O1J59R2m3j37j32M1J85Q9o5j71q1
4685a67Q5J46J09j07j78o8P5K02L7q5j72n3Q3J90M7r5j41r7J47J45N4j20j49l2
4709a44J24J44L1j37j13l7J27J28K5j45j50J0J16J68m2j11j47%J51J07K0j59j16
4732a50K4J39J20k8j45j28K3J72J42p3j46j11O0J65J02m8j85q2O9J40J03r5j35
$$ plain form
4755 -67 -161 -87 66 163 82 -79 -149 -44 108 127 73 -112 -176 -73 102 133 44 -114 -176 -23 126 144 6 -141
4779 -141 -147 -32 130 136 21 -122 -137 -15 145 139 15 -135 -126 20 145 115 -24 -134 -129 3 142 130 -32 -136
4803 -136 -128 39 126 72 -30 -149 -107 59 144 141 -33 -150 -107 44 135 79 -96 -173 -105 81 136 71 -84 -148 -80 90
4829 90 154 53 -102 -148 -58 90 145 83 -67 -124 -64 81 177 31 -106 -144 -24 112 134 17 -139 -168 -39 117
4853 117 121 -2 -141 -133 -12 110 102 -17 -133 -130 -17 130 125 -21 -154 -136 -11 135 117 -47 -117 -98 40 152 105
4878 105 -34 -120 -114 37 156 85 -39 -139 -73 61 153 69 -79 -136 -109 37 145 49 -123 -173 -65 87 118 38
4902 38 -83 -176 -66 98 138 34 -95 -149 -1 114 130 30 -90 -121 -26 111 160 13 -116 -148 -32 131 123 12
4926 12 -103 -124 -21 137 118 -9 -131 -126 -6 125 113 -55 -157 -108 31 119 100 -41 -133 -99 9 142 88 -59
$$ packed form
4755f7r4P4J53R7q1j61p0J05J52J9n4j85o4J03J75L1q9j58o2J53J49J8j38j47
4779a41oJ15J62Oj15j43j5J22J60oj24j50RJ46J25l0j39j10NJ32J39j2j62j04
4803a36QJ67Q7n4j02j19M2J66Q5lj74j17M3J51R1n6j75p7O8J86N5o5j55o4O8J70
4829I0O4j01j55m6R0J48N5o2j50n7O0J45R6j46j37l8J20J36K2j17j56k9J29J56
4853A17Mj23j39QJ21J22qj19j16LJ13J47nj46j33J8J25J46j8j64p0J9J38J12m7
4878A05j39q6OJ51J19p1j24j00O6J34R2q4j48n7K7J46J08r6j72n0J08J52L1q0
4902C8j21r3J10J64M0j04j29n4J48J15J6j00j20l1R5J37M9j47j29l2J16J63qj11
4926A2j15k1J03J58j9j27j22NJ20J31j2j68j02M9J39Q8j9j41r2L4J08J33n4j47
$$ plain form
4950 -59 -134 -106 49 116 98 -57 -155 -104 66 169 65 -73 -153 -63 84 128 79 -76 -158 -49 73 141 67 -81 -160
4975 -160 -66 89 158 30 -103 -115 -43 93 105 18 -119 -159 -34 107 99 -7 -119 -156 -14 103 122 -11 -121 -164
4999 -164 5 138 140 -24 -121 -103 2 142 101 20 -111 -112 15 155 106 -56 -157 -100 20 134 68 -62 -145 -121
5023 -121 24 114 63 -63 -139 -87 23 142 75 -98 -198 -61 77 129 54 -98 -128 -48 104 117 49 -87 -133 -35
5047 -35 92 120 45 -114 -142 -47 116 106 7 -112 -150 -19 78 109 -1 -146 -143 -32 107 117 -6 -127 -130 7 101
5072 101 106 -23 -124 -133 -3 130 100 -35 -134 -124 44 153 112 -45 -158 -102 41 130 100 -39 -143 -79 62 119
5096 119 54 -64 -112 -106 46 112 47 -83 -135 -67 63 164 24 -95 -156 -51 92 143 33 -100 -138 -58 113 129
5120 129 29 -116 -140 -10 78 104 29 -124 -141 -15 111 130 5 -118 -91 7 107 133 -17 -126 -104 6 122
$$ packed form
4950e9p5K8J55O7j8j55r8N1J70J03j04j38q0R0J47M4m9j55q2J09J22O8p4j48p9
4975a60R4J55O9j28j33j2P2J36J2q7j37m0J25J41qj06j12l7J42J17J9j33j10m3
4999a64J69J33Kj64r7J8J05J40m1q1j31jJ27J40m9j62j01N7J20J14o6j30q3K4
5023a21J45R0n1j26p6N2J10J19o7j73j00J37J38N2p5j52l0Q0J52J3o8j36m6R8
5047c5J27K8p5j59k8R5J63j0r9j19l8J31R7L1j10j45LJ11J39J0j23j21lJ37R4
5072A01Nj29j01rJ30J33l0j35r9J0J68J09m1j57j13N6J43Q9l0j39j04O4J41N7
5096A19o5j18m8OJ52O6o5j30n2O8J30J01j40j19o1J05J43N1j10j33l8Q0J71J6
5120A29j00j45k4J30Q8K6p5j53j7J26J26J9j25j23K7R8J00K6j50j09K2J10J16
$$ plain form
5143 122 76 -24 -129 -123 0 113 73 -22 -129 -102 13 127 99 -65 -130 -115 22 137 92 -66 -128 -76 55 132
5167 132 98 -57 -127 -67 63 149 40 -45 -129 -54 78 104 54 -84 -117 -65 70 107 39 -85 -100 -54 83 87 6 -96
5193 -96 -126 -36 93 120 13 -128 -133 -16 98 110 -5 -120 -117 9 113 103 5 -124 -110 12 101 100 -8 -112 -80
5218 -80 2 121 66 -22 -129 -93 23 118 58 -37 -139 -110 9 105 64 -83 -134 -79 25 91 61 -92 -154 -58 53 103
5244 103 45 -73 -152 -75 89 93 39 -81 -132 -37 64 139 44 -80 -111 -44 113 116 37 -90 -109 -13 77 123 8 -106
5270 -106 -127 -15 114 137 -2 -132 -112 -26 118 86 10 -115 -121 -11 99 88 -18 -113 -108 30 110 86 -31 -116 -99
5295 -99 46 139 77 -53 -92 -66 53 144 97 -39 -124 -57 49 130 75 -93 -149 -74 53 109 46 -72 -128 -74 67 127
5321 127 31 -78 -131 -34 50 123 8 -90 -109 -61 82 133 38 -101 -125 -12 106 124 20 -84 -98 -29 103 103 10 -109
$$ packed form
5143A22m6j00j05OJ23J13m0r5j07K7J15J14k8j64o5J5J37J15m5j58o2N2J31P7
5167A32l4j55p0O0J30Q6j09q5q4P5J32K6n0j38l3N2J35L7o8j24j5M6J37Mq1j02
5193i6l0R0J29K7j07j41nJ17J14J2j15j15LJ26J04j0r8j29J4J22Q9jj08j04L2
5218h0Q2J19n5q8j07L6J16R5o0r5j02K9J19R6m1j47n1N5J04O6l0j53o2R6J11N0
5244A03n8j18p9P7J64Mn4j20n1R5J01P5r5j24l1O7J57Lp9j27j9R6R0M6j15j14
5270a06k1J12J29K3j39j30K0Q6J44l2p6j25oJ10J10j1j06r5NJ38Q0k4j17q5J7
5295i9J45R3o2j30l9K6J19R1m7j36q5O7J06Q1n5j68n6P5J27N6o3j18n6N4J41O0
5321A27r6j09n3R7Q4P3j15r8j9M8J43N1r5j39k4J13J18J8j04j04j4O9J32%r3j19
$$ plain form
5347 -109 -113 -8 91 95 -21 -128 -109 10 97 89 -15 -134 -131 34 111 68 -27 -131 -101 8 103 72 -47 -134 -67 40
5373 40 99 40 -84 -133 -88 47 111 50 -62 -117 -69 69 107 67 -76 -129 -50 63 120 13 -92 -117 -51 52 104 13
5399 13 -95 -123 -12 74 67 -3 -104 -116 -42 65 82 14 -120 -125 -21 113 98 -23 -104 -95 9 115 116 -25 -104 -88 28
5426 28 102 107 -39 -97 -64 37 102 69 -26 -123 -90 22 119 64 -61 -124 -95 48 112 56 -56 -101 -78 43 96 56 -76
5453 -76 -130 -64 65 102 43 -53 -118 -69 87 131 38 -90 -104 -30 77 112 20 -83 -102 -12 74 132 6 -90 -117 -37 106
5480 106 100 -27 -105 -108 4 90 92 -19 -105 -98 -4 97 57 -29 -110 -100 28 100 50 -19 -91 -78 16 123 96 -41 -121 -51
5508 -51 65 121 76 -36 -85 -41 -1 95 79 -41 -127 -59 56 101 44 -97 -100 -59 56 94 26 -83 -136 -36 78 95
5534 95 26 -83 -128 -19 72 84 30 -109 -103 -41 75 103 3 -64 -97 8 89 81 7 -79 -66 -8 95 77 -13 -91 -94 18
$$ packed form
5347a09mJ05R9Mj16j07J9J19Q7qj04j19LJ65P7m3r5j04L0J09R5l1j19q7O7J07
5373D0N9n9j24m9M5J35O4o1j12n5M8J38L8m0j43n3P9J13N7j07j05k5O6J03N2r1
5399A3j08k8J11Q6pp0j01j2P4J07J7o8j34nJ04J34j5j21q1RJ04J06Jj41p9J6J16
5426B8P4Nj46n8L3J01O5l3r5r7L3J12R7n5j25o3K9J43O4n6j12m5K3J21N3m0j32
5453g6n4O6J29L7n9r6o5M9J56M4r3j28j4P4J07L5r2j03j9R0Q6N8j26r6k7Q0J43
5480A06oj27p8lJ12Q6Kj11q6PR4J01m0q6q1J0J28P2n0o9p2J3R4J07k7j37q0P0
5508e1J16N6m5j12m9M4M0R6j6j20q6O8J15M5n7j41lM1J15L8o8j09n3J00J14J7
5534I5o9j09m5J09R1J2n4j39OO2J16K8j00o7l3J05Q1qp4q6J3N8J03j8r0p8lJ12
$$ plain form
5562 18 70 74 -55 -99 -80 -10 82 60 -56 -118 -93 9 87 71 -50 -117 -67 46 90 70 -52 -125 -62 64 110 40 -41
$$ packed form
5562A8N2Mj29m4J9P0R2k2j16o2K5J02P8j6j21o7N0J13M4k0j22p3O3J26M6p0q1
$$ [...]
8191c8
##END NTUPLES=NMR FID
##END=
