##TITLE=1H_AM_NVCYCLOHEx695
 
 8 sc, 
 14.04.2022
##JCAMPDX= 6.0         $$ Bruker NMR JCAMP-DX V2.0
##DATA TYPE= NMR FID
##DATA CLASS= NTUPLES
##ORIGIN= UXNMR, Bruker Analytische Messtechnik GmbH
##OWNER= root
$$ XWIN-NMR		Version 3.5
$$ Thu Apr 14 10:26:49 2022 Russian Standard Time (UT+4h)  she@DPX200
##.OBSERVE FREQUENCY= 200.13135
##.OBSERVE NUCLEUS= ^1H
##.DELAY= (6, 6)
##.ACQUISITION MODE= SIMULTANEOUS
##.ACQUISITION SCHEME= undefined
##.AVERAGES= 8
##.DIGITISER RES= 18
##SPECTROMETER/DATA SYSTEM= spect
##.PULSE SEQUENCE= zg30
##.SOLVENT NAME= CDCl3
##.SHIFT REFERENCE= (INTERNAL, CDCl3, 0, 15.7039)
##AUDIT TRAIL= $$ (NUMBER, WHEN, WHO, WHERE, WHAT)
$$ ##TITLE= Audit trail, XWIN-NMR		Version 3.5
$$ ##JCAMPDX= 5.01
$$ ##ORIGIN= Bruker BioSpin GmbH
$$ ##OWNER= she
$$ F:/spectra/data/she/nmr/H-F/1/audita.txt
$$ ##AUDIT TRAIL=  $$ (NUMBER, WHEN, WHO, WHERE, WHAT)
(   1,<2022-04-14 10:25:12.65 +0400>,<she>,<DPX200>,
      <created by zg, POWCHK disabled, PULCHK disabled
       configuration hash MD5:
       00 E9 B6 7A A2 85 ED C7 34 08 36 98 17 FE 4E 26
       data hash MD5: 16K
       F3 4D 7C 09 71 A6 56 FC 11 01 E9 D5 BC 79 2E 7A>)
$$ ##END=
$$ 
$$ hash MD5
$$ 3A 0B F6 25 2A 4A 3A 92 51 9B 58 9F EE 50 B2 49
##$RELAX= 
##$RELAX= 
##$RELAX= 
##$RELAX= 
##$RELAX= 
##$RELAX= 
$$ Bruker specific parameters
$$ --------------------------
##$DU= <F:/spectra>
##$EXPNO= 1
##$NAME= <H-F>
##$PROCNO= 1
##$TYPE= <nmr>
##$USER= <she>
##$AMP= (0..31)
100 100 100 100 100 100 100 100 100 100 100 100 100 100 100 100 100 100 
100 100 100 100 100 100 100 100 100 100 100 100 100 100 
##$AQSEQ= 0
##$AQ_mod= 1
##$AUNM= <au_zg>
##$AUTOPOS= <>
##$BF1= 200.13
##$BF2= 200.13
##$BF3= 200.13
##$BF4= 200.13
##$BF5= 200.13
##$BF6= 200.13
##$BF7= 200.13
##$BF8= 200.13
##$BYTORDA= 1
##$CFDGTYP= 0
##$CFRGTYP= 5
##$CHEMSTR= <none>
##$CNST= (0..31)
1 1 145 1 1 1 1 1 1 1 1 1 1 1 1 1 1 1 1 1 1 1 1 1 1 1 1 1 1 1 1 1 
##$CPDPRG= <>
##$CPDPRG1= <>
##$CPDPRG2= <>
##$CPDPRG3= <>
##$CPDPRG4= <mlev>
##$CPDPRG5= <mlev>
##$CPDPRG6= <mlev>
##$CPDPRG7= <mlev>
##$CPDPRG8= <mlev>
##$CPDPRGB= <>
##$CPDPRGT= <>
##$D= (0..31)
0 1.2 0 0 0 0 0 0 0 0.06 0 0.03 0 0 0 0 0.0002 0 0 0 0 0 0 0 0 0 0 0 0 
0 0 0 
##$DATE= 1649917512
##$DBL= (0..7)
120 120 120 120 120 120 120 120 
##$DBP= (0..7)
150 150 150 150 150 150 150 150 
##$DBP07= 0
##$DBPNAM0= <>
##$DBPNAM1= <>
##$DBPNAM2= <>
##$DBPNAM3= <>
##$DBPNAM4= <>
##$DBPNAM5= <>
##$DBPNAM6= <>
##$DBPNAM7= <>
##$DBPOAL= (0..7)
0.5 0.5 0.5 0.5 0.5 0.5 0.5 0.5 
##$DBPOFFS= (0..7)
0 0 0 0 0 0 0 0 
##$DE= 6
##$DECBNUC= <off>
##$DECIM= 32
##$DECNUC= <off>
##$DECSTAT= 4
##$DIGMOD= 1
##$DIGTYP= 9
##$DL= (0..7)
0 120 120 120 120 120 120 120 
##$DP= (0..7)
150 150 150 150 150 150 150 150 
##$DP07= 0
##$DPNAME0= <>
##$DPNAME1= <>
##$DPNAME2= <>
##$DPNAME3= <>
##$DPNAME4= <>
##$DPNAME5= <>
##$DPNAME6= <>
##$DPNAME7= <>
##$DPOAL= (0..7)
0.5 0.5 0.5 0.5 0.5 0.5 0.5 0.5 
##$DPOFFS= (0..7)
0 0 0 0 0 0 0 0 
##$DQDMODE= 0
##$DR= 18
##$DS= 0
##$DSLIST= <SSSSSSSSSSSSSSS>
$$ [...]
##$SUBNAM2= <"">
##$SUBNAM3= <"">
##$SUBNAM4= <"">
##$SUBNAM5= <"">
##$SUBNAM6= <"">
##$SUBNAM7= <"">
##$SUBNAM8= <"">
##$SUBNAM9= <"">
##$SW= 18.05172834244
##$SWIBOX= (0..15)
0 0 2 0 0 0 0 0 0 0 0 0 0 0 0 0 
##$SW_h= 3612.71676300578
##$TD= 16384
##$TD0= 1
##$TE= 0
##$TE2= 300
##$TE3= 300
##$TEG= 300
##$TL= (0..7)
0 120 120 120 120 120 120 120 
##$TP= (0..7)
150 150 150 150 150 150 150 150 
##$TP07= 0
##$TPNAME0= <>
##$TPNAME1= <>
##$TPNAME2= <>
##$TPNAME3= <>
##$TPNAME4= <>
##$TPNAME5= <>
##$TPNAME6= <>
##$TPNAME7= <>
##$TPOAL= (0..7)
0.5 0.5 0.5 0.5 0.5 0.5 0.5 0.5 
##$TPOFFS= (0..7)
0 0 0 0 0 0 0 0 
##$TUNHIN= 0
##$TUNHOUT= 0
##$TUNXOUT= 0
##$USERA1= <user>
##$USERA2= <user>
##$USERA3= <user>
##$USERA4= <user>
##$USERA5= <user>
##$V9= 5
##$VALIST= <valist>
##$VCLIST= <CCCCCCCCCCCCCCC>
##$VD= 0
##$VDLIST= <DDDDDDDDDDDDDDD>
##$VPLIST= <PPPPPPPPPPPPPPP>
##$VTLIST= <TTTTTTTTTTTTTTT>
##$WBST= 1024
##$WBSW= 4
##$XGAIN= (0..3)
0 0 0 0 
##$XL= 0
##$YL= 0
##$YMAX_a= 305321
##$YMIN_a= -291092
##$ZGOPTNS= <>
##$ZL1= 120
##$ZL2= 120
##$ZL3= 120
##$ZL4= 120
##$ABSF1= 10
##$ABSF2= 0
##$ABSG= 5
##$ABSL= 3
##$ALPHA= 0
##$AQORDER= 0
##$ASSFAC= 0
##$ASSFACI= 0
##$ASSFACX= 0
##$ASSWID= 0
##$AUNMP= <proc_1d>
##$AZFE= 0.1
##$AZFW= 0.1
##$BCFW= 1
##$BC_mod= 2
##$BYTORDP= 1
##$COROFFS= 0
##$CY= 11.3945322036743
##$DATMOD= 1
##$DC= 2
##$DFILT= <>
##$DTYPP= 0
##$F1P= 2.36226072786647
##$F2P= -0.459571619588291
##$FCOR= 0.5
##$FTSIZE= 0
##$FT_mod= 4
##$GAMMA= 1
##$GB= 0.15
##$INTBC= 1
##$INTSCL= 1
##$ISEN= 128
##$LB= 0.24
##$LEV0= 0
##$LPBIN= 0
##$MAXI= 10000
##$MC2= 0
##$MEAN= 0
##$ME_mod= 0
##$MI= 1.114404
##$NCOEF= 0
##$NC_proc= 0
##$NLEV= 6
##$NOISF1= 3.799351
##$NOISF2= 2.8
##$NSP= 1
##$NTH_PI= 0
##$NZP= 0
##$OFFSET= 15.70392
##$PC= 1
##$PHC0= -18826.42
##$PHC1= 12.40078
##$PH_mod= 1
##$PKNL= yes
##$PPARMOD= 0
##$PSCAL= 0
##$PSIGN= 0
##$REVERSE= no
##$SF= 200.130013532006
##$SI= 16384
##$SIGF1= 3
##$SIGF2= 2
##$SINO= 400
##$SIOLD= 16384
##$SREGLST= <1H.CDCl3>
##$SSB= 0
##$STSI= 0
##$STSR= 0
##$SW_p= 3612.71676300578
##$SYMM= 0
##$S_DEV= 0
##$TDeff= 0
##$TDoff= 0
##$TI= <>
##$TILT= no
##$TM1= 0
##$TM2= 0
##$TOPLEV= 0
##$USERP1= <user>
##$USERP2= <user>
##$USERP3= <user>
##$USERP4= <user>
##$USERP5= <user>
##$WDW= 1
##$XDIM= 8192
##$YMAX_p= 0
##$YMIN_p= 0
$$ End of Bruker specific parameters
$$ ---------------------------------
##NTUPLES= NMR FID
##VAR_NAME=  TIME,          FID/REAL,        FID/IMAG
##SYMBOL=    X,             R,               I
##VAR_TYPE=  INDEPENDENT,   DEPENDENT,       DEPENDENT
##VAR_FORM=  AFFN,          ASDF,            ASDF
##VAR_DIM=   8192,          8192,            8192
##UNITS=     SECONDS,       ARBITRARY UNITS, ARBITRARY UNITS
##FACTOR=    0.0002768,     1,               1
##FIRST=     0,             0,               0
##LAST=      2.2672688,     0,               0
##MIN=       0,             -291092,         0
##MAX=       2.2672688,     305321,          0
$$ Real data points
##PAGE= N=1
##DATA TABLE= (X++(R..R)), XYDATA
$$ [...]
2077a174p0K430L9k415m0K445ok474J08K451j77k419K23K389k52k370K91K349
2095A328l19k362L65K365m28k360M98K360n94k286O38K208o01k244O30K285p22
2112G61k267Q25K214q91k147R00K110r12k108R52K115j015k095J069K062j131
2128D42k018J167J979j200j938J232J893j228j892J244J901j303j896J414J804
2143A601j435j737J414J707j404j709J451J714j530j652J566J597j600j529J618
2158G2J476j625j451J628J450j685j401J700J389j760j339J796J272j827j177
2173a482J784J165j774j186J835J158j900j078J924J001j908r64J905R31j916
2188e05q87J928Q73j950q44J982P89k015p09J996O72k001o29J992O01j990n86
$$ y = [-1174, -1244, 1186, 1225, -1190, -1230, 1215, 1209, -1265, -1157, 1294, 1117, -1302, -1079, 1310, 1058, -1312, -1021, 1328, 1009, -1353, -988, 1377, 949, -1411, -913, 1447, 853, -1433, -795, 1413, 812, -1432, -802, 1483, 761, -1506, -681, 1533, 642, -1505, -605, 1505, 593, -1515, -563, 1552, 537, -1558, -489, 1573, 442, -1576, -409, 1570, 370, -1568, -336, 1557, 329, -1563, -319, 1582, 279, -1617, -203, 1601, 166, -1571, -157, 1550, 146, -1563, -112, 1602, 72, -1580, -14, 1583, -17, -1546, 72, 1548, -77, -1528, 100, 1550, -135, -1536, 164, 1553, -207, -1546, 250, 1522, -305, -1482, 302, 1467, -307, -1493, 342, 1500, -400, -1478, 446, 1447, -461, -1425, 480, 1411, -505, -1392, 536, 1409, -541, -1385, 597, 1386, -629, -1338, 658, 1330, -671, -1300, 692, 1293, -697, -1283]
2205a283K018N53k062m75K069L90k018l79K009L57k010l43K041K83k034k52K042
2222I06K07k045j41K024R9k008o4J998M4k006rK023m5k042J32K013j91j970K09
2241h66J951k23j977K67K003l51j969M02J935m25j927M62J918m94j902N23J870
2258A197n44j862N68J851n97j853O38J839o75j798O85J776o75j794P12J793p72
2275D89j759Q12J714q17j705Q43J701q84j690R57J646j005j598J036J574j077
2291B37j550J109J536j164j504J209J449j228j413J247J406j287j381J330J325
2306A321j336j306J343J293j357j282J385J254j398j207J382J191j376j186J382
2321A03J194j429j148J440J115j454j079J461J053j487j022J508R98j534r68J573
$$ y = [-1283, 735, 1288, -774, -1249, 820, 1210, -808, -1187, 822, 1179, -831, -1174, 867, 1150, -884, -1136, 906, 1113, -932, -1073, 951, 1050, -958, -1022, 976, 1020, -986, -995, 1028, 983, -1059, -927, 1086, 895, -1075, -866, 1085, 862, -1115, -848, 1155, 804, -1165, -763, 1172, 747, -1180, -718, 1200, 706, -1196, -673, 1197, 653, -1209, -641, 1210, 613, -1240, -602, 1237, 562, -1236, -551, 1225, 550, -1244, -532, 1261, 489, -1270, -458, 1256, 439, -1266, -423, 1278, 394, -1296, -339, 1307, 302, -1296, -260, 1314, 237, -1313, -204, 1332, 168, -1336, -127, 1322, 94, -1319, -72, 1334, 47, -1334, -4, 1321, -15, -1321, 22, 1315, -42, -1324, 61, 1315, -83, -1290, 92, 1283, -93, -1279, 103, 1297, -132, -1280, 160, 1275, -179, -1258, 203, 1256, -231, -1253, 255, 1253, -281, -1249, 324]
2337C24R09j609q46J640P83j649p39J667O83j673o58J703O09j741n34J763M57
2354A089j722m45J709M54j724m35J742L95j732l82J721L69j720l48J728L13j700
2371f88l05J667L35j691l26J724K77j740k20J733J55j695j32J684J22j716r1J763
2389H56j9j743J21J687j43j697K03J686k46j688L20J659l53j658L88J653m29j647
2407a050M77J631n19j584N19J561m94j572M80J600n12j602N52J572n66j527N38
2424d96J516n10j550N47J544n97j529O57J482o86j440P03J421p37j422Q11J388
2441A102q58j350R02J336r72j292J037J219j059j175J075J147j100j133J136J116
2457A131j157j096J167J082j208j021J194R96j157j022J145J055j167j068J206
$$ y = [324, 1233, -376, -1222, 418, 1201, -448, -1187, 480, 1163, -510, -1168, 535, 1144, -597, -1131, 632, 1089, -633, -1078, 631, 1085, -639, -1074, 668, 1063, -669, -1051, 670, 1039, -681, -1029, 699, 1012, -688, -993, 674, 1009, -682, -1008, 716, 993, -747, -967, 766, 921, -774, -906, 778, 900, -816, -907, 856, 837, -906, -785, 902, 759, -938, -735, 951, 705, -983, -663, 996, 643, -1015, -627, 1026, 597, -1050, -573, 1058, 539, -1045, -526, 1035, 541, -1031, -551, 1049, 537, -1065, -513, 1059, 493, -1034, -496, 1020, 510, -1040, -493, 1051, 454, -1075, -418, 1064, 378, -1062, -359, 1062, 325, -1097, -286, 1102, 244, -1106, -204, 1132, 160, -1132, -95, 1124, 65, -1110, -35, 1112, 12, -1121, 15, 1131, -26, -1122, 45, 1127, -81, -1102, 92, 1088, -69, -1091, 54, 1109, -58, -1126, 80]
2472H0J035j212j003J197R83j190r67J174R87j214r69J270R08j297q51J319P99
2489A049j330p58J356O99j369o44J394O01j423n63J465M91j490m03J468L65j442
2506e34l62J440L59j465l50J502K95j507k41J464K59j453k88J467K95j475k90
2523h84J499K58j484k43J478K22j464k20J478J95j498j47J497J01j492o7J509
2540G38Qj517Q0J474j15j461J59J457k08j464K64J450l14j446L80J417m31j371
2558i00M29J356m15j379M44J395m90j379N17J328m88j317M75J328m80j338M76
2575d38J366n14j342N41J322n52j315N69J302n92j297O28J264o43j258O82J267
2592I90p56j222Q13J153q52j090Q37J086q58j080R19J039r64r93R85R62j006r26
$$ y = [80, 1115, -97, -1100, 97, 1080, -110, -1077, 97, 1084, -130, -1099, 171, 1079, -218, -1069, 250, 1049, -281, -1039, 317, 1016, -353, -997, 397, 998, -425, -988, 477, 968, -522, -925, 543, 908, -534, -896, 544, 903, -562, -912, 590, 885, -622, -863, 601, 860, -593, -881, 586, 881, -594, -884, 615, 873, -611, -854, 624, 846, -618, -838, 640, 835, -663, -810, 687, 788, -704, -771, 738, 746, -771, -691, 783, 668, -793, -634, 823, 615, -849, -585, 865, 551, -895, -515, 902, 471, -900, -471, 885, 470, -909, -465, 930, 440, -939, -422, 906, 418, -899, -424, 904, 424, -914, -438, 928, 414, -928, -387, 935, 383, -932, -363, 939, 347, -950, -322, 942, 299, -959, -277, 990, 234, -988, -175, 978, 126, -964, -127, 959, 101, -979, -60, 979, 15, -978, 7, 969, -37, -963]
2610i63J003R09r97r24J029R10j045q93J057Q77j057q65J063Q44j055q43J060
2627A10Q29j049q44J081Q32j129p79J137P26j128o97J127O91j143o68J165O38
2644H99j201n94J229N32j227m84J209M60j221m31J238M16j261l85J277L48j274
2661d70l10J266K88j263k65J247K89j279k73J278K68j312k36J317J97j283j90
2678g31J272J81j267j72J282J53j313j05J313O6j303l4J274K4j277NJ284l0j304
2697f82P8J293j10j273J27J277j76j253K01J242k20j220K14J245k34j266K93J239
2715G75l26j215L25J213l38j211L53J195l58j213M12J199m29j179M38J166m63
2732C44j162M87J151n14j137N31J125n53j116N88J112o28j068O16J063o43j041
$$ y = [-963, 40, 949, -48, -972, 57, 967, -78, -971, 86, 963, -94, -959, 104, 948, -107, -950, 110, 939, -110, -954, 127, 959, -170, -949, 188, 914, -214, -911, 216, 907, -236, -904, 261, 899, -302, -896, 333, 865, -362, -846, 363, 823, -398, -829, 409, 825, -436, -821, 456, 804, -470, -780, 486, 774, -489, -754, 493, 782, -497, -770, 508, 776, -536, -772, 545, 742, -541, -731, 541, 722, -545, -717, 565, 718, -595, -700, 613, 679, -624, -658, 616, 640, -637, -632, 652, 622, -682, -604, 689, 579, -694, -567, 710, 534, -719, -518, 724, 504, -716, -502, 743, 509, -757, -464, 775, 449, -766, -441, 772, 434, -777, -424, 771, 413, -800, -388, 811, 382, -797, -359, 807, 344, -818, -331, 820, 306, -831, -300, 825, 272, -844, -256, 856, 228, -840, -224, 839, 196, -845]
2749h45O60J034o67j036P15R95p27r77P33R61p40r48P45R52p75r49Q16R04q25
2768B6q85Q30Q79q52q62Q76Q23q70q02Q73P94q90p79R18P64r55p16R55O88r52
2788a37o67R55O66r80o46J012N96j019n76J018N68j016n54J026N45j048n18J043
2806B68N06j055m95J060M80j074m66J100M29j106l84J084L68j083l58J093L42
2823G09j116k84J111K52j104k29J106J96j097j77J118J32j114r4J089Q2j092o8
2841e80J105M4j106j0J084Mj070j5J093qj106J4J133o1j103O7J091o4j109R7J102
2862F02j04j107J19J107j53j089J66J090k01j073K36J061k63j046K79J047l16
2879C55j025L38J019l84r73L93R55m11r40M16R31m39r24M63R12m78r05N02Q89
$$ y = [-845, -185, 849, 182, -854, -139, 856, 129, -848, -115, 846, 106, -842, -97, 855, 80, -869, -53, 851, 26, -859, -29, 850, -2, -864, 12, 835, -35, -837, 36, 830, -60, -839, 79, 843, -112, -828, 127, 815, -137, -804, 151, 817, -163, -809, 203, 799, -220, -796, 222, 790, -226, -780, 246, 791, -257, -775, 268, 774, -281, -776, 284, 764, -310, -776, 324, 753, -353, -737, 347, 715, -368, -726, 367, 709, -407, -691, 420, 672, -432, -661, 445, 641, -456, -633, 485, 617, -497, -591, 498, 580, -512, -580, 525, 569, -537, -547, 537, 541, -529, -544, 549, 541, -565, -551, 582, 521, -582, -515, 576, 512, -597, -500, 602, 498, -609, -490, 617, 464, -625, -459, 631, 430, -643, -407, 654, 391, -655, -376, 671, 355, -670, -332, 687, 303, -670, -277, 678, 267, -673, -257, 674, 235, -689, -226, 686, 208, -697, -195, 694]
2898F94n13q75N05Q83n09q92N20Q96n42q89N66Q85n78q66N78Q51n77q54O06Q34
2918G23o17q26O39Q10o56p90O70P55o82p25P07O92p12o69P10O63p41o40P77N78
2938F66p75n42P50N42p62n21P58N29p80n21Q06M97q11m79Q03M74q01m69Q06M87
2958F57q25m73Q26M68q21m81Q56M26q44m15Q38M13q44m01Q77L63q77l27Q52L12
2978E80q74k81Q79K45q65k10Q60J88q64j62Q63J37q59j13Q59P7q43o2Q20P6q31
2999c80p7Q60M9q67j5Q56pq11m8Q52L2q62j8Q71qq60K9Q51l9q57M0Q71o6q67J00
3024c71Q38j25q12J23Q28j45q34J87Q07k11p67K21P44k16p56K32P63k73p36K89
3044b14P23l18o75K99O90l07p02L27O99l56o66L54O61l48o77L60O72l80o63L80
$$ y = [694, 181, -694, -189, 694, 185, -707, -187, 709, 167, -722, -156, 729, 151, -715, -137, 714, 137, -717, -111, 723, 106, -720, -81, 729, 73, -717, -47, 708, 26, -699, 8, 700, -12, -681, 29, 692, -49, -689, 88, 666, -109, -651, 99, 641, -121, -642, 116, 645, -135, -656, 150, 647, -164, -643, 160, 634, -167, -636, 170, 657, -168, -641, 185, 653, -168, -649, 207, 633, -211, -626, 212, 625, -219, -620, 257, 620, -257, -584, 268, 580, -294, -575, 304, 549, -316, -526, 334, 522, -342, -504, 359, 496, -363, -476, 383, 460, -383, -445, 375, 451, -380, -457, 403, 452, -415, -430, 426, 419, -392, -440, 412, 444, -418, -436, 435, 427, -433, -404, 447, 408, -449, -409, 462, 396, -471, -371, 467, 342, -470, -347, 481, 336, -498, -311, 496, 285, -482, -261, 483, 267, -489, -257, 506, 233, -503, -214, 509, 191, -484, -185, 505, 198, -504, -177, 522, 166, -500, -146, 515, 167, -510, -150, 522, 142, -521, -141]
3064a41O59l77o73M00O68m13o66M28O56m41o28M31O19m23o22M47O14m73n85M95
3084b5N29m81n12M76N14m83n25N19M86n23m57N21M48n28m26N19M21n44l95N40
3104G4L92n33m03N44L93n54l88N77L70n91l52N74L60n62l69N87L71o18l32N98
3124A38L30o02l11O02L02n98l06O11K85o19k69O27K47o22k23O10K04n92k24O16
3144B06J82o07j48N99J30n99j21O00J09n89r8N79R2n83p3N74Q0n86o7O01N5o21
3166b85k6O00K6n88l3N93M0o27j5O41j4o18J2O09no21K2O19k1o53N6O30p8o00
3190c36O7O07q0o07J15N95j35n63J30N36j11n62J46N59j85n32J93N06j89m90J86
3211a50N04j87n27K14N15k25n02K38N01k27n22K37N27k63n20K77N04k71n23K77
$$ y = [-141, 518, 141, -532, -132, 536, 123, -543, -115, 541, 100, -528, -97, 522, 99, -523, -76, 538, 65, -520, -25, 504, 23, -489, -13, 501, 18, -507, 12, 498, -25, -482, 39, 487, -41, -467, 52, 473, -71, -466, 74, 466, -67, -470, 74, 467, -87, -475, 102, 472, -119, -471, 103, 463, -99, -468, 119, 490, -128, -460, 138, 468, -134, -445, 157, 459, -139, -445, 166, 451, -168, -437, 190, 437, -185, -408, 202, 406, -186, -410, 206, 388, -219, -367, 232, 362, -237, -358, 242, 351, -238, -336, 243, 335, -248, -321, 253, 333, -253, -320, 281, 336, -285, -311, 289, 315, -273, -306, 287, 327, -300, -315, 326, 312, -306, -294, 315, 310, -311, -289, 330, 309, -344, -288, 342, 264, -336, -269, 338, 258, -349, -234, 361, 226, -337, -207, 329, 218, -344, -198, 361, 176, -356, -163, 343, 154, -336, -150, 354, 167, -360, -146, 369, 144, -358, -120, 381, 154, -368, -131, 396, 133, -387, -110, 394, 123, -400, -123]
3231a23N32k99n18L15N06l26m92L23M92l23m94L42M86l72m57L79M11l55m07L59
3251b1M11l62m18L94L76l86l50L78L54l97l40M14L17m09l09L95L15m01l23M21
3271E9L14m31l16M39L03m52k86M52K92m44l13M67L13m92k89M92K67m77k68M92
3291A22K66n08k39M86K35m92k26N09J96m90j82M85J69m86j36M61J28m52j31M54
3311A69J22m72r6M65P8m51q0M60P5m63o6M72M9m66o4M85M8m87m3M98L5m99l9N11
3335B41K3n09j4N08J4n07kN08rn17M2M83l3m88M2M73n1m56O6M52p5m38Q1M40j13
3360A61m18J01M24j10m08J14M04j38m03J39M04j43m06J62L96j56m02J48M19j74
3380A14m02J88M09j94m19K09M05k03m11K11M09k23m01K28M00k41l84K47L62k47
$$ y = [-123, 409, 110, -408, -93, 413, 87, -405, -82, 410, 87, -407, -65, 421, 49, -408, -29, 382, 27, -380, -21, 390, 28, -390, 4, 380, -6, -356, 22, 376, -21, -361, 53, 370, -39, -348, 47, 362, -39, -362, 59, 373, -58, -374, 65, 368, -84, -370, 82, 374, -70, -383, 84, 397, -95, -384, 108, 375, -102, -370, 122, 388, -120, -359, 127, 362, -130, -356, 153, 349, -141, -323, 162, 331, -155, -291, 170, 298, -154, -285, 169, 291, -181, -277, 188, 266, -185, -265, 195, 270, -193, -259, 213, 262, -204, -268, 217, 265, -222, -265, 233, 268, -231, -270, 241, 264, -245, -259, 249, 263, -244, -246, 262, 253, -264, -222, 261, 228, -260, -218, 255, 204, -252, -186, 266, 191, -247, -166, 274, 161, -257, -156, 268, 158, -250, -136, 268, 130, -273, -134, 270, 127, -279, -117, 279, 123, -279, -131, 288, 114, -288, -100, 309, 115, -304, -95, 310, 107, -304, -93, 316, 93, -308, -80, 320, 79, -305, -58, 304, 57]
3400E7l57K55L32k41l32K51L28k69l04K58L08k73k90K75K76k69k66K61K77k76
3420Ak73K82K63k85k71L17K47l07k45L06K54l11k62L30K51l36k36L24K45l45k27
3441b78L50K11l40k21L55J98l54j95L60J85l56j73L60J44l45j36L27J47l32j41
3461b34L44J31l50j12L40R9l29r8L35R9l35j01L52Q3l46r1L61O1l45o0L52N9l53
3484a38o1L60N1l69l4L52N3l75l3L58K5l62k5L74Kl51j0L59nl41LL52k6l28J6
3509a53L38k8l41M0L29l0l29L1L38n0l29N5L26o1l25O6L26p2l25O8L43j02l33
3532b18J09L15r2l21R5L19r9l19J10L11j22k97J15L00j21l02J28L14j42k95J39
3553g3K93j51k78J35L01j60k86J58K84j67k71J58K81j72k76J82K71j89k71J91
$$ y = [57, -300, -45, 287, 46, -286, -35, 293, 24, -280, -22, 286, 13, -277, -2, 274, 5, -261, 0, 277, 1, -272, 10, 273, -12, -283, 34, 281, -26, -271, 35, 289, -22, -284, 46, 297, -39, -275, 49, 294, -51, -278, 72, 283, -57, -278, 77, 275, -79, -274, 86, 271, -85, -258, 102, 246, -99, -235, 92, 239, -93, -234, 110, 241, -109, -221, 119, 218, -111, -209, 126, 225, -110, -211, 141, 224, -122, -213, 148, 209, -136, -196, 156, 215, -138, -199, 161, 212, -157, -191, 161, 214, -161, -194, 164, 189, -173, -198, 176, 178, -173, -183, 176, 171, -170, -167, 185, 159, -169, -153, 185, 157, -184, -144, 185, 155, -174, -143, 195, 145, -184, -129, 197, 136, -189, -123, 203, 131, -194, -126, 217, 115, -218, -109, 206, 114, -207, -112, 207, 108, -211, -101, 210, 88, -209, -94, 206, 85, -217, -89, 225, 83, -212, -73, 220, 69, -209, -74, 227, 67, -219, -61, 223, 56, -215, -57, 224, 52, -224, -42, 229, 40, -231, -40]
3573d0K57j84k61J93K67k06k66K19K53k14k59K23K39k10k51K30K37k32k24K27
3593bK22k14k17K12K17k20k14K35K00k32k01K31J97k29k03K37K02k55j81K48J81
3614B14k48j95K65J90k77j88K94J70k96j59K86J58k75j61K83J64l05j51L19J20
3634B08k95j27K99J42l03j45L14J20k88j14K80J12k85j13K91J02k87r2K91O7k85
3655a08o5K71P6k90p2K97P8l23n0L20L4k94n4L06N5l29l1L32L4l41j8L33nl25
3679a69oL37Nl44J2L43l2l13K8K94j9l01J6L24l2l26N5K95l5l05L7K96l4l05N6
3704a23K99o2k93O7K86o1k90O9L04q7l12J14K88j10k91J06K93j04l06J26L05j42
3726G6k80J27K95j34k95J44L06j67k91J57K79j66k55J53K59j54k79J75K63j72
$$ y = [-40, 217, 33, -228, -35, 232, 26, -240, -21, 232, 18, -241, -18, 221, 11, -240, -10, 227, -5, -229, -2, 220, 6, -211, 1, 218, -2, -216, 19, 219, -13, -214, 17, 214, -15, -218, 19, 221, -34, -215, 33, 214, -34, -229, 36, 226, -51, -239, 55, 225, -71, -230, 56, 214, -61, -222, 61, 225, -80, -231, 88, 208, -87, -214, 85, 227, -76, -221, 93, 213, -75, -189, 91, 203, -82, -195, 96, 198, -89, -181, 110, 177, -108, -173, 98, 174, -116, -188, 109, 187, -136, -186, 134, 168, -126, -180, 126, 181, -148, -179, 153, 187, -154, -172, 161, 156, -169, -175, 162, 167, -177, -165, 178, 146, -167, -139, 155, 136, -165, -149, 175, 143, -183, -128, 167, 132, -173, -136, 160, 126, -179, -123, 176, 114, -179, -112, 174, 113, -177, -108, 196, 109, -203, -89, 199, 89, -202, -96, 197, 93, -213, -87, 218, 76, -204, -77, 218, 84, -211, -67, 239, 72, -219, -62, 217, 51, -204, -51, 208, 54, -225, -50, 213, 41]
3746D1k47J52K50j58k38J55K54j84k34J86K26j86k21J89K28k02k23K03K23k18
3766dk00K12J97k08k17K39K11k54j94K47J92k48j88K45J85k59j78K61J78k57j80
3787b20K64J65k72j44K53J58k56j51K61J40k49j47K51J49k68j29K74J03k49j20
3807a87K57J23k75j09K80R6k70r4K79P9k77q9K90P6k95o2K98O1k94m9K82N7l09
3830a32m4L19K5l14pK93K1l08k1L07K7l14pL08pk83KK86pk90QK83k4k70K4K86
3856A61k6k87L1K86l7k91L9K80l9k86M9K87m6k91O5K84p0k82O3K84q0k72P2K87
3880A81r1k79R8K82j04k76J05K89j35k65J18K77j24k72J27K72j37k65J50K53j42
3901F2k58J43K52j57k31J49K30j48k42J60K27j57k19J54K32j61k27J65K22j72
$$ y = [41, -206, -54, 196, 38, -200, -45, 209, 25, -209, -23, 203, 17, -204, -15, 213, 11, -212, -9, 214, -4, -204, 8, 205, -3, -220, 19, 230, -24, -218, 29, 221, -27, -215, 30, 215, -44, -222, 39, 217, -40, -220, 44, 209, -63, -207, 46, 204, -52, -203, 58, 198, -51, -198, 53, 202, -66, -195, 79, 182, -67, -187, 70, 193, -82, -191, 89, 185, -85, -179, 100, 179, -98, -187, 103, 179, -116, -178, 120, 181, -113, -162, 120, 177, -132, -176, 143, 168, -146, -153, 140, 161, -147, -168, 139, 166, -148, -155, 153, 146, -137, -135, 151, 144, -146, -138, 145, 121, -149, -125, 161, 135, -152, -121, 165, 128, -163, -124, 156, 117, -169, -120, 167, 121, -170, -105, 179, 109, -173, -110, 174, 94, -178, -106, 181, 90, -189, -91, 191, 87, -189, -84, 205, 70, -195, -77, 200, 76, -196, -69, 203, 66, -199, -49, 204, 62, -196, -53, 199, 42, -189, -40, 190, 42, -200, -40, 187, 30, -189, -35, 197, 36, -191, -26, 196, 24]
3921B4k26J73K14j64k23J98J93j87j96J83K09j94k01K01J97k11j87K18J86k12
3941ej78K08J75k23j79K26J71k21j69K25J61k32j55K19J74k47j41K40J42k37j43
3962a89K34J32k32j37K41J32k34j34K37J30k30j32K39J26k42j31K56J10k42j05
3982a71K46J07k58r3K46R6k58q7K65P4k68o3K61P7k84n3K83L4k75m4K76N1k95
4005a33l4K90K9k85k5K87J4k76j9K83J5k77j6K79J7k78j7K72Rk62jK53J4k64K
4030a23K61nk70JK79k3k58J3K76l7k69M1K78o2k64N4K75p2k87R3K78j00k68R5
4054i4K69q7k81J10K59r7k69J11K68j18k62J10K73j19k52J02K66j13k59J01K67
4075A85j08k69J17K55j09k57J09K62j26k55J32K46j31k43J36K42j53k43J75K30
$$ y = [24, -202, -29, 185, 21, -202, -4, 189, 2, -194, -11, 198, 4, -197, 4, 201, -10, -197, 21, 207, -5, -183, 25, 200, -23, -202, 24, 195, -26, -195, 30, 191, -41, -196, 23, 197, -50, -191, 49, 191, -46, -189, 45, 177, -55, -192, 49, 181, -53, -187, 50, 180, -50, -182, 57, 183, -59, -190, 66, 176, -66, -171, 75, 182, -76, -169, 77, 173, -85, -172, 93, 167, -101, -164, 97, 174, -110, -163, 120, 154, -121, -165, 111, 162, -133, -167, 123, 152, -133, -158, 129, 143, -133, -152, 131, 146, -131, -147, 132, 149, -129, -146, 126, 135, -127, -128, 125, 139, -125, -123, 138, 133, -137, -136, 143, 120, -138, -125, 151, 114, -155, -114, 164, 102, -162, -108, 167, 95, -192, -99, 179, 79, -189, -94, 175, 88, -193, -83, 176, 79, -190, -79, 189, 71, -191, -81, 192, 73, -179, -77, 189, 76, -183, -82, 185, 77, -192, -75, 180, 71, -186, -77, 185, 59, -196, -64, 182, 51, -192, -56, 186, 33, -210, -35, 195]
4095A95j84k13J88K27k16k02K11K04k14k03K23J96k22k03K31J91k29j87K38J76
4115B07k25j87K24J93k33j84K13J85k25j67K27J66k15j96K31J74k17j74K32J82
4135B11k63j53K43J51k46j54K61J44k74j22K77J14k71j06K80J01k88q5K89P1k87
4156a07p9L04O5k96n4K76Q4l16m9K92N4k94m8K88M7k99m0K84M2k85l9K82N0k88
4180a26m3K90M2k94k7K89L0l06k2L08Jk94OL07j5l09K9L01l5k99M1K98n5l08Q4
4205a07L02q7k99P7L06r2k98R3K94r1l03J14K78r0k94J09K87j13k83R3K94j00
4227I0k83R7K92j07l01J25K84j17k71J02K83j09k88J33K86j55k77J56K74j59k62
4248b07J62K55j64k66J82K49j82k53K07K29j98k32K08K29k16k28K19K22k13k19
$$ y = [195, 11, -202, -14, 213, -3, -205, 6, 210, -4, -207, 16, 212, -10, -213, 18, 209, -20, -207, 31, 207, -18, -205, 19, 212, -21, -205, 8, 193, -32, -199, 28, 194, -21, -217, 14, 188, -29, -203, 29, 211, -52, -205, 38, 189, -57, -211, 50, 194, -80, -202, 75, 189, -82, -188, 92, 193, -95, -180, 109, 180, -107, -186, 118, 183, -113, -167, 109, 193, -123, -172, 120, 174, -120, -168, 120, 167, -132, -172, 112, 154, -131, -170, 112, 162, -126, -169, 121, 163, -131, -158, 131, 161, -145, -167, 141, 142, -152, -146, 161, 146, -163, -134, 167, 132, -167, -126, 172, 117, -191, -107, 195, 108, -191, -114, 192, 100, -198, -105, 189, 98, -205, -91, 187, 97, -197, -88, 199, 86, -197, -104, 190, 90, -193, -96, 196, 89, -212, -87, 197, 80, -191, -89, 194, 85, -203, -70, 216, 61, -216, -60, 214, 55, -207, -45, 210, 46, -220, -38, 211, 29, -224, -17, 212, 14, -218, -10, 219, 3, -225, -6, 216, 3, -216]
4268b16K16K13k17k22K36K08k18k17K26K09k31j94K20K07k26k05K32K02k34k08
4288b19K36K01k50j81K43J80k46j75K52J68k63j62K74J31k52j45K86J19k80j18
4308b01K84J18k86j06K79J01k80j03K89J03k98q5K77J04k96p7K80Q5k92q0K96
4329A12P1k90p6K86P5k85p3K89O6k95n3K92M0k83m3K90M2l15k1L04J5k97jK92
4353A42pk73j8L00lk99L0K88l0k84K9K73l0k78L3L02m9l03N6K91o0k80N3K83n8
4378A08k86O8K69p2k67P8K75o9k88R3K62r1k77J03K62q3k64Q3K67r5k67J12K66
4401A87j21k58J31K55j31k52J31K54j47k40J48K44j70k19J47K32j57k33J69K24
4421A94j59k36J82K11j70k28J81K27j98k08J88K08j94k04J84K11j80k16K00K06
$$ y = [-216, 0, 213, -4, -226, 10, 218, 0, -217, 9, 218, -13, -207, 13, 220, -6, -211, 21, 223, -11, -219, 17, 218, -32, -213, 30, 210, -36, -211, 41, 209, -54, -216, 58, 189, -63, -208, 78, 197, -83, -201, 83, 201, -85, -191, 88, 189, -91, -194, 95, 198, -100, -185, 92, 196, -100, -177, 103, 188, -104, -184, 112, 183, -107, -183, 103, 178, -107, -180, 109, 175, -120, -173, 119, 159, -124, -167, 123, 165, -150, -171, 133, 148, -149, -150, 142, 135, -138, -156, 144, 141, -158, -128, 160, 130, -154, -125, 148, 118, -160, -127, 175, 126, -177, -121, 170, 110, -170, -117, 166, 108, -178, -110, 159, 87, -180, -102, 173, 104, -184, -91, 171, 80, -197, -94, 168, 85, -179, -96, 171, 76, -191, -79, 187, 66, -192, -61, 194, 63, -189, -58, 196, 49, -191, -43, 201, 31, -188, -41, 191, 34, -199, -30, 194, 35, -201, -19, 192, 22, -206, -25, 202, 4, -204, -16, 192, -2, -206, -22, 189, 9, -207, -7, 199]
4441A99j99k09K19J82k01j81K01J83k12j77K18J77k25j71K25J74k34j63K26J63
4461A95k36j50K42J35k36j44K46J30k53j09K42J23k63j02K52J05k58j04K43J17
4481A75k58q9K55P5k48q5K63P7k54p5K57Q7k76p0K75O3k69o6K60O3k56n8K59N4
4505A59k65m8K64L4k67k5K58K9k84pK72J0k56j3K67J6k88PK78k6k59L1K58k0k76
4530a51M2K64m0k61M5K58n5k49N0K65o6k73P2K67p8k52P4K51p2k70Q9K57r5k62
4554a90J04K56j04k47J10K44j01k49J14K43j33k29J25K28j29k36J59K13j37k18
4574a77J41K22j60k07J52K07j51k21J71K06j74k04J74K04j78j85J66K01j92j84
4594a89J87J80j95j71J92J74k02j65K12J59k09j49J91J58k10j53K23J42k18j49
$$ y = [199, 0, -209, 10, 192, -9, -190, 11, 194, -18, -195, 23, 200, -25, -196, 29, 203, -31, -194, 32, 195, -41, -191, 51, 186, -50, -194, 52, 182, -71, -180, 62, 185, -78, -180, 72, 177, -81, -185, 58, 175, -83, -172, 83, 158, -90, -175, 88, 165, -89, -164, 93, 180, -96, -166, 109, 172, -97, -163, 97, 160, -96, -154, 105, 159, -106, -154, 110, 144, -123, -148, 110, 139, -145, -152, 120, 130, -126, -139, 128, 144, -144, -137, 141, 115, -144, -113, 145, 125, -151, -109, 155, 115, -146, -101, 157, 102, -147, -97, 168, 102, -171, -99, 168, 90, -162, -88, 163, 91, -179, -90, 167, 72, -190, -86, 170, 66, -181, -71, 173, 72, -177, -63, 180, 47, -182, -57, 171, 42, -194, -35, 178, 41, -177, -36, 186, 26, -181, -29, 178, 27, -194, -23, 183, 9, -195, -21, 183, 5, -180, -14, 187, -5, -189, -2, 178, -17, -188, 4, 178, -24, -189, 23, 182, -27, -176, 15, 173, -37, -190, 33, 175, -43, -192]
4614a92K27J39k28j30K23J30k10j38K42J21k43j13K30J00k23j02K39R8k36r9K42
4635G7P7k39p4K39Q3k55n3K25O0k31n8K38N6k66l2K44N1k50l7K39N4k60k5K43
4659A06K9k47k4K48J9k45k0K52Ok42PK37j0k39RK41j0k49K7K28k4k37L6K28l5
4684I1k27M7K23m7k28N6K18n3k29O7K27p1k24Q2K15p4k14P9K05q5k08Q7K03r3
4708D7j82Q7J93r7j89R3J98j13k02J23J95j20j87J15J97j35j76J27J73j31j80
4729a64J51J57j38j65J39J65j41j65J55J61j58j54J67J45j66j43J69J34j50j42
4749a43J60J41j75j33J78J23j82j16J82J06j68j20J83J07j86r1J67J03j86j01
4769a51J92J00k05q6J96Q4j88q1J90Q2j98p0J97N4j87o1J86O5j91o1K07N4j95
$$ y = [-192, 35, 174, -54, -184, 39, 169, -41, -179, 63, 184, -59, -172, 58, 158, -65, -167, 72, 170, -66, -165, 77, 154, -85, -159, 80, 163, -92, -145, 80, 140, -91, -149, 89, 145, -121, -153, 91, 142, -108, -145, 94, 148, -112, -137, 106, 135, -112, -136, 112, 131, -114, -134, 118, 124, -118, -111, 126, 116, -123, -114, 127, 117, -132, -105, 123, 99, -138, -102, 126, 91, -136, -89, 134, 87, -141, -85, 133, 80, -149, -82, 145, 74, -150, -68, 147, 73, -141, -62, 143, 58, -150, -63, 140, 47, -135, -48, 145, 48, -141, -48, 150, 37, -165, -42, 153, 33, -154, -39, 158, 23, -153, -26, 147, 16, -164, -13, 144, 6, -159, -20, 145, 4, -161, -6, 155, -3, -157, 10, 155, -11, -154, 15, 149, -1, -143, 17, 158, -17, -150, 28, 151, -31, -147, 35, 141, -27, -147, 36, 143, -43, -134, 33, 136, -50, -151, 41, 141, -64, -150, 46, 130, -58, -139, 51, 133, -65, -135, 62, 116, -71, -132, 54, 119, -72, -133, 74, 128, -67]
4792f7n1K00L7k03l0K02K7k05j4J88J6j90k0K02%j80j6J92Mk03K0J90k0j84J8
4817h7J80j5j94J5K08k5j90L7J82l4j87L3J93l8j80K9J80l0j95N6J84m6j89M0
4841g3J99o4j74N5J76o0j73O7J63q6j64R6J51p6j61Q4J56q7j59Q9J67r2j63J06
4865b3J39r6j37R1J44r5j48J13J38j12j44J21J36j12j46J22J37j19j34J26J20
4886A21j25j21J15J45j50j28J46J20j44j08J37J12j36j19J36J14j46r7J46R7j48
4907c3r6J54R7j61p5J46P8j43r3J66R4j84o2J62P5j69p2J70O8j65p0J66O2j74
4931e9n1J69M9j70n8J72N6j64o4J83M9j90l3J77M1j87k5J69L8j76l9J82K9j76
4955g8k0J83Kj75LJ77j5j67OJ66jj68jJ79j6j77J7J78k4j66J8J75l2j72K9J86
$$ y = [-67, -118, 82, 119, -84, -114, 88, 115, -90, -104, 84, 100, -90, -110, 92, 92, -88, -104, 88, 92, -111, -91, 99, 79, -105, -87, 93, 78, -116, -101, 107, 82, -108, -71, 111, 77, -110, -77, 116, 78, -102, -73, 107, 77, -118, -62, 122, 76, -113, -73, 126, 62, -112, -57, 119, 59, -114, -47, 116, 30, -134, -38, 113, 37, -124, -40, 116, 29, -130, -41, 126, 34, -129, -23, 116, 20, -117, -26, 118, 23, -125, -12, 126, 14, -130, -9, 127, 15, -131, -9, 128, 9, -125, 1, 121, -4, -125, -10, 135, -15, -143, 3, 123, -21, -129, 8, 120, -16, -135, 1, 115, -31, -128, 18, 115, -33, -129, 25, 122, -39, -114, 32, 110, -33, -126, 40, 134, -50, -112, 50, 125, -44, -116, 54, 122, -43, -113, 53, 115, -59, -110, 59, 108, -62, -120, 52, 108, -56, -120, 63, 112, -78, -111, 66, 107, -80, -105, 64, 102, -74, -113, 69, 98, -78, -98, 85, 87, -88, -85, 92, 77, -90, -84, 82, 81, -87, -88, 91, 75, -102, -85, 93, 69, -97, -79, 96, 64, -108, -79, 107]
4981A07m1j85M3J79l6j76K9J85m0j74L2J86n9j68N8J77o3j78Q6J55o4j75P9J74
5005A31r4j58R1J52q3j55Q5J53r6j57J05J40r1j47J01J38r9j42J04J49j26j35
5027a34J16J34j19j18J09J33j24j28J22J35j23j28J46J08j39j15J47J08j51j06
5047a27J49J08j49j11J49R6j41r1J41R2j57q0J52P8j51q1J62P4j72p1J74O3j68
5070f1o3J73M9j58o5J90M3j61n6J67M8j72m5J74L8j68l2J64K9j65k7J71K8j79
5094g8k5J85J4j86nJ78Nj82NJ76jj84J0J74pj80L0J64l0j64J4J80j6j87L9J82
5120A11n2j69M9J61m1j64L4J80n1j71O6J60n3j66N4J70o7j70P5J60p2j53O5J67
5144A23q9j56Q5J39p3j49R4J41r6j50J12J32r8j48J18J40j19j34J14J38j12j43
$$ y = [107, 66, -119, -76, 103, 67, -109, -80, 105, 65, -109, -77, 109, 50, -118, -60, 117, 54, -124, -38, 117, 53, -122, -43, 131, 37, -121, -30, 122, 39, -116, -31, 122, 26, -131, -26, 114, 23, -124, -23, 115, 16, -126, -22, 127, 1, -134, -18, 116, -3, -121, -12, 121, -3, -131, -9, 126, 3, -125, 21, 129, -10, -125, 22, 130, -21, -127, 22, 130, -19, -130, 19, 115, -26, -117, 24, 116, -41, -121, 31, 109, -42, -123, 39, 113, -59, -130, 44, 107, -61, -124, 49, 98, -60, -125, 65, 108, -53, -109, 58, 106, -66, -111, 63, 101, -67, -99, 65, 94, -71, -98, 73, 101, -78, -103, 82, 96, -90, -95, 83, 88, -94, -89, 87, 86, -98, -88, 86, 79, -101, -71, 93, 63, -101, -87, 93, 77, -110, -71, 111, 59, -110, -61, 100, 59, -105, -71, 109, 58, -113, -47, 113, 60, -106, -52, 118, 51, -119, -44, 116, 44, -109, -44, 123, 34, -122, -37, 102, 29, -120, -26, 115, 19, -131, -19, 113, 15, -133, -15, 125, 6, -128, -14, 124, 12, -131]
5166a31J22J30j24j25J29J29j29j24J35J15j38j01J35J07j38j07J28J08j54r7
5186a30J46J02j54r5J57R1j48r5J62P0j36q9J44Q1j60n4J41P5j57o6J68M8j57
5209e6m2J54M1j53l5J50M6j70m2J80K6j66l6J73L7j72l6J74K4j71l2J73K7j87
5233i3kJ69Mj62j2J69J8j83%J67Oj68%J69j1j64J7J66k8j58L7J60l8j55L1J58
5259I7l2j68M1J61m8j43L9J53n0j57M9J63n6j57N3J59o2j49N0J52o0j52O7J61
5283A11p8j43P4J35o8j48J00J22q4j32Q4J40q8j24Q2J26r1j26R8J06r0j10J01
5306cJ26j15j20J17R8j04j11J15J11j22j08J21R0j05j02J10J10j24j01J23R0j18
5328b2j02J41Q8j26q6J23R0j23q5J24R2j49p0J38O2j27o9J37O2j34o3J40N3j39
$$ y = [-131, -9, 121, -3, -128, 1, 130, 1, -123, 12, 127, -11, -112, 23, 130, -8, -115, 13, 121, -33, -130, 16, 118, -36, -131, 26, 117, -31, -126, 36, 106, -30, -119, 25, 106, -54, -108, 33, 108, -49, -115, 53, 101, -56, -98, 56, 97, -56, -91, 59, 105, -65, -107, 73, 99, -67, -103, 70, 107, -65, -101, 73, 97, -74, -106, 67, 94, -93, -95, 74, 78, -84, -96, 73, 91, -92, -92, 75, 81, -87, -87, 82, 71, -93, -76, 90, 62, -96, -59, 101, 63, -92, -61, 97, 65, -103, -62, 99, 51, -92, -53, 100, 50, -107, -58, 105, 49, -108, -55, 104, 42, -107, -57, 95, 35, -117, -50, 111, 33, -110, -36, 99, 31, -117, -17, 105, 21, -111, -27, 113, 25, -99, -17, 109, 18, -108, -10, 96, 6, -104, -3, 123, 8, -112, 5, 103, -1, -112, 3, 114, -8, -116, 5, 95, -10, -112, -2, 108, -16, -117, 6, 96, -22, -124, 17, 105, -21, -107, 16, 106, -17, -102, 22, 114, -35, -105, 33, 95, -32, -101, 36, 98, -36, -99, 41, 94, -45]
5352d5m7J33N1j42l9J35L7j38l6J51L4j47m3J37M1j47k6J59K2j62j9J51K4j48
5376f4k1J51K8j70%J52Pj40k2J57Qj63LJ54Lj57NJ43nj52J5J40qj43RJ49k2j51
5404i4K3J56l4j46L6J45m0j37L7J43k6j64L6J66m9j54N6J45n4j49N7J54n7j60
5428a10P1J51o8j44N7J51p2j39O0J50p7j43P9J45r4j32Q9J33q7j33Q7J33r7j18
5452a08R6J19r8j28J11J12j10j03J03J14j02j18J16J08j13j07J22J05j23r8J20
5473A8J11j33j06J31J01j38j01J39R6j36r2J30R2j35r9J43Q6j46r1J62Q1j56p1
5496a14J54O8j66n9J58O4j65n6J66N3j60m1J61L5j61l9J68L0j55k5J54L0j73o
5520g9J53J7j45l8J62K7j70k3J74Lj72lJ76kj70j0J78Qj81%J75lj67J2J63j0j59
$$ y = [-45, -92, 41, 92, -50, -89, 46, 83, -55, -91, 60, 94, -53, -96, 41, 82, -65, -91, 68, 90, -72, -91, 60, 84, -64, -85, 66, 94, -76, -76, 76, 83, -57, -79, 78, 86, -77, -74, 80, 83, -74, -69, 74, 69, -83, -68, 72, 64, -79, -70, 79, 57, -94, -71, 85, 51, -95, -59, 86, 46, -91, -54, 89, 63, -101, -65, 101, 52, -102, -46, 99, 45, -104, -47, 107, 50, -110, -39, 112, 44, -100, -43, 108, 36, -103, -43, 107, 30, -113, -34, 111, 17, -115, -26, 107, 20, -113, -26, 107, 10, -108, -12, 107, 9, -119, -8, 104, -6, -109, -6, 108, 6, -112, 4, 112, -1, -108, 14, 119, -4, -102, 18, 129, -4, -110, 21, 122, -16, -117, 22, 118, -18, -110, 20, 112, -23, -122, 21, 107, -39, -130, 32, 113, -43, -114, 40, 108, -58, -117, 41, 105, -60, -116, 50, 103, -57, -98, 63, 98, -63, -102, 66, 96, -59, -84, 70, 100, -73, -79, 74, 91, -54, -92, 70, 97, -73, -96, 78, 81, -91, -94, 82, 80, -90, -100, 78, 86, -95, -95, 80, 77, -90, -78, 85, 75, -84]
5547h4RJ69k9j56J1J78l5j63L7J72m3j67M0J68n1j52L8J63m3j65N1J58n7j49N7
5572d3J60p7j61P3J53p2j59Q6J48q0j48R2J48r2j49R7J42q9j54R9J50r3j41Q9
5596b1J39j05j30J02J47j20j28J10J30j15j24J09J17j14j13J20J13j36j03J39
5616A7R6j26j06J29J04j36j04J41R4j39q2J39P5j29p6J34P4j33p8J50P6j64o6
5639a10J65O0j48p6J62N7j58m8J51O5j67m8J57M3j58n0J73K4j58l2J67J8j58j7
5663h6J56L0j79j0J63%j50qJ50J7j59RJ52mj63NJ65pj64J4J65j6j59LJ69j3j64
5690h4K6J58l0j69K9J78l5j68L3J65n0j57L7J68n7j51O3J46o1j49N9J53o3j47
5714a06O5J55p2j61Q7J44p7j48Q9J42j07j24R3J39r2j36R5J36r5j41J05J28j21
$$ y = [-84, -75, 94, 65, -91, -80, 98, 63, -100, -63, 109, 66, -101, -61, 107, 56, -96, -58, 105, 62, -103, -52, 106, 49, -100, -43, 117, 40, -121, -48, 105, 33, -126, -40, 108, 28, -120, -28, 120, 28, -121, -24, 118, 29, -125, -26, 124, 31, -110, -21, 118, 13, -117, -15, 132, 12, -116, -6, 124, 9, -115, -6, 111, -3, -116, 4, 117, -19, -122, 17, 113, -13, -119, 10, 114, -22, -126, 15, 109, -30, -112, 27, 102, -27, -103, 31, 105, -28, -106, 44, 120, -44, -110, 55, 115, -33, -109, 53, 110, -48, -96, 55, 120, -47, -95, 62, 105, -53, -103, 70, 94, -64, -96, 71, 89, -69, -86, 70, 100, -79, -89, 74, 74, -76, -84, 66, 83, -76, -67, 85, 81, -82, -77, 88, 81, -83, -69, 96, 80, -79, -76, 93, 80, -84, -58, 100, 70, -99, -70, 108, 73, -95, -62, 103, 53, -104, -67, 101, 44, -107, -44, 102, 41, -108, -49, 104, 41, -106, -41, 114, 42, -119, -32, 112, 35, -113, -24, 118, 11, -113, -20, 119, 27, -109, -14, 122, 27, -114, -9, 119, -2]
5737bj13J10J15j07j18J17J04r7j22J10J19j16j24J19J23j22j14J22J05j28j01
5758a20J38J00j27j02J29R5j18j00J27R2j33r4J47Q8j42p8J33P7j44o6J42P4j54
5781c6n0J29O3j45p0J55N0j59l9J53M1j50l9J53M0j62l5J66L6j58l4J67K4j68
5805f8k4J56L2j56l0J79J7j82%J57Nj56KJ54Kj45j7J69j6j59MJ68j6j59J4J63
5831I4k9j58K7J59l1j59L3J54k2j69L0J66l2j53M1J47l8j67M5J67m4j63O3J46
5855A07l7j68O0J54n6j58P2J37o0j60P1J49o6j61P2J56q4j44P6J45q4j50J09J40
5879A20j03j43J06J30r7j32J02J36j05j34J17J25j10j32J09J41j24j26J24J25
5899A29j25j28J28J21j18j34J27J24j30j26J42J11j47j04J38J13j47j03J38J00
$$ y = [-2, -115, -5, 110, 3, -115, 2, 106, 9, -113, -3, 116, 0, -124, -5, 118, -4, -118, 4, 109, -19, -120, 18, 118, -9, -111, 18, 113, -5, -105, 22, 114, -19, -113, 34, 122, -20, -98, 35, 112, -32, -98, 44, 118, -36, -86, 43, 106, -39, -109, 46, 96, -63, -102, 51, 92, -58, -97, 56, 96, -66, -101, 65, 101, -57, -91, 76, 100, -68, -92, 64, 96, -60, -90, 89, 106, -76, -76, 81, 86, -70, -68, 86, 88, -57, -74, 95, 79, -80, -76, 92, 76, -83, -69, 94, 65, -93, -66, 93, 62, -97, -64, 90, 68, -101, -71, 95, 63, -90, -49, 98, 60, -107, -62, 105, 61, -102, -39, 107, 70, -98, -38, 116, 60, -98, -26, 111, 51, -109, -38, 111, 45, -116, -44, 112, 28, -116, -40, 105, 21, -129, -20, 120, 17, -126, -20, 110, 13, -119, -17, 119, 14, -120, -3, 122, 12, -120, -11, 130, 6, -120, 4, 129, 4, -124, 4, 125, 7, -127, 0, 124, -6, -132, 10, 121, -26, -130, 8, 121, -26, -129, 9, 109]
5919A09j40j06J58J01j54r3J49J00j72p4J54Q3j53q1J57P7j56p1J67O0j57o8J68
5942E8P1j85o2J75N0j68m4J53N6j73n2J71O4j84l9J86J5j65m3J88L1j96pJ76J9
5967I5j92lJ76K2j82j4J92Lj90JJ85Qk06J7J90j9j80K2J79k1j80J4J87k8j82J9
5993h7J97l8j89M1J82l9j91N4J82o0j77N7J80o6j72O3J74n1j86P6J73p3j81R0
6017d1J68q4j66Q4J67r2j61R0J63q5j69J07J52j13j57J21J45j15j49J19J50j30
6039Dj47J20J49j30j36J34J40j33j33J25J37j42j29J46J34j48j40J55J33j53j21
6060a35J61J12j61j00J56J06j62j10J77J00j70r8J64R6j75q7J78P7j87o7J81P8
6082A34j97o2J77P3j93p0J97P1k06n2J91N3j81o4J96N0j92m7J99L6j95l7J99M0
$$ y = [109, -31, -137, 21, 122, -32, -125, 24, 124, -48, -122, 32, 115, -38, -119, 38, 115, -41, -112, 55, 115, -42, -110, 58, 129, -56, -118, 57, 107, -61, -105, 48, 104, -69, -121, 50, 114, -70, -109, 77, 92, -73, -116, 72, 103, -93, -100, 76, 95, -97, -100, 76, 98, -84, -98, 94, 97, -93, -92, 93, 101, -105, -88, 102, 83, -97, -75, 104, 83, -97, -83, 104, 76, -106, -87, 110, 72, -117, -76, 106, 67, -124, -70, 112, 52, -125, -68, 112, 46, -126, -63, 111, 60, -126, -50, 123, 50, -131, -41, 127, 43, -123, -39, 128, 36, -125, -35, 128, 43, -126, -19, 133, 20, -137, -16, 129, 14, -135, -16, 134, 4, -143, -23, 126, -4, -140, -6, 134, 1, -132, -7, 130, -12, -141, 5, 139, -9, -149, 6, 139, -14, -135, 26, 138, -23, -123, 33, 139, -23, -133, 44, 144, -26, -124, 40, 136, -39, -126, 52, 129, -58, -125, 56, 134, -63, -125, 52, 125, -68, -138, 59, 130, -76, -128, 63, 116, -65, -129, 67, 117, -75, -122, 77, 113, -82, -119, 80, 120]
6106A20k03m0K13K4j97l2K11K1k07j6K04Rk11lJ95J3k07J2J96qk11QK17k3j98
6131a13K0K03l3j89K5J98l1k16N1K02m8k05O7J96n4j89M8J97n9k01P2J87o9j89
6155a30P2J99q4j80O1J90p9j85Q7J84r9j78R7J82j00j84J04J73j07j81J32J63
6177A37j18j71J28J58j27j37R7J79j39j47J33J48j28j52J19J62j45j42J58J27
6197A40j39j32J45J33j48j37J51J28j65j30J73J15j58j21J61J27j73j15J74J07
6217A36j76j17J80J12j79r1J70J00j94q6J94Q6j86p7J83Q0j94p4J93P2j94n3J88
6240G3N2j81o1J86O0k07m7K01M4k01l6J97L8k01k8J95K2k01k2K05J7j90l0K13
6264I8%j96oJ99jj91rK11mk01PK00j3j97J1K11k1k14K7K02k8k00M0J91l6j99L8
$$ y = [120, -83, -123, 90, 114, -83, -115, 96, 117, -90, -106, 98, 107, -104, -107, 88, 101, -106, -94, 102, 94, -117, -109, 108, 85, -113, -93, 110, 77, -112, -87, 111, 80, -136, -85, 117, 69, -136, -69, 127, 73, -116, -68, 129, 70, -131, -59, 128, 59, -130, -58, 141, 57, -123, -62, 128, 49, -136, -49, 135, 36, -142, -45, 137, 37, -147, -43, 130, 23, -158, -26, 137, 19, -152, -24, 134, 7, -130, -33, 146, 7, -140, -7, 141, 13, -139, -20, 142, -3, -145, 13, 140, 1, -131, 14, 147, -1, -138, 13, 141, -24, -154, 19, 134, -24, -145, 16, 143, -30, -145, 29, 136, -40, -157, 23, 135, -44, -135, 35, 135, -59, -145, 49, 135, -51, -128, 55, 135, -59, -133, 60, 132, -62, -115, 73, 125, -56, -117, 69, 129, -78, -125, 76, 120, -81, -117, 80, 118, -83, -111, 84, 106, -95, -117, 88, 105, -85, -115, 98, 98, -98, -104, 95, 94, -97, -106, 105, 101, -100, -93, 107, 94, -103, -92, 119, 98, -116, -89, 113, 85, -115, -75, 116, 80, -119, -81]
6291h1K06l8k09N1J97o6j89N5J94o0j96P3J84o9j84N7J99o7j95P9J88p4j96Q5
6315e6J89q2j95J02J79q9j93J00J87r4j90J19J63j06j76J14J62j11j61J18J56
6336A36j26j67J31J69j28j62J39J57j56j52J52J48j50j47J56J39j48j40J46J52
6356A49j66j30J58J39j62j40J75J35j81j24J77J31j85j26J81J11j75j04J80R5
6376A38j86r3J79J08j97r9J98R4j93j01J93Q9j93q3K06P1k03q3K14P2k12o3K06
6399F2P3k09n6K11N7k12n6K27L0k16l6K07M8k15l6K23J9k24j8K19K4k19j8K24
6423A09Mk18pK14Jk18jK29j0k30K0K09ok21L1K26l6k22L5K13k6k12L3K20m1k26
6449a30O3K11n4k14N7K01n4k17O1K19p6k06Q4K03q9k11R0K17j06k04J01J88r1
$$ y = [-81, 125, 87, -122, -71, 126, 60, -129, -74, 120, 60, -136, -63, 121, 52, -132, -75, 124, 57, -138, -59, 129, 55, -141, -56, 133, 51, -144, -42, 137, 48, -145, -45, 142, 48, -142, -23, 140, 34, -142, -28, 134, 23, -138, -20, 136, 10, -157, -26, 143, 15, -147, -8, 149, -7, -159, -7, 141, -9, -156, 0, 139, -9, -149, -3, 149, -17, -147, 11, 150, -12, -152, 23, 158, -23, -147, 30, 161, -24, -150, 31, 142, -33, -137, 43, 138, -48, -141, 38, 146, -51, -150, 48, 142, -51, -152, 41, 130, -63, -146, 60, 131, -72, -155, 59, 131, -81, -144, 62, 135, -74, -130, 81, 138, -74, -130, 97, 127, -89, -125, 82, 130, -85, -121, 102, 121, -103, -121, 98, 122, -97, -115, 109, 113, -105, -112, 102, 103, -115, -116, 113, 103, -127, -107, 102, 96, -125, -94, 132, 96, -126, -91, 122, 96, -116, -83, 137, 96, -130, -67, 144, 90, -124, -67, 134, 80, -137, -76, 143, 67, -139, -55, 148, 59, -152, -62, 155, 49, -155, -54, 134, 43]
6472D3k02R6K09j09j95J01K09j23j88J17J98j29j86J31J91j45j74J38J79j42j76
6493a57J45J72j46j72J56J56j45j64J56J56j54j59J52J67j79j52J68J47j70j41
6513a64J74J42j77j29J73J40j97j30K00J23j95j15J89J26j99j15K08J03k06r5
6533a44J99R2k02q4K03Q5k07q0K07P5k15p0K18O4k12p4K26N6k25n7K26M3k19l8
6557a33K13L9k06m3K15M3k38j7K23K3k22k3K45J4k45RK19J3k43PK22lk27PK28
6582A20k7k10K3K10qk38K5K27l1k20L3K14l9k13M7K16n3k17M9K23n7k13O8J99
6606A28n9k08O7K22q4k16Q9K09q9k07J00J93r4k02J06J93j05j91J02K01j15k00
6628a60J32J89j34j86J22J93j36j90J43J69j32j79J45J81j40j83J47J63j54j48
$$ y = [43, -159, -63, 146, 37, -158, -57, 152, 29, -159, -42, 156, 27, -159, -28, 163, 18, -156, -18, 161, 19, -157, -12, 160, 14, -158, -2, 154, 9, -155, 1, 157, 3, -156, -4, 163, -16, -168, 0, 147, -23, -164, 10, 152, -25, -154, 19, 159, -38, -168, 32, 155, -40, -155, 34, 160, -39, -154, 54, 157, -49, -144, 55, 147, -55, -139, 64, 149, -58, -138, 69, 144, -71, -141, 77, 141, -71, -145, 81, 137, -88, -145, 81, 124, -95, -133, 80, 119, -87, -130, 85, 128, -110, -127, 96, 119, -103, -126, 119, 133, -112, -103, 116, 129, -114, -107, 115, 112, -115, -108, 120, 93, -117, -94, 116, 108, -130, -105, 122, 91, -129, -96, 118, 79, -134, -87, 129, 76, -141, -92, 131, 74, -139, -71, 128, 69, -139, -72, 150, 66, -150, -61, 148, 59, -148, -48, 145, 51, -151, -45, 148, 43, -148, -46, 155, 40, -160, -28, 161, 27, -159, -37, 156, 20, -170, -27, 142, 10, -169, -24, 157, 17, -166, -19, 144, -10, -158]
6648a58J56J56j59j59J60J49j54j43J61J54j73j31J69J35j76j34J62J41j89j12
6668a45J74J21j84j15J80J23j95j06J93R9j94r9J91R2j90r2J87R5j91r2K10P8
6690A40j97q8K03P2j99o5K01O2j99o9K16N9k13m1K01M8k07l8K14K0k08l6K14K5
6714A15k04k6J99K0k03l4K33Qk28OK14Jk25PK23ok22J1K17j6k09J2K21j6k22L4
6740i0K17l6k14K5K28l7k15M4K02m4k06M9K04n5k12O5K06o2k07P2K00o8j98O5
6764f7K04q3j99R1J91r6j86R0J87r0j92J04J93j08j89J04J88j01j94J22J80j22
6786B7j84J33J75j11j77J18J68j31j72J31J76j41j54J28J70j53j55J47J42j46
6806ij45J45J47j58j33J61J34j53j35J51J36j56j45J74J30j70j20J78J11j72j15
$$ y = [-158, -2, 154, -5, -164, -4, 145, -9, -152, 9, 163, -10, -141, 28, 163, -13, -147, 15, 156, -33, -145, 29, 150, -34, -149, 31, 154, -41, -147, 46, 145, -49, -148, 43, 135, -55, -147, 40, 135, -56, -148, 62, 140, -57, -145, 58, 130, -69, -134, 67, 129, -70, -139, 77, 136, -77, -118, 83, 131, -76, -114, 100, 120, -88, -124, 90, 115, -89, -115, 84, 104, -99, -133, 100, 108, -120, -114, 100, 101, -124, -117, 106, 100, -122, -111, 106, 90, -119, -107, 114, 98, -124, -90, 127, 91, -123, -98, 130, 93, -122, -78, 124, 80, -126, -77, 127, 72, -140, -75, 131, 69, -138, -66, 134, 66, -132, -67, 137, 54, -145, -54, 137, 41, -145, -55, 132, 42, -150, -46, 147, 39, -150, -46, 142, 41, -153, -31, 149, 27, -157, -24, 151, 40, -137, -19, 149, 18, -154, -23, 153, 12, -142, -14, 156, 3, -152, -5, 137, -9, -154, -9, 138, -20, -153, 8, 142, -11, -146, 5, 141, -15, -160, 14, 144, -26, -146, 32, 143, -29, -144]
6827a44J83J18j92j08J93R8j92r4J83R5j86r6J86R3j96q3J94Q8k00q6K06P6k02
6850f6o2J87O5k01o0K08M8k06l8J92N9k08l8K07M4k12k9K08K9k13l2K25J3k03
6874h3k3J96J5k06qK21mk01%J96jk22J1K20j4k11J3K12k6k07K5K05k5k03K8K10
6900A18m1k01M0J98l8k10O2J92m7k05O8J99n7k03O6J87n4j97Q1J82p9j88P3J93
6924A39r6j79Q4J88q3j91J01J76j05j81J02J88j19j69J13J70j24j68J23J76j36
6945Ij64J36J68j31j73J38J73j44j57J47J45j39j45J42J45j47j45J47J49j56j39
6966a41J65J24j63j31J72J17j64j27J77J07j76j08J76J07j79r3J81R1j85q4J69
6987C5R4j91p2J88P4j87p9K06P0k06o4K00O9k04n4J90P3k18m8K11M8k15l3J94
$$ y = [-144, 39, 157, -35, -143, 50, 148, -44, -138, 45, 140, -46, -142, 44, 137, -59, -142, 52, 140, -60, -146, 60, 136, -66, -128, 59, 124, -77, -137, 71, 119, -87, -125, 67, 126, -82, -120, 87, 131, -81, -110, 98, 127, -86, -118, 107, 120, -83, -106, 90, 105, -101, -109, 112, 108, -93, -93, 103, 102, -120, -109, 111, 97, -114, -101, 111, 85, -122, -97, 108, 83, -120, -92, 118, 77, -124, -84, 114, 76, -134, -72, 120, 73, -132, -64, 135, 78, -125, -59, 128, 74, -123, -42, 140, 61, -127, -54, 139, 43, -136, -52, 136, 53, -138, -37, 139, 34, -147, -45, 143, 24, -145, -32, 138, 14, -154, -31, 145, 9, -155, -19, 149, 18, -155, -17, 156, 12, -145, 2, 147, 8, -137, 5, 150, 3, -142, 5, 154, -2, -141, 24, 148, -15, -146, 26, 143, -21, -148, 29, 136, -40, -148, 28, 135, -44, -137, 44, 135, -50, -134, 35, 129, -62, -134, 54, 128, -59, -138, 68, 138, -68, -132, 68, 137, -67, -121, 69, 142, -76, -124, 87, 135, -80, -113, 81]
7011H1M1j99m7K17K8k09k3J88L0k14j3K11J6k10j2K12oj97MJ92J1k15J7K03k4
7036H2j86J0K02k1k05L0K08l6j98L8J97m3j87M0J93m8k06M6K17o2k03P3J86p8
7060D9j89P0K03q2j85P6J84q2j79Q8J75q4j84R7J74j02j76J12J70j01j68J10J64
7083A40j16j66J22J61j23j58J30J51j28j55J37J55j45j44J29J51j38j41J35J41
7103A38j48j37J56J24j46j31J49J31j60j23J57J30j63j29J77J08j62j08J71J02
7123A36j62j12J80Q4j64q8J77Q8j83q3J81Q3j86p5J61Q5j84o9J89P0j85p1J91
7146F3N7j92m7J75N8j91m5J84M5j87l8J99L6j98l5J99J9j88j6J90J1j90oJ86J5
7171A04j96qK01%j89j2J99j2j85QJ92j2j97K7J83k2j91K6J92m4j78L9J72k8j74
$$ y = [81, 122, -77, -124, 93, 121, -88, -111, 77, 107, -107, -120, 91, 107, -103, -115, 97, 91, -106, -102, 90, 101, -114, -97, 106, 82, -104, -94, 108, 87, -118, -88, 120, 84, -114, -76, 121, 78, -109, -69, 124, 76, -130, -84, 133, 71, -132, -59, 127, 49, -140, -70, 133, 51, -134, -58, 126, 44, -135, -47, 128, 44, -140, -43, 131, 29, -147, -35, 135, 34, -134, -24, 140, 24, -142, -20, 141, 18, -140, -10, 141, 13, -142, -5, 150, 5, -139, -10, 141, 3, -138, -3, 138, -10, -147, 9, 133, -13, -144, 5, 136, -24, -147, 10, 140, -23, -152, 25, 133, -29, -137, 34, 136, -26, -138, 42, 126, -38, -126, 51, 139, -44, -127, 54, 137, -49, -124, 37, 122, -62, -131, 58, 128, -57, -128, 63, 120, -72, -119, 56, 114, -77, -122, 62, 107, -80, -118, 81, 117, -81, -116, 83, 102, -86, -102, 88, 99, -91, -97, 89, 104, -92, -100, 101, 101, -88, -100, 99, 87, -98, -90, 102, 90, -107, -80, 103, 81, -110, -84, 108, 64, -114, -75, 97, 69, -105]
7196a05L4J83l3j98N5J87o1j90O4J88n5j81O4J72o3j89P4J76p6j54O6J71q8j62
7220a21P7J73r5j62J03J54j01j55R7J47r5j55J11J46j13j41J15J36j13j40J20
7241a2J36j17j45J23J49j31j36J25J39j25j30J34J27j44j25J35J32j47j17J45
7261A6J17j46j08J46J12j52j11J47J06j53j06J55J07j64r3J50R4j54r4J66R6j78
7283d7q2J69Q1j69o4J56P1j68o5J61Q3j76n6J63O6j71o3J93M0j84l7J78L9j82
7307f4m7J86L1j76k6J75K5j84k1J81J9j83k0J76K4j88%J81J3k01J2J84j3j68M
7332h0J81j9j71J7J77rj88K0J80k4j86L1J78k2j86L0J83m9j75N0J71o1j62N6J62
7357A04m7j77N9J75o2j73O3J76o8j83Q0J79q2j70Q6J66r2j52R1J56r3j64J10J51
$$ y = [-105, -71, 112, 79, -119, -64, 123, 62, -128, -64, 124, 69, -112, -48, 124, 61, -128, -54, 122, 46, -108, -42, 129, 41, -121, -44, 129, 34, -128, -25, 129, 28, -127, -30, 117, 22, -133, -22, 124, 11, -130, -15, 121, 8, -132, -12, 124, 7, -138, -15, 134, 3, -133, -8, 131, 6, -124, 10, 137, -7, -132, 3, 135, -12, -129, 16, 133, -13, -121, 25, 137, -15, -126, 21, 127, -26, -132, 23, 130, -34, -127, 23, 117, -37, -131, 35, 131, -47, -129, 40, 121, -48, -112, 44, 115, -53, -118, 43, 126, -50, -106, 57, 123, -48, -111, 82, 122, -62, -99, 79, 118, -64, -111, 75, 106, -70, -96, 79, 104, -80, -101, 80, 99, -84, -104, 72, 96, -92, -92, 89, 102, -99, -87, 97, 84, -84, -80, 101, 82, -89, -72, 105, 96, -92, -72, 108, 84, -102, -71, 107, 85, -101, -71, 112, 63, -112, -62, 109, 48, -114, -58, 104, 57, -120, -61, 114, 52, -121, -58, 118, 50, -133, -53, 126, 44, -126, -40, 126, 34, -118, -27, 129, 36, -128, -18, 133]
7381A33r9j50R9J53j00j61J13J44j15j34J09J32j07j45J10J47j25j37J27J19j07
7402Fj32J28J30j43j20J36J30j52j12J44J12j52j04J51J04j42j00J32J11j47j02
7423a22J44J15j68q6J72Q4j69r2J77P5j69p6J62P7j75o8J63O8j73n5J67N7j68
7446f0n6J76N1j72n6J89L6j83l0J74L7j74k5J59L8j78k2J74L0j82j8J79J8j86
7470h1j1J80Mj67j5J88kj85QJ81pj91J1J76j2j74J4J83l0j77K9J72k6j73K6J76
7496I7l1j77M8J71m4j70N3J69n3j59M8J76p4j65P6J61p7j49O3J65q0j59O9J67
7520A25p9j54P0J61r4j45R6J39r0j55J00J45j04j47J15J38j09j38J10J29j06j33
7542a26J22J22j12j37J15J40j33j11J26J20j24j18J30J06j25j15J39J12j42r9
$$ y = [133, 34, -116, -17, 136, 36, -125, -12, 132, 17, -117, -8, 124, 17, -128, -18, 129, 4, -133, -6, 113, 6, -126, 2, 132, -11, -131, 5, 135, -17, -129, 15, 127, -25, -129, 22, 126, -16, -116, 16, 127, -20, -122, 22, 137, -31, -117, 55, 139, -30, -122, 55, 130, -39, -115, 47, 124, -51, -119, 44, 112, -61, -116, 51, 108, -60, -116, 60, 111, -61, -117, 72, 108, -75, -105, 69, 106, -68, -93, 66, 104, -74, -96, 78, 108, -74, -92, 87, 105, -81, -92, 88, 92, -75, -90, 98, 96, -89, -81, 100, 93, -98, -87, 89, 77, -97, -83, 100, 70, -107, -78, 94, 68, -105, -79, 97, 66, -111, -63, 108, 64, -106, -53, 116, 63, -96, -48, 128, 54, -111, -35, 126, 49, -100, -37, 128, 48, -111, -42, 125, 46, -108, -38, 123, 29, -116, -20, 119, 29, -126, -26, 119, 15, -132, -17, 121, 12, -126, -16, 113, 7, -126, -4, 118, 6, -131, -16, 124, -9, -120, 6, 126, 2, -116, 14, 120, -5, -120, 19, 131, -11, -110]
7562a10J27J18j61j06J65Q7j45r2J48Q5j41r7J45Q5j59o3J34Q1j45p9J71P1j68
7585d9p4J77N3j65n1J64N2j55n2J69L7j65l9J55O0j82l5J62L9j63m0J77K3j52
7609e4m1J59K1j67k4J73K1j71mJ60%j57j2J81%j73nJ83rj68J0J62jj67J5J67k0
7636G9j70K5J65k7j52L4J50k6j77M0J69m1j65M1J55l4j69M7J61o0j52M9J52n6
7660C8j51N7J61o4j54O3J49p0j32O1J48p7j46Q4J49q6j40R8J25r1j39R9J34r0
7684B6j41J04J38j04j38J03J29j01j35J17J22j04j26J04J21j08j29J19J07j14
7704a0j06J05J14j17r6J17R4j20r9J29R8j33q7J19J03j29r1J31R5j32r4J46P0
7727A07j22r2J46P3j39p3J41O4j46o8J47P9j56n4J30O7j50n5J47M8j43n3J34N9
$$ y = [-110, 17, 135, -26, -132, 33, 120, -25, -117, 31, 116, -25, -122, 23, 108, -51, -114, 20, 101, -44, -123, 48, 119, -49, -123, 54, 107, -58, -109, 55, 107, -48, -100, 69, 106, -59, -98, 57, 117, -65, -100, 62, 101, -62, -102, 75, 98, -54, -95, 64, 85, -82, -106, 67, 88, -83, -87, 73, 73, -84, -96, 85, 85, -88, -93, 90, 81, -87, -77, 85, 84, -83, -68, 99, 79, -91, -66, 99, 72, -80, -46, 104, 78, -99, -59, 110, 69, -96, -55, 100, 66, -103, -56, 105, 45, -107, -58, 94, 38, -113, -56, 105, 41, -113, -50, 99, 29, -103, -42, 106, 29, -117, -33, 116, 30, -110, -12, 113, 22, -117, -18, 116, 26, -115, -11, 127, 23, -115, -12, 117, 16, -119, -2, 120, 16, -110, -6, 115, 7, -122, -3, 104, -10, -116, -11, 103, -14, -110, 7, 101, -19, -118, 11, 109, -24, -111, 8, 111, -18, -109, 22, 117, -15, -109, 37, 107, -15, -107, 39, 112, -27, -100, 41, 105, -41, -109, 38, 117, -39, -93, 37, 104, -46, -101, 46, 94, -49, -102, 32, 91]
7751I1j49n1J58M5j53l1J59L6j59l8J53K3j41l4J66K8j66k3J59K2j57j7J52Pj52
7776g2j3J66nj49mJ50lj53J0J53j3j60K0J52j1j58J0J52j2j47K0J58l2j54K7J56
7802H8k6j58L8J53l9j49N0J35l6j53M3J58m9j53O1J45n7j49O6J32o2j48P2J44
7826A06p7j31O5J30o4j39P6J38q0j25P2J23q2j22Q9J24q2j26J01J14q8j37J05
7849a0J18r5j12R8J16j17r5R3J19j16j12J13J13j23j01J18Q9j03r8J08R2j16r3
7872a14J23Q2j12q5J19R0j36p1J26P3j32o5J38O8j39o1J37O5j30p0J43N8j38o9
7896a00J41O6j47n5J38O1j56m5J46M5j47m2J42M8j57k8J47L1j54j8J44K7j61j0
7920h4J52J2j49j3J55Jj38j8J42L0j63PJ47mj52OJ40Lj42KJ43Lj57RJ57j8j46
$$ y = [91, -58, -109, 49, 94, -59, -90, 69, 105, -54, -92, 61, 84, -57, -91, 75, 103, -63, -86, 73, 95, -62, -79, 73, 80, -72, -85, 81, 76, -73, -77, 73, 70, -83, -73, 80, 67, -93, -73, 79, 68, -90, -80, 72, 60, -87, -67, 91, 59, -95, -68, 88, 62, -96, -58, 95, 56, -93, -43, 92, 56, -97, -54, 104, 55, -98, -37, 108, 51, -98, -32, 100, 38, -110, -38, 106, 29, -102, -37, 93, 29, -110, -34, 104, 24, -101, -29, 94, 12, -110, -21, 103, 21, -105, -4, 110, 22, -115, -10, 108, 13, -99, -1, 115, -2, -97, -4, 115, -1, -113, 0, 113, -10, -111, 7, 96, -7, -105, 3, 95, -21, -114, 9, 91, -21, -106, 13, 103, -33, -104, 22, 95, -37, -102, 36, 104, -35, -96, 41, 106, -24, -94, 49, 107, -31, -100, 41, 107, -40, -95, 43, 104, -52, -97, 49, 94, -53, -95, 47, 95, -62, -90, 57, 88, -66, -84, 60, 87, -74, -84, 68, 80, -69, -82, 73, 74, -64, -82, 60, 90, -73, -66, 81, 77, -75, -69, 71, 74, -68, -66, 77, 80, -77, -68, 89, 71, -75]
7947g5J4J45j2j70K5J56l8j41L2J51n3j26K8J61m9j51M9J47n2j40N2J38n1j35
7971i5O1J42o8j46P5J35o2j42P2J35p1j35P8J37r4j18Q2J19q5j23Q6J19q8j20
7995a06Q5J14q4j15P7J21r0j02Q2J20j10r9J03R8j02j00J10R1j05r3J16R5j12
8018fr3J07J01j19r0J17Q6j17p4J15P4j19q1J39M8j09p3J27N2j34n6J27P4j36
8042d0n9J19P5j40n3J40M2j34m1J41M0j34n0J39M6j36m2J46L1j47k1J20M1j42
8066e9rJ25K7j34k9J36K1j37j8J39Oj40MJ38%j42pJ43oj36NJ40j5j21J1J21mj35
8094g6J7J20mj36K2J38j9j41J8J36k3j31L6J32k1j39K4J42m9j17L4J20l6j19M2
8119c0J17n4j20M4J21m2j30N8J23o5j13N5J22o6j11O7J07o5r6M1J23o7j03P5J05
$$ y = [-75, -61, 84, 72, -98, -73, 83, 45, -96, -64, 87, 34, -92, -64, 97, 48, -103, -54, 93, 41, -99, -47, 91, 40, -95, -34, 108, 40, -106, -31, 104, 42, -100, -28, 107, 36, -99, -21, 116, 22, -96, -14, 105, 20, -103, -17, 102, 14, -106, -21, 93, 9, -106, -29, 92, 2, -100, -18, 102, -8, -107, -4, 94, -8, -108, 2, 93, -12, -105, 11, 106, -6, -99, 8, 109, -10, -100, 17, 103, -14, -88, 27, 101, -18, -99, 40, 88, -21, -94, 33, 85, -49, -105, 22, 96, -40, -99, 20, 95, -45, -98, 42, 84, -50, -91, 50, 90, -44, -94, 45, 91, -45, -87, 59, 90, -57, -78, 42, 83, -59, -68, 57, 84, -50, -79, 57, 78, -59, -77, 62, 68, -72, -68, 70, 70, -72, -79, 64, 58, -78, -73, 67, 52, -69, -58, 63, 59, -76, -59, 61, 57, -79, -57, 81, 62, -79, -61, 75, 52, -79, -43, 89, 68, -71, -47, 95, 46, -71, -37, 83, 47, -72, -30, 87, 33, -87, -43, 78, 36, -94, -36, 87, 22, -91, -36, 86, 20, -91, -24, 83, 18, -78, -37, 86, 19, -84, -9, 96]
8144I6q6r4P8R6p3j04P9J04q0j05Q8R0q1r5Q6R1j02p3Q2Q8r4q5R2Q8j01q4R2R0
8172H3r5q2R4Q6j09p0J00P9j06o3R2P7j00p3J14N8j04n7J03
$$ y = [96, 10, -84, -6, 90, 17, -87, -8, 96, 16, -89, -1, 89, 8, -87, -1, 90, -12, -85, -3, 85, -9, -94, -2, 86, -15, -99, -7, 83, -12, -94, 0, 86, -23, -93, 7, 86, -20, -83, 9, 86, -14, -87, 27, 85, -19, -76, 27]
8191B7
$$ Imaginary data points
##PAGE= N=2
##DATA TABLE= (X++(I..I)), XYDATA
0@%%%%%%%%%%%qJ6j6J6k4L2l2M0n6O4p2Q8j05J27j50J76k03K28k65L05l46L94
33B09m48N08n74O44p21Q07r01J006j116J238j374J521j681J858k050K258k489
50a305K743l020L327l671M053m483M970n525O167o919P816q902J0250j1983J4299
65G817j7560K2535l1135M9974j60628J24820L09498l58755j98832K74998K38328
76B61060k85461k35325K79689K54982l19148k16026L08954K02752l04425j87880
86b40828K88733J96521l02363j79416L01166J64371k94505j51600K77384J62201
96B21664k85192j61002L00055J43090l06323j13549K85799J06641k66515j18956
106a94288K67857J29418k89213j14384L00554Q6849k89943o9701K69066P3039
$$ y = [0, 0, 0, 0, 0, 0, 0, 0, 0, 0, 0, 0, -8, 8, -8, 8, -16, 16, -16, 24, -32, 32, -40, 48, -57, 70, -80, 96, -107, 121, -144, 161, -185, 209, -239, 269, -305, 339, -382, 425, -476, 530, -586, 652, -722, 799, -882, 976, -1074, 1184, -1305, 1438, -1582, 1745, -1926, 2127, -2356, 2614, -2911, 3256, -3663, 4153, -4749, 5501, -6482, 7817, -9743, 12792, -18343, 31631, -128997, -4177, 305321, -53434, -252266, 22732, 261060, -24401, -259726, 19963, 274945, -44203, -260229, 48725, 251477, -52948, -240828, 47905, 244426, -57937, -237353, 63813, 228184, -66321, -217921, 59463, 221664, -63528, -224530, 75525, 218615, -87708, -201257, 84542, 191183, -75332, -194288, 73569, 202987, -86226, -200610, 99944, 186793, -103150, -172851, 96215, 169254]
116A69254k60430q1172K66223P9545k74588o7287K74760N4578k68889m6471K63222
127A08745M0124k58577l2937K51580K8216k43543k8725K40676K9844k44903k3491
138a32991K48700R437k43639L308K30756o700k19342K074K17362J125k22962M447
150a08425K27094j6825k23125K7727K12862l1150k03764K8557K01339k6530k04580
161a16820L0448K07505l9962k04514M9031J96373n2788j88677N2495J84855n2493
172F5453j83513N4725J82031n8118j80069O2290J77749o7933j73304P3746J65606
183A18663p6420j56899P4206J52130p0497j53436P1582J56205p9268j53507Q8052
194b9189J43993r0724j34022Q6730J30563q3116j32786Q5551J33891r2134j29809
$$ y = [169254, -91176, -172348, 93875, 173420, -101168, -168455, 106305, 160883, -108006, -154477, 108745, 148869, -109708, -142645, 108935, 137151, -106392, -135117, 105559, 135403, -109500, -132991, 115709, 125146, -118493, -115185, 115571, 108871, -110471, -108397, 108965, 110090, -112872, -108425, 118669, 101844, -121281, -93554, 119308, 88158, -115606, -87049, 114290, 87760, -116820, -86372, 121133, 81171, -123343, -74312, 122061, 69273, -119404, -66909, 117946, 65453, -118060, -63335, 118696, 60578, -119491, -57201, 120548, 52615, -120689, -46943, 118663, 42243, -114656, -40450, 111680, 41183, -112253, -40671, 115534, 36266, -117241, -29189, 114804, 24080, -109942, -23212, 107351, 24235, -108551, -23000, 110891, 18757, -111052]
205a11052R6976J23134r7768j18427R7396J16095r8382j13874J00125J10970j01389
216C804j08473J02770J06587j05540j03434J08721R7932j09614r2114J07571Q9084
227I7294j05336q9260J06501Q9049j10820q4931J14170P7838j13490p1955J10207
238A9267O9799j08230o9636J09258O8232j11540o4774J12960O0562j13167n6801
249h4070J12867N3556j12425n0692J11782M8563j11574m6924J12336M4860j13669
260c5390m1752J14558L7915j14183l4521J12981L2319j12152l0831J12414K8913
271G0271j13335k5688J13425K2039j12290j9162J10818J7173j09836j5413J09425
282D7427J3268j09091j0768J08524Q111j07705n381J06439K984j05012j030J03736
$$ y = [-111052, -14076, 109058, 11290, -107137, -9741, 106354, 7972, -105902, -5777, 105193, 3804, -104669, -1899, 104688, -852, -104286, 4435, 102367, -7247, -99361, 8210, 97294, -8042, -97302, 9199, 98248, -12572, -97503, 16667, 94505, -18985, -90940, 19267, 89066, -19164, -88800, 20458, 88690, -22850, -87624, 25336, 85898, -27269, -84070, 28797, 82353, -30072, -80764, 31018, 79581, -31993, -78917, 33419, 78279, -35390, -77142, 37416, 75331, -38852, -73373, 39608, 71927, -40225, -71056, 41358, 70271, -43064, -68752, 44673, 66712, -45578, -64740, 46078, 63251, -46585, -61998, 47427, 60695, -48396, -59164, 49360, 57471, -50234, -55615, 50824, 53808, -51204, -52234, 51502]
294E1502o60j02849K386J02287m417j01735O736J00965r169r9804J1363R8431
306E5036j3060r7357J4684R6615j6576r5808J8619R4721k0505r3526K2139R2558
318E7540k3869r1669K5864R0489k7843q8961K9525Q7335l0869q5946L2135Q4779
330E8510l3591q3573L5163Q2204l6770q0600L8166P8962l9426p7388M0638P5851
342E8146m1795p4397M2980P2948m4141p1545M5392P0105m6730o8383M7773O6689
354E7042m8550o5259M9324O4130n0449o2876N1851O1156n2969n9246N3663N7484
366E5301n4089n6131N4643N5028n5566n3780N6688N2154n7685n0265N8305M8414
378E3017n8587m6912N8954M5509n9394m4169N9920M2829o0605m1323O1317L9570
$$ y = [51502, 50842, -52007, -49621, 52666, 48249, -53486, -46750, 54215, 45046, -54758, -43395, 55036, 41976, -55381, -40697, 55918, 39342, -56466, -37847, 56874, 36369, -57157, -35018, 57540, 33671, -57998, -32134, 58355, 30512, -58449, -28924, 58411, 27542, -58404, -26269, 58510, 24919, -58654, -23491, 58713, 21943, -58657, -20491, 58471, 19045, -58343, -17705, 58146, 16351, -58046, -15066, 57882, 13741, -57804, -12412, 57693, 10963, -57420, -9647, 57042, 8492, -56767, -7443, 56687, 6238, -56638, -4787, 56369, 3400, -55846, -2183, 55301, 1212, -54919, -276, 54752, -814, -54594, 2094, 54248, -3437, -53702, 4603, 53017, -5570, -52482, 6472, 51981, -7413, -51582, 8338, 51167, -9438, -50761, 10556, 50126]
390E0126o1828l7632O1899L6001o1806l4827O2061L3717o2683l2288O3380L0388
402D6508o3617k8429O3295K6983o2957k6050O3136K5039o3751k3453O4186K1476
414D2366o4061j9690O3620J8344o3293j7269O3256J6127o3397j4811O3551J3345
426C8088o3642j1731O3535J0051o3087q608O2493P551o2035o847O2198N815o2662
439b8881m082O2714K009o1920m13O0741k47o0155O35O0398j677o0748L422O0546
453C2342n359n9608O817N8355p586n7436Q001N7113q607n7247R892N7131j1586
466B2222n6422J3169N5281j4354n3984J4991N2928j5184n2547J5511N2843j6701
478A7753n2978J8731N2035k0482n0284K1201M8725k1119m8047K1038M8264k1776
$$ y = [50126, -11702, -49334, 12565, 48566, -13240, -48067, 13994, 47711, -14972, -47260, 16120, 46508, -17109, -45538, 17757, 44740, -18217, -44267, 18869, 43908, -19843, -43296, 20890, 42366, -21695, -41385, 22235, 40579, -22714, -39983, 23273, 39400, -23997, -38808, 24743, 38088, -25554, -37285, 26250, 36301, -26786, -35394, 27099, 34650, -27385, -34232, 27966, 33781, -28881, -32963, 29751, 31760, -30160, -30573, 30168, 29921, -30234, -29599, 30799, 29122, -31626, -28204, 32342, 26983, -32625, -25808, 32547, 24961, -32475, -24474, 32639, 24032, -33215, -23323, 33808, 22222, -34200, -21031, 34250, 19896, -34088, -19097, 33831, 18647, -33900, -18389, 34454, 17753, -35225, -16494, 35541, 15059, -35225, -14024, 34701, 13582, -34465, -13427, 34837, 13061]
490A3061m8635K3523M8178k5568m6550K6785M4508k6736m3316K6349M3157k6611
502H145m3350K7717M3172k9396m2111L0913M0256l1587l8247L1191L7090l0522
514C271l7082L0692L7402l1965l7078L3834L5522l5178l3103L5152L1110l4084
526a507l0534L3323L1134l4022l1485L5925L0416l7610k8219L8121K5947l7422
538e933k4685L6441K4606l6232k4986L7145K4842l8751k3533M0009K1372m0223
550i928j9178L9277J7920l7880j8162L7498J8993l8838j8692M0826J6567m1662
562a3259j3672M0575J1921l8726j1913L7791J2741l8460j2892M0077J1512m1195
574a5500r083M0836P051l9510o198L8338O194l7922o392L8259O337l9321n419
$$ y = [13061, -35574, -12051, 36127, 10559, -35991, -9206, 35302, 8566, -34750, -8401, 34756, 8145, -35205, -7488, 35684, 6288, -35823, -4910, 35346, 3759, -34488, -3297, 33793, 3271, -33811, -3119, 34283, 2318, -34760, -926, 34596, -582, -33685, 1467, 32577, -1507, -32041, 1282, 32416, -1606, -33091, 2834, 33250, -4360, -32579, 5542, 31489, -5933, -30618, 5823, 30429, -5803, -30789, 6356, 31198, -7553, -31086, 8923, 30295, -9928, -29106, 10171, 28091, -9789, -27951, 9547, 28540, -10298, -28990, 11836, 28403, -13259, -26931, 13644, 25565, -13161, -25074, 12717, 25458, -13002, -25894, 14183, 25695, -15500, -24583, 16253, 23304, -16206, -22404, 15934, 22128, -15794, -22186, 16073, 22410, -16911, -22330]
587b2330M0546L145m0505o31L8774l99l6737m24L6255J547l7634j160L9425j148
601A8724l9757L991L8103n497l5709M908L4709l707l5620L831L6963n497l7216
614b1774P496L6325q866l5036R522L3805r564l2940R120L2970q921l3837R839
627a1861L4545j1884l3973J3867L2026j4482k9992J3583K9284j2347l0319J2494
639i059L1804j4585l1744J7090K9736j8048k7320J7144K6333j5869k7011J5840
651e689K8008j7166k8094J8918K7008k0064k5389K0223K4084j9755k3534J9315
663b135K3652j9417k3988K0195K4016k1482k3331K2716K1814k3154k0055K2426
675A257J9202k1325j9693K1155K0735k2618k0587K4529J8749k5180j6488K4181
$$ y = [-22330, 18216, 21361, -19144, -19775, 18999, 18600, -18137, -18561, 17694, 19241, -18393, -19553, 19872, 18724, -21033, -17042, 21061, 15564, -20145, -15237, 19472, 15765, -19855, -16024, 20939, 15442, -21774, -14278, 22047, 13181, -21855, -12333, 21472, 11908, -21032, -11912, 21058, 12137, -21700, -11861, 22684, 10800, -23173, -9306, 22720, 8238, -21754, -8171, 21113, 8766, -21553, -9059, 22745, 8160, -23584, -6494, 23242, 5194, -22126, -4982, 21351, 5482, -21529, -5689, 22319, 5153, -22941, -4023, 22985, 2921, -22468, -2245, 21839, 2084, -21450, -2135, 21517, 2100, -21888, -1693, 22323, 841, -22490, 226, 22040, -1114, -21169, 1257, 20459, -866, -20559, 596, 21331, -1287, -21874, 2655, 21404, -3776, -20264, 3917]
687C917J5428k2767j5906K2464J6737k3511j6583K4879J5262k5444j3592K4998
699E882J2585k4319j2290K4017J2222k4155j2064K4537J1749k5113j1188K5858
711G721J0028k6176q525K5543P661k4526p941K4316Q552k5327q236K6606O645
724A6341k6811m893K5854M128k4757m408K4537M770k5149m366K5762L293k5764
737a1463k166K5232J437k4572j122K4154R09k3903p36K3834N12k4008RK4236r91
752A1362k4052K047K3273k489k2522K298K2465k249k2938K826K3258l836k3054
765a3611M742K2516n265k1996N481K1720n600k1745N936K1858o560k1779P309
778f994K1423p934k0895Q345K0362q537j9930Q602J9723q738j9742R281J9485
$$ y = [3917, 19345, -3422, -19328, 3136, 19873, -3638, -20221, 4658, 19920, -5524, -19116, 5882, 18467, -5852, -18142, 5875, 18097, -6058, -18122, 6415, 18164, -6949, -18137, 7721, 17749, -8427, -16952, 8591, 16252, -8274, -16215, 8101, 16653, -8674, -16910, 9696, 16341, -10470, -15363, 10491, 14619, -10138, -14546, 9991, 14761, -10388, -14754, 11008, 14301, -11463, -13629, 11603, 13040, -11532, -12654, 11500, 12409, -11494, -12230, 11604, 12116, -11892, -11883, 12353, 11362, -12690, -10643, 12630, 10141, -12381, -10083, 12382, 10133, -12805, -9979, 13279, 9443, -13611, -8869, 13647, 8382, -13614, -8133, 13587, 7987, -13758, -7822, 14036, 7476, -14303, -6994, 14429, 6495, -14400, -6055, 14307, 5770, -14160, -5558, 14165, 5427, -14315, -5034, 14451]
791A4451r949j8801J0271J8092j0249j7747J0291J7598j0608j7336J1020J6886
803A3919j1288j6513J1540J6202j1856j5905J2233J5541j2584j5114J2808J4797
815A3780j2995j4651J3383J4475j3928j4057J4385J3466j4514j3056J4552J2932
827A3772j4858j2707J5319J2157j5568j1488J5434J1151j5357j1046J5593J0763
839A3165j5975j0086J6032R371j5715r054J5473R004j5614q777J5913Q252j6050
852d061p628J5916P216j5797o989J5896O697j6063o298J6190N896j6240n611J6434
866E558N296j6787m694J6922M048j6730l711J6540L721j6785l545J7254K870j7389
880g432k110J7097J674j6754j538J6640J387j6706j038J6656O66j6538l17J6427
$$ y = [14451, 4502, -14299, -4028, 14064, 3815, -13932, -3641, 13957, 3349, -13987, -2967, 13919, 2631, -13882, -2342, 13860, 2004, -13901, -1668, 13873, 1289, -13825, -1017, 13780, 785, -13866, -483, 13992, 64, -13993, 392, 13858, -656, -13712, 840, 13772, -1086, -13793, 1526, 13683, -1885, -13373, 2061, 13212, -2145, -13191, 2402, 13165, -2810, -12896, 3136, 12507, -3208, -12262, 3211, 12215, -3399, -12176, 3737, 11989, -4061, -11689, 4227, 11443, -4354, -11343, 4553, 11250, -4813, -11111, 5079, 10975, -5265, -10876, 5558, 10854, -5933, -10627, 6295, 10343, -6387, -10098, 6442, 10163, -6622, -10167, 7087, 9957, -7432, -9542, 7555, 9229, -7525, -9063, 7577, 8964, -7742, -8780, 7876, 8542, -7996, -8313, 8114]
894H114p8j6276N27J5989q97j5560R83J5334r40j5492J173J5787j862j5729K663
909f264J5156k943j4643K751J4756k797j5158L381J5278m143j4964M575J4623
922I608m752j4568N060J4510n460j4308N752J4064n874j4049O134J4098o688j3852
936a0325P214J3277p372j2684P106J2577o958j2820P329J2854q034j2283Q388
949a731J1541q184j1232P983J1319q165j1323Q587J1053q897j0740R118J0460
962I789r345j0195R567R900r711r673R810R585j0045r543J0457R319j0896q857
976i838J1118Q338j1038q089J0973Q065j1149p976J1477P677j1738p225J1827
989B422O781j1768o437J1652O255j1584o176J1686O034j1916n697J2095N204j2064
$$ y = [8114, 8036, -8240, -7713, 8276, 7379, -8181, -7198, 8136, 7196, -8296, -7123, 8664, 6802, -8927, -6264, 8892, 5949, -8694, -5943, 8813, 6016, -9142, -5761, 9517, 5374, -9590, -5015, 9608, 4856, -9712, -4652, 9858, 4398, -9910, -4158, 9906, 4032, -10017, -3883, 10215, 3527, -10325, -3111, 10166, 2794, -9890, -2784, 9793, 2835, -9985, -2656, 10198, 2164, -10119, -1731, 9810, 1626, -9606, -1623, 9696, 1531, -9792, -1205, 9848, 951, -9789, -671, 9789, 444, -9751, -184, 9716, 5, -9668, 142, 9727, -318, -9861, 596, 9915, -981, -9838, 1280, 9618, -1420, -9509, 1464, 9529, -1620, -9596, 1881, 9558, -2180, -9405, 2422, 9203, -2565, -9002, 2650, 8905, -2679, -8855, 2831, 8865, -3051, -8748, 3347, 8551, -3513]
1003c513m754J1835M575j1705m574J1847M464j2179m063J2359L539j2272l201
1016g642J2134L070j2190k894J2331K583j2374k316J2410K085j2529j755J2612
1029E525J323j2489r71J2258Q45j2127q42J2257O95j2510k11J2528l87j2148O55
1044e599J1711n22j1653M17J1963p90j2070J318J1840j663j1538J797J1380j911
1058D680j1330K080J1274k253j1264K478J1270k798j1203L146J1040l475j0714
1071g069L606J0448l553j0440L584J0637l928j0691M500J0339m843r828M773R608
1085G143m669r648M765R727n061r673N426R459n738r152N914Q812n942q580N881
1100a336Q577n967q637O235Q609o652q354O991P900p075p489O929P377o807p514
$$ y = [-3513, -8267, 3568, 8143, -3562, -8136, 3711, 8175, -4004, -8067, 4292, 7831, -4441, -7642, 4492, 7562, -4628, -7522, 4809, 7392, -4982, -7298, 5112, 7197, -5332, -7087, 5525, 6848, -5641, -6612, 5646, 6491, -5636, -6478, 5779, 6474, -6036, -6247, 6281, 5894, -6254, -5599, 6112, 5590, -6063, -5646, 6317, 5527, -6543, -5225, 6615, 4952, -6586, -4789, 6591, 4680, -6650, -4570, 6704, 4451, -6813, -4335, 6935, 4137, -7066, -3920, 7120, 3645, -7069, -3463, 6985, 3432, -7008, -3424, 7213, 3285, -7406, -2906, 7433, 2590, -7238, -2465, 7143, 2474, -7174, -2409, 7318, 2257, -7416, -1990, 7469, 1731, -7421, -1507, 7305, 1363, -7217, -1336, 7241, 1274, -7363, -1128, 7481, 829, -7525, -534, 7366, 291, -7198, -269, 7108, 301, -7213]
1115g213P027P532p414p288P721O882p815o479P729O235p609o147P565O177p694
1130g91o169Q002N916q268n485Q324N052q176m830P979M860q001m957Q305M853
1145F614q706m442Q886L941q786l627Q606L559q541l605Q714L543q994l293R252
1160C121K876r317k421R142K154q875k162Q828K189q959k106R182J797r280j379
1175e210R148J040q881q93Q624R45q583r89Q741Q26q920m77Q949P1q790K13Q551
1192D365l24q385K97Q436l16q666N66Q888j042q819J446Q572j615q375J661Q321
1208E010j677q412J814Q535k088q583K480Q390k757q087K815P864k779p779K753
1223b501P809k868p830L087P766l377p517L539P186l494p020L406P036l478p050
$$ y = [-7213, -186, 7346, -68, -7356, 365, 7247, -568, -7047, 682, 6917, -692, -6839, 726, 6903, -791, -6960, 1042, 6958, -1310, -6795, 1529, 6581, -1595, -6425, 1554, 6414, -1587, -6544, 1761, 6614, -2092, -6534, 2352, 6293, -2493, -6120, 2486, 6045, -2496, -6101, 2613, 6156, -2838, -6131, 3121, 5997, -3320, -5741, 3401, 5555, -3320, -5482, 3346, 5535, -3424, -5530, 3652, 5449, -3831, -5210, 3938, 4978, -3903, -4796, 3828, 4773, -3810, -4799, 3942, 4768, -4152, -4629, 4320, 4391, -4399, -4186, 4365, 4041, -4344, -4047, 4389, 4073, -4593, -4027, 4861, 3819, -5000, -3554, 5018, 3403, -4972, -3311, 5010, 3333, -5079, -3265, 5270, 3182, -5401, -2921, 5469, 2712, -5375, -2560, 5304, 2525, -5254, -2501, 5308, 2440, -5390, -2303, 5463, 2086, -5431, -1892, 5294, 1800, -5220, -1814, 5222, 1744, -5306]
1238e306L662P026l899o911M150O711m336o458M390O318m388o357M550O370m787
1253G35o332N095O160n333n908N442N684n457n563N445N570n580n533N794N340
1268E559n923n122N972M909n956m743N909M626n887m562N932M467n999m307O031
1283I06M150o068l985O111L791o066l660O053L603o123l559O320L367o459l106
1298d725O504K903o530k784O607K668o713k546O854K353o955k130O959J970o979
1313b544j841P016J699p081j477P030J318o931j272O934J187o975j016O959Q18
1328C824o838p13O744O63o712n60O680M55o649l38O635J94o596q3O615p9o624
1345c382K76O556m22o496N11O515o29o599Q26O661j103o596J280O521j428o447
$$ y = [-5306, -1644, 5382, 1483, -5428, -1278, 5433, 1097, -5361, -971, 5347, 959, -5398, -848, 5522, 735, -5597, -502, 5658, 325, -5583, -141, 5543, 86, -5477, -32, 5538, -42, -5575, 219, 5559, -364, -5486, 486, 5395, -561, -5304, 605, 5231, -656, -5218, 714, 5181, -818, -5125, 906, 5056, -1012, -4997, 1114, 4905, -1161, -4821, 1232, 4835, -1288, -4847, 1473, 4840, -1619, -4725, 1779, 4682, -1848, -4632, 1975, 4643, -2070, -4616, 2238, 4591, -2364, -4494, 2465, 4435, -2544, -4385, 2631, 4330, -2751, -4228, 2802, 4120, -2811, -4083, 2851, 4038, -2937, -3953, 3006, 3824, -3014, -3727, 3017, 3680, -3032, -3592, 3088, 3543, -3106, -3444, 3191, 3385, -3211, -3294, 3321, 3242, -3382, -3106, 3450, 3028, -3468, -2957, 3558, 2929, -3670, -2844, 3817, 2714, -3882, -2602, 3919, 2491, -3956]
1361c956J525O439j651o430J806O385j929o359K094O300k258o181K397O017k431
1376A768n872K364N905k428n961K651N859k837n637K865N467k841n428K896N402
1391D173k997n353L101N289l236n208L355N137l526n007L667M827l703m719L692
1406e08M749l781m822M072M693m349m380M376M164m245m162M265M223m447m147
1421d299M629L961m696l782M712L647m740l543M774L424m772l349M764L328m845
1436g87l263M982L075n073k825N004K663m881k679M894K708n053k592N201K351
1451C725n210k154N162K058n145k002N217J866n224j757N242J701n331j586N456
1466B018J342n468j089N319J036n249j083N360J017n505q08N564N31n470l81N346
$$ y = [-3956, -2431, 4008, 2357, -4073, -2267, 4118, 2189, -4170, -2076, 4224, 1966, -4215, -1818, 4199, 1768, -4104, -1740, 4165, 1737, -4224, -1573, 4286, 1449, -4188, -1323, 4144, 1303, -4125, -1229, 4173, 1176, -4177, -1076, 4213, 977, -4231, -876, 4261, 735, -4272, -605, 4222, 519, -4200, -508, 4241, 460, -4362, -290, 4403, 54, -4326, 50, 4214, -31, -4193, 72, 4295, -152, -4299, 330, 4291, -405, -4187, 525, 4172, -568, -4111, 663, 4087, -685, -4034, 730, 4058, -787, -4050, 932, 4007, -1066, -3891, 1113, 3776, -1105, -3784, 1110, 3818, -1235, -3827, 1374, 3725, -1485, -3639, 1523, 3581, -1564, -3566, 1651, 3517, -1707, -3464, 1778, 3479, -1852, -3438, 2018, 3360, -2108, -3197, 2122, 3158, -2091, -3174, 2186, 3203, -2302, -3110, 2454, 2985, -2485, -2866, 2480]
1482B480L40n304l46N388K29n443l8N383q3n315J48N312k65n293M14N209m98n118
1500b800N13N105n26n177P00N170r05n044J004M918j021m878J039M913j123m962
1516c074J305M924j499m814J613M697j659m663J719M683j853m686K032M619k183
1531A161m541K294M457k359m402K439M356k521m318K633M219k694m135K748M106
1546C443k837m013K894L916k923l799K890L761k900l772L016L693l120l555L164
1561a42L389l113l328L051L386l169l384L371L237l517l005L482K933l480k942
1576c231L590K903l759k768L880K618l946k502M009K407m053k328M133K205m146
1591i88k093M132K046m141k036M246J907m294j718M199J599m055j633M007J699
$$ y = [2480, 2820, -2484, -2830, 2558, 2787, -2656, -2694, 2689, 2606, -2709, -2561, 2751, 2486, -2807, -2393, 2816, 2318, -2800, -2287, 2818, 2292, -2885, -2185, 2985, 2080, -2964, -1960, 2958, 1937, -2941, -1902, 3011, 1888, -3074, -1769, 3155, 1656, -3158, -1545, 3152, 1493, -3170, -1451, 3232, 1379, -3307, -1275, 3344, 1161, -3380, -1086, 3371, 1012, -3390, -951, 3405, 884, -3434, -801, 3418, 724, -3411, -663, 3443, 606, -3407, -513, 3403, 480, -3319, -429, 3332, 432, -3340, -324, 3369, 249, -3306, -142, 3247, 134, -3194, -143, 3243, 74, -3310, 61, 3298, -219, -3224, 258, 3191, -289, -3231, 359, 3262, -497, -3265, 615, 3233, -713, -3215, 794, 3201, -852, -3180, 953, 3158, -988, -3081, 1051, 3097, -1044, -3080, 1166, 3073, -1221, -2939, 1260, 2859, -1196, -2829, 1178, 2877]
1606B877m107j617M157J476m147j347M069J276m001j245L978J250m054j178M148
1621A535J033m215q38M199O98m171o12M217N11m255l88M291K89m364j46M422n0
1638B156m384J88M339k89m287L49M238l87m225L90M274m92m277O52M156p48l966
1655b313O73L885n78l937O05L998p46l951Q53L838q90l758R31L707r46l720J027
1672a322L734j145l712J277L688j416l667J587L611j737l507J815L446j864l490
1687b702J983L525k186l453K361L271k384l171K364L122k346l121K375L116k464
1702B90l033K496K935k478k849K444K786k414k732K390K707k362k699K394K695
1717B570k494k617K584K473k590k366K554K378k631k370K760K295k895k181L023
$$ y = [2877, -1230, -2847, 1310, 2786, -1361, -2708, 1361, 2637, -1364, -2609, 1369, 2619, -1435, -2613, 1535, 2568, -1647, -2485, 1714, 2412, -1759, -2371, 1846, 2357, -1898, -2286, 2005, 2294, -2070, -2216, 2206, 2156, -2228, -2040, 2299, 2010, -2277, -1928, 2310, 1923, -2302, -1912, 2362, 1870, -2407, -1755, 2401, 1653, -2313, -1640, 2245, 1667, -2270, -1665, 2333, 1587, -2364, -1511, 2327, 1437, -2321, -1390, 2317, 1371, -2349, -1322, 2412, 1267, -2445, -1168, 2520, 1104, -2563, -976, 2635, 898, -2609, -794, 2652, 788, -2702, -719, 2806, 620, -2833, -472, 2799, 415, -2756, -392, 2730, 384, -2737, -362, 2754, 290, -2743, -247, 2688, 210, -2639, -195, 2591, 177, -2555, -165, 2542, 180, -2519, -125, 2570, 76, -2541, 43, 2516, -74, -2440, 114, 2492, -139, -2509, 251, 2546, -349, -2530, 493]
1732D93K020l081j908L105J858l176j806L264J703l322j605L357J539l411j457
1747b427L441J341l387j277L331J281l319j268L331J227l338j140L294J093l245
1762a062j065L219J040l177j046L204R94l252q83L247P88l243p37L273O40l308
1778a368n21L329M16l351l31L397K11l439o9L435l9l428J33L426k12l437L02L437
1796A891l90l404M57L378n04l324N19L305n47l288N89L252o28l189O31L144o18
1813A274l157O63L134p25l093P57L078q19l040Q66L022r44l020J043K976j108
1829I07k945J183K931j288k926J443K863j566k766J613K731j643k743J740K726
1844B260j849k654J947K551j967k490J971K466k000k441K022K419k072k339K048
$$ y = [493, 2513, -568, -2476, 629, 2487, -689, -2495, 769, 2472, -850, -2455, 902, 2441, -970, -2427, 1014, 2355, -1032, -2309, 1022, 2303, -1016, -2284, 1047, 2274, -1064, -2204, 1090, 2183, -1062, -2127, 1092, 2132, -1045, -2091, 1113, 2107, -1145, -2028, 1219, 2007, -1236, -1973, 1300, 1940, -1368, -1889, 1440, 1856, -1495, -1826, 1571, 1782, -1657, -1726, 1709, 1670, -1758, -1625, 1801, 1589, -1848, -1546, 1891, 1501, -1903, -1446, 1932, 1428, -1896, -1377, 1928, 1381, -1907, -1318, 1934, 1306, -1883, -1252, 1892, 1274, -1883, -1220, 1914, 1189, -1904, -1147, 1931, 1112, -1928, -1062, 1960, 1016, -2004, -961, 2015, 907, -2038, -855, 2076, 788, -2138, -695, 2168, 602, -2164, -551, 2180, 537, -2206, -466, 2260, 411, -2243, -296, 2255, 288, -2202, -231, 2235, 235, -2206, -184, 2235, 163, -2176, -128]
1859a28K310k059k307K118K241k157k143K119K097k105k102K137K114k253k048
1874b166K354J925k350j838K351J796k377j796K469J748k582j631K651J517k660
1889e89j447K693J393k753j310K781J243k793j182K791J160k867j082K906R73
1904A917k878r04K830Q56k789q82K822Q77k880p98K916O63k854o09K809N96k806
1921a114n84K847N34k870m48K890L47k879k71K865K11k852j59K884P1k879qK886
1939A471n5k917J51K930k78k887L56K808l53k818L72K857m56k871N58K826o45
1956A049k767O82K723o95k700P15K704p54k711Q47K675r07k623R54K592r99k564
1973a779J040K527j062k507J102K515j188k488J267K433j327k371J363K314j387
$$ y = [-128, 2182, 123, -2184, -66, 2175, 18, -2125, -6, 2091, -14, -2116, 21, 2135, -118, -2166, 188, 2113, -237, -2075, 276, 2072, -305, -2101, 368, 2116, -466, -2097, 554, 2071, -589, -2036, 657, 2050, -703, -2013, 768, 2011, -782, -1964, 827, 1987, -880, -1962, 944, 1917, -961, -1865, 965, 1821, -968, -1850, 972, 1849, -1031, -1829, 1087, 1750, -1104, -1713, 1096, 1692, -1114, -1698, 1149, 1683, -1187, -1635, 1255, 1602, -1277, -1548, 1317, 1528, -1324, -1483, 1401, 1472, -1407, -1415, 1471, 1416, -1501, -1350, 1580, 1302, -1585, -1229, 1579, 1226, -1592, -1220, 1637, 1181, -1690, -1132, 1694, 1049, -1718, -1036, 1687, 992, -1708, -993, 1711, 957, -1754, -907, 1768, 861, -1762, -808, 1784, 785, -1779, -739, 1788, 726, -1781, -679, 1836, 648, -1840, -573, 1860, 533, -1838, -475, 1839, 452]
1988D52k294J400K311j479k292J586K204j638k146J657K105j679k067J706K052
2003A878j757k024J819J973j869j903J911J833j899j807J927J769j951j744K000
2018A56J706k045j639K076J584k123j500K118J470k133j453K150J422k209j353
2033a773K228J297k271j229K288J148k254j113K243J116k299j079K375R86k398
2048g35q79K364Q34k353p99K367P60k378p39K439O68k459n80K474M86k437m60
2065a427K443M02k440l60K439L20k456k74K501J70k492q9K434N5k407m5K411K5
2083A210k460O3K462j29k450J99K405k24k388K68K362k97k365L49K368l95k364
2100a386M65K354n44k315O03K258o25k221O12K260o69k284P72K252q67k174Q96
$$ y = [452, -1842, -442, 1869, 390, -1902, -316, 1888, 250, -1896, -239, 1866, 187, -1880, -174, 1878, 121, -1903, -84, 1889, 20, -1883, 28, 1861, -38, -1845, 82, 1851, -100, -1844, 156, 1862, -183, -1822, 254, 1838, -285, -1785, 333, 1803, -330, -1783, 367, 1789, -420, -1773, 455, 1752, -519, -1748, 540, 1688, -566, -1679, 564, 1680, -619, -1698, 677, 1663, -735, -1614, 750, 1584, -769, -1568, 799, 1559, -819, -1558, 881, 1549, -910, -1490, 984, 1470, -967, -1427, 1016, 1418, -1022, -1382, 1057, 1377, -1079, -1353, 1148, 1318, -1174, -1263, 1171, 1226, -1181, -1226, 1185, 1210, -1250, -1187, 1275, 1146, -1304, -1105, 1300, 1076, -1312, -1044, 1318, 1021, -1344, -995, 1373, 978, -1386, -921, 1433, 889, -1426, -823, 1435, 810, -1411, -799, 1461, 792, -1492, -720, 1532, 665, -1509, -613]
2117f13K110r01k107R33K100r84k099J040K092j112k039J148K000j192j964J233
2133c55J914j237j881J238J895j274j902J379J851j449j750J443J697j413j711
2148a555J427J720j491j679J539J640j605j572J613J526j629j480J630J450j650
2163a16j435J697J398j735j352J767J315j824j224J807J171j780j173J802J181
2178A499j871j113J914J036j921r61J901R45j913r15J928Q90j946q65J984Q10
2194A402k010p43K010O75j999o39J990O01j991n98K011N79k044n29K085M20k037
2211h17l81K009L64k009l48K037L09k031k82K043K22k047j66K048J13k006q5K006
2229I79N7k007l8K023mk046R5K030j69k004K07J966k11j984K54J991l18j977L70
$$ y = [-613, 1497, 596, -1511, -578, 1522, 538, -1561, -521, 1571, 459, -1580, -432, 1568, 376, -1588, -355, 1559, 322, -1559, -321, 1574, 300, -1602, -223, 1628, 179, -1571, -128, 1569, 156, -1555, -128, 1592, 101, -1578, -39, 1601, -4, -1576, 37, 1563, -66, -1546, 84, 1534, -116, -1551, 146, 1544, -191, -1543, 224, 1539, -285, -1509, 298, 1469, -311, -1484, 318, 1499, -372, -1485, 429, 1465, -456, -1417, 484, 1429, -484, -1399, 529, 1419, -527, -1392, 592, 1402, -608, -1351, 659, 1334, -665, -1304, 686, 1287, -704, -1302, 709, 1288, -756, -1285, 800, 1220, -817, -1198, 811, 1175, -834, -1182, 855, 1164, -867, -1149, 894, 1116, -931, -1097, 951, 1064, -942, -1027, 979, 1036, -971, -1009, 1014, 1010, -1036, -941, 1089, 920, -1084, -877, 1089, 878, -1106, -852, 1139, 821, -1156, -786]
2248g86J940m04j916M28J918m68j918N11J890n28j888N69J874n95j851O03J857
2265A236o63j805O79J785o81j779P01J782p38j778P97J739q25j711Q42J698q65
2282D14j687R20J658r77j634J019J596j051j573J085J532j118j518J180J477j225
2298I8j428J245J406j278j380J321J335j323j304J321J304j347j283J371J268
2313A326j379j240J390J201j369j194J373J185j403j170J428J136j459j086J460
2328A99J068j474j053J498J014j531r79J551R48j605q67J629P95j639p48J655
2344D61P07j659o71J685O31j728n68J747M98j721m47J710M42j721m29J744L95
2361A076j726l92J721L72j716l65J719L24j703l07J675L23j678l44J715L01j729
$$ y = [-786, 1154, 750, -1166, -738, 1180, 712, -1206, -695, 1195, 667, -1221, -652, 1222, 627, -1224, -621, 1236, 573, -1232, -553, 1232, 551, -1228, -527, 1255, 517, -1261, -464, 1275, 450, -1261, -419, 1279, 414, -1273, -353, 1305, 328, -1306, -287, 1309, 258, -1315, -230, 1302, 184, -1334, -154, 1323, 98, -1330, -85, 1321, 43, -1337, -16, 1319, -4, -1308, 13, 1317, -30, -1313, 58, 1326, -53, -1293, 97, 1298, -71, -1265, 108, 1293, -110, -1280, 148, 1284, -175, -1261, 199, 1267, -207, -1260, 238, 1252, -279, -1258, 293, 1241, -364, -1231, 398, 1193, -446, -1194, 461, 1168, -491, -1162, 523, 1154, -574, -1142, 605, 1103, -618, -1065, 645, 1087, -634, -1063, 681, 1076, -650, -1042, 679, 1051, -665, -1030, 689, 1013, -690, -997, 678, 1001, -677, -1021, 694, 995, -734]
2378g34k48J731J93j723j40J677J40j688j14J737N1j768P1J727j36j695J82J683
2396I46k31j675K80J691l41j667L73J658m16j638M54J634n13j594N05J564m96
2413E34j552M78J585m91j619N38J580n59j538N47J513n28j522N30J537n57j550
2430a074O26J511o63j475P13J429p18j416P67J401q26j378Q79J348r33j309J006
2447a12J250j059j177J056J157j080j143J105J123j146j108J180J078j199j042
2462a117J196J007j164j015J140J049j167j058J189J054j215j005J210R74j180
2477a02r66J171R82j199r85J256R44j296q72J299Q38j319p77J337P26j371o69
2494a003J378O27j404n86J449N17j488m35J480L73j454l61J447L55j456l57J497
$$ y = [-734, -982, 749, 942, -781, -921, 756, 896, -792, -906, 831, 882, -886, -815, 912, 776, -919, -737, 946, 715, -960, -680, 1011, 670, -997, -624, 1034, 618, -1020, -566, 1068, 555, -1039, -534, 1030, 534, -1018, -540, 1045, 554, -1065, -527, 1053, 494, -1044, -497, 1016, 488, -1034, -504, 1033, 476, -1074, -448, 1063, 400, -1075, -362, 1067, 349, -1067, -300, 1101, 275, -1103, -224, 1124, 191, -1118, -112, 1138, 79, -1098, -42, 1115, 35, -1108, -3, 1120, -26, -1134, 46, 1124, -75, -1117, 79, 1086, -78, -1093, 47, 1096, -71, -1129, 60, 1114, -101, -1106, 104, 1078, -102, -1068, 103, 1085, -114, -1099, 157, 1101, -195, -1067, 232, 1070, -249, -1026, 311, 1037, -334, -1003, 375, 1002, -402, -988, 461, 978, -510, -945, 535, 908, -546, -907, 540, 895, -561, -918, 579]
2511E79L17j516k53J477K56j453k77J465K90j480k82J489K72j492k56J503K28
2528H67j485k04J464K11j488j74J485J29j486q9J494L6j521M0J501j05j466J43
2546f48J450j79j456K33J439k69j456L46J440m19j384M24J361m17j364M27J398
2563I26m71j391N10J362n07j327M79J339m85j336M88J340m98j350N36J345n61
2580C99j325N51J316n82j306O13J280o44j258O61J251p14j238P97J168q29j111
2597i71Q39J079q44j084R04J072r53j027R83R82j003r26R92R22j004r06J011R16
2615I82j038r01J053Q80j057q70J058Q54j062q44J060Q28j058q45J072Q39j106
2632a55q08J134P60j136p27J137O94j135o81J160O60j188o30J227N69j226n06
$$ y = [579, 896, -620, -873, 604, 860, -593, -870, 595, 885, -595, -877, 612, 884, -608, -864, 639, 867, -618, -822, 642, 853, -635, -809, 676, 805, -681, -770, 724, 760, -761, -721, 780, 675, -791, -648, 802, 623, -833, -600, 839, 570, -886, -540, 900, 481, -903, -479, 882, 465, -899, -472, 926, 455, -936, -426, 936, 429, -898, -419, 920, 435, -901, -413, 927, 429, -921, -385, 960, 399, -926, -375, 941, 359, -947, -334, 946, 302, -956, -295, 956, 242, -996, -199, 969, 140, -971, -132, 947, 103, -981, -77, 995, 42, -985, -2, 980, -23, -949, 43, 965, -39, -945, 66, 982, -56, -957, 96, 976, -81, -951, 107, 961, -101, -945, 115, 943, -115, -960, 112, 951, -155, -963, 171, 931, -205, -932, 205, 899, -236, -917, 243, 903, -285, -915, 312, 881, -345, -851]
2649h51J222M85j221m48J222M30j243m05J266L63j261l41J280K92j263k86J257
2666D98K77j263k87J280K60j284k49J298K15j300j77J277J75j277j73J289J63
2683G22j298j32J309Q9j301m1J291J6j279jJ266nj290O4J284j01j264J17J257
2702G03j42j265J84J252k13j227K03J247k41j260K75J252l13j237L37J208l40
2719D23j190L19J220l59j217L90J212m16j204M57J175m64j154M76J160n07j141
2736h20N27J127n36j125N58J125o05j085O29J047o30j030O31J043o65j035O84
2753a60J019p10r95P32R60p45r53P44R53p61r43P91R20q03r03Q13Q86q32q69Q56
2773@Q40q64q12Q79Q02q76p93R06P67r41p17R50O90r55o69R49O63r67o49R80O32
$$ y = [-851, 371, 856, -365, -813, 409, 839, -404, -809, 457, 820, -441, -782, 498, 790, -473, -759, 498, 775, -488, -775, 505, 765, -519, -768, 530, 745, -555, -732, 545, 720, -557, -730, 559, 722, -576, -708, 601, 690, -611, -652, 639, 655, -624, -625, 641, 636, -654, -590, 694, 593, -671, -554, 703, 561, -704, -520, 732, 519, -708, -505, 742, 501, -759, -484, 768, 455, -782, -445, 763, 423, -767, -448, 772, 413, -804, -414, 798, 382, -822, -365, 810, 346, -808, -332, 828, 321, -820, -293, 834, 298, -827, -269, 856, 251, -834, -205, 842, 212, -818, -187, 856, 191, -844, -160, 859, 149, -846, -114, 846, 101, -852, -108, 845, 84, -859, -68, 852, 49, -854, -41, 845, 13, -856, 0, 840, -24, -836, 43, 845, -31, -824, 82, 849, -92, -809, 141, 831, -124, -793, 156, 819, -148, -797, 183, 815]
2794H15j009n92J010N69j017n62J008N64j041n38J045N10j050m87J058M74j057
2811c00m79J090M42j093m07J088L92j081l67J087L49j096l25J135K63j119k23
2828f44J087K12j101j84J108J51j098j32J108P9j076r8J100O3j113j9J091Kj076
2847e40j1J088oj091J1J112k7j131P1J098o8j082N6J121q4j118J25J096j34j095
2867f09J46J113j98j079K20J054k44j035K60J040l05j022L24J001l34j011L84
2884b95R81m22r49M29R33m44r28M67R04m70r06M89Q99m91q94N15Q73n06q86N29
2904a72Q92n36r02N57Q94n75q58N57Q63n62q63N89Q56o28q35O37Q18o46p96O62
2924d8P77o86p51O83P26p16o65P01O62p39o33P47O13p76n65P73N34p56n39P69
$$ y = [815, -194, -786, 224, 793, -224, -786, 222, 786, -255, -793, 252, 762, -288, -775, 283, 757, -300, -779, 311, 753, -340, -747, 341, 733, -348, -715, 372, 721, -375, -700, 435, 698, -421, -644, 443, 655, -446, -630, 478, 629, -469, -601, 507, 586, -490, -588, 512, 575, -538, -557, 534, 536, -540, -551, 537, 531, -560, -549, 563, 536, -595, -524, 574, 506, -576, -520, 601, 517, -601, -476, 620, 486, -609, -463, 650, 452, -627, -407, 647, 403, -632, -372, 668, 363, -659, -335, 666, 332, -679, -295, 686, 264, -685, -256, 677, 233, -695, -228, 676, 206, -700, -211, 688, 197, -697, -182, 691, 185, -701, -172, 720, 184, -718, -161, 733, 158, -700, -143, 720, 158, -705, -116, 740, 112, -723, -86, 732, 86, -710, -48, 729, 43, -708, -25, 701, -15, -680, 21, 683, -56, -689, 58, 671, -105, -670, 103, 637, -119, -658, 111]
2944A11N33p69n27P96N13q10m84Q12M64p95m85Q18M77q11m82Q22M80q43m74Q63
2964B09M26q38m25Q44M14q48m22Q71L77q72l44Q70L12q70k79Q69K57q64k20Q53
2984C20J89q54j71Q69J56q62j26Q61Q9q42o5Q22P3q28o5Q35O0q66k6Q63qq40L
3007d13Q32K1q54k4Q83k2q72L1Q51k9q57L9Q68o6q68R3Q50j09q29J14Q30j14q55
3030e00J80Q17k08p82K32P47k14p47K18P59k57p47K91P32l16o91K96O89l03o96
3050e00L12P07l56o71L41O69l43o83L61O74l56o77L78O58l72o63L70O76l88o72
3070e35M15O68m44o27M31O20m32o17M45O05m58n95M95N60m95n23M78N19m88n11
3090d89M95M90n17m60N24M38n20m33N28M10n29m12N34L99n41l91N28M04n41l85
$$ y = [111, 644, -125, -652, 144, 657, -153, -637, 175, 639, -156, -641, 177, 654, -157, -639, 183, 663, -180, -654, 209, 635, -203, -628, 216, 630, -218, -640, 231, 608, -264, -608, 262, 574, -296, -575, 294, 551, -313, -533, 320, 509, -345, -516, 353, 509, -353, -479, 382, 471, -371, -436, 386, 459, -369, -434, 401, 461, -405, -431, 432, 424, -416, -413, 419, 440, -414, -438, 445, 423, -449, -418, 433, 404, -453, -414, 454, 388, -480, -387, 463, 354, -475, -361, 469, 355, -500, -320, 497, 289, -493, -261, 486, 272, -475, -257, 502, 245, -502, -211, 521, 205, -486, -190, 499, 196, -500, -188, 519, 163, -508, -167, 502, 159, -524, -163, 511, 155, -522, -144, 514, 142, -521, -151, 525, 137, -535, -120, 548, 104, -523, -92, 528, 96, -521, -76, 529, 71, -524, -29, 531, 36, -487, -9, 510, 22, -489, 6, 496, -21, -481, 43, 481, -39, -472, 56, 466, -63, -475, 59, 458, -83, -474, 54, 458, -83, -468]
3110d68N61L79n75l58N76L50n68l49N56L87n99l57N98L40o07l05N84L21n96l16
3130d46O11K86o20k69O18K57o23k27O09K12o00k14O08J88o14j66O05J40n86j42
3150c73O02J16n96q7N75R7n88p5N81Q4n93o7O00O9o13l1N95K1n99k1N88M5o09
3173b79m5O38Ro29oO31k1o03PO34l6o32L1O26o7o15Q8O03q2o03J00N91j16n73
3197c49J34N59j36n49J37N57j58n58J98N30k09m97K02M98j85n21K03N28k40n06
3217c62K33N03k44m89K22N15k53n25K80N18k83n10K69N28k94n38L18N19l22m98
3237d13L20M92l17m97L32M90l43m78L81M48l80m17L64M05l57m10L84L90l95l59
3257c60L88L48l89l38L86L36m20l13M11L02m13l08M24L12m35l05M27L19m56k93
$$ y = [-468, 93, 472, -103, -461, 115, 465, -103, -452, 104, 491, -108, -465, 133, 473, -134, -439, 145, 466, -130, -446, 165, 451, -169, -438, 180, 437, -186, -413, 196, 408, -192, -406, 202, 390, -224, -390, 215, 355, -231, -373, 229, 345, -251, -338, 237, 334, -254, -329, 252, 336, -257, -324, 276, 345, -268, -299, 296, 317, -282, -303, 285, 330, -279, -324, 314, 323, -306, -312, 319, 298, -305, -298, 336, 300, -332, -301, 325, 258, -357, -269, 334, 252, -351, -251, 340, 224, -349, -215, 344, 208, -341, -204, 353, 195, -363, -165, 365, 156, -341, -139, 359, 174, -347, -144, 384, 144, -362, -129, 374, 130, -359, -137, 378, 125, -400, -120, 398, 115, -395, -126, 402, 108, -430, -112, 407, 85, -413, -93, 399, 82, -415, -83, 407, 64, -414, -33, 415, 35, -382, -18, 387, 30, -380, 4, 394, -1, -360, 28, 376, -13, -351, 35, 371, -49, -362, 49, 351, -62, -370, 54, 366, -69, -374, 53, 372, -84, -377]
3277c77M52K91m48l08M65L04m78k94N02K81m98k63M88K56m87k41M91K33m89k27
3297c47M95K07m91j87M80J65m67j67M70J30m55j24M47J16m52j13M71Q2m57p5M51
3318A79P9m67o6M78N6m68n5M74O2m92m0M94M0n06k9N03J8m96k7N11J4n09nN15
3342B63j8m98K7M89l2m80L6M67l7m82N8M64p5m43Q4M33r2m28J00M09j03m00J09
3365a49M11j31l99J33L98j29l97J39M02j46l99J50M04j63m10J90M12j96m13J92
3385a01M21k07m15K14L92k06l90K02M02k40l80K30L77k47l58K44L53k46l43K56
3405d2L29k57l24K62L09k65k76K54K79k64k75K76K59k56k63K69K77k88k69L07
3425D2K50k99k52K90K51k90k74L18K54l32k46L33K45l41k47L56K16l45k11L55
$$ y = [-377, 75, 366, -82, -390, 75, 379, -99, -393, 109, 390, -108, -371, 117, 373, -114, -355, 136, 369, -120, -347, 148, 355, -136, -323, 157, 322, -145, -312, 158, 288, -167, -291, 156, 272, -180, -293, 178, 260, -197, -272, 179, 258, -209, -275, 203, 259, -209, -264, 210, 272, -220, -260, 234, 274, -232, -261, 242, 260, -236, -263, 248, 262, -247, -252, 263, 245, -253, -226, 263, 231, -249, -213, 254, 217, -265, -207, 257, 182, -261, -177, 256, 164, -264, -164, 245, 142, -258, -149, 262, 131, -268, -135, 263, 134, -263, -124, 278, 132, -267, -117, 287, 124, -286, -96, 316, 120, -293, -101, 320, 113, -302, -88, 304, 98, -292, -90, 312, 72, -308, -78, 299, 52, -306, -62, 291, 45, -298, -42, 287, 30, -294, -32, 277, 12, -264, -10, 269, 5, -270, 6, 265, 9, -254, 15, 292, 4, -265, 42, 292, -7, -259, 31, 282, -8, -282, 36, 290, -42, -288, 45, 290, -51, -298, 58, 274, -71, -282, 73]
3445G3J96l45k03L54J91l58j71L57J65l54j31L24J44l30j41L26J44l49j10L40
3465A22J07l28j09L39Q6l31q8L37Q0l46q2L48Q5l54r7L64P4l67n9L79N0l71n1
3488b12L62L9l64l8L75K6l56k6L66Rl56%L58ql39OL50k2l36K1L33k9l31L8L18
3513A84k9l39M2L40n4l30N8L29p2l29P5L22q0l25Q1L26q0l33Q2L44j04l19R4L21
3537B04r1l28J12L17j20k99J25L03j21l11J41L05j34l14J51K78j39k83J38K84
3557B18j46k80J67K65j61k68J51K62j59k71J68K79j84k63J68K74j94k56J95K60
3577B25j87k69K12K61k23k48K19K34k10k28K10K45k18k46K31K31k28k15K23K14
3597B33k21k15K17K03k21j96K23J94k31k00K32K10k53j91K56J66k38j85K44J86
$$ y = [73, 269, -76, -279, 75, 266, -92, -263, 94, 259, -95, -226, 98, 242, -88, -229, 97, 241, -108, -218, 122, 229, -99, -208, 131, 217, -114, -202, 135, 215, -131, -213, 135, 220, -134, -231, 133, 207, -160, -219, 160, 210, -161, -212, 150, 189, -175, -213, 162, 188, -168, -194, 172, 181, -175, -175, 183, 175, -164, -158, 192, 170, -166, -145, 188, 159, -172, -134, 184, 155, -184, -142, 198, 144, -186, -128, 201, 129, -200, -125, 197, 117, -208, -127, 199, 119, -214, -132, 212, 108, -211, -117, 204, 113, -215, -103, 214, 94, -205, -80, 223, 102, -209, -68, 237, 103, -211, -60, 218, 79, -204, -66, 218, 72, -208, -41, 224, 63, -205, -54, 208, 49, -222, -54, 225, 41, -222, -54, 220, 26, -230, -35, 225, 38, -231, -19, 242, 19, -229, -10, 224, 14, -214, -4, 241, 23, -223, 8, 239, 11, -204, 19, 233, 12, -203, 14, 217, -4, -200, 23, 217, -14, -214, 18, 228, -25, -216, 40, 206, -32, -217, 27, 213]
3617B13k61j86K89J60k75j69K95J57k78j52K81J51k78j56K98J48k94j40K87J39
3637B29k91j32K86J28l01r9K80J04k78j15K88J01k97r3K87R8l00q2K81Q9k93p6
3659a86K94O9l01n7L12L5k95n3L15N5l21n0L37M0l43j3L32J8l51OL22Ql31OL37
3684A85j9l37K3L15ol25J1L29l0l22L2L12m7k90K9K93l6k90M8L01o9k91P2K82
3708A70o6k76N8K97o6l06R4K95j05k77J00K95j16l04J36L00j39k97J43K71j34
3729G3k77J26L02j46k99J64K69j66k63J58K66j61k67J69K65j82k41J65K32j53
3749C4k40J68K36j60k42J87K22j84k21J89K18j90k15J96K21k05k29K33J93k12
3769ak17K32K05k48j88K55J81k52j89K51J90k70j72K63J70k69j61K59J59k57j53
$$ y = [213, -48, -234, 55, 215, -60, -229, 66, 223, -55, -207, 74, 225, -53, -209, 89, 237, -57, -197, 90, 229, -62, -194, 92, 220, -81, -180, 100, 204, -74, -189, 99, 200, -97, -190, 97, 195, -105, -187, 94, 183, -110, -186, 108, 177, -124, -181, 131, 166, -129, -182, 133, 188, -133, -183, 154, 194, -149, -162, 170, 188, -163, -157, 165, 173, -158, -152, 185, 166, -171, -148, 167, 161, -164, -153, 176, 146, -176, -144, 168, 121, -169, -140, 153, 117, -173, -125, 176, 107, -184, -112, 170, 104, -172, -114, 183, 117, -189, -95, 200, 95, -182, -82, 213, 97, -207, -71, 229, 90, -207, -64, 207, 73, -204, -78, 224, 78, -221, -57, 212, 46, -217, -59, 207, 46, -221, -52, 213, 31, -210, -45, 187, 34, -206, -38, 198, 38, -204, -17, 205, 21, -200, -11, 207, 17, -198, -2, 219, 14, -215, 18, 211, -1, -218, 14, 219, -29, -217, 38, 219, -33, -222, 29, 219, -51, -223, 40, 210, -59, -220, 39, 198, -59, -212]
3790b12K59J61k59j55K78J16k52j22K51J40k60j26K66J15k64j03K57J05k58j17
3810a80K69J03k73q8K77Q2k94p7K80P9k90n9K85N4k92n9K95N1k90n7L10L2l04
3833a46k2K91K7k89k7L07K2l05j0L05qk87J0K84lk84RK96l3k76K5K73l2k77K4
3858a26K92m4k85N0K68l4k81M0K76l9k94M9L01o8k96P9K80p1k81P4K92q3k81R7
3882h5K75r4k83J20K75j26k71J31K62j18k66J22K63j32k64J45K55j49k51J48K43
3903B00j51k38J40K44j61k25J37K43j60k28J58K41j70k31J78K03j61k21J79K16
3923A93j69k14J83K02j83j90J81J89j79j93J82K12k00k11K17J83k09j80K16J79
3943B09k28j77K17J76k33j66K34J55k31j60K49J47k50j49K49J43k43j34K28J53
$$ y = [-212, 47, 208, -51, -206, 72, 188, -64, -186, 65, 205, -55, -181, 85, 200, -64, -167, 90, 195, -63, -180, 89, 192, -81, -169, 108, 190, -104, -181, 99, 178, -112, -171, 114, 168, -124, -183, 112, 163, -127, -184, 126, 158, -146, -168, 123, 150, -139, -166, 141, 163, -142, -152, 153, 145, -142, -132, 152, 149, -135, -126, 170, 137, -139, -114, 159, 127, -150, -126, 166, 122, -163, -113, 155, 121, -160, -120, 156, 117, -177, -128, 173, 105, -191, -112, 168, 97, -184, -110, 182, 99, -182, -85, 190, 96, -187, -67, 208, 82, -189, -58, 204, 86, -180, -58, 205, 73, -191, -46, 209, 60, -191, -43, 200, 49, -189, -49, 195, 34, -191, -54, 189, 29, -199, -41, 200, 30, -201, -23, 180, 19, -202, -23, 193, 24, -190, -7, 195, 12, -178, 3, 192, 13, -180, 2, 214, 14, -197, 20, 203, -6, -186, 30, 209, -19, -196, 21, 197, -36, -202, 32, 187, -44, -204, 45, 192, -58, -207, 42, 185, -58, -192, 36, 189]
3963A89k38j39K36J37k37j28K42J20k26j17K20J26k22j39K45J12k49j06K51R1
3983A68k25j15K49R5k57q9K61Q2k69p6K65N7k67n3K75M4k74m2K89M3k92l1K79
4006A17L7k79k8K87K1k88k2K88K3k81j0K74Nk60j1K60J2k70OK57Kk71lK63Mk73
4032a40J3K60qk69LK85l3k66K8K73m3k82P0K68n1k82P6K75p3k81Q8K73j02k68
4056a86J15K72j14k58R8K69r8k75J05K66j16k58J06K55j02k63J01K64j11k54J03
4077h1K48j04k57J21K46j27k53J45K42j42k34J49K45j57k39J63K34j83k14J88
4097a0K28k04k15K06K15k10k20K24J99k20j98K26J84k24j93K29J93k31j84K22
4117A7J82k23j87K24J89k31j86K23J87k26j81K18J84k19j74K22J77k26j72K42
$$ y = [189, -49, -188, 48, 185, -52, -180, 62, 182, -44, -161, 59, 185, -37, -176, 69, 181, -68, -174, 77, 168, -57, -172, 77, 172, -85, -174, 87, 169, -100, -176, 89, 146, -121, -174, 101, 145, -129, -171, 118, 161, -131, -162, 117, 154, -125, -153, 134, 155, -133, -155, 133, 156, -125, -135, 139, 144, -116, -127, 133, 145, -125, -119, 138, 140, -131, -134, 129, 133, -140, -127, 133, 125, -144, -141, 144, 111, -155, -127, 146, 103, -179, -109, 159, 108, -174, -98, 177, 104, -177, -89, 184, 82, -186, -71, 201, 87, -171, -73, 196, 98, -177, -72, 194, 78, -180, -74, 181, 79, -184, -83, 181, 70, -184, -81, 167, 63, -194, -73, 173, 46, -207, -62, 180, 38, -196, -47, 198, 41, -198, -35, 199, 16, -198, -10, 218, 14, -201, 5, 220, 10, -210, 14, 213, -7, -205, 21, 205, -19, -212, 17, 210, -21, -205, 17, 199, -24, -211, 13, 202, -29, -215, 8, 195, -31, -212, 6, 190, -29, -203, 19, 196, -30, -202, 40]
4137D0J68k58j42K47J48k52j52K73J24k65j14K76J07k85r2K91Q3k92p7K90O0k97
4159a19m7K88M9l00n1L08L3k88m5K79N2k79o7L05M3k92n0L03M8k91l3K80M7l02
4183a29k2K95J7k83l0K99K2l03%K98rk97K0K90l7k92L4K99n6l00O4L06q2l00P4
4208a22L08q9k94Q2L04j10k82R2L00r7k88J07K85r8k83R1K99r8k85R5K83r0k98
4231a88J11K78j05k86J22K61j16k76J40K57j31k73J48K63j49k60J57K56j66k61
4251b18J82K52k01k37J94K38j94k32J97K28j97k32K19K22k20k13K22K14k26k18
4271b20K24K21k28j98K06K13k16k24K40K08k28k14K31K03k34k00K33K00k43k00
4291b26K48J85k52j72K55J68k64j60K73J33k50j32K51J38k66j22K77J19k82j07
$$ y = [40, 208, -50, -192, 55, 203, -49, -201, 72, 196, -69, -183, 93, 200, -85, -177, 114, 197, -95, -172, 118, 178, -119, -166, 122, 171, -129, -180, 128, 161, -127, -172, 107, 159, -120, -187, 118, 161, -131, -181, 122, 170, -121, -154, 126, 173, -129, -151, 144, 161, -122, -152, 147, 169, -134, -134, 164, 155, -142, -122, 168, 131, -161, -127, 172, 116, -184, -120, 186, 104, -196, -122, 186, 97, -197, -115, 189, 79, -203, -111, 189, 92, -196, -89, 196, 98, -185, -94, 205, 107, -178, -83, 200, 110, -188, -77, 201, 96, -190, -68, 193, 77, -199, -59, 198, 67, -206, -58, 205, 56, -204, -47, 209, 43, -218, -36, 216, 15, -222, -28, 210, 16, -216, -19, 209, 12, -220, -1, 221, 1, -212, 10, 224, -2, -220, 4, 225, -3, -201, 5, 218, 2, -222, 18, 226, -2, -216, 15, 218, -16, -216, 17, 217, -26, -226, 22, 207, -45, -217, 38, 206, -58, -218, 55, 188, -62, -194, 57, 195, -71, -193, 84, 203, -79, -186]
4311a86K78J08k71j10K73J11k93r0K97P8k91p2K72Q4k73j01K93P2k84q1K94O6
4333A74k92p4K91O9k95n9L05N1k93m5K83M8k94k2K86K3l10RK89jk81kK90%k95
4358a45J6K93k3k99M4K80m2k64J2K91m4k81N7K69m7k87N6K76n6k87P1K86q2k75
4382a81P5K73o2k87P4K81p7k76R0K67r2k65R1K74r3k67J04K68j18k50J21K59j35
4405G4k59J29K51j26k63J36K57j49k43J56K30j61k30J57K35j72k27J70K12j50
4425B7k37J84K18j81k05J80K08j71k14J78K08j95j92K12J88k07j90K13J88k14
4445bj82K00J86k16j74K11J80k25j72K17J73k28j69K33J56k37j51K34J48k42j41
4466b01K46J41k51j37K58J26k46j20K42J16k37j22K56J14k61j03K76Q2k61q2K60
$$ y = [-186, 92, 200, -71, -181, 92, 203, -90, -180, 117, 195, -96, -168, 104, 188, -85, -186, 107, 179, -105, -186, 108, 174, -118, -192, 99, 168, -127, -186, 119, 170, -123, -168, 115, 163, -131, -153, 133, 156, -154, -145, 144, 143, -138, -140, 150, 150, -145, -129, 164, 141, -158, -114, 166, 124, -140, -128, 163, 119, -162, -105, 164, 117, -170, -114, 162, 106, -181, -110, 176, 94, -181, -106, 167, 105, -182, -108, 173, 96, -180, -90, 177, 85, -180, -89, 185, 92, -175, -71, 197, 79, -171, -50, 209, 74, -185, -56, 195, 69, -194, -58, 199, 50, -193, -37, 193, 32, -198, -41, 194, 22, -205, -35, 177, 27, -210, -26, 192, 11, -194, -14, 194, 23, -191, -13, 195, 0, -192, 20, 208, 1, -189, 24, 212, -2, -184, 16, 202, -14, -188, 23, 203, -22, -194, 23, 196, -32, -201, 32, 188, -49, -200, 34, 182, -60, -201, 45, 186, -65, -202, 56, 182, -64, -184, 58, 174, -63, -185, 71, 185, -76, -179, 97, 179, -82, -164, 96]
4487I6P7k55q2K64P3k71p7K70O9k68n8K65M9k70m9K67N1k74l6K66L8k68m2K73
4511A08L1k63l0K69K4k79%K62J4k68MK71j4k69L3K50j6k61K5K73m2k70M5K79o4
4536A12k69O4K68q2k53P4K37o8k60Q3K53q2k46Q0K49q4k60J04K49j06k48J07K51
4559A73j10k42J21K42j20k45J29K36j32k34J41K42j43k36J56K19j51k21J51K20
4579A96j78j88J47K10j65k03J67J96j75k05J90J90j83k01J92J89k00j68J94J75
4599A80k04j66K07J65j98j60K11J48k05j55K14J51k15j44K15J39k26j11K17J14
4619A77k19j33K28J24k37j14K36J12k40j01K21J05k42q0K35P8k36q1K31Q7k38
4640h7o4K43M5k31o7K57N8k44m2K32M7k50l2K48L9k59qK32J7k35k2K50Lk40k5
$$ y = [96, 173, -82, -164, 100, 173, -98, -175, 95, 164, -104, -162, 103, 152, -118, -167, 100, 151, -123, -159, 107, 145, -123, -165, 108, 139, -124, -154, 115, 139, -140, -140, 122, 136, -132, -128, 143, 129, -140, -107, 143, 127, -134, -109, 164, 122, -148, -103, 176, 112, -157, -93, 175, 93, -160, -86, 151, 83, -177, -94, 159, 77, -169, -89, 160, 76, -184, -80, 169, 63, -185, -78, 173, 63, -179, -58, 184, 64, -181, -52, 184, 52, -182, -41, 201, 58, -178, -22, 197, 46, -175, -24, 196, 18, -170, -23, 187, 22, -181, -14, 182, 7, -198, -8, 182, -1, -202, -10, 179, -21, -189, 5, 180, -24, -190, 17, 182, -16, -176, 35, 183, -22, -177, 37, 188, -27, -171, 44, 183, -43, -154, 63, 177, -42, -175, 53, 177, -60, -174, 62, 174, -66, -167, 54, 159, -83, -163, 72, 150, -86, -167, 64, 151, -87, -151, 92, 137, -94, -161, 96, 154, -90, -132, 100, 147, -103, -135, 113, 152, -107, -115, 117, 134, -101, -123, 127, 130, -110, -135]
4665a35K56J5k52qK35mk38J3K36j4k36K3K26k8k25L3K27l2k36M1K44n7k31O2K20
4690A35m0k37O6K32p8k14O8K14p1k25J06K04q8k16Q6K15r7k08J09J78j01j89J03
4713d8K03j28j86J19J74j04j85J17J82j20j80J25J78j28j78J43J64j22j75J54
4733EJ64j58j55J40J66j50j47J44J47j56j34J51J43j65j30J59J31j81j13J69J19
4754A49j83j11J69J16j78j21J92Q4j66j12K00J04j96q7J82R4j89q8K01P3j84q3
4776a34J86Q5j91o8J83P1j91o6J96O6j94o0J97N6k10l9J92M0j97k8J88K9j90l6
4800a15K00Oj87k3K03Kj94OJ97Rk09K1J84k5j66J0J80oj94K0J97l2j82L3J77k9
4826H3j81K9J96l9j86L3J85m3j92M3J92n5j75M2J86n6j83O2J60n5j68O1J69p2
$$ y = [-135, 121, 136, -116, -124, 111, 107, -131, -118, 118, 104, -132, -109, 117, 89, -136, -103, 124, 92, -144, -103, 141, 84, -147, -85, 135, 95, -142, -76, 156, 78, -136, -68, 146, 75, -150, -44, 160, 72, -144, -58, 157, 60, -148, -39, 139, 38, -151, -48, 155, 27, -159, -40, 134, 30, -155, -38, 144, 24, -156, -31, 147, 19, -159, -16, 148, 26, -149, 5, 169, 11, -144, -4, 162, 12, -135, 9, 156, 0, -134, 17, 160, -5, -135, 24, 155, -26, -139, 30, 149, -34, -145, 24, 140, -38, -159, 33, 117, -49, -161, 39, 143, -53, -140, 42, 136, -53, -141, 60, 133, -51, -134, 52, 137, -54, -122, 61, 132, -59, -125, 71, 137, -57, -117, 80, 136, -74, -113, 79, 119, -78, -106, 82, 111, -79, -115, 85, 91, -96, -119, 84, 86, -108, -102, 95, 104, -105, -84, 100, 75, -91, -81, 99, 93, -101, -81, 116, 84, -98, -65, 112, 83, -98, -69, 127, 88, -98, -65, 120, 77, -115, -72, 120, 65, -110, -68, 118, 62, -121, -59, 101, 46, -122, -61, 108, 36]
4850C6j58P9J59r8j49Q2J64p9j58Q9J56r0j52J04J50j00j54J09J42j00j35R3J45
4873A35j13j49J30J33j18j44J15J38j22j39J21J26j29j22J22J44j36j37J39J34
4893A28j47j14J36J22j41j13J41J19j44j15J47J03j50p7J39R9j55q9J55R3j63
4914b6p9J56O9j61o5J58P3j71p6J69O5j55q3J64O7j62o1J69O2j83n3J79M8j71
4938f7n4J80M9j80m3J81M2j72m2J95K3j77l9J92L0j88k5J86J2j87lJ78Nj81PJ71
4964I3lj74OJ78k2j82J7J72k0j74L2J68k3j78K1J86l1j72K9J82l4j70J9J92k8
4989H4j87M7J71m7j76N8J80o8j63O0J69p9j67R4J48r3j52Q9J53q5j69R5J55q9
$$ y = [36, -122, -43, 116, 18, -131, -49, 115, 36, -122, -33, 123, 33, -119, -15, 135, 35, -119, -10, 132, 32, -103, -10, 135, 22, -127, 3, 136, 18, -126, -11, 127, 5, -134, -13, 113, -16, -138, -16, 128, -8, -145, -6, 128, -19, -133, 3, 125, -16, -129, 12, 131, -13, -128, 19, 122, -28, -105, 34, 133, -22, -111, 44, 137, -26, -105, 51, 120, -41, -106, 52, 125, -46, -122, 47, 112, -43, -126, 38, 105, -57, -118, 51, 113, -70, -123, 56, 104, -67, -121, 59, 108, -72, -115, 66, 108, -64, -106, 89, 112, -65, -104, 88, 118, -70, -95, 91, 103, -84, -87, 91, 96, -85, -78, 93, 90, -84, -78, 100, 78, -104, -87, 85, 65, -109, -77, 91, 68, -110, -89, 97, 66, -106, -77, 105, 71, -99, -80, 112, 84, -103, -56, 115, 68, -108, -50, 130, 62, -101, -41, 128, 49, -118, -24, 124, 31, -121, -32, 121, 36, -133, -38, 117, 28]
$$ [...]
8191I6
##END NTUPLES=NMR FID
##END=
