##TITLE=1H_AM_NVCINN
 D2O
 8 sc, 
 18.12.2023
##JCAMPDX= 6.0         $$ Bruker NMR JCAMP-DX V2.0
##DATA TYPE= NMR FID
##DATA CLASS= NTUPLES
##ORIGIN= UXNMR, Bruker Analytische Messtechnik GmbH
##OWNER= root
$$ XWIN-NMR		Version 3.5
$$ Mon Dec 18 14:09:17 2023 Russian Standard Time (UT+4h)  she@DPX200
##.OBSERVE FREQUENCY= 200.1313
##.OBSERVE NUCLEUS= ^1H
##.DELAY= (6, 6)
##.ACQUISITION MODE= SIMULTANEOUS
##.ACQUISITION SCHEME= undefined
##.AVERAGES= 8
##.DIGITISER RES= 18
##SPECTROMETER/DATA SYSTEM= spect
##.PULSE SEQUENCE= zg30
##.SOLVENT NAME= D2O
##.SHIFT REFERENCE= (INTERNAL, D2O, 0, 15.7039)
##AUDIT TRAIL= $$ (NUMBER, WHEN, WHO, WHERE, WHAT)
$$ ##TITLE= Audit trail, XWIN-NMR		Version 3.5
$$ ##JCAMPDX= 5.01
$$ ##ORIGIN= Bruker BioSpin GmbH
$$ ##OWNER= she
$$ F:/spectra/data/she/nmr/H-F/1/audita.txt
$$ ##AUDIT TRAIL=  $$ (NUMBER, WHEN, WHO, WHERE, WHAT)
(   1,<2023-12-18 14:05:30.07 +0400>,<she>,<DPX200>,
      <created by zg, POWCHK disabled, PULCHK disabled
       configuration hash MD5:
       00 E9 B6 7A A2 85 ED C7 34 08 36 98 17 FE 4E 26
       data hash MD5: 16K
       1A D5 06 85 0B C4 C4 BF AB B3 70 67 48 80 C2 C7>)
$$ ##END=
$$ 
$$ hash MD5
$$ 90 CA 93 40 D2 74 C6 A9 29 D0 FC F3 0E DC 11 5D
##$RELAX= 
##$RELAX= 
##$RELAX= 
##$RELAX= 
##$RELAX= 
##$RELAX= 
$$ Bruker specific parameters
$$ --------------------------
##$DU= <F:/spectra>
##$EXPNO= 1
##$NAME= <H-F>
##$PROCNO= 1
##$TYPE= <nmr>
##$USER= <she>
##$AMP= (0..31)
100 100 100 100 100 100 100 100 100 100 100 100 100 100 100 100 100 100 
100 100 100 100 100 100 100 100 100 100 100 100 100 100 
##$AQSEQ= 0
##$AQ_mod= 1
##$AUNM= <au_zg>
##$AUTOPOS= <>
##$BF1= 200.13
##$BF2= 200.13
##$BF3= 200.13
##$BF4= 200.13
##$BF5= 200.13
##$BF6= 200.13
##$BF7= 200.13
##$BF8= 200.13
##$BYTORDA= 1
##$CFDGTYP= 0
##$CFRGTYP= 5
##$CHEMSTR= <none>
##$CNST= (0..31)
1 1 145 1 1 1 1 1 1 1 1 1 1 1 1 1 1 1 1 1 1 1 1 1 1 1 1 1 1 1 1 1 
##$CPDPRG= <>
##$CPDPRG1= <>
##$CPDPRG2= <>
##$CPDPRG3= <>
##$CPDPRG4= <mlev>
##$CPDPRG5= <mlev>
##$CPDPRG6= <mlev>
##$CPDPRG7= <mlev>
##$CPDPRG8= <mlev>
##$CPDPRGB= <>
##$CPDPRGT= <>
##$D= (0..31)
0 1.2 0 0 0 0 0 0 0 0.06 0 0.03 0 0 0 0 0.0002 0 0 0 0 0 0 0 0 0 0 0 0 
0 0 0 
##$DATE= 1702893929
##$DBL= (0..7)
120 120 120 120 120 120 120 120 
##$DBP= (0..7)
150 150 150 150 150 150 150 150 
##$DBP07= 0
##$DBPNAM0= <>
##$DBPNAM1= <>
##$DBPNAM2= <>
##$DBPNAM3= <>
##$DBPNAM4= <>
##$DBPNAM5= <>
##$DBPNAM6= <>
##$DBPNAM7= <>
##$DBPOAL= (0..7)
0.5 0.5 0.5 0.5 0.5 0.5 0.5 0.5 
##$DBPOFFS= (0..7)
0 0 0 0 0 0 0 0 
##$DE= 6
##$DECBNUC= <off>
##$DECIM= 32
##$DECNUC= <off>
##$DECSTAT= 4
##$DIGMOD= 1
##$DIGTYP= 9
##$DL= (0..7)
0 120 120 120 120 120 120 120 
##$DP= (0..7)
150 150 150 150 150 150 150 150 
##$DP07= 0
##$DPNAME0= <>
##$DPNAME1= <>
##$DPNAME2= <>
##$DPNAME3= <>
##$DPNAME4= <>
##$DPNAME5= <>
##$DPNAME6= <>
##$DPNAME7= <>
##$DPOAL= (0..7)
0.5 0.5 0.5 0.5 0.5 0.5 0.5 0.5 
##$DPOFFS= (0..7)
0 0 0 0 0 0 0 0 
##$DQDMODE= 0
##$DR= 18
##$DS= 0
##$DSLIST= <SSSSSSSSSSSSSSS>
##$DSPFIRM= 0
$$ [...]
##$SUBNAM2= <"">
##$SUBNAM3= <"">
##$SUBNAM4= <"">
##$SUBNAM5= <"">
##$SUBNAM6= <"">
##$SUBNAM7= <"">
##$SUBNAM8= <"">
##$SUBNAM9= <"">
##$SW= 18.0517328524113
##$SWIBOX= (0..15)
0 0 2 0 0 0 0 0 0 0 0 0 0 0 0 0 
##$SW_h= 3612.71676300578
##$TD= 16384
##$TD0= 1
##$TE= 0
##$TE2= 300
##$TE3= 300
##$TEG= 300
##$TL= (0..7)
0 120 120 120 120 120 120 120 
##$TP= (0..7)
150 150 150 150 150 150 150 150 
##$TP07= 0
##$TPNAME0= <>
##$TPNAME1= <>
##$TPNAME2= <>
##$TPNAME3= <>
##$TPNAME4= <>
##$TPNAME5= <>
##$TPNAME6= <>
##$TPNAME7= <>
##$TPOAL= (0..7)
0.5 0.5 0.5 0.5 0.5 0.5 0.5 0.5 
##$TPOFFS= (0..7)
0 0 0 0 0 0 0 0 
##$TUNHIN= 0
##$TUNHOUT= 0
##$TUNXOUT= 0
##$USERA1= <user>
##$USERA2= <user>
##$USERA3= <user>
##$USERA4= <user>
##$USERA5= <user>
##$V9= 5
##$VALIST= <valist>
##$VCLIST= <CCCCCCCCCCCCCCC>
##$VD= 0
##$VDLIST= <DDDDDDDDDDDDDDD>
##$VPLIST= <PPPPPPPPPPPPPPP>
##$VTLIST= <TTTTTTTTTTTTTTT>
##$WBST= 1024
##$WBSW= 4
##$XGAIN= (0..3)
0 0 0 0 
##$XL= 0
##$YL= 0
##$YMAX_a= 123881
##$YMIN_a= -107267
##$ZGOPTNS= <>
##$ZL1= 120
##$ZL2= 120
##$ZL3= 120
##$ZL4= 120
##$ABSF1= 10
##$ABSF2= 0
##$ABSG= 5
##$ABSL= 3
##$ALPHA= 0
##$AQORDER= 0
##$ASSFAC= 0
##$ASSFACI= 0
##$ASSFACX= 0
##$ASSWID= 0
##$AUNMP= <proc_1d>
##$AZFE= 0.1
##$AZFW= 0.1
##$BCFW= 1
##$BC_mod= 2
##$BYTORDP= 1
##$COROFFS= 0
##$CY= 11.3945322036743
##$DATMOD= 1
##$DC= 2
##$DFILT= <>
##$DTYPP= 0
##$F1P= 15.7292609196834
##$F2P= 12.9074282941183
##$FCOR= 0.5
##$FTSIZE= 0
##$FT_mod= 4
##$GAMMA= 1
##$GB= 0.15
##$INTBC= 1
##$INTSCL= 1
##$ISEN= 128
##$LB= 0.24
##$LEV0= 0
##$LPBIN= 0
##$MAXI= 10000
##$MC2= 0
##$MEAN= 0
##$ME_mod= 0
##$MI= 1.114404
##$NCOEF= 0
##$NC_proc= 0
##$NLEV= 6
##$NOISF1= 3.799351
##$NOISF2= 2.8
##$NSP= 1
##$NTH_PI= 0
##$NZP= 0
##$OFFSET= 15.70392
##$PC= 1
##$PHC0= -24751.58
##$PHC1= 8.652719
##$PH_mod= 1
##$PKNL= yes
##$PPARMOD= 0
##$PSCAL= 0
##$PSIGN= 0
##$REVERSE= no
##$SF= 200.130013532006
##$SI= 16384
##$SIGF1= 3
##$SIGF2= 2
##$SINO= 400
##$SIOLD= 16384
##$SREGLST= <1H.CDCl3>
##$SSB= 0
##$STSI= 0
##$STSR= 0
##$SW_p= 3612.71676300578
##$SYMM= 0
##$S_DEV= 0
##$TDeff= 0
##$TDoff= 0
##$TI= <>
##$TILT= no
##$TM1= 0
##$TM2= 0
##$TOPLEV= 0
##$USERP1= <user>
##$USERP2= <user>
##$USERP3= <user>
##$USERP4= <user>
##$USERP5= <user>
##$WDW= 1
##$XDIM= 8192
##$YMAX_p= 0
##$YMIN_p= 0
$$ End of Bruker specific parameters
$$ ---------------------------------
##NTUPLES= NMR FID
##VAR_NAME=  TIME,          FID/REAL,        FID/IMAG
##SYMBOL=    X,             R,               I
##VAR_TYPE=  INDEPENDENT,   DEPENDENT,       DEPENDENT
##VAR_FORM=  AFFN,          ASDF,            ASDF
##VAR_DIM=   8192,          8192,            8192
##UNITS=     SECONDS,       ARBITRARY UNITS, ARBITRARY UNITS
##FACTOR=    0.0002768,     1,               1
##FIRST=     0,             0,               0
##LAST=      2.2672688,     0,               0
##MIN=       0,             -107267,         0
##MAX=       2.2672688,     123881,          0
$$ Real data points
##PAGE= N=1
##DATA TABLE= (X++(R..R)), XYDATA
$$ [...]
1413A654L49l53r39j160r45l64L52Q91J173Q98L58l19q53j088q67n07J39P46J043
$$ 1654 2003 1650 711 -449 -1394 -1758 -1406 -515 658 1556 1914 1595 742 -346 -1213 -1720 -1581 -835 208
1432B08J013N28m5p18j148j061n73N8O71J112J008N48k8o10j064r90o04o8O37
$$ 208 1221 1749 1704 986 -162 -1223 -1796 -1738 -1067 45 1053 1601 1573 963 -101 -1091 -1695 -1763 -1126
1451a126R29J063P08P0n28r03j033p97j02N24R56J018P80J57m29r83j002o85k47
$$ -1126 -197 866 1574 1644 1116 213 -820 -1617 -1719 -1195 -239 779 1559 1716 1287 304 -698 -1383 -1630
1470a630M13Q81R27Q08K38k83p69j045q34l75K80Q12J020Q48M03l33p22j026r00
$$ -1630 -1217 -336 591 1399 1637 1354 585 -460 -1294 -1669 -1389 -577 443 1291 1694 1361 639 -387 -1287
1489a287l21K17P47R67Q95L97j86o55r44r26m41J17O32R71Q98N26o2n75r91r67
$$ -1287 -1608 -1391 -644 323 1218 1615 1429 774 -170 -1096 -1537 -1420 -788 183 1081 1607 1545 970 -21 -988
1509i88n53jO03R50R08O02j1n95q73r19n15j14M23Q23Q96O68K09m35q73r22p94
$$ -988 -1541 -1542 -939 11 919 1521 1510 915 42 -877 -1392 -1506 -1083 -260 636 1304 1513 1078 205 -717 -1511
1530a511j24M17Q45R59P52J55l49p89r77o34k53L05P55R22P52K64j84p25r79p57
$$ -1511 -1635 -1218 -373 586 1338 1493 1144 355 -622 -1256 -1509 -1204 -449 473 1225 1489 1305 580 -399 -1156
1550a156l17K62P07R22Q07L67k08o65r99p65m36J72O54Q78P75M83j10n83q78q24
$$ -1156 -1473 -1211 -504 418 1225 1592 1384 719 -280 -1045 -1481 -1309 -655 223 998 1481 1371 788 -90 -914
1570i14m92J5N35R06Q54N07M1n95r06r03m89k0M87Q39Q12O16P3m34q19q96n82
$$ -914 -1406 -1391 -856 50 904 1411 1452 857 -49 -952 -1441 -1461 -974 -135 677 1293 1366 932 113 -783 -1365
1591a365j14M00P87Q51O40J81l40p21r41o56k07L19Q12Q80O68K32k35p45q95o21
$$ -1365 -1479 -1079 -292 559 1199 1380 1040 319 -622 -1278 -1485 -1166 -354 526 1194 1426 1191 446 -449 -1070
1611a070k74K30O50Q52P63L59k22o20q65p59l90J32O37Q94P49M34j92n85q24p94
$$ -1070 -1344 -1114 -464 388 1151 1510 1288 668 -197 -956 -1346 -1214 -577 317 1066 1500 1308 723 -101 -895
1631h95l71pO01P55P52N12Qn58p84p95n67m1M65Q35Q35N21R3m82p64q58n57j09
$$ -895 -1266 -1273 -672 83 835 1347 1355 797 13 -782 -1349 -1390 -925 -90 745 1266 1359 877 113 -745 -1302 -1411
1653a411L84P59Q61N75J47l84p17p87o54j87K94O95Q89O98J77k76n97r26o75k89
$$ -1411 -1027 -268 593 1168 1315 931 214 -573 -1227 -1414 -1120 -425 464 1162 1339 1063 466 -460 -1135 -1424
1673a424K55O85Q30O89K42j22o13q50o66l74J21O16Q43O68M78j40n64p51p32m57
$$ -1424 -1169 -484 346 1035 1277 1155 542 -308 -974 -1348 -1227 -611 232 900 1378 1238 674 -77 -809 -1266
1693a266N7N16Q22P26M86m4n17p54p61m78n2M55P87P98M06J14l97p15q39m91j26
$$ -1266 -1209 -693 129 855 1341 1297 780 26 -735 -1213 -1265 -810 -23 775 1181 1295 898 183 -656 -1147 -1273
1714a273L90O66Q26N42J07l33p09p36o15j87L17O74P94N39J86k20n70q45o29k13
$$ -1273 -883 -217 609 1151 1258 925 216 -520 -1135 -1322 -1005 -331 463 1002 1188 968 398 -447 -1076 -1289
1734a289J56O78P56O54L15j67o15p75o86k89J22N68Q57O85K83j24n26q10o32l65
$$ -1289 -1133 -455 301 955 1270 1103 488 -287 -973 -1262 -1140 -572 285 970 1253 1129 603 -207 -839 -1204
1754a204N3N67P22O97M27m5n20o99p58l93l2M47P26P40M54P4m83o81p07n36k0
$$ -1204 -1151 -584 138 835 1262 1217 697 -2 -760 -1153 -1185 -738 -12 728 1182 1256 773 92 -615 -1151 -1171
1775a171L34P24P30N66N7l40p28p41n16j60L66O22O53O96J71k93o15q20n96j90
$$ -1171 -837 -113 617 1183 1240 900 172 -569 -1085 -1245 -879 -257 396 1092 1263 970 355 -465 -1061 -1251
1795a251L25N76P80N75K29k54o11p41n97k36J82M96P47O69K70j78m70o96p42l21
$$ -1251 -926 -350 430 1005 1234 980 369 -372 -969 -1205 -1023 -527 220 889 1159 981 511 -185 -927 -1248
1815a248J37N29P12O11M31j11m11p57o64m11P4L87P60P01L57Q0m49o75o73m52
$$ -1248 -1111 -582 130 741 1172 1061 650 -107 -771 -1182 -1108 -721 39 740 1097 1177 728 53 -620 -1072
1835a072p1M65O05P06N37J5m30o02p46m33q0K37O78P61M40R7l17n98o28m97k39
$$ -1072 -1143 -678 -73 633 1170 1185 755 153 -593 -1026 -1106 -869 -191 570 1010 1107 790 192 -436 -933 -1172
1856a172K10N88P09O09J13j53n23p83n09k83J81N82P27N52K46j43n78n59o15l22
$$ -1172 -962 -374 335 944 1057 904 381 -402 -911 -1194 -1013 -431 296 848 1094 951 373 -186 -801 -1123
1876a123J26M55O97O01L49o9m03o61o65m01M4M11O84P16L60m3m45n78o83l91j8
$$ -1123 -997 -542 155 756 1105 1036 633 -28 -693 -1094 -1050 -639 45 761 1121 1078 633 55 -628 -1019 -1037
1897a037L02O48O23M37J28l99n59o40n16r0K43O86O64M43J30k45n78o68n24n8
$$ -1037 -735 -87 536 973 1101 702 143 -497 -1013 -1103 -860 -174 490 933 1063 818 240 -428 -952 -1010
1917a010J43N94O81M60K11k46m91o25n67k33J78M62O74N65L37k00n27o05n82k70
$$ -1010 -867 -273 408 868 1079 833 342 -283 -850 -1083 -905 -443 231 796 1133 933 406 -199 -781 -1051
1937a051N7N21N84N43L42p0l95o67n47l01n2L90O45N99M90p7l52p02n40m15lL54
$$ -1051 -994 -473 111 654 996 926 531 -136 -683 -984 -1036 -646 -1 598 1088 1011 659 -43 -583 -998 -1001 -647
1959f47N86O13L77J12l20n59n81m88j00K77N63N45N01J48k59n51n99m46k27K43
$$ -647 -61 552 929 1041 721 162 -419 -907 -1007 -730 -167 378 879 1027 768 217 -382 -828 -1055 -812
1979h12M64O99M88K62k68n17n66n28k12J24M19O42N36K82q0m84o36n57k68J05
$$ -812 -348 351 839 1101 833 316 -250 -778 -990 -866 -447 195 731 1013 933 449 -187 -744 -1012 -907
1999i07L84O11O00K78j6m66n53n78l69N8M16N75N30L67j7k75o03n74l56j19L52
$$ -907 -523 88 688 966 950 484 -69 -647 -1016 -958 -542 33 563 930 913 638 35 -539 -895 -1014 -662
2020f62N58N69L86J47k72n26o57m52p4K64M74O59M57J22k35m66o45m63r8Q6N31
$$ -662 -104 465 851 998 726 200 -457 -909 -983 -719 -245 414 871 993 758 292 -353 -816 -914 -828 -297
2041b97N82N53J58j28m68o24n23k47Q7N04N97N06K57p7m32n72n63k67L1L30O68
$$ -297 285 838 996 868 400 -224 -747 -994 -907 -403 194 700 957 880 448 -124 -687 -954 -923 -593 75
2062G5N09L36J5l65n99o10l07J8L67N29O01L66N4l94n14o00l93p5L40N03N46M62
$$ 75 584 920 935 570 -29 -639 -946 -928 -561 -32 569 935 989 595 81 -519 -912 -987 -647 -144 402 864
2084H64P5k44m61n81n05r1K02N12N89M47J86j97m80n88n02j41Q8N30N52M32K16
$$ 864 939 695 234 -347 -852 -943 -741 -229 360 807 993 796 316 -272 -774 -915 -827 -297 255 687 903
2105I03o2n28n59m31k59J05L86N97M69L31j33l28o04m93k97J1L79N34N25K93M6
$$ 903 841 313 -246 -677 -936 -831 -445 152 621 952 819 491 -113 -606 -903 -892 -513 21 546 839 885
2126H85l28n19m94m04j2L04N17M90L52J28k86n36m87m56q1K55N26N29L89J20k54
$$ 885 557 38 -456 -860 -872 -568 -51 439 791 919 633 97 -390 -846 -927 -672 -146 383 772 892 638
2147F38m68n23m22n6J46M92N11M25J58j97m62n09m21j96J48L71N92M60J99p4m41
$$ 638 170 -353 -775 -831 -685 -193 318 743 901 704 242 -267 -688 -884 -736 -365 227 687 886 812 371
2168C71n49m26k34J18L45N37M79J94k5l75n41m76k34K7L38M86M83K84K8k99n36
$$ 371 -178 -604 -838 -720 -375 162 641 835 810 435 -106 -582 -816 -789 -451 35 518 802 830 531 -5
2189em73k55j27L48M73M87L40lj81n27n13l54o7K89M45M80M11P6k60m05m66m38
$$ -5 -478 -733 -860 -512 -39 448 788 785 604 77 -436 -790 -857 -568 -123 357 768 844 584 179 -287 -725
2211g25j19K15M22M83L95J74j38m70n22l89j63J53L88N18L53L02k23l40m86m25
$$ -725 -844 -629 -207 276 671 845 707 237 -285 -674 -837 -684 -296 222 575 877 654 314 -172 -597
2231e97j85O4L52N13L72K52m2l37m65m41k69N4L27M57M93J72jk75m67l94l55M2
$$ -597 -782 -718 -366 147 519 771 729 392 -73 -514 -783 -729 -402 55 548 720 719 444 -23 -417 -772 -730
2253g30K45M58M40K72O3k49l74n26k52q3J97M58M10K96J44k19l74m99l28p5J50
$$ -730 -485 -27 413 685 748 499 125 -401 -653 -736 -539 -81 329 625 769 550 176 -323 -651 -726 -576
2274e76M25M35L41J18j59l76m04l49j80J10M28M17L58J48j41l30m06m20j59J17
$$ -576 -151 284 625 743 584 208 -196 -545 -725 -615 -187 230 588 736 595 265 -141 -561 -720 -603
2294f03K83M36M22J67m5l28m53l23k30M9K75M14L86K70l5k80m27m45j83j3K32
$$ -603 -320 116 538 705 660 332 -121 -444 -674 -625 -350 64 450 720 685 405 -22 -467 -650 -663 -431
2315d31M02M58K03M0k10l97m44k60J3J73L13M48L11R9k18l93l89k87q8J91L15
$$ -431 -29 429 632 672 462 65 -379 -639 -626 -453 -140 308 619 718 500 107 -282 -569 -657 -466 -151
2336a51M42L16L2j46l08m43k75q5J27K91L97L08J75r4l26m48m03j20J33K82M34
$$ -151 291 607 639 493 185 -258 -533 -618 -491 -200 197 505 680 586 260 -188 -591 -711 -578 -296 138
2357A38L64J32ql45m40l03j22NK84L64M06J84p9k24m01l92k21O4K56L43L88K31
$$ 138 502 634 626 281 -159 -462 -584 -579 -295 69 475 659 580 356 -45 -437 -658 -594 -338 5 393 624
2379F24Mj96m07l98k02J0J57M14L81K10Rk03l67l84k56q7K74L56L32L41K3j90
$$ 624 628 432 25 -373 -575 -565 -408 6 387 597 606 403 36 -348 -604 -691 -417 -61 271 612 635 445
2401D45l85m09k51q9J88L52M30K89J40k10l36m10k73j48J39K94L88L99J23j23
$$ 445 60 -349 -600 -689 -501 -149 281 570 710 500 164 -246 -519 -667 -528 -234 154 553 676 553
2421E53k64m30k89j80J14K42L88L65J64o5l07l96l43j34m1L19L30M21J52l5k30
$$ 553 289 -141 -430 -610 -496 -254 134 499 663 598 291 -105 -448 -582 -623 -304 26 447 599 564 334
2442C34l34l71k74Q7J50M19L60K53J2k55l80l58k51j0K24L61L73K55L0j65l10
$$ 334 0 -371 -645 -558 -408 11 371 624 636 381 1 -357 -608 -618 -394 -33 340 595 625 460 150
2463A50m60k70j23K39L23M72K18J21j73l63l65k98r8Q8L23L39L82J15p4k43m61
$$ 150 -310 -580 -703 -464 -141 331 549 670 497 134 -231 -529 -627 -539 -216 123 505 620 546 303 -158
2484a58l56j02O7K39M49K81K08ml05m32l30k20N8L14L46M08J93l7k52m27l34k05
$$ -158 -514 -616 -549 -310 139 420 628 624 319 -113 -443 -663 -605 -291 55 463 656 619 367 -60 -394 -599
2506e99q1K55M37L51K19M4j73m47l40l12mJ72L94L95K76O1j63l61m42k40o0J36
$$ -599 -680 -425 12 363 582 626 453 6 -334 -646 -650 -478 -84 311 587 648 485 124 -318 -558 -618 -482
2528d82L19M44K44J10p4l56m23l84o5O7L28M45L76J09j36k51l94l93j64J00L21
$$ -482 -163 281 525 635 561 205 -218 -602 -667 -600 -272 173 549 658 522 271 -123 -516 -680 -580 -259
2549b59L36L81J83o3k43m20m00k02N9K63M56L14K03K5k52m55k79k31q6K59L99
$$ -259 77 458 641 578 335 -85 -485 -687 -628 -365 91 405 608 633 381 -74 -353 -584 -670 -411 -12
2570a2M04K32j9j53l74m20k35q5J95L66M22K47J54k15l97l87k93j14J35L23N32
$$ -12 392 624 605 452 78 -342 -577 -662 -467 -101 321 568 722 507 110 -277 -570 -684 -549 -226 306
2591C06K62J27j25l37m57l00j04N9L40L69M06J81j63k66m57l01j82O0L10L61L71
$$ 306 568 695 570 233 -224 -524 -628 -569 -229 140 546 727 564 298 -159 -460 -642 -582 -272 89 460
2612D60J75l3k78m30l48j72l4L13L51M00K48l1k39m08l91k65M6K31L59M66J66
$$ 460 635 602 324 -106 -454 -626 -660 -347 4 404 652 621 382 -26 -417 -682 -636 -405 -46 420 586
2633E86J01k41l55m48k49k3J18M05M05L42K7j61l72m40k86k4Q3L27M26L08J68
$$ 586 687 446 91 -357 -606 -629 -511 -106 299 641 668 507 135 -305 -591 -615 -532 -205 221 529 697
2654F97j17m03l50l89j37J73L25L72L68J57j30l40l37l88k21J01L22L89L62J80
$$ 697 580 177 -173 -562 -699 -526 -201 171 539 696 566 226 -111 -499 -720 -619 -297 92 454 634
2674F34m5k96l54m01k27P2K39L86M14K65n0k43m24m14k00l1K85L42L98K82k1k12
$$ 634 589 293 -61 -462 -689 -617 -378 8 422 687 637 394 -30 -444 -644 -675 -390 -48 350 632 611 399
2696C99l59l34l65l6K41L22L99L07M1j19l26m63l42j7J05L91M62K55J36j82l46
$$ 399 40 -294 -659 -695 -454 -132 267 574 615 496 170 -293 -635 -652 -547 -156 306 561 697 515 169
2717A69l74l02j67J29L11M64L04J19j25k79l73l95j83R7L42L80L88J62q3k58m13
$$ 169 -205 -507 -674 -545 -234 230 534 653 528 249 -124 -519 -702 -605 -263 117 505 667 584 326 -87
2738h7l78j55K5K51L94L51K72l5k70l46m22k33j6K36M27L05L24J0k31m29l66k78
$$ -87 -465 -620 -595 -344 50 401 673 638 368 22 -400 -633 -649 -413 14 319 643 653 422 -7 -373 -651
2760f51k1K41L77M23J88O0j39l58m53k23j52K11L15M08L19Q4n0m16m19k99q6P7
$$ -651 -672 -431 -54 369 557 617 478 120 -333 -556 -708 -497 -182 226 545 629 579 163 -256 -555 -641 -564
2782e64L79M40K08J92j52l14l41l18j96Q4K99L93L47J65j4k62m77k90j79M7K06
$$ -564 -185 255 463 655 503 189 -152 -470 -666 -582 -283 110 457 622 608 346 -131 -421 -600 -553 -347
2803c47L67M02J72Rk69l06m62k02j1K48L71L97J41Q9k26l16m03l05N2J83L81L60
$$ -347 20 422 594 603 334 28 -434 -636 -647 -399 -28 369 510 599 373 57 -346 -651 -599 -416 -35 325
2825C25K25L2j20m06l25k74m1J44L37L40K68P1j20k85l36l30j32J09L47L03L80
$$ 325 550 582 462 56 -269 -543 -584 -440 -103 237 505 576 456 171 -165 -495 -627 -518 -171 132 512
2846E12J36j24k86m03l07j40P3K83L88L28J10J4k84l79l55j14rK28L55M17J95
$$ 512 648 524 238 -165 -472 -612 -539 -256 132 460 570 584 300 -79 -434 -548 -557 -329 26 443 638
2867F38n0k06m17l87k40M7K62L19M04J94j0k17k76m49k45M9K12K75L69K78K9j07
$$ 638 588 382 -35 -422 -662 -615 -353 -34 370 564 554 337 61 -388 -633 -584 -372 -97 272 550 579 472
2889D72l69l61l08q2K22K99L55K83P2j08l38l56k55o0K3K97M07K71J42q8k49l58
$$ 472 103 -258 -566 -648 -426 -127 228 511 583 475 137 -219 -474 -534 -511 -214 193 464 606 518 269 -89
2911h9m11j56J52K49L47L55J77j31k37l71l20j16K8K03L58L58J89j9j74l78l70
$$ -89 -500 -656 -504 -255 92 447 624 493 256 -115 -435 -551 -523 -320 38 396 585 566 392 14 -356
2932c56k16n4K17M21K57K75M8k58k83l41k95j1K07L10M10K21lj26l49k75k82j28
$$ -356 -572 -626 -409 12 269 544 592 334 51 -290 -585 -596 -389 -79 331 552 549 423 74 -201 -483 -611
2954f11J20K93L81L15M9p1l18l71l07q7R7K88M39K15J86j42k39m26k55j55M2L19
$$ -611 -491 -198 183 498 547 476 158 -213 -520 -607 -510 -222 217 432 618 476 237 -189 -444 -599 -557 -238
2976b38L17L35J28k0k29l46l61j35J2K93L20K71K10m3j92k93l25k56o1K81L53
$$ -238 79 414 542 522 293 -53 -414 -549 -537 -244 76 347 557 514 322 29 -296 -552 -613 -332 21
2997B1L19J69L4j37l41l84k03j1J04K66M50K08R9k01k90l79j88r7J30K56L62K89
$$ 21 340 509 543 406 65 -319 -522 -533 -429 -163 287 495 594 393 103 -276 -464 -561 -431 -175 187 476
3019D76J05j65k41l24l19m6J1K71L45L10J13Pl64k85k94j26M0K77L22K83K11j27
$$ 476 581 416 175 -149 -468 -514 -503 -232 113 423 536 543 179 -106 -400 -526 -486 -209 113 396 607 480
3041D80j52m50j86k56K6J78L73K74K53m6j59l10l30k66QK08L05L13K33P2j93l26
$$ 480 328 -122 -308 -564 -538 -360 13 287 540 494 335 25 -305 -571 -563 -355 -50 263 496 568 375 49
3063D9k94k57n1J55K58L40K72Q0j12l06l44k80o3J20K95L20K59J42j32k55l26
$$ 49 -245 -502 -553 -398 -140 200 472 552 440 134 -210 -490 -553 -433 -138 182 441 583 451 196 -130
3084a30k76j24J12K28L00K31K32o5k89l10k95j47M4J77L08L43K64j02k53l13k78
$$ -130 -406 -530 -418 -190 110 341 573 508 219 -91 -386 -533 -489 -312 -4 339 603 501 248 -65 -343
3105c43j95J4K38K56L01K55Nj80l18l23j79p7K20K56K80L41J0j80k01l70l24l7
$$ -343 -538 -524 -286 -30 271 526 531 351 33 -290 -469 -546 -326 -70 210 551 561 381 180 -190 -514 -551
3127e51J63K76L42K06J53j33k74l69l06k0J10K40L01K74J55j40k42k91k93j52
$$ -551 -388 -112 230 436 589 456 182 -187 -493 -513 -403 -163 138 412 567 427 185 -106 -399 -551
3147e51M6K53M00K70O1j3j68l87l40j30Q6K33L06L29J61o1j90l46l07j35n9K22
$$ -551 -505 -252 148 418 479 466 298 -89 -429 -559 -473 -240 66 395 556 495 305 -41 -348 -483 -542 -320
3169c20L04L54J31M9k07k79k97l19O1J25L43L22J85R4j54k81l27k51r2K00K23
$$ -320 -16 338 469 518 311 32 -265 -584 -523 -398 -55 267 452 546 392 111 -216 -467 -559 -359 -136
3190a36L70K09Q5p1l40k52k92p5M2L21L21K36J72j06k88l10k22j53M3K46K54L45
$$ -136 234 443 528 457 117 -135 -427 -502 -460 -139 182 418 590 484 196 -114 -336 -489 -446 -200 54 399
3212C99J48r3j44l35l08j68O3J60L47K78J13P8k82k55l24j95K9J54L69K56K28
$$ 399 547 454 310 -25 -333 -501 -438 -278 69 347 460 538 256 1 -323 -518 -489 -335 34 290 518
3233E18o1j37k75l54j89L3J15L37K72K03O6j53k86k97k21r5J49K63L10K49L9j15
$$ 518 457 320 45 -309 -498 -465 -350 -13 259 462 528 375 89 -208 -429 -524 -375 -112 198 447 486 371
3255C71k55l67j65j00J26K22L04L02R7j04k07l93j93j41O6K38K73K72J57j53j34
$$ 371 116 -251 -416 -516 -390 -168 136 438 535 431 224 -169 -362 -503 -437 -199 74 346 503 350 216
3276B16k87k57j45L3K27K56L23J16%k37k51k37k46N2J61K59L56J75l3j66k80k13
$$ 216 -71 -328 -473 -440 -213 43 366 482 482 245 -6 -243 -489 -437 -276 -17 339 514 481 315 35 -178
3298a78k54kJ53K37K61K09M0j35k34k98j92j28J52L13K84J79R2j88k47k88j67
$$ -178 -432 -434 -281 -44 217 426 466 331 97 -201 -393 -521 -369 -56 228 407 499 311 64 -224 -391
3319c91j02J58J83L38K20J9q3j41l72k05j08J11J80K50L28O6q2k31k30l02p4P2
$$ -391 -493 -335 -152 186 406 425 342 201 -171 -376 -484 -373 -193 57 385 451 369 138 -92 -394 -468 -396
3341c96K19K69J91J51j5k33k36k17j60m0K39K46K91J64p5j66k33k50k26m0L02
$$ -396 -177 92 283 434 419 186 -50 -267 -427 -467 -228 18 309 473 398 232 -1 -251 -477 -517 -215
3362b15K04K57J34R5j34k98k76j74k8J18K68L06J14Q6j23k88k16j68p8J22J67
$$ -215 -11 246 380 475 341 43 -233 -407 -435 -317 -49 257 371 457 334 46 -170 -338 -416 -294 -127
3383a27K38J94J18r9k11k32k49k8qK43L14J42J30k8k37k47k07r1RK00K82J86J27
$$ -127 111 305 423 324 113 -119 -368 -396 -404 -161 153 295 425 397 160 -87 -294 -385 -376 -176 106 292 419
3406D19n2j97k23k56j01K1J65K72K89K3Oj73k35k31j57J7J93J92J96K22m9o1k70
$$ 419 367 170 -53 -309 -410 -389 -224 48 337 360 366 193 -42 -273 -430 -413 -220 -28 168 390 341 280 10
3429A0k30j93j2J40K42K36J55P4j53k23k70j44l0R7K17K75J62J04j39k15k36j97
$$ 10 -220 -413 -425 -285 -43 193 348 422 269 46 -224 -368 -398 -301 -84 191 353 457 318 103 -133 -330
3451c30p4J23J34K20K32J15n6k60k66j47j15O9K09K28J64J13l9k02k23k14q7J
$$ -330 -404 -281 -147 73 305 420 364 104 -162 -309 -424 -355 -146 82 246 359 320 118 -105 -319 -406 -405
3473d05J86K15L04P8l7j76k10k08j25L3R0K23K47J51n2o8k71j58j15m3Q9K65J97
$$ -405 -219 -4 300 378 341 165 -45 -253 -378 -345 -255 -32 215 366 314 246 -25 -183 -298 -341 -252 13 210
3496B10J42j4r6j66k57n8j76J77J87K02J85N4j08k14j88k53j7J59J56K21J40O8
$$ 210 352 338 242 76 -181 -239 -415 -238 -51 151 336 390 282 68 -120 -373 -390 -231 -75 146 286 354
3518C54l8k38j94j59o3N8J42K19J71J62r9j76j95j95q5MJ85K28K20R6m3k39j50
$$ 354 316 78 -116 -275 -338 -280 -138 81 252 414 315 139 -56 -251 -336 -332 -147 81 301 397 354 115 -35
3541c5j62j36oJ71J96J61J38nj22j92k04j49j7J34J71K23R7L6p2k12j78j88k7
$$ -35 -197 -333 -339 -168 28 189 327 322 200 8 -196 -345 -362 -228 -57 166 263 299 227 15 -163 -351 -378
3564c78J19J89K53J73k0j10j43k24j76m2R3K15J43J78Q7m4k00j88j86n9rK02J71
$$ -378 -259 -70 183 356 336 226 83 -141 -317 -359 -266 -51 92 270 357 313 113 -75 -261 -320 -329 -127 44
3587D4K04J08r4j45k12j31p9j7J34K15J95R1o6j02k02j57j49P7J22J48L04j3L4
$$ 44 248 356 262 117 -95 -226 -305 -322 -188 27 222 313 247 145 -57 -214 -363 -286 -164 -16 288 275 309
3610C09r2j41k31j13k3J14J17K38J64oq7k24j58j52o9R5K02J92J94J9j39j38j32
$$ 309 217 76 -155 -268 -291 -177 -60 178 342 336 249 25 -133 -285 -354 -259 -57 135 329 348 209 71 -61
3633f1j83p1P1J69J80J68K9N1j93j94j96j03M3J61J55J70J20l5j14j71k50j05
$$ -61 -244 -315 -244 -75 105 273 302 353 160 -34 -230 -333 -290 -129 26 196 316 281 167 -4 -254 -359
3655c59L9J26K28J39J69m0r4k18k04m6l8M3J84K20J70Pj43j67j78j09l3J06J44
$$ -359 -320 -194 34 173 342 302 208 -10 -214 -260 -298 -255 -71 149 319 326 183 16 -162 -271 -304 -198 -54
3678e4K23J16N9j16j94j92j29n3Q4J06K17J89j1m2p8k26j34q4O4J24K16K06O3
$$ -54 169 285 344 228 34 -158 -287 -340 -256 -150 67 256 245 203 125 -101 -235 -319 -255 -131 85 291 354
3701C54m7j88j97j75l3J4R4K80O4J88q3j22j63k22p5m7J96K07J88L7J7j37j86
$$ 354 307 119 -78 -253 -286 -272 -178 102 166 354 271 149 -14 -236 -311 -358 -162 45 233 270 287 150 -36
3724c6j46j19L4O5J82K13Q1P7j11k07j89j50pN4K61J67Q3Q8r5j89k00j64MN3J69
$$ -36 -182 -301 -267 -202 -20 193 274 351 240 33 -156 -306 -313 -259 2 169 252 340 245 56 -144 -308 -304 -251 -82
3749h2J80J61L5n9j81j01k32p4P3J92J77J77N2m5j33k47r3q3j3J30K22J78O1l9
$$ -82 98 259 294 235 54 -47 -279 -353 -280 -88 89 266 318 273 140 -107 -200 -283 -296 -166 56 234 295 256
3773B56j40j26j76j10J7R3J74K37O5J8j30j62k06j50Q5P7J83J48J26j0n1k38j44
$$ 256 116 -10 -186 -296 -279 -186 -12 225 290 308 178 16 -190 -340 -255 -178 5 153 279 269 218 -20 -164
3796a64j47L5P0K06J11J16R9j56j56j56q5r0R1K06J34J58Ol6j23k06j33r8Q7J35
$$ -164 -311 -276 -206 0 111 227 326 170 14 -142 -227 -317 -226 -20 114 272 278 242 119 -87 -220 -318 -231 -96
3820i6J93P6J38m1k13j35j03q9j8J65J58J30Q3Mp9j69j84j20J9J65J14J66J11
$$ -96 97 173 311 270 57 -78 -181 -270 -288 -123 35 165 248 252 173 4 -180 -300 -281 -116 -2 164 275
3843B75j6j10j45j43r8o1R8J82J70J02k1q8j10j74j27L9qJ81J46J45O9j16p3k16
$$ 275 259 149 4 -139 -237 -298 -200 -18 152 254 233 145 35 -139 -266 -227 -235 -54 92 237 306 190 117 -99
3867i9j95j8P1J53J74J54M5l3j40j74j69j8N0O3K61J07M7r0q1j83q9j22Q1N2J78
$$ -99 -294 -312 -241 -88 86 240 285 252 112 -62 -231 -249 -199 -136 125 232 279 189 108 -75 -164 -286 -205 -153 25
3892B5J40J26j4j30j87j50o4J4R0J55J72N0K5q4k05j41n6l1J20J49J70O9O5j11
$$ 25 165 291 277 147 -40 -190 -254 -240 -150 5 177 227 252 168 -37 -178 -234 -265 -145 4 174 243 308 197
3916A97j82r6j38k6j1J56K14J30%lk14j17j22q2R5J39J76N9R8j25o8j96r4k2j4
$$ 197 15 -81 -219 -245 -256 -100 114 244 244 241 27 -90 -212 -294 -199 -60 116 175 273 148 80 -116 -210 -232 -246
3941b46K02J42J59m2Rj26j22j15j17N1J08J57J45K5J6j23j09j58r6J5O1J77J74
$$ -246 -44 98 257 215 224 98 -24 -139 -256 -205 -97 60 205 230 246 123 14 -144 -240 -225 -164 13 187
3964A87Rj5j0k00j16j06oQ3K09J46L9M2m5k22j31j06K8J9J60J77O4J5n9j42j50
$$ 187 196 181 171 -29 -145 -251 -257 -174 35 181 220 262 217 -5 -136 -242 -214 -195 -35 142 206 221 162 20 -130
3989a30j04j0Q4R9R1J92J8o6j06j26j46j8K3J51O0J50M2m9k7j71j20p3OQ7J62
$$ -130 -234 -244 -160 -61 30 222 240 174 68 -58 -204 -222 -199 -48 12 162 204 155 128 -43 -163 -236 -230 -143 19
4014A9J41R9k3j18j51j68k2m2J02Q7K48KL2q4j19j14p5p8J36R7J17R0J3l2j96
$$ 19 160 259 236 118 -33 -201 -223 -265 -163 -76 172 174 206 122 3 -111 -186 -264 -128 -31 86 176 189 157 -39
4039c9p3j20J1Q8R1J42N0O7k5j64r2j53L8rJ16J32J37J9m0r7j49j20n5L5J21J57
$$ -39 -112 -232 -221 -133 -42 100 150 217 192 28 -64 -217 -179 -188 -72 60 197 216 176 79 -70 -190 -245 -210 -89 68
4065F8J16O8r2o2j20j27Jm3O5J83R4R1p9m1j08j60n3k1J15K01L4J26o0r0o6j43
$$ 68 184 252 160 98 -22 -149 -148 -191 -126 57 151 242 163 122 14 -146 -199 -220 -105 96 130 256 196 106 40 -103
4091a03q1l3O2J58J24J40k0j25j23j36m0j1Q6N5J94L9L4p3j15r5j43QRJ40R5J04
$$ -103 -184 -217 -155 3 127 267 247 122 -1 -137 -177 -188 -102 -47 147 186 220 147 32 -63 -206 -198 -189 -49 46 150
4117A50O5m9j17j33Nj05j3J37J00M6P6L7n6j95j04j7M1L2J37M8R5J0j28o8j16
$$ 150 215 166 49 -84 -79 -184 -197 -60 40 86 162 199 143 -52 -156 -173 -132 -100 37 85 180 190 62 -6 -122
4142a22m6n9J15J05J30Q3k2k4j55p9j21ML6J78J15N0J6j5j42j33p2m9R2R1J01
$$ -122 -168 -227 -112 -7 123 206 184 160 5 -74 -195 -191 -155 23 138 188 204 189 47 -86 -158 -207 -115 -24 77
4167G7L3L5Km6j21j14o4N3M3J14J43N8oj17r9j27n9J5Q2J28J07N6J2p2j21j44
$$ 77 110 145 147 101 -20 -134 -198 -145 -102 12 155 213 207 90 -9 -136 -195 -180 -98 30 137 193 205 133 12 -132
4193a32n4oQ6R1J72J7l8M5j85j10j02L1O6P8J18J39r6K8j50j00p4j5O1J04P8J05
$$ -132 -186 -192 -106 -15 157 174 136 181 -4 -114 -216 -185 -119 -41 77 216 120 148 -2 -102 -176 -191 -130 -26 52 157
4219A57K3l4p8j12j87L5Q1L3J39J10P5l5j34j61r9Lj3J06J43N7J6l5n1n4j11j2
$$ 157 180 146 68 -44 -231 -196 -115 -82 57 167 242 207 73 -88 -187 -184 -197 -91 52 109 125 90 39 -15 -126 -138
4245a38k9N3J13J19L1O2j45r1r4p8M6N6J30R4N6K6q2j06j07j31N9J9Q0J51O2L6
$$ -138 -167 -114 -1 118 149 211 66 -25 -119 -197 -151 -95 35 129 185 211 129 23 -84 -215 -156 -137 -57 94 156 192
4271A92k4j47j26l0j11J14J22P1J12%mk3j80j30j1rJ36J10Q1M4n2j33n7q2p9P1
$$ 192 168 21 -105 -135 -246 -132 -10 61 173 173 169 146 -34 -164 -175 -184 -48 62 143 187 135 2 -55 -137 -216 -145
4297a45M8J88O5K0m3k2j27q9n6KP7Q8J51L3n0j9j35j04n3NP4L9J51M1Pn2q2j67
$$ -145 -97 91 156 176 133 111 -16 -105 -161 -159 -82 6 157 190 140 121 -14 -118 -171 -166 -92 -53 98 139 146 94 12 -155
4325a55j2j9J31J6J21P2j2n4kj64l7n0M8J52J5R4nJ5l0j56j39l6N4J18O3R5L0
$$ -155 -167 -186 -55 -39 82 154 142 88 86 -78 -115 -165 -117 35 50 144 139 154 124 -32 -171 -207 -153 -35 28 123 153
4352A53J5j19j04j05J3LN7J15J16J1J6j50k3j51J3j5O9R1P6J34q7n5n8j28o5K7
$$ 153 168 49 -55 -160 -147 -144 -87 28 144 155 171 21 -2 -153 -140 -155 -86 5 81 215 128 73 15 -113 -178 -151
4378a51P2P2O9M9O8p2p9q6p3k2qJ60Q1O5K2n3o6j02j32MO6O9Q4R7J7l5q7j01q4
$$ -151 -79 -7 62 111 179 107 28 -58 -131 -153 -161 -1 80 145 167 114 48 -54 -186 -182 -116 -47 37 134 151 116 29 -72 -156
4407a56k0M4M1J41P8L5l7o1j15q5k6K1J10Q2J09pl3o0q8j19j0K5M7J31M0R5n9
$$ -156 -176 -132 -91 50 128 163 126 65 -50 -135 -161 -140 -30 52 161 154 121 61 -27 -146 -156 -131 -84 47 87 182 123
4434A23n3j45o3Ok0R9M9J07J8l7K6j67p0o2M6Q9N1R5M9K3m4j28q3n1nP4Q6R2O2
$$ 123 70 -75 -138 -132 -152 -53 -4 103 121 84 110 -57 -127 -189 -143 -54 -3 92 141 164 120 -8 -91 -142 -147 -73 13 105 167
4463A67l3j5j00r9q6M6L9N8J27M9Qp6r2p4j23O1L5J06O1Q9No4m0j29l0n2P4j1
$$ 167 134 119 19 -80 -166 -120 -81 -23 104 153 161 85 -7 -81 -204 -143 -108 -2 59 148 153 89 49 -80 -110 -162 -88 -99
4491i9J87N1P6o5j01j80j7m0O3J14N5Q9Loo7n9r3l2kO2J37J5J40j7j24j34p0j2
$$ -99 88 139 215 150 49 -131 -148 -188 -125 -11 44 133 136 130 63 4 -89 -121 -123 -61 76 91 231 214 90 -44 -114 -126
4519a26PO0Q8Q4K0pm6p9q1j34L4N0P0R8O7P2j15k2q2j20M0J8P1J24O3m4n2L7j60
$$ -126 -119 -59 29 113 133 126 80 1 -80 -214 -180 -130 -60 38 105 177 62 40 -42 -162 -122 -104 -33 91 154 110 58 95 -65
4548f5r7K1N6K6M2J17K3M3j77k5j41M8J0K6J43M3M3N2j35p2j41o2R0L0J21J46
$$ -65 -162 -141 -85 -59 -17 100 123 166 -11 -36 -177 -129 -119 -93 50 93 136 188 53 -19 -160 -222 -132 -102 19 165
4574A65MJ2j04q8j20j0LM3J31M4M6L4q2j04p9%n1O0J29R2O1n5n5j64L6q8K2J5
$$ 165 169 181 77 -11 -131 -141 -138 -95 36 80 126 160 78 -26 -105 -105 -156 -96 33 125 186 131 76 -88 -52 -140 -118 -103
4602a03R7Q4R9Oo3q6j07r6K1K8J01R8P8Jl1j31m9q7l8L9J32K8J10k6Kl8j30q1
$$ -103 -6 78 177 183 120 34 -73 -169 -148 -120 -19 79 157 158 127 -4 -53 -140 -178 -139 -7 21 131 105 107 69 -61 -142
4630a42p8Q9P4P2O0J00q9m7o9j30J1j4J28Q8lO9Ml5j02rj12k8J6J15J28N7k2m2
$$ -142 -220 -131 -57 15 75 175 86 39 -30 -160 -149 -163 -35 53 50 119 123 88 -14 -23 -135 -163 -147 -32 96 153 131 89
4658H9j02j12l1P4k0J17P9Q7m6m6o1q2o9m5P9N9J02P0Ql4k7j51m9l8k8J53P9P3
$$ 89 -13 -125 -156 -82 -102 15 94 181 135 89 28 -54 -123 -168 -89 -30 72 142 150 116 89 -62 -111 -149 -177 -24 55 128
4686A28N9p8p7p5l0n6nL6J62R7J2o3Rj99Mr9L1N2O9J64j7L2j45Qr6r8J4J28M5
$$ 128 187 109 32 -43 -73 -129 -134 -98 64 161 173 110 119 -80 -76 -175 -144 -92 -23 141 124 156 11 19 -77 -175 -161 -33 12
4715A2M1R2K0n8j09o2o3l4K1J58O1M4Pk6o4j13j02J8R8J8P6Q6Mj2p6r2q0j7L5
$$ 12 53 145 165 107 -2 -64 -127 -161 -140 18 79 123 130 104 40 -73 -175 -157 -59 -41 35 121 125 113 37 -55 -135 -152 -117
4744a17R8M7J00Q2j19n8m1j86J01j0J7J26P8L1j7r6n2j21n9J06J3N0J53m8M4o8
$$ -117 -19 28 128 210 91 33 -8 -194 -93 -103 -86 40 118 149 132 36 -16 -137 -196 -90 -77 -27 126 78 122 54
4770E4r7r2L8o2M6J45N0Q5J1r0j18k2j37L0P7N5J33k5M3kj32m7o7jK5Q7J33K4
$$ 54 -43 -135 -97 -159 -113 32 82 167 178 88 -30 -52 -189 -159 -82 -27 106 81 124 122 -10 -57 -124 -125 -100 -13 120 144
4798A44j5j0q5q7o6n8R7P7Q3P1j5m7k7j00p1p4Q8O6J14K4L0o6rq5q3o6J9N5J14
$$ 144 129 119 34 -53 -119 -177 -80 -3 80 151 136 89 62 -38 -109 -183 -95 -29 85 109 139 73 64 -21 -104 -170 -151 -96 18
4827A8J22NK2o5q8r1j08O7k1J11P4P5L4j74N4j65m6lJ23K0Q5J27n3Kr8r8n3kK5
$$ 18 140 145 167 102 14 -77 -185 -118 -139 -28 46 121 155 -19 35 -130 -176 -179 -56 -36 49 176 123 125 27 -71 -124 -126 -101
4856a01Q2J14N8Rm8p1j05p0qL4N8J58M2Ol4q8r6o7k0J7O4J20O5N3n8j18J6j42
$$ -101 -19 95 153 162 114 43 -62 -132 -140 -106 -48 110 152 158 124 36 -60 -127 -147 -130 -66 54 119 172 114 -4 12 -130
4884a30k9K9O3R3M1N6Rn7o5n7p8j4R9P2O9O8l8o7l3j05q0l5J38PJ20R6m7l3n7
$$ -130 -159 -130 -67 26 67 123 132 75 10 -47 -125 -139 -40 32 101 169 131 64 31 -74 -154 -189 -51 -44 76 172 125 92 35
4913C5j00j00qK2K02L0O4k6j8m8j46o1j8O7P9J36L8LJj52p3q3rM6J19M6J09J7
$$ 35 -65 -165 -173 -151 51 81 145 119 101 53 -93 -154 -172 -105 -26 110 148 151 152 0 -73 -156 -165 -119 0 46 155 172
4941A72j0r4r2p8o1O0JJ39J24l8n1j3j37ok8n2N4J15J16j4N2j10k6j60k4N2P9
$$ 172 162 68 -24 -102 -163 -103 -102 37 161 123 72 59 -78 -84 -112 -164 -110 5 121 107 159 49 23 -137 -161 -109 -30
4968c0K3J06K0M0o9j13j13j7l1Q7R1Q7L9K5l0j13r2o0K4M3O1M1J07K0n5j02k8
$$ -30 -7 99 119 159 90 -23 -136 -153 -184 -97 -6 81 120 145 115 2 -90 -150 -126 -83 -22 19 126 146 91 -11 -39
4995c9p9p0O9Q1Q3N4O9p4n3j03q9rJ2P4J06M1O3p8mj44K5q9rJ00J14R2k9L7n7
$$ -39 -118 -188 -119 -38 45 99 168 94 41 -62 -151 -160 -148 -74 32 73 136 58 54 -90 -65 -154 -163 -63 51 143 114 151 94
5024I4r0j30q2K6J68QQ2J3J11j31o9j19l2L5n6J11J43Q6l3o0j01j21j2j8K8J06
$$ 94 4 -126 -208 -182 -14 -6 76 89 200 69 0 -119 -151 -116 -172 -61 82 168 135 75 -26 -147 -159 -177 -149 -43
5050d3R5J20J1q6o6j75M2n8L7O5J08M0O2o9r4o3o5K2l6J35R2O4L5l4o9j55l8p6
$$ -43 52 172 183 97 31 -144 -102 -160 -123 -58 50 90 152 83 -11 -74 -139 -117 -153 -18 74 138 173 139 70 -85 -123 -199
5078a99R0K5J16J16L2o7j24m8n1n4MR6P3R9j6L9q0q6n9p2j9J22P8J46l4nj4p7
$$ -199 -109 -84 32 148 180 113 -11 -59 -110 -164 -160 -64 9 108 92 131 51 -35 -94 -166 -185 -63 15 161 127 122 108 31
5106C1j26o7Q9K9O7L9J15om5j32p6l5m7LJ29N3P5P5q7o0j07o3Lk4Q6J23M1P9k2
$$ 31 -95 -162 -73 -44 23 62 177 171 126 -6 -82 -117 -164 -161 -32 21 96 171 84 24 -83 -146 -143 -167 -81 42 83 162 140
5135A40n3j28p8j7L2Q8O0M3L1J7q5p9j27k2Q2M9N2J39J6p5Jq9j30j6N5O5N7L5
$$ 140 87 -41 -119 -136 -104 -16 44 87 118 135 50 -29 -156 -178 -96 -47 5 144 160 85 86 -3 -133 -149 -94 -29 28 63
5163F3R8jo8o1j02j14J3N4R6J06qN5J5j63j08Pm3KJ43M6P7J9o8Rq7l5j21J09R7
$$ 63 161 160 92 31 -71 -185 -172 -118 -22 84 76 131 146 -17 -125 -118 -161 -159 -16 30 107 126 58 67 -20 -55 -176 -67 30
5192C0N8J6P7j01j4r3q1k5qO6P2J69n1l5p5r6l3n2P2M0N0J39JJ1q1r2n4m1JN7
$$ 30 88 104 181 80 66 -27 -108 -133 -141 -75 -3 166 115 80 5 -91 -124 -176 -104 -64 -14 125 126 137 56 -36 -90 -131 -130 -73
5222g3K7J06R2m8J6j12p6o8m1J14R5R4N4m2m9p4q6o7J8M8K9O2J03N0r3j04m8m0
$$ -73 -46 60 152 104 120 8 -68 -136 -177 -63 32 126 180 138 89 15 -71 -138 -120 -72 -43 19 122 172 79 -25 -73 -113
5250a13kn6J04J26M7M8p0l8o3p4j9j5O0J04P7L1m8j07l5r8l7L8O8P7K9J34n4N
$$ -113 -115 -171 -67 59 106 154 84 46 -17 -91 -110 -125 -65 39 116 147 99 -8 -43 -141 -178 -140 -72 5 34 168 114 119
5278A19j59p2q6O3R5N7Q6K2M0j30n0k5j12N9%O1N8O7RJ2j16n8j17N7L1P1Q2M4
$$ 119 -40 -112 -198 -135 -40 17 103 125 165 35 -15 -40 -152 -93 -93 -32 26 93 102 114 -2 -60 -177 -120 -89 -18 64 108
5306A08Rj9p7n5r5NL3K9Q6R3m7L5q6m0l5n9K2J5J53L6OQo7o9n4q8K7N8J00K5L8
$$ 108 117 98 21 -34 -129 -124 -91 -62 24 117 70 105 19 -21 -56 -115 -93 -78 75 111 117 125 58 -11 -65 -153 -126 -68 32 57 95
5337I5Pm4q6l9n2j3Q6lJ15M0K7k2j68p1j7QO8J40L2rQ2l1j41o2m4j2L0M7R7Q6
$$ 95 102 58 -28 -67 -119 -132 -46 -49 66 106 133 111 -57 -128 -145 -137 -69 71 103 94 176 145 4 -58 -102 -114 -84 -37 60 146
5367A46J4r9m3k1j10p4P6J06M0Q6n0j4Kj19k0o6lJ23R3M6K7r9l1r0j7l2kJ07O2
$$ 146 160 61 18 -3 -113 -187 -111 -5 35 121 71 57 59 -60 -80 -146 -149 -26 67 113 140 41 10 -80 -97 -129 -131 -24 38
5396C8L7O9o7o7m3o3k7k7J31Q5M5M5j9r9p9o2J0l7P6O5O1L3l6j7n3j01m2M6J9
$$ 38 75 144 77 10 -33 -96 -123 -150 -19 66 111 156 137 38 -41 -103 -93 -130 -54 11 72 105 69 52 -1 -102 -144 -98 -79
5425g9R4J05Kk0l2p4r3n0J3J03L2P5M3Pk9l3j19p7pQ3O0R9J7O3r4m6j25J0k2M
$$ -79 15 120 122 102 70 -4 -97 -147 -134 -31 1 76 119 126 97 64 -55 -132 -139 -56 4 103 120 183 89 43 -82 -72 -94 -90
5455i0J05%R2J00j60m1m3n1m7K7J06O7N9K0j2j10l6q8mL3k3J40N6L8o6l3l6q5
$$ -90 15 15 107 207 47 6 -37 -88 -135 -108 -2 65 124 144 132 22 -14 -102 -106 -73 -96 44 100 138 72 39 3 -82
5483h2k6k0M7R6Q2J0L7p6q5j04L7j1L9P8L1%Q8m5j02o7k2j9N9O3NP8J8q6p8J1
$$ -82 -108 -128 -81 15 97 107 144 68 -17 -121 -84 -95 -56 22 53 53 141 96 -6 -73 -95 -114 -55 8 13 91 109 23 -55 -44
5513d4p7k6N6P4N8R0Kp7m7q2o7LpJ01N9Q3M3l9p9n9r0NqJ00Q6J08m2m4m6n8p3
$$ -44 -121 -147 -91 -17 41 131 133 56 9 -73 -140 -137 -144 -43 16 99 142 103 24 -35 -125 -120 -128 -28 58 166 124 80 34 -24 -97
5544i7j5J8M6P5M2P9p3m4Nj59Kj3P6Q7J02J2n4Jj19j0j17P8L9J04lP3J7j08n2
$$ -97 -112 -94 -48 27 69 148 75 31 36 -123 -121 -134 -58 29 131 143 89 90 -29 -39 -156 -78 -39 65 62 135 152 44 -8
5573hn5k2l8M4Q7R6M6o4nj16j6q6K4%J25O2j7Q3j24Nn7n7J4kM0M9P9K9m5l8p6
$$ -8 -63 -85 -123 -79 8 104 150 86 81 -35 -51 -137 -113 -113 12 74 57 140 16 21 -36 -93 -79 -81 -41 8 87 116 71 33 -43
5604d3j4kq3J00P1O0rO4n5j24l1p1N1J2R0J16%l6m4j6j01j9lJ11j4Q3L7j1n3j10
$$ -43 -57 -59 -142 -42 29 89 80 144 89 -35 -66 -137 -86 -74 16 132 132 96 52 36 -65 -84 -87 24 10 93 130 119 66 -44
5634d4K1j35K5O7N1N9Q2l8k0q7m2o2lM5O3Q1P3l9L0j24n7n9LM4Q8L9O2Ol6n2j03
$$ -44 -23 -158 -133 -66 -15 44 126 88 68 -19 -61 -123 -126 -81 -18 63 136 97 127 3 -54 -113 -110 -66 22 61 123 129 93 41 -62
5665f2N8p7K7l4J16J11kj08k7k5o5k5LP5P1N5K2m4K9q6r8oj3j4J09J03L9l0N5
$$ -62 -4 -81 -54 -88 28 139 137 29 2 -23 -88 -113 -110 -35 36 91 113 69 98 12 -86 -92 -105 -119 -10 93 132 102 157
5694A57j51j08k8k2K6R0P5Q8k5rn4o6o4K5k7P1Q3L8M4k2n0q8j13J8J6L5R4O3m2
$$ 157 6 -102 -130 -152 -126 -36 39 127 102 93 39 -27 -91 -66 -93 -22 61 99 143 121 71 -17 -130 -112 -96 -61 33 96 54
5723E4P4q5j33J0pq1R6N1J22O3k4r4k5r3j04Q4N3P7K3O2o2%p8o3n3M0J8Q6P4P5
$$ 54 128 43 -90 -80 -87 -168 -72 -21 101 164 140 46 21 -72 -176 -92 -39 38 61 123 61 61 -17 -80 -133 -93 -75 11 85 160
5753A60o8l4l6q6o3P7PO6lP4P3j02p5l4j6n3K9M8M8P5%ol1r0m4k6kQ6J18lK7l3
$$ 160 92 58 22 -64 -127 -50 -43 23 20 94 167 65 -10 -44 -60 -113 -84 -36 12 87 87 81 50 -40 -84 -110 -112 -26 92 89 116 83
5785H3k4p7k6p0J6N1N8R2M6Oj03j22K5n2L5J1M8J12M7rr4j19k5K0k6M0M9L2K3
$$ 83 59 -18 -44 -114 -98 -47 11 103 149 155 52 -70 -45 -97 -62 -51 -3 109 156 147 53 -66 -91 -71 -97 -57 -8 24 47
5814D7O0k3r2n4o9l1O3J13L0K7M9k6k9j27k4n4K3J07P1O2pl9l8n9o5n4M8N1K7
$$ 47 107 84 -8 -62 -131 -162 -99 14 44 71 120 94 65 -62 -86 -140 -117 -10 61 123 116 77 39 -20 -85 -139 -91 -40 -13
5843a3P2oL4o8l3m4q2N8K6O8O6O2J7j85K3n9l8MK4O1Q6L9j6q3J4q8l4k0J1N0J40
$$ -13 59 53 87 19 -14 -58 -140 -82 -56 12 78 140 157 -28 -5 -64 -102 -98 -74 -13 73 112 96 13 27 -61 -95 -115 -104 -54 86
5874H6M7l7k5p6Jq5LK6M6K2J68n0j10J2p9q9K6L7J6J08pQ3n8j6q4o3oJ6O8P0J9
$$ 86 133 96 71 -5 -4 -89 -86 -60 -14 8 176 126 16 28 -51 -140 -114 -77 -61 47 40 123 65 49 -35 -98 -104 -88 -20 50 69
5905F9N0n4l2o1k0o3K0rJ64pJ0J7o2l4q3N7r6O6Q6R5n8L8l5l0n3k9m2M6K6K8Q3
$$ 69 119 65 33 -28 -48 -111 -91 -100 64 57 67 84 22 -12 -95 -38 -134 -68 18 113 55 93 58 28 -25 -54 -96 -50 -24 4 87
5936H7M2r7k0o7m0m1MO4N4J14k6M7o7j08k5j7L1M3K2R5l2K2m4j1q7j1k7PJ40J4
$$ 87 129 32 12 -55 -95 -136 -132 -68 -14 100 74 121 54 -54 -79 -96 -65 -22 0 95 63 85 41 30 -57 -68 -95 -88 52 66
5966F6P8k3n3n0o8k2j2N5O2j1L0J1m1Oj66nJ1O7R8kP7on2m3j38M8k7J5J17KQ3
$$ 66 144 121 68 18 -50 -72 -84 -29 33 22 52 63 22 28 -138 -143 -132 -65 33 31 108 102 50 7 -131 -83 -110 -95 22 24 107
5997A07k0L5j25j9j22O9R0OJ8N3M1l6q9k9m5l1J5P0N4K3Lm5Mj00m1k6N4L4N5k9
$$ 107 87 122 -3 -22 -144 -75 15 21 39 92 133 97 8 -21 -66 -97 -82 -12 42 65 68 23 27 -73 -114 -140 -86 -52 3 -26
6027b6J07l1Jr4k4j6j8K4P7J4Q7l3J7j00r4J8m4Q1K2Q4K0Kk4j03N1l6n0N6K7K4
$$ -26 81 50 51 -43 -67 -83 -101 -77 0 14 101 68 85 -15 -109 -91 -135 -54 -32 52 72 74 50 -53 -2 -38 -88 -32 -5 19
6057A9J13j1o2m0m2j17J8MJ23j3Q2K7J4q8n9o9m8K7N4Q8K9K4m3K0n0m2o6Q7l7
$$ 19 132 121 59 19 -23 -140 -122 -118 5 -8 74 101 115 27 -32 -101 -149 -122 -68 20 49 73 30 50 0 -42 -108 -21 -58
6086e8R8P9qk4j01JOp5KK2K0J21m8M3l2r2M7o5k3nP6K3j1P5K9j14l5n0J0O1K1
$$ -58 40 119 111 87 -14 -13 -7 -82 -80 -58 -38 83 35 78 46 -46 1 -64 -87 -92 -16 7 -4 71 100 -14 -49 -99 -89 -28 -7
6117gl6J54m8j5J4n5p8KJ0N9M9M6m5M3l8r3K9q7P9k7L1P5L4m5K6r7o6j4mJ07K3
$$ -7 -43 111 63 48 62 7 -71 -69 -59 0 49 95 50 93 55 -38 -9 -96 -17 -44 -13 62 96 51 77 -20 -86 -100 -104 3 26
6148B6mpO3lq2n8K5j5o0R3k9J13%qk4j06K6k2PL2J06m2O1J8j11k6l1K9R1o9P2
$$ 26 22 15 78 75 -7 -65 -40 -55 -115 -22 -51 62 62 54 30 -76 -50 -72 -65 -33 73 31 92 110 -1 -27 -58 -29 62 -7 65
6179F5n6P5l0k9Oj19J8M5J0K2jR7r3J4l9m7k4L9K1Q3j6J0M2p2j7K3j28k1Q9N3
$$ 65 9 84 54 25 31 -88 -70 -25 -15 7 6 103 10 24 -15 -62 -86 -47 -26 57 41 51 93 21 4 27 -101 -122 -33 20
6209B0MK0L4l2q3O6o5J5%M3J9QL4k2op2km4K7j5J07J1Pk7kn7Kk4JL0k0O9m0L8
$$ 20 24 44 78 46 -37 29 -36 -21 -21 22 41 49 83 61 55 -17 -19 -63 -36 -51 56 67 74 47 45 -12 -10 -34 -33 -3 -23 46 6 44
6243D4K7p1k3Qp2P3JO1k3L4k9m8j9Mj8M4NO1J7m0L0p4l5l5M4l2J9J23k6L3k7n5
$$ 44 71 0 -23 -15 -87 -14 -13 48 25 59 30 -18 -37 -33 -51 -7 -2 59 76 36 66 -8 -43 -78 -34 -66 -47 76 50 83 56 1
6275A%o3k3LQ0n0O9J9n9N8q0J6k2nk7Q6O6m0L1n3Ro8l6nQ2M8K7k2m6R1j42K0R
$$ 1 1 -62 -85 -82 -2 -52 17 36 -23 35 -45 -29 -51 -56 -83 3 69 29 60 7 16 -52 -88 -93 -11 37 64 42 -4 87 -55 -35 -26
6308b6k4P0MJ6j2J7n5L8n7jk4k0Q6L8l4J8%j8l7j7n1K2P0M2OK4m3m4M7p4L5p1
$$ -26 -50 20 24 40 28 45 -10 28 -29 -30 -54 -74 12 50 16 34 34 16 -21 -38 -89 -67 3 45 51 75 32 -12 35 -39 -4 -75
6340g5M3M0N0K4q2j0Rj2l2m1J1O2P6n4J9L0q1m2m7O3K1qR2k1J3l9J0n6l5M0o5
$$ -75 -32 8 58 82 0 -10 -1 -13 -45 -86 -75 -13 63 9 28 58 -23 -65 -112 -49 -28 -36 56 35 48 9 19 -37 -72 -32 -97
6371i7O9N4N4mpln0n8j7oO8J3M4j0P2j61O2j7j1j3k3J19r8O1Mk7l5l7J9Oj1L3
$$ -97 -28 26 80 76 69 66 16 -42 -59 -65 3 16 60 50 122 -39 23 6 -5 -18 -41 78 -20 41 45 18 -17 -54 -35 -29 -40 -7
6403gJ4Q5o7k3q6J3j4k2O4N7L7K7l8Jl4j8J5l6K6k6J17lJ4n7j1n8l1J5j4N4L1
$$ -7 7 92 25 2 -84 -71 -85 -107 -43 14 51 78 40 41 7 -11 4 -32 -6 -32 85 82 96 39 28 -30 -61 -46 -60 -6 25
6434B5m3N5On3j6r1M8O7K6K7l9J4K0pj19K3NK9M6p1M8J07m3n8n2J6m%k0L5M6M5
$$ 25 -18 37 43 -10 -26 -117 -69 -2 24 51 12 26 46 39 -80 -57 -52 -23 23 -48 0 107 64 6 -46 -30 -34 -34 -54 -19 27 72
6466G2m7n3OLL7r3P0N5MJ3L4m1o7j9n5O8rK0Q5k5L5n0l3o7l9N0M9K9nL6o0j6k
$$ 72 25 -28 -22 -19 18 -75 -5 50 54 67 101 60 -7 -26 -81 -13 -22 -2 83 58 93 43 10 -57 -96 -46 3 32 27 63 3 -13 -15
6499a5Ko0RK3N3N6Jk6j5k0l1mk9KM2K5P3rj2n7n4N5j12N7P1k8M0lN2n2n6k1qJ9
$$ -15 -13 -73 -64 -41 12 68 69 43 28 8 -23 -27 -56 -54 -12 13 86 77 65 8 -46 9 -103 -46 25 -3 37 34 86 34 -22 -43 -51 -32
6533c2p7J12K2L6j6k8m5o8oj1K8J02m7J29m7n9Mo8M4j1J3K8M0J0J9k6m9l7k5J0
$$ -32 -109 3 25 61 45 17 -28 -96 -102 -113 -85 17 -30 99 52 -7 -3 -71 -27 -38 -25 3 43 53 72 46 -3 -40 -65 -55
6563e5pJ9O3J8K2o7K0l8m2K3O2k5L0j0N6J7q8j4j12MN2P6K3rK8rr2O0m7j4K2J8
$$ -55 -62 -43 20 38 60 -7 13 -25 -67 -44 18 -7 23 13 69 86 -2 -16 -128 -124 -72 4 27 18 46 37 -55 5 -42 -56 -34 -16
6595a6P1k2J7L0n5j8prn3O1L8k2K3%jm8l4J5l7l0R7K4l0O6Op0l7p2M2KO0P5k3
$$ -16 55 33 50 80 25 7 0 -9 -62 -1 37 15 38 38 37 -11 -45 -30 -67 -97 0 24 -6 60 66 -4 -41 -113 -71 -69 -9 66 43
6628D3N5pj04L1o2m9M5N4M0N5k6j1q3L6n8m5L6L5M8k2J3M6j1q3J0m4j6j0J10o
$$ 43 98 91 -13 18 -44 -93 -48 6 46 101 75 64 -19 17 -41 -86 -50 -15 33 11 24 70 59 -24 -14 -58 -74 -84 26 20
6658B0O6o0rJp3l3M6M1j2K8M1j1q3J3lk0N3k1pM3J6M5p9L3o8n0j8Q8K6J2M6k0
$$ 20 86 26 17 18 -55 -88 -42 -1 -13 15 56 45 -38 -25 -28 -48 5 -16 -23 20 36 81 2 35 -33 -83 -101 -13 13 25 71 51
6690E1Kj03N8r0J5L0J0LN1P5m9Qn2o4kl2L4P5M8oJ5J1j03k2q5N6L3K9P6k7K1l0
$$ 51 53 -50 8 -82 -67 -37 -27 -24 27 102 53 61 9 -55 -57 -89 -55 20 68 62 77 88 -15 -37 -122 -66 -33 -4 72 45 66 36
6722C6m7o9nJ2oP3K3P6J9r4N7j33k4J8L9L3K3J7P3n4k2n0l5n4QM2R0J2jj6jLj12
$$ 36 -11 -80 -85 -73 -79 -6 17 93 112 18 75 -58 -82 -64 -25 8 31 48 121 67 45 -5 -40 -94 -86 -44 46 58 57 41 40 43 -69
6755f9qJ7J3L9L9O2k3n6l4o6K4k8Q9RL0%J2L8q0k1q8j9M3L8Q6J0M1m9m5o9k7J8
$$ -69 -77 -60 -47 -8 31 93 70 14 -20 -86 -62 -90 -1 8 38 38 50 88 8 -13 -101 -120 -77 -39 47 57 98 49 4 -65 -92 -74
6787g4K0M5ON0K1Mn9q1rj5L2L3O2K1K2m0l9j9Pn9Q0m5O0M4K7l0kn4p4O1m1mO1
$$ -74 -54 -9 -3 47 68 72 13 -68 -77 -92 -60 -27 35 56 78 38 -1 -20 -13 -72 8 -37 23 67 94 64 62 8 -66 -5 -46 -50 11
6820A1O3o4Q5n9k2n6j4p1P8O9k0M6K7L4r8o7n0M9L4mN1K8M7j7p7j2m6k2M8l5N8
$$ 11 74 10 95 36 14 -42 -56 -127 -49 20 0 46 73 107 9 -58 -108 -59 -25 -29 22 50 97 80 3 -9 -55 -77 -29 -64 -6
6851fQ7M0m0n5l0n3l1O8JK3Q7L9n5m3p7J0q8J6J9J78n0K9%m9m4p4j0M5J5N6m2
$$ -6 81 121 81 26 -4 -57 -88 -20 -19 4 91 130 75 32 -45 -35 -123 -107 -88 90 40 69 69 20 -24 -98 -108 -63 -48 8 -34
6882c4R5J5k1m6n9ol0jJ03M3Q6q3mnn7q9M7PL4K2N0K2Ln0j08N9q5O8m3O0O3N3
$$ -34 61 76 55 9 -50 -56 -86 -87 16 59 145 62 58 53 -4 -93 -46 -39 -5 17 67 89 92 42 -66 -7 -92 -24 -67 -7 56 109
6914A09r3n0njJ3L0j1K2K8L6K8o1k8q5l9JLJ10P2O5o5p7k2k0k2l2P8KM4N0n4L0
$$ 109 16 -34 -39 -40 -27 3 -8 14 42 78 106 45 17 -68 -107 -106 -103 7 79 144 79 2 -20 -40 -62 -94 -16 -14 30 80 26 56
6946E6n9l0n8k8O4N7M1Pm6N9j19M0o6m8J28n5N7L9K2L1q3o3l2LK1lO5J00j7l0
$$ 56 -3 -33 -91 -119 -55 2 43 50 4 63 -56 -16 -82 -130 -2 -57 0 39 61 92 9 -54 -86 -83 -62 -65 0 100 83 53
6976E3n4o1k0K7J6RL7N0M8r1N8o7l6l0j1l1R2N1N2ol8o2p6NQJ8K3J03j4oRn6o9
$$ 53 -1 -62 -82 -55 -39 -30 7 57 105 14 72 5 -31 -61 -72 -103 -11 40 92 86 48 -14 -90 -85 -77 -59 -36 67 53 47 56 0 -69
7009f9K5k2rK6J02N5n8k3m4J2j16Q0N1jR8%j5j7p8p1L9Oo7P2J05K8p4Pn6m5M2
$$ -69 -44 -66 -75 -49 53 108 50 27 -17 -5 -121 -41 10 9 107 107 92 75 -3 -74 -35 -29 -96 -24 81 109 35 42 -14 -59 -17
7040a7Rn2K7N0J1O3m7k7m9Jn5j6N2M5Q7p7L2K0p5k1J6l3j8J33l9R5m8k8k5p7J1
$$ -17 -8 -60 -33 17 28 91 44 17 -32 -31 -86 -102 -50 -5 82 5 37 57 -18 -39 -23 -56 -74 59 20 115 67 39 14 -63 -52
7071e2n9O2P6k7OJ4K8qo6p0nO7RN0L7K6k9r5j2K0k9%N9N2LO0r3k0on7j8K0N4r
$$ -52 -111 -49 27 0 6 20 48 40 -26 -96 -101 -34 -25 25 62 88 59 -36 -48 -28 -57 -57 2 54 57 117 24 4 -2 -59 -77 -57 -3 -12
7105a2N2L5J0p4Qn2j7L3OK2J4N5l6kj7p2k7K0mR6l1J0P2o8L9j22J8k7M3M7kK1
$$ -12 40 75 85 11 19 -33 -50 -17 -11 11 25 80 44 42 25 -47 -74 -54 -58 38 7 17 89 21 60 -62 -44 -71 -28 19 17 38
7137C8k7k0O1m7m5n7L0J15p5J7J36p5Mn8j9q5J11l5O0M1K1r4M3k0q2L0KL8kL9
$$ 38 11 -9 52 5 -40 -97 -67 48 -27 -10 126 51 55 -3 -22 -107 4 -31 29 70 91 -3 40 20 -62 -32 -30 8 6 45
7167D5oNl1r0L9lq1R9K9N6j5K0l6pl9o3K4N9l5Q0MM8n9n0Qm7k9N9oM4O9Kp8k0
$$ 45 39 44 13 -77 -38 -41 -122 -23 6 62 47 67 31 24 -15 -78 -54 5 -30 50 54 102 43 -7 1 -46 -75 -16 -22 22 91 93 15 -5
7201eK1q1J2k1N8J18m0pK9j11k5k6LO1qON3QLj3n9j3m7N4m9M0Q2l7P9l9k8o0n2
$$ -5 16 -65 -53 -74 -16 102 62 55 84 -27 -52 -78 -75 -14 -22 -16 37 45 48 35 -24 -37 -84 -30 -79 -39 43 6 85 46 18 -42 -94
7234i4L7P4L3oN3o9P7j01m9j9NO9l6M7M4p7O2j04K5o9R4k0RK5K4L7l3n9M0j2p9
$$ -94 -57 17 50 44 97 28 105 4 -45 -64 -59 10 -26 21 65 -12 50 -54 -29 -98 -4 -24 -15 10 34 71 38 -21 19 7 -72
7265g2O9k0Q4m2K1k3k9n1M7l8M7lO2j8J6Pk6k0m3mnJ7oP6j4k6K1J8m5n7rj6R5
$$ -72 -3 -23 61 19 40 17 -12 -63 -16 -54 -7 -10 52 34 50 57 31 11 -32 -36 -41 -24 -30 46 32 6 27 45 0 -57 -66 -82 13
7298A3L1qJ5m0qk5M5j14M5O3MM8ko7O4j08M1j8j9RO9JM4k1k5q4j7nP2m6M1L2L0
$$ 13 44 36 51 11 3 -22 23 -91 -46 17 21 69 67 0 64 -44 -3 -21 -40 -31 38 39 83 62 37 -47 -64 -69 3 -43 -2 30 60
7331F0Qn7l4J1J1m9J7K9J1N2J4n1p9Nj8QM9J6Q0q8Q2l6q4N5j01J1M7K4J01k5Q
$$ 60 68 11 -23 -12 -1 -50 -33 -4 7 59 73 22 -57 -52 -70 -62 -13 3 83 -5 77 41 -43 12 -89 -78 -31 -7 94 69 77
7362G7j7p5n5J3QL6M9K3k3j6mm6kr9J16l8L7M5M0l3kJ2n1n2M9nm3J18j9M7j03
$$ 77 60 -15 -70 -57 -49 -13 36 59 36 20 16 -30 -32 -131 -15 -53 -16 29 69 36 34 46 -5 -57 -8 -13 -56 62 43 90 -13
7393a3n0M9j9JNL7%O7o6J3k2J0o3L1k3R8m0J0pO0m6p2qpOJ6L9O4j4l7kp7K0m4
$$ -13 -63 -14 -33 -32 -27 10 10 77 11 24 2 12 -51 -20 -43 55 15 25 18 78 32 -40 -48 -55 -49 -33 6 70 56 19 17 -60 -40 -84
7427h4K3j0R1m4K8O5m7n7l7O3Oj1K1L7K0o7K9Nk4j2%j0M9mL1jJ8p3j16P2L9o3
$$ -84 -61 -71 20 -24 4 69 22 -35 -72 -9 -3 -14 7 44 64 -3 26 31 7 -5 -5 -15 34 30 61 60 78 5 -111 -39 0 -63
7459f3K5N9M4oqk8n1l7mR9k5K2j5M1Pj7j03k6M7l0J04j4o2Q3kp8N5p1J7j4L0K7
$$ -63 -38 21 65 59 51 23 -28 -65 -69 30 5 27 12 53 60 43 -60 -86 -39 -69 35 21 -41 42 40 -38 17 -54 -37 -51 -21 6
7491FO4J6nm7o7mp4N7O8L5LK3qj2j12k6j3J3Q0j1L5L4jr7J1K5p3M1l1N1O6L6l7
$$ 6 70 86 81 34 -33 -37 -111 -54 14 49 52 75 67 55 -57 -83 -96 -83 -3 -14 21 55 54 -43 -32 -7 -80 -39 -70 -19 47 83 46
7524D6l2o0J7j9k2L2M3M2l5K5Pko7k7QJ8KJ20k0l1L6r9m1J3Nk7O2N7JQjo1l1j1
$$ 46 14 -46 -29 -48 -70 -38 5 47 12 37 44 42 -25 -52 -44 -26 -24 96 76 45 81 -18 -59 -46 -41 -68 -6 51 52 60 59 -2 -33 -44
7558d4n4P7mL5N5q5M1k7mn2l7j2J25M5l8K0oo0L0%m6m2N5K7K4N1l9onp9j4K1j2
$$ -44 -98 -21 -25 10 65 -20 21 -6 -10 -62 -99 -111 14 59 21 41 35 -25 5 5 -41 -83 -28 -1 23 74 35 29 24 -55 -69 -48 -60
7591f0R7m6L8L3J5j03k1OJ1M4m4O1M8m9K4j4j14PJ5J7J5L0K0M3k5m7Nk3k7J1L
$$ -60 37 -9 29 62 77 -26 -47 -41 -30 14 -30 31 79 30 54 40 -74 -67 -52 -35 -20 10 30 73 48 1 6 -17 -44 -33 -30
7622c0N5M4k6LOp9l0pK3l3N0J8O7J6p3l1%l1m5J04M7l1L2J0l7o1proK7K9J08k7
$$ -30 25 69 43 46 52 -27 -57 -64 -41 -74 -24 -6 61 77 4 -27 -27 -58 -103 1 48 17 49 59 22 -39 -46 -55 -61 -34 -5 103 76
7655G6k0l5j4j2m0k3M7L2J8L4K4j00J0k5J0l5K2M2PN0ok3Oq5l2JO9k0L4J1Kk3
$$ 76 56 21 7 -5 -45 -68 -21 11 29 63 87 -13 -3 -28 -18 -53 -31 11 18 68 62 39 45 -40 -72 -71 -2 -22 12 23 25 2
7687Bk1j1Lk8J1k8J15J3Mk6k2j8l4J4kL7K1M7m4M5l9%j63N4N9kO7m3K4K8o7m1
$$ 2 -19 -30 -27 -55 -44 -72 43 56 60 34 12 -6 -40 -26 -28 9 30 77 33 78 39 39 -124 -70 -11 -13 54 11 35 63 -4 -45
7719d5Nj1Kj8O5N2ol0j1jo9lQO1j1J9M9K9n2p8P1q4QJ5NM4N8j6rl9l8l9J3L8k6
$$ -45 -40 -51 -49 -67 -2 50 44 14 3 2 -67 -70 -62 -1 -12 7 56 85 33 -45 26 -58 -50 -35 -30 14 72 56 47 8 -30 -69 -56 -18 -44
7754d4O4nJ05l1p4L7q5l4K5N2oK6N7p7%k3p3P5n6L5J0M5J8L0n7m6kl7k1O7M9J3
$$ -44 20 15 120 89 15 52 -33 -67 -42 10 4 30 87 10 10 -13 -86 -11 -67 -32 -22 23 41 71 14 -32 -34 -71 -92 -25 24 37
7786C7M7j33N9Ro7L6m2K8O9K0j4Rm8m2qk3oL9j3N0jQ3n4Qr7J0K4m8K0J8P5j9k
$$ 37 84 -49 10 19 -48 -12 -54 -26 43 63 49 58 10 -32 -40 -63 -69 -30 -43 7 6 89 35 43 -54 -44 -20 -68 -48 -30 45 26 24
7819B4nk7l1J0R%N3J6K1j10R7o8n1N0J2n0P0J8rK1k8j2p5l7R2n4L1N6k4L5k1l8
$$ 24 19 -8 -39 -29 -20 -20 33 49 70 -40 57 -11 -62 -12 0 -50 20 38 29 50 22 10 -65 -102 -10 -64 -33 23 -1 34 13 -25
7851b5k0j7o0Q2KK3M0pLL3p3j8o4J03J0m1O6k9N7o5J4m9l2M7n3Q8K6K5j5k8Qk3
$$ -25 -45 -62 -122 -40 -38 -15 25 18 21 54 -19 -37 -101 2 12 -29 37 8 65 0 14 -35 -67 -20 -73 15 41 66 51 23 31 8
7883Ho4k8LO2O1L0o6L5j4r6K1R%NK1N3k1N4q9J4o3k7N7L6Q1m8K4K2k5k5p1J3l8
$$ 8 -56 -84 -81 -19 42 72 6 41 27 -69 -48 -39 -39 -34 -13 40 19 73 -16 -2 -65 -92 -35 1 82 34 58 80 55 30 -41 -28 -66
7916f6Q8K6K2k1N0n1p6l0j4O9J4ML0M3m1Qp6j8L7j8jKJ4O4k6k6n7O0o9RQL5N4
$$ -66 22 48 70 49 99 48 -28 -58 -72 -3 11 15 45 88 47 55 -21 -39 -2 -20 -21 -19 -5 59 33 7 -50 10 -59 -50 -42 -7 47
7949D7Qnj7%l8m4L6l3O9M2k4k6L1m4M4j10N0KJN5J9m1Jj5n3j1l7M4M4n6R5J7L6
$$ 47 55 50 33 33 -5 -49 -13 -46 23 65 41 15 46 2 46 -64 -14 -12 -11 44 63 22 23 8 -45 -56 -93 -49 -5 -61 34 51 87
7982H7j18O4o0o1J1M7N3L4k1J5nq0k6j9K1j9O5N1M7qk9n9j8km4Q7lkP7j2j9o3
$$ 87 -31 33 -27 -88 -77 -30 23 57 36 51 46 -34 -60 -79 -58 -77 -12 39 86 78 49 -10 -28 -30 -74 13 10 8 85 73 54 -9
8014im6M0m8K2J8Q7m4K6Nk8n1m1L4JK6M2m3N7K1l3m1p2L8K4KJ0P2o8N8k5j16K1
$$ -9 -55 -15 -63 -41 -23 64 20 46 51 23 -28 -69 -35 -34 -8 34 -9 48 69 36 -5 -77 -39 -15 -13 -3 69 1 59 34 -82 -61
8046f1K8K5mkjM8m7N4k3n0k4J2KO6l7J3Qj4%m8mk9J06L3l0mN5n4j8ko6Q3k1JL3
$$ -61 -33 -8 -12 -14 -15 33 -14 40 17 -33 -57 -45 -43 23 -14 -1 7 -7 -7 -55 -59 -88 18 51 21 17 72 18 0 -2 -68 15 -6 -5 28
8081B8J3L9m8m1L2o7LL8pL2K1L6K0r0j9l0j1j4N1k8k5J3J05n9j8Pp1J15p1K0P4
$$ 28 41 80 32 -9 23 -44 -41 -3 -10 22 43 79 99 9 -10 -40 -51 -65 -14 -42 -67 -54 51 -8 -26 -19 -90 25 -46 -26 48
8112D8J1j3K7j02Oj5L1J6l2Q3k0j2J9m0j3m1j7Q5J7Ko%Pl8n3m3N4%K9j4O6O2o6
$$ 48 59 46 73 -29 -23 -38 -7 9 -23 60 40 28 47 7 -6 -47 -64 21 38 40 34 34 41 3 -50 -93 -39 -39 -10 -24 42 104 38
8145C8l6n3o0Q5m2O7N3n3K3k4K5j4l0M3j02O5M6l8mN3pk7Kn1LM3J8KJ5M3m2m9
$$ 38 2 -51 -111 -26 -68 -1 52 -1 22 -2 23 9 -21 22 -80 -15 31 -7 -11 42 35 8 10 -41 -38 5 23 25 40 83 41 -8
8177hL3j26O0N5kK6M3j05j0J6j8j6N7m6
$$ -8 25 -101 -41 14 12 38 81 -24 -34 -18 -36 -52 5 -41
8191d1
$$ Imaginary data points
##PAGE= N=2
##DATA TABLE= (X++(I..I)), XYDATA
0@%%%%%%%%%%%%%%jMj1J6j6J6j8K6l2L4m2N0n6O4p5Q7r8J12j28J46j65J84k07
$$ 0 0 0 0 0 0 0 0 0 0 0 0 0 0 0 -1 3 -8 8 -8 8 -10 16 -16 18 -24 26 -30 34 -41 46 -52 60 -68 78 -87 97 -110
37a10K33k62K91l21L59m01M44m90N41o00O63p29Q04q85R74j075J186j308J446
$$ -110 123 -139 152 -169 190 -211 233 -257 284 -316 347 -382 422 -463 511 -564 622 -686 760
56G60j603J783j992K236k530K888l332L905m679N785p513J0612j7938O9728O5771
$$ 760 -843 940 -1052 1184 -1346 1542 -1790 2115 -2564 3221 -4292 6320 -11618 58110 123881
71A23881o2863m7240n7150j9128J540L6358M1840M4329K0150k754l4256m7317
$$ 123881 61018 13778 -43372 -62500 -60960 -24602 17238 61567 81717 78963 44707 -2610
83b610n0730k9681k936K9570M6004M8419K8670J133k9569m6439m8144l0152l260
$$ -2610 -53340 -83021 -85957 -56387 -10383 38036 66706 67839 38270 -8169 -56313 -86465 -89725
96h9725K5617M2431M4334K8832M957k0795l7035m0827k9278p837J7609L7274M4587
$$ -89725 -64108 -21677 22657 51489 56446 35651 -1384 -42211 -71489 -79326 -61717 -24443 20144
109B0144L5613J3633j3656l4832m1992l1969r713J6008L4555L9773L0730J1076
$$ 20144 55757 69390 55734 20902 -21090 -53059 -62772 -46764 -12209 27564 58294 69370
121F9370j1771k9944l7375l1730j4785P509K6969L6399L2551J6381n871k5941
$$ 69370 57599 27655 -9720 -41450 -56235 -48726 -21757 14642 47193 63574 57703 31762
133C1762l6301l3222j7778M227K4256L4730L2001J7166l724k2805l2697l0407
$$ 31762 -4539 -37761 -55539 -51312 -27056 7674 39675 56841 53117 30312 -2385 -32792
145c2792j7363J443J9195K9810K9884J9233J488j7062k9593l1305k1343l164J5935
$$ -32792 -50155 -48712 -29517 293 30177 49410 50898 33836 4243 -27062 -48405 -51569 -35634
158c5634K8948L0739K0923L468j4838k7024k8977k0134m253J2843K4800K7468
$$ -35634 -6686 24053 44976 48444 33606 6582 -22395 -42529 -46782 -33939 -9139 18329
170A8329K0322N888j0559k3173k7477k1995q367Q211K2007K7303K2570R035p818
$$ 18329 38651 44539 33980 10807 -16670 -38665 -47032 -38821 -16814 10489 33059 42094 34276
183C4276k1556k6602k1692q719P108J9836K5010K1236R858m541j7132k3369k1130
$$ 34276 12720 -13882 -35574 -44293 -37185 -17349 7661 28897 38755 34214 17082 -6287 -27417
196b7417j1203L103J6238K3452K2115J2531j732j5226k2802k1724j2477J468J4676
$$ -27417 -38620 -35517 -19279 4173 26288 38819 37087 21861 -941 -22665 -35142 -33674 -18998
209a8998K2080K1200J2643k86j2758k0263k0226j3223j440J0681J8841K0207J4080
$$ -18998 3082 24282 36925 36639 23881 3618 -16608 -29831 -31271 -20590 -1749 18458 32538
222C2538K471j0166j9167k0770j4973l365R217J7983J9702J4113L305q554j7075
$$ 32538 35009 24843 5676 -15094 -30067 -33432 -24215 -6232 13470 27583 30888 22334 5259
235E259j9347j4641m743O677J5702J8693J5043N797n435j4666j8327j5249o430
$$ 5259 -14088 -28729 -33472 -26795 -11093 7600 22643 28440 23005 8339 -9988 -25237 -31667
248c1667M803J4269J8249J5594P021l848j3289j7276j4960o888L566J2537J6983
$$ -31667 -26864 -12595 5654 21248 28269 24421 11132 -6144 -21104 -27992 -24426 -11889 5094
261E094J5374Q334j705j0918j6053j5353q832J009J0332J5894J5289R145m50r822
$$ 5094 20468 28802 27097 16179 126 -15227 -24059 -23050 -12718 3176 18465 27610 27160 17338
275A7338j5522j5390r620m67Q704J4382J4825R604R17q017j4015j4971j0394k109
$$ 17338 1816 -13574 -23194 -23661 -14957 -575 14250 23854 24771 16754 2739 -12232 -22626 -24735
289b4735O957J3257J4542J0451K445o499j2943j4662j0977l257N547J2270J4156
$$ -24735 -17778 -4521 10021 20472 22917 16418 3475 -11187 -22164 -25421 -19874 -7604 6552
302F552J1161L840m685j1424j3854j1179m265M171J1026J3704J1397N026l326
$$ 6552 17713 21553 16868 5444 -8410 -19589 -23854 -19683 -8657 5047 16444 21470 18144
315A8144j0157j3186j1328n225K752R804J3032J1723O119j860q962j2649j1593
$$ 18144 7987 -5199 -16527 -21752 -19000 -9196 3836 15559 21678 19818 10856 -1793 -13386
328a3386o300J356Q494J2436J1704O774p23p855j1919j1566o969J49P132J1286
$$ -13386 -19686 -18330 -9836 2600 14304 21078 20355 12500 581 -10985 -17954 -17805 -10673 613
342F13J1430P324N12o508j0987j1646p971j300N758J0689J1435Q021J410n597
$$ 613 12043 19367 19879 13371 2384 -9262 -17233 -18533 -12775 -2086 9349 17370 18780 13183
356A3183j0541j1437q172j915M793R672J0923Q288K658m059r126j0872q772l224
$$ 13183 2642 -8795 -16967 -18882 -14089 -4417 6506 14794 17452 13393 4267 -6605 -15377 -18601
370a8601L445Q876J0912Q911L640l020q553j0852q869l746K737Q201J0481Q850
$$ -18601 -15156 -6280 4632 13543 17183 14163 5610 -5242 -14111 -17857 -15120 -6919 3562 12412
384A2412M171k066p406r807q912m671J282O733R804R335N394o67o567r867r428
$$ 12412 16583 14517 7111 -2696 -11608 -16279 -14997 -8264 1540 10875 16269 15602 9035 -832 -10260
399a0260n459O23O481R603R115N300k16n730q865q939n750n66M821Q561R015O376
$$ -10260 -15719 -15096 -8615 988 10103 15403 15187 9457 592 -8347 -14097 -14663 -9842 -1281 7734 14110
415A4110J181m460q511r348o692j495M266Q434R261O672J587m067q011q906o516
$$ 14110 15291 10831 2320 -7028 -13720 -15215 -10949 -2515 6746 13418 15005 10938 2927 -5979 -12495
430a2495j852L305P218Q593O850K661k457o854q684p403l287K211O975R011P596
$$ -12495 -14347 -11042 -3824 4769 11619 14280 11823 4969 -3715 -11118 -14405 -12194 -5219 3792 11388
445A1388L350k285o765q650p333l364J806O043Q065P128L752j016n475p897p663
$$ 11388 14738 12453 5688 -2962 -10295 -13659 -11853 -5810 2255 9383 13135 12119 6644 -1253 -8916
460h916m417L66N139Q066P984M714k67n176q122p866m723J10M885P668P623M779
$$ -8916 -13333 -12967 -7828 238 8222 12936 12669 7493 -629 -8495 -13218 -13108 -8223 -555 7068 11847
476A1847L43m090o992p370n119j071L600O902P829N854J555l370p066q117o001
$$ 11847 12190 8100 1108 -6262 -11381 -12452 -8852 -1950 5879 11733 13288 9918 2852 -5265 -11266
491a1266j619L406O926P824N578J631k912o292p253n870k371K075N544P212O221
$$ -11266 -12885 -9479 -2553 5271 10849 12480 9568 3276 -3977 -9847 -12218 -10143 -4599 2613 8834
506H834K953j606n729p599o733l219J623N753P660O593L167j362n282p102o231
$$ 8834 11787 10181 4452 -3147 -9880 -13099 -11476 -5723 1937 8530 11697 10335 5053 -2049 -8280
521h280l246R76M792O826O524L889m6m064o683o784m403j66M107O854P148M480
$$ -8280 -11526 -10550 -5758 1068 7592 11481 11435 7371 688 -6096 -10499 -10665 -6558 296 7444 11924
537A1924J82m144o824o794m369k88L565O023O465M338R63l034n930o680n195j762
$$ 11924 12106 7962 1138 -5656 -10025 -10313 -6748 -725 5740 10078 11041 8007 2077 -4603 -9798 -11560
553a1560K487N885O966N452J713k682n954o819n315j778K420N576O521N248K095
$$ -11560 -9073 -3188 3778 9230 10943 8261 2307 -4512 -9827 -11605 -9185 -3609 2912 8160 10255
568A0255j983n036o213n377k525J435M697O534N724L083j038m650o586o047l099
$$ 10255 8272 3236 -2977 -8354 -10879 -9444 -4747 1787 7511 10594 9556 4906 -1680 -7727 -10826
583a0826J079M751O461N819K909q33m266n883n574l297K45L598N804N897L830
$$ -10826 -9747 -4996 1465 7284 10193 9360 5094 -789 -6363 -9660 -9415 -5817 -13 5884 9714
598I714L54l458n948o150m066k72L445N860O195L964M54l172n632n875m056p68
$$ 9714 10068 6610 662 -5488 -9554 -9826 -6381 -521 5674 9638 10092 6920 1288 -4587 -8643 -9411
614i411K731N226N784M309J284k245m988n930m734j695K087M934O075M879J701
$$ -9411 -6680 -1454 4330 8639 9923 7678 2690 -3240 -7974 -9669 -7582 -2648 3427 8306 10007
629A0007k158m934o034m665j762J682M558N577M694K136j164m039n610n076k606
$$ 10007 7849 2915 -3119 -7784 -9546 -7864 -3306 2271 6965 9101 7937 3898 -1712 -6788 -9394
644i394Q29M029N759N173K771q03l987n658n228k806O31L759N478N053K878k21
$$ -9394 -8565 -4536 1223 6396 9167 8364 4377 -1281 -6509 -9315 -8684 -4925 553 5606 8484 8263
660H263l422n075n120l204j54L091M997N331L451M36k886n060n312l678m07K775
$$ 8263 4841 -234 -5354 -8558 -8712 -5621 -624 4707 8158 8594 5708 648 -4664 -8342 -8749 -5974
676e974N032N320L573O57k515m642n078l685j027K151M430N139L886J358j839
$$ -5974 -942 4378 7951 8608 6093 1451 -3627 -7312 -8339 -6188 -1758 3381 7267 8625 6786
691F786m384n154m170j494J708M275N182M146J574j515m055n034m175j764J258
$$ 6786 2402 -2752 -6922 -8416 -6708 -2433 2749 6895 8469 6954 2899 -2135 -6310 -8074 -6816
706f816L708M841M205K027q53l525m925m388k265O68L458M860M521K495o05l199
$$ -6816 -3108 1733 5938 7965 7112 3587 -1338 -5726 -7991 -7323 -3865 995 5516 8011 7406 4207
722D207m742m480k578L27L000M561M434K589k9k740m422m513k845k43K483M424
$$ 4207 -535 -5015 -7593 -7266 -4266 295 4729 7318 7289 4549 127 -4386 -7231 -7474 -4991 -567
738e67M549K994L64k415m238m545l118n90K172M107M481L238Q79k009l848m473
$$ -567 3982 6976 7340 4925 687 -3858 -6976 -7566 -5394 -1287 3194 6432 7311 5302 1454 -3019
754c019l336j035J717L735M475L424J325j493l568m406l553j360J252L467M405
$$ -3019 -6355 -7390 -5673 -1938 2537 5961 7286 5793 2225 -2181 -5734 -7094 -5842 -2375 2030
769B030L544J600j093l276m278l720j802R68L057M228L762J975p34k915m120l840
$$ 2030 5574 7174 6081 2805 -1473 -5193 -6995 -6027 -2970 1258 5020 6995 6261 3346 -774 -4614
785d614j985L19K754L968L855K099j91k478l979l820k409J66K271L886L933K386
$$ -4614 -6599 -6280 -3526 442 4297 6396 6205 3727 -252 -4072 -6481 -6315 -4044 -158 3775 6161
801F161J69k225l714l823k614l22K004L572L826K712N91j778l445l802k857o56
$$ 6161 6330 4105 391 -3432 -6046 -6368 -4364 -792 3034 5746 6337 4559 1114 -2688 -5545 -6201
817f201J530L272L940K871J013j525l135l910k971j002J313L044L753K920J225
$$ -6201 -4671 -1399 2541 5412 6425 4900 1765 -2145 -5116 -6118 -4805 -1761 1992 4912 6137
832F137j068k840l682l080j419P68K671L676L263J525o77k605l711l249j649N22
$$ 6137 5069 2229 -1453 -4533 -5952 -5184 -2513 1163 4426 5951 5274 2669 -1042 -4291 -5940 -5418
848e418K514L472L297J748m07k274l456l173j865R2K013L372L345K076J14j868
$$ -5418 -2904 568 3865 5613 5206 2932 -524 -3697 -5562 -5470 -3457 -85 3260 5336 5450 3582
864C582l334l452k170j76J896L264L425K175K77j719l037l370k224m75J419K923
$$ 3582 248 -3204 -5374 -5550 -3654 -390 3035 5210 5487 3768 731 -2639 -4863 -5338 -3919 -996
880i96L285K459O74j183k861l390k626q64J175K731L397K655R88j061k676l307
$$ -996 2289 4748 5422 4239 1378 -2012 -4638 -5502 -4327 -1596 1801 4456 5444 4383 1707 -1600
896a600k628j065R05K496L229K596J270o42k196l139k827j466L57K213L247L011
$$ -1600 -4228 -5293 -4388 -1892 1337 3933 5203 4561 2365 -774 -3601 -5067 -4710 -2497 750 3761
912C761J553l70k190l155k976j582K79J986K994K810J640n9j691k905k890j871
$$ 3761 5314 4944 2754 -401 -3377 -4959 -4680 -2694 300 3110 4750 4691 3000 95 -2795 -4666
928d666k27J547K820L087K015K93j528k839l077k124l57J506K693L042K116M64
$$ -4666 -4893 -3346 -526 2561 4576 4869 3341 502 -2575 -4699 -5056 -3550 -857 2185 4301 4765
944D765j279k496k973k087p16R62K362K961K369R39r15k234l114k374j050P42
$$ 4765 3486 990 -1983 -4070 -4786 -3824 -1462 1499 3868 4807 3892 1658 -1456 -3830 -4880 -4138
960d138K365L031K444R67p26k165k863k318j155M33J924K719K585J407l02j804
$$ -4138 -1773 1258 3702 4669 3943 1778 -1085 -3403 -4558 -4125 -2201 518 3103 4510 4208 2404
976B404k696k678j510J48J748K862K658J594k9j762k611k604j575j5J435K570
$$ 2404 -292 -2970 -4480 -4332 -2584 278 2936 4530 4501 2739 128 -2476 -4051 -4066 -2631 -61
992f1K595J623K94j303k372k745j808n33J159K364K772K008M79j155k410k775
$$ -61 2534 4157 4451 3148 776 -1969 -3777 -4310 -3151 -787 1985 3993 4472 3317 907 -1868
1008a868k006n84J088K215K534J925P33p74k020k528k097r59N39J973K582K304
$$ -1868 -3874 -4458 -3370 -1155 1379 3304 4037 3263 1243 -1285 -3382 -4341 -3802 -1829 753 3057
1024C057J187n31j896k645k321j063N05J802K603K262J121l32j640k400k242j240
$$ 3057 4244 3713 1817 -828 -3149 -4212 -3707 -1905 698 2960 4081 3749 2109 -291 -2533 -3773
1040c773P1J419K328K328J461Q8j374k431k392j594k16J419K356K383J574R6j187
$$ -3773 -3702 -2283 45 2373 3834 3922 2548 117 -2275 -3869 -4085 -2666 -310 2073 3647 3743 2556
1057B556k216k318j559l41J052J922K377J707O02q55j910k360j936o52Q40J983
$$ 2556 340 -1978 -3537 -3878 -2826 -904 1473 3180 3782 2927 1017 -1343 -3279 -3931 -3091 -1108
1073a108K449J885P34p53j865k282j912p27N59J768K185J973Q39l64j523k208
$$ -1108 1341 3226 3960 3207 1342 -940 -2852 -3579 -3020 -1252 933 2906 3745 3381 1858 -350
1089c50k114j049K05J502K253K144J150k09j539k258k145j169J78J316K146J974
$$ -350 -2464 -3513 -3308 -1806 447 2591 3741 3532 1993 -265 -2410 -3579 -3401 -2085 61 2035
1105B035J301m4j204j984k093j413j81J059K012K120J558K94j092j984k185j505
$$ 2035 3336 3292 2088 104 -1989 -3402 -3583 -2524 -512 1608 3166 3460 2368 384 -1801 -3306
1121c306l16R57J859K172J561M27p69j814k054j600n57O55J649K132J749P35n67
$$ -3306 -3622 -2665 -806 1366 2927 3354 2585 771 -1283 -2883 -3440 -2785 -1136 996 2745 3480 2913
1138B913j613k132j767r09O22J572K076J874Q32m11j481k044j833r12K41J387
$$ 2913 1300 -832 -2599 -3508 -2886 -1314 762 2636 3468 3057 1576 -468 -2301 -3213 -2972 -1585
1154a585J923J858J048j54j248j973j918j094L4J171J959J915J201%j091j875
$$ -1585 338 2196 3244 3090 1842 -131 -2049 -3143 -3109 -1938 21 1936 3137 3137 2046 171
1170A71j961j221j22J018J777J923J288K59r29j630j941j395m33Q15J687J969
$$ 171 -1790 -3011 -3133 -2115 -338 1585 2873 3132 2203 573 -1368 -2763 -3196 -2381 -694 1275
1186A275J450M20p42j540j979j488n06O21J553J902J414P07n85j468j820j597
$$ 1275 2725 3145 2403 863 -1116 -2604 -3110 -2489 -936 966 2380 3087 2502 1034 -786 -2383
1202b383o54L81J394J833J609P74k59j371j785j763p63K14J260J807J653Q76j07
$$ -2383 -3037 -2656 -1262 571 2180 2954 2695 1324 -461 -2224 -2987 -2773 -1513 294 1947 2823 2716
1219B716j152j730j682r64M2J084J769J638J048P5r92j664j717j113r3Q54J628
$$ 2716 1564 -166 -1848 -2812 -2770 -1686 83 1721 2769 2844 1852 188 -1529 -2642 -2735 -1881 -253
1236b53J668J176K19q30j517j707j241k69P55J437J709J226L70n92j506j668j314
$$ -253 1415 2591 2810 1980 463 -1244 -2485 -2754 -1999 -562 1147 2373 2743 2151 645 -1023 -2337
1253b337l92N16J402J640J326N62n50j239j643j426n07L47J260J570J396O90l26
$$ -2337 -2729 -2213 -811 829 2155 2717 2167 928 -715 -2141 -2648 -2301 -1041 529 1925 2615 2289
1270B289j091j618j480o73K74J102J457J552P55j94j015j473j450q27P2R22J582
$$ 2289 1198 -420 -1900 -2573 -2299 -1197 260 1812 2567 2373 1358 -115 -1565 -2392 -2320 -1398 184
1287A84J445Q38jr12j460j445r40m5Q14J421J472R38R3o77j361j489j017k13O18
$$ 184 1629 2467 2466 1554 94 -1351 -2291 -2336 -1522 -101 1371 2309 2402 1725 364 -1125 -2142 -2355 -1737
1306a737J283J468J048L01n64j268j520j066l32M28J256J434J104M43n00j100
$$ -1737 -454 1014 2062 2363 1799 531 -989 -2055 -2387 -1959 -703 731 1835 2278 1778 678
1322F78j444j122m46L90J056J408J155N70k94j033j380j225o53K56J041J373J205
$$ 678 -766 -1888 -2334 -1944 -888 520 1675 2245 1951 918 -462 -1687 -2340 -2084 -1043 330 1535
1339A535O11j73r23j336j184o68J16Q88J223J264P22l0p14j201j323q13m4P26
$$ 1535 2146 1973 1050 -286 -1470 -2138 -2022 -1134 89 1353 2075 2045 1331 130 -1193 -2006 -2050 -1324
1357a324J253J334P69J31o83j170j291q13j66O02J179J251P85K24n08j116j175
$$ -1324 -71 1263 2032 2163 1480 310 -981 -1794 -1960 -1358 -179 1072 1857 2081 1573 457 -718
1374g18r45l28M28J048J240R90L60m92j005j213j038l69L41J009J101R80M60k94
$$ -718 -1663 -1991 -1563 -515 725 1715 2075 1583 578 -635 -1673 -2042 -1701 -692 409 1389 1849 1555
1392A555r01j142j068m84K41Q45J106J198N16j73p61j242j053n41N9Q44J130J030
$$ 1555 654 -488 -1556 -2040 -1799 -954 152 1350 1866 1693 932 -310 -1363 -1904 -1845 -1001 129 1159
1410A159O51m7p27j086j033o05k7O26J019J117P20P5n79j003j152p65r6M94J081
$$ 1159 1810 1763 1036 -50 -1083 -1688 -1715 -1089 -70 1047 1767 1842 1263 260 -892 -1657 -1753 -1259 -178
1429a78J076Q13J37n30r74j090q06j78L97R10J028Q33L45l39q79j119q46l29K27
$$ -178 898 1711 1848 1318 344 -746 -1552 -1730 -1333 -423 605 1438 1783 1444 565 -554 -1400 -1729 -1502
1448a502Q97J083R34M15k74q87j092r39l25K28Q21J002Q56M54j38o82j061r17
$$ -1502 -605 478 1412 1827 1553 666 -426 -1365 -1690 -1462 -641 361 1217 1671 1533 851 -210 -1127
1466a127n42Q4O02J074R76N61o0o77j033r92n54K3O83R44R48N65J07n91r55r55
$$ -1127 -1669 -1585 -983 91 1067 1628 1568 891 -142 -1134 -1688 -1665 -982 -38 910 1475 1582 991 36 -919
1486i19o14q7N29Q71J020P02J77m49r62r48p48k02M64R35R90P20J92m31p48j006
$$ -919 -1533 -1620 -1091 -220 800 1502 1679 1230 268 -680 -1428 -1630 -1166 -231 759 1479 1671 1240 492 -514
1506e14p58k35L02P87J007O97L77k97p67r63q71l33J62P96J005P82L96k30p02
$$ -514 -1272 -1507 -1205 -418 589 1286 1663 1366 599 -364 -1235 -1568 -1406 -610 395 1177 1573 1343 641
1525F41r52q39m38J86P27Q46Q43M79j46o32r16q54n37L6N77R95R25N64m4n61r81
$$ 641 -311 -1150 -1588 -1402 -675 171 1014 1493 1347 715 -201 -1055 -1592 -1556 -979 16 941 1505 1461 900 -81
1546h1q30n59M9N01Q33R14N37J41n36p84r20n94j15M33P97R26P09J15l29q62r31
$$ -81 -911 -1470 -1421 -920 -87 827 1364 1505 969 185 -735 -1329 -1444 -1011 -214 712 1421 1536 1207 345 -586
1567e86o73j47M00O96R34P46J30k72q06p85p06m29K52P64Q99O94M00k49o54r52
$$ -586 -1259 -1406 -1006 -310 624 1370 1500 1228 422 -363 -1069 -1498 -1246 -482 417 1111 1511 1262 608 -344
1587c44p59l87J72O62Q99P24M08j44n94q90p98l70P4N14Q80Q02N44m5n31q62q97
$$ -344 -1103 -1490 -1318 -656 243 967 1375 1231 637 -253 -1051 -1421 -1347 -833 47 849 1393 1348 817 -45 -942
1608i42m93K0M87Q66Q67N16M2n18p53q12n27j18L38Q26R31N31J64l74p64q63o55
$$ -942 -1435 -1415 -928 -62 805 1321 1363 845 92 -720 -1247 -1365 -1027 -201 730 1261 1425 1051 287 -576 -1231
1629a231k35M44O30R82O47K14k74p60p69p30k47K06P71P86P79K27k39o16q33p55
$$ -1231 -1466 -1022 -392 590 1237 1451 1177 417 -352 -1082 -1329 -1123 -352 434 1213 1440 1201 585 -248 -1003
1649a003l38J88N61Q53P13M10j20o12q84p12l95R2N04Q33P56M62k3n11q14q07
$$ -1003 -1341 -1153 -592 261 974 1384 1264 652 -232 -944 -1339 -1247 -743 90 846 1308 1285 774 -40 -847
1669h47m88rM79P91P61N52O7m27p45q69n57p2M11P41Q40N03J89l81p25q21n97
$$ -847 -1335 -1344 -865 -74 687 1239 1306 879 134 -735 -1292 -1364 -953 -212 628 1131 1320 939 214 -607 -1204
1690a204j87L22O58R50N60K40l07o47q22o59j90K17O98P56O91K48j69o71p48p11
$$ -1204 -1391 -1069 -411 539 1099 1339 1032 385 -437 -1096 -1286 -1069 -371 385 1076 1324 1155 484 -264 -975
1710i75l43J64N94Q32P26L33j07n59q16p12l58Q8N05Q23O86L58j0n21p11q07m12
$$ -975 -1318 -1154 -560 272 998 1331 1224 665 -151 -863 -1221 -1133 -628 195 881 1239 1229 708 -3 -810 -1222
1731a222M0M07P47P31N37k2l90p98p16n34k7M37O52P91M81J29l86o75p71m93k09
$$ -1222 -1182 -775 -28 703 1240 1218 828 30 -686 -1220 -1247 -810 -158 633 1114 1243 857 182 -589 -1082 -1291
1752a291L91N99P72N83J90k37o78q30n50k23K53O54P82N55L01k50n98p08o45k82
$$ -1291 -900 -301 471 1054 1244 1007 329 -501 -1051 -1274 -1021 -367 415 970 1271 1021 423 -285 -930 -1212
1772a212J55N85P56O57K83j06n41p30p68l13J19O06O24P60L70j06m78p45p23l59
$$ -1212 -1057 -472 284 941 1224 1118 577 -153 -921 -1234 -1115 -509 115 875 1245 1139 661 -84 -807 -1166
1792a166N1M11P72O93M37jm44p08o46n48l6M12O66P76M73M1l92o45p92m74n6L11
$$ -1166 -1115 -704 68 761 1198 1197 753 45 -601 -1149 -1185 -773 -107 669 1142 1183 791 146 -646 -1120 -1176 -865
1814h65O57P44M75J88k85o56p08n72j88K62O49P26N70K18k52o15p11o13k17K05
$$ -865 -208 536 1011 1199 914 258 -450 -1022 -1210 -948 -299 427 997 1215 963 348 -363 -976 -1193 -988
1834i88O19P12N49K92j79n63o68o42k60R2M80Q00N57L66l2n63o35o77m27J08M34
$$ -988 -369 343 892 1184 1005 442 -226 -868 -1128 -1036 -556 244 801 1167 1135 572 -63 -740 -1167 -1059 -625
1855f25P85O33K99K5m52o84o10m16p2M16O68O40M67K7l07o54o46n34r8L82N73
$$ -625 160 793 1092 1117 665 -19 -629 -1045 -1117 -701 -33 607 1074 1101 794 140 -506 -1040 -1138 -756 -183
1876a83O61N47N4k51o35o98n27o7J91N74P14M94K02k48n11o50n92j79J56N41O55
$$ -183 478 1025 1079 828 193 -505 -1032 -1099 -908 -334 380 874 1076 828 317 -333 -925 -1104 -948 -407 248
1897B48N82L44k85m26o90o25k04J25M85O95M94L30p1m50n47o90l46P3L93O32O37
$$ 248 830 1174 889 463 -227 -852 -1056 -931 -446 249 743 1073 1002 552 5 -685 -1031 -958 -565 67 704
1918G04L77k1m34o00o61l79%M34N87N70M52m3l21n83o12m11j25L19M83P31M77
$$ 704 1081 1060 626 26 -635 -1014 -1014 -580 7 577 1029 986 665 82 -530 -941 -1066 -747 -264 467 944
1939I44Q3j69o08p06m92j36K48N80N87N28J65k10m66o48n20k14J55M99O62M98
$$ 944 1027 858 250 -456 -948 -1084 -836 -256 331 859 1024 814 348 -300 -820 -1034 -879 -380 282 780
1959G80K49j17n19n84n84l01J37M41O21O46K78j14l75p33m68l56L0M37O04N29
$$ 780 1029 912 393 -191 -775 -1076 -939 -498 123 769 1047 933 558 -175 -643 -999 -969 -532 72 601
1979F01L49N3l78n58o60l50n3L46N50O10M19J34l61n63o10m46j28K77O05N77N09
$$ 601 950 1003 625 67 -593 -943 -996 -650 -100 510 929 1063 702 139 -471 -917 -1045 -768 -163 414 923
2000I23P9k74m86n86n00j67K18N32N90N12K19j45n07o74n35k07J24M98O49N07
$$ 923 1002 728 242 -344 -844 -1011 -793 -261 329 841 1060 915 408 -266 -801 -1008 -884 -386 263 770
2020G70K13q3m78n86n03l48J12L99N71N91L39p2l66o38o12l15L6L57N89O01L82
$$ 770 983 900 422 -164 -667 -1015 -903 -504 67 658 997 925 559 -79 -691 -1006 -970 -613 -24 577 959
2041I59l4l60n77n57l06q5K66N59O41L83J20k90n68n90m16j24K70M98O63M13K00
$$ 959 925 565 -12 -569 -875 -960 -694 -135 506 889 1009 719 151 -439 -855 -979 -709 -211 452 865 1065
2062A065l02m60o79l78j79J63N00N57M98J94j49m76n65n27k58R0M94N77N37K88
$$ 1065 763 303 -376 -754 -933 -770 -270 287 785 979 830 354 -211 -738 -996 -906 -412 165 702 990
2082I90j02m60o26m59k55l4M13O16N19L11ql68n71n20l72P3K64N52N64L92K2l08
$$ 990 888 428 -198 -657 -912 -946 -533 83 602 913 905 537 -34 -554 -926 -853 -589 -37 527 919 941 633
2104F33n30n65l84q1K90N41N80L75J12k80n24n78l35j90K30M35O43M16J57j95
$$ 633 103 -462 -846 -927 -637 -96 484 859 971 691 167 -411 -746 -936 -706 -271 372 788 945 750
2124G50n12n56m46j31J13N26N10M55J82l4n16m96n33j98P1M29N40N15K93j34l09
$$ 750 238 -318 -764 -895 -782 -256 254 709 891 857 341 -155 -688 -886 -815 -386 154 669 962 828 519
2145E19o12n09k68L4L90N00N38K58j9l27n06n11k90n8L33M61N27L07R2k96n37
$$ 519 -93 -602 -870 -836 -446 54 592 850 831 504 -2 -513 -803 -861 -528 -67 460 767 859 563 26
2166B6m47m17n6K26N80M80L42J24k18m97n27l15j41J99M58M67M63M5p4m49n45
$$ 26 -421 -838 -894 -668 -88 392 734 858 640 143 -384 -699 -840 -641 -183 284 747 792 718 269 -276
2187b76m42j46J76M29M65M90J13n5l80o06l36k36O9L96M98M66K26o6m25m74m37
$$ -276 -718 -864 -688 -259 206 696 809 754 374 -232 -568 -804 -735 -339 159 625 851 785 360 -114 -551
2208e51k68M9L92M49M75K21J2l23m78m50l19RK56M84M69L41N1k82m52n05k86j02
$$ -551 -819 -770 -378 71 546 767 779 456 -22 -472 -791 -782 -526 -42 427 768 819 537 85 -420 -706 -808
2230h08K23M62N34K92R0k08m22m68m06m6J61L74N47L73Q9k16l25m67m55j34J53
$$ -808 -585 -123 411 703 793 585 163 -305 -711 -757 -596 -222 325 698 787 571 246 -221 -676 -810 -657
2251f57L90M41L88K26j62l51m93m23j11P7L46M72M34J86r4l40m36m13k22N9L22
$$ -657 -267 174 562 788 626 275 -218 -641 -752 -675 -329 143 577 763 669 329 -107 -520 -742 -683 -361
2272c61M08N01K01n0k57m31m74k68KK87M72M56J63P5k51m32m20k98k8J86M24L83
$$ -361 47 548 749 699 442 11 -463 -731 -729 -442 30 486 649 724 473 41 -379 -677 -705 -519 -95 288
2294B88L59O0k33l45m77l59o7K18M40M41K73J22k02l61m32l46j14J82L08M91L37
$$ 288 647 707 474 129 -348 -707 -774 -556 -116 325 598 720 518 157 -275 -621 -735 -553 -245 246 583
2315E83J42j22l40m51l70j47J05L25M56L27J56q4l41l74l43j94M8L15M31L39J71
$$ 583 725 603 263 -188 -558 -705 -600 -275 181 508 664 580 239 -135 -478 -672 -624 -309 122 461 632
2336F32k2k24m91l11k97J7K51M61M50J34L7k69m10l49k93K0K62L69L59K68L3j85
$$ 632 610 386 -105 -416 -713 -696 -445 16 466 600 637 368 -42 -391 -684 -664 -402 -33 326 594 627 442
2358D42l50m06k56o7K02L09M48K87M3j77l40m26k67p3J34L33M29L09mo9l24l98
$$ 442 92 -314 -570 -637 -435 -126 322 609 652 475 135 -291 -558 -631 -497 -164 265 574 570 501 177 -221
2380b21l04j41R3L59L53L85J54j26k50m71l71j34K5L62M20L70J74j81k12l70l41
$$ -221 -525 -666 -573 -214 139 524 678 552 302 -169 -540 -674 -649 -287 133 503 677 496 284 -86 -427
2401d27j96Q0K48M16L37K38q5k36l95m61j88N3K64L86L30K28M2k71l46l90k27
$$ -427 -623 -543 -295 121 458 696 611 375 -20 -481 -669 -616 -352 34 364 592 634 363 17 -373 -600
2422f00k8J65L70L70K95L6j97l26m01k62r4J74L83L88K79J02j77l36l64l24o3
$$ -600 -628 -463 -93 277 572 608 411 85 -316 -578 -672 -498 -115 273 552 654 477 141 -223 -547 -610
2443f10J11L85L52K51J69j40l11l55l38j70N5L35M65L27J42o4l36l74l75j47O7
$$ -610 -499 -114 238 489 658 518 207 -148 -486 -656 -601 -266 199 526 668 604 268 -106 -481 -628 -561
2464e61K75M06L39J78p4k58l72l55k11J2K56L67L50K57L1k74l55l76k11q7K78
$$ -561 -286 120 459 637 563 305 -67 -422 -633 -621 -365 2 352 609 640 366 11 -365 -576 -663 -385
2485c85L39M24K19M2j24m32l84k70k2J49K92M17K99O3j03m44l65k79j30J09M23
$$ -385 -46 378 597 639 515 83 -301 -571 -593 -444 -152 265 564 627 524 80 -285 -564 -694 -585 -162
2506a62L64L48J46j70l49l69l09j85J29L03L59M10J52j07k10m56l74j08k8K60
$$ -162 202 550 696 526 177 -192 -501 -686 -557 -254 105 515 667 560 350 -106 -480 -588 -616 -356
2526c56M14M20J86m5l07l61l61k54O5K25L81L35K73N5k71l17l86k56j15K12M03
$$ -356 58 478 664 619 312 -49 -410 -664 -599 -374 7 342 615 670 399 82 -304 -560 -675 -463 -60
2547f0L88K31J17k25l29l77l48o4J42L88L85L64M6j84k92m40k92j14J22L42M43
$$ -60 328 559 676 451 122 -255 -603 -667 -525 -137 248 612 658 474 182 -258 -550 -664 -542 -200 243
2568B43K69J97j35m00k65m13j23R7K48M55L62J60j7l40m44l29j59m6L02L70M13
$$ 243 512 709 574 174 -91 -504 -627 -530 -282 173 535 695 678 338 -106 -435 -594 -640 -338 32 445
2589D45K04k0k09m68l64k33K7J72M69L49K66J2k19m25l17l12J5J59L56L74L53
$$ 445 649 629 420 -48 -412 -645 -618 -446 23 372 638 650 431 6 -311 -623 -608 -449 -93 281 634
2610F34Q0j27m53m25k78j10J96K91M85K69J38j48k85n20l49r9R7L41M48L34J22
$$ 634 714 587 134 -291 -569 -679 -483 -192 293 562 700 552 267 -253 -602 -701 -604 -263 185 519 641
2631F41j13l15m25k99j73N8L35M16L79J59r6k81l77l81j72NK38M43L63K24J3k71
$$ 641 528 213 -212 -511 -684 -626 -291 125 504 663 567 286 -91 -472 -644 -639 -401 42 405 629 642 371
2653C71l87m05j90rJ90L81M05L46k0k71l55m19k75k3K11L23M83K52R1k15l62l89
$$ 371 -16 -421 -611 -620 -430 -49 356 702 682 411 56 -363 -638 -661 -450 -127 356 608 699 484 122 -267
2675b67l86l3J77L77L70L58P4j68l13m25l29q8J12L55L73L80J61j70k72m87k94
$$ -267 -653 -686 -509 -132 238 596 670 502 189 -236 -565 -653 -541 -186 187 567 728 558 286 -201 -495
2696d95j65Q9K45M61L79J56r2k43m27l67k29P1K34M53L81K55l2l25m31l90k09
$$ -495 -660 -571 -326 135 514 670 578 335 -92 -459 -688 -617 -383 70 451 706 674 349 -82 -472 -681
2717f81kK53L75M62K16N1k49l58m40k38k3J81L68M25K68J4j18l71l88l50m0J69
$$ -681 -683 -430 -55 407 623 674 425 67 -373 -611 -634 -453 -85 340 608 622 504 133 -255 -605 -645 -476
2739d76L48M47K26J06j44l15m13l44p2R7L41L70L25J36m9l30m16l38j51J17K29
$$ -476 -128 319 545 651 507 192 -221 -565 -637 -540 -199 171 496 632 583 253 -163 -501 -652 -535 -306
2760c06M87K91K02n0k96m55l24k57J44K58L96L42K43o3k90l88l57j88j1K43L95
$$ -306 181 472 674 624 328 -127 -451 -708 -564 -306 90 432 675 612 322 -66 -423 -611 -622 -379 16
2781A6L99K24L9k06m00m12k66j1J98M19L57K29jj27l79l78k40j11J74L61L31L55
$$ 16 415 639 678 472 72 -340 -606 -617 -419 0 357 586 585 458 79 -299 -539 -650 -476 -115 216 571
2803E71P0j22l36m38k92j14J57K77L86L98N7r2l38m26k59j58J32K76M12L15J46
$$ 571 641 519 183 -255 -547 -661 -504 -227 159 557 614 522 184 -242 -501 -659 -527 -251 161 476 622
2824F22l2k94l88l06k41O8K47M17L56K11o2k30l92l02k78k5K72L71L86K36n1k38
$$ 622 590 296 -92 -398 -639 -571 -324 93 449 660 598 368 -24 -326 -604 -629 -357 14 400 636 585 347
2846C47l38m43j30m5K04K95L90L04J7j53l67l53k79q2K55K44L18L78M9j09l95
$$ 347 9 -434 -564 -609 -405 -110 280 584 601 448 81 -272 -551 -633 -378 -134 184 562 611 502 107
2867A07l57k47j15J47K76M02K84Q6j16k68l59l14j18R9K54L59L60J92j23k65m57
$$ 107 -250 -497 -612 -465 -189 213 497 583 467 199 -160 -474 -592 -493 -239 120 480 672 549 284 -173
2888a73k84j39J2L21L05L37K14n3j92l94l54j48q1K71L96L37J92M6k35l61l69
$$ -173 -457 -596 -584 -263 42 379 593 540 348 -46 -400 -548 -629 -358 38 375 567 613 378 17 -352
2909c52j87n0J64M11K88K79K3j80k57m39k97lJ57L57L74K34Q7r6m43l30k76q5
$$ -352 -539 -589 -425 -14 274 553 576 396 139 -300 -597 -600 -443 -86 288 522 609 513 70 -260 -536 -621
2931f21J00L39L63K79J45j06k69m02k70j69J36J87L86L13K32j24k20l17m21j79
$$ -621 -521 -182 181 460 605 499 230 -172 -442 -611 -475 -288 98 411 643 519 299 -18 -439 -618
2951f18O1K91L01L84K29j05j99l56l60k56R1K09L29M00J78p7j02l25l96k49n0
$$ -618 -557 -266 35 419 648 543 344 -12 -372 -628 -537 -328 1 401 579 502 400 75 -321 -570 -620
2972f20K58K77L95K16L7j57k66m14k50n4J52K42M11K64J03j28k82l74k91j15R9
$$ -620 -362 -85 310 526 563 406 140 -274 -524 -578 -426 -184 227 491 594 466 184 -190 -481 -596 -497
2993d97L17M39K56R8j15k72l62l25q8N6K70L12L35J75j48j81l39l47j98J24J81
$$ -497 -180 259 515 613 498 226 -136 -461 -549 -493 -223 89 424 599 451 270 -69 -416 -614 -490 -309
3014c09L75L18J87q0j76l37l29k34M7J81L25L71K32j3j81l55l32j87p5K17K06
$$ -309 66 384 571 491 315 -22 -351 -585 -538 -357 -32 339 571 558 377 22 -310 -497 -572 -355 -149
3035a49M86K18J9j21l24l95k10j03J40K62L83K65J11j44k61l75k22j35M9L01L21
$$ -149 337 555 574 453 129 -266 -476 -579 -439 -177 206 471 582 438 177 -198 -420 -555 -506 -205 116
3056A16K85J84j07j99m09l03j62L1K59L43L19K06p9j91l55l23j72PK45L12L51
$$ 116 401 585 478 279 -130 -433 -595 -564 -305 38 357 563 484 293 -62 -385 -557 -550 -305 7 358
3077C58J48jj37l15l19k25J2J28L56L32J84K0k07k60l13k75l9J47L28K93K66Q1
$$ 358 506 505 368 53 -266 -491 -479 -351 5 337 521 541 334 74 -239 -514 -553 -406 -78 215 481 562
3099E62q6l85k86k82k5M3K79L20L57Oq4k96k69k53k22J69K74L14K69J62o6k15
$$ 562 476 91 -195 -477 -502 -459 -180 140 497 503 419 123 -146 -399 -621 -452 -178 136 405 567 501 286
3121B86l38l68q7j1K38L18L43J22k0k14l13l14j67Q3J09L28K97K23kj98k67l79
$$ 286 -52 -420 -507 -518 -280 38 381 503 483 269 -44 -358 -525 -442 -333 -5 292 515 513 315 48 -331
3143c31j87J1J37L46L02K25J5j60k76k98l06q0K11K87L22K74K2q1k72m10j78m2
$$ -331 -518 -507 -370 -24 278 503 518 358 82 -216 -522 -602 -391 -104 218 492 514 433 161 -249 -427 -469
3165d69Q6K88K52K74J07l9k94l52k79q9K1L03L22K30J36j9k41l30k87r1m4K05
$$ -469 -383 -95 157 431 538 499 205 -147 -426 -515 -494 -191 131 361 497 478 237 -93 -380 -471 -515 -310
3187c10L17K94K13r8j44k64l13k43M0J73L10L61J66j2j93k22l56j70n1J38L07
$$ -310 7 301 514 416 272 8 -305 -548 -508 -335 -25 336 502 490 297 75 -281 -451 -502 -364 -57
3208e7L07K21M5j49l06l01k41o8K40K25K43L13M1j37k27l37k19j01O9K74L19K77
$$ -57 250 471 516 367 61 -240 -481 -549 -309 -84 159 472 513 376 149 -188 -407 -508 -439 -165 154 431
3230D31Q2l1k94k91l27r3M7L17K77K93J54j75j22l32k71r6J8J94K68K93J23N0
$$ 431 513 482 188 -103 -430 -523 -476 -159 118 411 565 390 268 -64 -335 -431 -413 -219 49 342 465 515
3252E15k87j83l18j85K1J98K45L14J34K7j73l24l13j65JJ50L14K81K95r4j72k88
$$ 515 228 45 -273 -458 -437 -239 6 320 454 481 308 -16 -329 -494 -493 -343 -29 252 547 453 281 -7
3274gk37k01o4J72K56K81K75np9k65l34j98j11J37K44K98K45R9j33j80l47k56
$$ -7 -244 -445 -509 -337 -81 200 475 470 391 126 -208 -406 -517 -380 -136 162 407 506 373 193 -154 -410
3296d10l2P8J74L10K73R6p3k30k43k39k12O9J90K86K53K21j04j64k90k50k11Q8
$$ -410 -442 -364 -190 120 393 489 416 186 -57 -296 -508 -439 -249 37 290 511 407 243 -47 -297 -508 -420
3318d20J66K92K28J47P6j57l33k90j40rJ86K27K86J20O6j39k73l00j56k9J58J84
$$ -420 -254 38 266 413 489 332 -1 -291 -431 -440 -254 -27 259 379 445 306 33 -267 -423 -452 -294 -110
3340a10L35J98M3j51k10k84k12L2K1K54K37K09P6j32k00l38j70n2N6K11L21J92
$$ -110 225 423 466 315 105 -179 -391 -359 -338 -84 153 362 438 306 106 -232 -402 -454 -398 -187 134 326
3362C26J28j25j66k55k15j16M5J86K58K56J00N9k70k66k93o3L6J93K28K31J49
$$ 326 454 329 163 -92 -307 -423 -378 -192 66 322 422 481 211 -55 -348 -411 -375 -182 46 277 426
3383D26q4j42k62j79j48J2J27K21K01K42rq1l47k50j25l8J57K50K77J31L8j20
$$ 426 342 200 -62 -241 -389 -377 -250 -29 172 414 405 324 -23 -273 -398 -436 -279 -29 248 379 417 297
3405B97k45k23k05l1Q6K27K77J62P2q6j55k94k33r7J13J99L14J84N8p7k12k14
$$ 297 52 -171 -376 -407 -321 -94 183 345 417 331 176 -118 -351 -448 -335 -136 178 362 420 343 131 -83
3427h3k22j00L3K36K12K49M9n0j79k32k22j24R6J10K82J97J24qj34k45k72j27
$$ -83 -305 -405 -372 -136 76 325 374 324 145 -87 -309 -433 -337 -227 55 252 376 368 234 -11 -283 -410
3449d10N5J41K24J87J44P3j56k59j95j74jJ28J99J99K08Nj04j88k55j22m6J13
$$ -410 -355 -214 10 197 341 414 258 -1 -196 -370 -371 -243 -44 155 363 368 264 76 -179 -301 -347 -234
3471b34J59K62J48O0j59k24j33k05j18J29J99K68K38M0j32j47k71j70o5Q4J13
$$ -234 -75 187 335 395 236 12 -121 -326 -444 -315 -116 152 390 430 298 151 -120 -290 -355 -271 -158
3492a58K33K13P1k2j99k04k17r4K7K05J72K84N8k8j21k20k51j02rJ37K54K43J05
$$ -158 75 288 359 337 138 -66 -283 -377 -350 -145 27 311 369 341 220 0 -251 -353 -362 -225 29 272 377
3515C77p0r2k03k28j40L3J76J28K40J13Pj61j38k36j47k9J71J76J67K22k5o3k28
$$ 377 307 215 12 -216 -356 -323 -147 -19 221 334 341 180 42 -194 -341 -370 -199 -23 144 366 341 278 50
3538E0k33j24k8P6J55K30K00J5q1j72j78k22j4K8J65K37J78N1m7j24k12k55n9
$$ 50 -183 -307 -335 -259 -104 126 326 341 260 88 -90 -312 -326 -298 -133 104 282 333 286 162 -50 -305 -364
3561c64N1J82J50K43Q7k6j41k64j42j03l6J58J63K53J21o2n8k51j98p7k0J31J78
$$ -364 -313 -131 19 262 349 323 182 -82 -224 -327 -363 -205 -42 211 332 270 212 -39 -237 -314 -334 -203 -25
3584b5K18J26L7j21k62j13j16p7P7J57K25J80L2m0k31j90j76n2Q9J65J57K23Q4
$$ -25 193 319 356 235 -27 -140 -256 -333 -256 -99 126 306 338 298 67 -123 -299 -351 -262 -97 60 283 367
3607C67r3j82k07j73n0M1J69K22J95N3n0k15q8k11j28L7J70J91J25J68j1j57k40
$$ 367 274 92 -115 -288 -338 -297 -128 94 289 342 292 77 -11 -222 -350 -313 -143 48 173 341 330 173 -67
3630f7k02n4M4R7J92J74J73n3o5k18j80j48rM4L35J11J50j3q1j93j75k01l3J08
$$ -67 -269 -323 -279 -182 10 184 357 304 239 21 -159 -307 -316 -272 63 174 324 311 230 37 -138 -339 -372 -264
3654b64K11J50K25j6o1j50k70j21k3P5K01J63J07J15j15m1l23j34l0J04N8K62
$$ -264 -53 97 322 306 245 95 -175 -296 -319 -244 -43 120 227 342 227 186 -137 -271 -301 -197 -139 123
3676A23R6J11j1k19j57j74j07M4R8K49J57J00Jj21j86k51n0j2J06K09K03M6oo7
$$ 123 219 330 319 100 -57 -231 -338 -294 -196 53 210 310 311 190 4 -247 -297 -309 -203 6 209 255 249 182
3700A82j75j78j31l1J38J67K19R6L6o8j52k42j22n3J13J26J30J81J24j05j39k06
$$ 182 7 -171 -302 -333 -195 -28 191 287 323 255 103 -139 -261 -314 -201 -75 55 236 360 255 116 -90
3722i0j55r3Q3J49J37K03J06n9j26k32j95p2J20M6K83J04P4J2j33k45k02l2K5
$$ -90 -245 -338 -255 -106 31 234 340 281 155 -77 -272 -344 -224 -178 105 209 283 295 162 -83 -285 -317 -292
3745b92J52J32K08J24m3j60j10k35n3n1J48K20J35J42Kj59j69j38j48k4Q9J71
$$ -292 -140 -8 200 324 281 121 11 -224 -277 -328 -180 40 175 317 319 160 -9 -147 -295 -319 -230 -59
3767e9K60N6R2j47r8k00k34J4J32J08J65J76J9k5j90j57k30K7N5J34J61J95J02
$$ -59 201 257 349 202 104 -96 -330 -316 -184 -76 89 265 284 259 69 -88 -318 -291 -236 -102 59 254 356
3790C56n7j97j72j34r0L3J55J34J71R1o9k7k24j81j12Q0J08J23J72J56m4j34j42
$$ 356 299 102 -70 -204 -294 -261 -106 28 199 290 221 194 -30 -211 -323 -243 -135 -12 160 316 272 138 -4
3813dj71j49K1J34J60J88J07m0q6r9k60o5k8O6J77J87J31j0k4j80j53j79m9R0
$$ -4 -175 -324 -303 -169 -9 179 286 246 160 61 -199 -264 -292 -226 -49 138 269 259 235 55 -98 -277 -326 -236
3837b36J94J30J26Q2k2j83k11j08p7L4K15J49J58M2m0j43j22k12p9L2J39J81J44
$$ -236 -42 88 214 296 274 91 -120 -228 -305 -271 -56 93 251 293 253 110 -12 -224 -303 -271 -132 49 193
3860A93J10k6j53j32j95j05P4L0K15Q4J58kj16j43j48p5mJ12R9J63R9mo6j23j63
$$ 193 303 277 124 -8 -203 -308 -234 -204 11 95 253 251 135 -8 -156 -231 -235 -123 -24 139 238 234 168 45 -118
3885a18j48j5J30J14K07O7J01j72j46j28j57j2J11J35R4J28L0k1j34j26j87k0
$$ -118 -266 -281 -151 -37 170 237 338 166 20 -108 -265 -277 -166 -31 63 191 221 200 66 -60 -247 -267
3907b67Q7O6J31J38J65j09j17j23j79o3K1J35J24J66J24j03j08j03r0j22j5Q9
$$ -267 -180 -114 17 155 320 211 94 -29 -208 -271 -250 -115 9 175 299 196 88 -15 -105 -227 -242 -153
3929a53K00J20O8Lj25r8j36j45N4Q8J40J53Q6km8j97j96n5j6N5P9K60J48m8l1
$$ -153 47 167 235 238 113 15 -121 -266 -212 -124 16 169 255 253 205 8 -188 -243 -259 -204 -125 135 283 235 204
3954B04j51j61j13k7L6J76J50J09J7l5j26j64p7q3L1Q1K31J13O9q4l5k35j85M0
$$ 204 53 -108 -221 -248 -212 -36 114 223 240 205 79 -85 -162 -245 -214 -133 98 211 280 196 161 -74 -259 -219
3978b19M8Q2J55J43N0p4p7j18j62p5N1R0J54J11Q7nn6k24j05j41O9N2J86J05J00
$$ -219 -171 -89 66 209 259 185 108 -10 -172 -247 -196 -106 48 159 246 241 185 -39 -144 -285 -216 -164 22 127 227
4003B27L9j05j64j08j00rM4J47J72J01nr6r7j44p6k4K0J19J73Q3N6p7j45j01j04
$$ 227 266 161 -3 -111 -211 -220 -176 -29 143 244 239 143 46 -98 -174 -198 -178 -59 114 197 253 176 31 -70 -174
4028a74p1N2R8J24J21O9j7j26j48j00q6N5J36P0J07J27l8l8j41j75o0J1J15P6
$$ -174 -245 -193 -95 29 150 219 202 76 -72 -172 -258 -203 -67 3 110 237 199 161 20 -155 -215 -204 -89 -13
4052a3J78Q6oj08j14j23q5L7P4Q2J52P0mo8j62q1j24P4J4Q4J42J40j3r3r3j34
$$ -13 165 251 245 137 23 -100 -185 -148 -74 8 160 230 226 158 -4 -85 -209 -135 -121 -37 105 245 232 139 46 -88
4078h8j57%M2J06J85J39j8l3r3j35j20nl2J17J36J44J08o3j23j43p7j02kJ10J80
$$ -88 -245 -245 -203 -97 88 227 209 176 83 -52 -172 -177 -209 -92 44 188 296 233 110 -33 -110 -212 -214 -104 76
4103G6O0P7Oj00j62j12o6Q2K5J28J15R0k6l9j25j39q5k4O3J17J09P8J8n7q7j32
$$ 76 136 213 219 119 -43 -155 -221 -139 -114 14 129 219 193 154 29 -110 -195 -219 -156 -39 70 148 166 109 22 -110
4129a10q1k1L4J39J31R5J3l0p4j49j15K0K8J01J02P8LK7p1j56j51k4RJ21J38R5
$$ -110 -191 -212 -178 -39 92 187 200 170 96 -53 -168 -148 -120 -19 83 161 164 191 120 -36 -187 -211 -202 -81 57 152
4155A52O0o9l1j70j04m8J4P5J27O9J09j3q8j30r7Rr8J02J45P1O8R1j15o4j32j06
$$ 152 212 143 112 -58 -162 -210 -196 -121 6 75 184 171 83 -47 -144 -135 -233 -131 14 85 153 244 129 65 -67 -173
4181a73j1Q9N5J35J40L1q8j28j02j03m6L1J37J02P3K9Jr1q2j31q7O9P4J13O3N2
$$ -173 -184 -95 -40 95 235 266 178 50 -52 -155 -201 -170 -33 69 142 171 172 81 -1 -132 -219 -150 -76 37 100 152
4207A52j9n8j13j61QL0K7J42J18R1j4r4j53q8l6j9P9R6J73M6j5p0j24j06p9M8
$$ 152 133 75 -38 -199 -191 -161 -134 8 126 217 203 109 -44 -132 -168 -187 -108 -12 161 207 192 122 -2 -108 -187 -139
4233a39m1J69Q1R8J3J1j91r6j22L3l3J99P6R7L0m9j02j13j00M0m1O6J90N1Q9n7
$$ -139 -180 -11 70 168 181 192 1 -95 -217 -184 -217 -18 58 155 185 136 34 -79 -179 -139 -180 -114 76 127 216 159
4259A59q9j09r5k0RR0J43O5M3l4n0j44p8o7L2O0J03J24L5K8r5j44p2q7OR0Q5P6
$$ 159 70 -39 -134 -154 -145 -55 88 153 196 162 112 -32 -110 -177 -145 -85 18 142 177 205 110 -34 -106 -193 -187 -97 -12 64
4287F4J35p2Lj14j04r7K5j1J48Q8R4rn2r5j10o0J0K9J36R2L6P7o9p2j20n9p8M3
$$ 64 199 127 130 16 -88 -185 -160 -171 -23 65 159 150 98 3 -107 -167 -157 -128 8 100 136 213 144 72 -48 -107 -185 -142
4315a42J12M8J03O5j4j20j14j02m9Q6J07R3O6N5k7j13j13r4J7oR9O7N7Q1J2n8
$$ -142 -30 18 121 186 172 52 -62 -164 -213 -127 -20 73 139 194 167 54 -59 -153 -136 -142 -43 24 81 162 174 116
4341A16j47r5l1m3R1J33O8N6j4N7j69j43o4K6N8J06J23P3J2j21j39p9J9p3N2P4
$$ 116 -31 -126 -157 -200 -109 24 92 148 134 191 22 -121 -185 -159 -101 5 128 201 213 92 -47 -126 -107 -180 -128 -54
4367e4J14J23K2j32m7j14o3l1P4N8J18P2k5l4m2r0r9q7J20OJ75R8qJ3j32p5r2
$$ -54 60 183 205 73 26 -88 -151 -182 -108 -50 68 140 115 81 39 -51 -150 -237 -117 -111 64 162 154 167 35 -40 -132
4394a32j2rJ35N6J11K8K6q9j17j19qqR4N9P5M7Ll7j31p3mk4K2J87RQ4oj07q9o3
$$ -132 -144 -153 -18 38 149 177 203 114 -3 -122 -130 -138 -44 15 90 137 140 103 -28 -101 -105 -129 -107 80 89 173 167 60 -29 -92
4424i2o3M4J5J59PM5M7o6o2j28o4K4M7O5P6M8Q8r8n4o5p5p3J08L4J09Q4k7pj21
$$ -92 -155 -111 -96 63 70 115 162 96 34 -94 -158 -134 -87 -22 54 102 190 92 38 -27 -102 -175 -67 -33 76 160 133 126 5
4453Ej0j18MoN2J07P8km7k7p8l8j0q1J31O1O7J14j13Lj05j12j0MM4J26Q7K6Jo4
$$ 5 -5 -123 -119 -125 -73 34 112 110 63 36 -42 -80 -90 -171 -40 21 88 202 89 92 -13 -125 -135 -131 -87 39 126 152 153 89
4483H9r3p6l8p3Q9P8J27J4P0j03j39Rj29L1R0pJ33P2M1j20o5j03l3J0J0J05J31
$$ 89 -4 -80 -118 -191 -102 -24 103 117 187 84 -55 -46 -175 -144 -54 -61 72 144 185 65 0 -103 -136 -126 -116 -11 120
4510A20L0j3k8j30o9j6l7P1P5Q9N1K7m7r8q1o2j7m4J53Q8O1kK4m7j52k4o3M8M1
$$ 120 150 137 109 -21 -90 -106 -143 -72 3 92 143 170 123 25 -56 -118 -135 -179 -26 62 123 121 145 98 -54 -78 -141 -93 -52
4539e2M5J40l4J1k0j09j41M1k5O0J41Q5m1P2j14j11n4o1l4N6J67M7J07k9p4q4
$$ -52 -7 133 99 110 90 -19 -160 -119 -144 -84 57 142 101 173 59 -52 -106 -167 -201 -145 22 69 176 147 73 -11
4565a1q9o8PN9J08Q5L3j0k2p8j36l5j0O6R7P8Q3n7l0o4o8p6jk7P9J45P2k6N4j13
$$ -11 -100 -168 -161 -102 6 91 124 114 92 14 -122 -157 -167 -101 -4 74 157 100 70 6 -62 -138 -139 -166 -87 58 130 104 158 45
4595D5j14p8n1P4MJ84P5QK9j40mj43n7L2J07L6J38N4n8n9j23k4q3M7J9O7J16R4
$$ 45 -69 -147 -198 -124 -120 64 139 147 176 36 32 -111 -168 -136 -29 7 145 199 141 82 -41 -65 -148 -101 -82 -15 101 195
4623A95q9n8l0j37k4L3K0N9P2J13j0r9k3o9j39PM4J60OJ51k5k8p9j34m8k6K3J23
$$ 195 106 48 18 -119 -143 -110 -90 -31 41 154 144 45 22 -47 -186 -179 -135 25 31 182 157 129 50 -84 -132 -158 -135 -12
4651a2O2Q3j2k7o0r4m9p4O4O8P9Q5R0j04j2j65n8k8L6R4P7P4J0j5n8j02k4o7j5
$$ -12 50 133 121 94 34 -60 -109 -183 -119 -51 28 113 203 99 87 -78 -136 -164 -128 -34 43 117 127 112 54 -48 -72 -139 -154
4680a54N3J13Q0O6Jr5n8j22n8j0J37K6R9R6j4k0j03n2j03p0M4N2R4J51j3l2j37
$$ -154 -101 12 92 158 159 64 6 -116 -174 -184 -47 -21 78 174 160 140 37 -15 -118 -188 -144 -92 2 153 140 108 -29
4707b9l8K1j08l1J04J22R2K6l1n0j89l8J3%M8N9J08P2l4j05pj60O4o5Q9R3Q9N6
$$ -29 -67 -46 -154 -185 -81 41 133 159 128 78 -111 -149 -136 -136 -88 -29 79 151 117 12 5 -155 -91 -156 -67 26 115 171
4735A71k0m4q7j07J6p1J02J17QR5m6m3n4q9q0NJJ12P7M6J5J8j41j07m8j4N8O8
$$ 171 151 107 20 -87 -71 -142 -40 77 85 180 134 91 37 -52 -132 -127 -126 -14 63 109 124 142 1 -106 -154 -168 -110 -42
4763d2J51j6K0K8j14p7o2p1P9L9J25P9MJ0o8r5j68L5jJ27P1N7O0r3J8r4q5q8K7
$$ -42 109 93 113 141 27 -50 -112 -183 -104 -65 60 139 143 153 85 -10 -178 -143 -144 -17 54 111 171 78 96 2 -83 -171 -144
4792a44J05O3O6Q6q5k5r6j09m2K8J02P4K1J43n7l3n2j11j04k7O9J27O0J08l8k8
$$ -144 -39 24 90 176 91 66 -30 -139 -181 -153 -51 23 44 187 130 97 45 -66 -170 -197 -128 -1 59 167 129 101
4818A01j08r5pp9O7J06P3O8P6j06p5j13k9l9L8J38L4M6K8m5k4j71qp0M3R3O1J60
$$ 101 -7 -102 -109 -188 -121 -15 58 126 202 96 21 -92 -121 -160 -122 16 50 96 124 79 55 -116 -124 -194 -151 -58 3 163
4846A63k2Lr3j42K6j20j6J42J47K5O2k2p3j06o6l1L1K6N6J75L1q2l5r0p4m7j3
$$ 163 141 144 51 -91 -65 -185 -201 -59 88 113 175 153 80 -26 -92 -123 -92 -66 -10 165 196 114 79 -11 -85 -132 -145
4873a45R9J04M3J09p3m1n6r3j16O1m8J42L7J15O8q7j05r4m2k9L6M7J82J6N6n1
$$ -145 -46 58 101 210 137 96 40 -53 -169 -108 -156 -14 23 138 206 119 14 -80 -122 -151 -115 -68 114 130 186 135
4899A35j04n1j24oL1J31P7L5J4K2j06j52k4n0M1R7Q5O5Q3o5o8j27q2%rJ25R1L2
$$ 135 31 -20 -144 -150 -119 12 89 124 138 160 54 -98 -122 -172 -131 -34 51 116 199 134 66 -61 -143 -143 -152 -27 64 96
4927I6K5M8r7r2q4p2K8O3J01O8O5k7k3q5q9r3j4P3J33N7P5l3Oj04q7n8o2R0O5
$$ 96 121 169 72 -20 -104 -176 -148 -85 16 84 149 122 99 14 -75 -168 -182 -109 24 81 156 123 129 25 -62 -120 -182 -92 -27
4956b7J17M3O%j39m0r2Kk1J47N4P3J6nj17p1j28K3LJ61k0J68j8j9q0j03p2m2J3
$$ -27 90 133 139 139 0 -40 -132 -130 -151 -4 50 123 139 134 17 -54 -182 -159 -156 5 -15 153 135 116 36 -67 -139 -181 -168
4985a68R6J21K0R2jp4j15j01j8N3L4O5R6M4k0jj77k3o6mK7J42P3K9km2j18j01
$$ -168 -72 49 69 161 160 86 -29 -130 -148 -95 -61 4 100 144 124 123 -54 -77 -143 -147 -120 22 95 124 122 80 -38 -139
5013a39l4j6J07P4O8J22l4k6j18r4o3j8M1J01M3J33L9m7r2k6j28l1J6P3J45L7
$$ -139 -173 -189 -82 -8 60 182 148 122 4 -90 -153 -171 -130 -29 14 147 186 139 47 21 -107 -138 -122 -49 96 133
5039A33L4m0o6j03j55LN1J18Q4M6O9m8o4q7j00l5j9P8J66L0J7N2j36j3j34m9O2
$$ 133 167 127 61 -42 -197 -194 -143 -25 59 105 174 126 62 -25 -125 -160 -179 -101 65 95 112 164 28 15 -119 -168 -106
5066a06kR6P5J32p0l3r1r0k3J9j0J31O0N7P5j19p7j24k1k7L8P1J08P0K8o6j16
$$ -106 -108 -12 63 195 125 92 1 -89 -112 -93 -103 28 88 145 220 101 24 -100 -121 -148 -110 -39 69 139 167 101 -15
5093a5l7n6l3L0O1J61n2Q8m2l4j44r1O6k2J51NQ3K6J4r9r7r8m1K5J83rJ62qp1
$$ -15 -52 -108 -141 -111 -50 111 59 147 105 71 -73 -164 -98 -120 31 36 119 145 159 60 -37 -135 -176 -151 32 23 185 177 106
5122A06k4n5j35n0M6K1J30P3L6l0k8p6p2j06N3J4Q5P4K4K0l2o1j03n4j8J13K4
$$ 106 82 27 -108 -158 -112 -91 39 112 148 118 90 14 -58 -164 -111 -97 -12 62 86 106 74 13 -90 -144 -162 -49 -25
5149b5J13PL1n9n4q0o4kL0K4J75P6l3M5j13j17q3KJ3R9O7L0nP5j45o4k8p0N6l1
$$ -25 88 95 126 67 13 -67 -131 -133 -103 -79 96 172 139 184 71 -46 -129 -127 -114 -15 52 82 77 152 7 -57 -85 -155 -99 -130
5179a30J31J11J9k3Jj31q8l2L6Q1%J18K7k6Jp9j38l8O5j7Q6J29pO5m4m1j64m1
$$ -130 1 112 131 108 109 -22 -110 -142 -106 -25 -25 93 120 94 95 16 -122 -160 -95 -112 -26 103 96 161 117 76 -88 -129
5207a29JO1N6P0L9M5l3o8j47k0j3O1O1N4J09J5m6j09k5j89K5L5Q5R2N5J04n7p4
$$ -129 -128 -67 -11 59 98 143 110 42 -105 -125 -138 -77 -16 38 147 162 116 7 -18 -207 -182 -147 -62 30 85 189 132 58
5235E8n7j77Q0L5l2J20R8j3J9o2k2k04J9J1J18Q8j1O0L8q8m5j09q5N8K5L5L8P3
$$ 58 1 -176 -96 -61 -93 27 125 112 131 69 47 -157 -138 -127 -9 79 68 128 166 78 33 -76 -161 -103 -78 -43 -5 68
5263F8R3k9j68q0ql1R1N9Q2R2o9lr1m2j25P4m1O9O6J20pK5r9j64J9l4M0PJ61K0
$$ 68 161 132 -36 -116 -124 -155 -64 -5 77 169 100 97 6 -36 -161 -87 -128 -59 7 127 120 145 46 -118 -99 -133 -93 -86 75 95
5293I5L6n3l0r0q7j8M0R1N6mQ7J7k6j23q0m2k6O9R7L3N1J8n0q2q2j4m7O7O6J23
$$ 95 131 78 48 -42 -129 -147 -107 -16 40 36 123 140 114 -9 -89 -131 -157 -88 9 42 93 111 61 -21 -103 -117 -164 -97 -31 92
5323I2J2J5p1j8p1j22N3J0J19Q9j5J11j30j0j40m0L3qP9O6N8jj7n7o5r9l3P0P6
$$ 92 104 119 48 30 -41 -163 -110 -100 19 108 93 204 74 64 -76 -116 -83 -91 -12 54 112 111 94 37 -28 -127 -160 -90 -14
5352a4M8l9J08Kj01k8j15OrN4J08Q3N7p9k7q3r2L5m3J14K4N0J4K8n2p2r5j2K3
$$ -14 34 -5 103 105 4 -24 -139 -133 -142 -88 20 103 160 81 54 -29 -121 -86 -129 -15 9 59 73 101 49 -23 -118 -130 -107
5381a07M0R0P0N7j0j20n9j1r4kL5J56K6K6Lk2j09r0k4J9P4L7Q8nP5q0m6r1n7J1
$$ -107 -67 23 93 150 140 20 -39 -50 -144 -146 -111 45 71 97 100 78 -31 -121 -145 -126 -52 -15 73 68 143 63 17 -74 -131 -120
5411a20L6P0O5K5J9pm9n9p5k7O2J8R3O0M0oo1j51j6l6%R8O8P3m2K2p4m8q5L0j1
$$ -120 -84 -14 51 76 95 88 39 -20 -95 -122 -60 -42 51 111 151 145 84 -67 -83 -119 -119 -21 47 120 78 100 26 -22 -107 -77 -88
5442h8OJ06L5K9n5L8j28j1p5M3P8L7J06K5l4m2j01o6m3L5K2R1K4J06j2J1r1p2
$$ -88 -82 24 59 88 33 71 -57 -68 -143 -100 -22 15 121 146 112 70 -31 -97 -140 -105 -83 8 32 138 126 137 46 -26
5470b6m5j5M3N0K1R8k8m1q8k2q1J7N4O9L9N1P5q8p3j4o2n3P3K7N0L7N9Pj03r5
$$ -26 -71 -86 -43 7 28 126 98 57 -31 -53 -134 -117 -63 6 45 96 171 83 10 -4 -66 -119 -46 -19 31 68 127 134 31 -64
5500f4m8j8N0M2O0P8K6l1p6o4k6q6M6L6R0M6L3L2n0j05n6k7l9R4L3R9M7Jp1o2
$$ -64 -112 -130 -80 -38 22 100 126 95 19 -45 -71 -157 -111 -75 15 61 94 126 76 -29 -85 -112 -151 -57 -24 75 122 123 52 -10
5530a0o6l5nM4O7J30j2km7p7o5m8k5Q3P5J7J13l4No2j10l0Pl3R0J33J2Qn9l4j29
$$ -10 -76 -111 -116 -72 -5 125 113 111 64 -13 -78 -126 -151 -68 7 24 137 103 108 46 -64 -94 -87 -120 -30 103 115 123 64 30 -99
5561i9l1k0K8Q9R3Q1ql5q1q6j9m7L8M9R4Q1Kn0o3n1j00M7J3N1Q0O1k8K3q9l9j6
$$ -99 -130 -150 -122 -33 60 141 133 98 17 -69 -88 -135 -97 -48 46 127 129 79 16 -35 -135 -88 -75 -24 56 117 89 112 23 -16 -32
5592c2j21R1NP1N7P7l9q3K0j43Lk9O0N7J11J4jLr5r4n4J5K1P9N6P9k7L3j04q1
$$ -32 -153 -62 -57 14 71 148 109 26 46 -97 -94 -123 -63 -6 105 119 118 121 26 -68 -122 -107 -86 -7 49 128 101 134 30 -51
5622e1m9qJ1J44nO4j3L8q6n6o0o5LQ5J30O0Nm6n4p9o1qLK4J22O6K3k3m6n6j22
$$ -51 -100 -108 -97 47 42 106 93 131 45 -11 -71 -136 -133 -48 82 142 147 101 47 -32 -93 -101 -98 -74 48 114 137 114 68 12 -110
$$ [...]
8191A0
##END NTUPLES=NMR FID
##END=
