##TITLE=1H_AM_NVCDCl3
 CDCl3
 8 sc, 
 5.9.2023
##JCAMPDX= 6.0         $$ Bruker NMR JCAMP-DX V2.0
##DATA TYPE= NMR FID
##DATA CLASS= NTUPLES
##ORIGIN= UXNMR, Bruker Analytische Messtechnik GmbH
##OWNER= root
$$ XWIN-NMR		Version 3.5
$$ Tue Sep  5 13:50:18 2023 Russian Standard Time (UT+4h)  she@DPX200
##.OBSERVE FREQUENCY= 200.13135
##.OBSERVE NUCLEUS= ^1H
##.DELAY= (6, 6)
##.ACQUISITION MODE= SIMULTANEOUS
##.ACQUISITION SCHEME= undefined
##.AVERAGES= 8
##.DIGITISER RES= 18
##SPECTROMETER/DATA SYSTEM= spect
##.PULSE SEQUENCE= zg30
##.SOLVENT NAME= CDCl3
##.SHIFT REFERENCE= (INTERNAL, CDCl3, 0, 15.7039)
##AUDIT TRAIL= $$ (NUMBER, WHEN, WHO, WHERE, WHAT)
$$ ##TITLE= Audit trail, XWIN-NMR		Version 3.5
$$ ##JCAMPDX= 5.01
$$ ##ORIGIN= Bruker BioSpin GmbH
$$ ##OWNER= she
$$ F:/spectra/data/she/nmr/H-F/1/audita.txt
$$ ##AUDIT TRAIL=  $$ (NUMBER, WHEN, WHO, WHERE, WHAT)
(   1,<2023-09-05 13:49:00.70 +0400>,<she>,<DPX200>,
      <created by zg, POWCHK disabled, PULCHK disabled
       configuration hash MD5:
       00 E9 B6 7A A2 85 ED C7 34 08 36 98 17 FE 4E 26
       data hash MD5: 16K
       AD F5 1A 49 F8 05 88 0F 69 4F 52 EA 7F B6 4E 65>)
$$ ##END=
$$ 
$$ hash MD5
$$ 6D E8 AF 7D FC 9A 1D CC 45 A0 47 CC 90 56 2A 01
##$RELAX= 
##$RELAX= 
##$RELAX= 
##$RELAX= 
##$RELAX= 
##$RELAX= 
$$ Bruker specific parameters
$$ --------------------------
##$DU= <F:/spectra>
##$EXPNO= 1
##$NAME= <H-F>
##$PROCNO= 1
##$TYPE= <nmr>
##$USER= <she>
##$AMP= (0..31)
100 100 100 100 100 100 100 100 100 100 100 100 100 100 100 100 100 100 
100 100 100 100 100 100 100 100 100 100 100 100 100 100 
##$AQSEQ= 0
##$AQ_mod= 1
##$AUNM= <au_zg>
##$AUTOPOS= <>
##$BF1= 200.13
##$BF2= 200.13
##$BF3= 200.13
##$BF4= 200.13
##$BF5= 200.13
##$BF6= 200.13
##$BF7= 200.13
##$BF8= 200.13
##$BYTORDA= 1
##$CFDGTYP= 0
##$CFRGTYP= 5
##$CHEMSTR= <none>
##$CNST= (0..31)
1 1 145 1 1 1 1 1 1 1 1 1 1 1 1 1 1 1 1 1 1 1 1 1 1 1 1 1 1 1 1 1 
##$CPDPRG= <>
##$CPDPRG1= <>
##$CPDPRG2= <>
##$CPDPRG3= <>
##$CPDPRG4= <mlev>
##$CPDPRG5= <mlev>
##$CPDPRG6= <mlev>
##$CPDPRG7= <mlev>
##$CPDPRG8= <mlev>
##$CPDPRGB= <>
##$CPDPRGT= <>
##$D= (0..31)
0 1.2 0 0 0 0 0 0 0 0.06 0 0.03 0 0 0 0 0.0002 0 0 0 0 0 0 0 0 0 0 0 0 
0 0 0 
##$DATE= 1693907340
##$DBL= (0..7)
120 120 120 120 120 120 120 120 
##$DBP= (0..7)
150 150 150 150 150 150 150 150 
##$DBP07= 0
##$DBPNAM0= <>
##$DBPNAM1= <>
##$DBPNAM2= <>
##$DBPNAM3= <>
##$DBPNAM4= <>
##$DBPNAM5= <>
##$DBPNAM6= <>
##$DBPNAM7= <>
##$DBPOAL= (0..7)
0.5 0.5 0.5 0.5 0.5 0.5 0.5 0.5 
##$DBPOFFS= (0..7)
0 0 0 0 0 0 0 0 
##$DE= 6
##$DECBNUC= <off>
##$DECIM= 32
##$DECNUC= <off>
##$DECSTAT= 4
##$DIGMOD= 1
##$DIGTYP= 9
##$DL= (0..7)
0 120 120 120 120 120 120 120 
##$DP= (0..7)
150 150 150 150 150 150 150 150 
##$DP07= 0
##$DPNAME0= <>
##$DPNAME1= <>
##$DPNAME2= <>
##$DPNAME3= <>
##$DPNAME4= <>
##$DPNAME5= <>
##$DPNAME6= <>
##$DPNAME7= <>
##$DPOAL= (0..7)
0.5 0.5 0.5 0.5 0.5 0.5 0.5 0.5 
##$DPOFFS= (0..7)
0 0 0 0 0 0 0 0 
##$DQDMODE= 0
##$DR= 18
##$DS= 0
##$DSLIST= <SSSSSSSSSSSSSSS>
$$ [...]
##$SUBNAM1= <"">
##$SUBNAM2= <"">
##$SUBNAM3= <"">
##$SUBNAM4= <"">
##$SUBNAM5= <"">
##$SUBNAM6= <"">
##$SUBNAM7= <"">
##$SUBNAM8= <"">
##$SUBNAM9= <"">
##$SW= 18.05172834244
##$SWIBOX= (0..15)
0 0 2 0 0 0 0 0 0 0 0 0 0 0 0 0 
##$SW_h= 3612.71676300578
##$TD= 16384
##$TD0= 1
##$TE= 0
##$TE2= 300
##$TE3= 300
##$TEG= 300
##$TL= (0..7)
0 120 120 120 120 120 120 120 
##$TP= (0..7)
150 150 150 150 150 150 150 150 
##$TP07= 0
##$TPNAME0= <>
##$TPNAME1= <>
##$TPNAME2= <>
##$TPNAME3= <>
##$TPNAME4= <>
##$TPNAME5= <>
##$TPNAME6= <>
##$TPNAME7= <>
##$TPOAL= (0..7)
0.5 0.5 0.5 0.5 0.5 0.5 0.5 0.5 
##$TPOFFS= (0..7)
0 0 0 0 0 0 0 0 
##$TUNHIN= 0
##$TUNHOUT= 0
##$TUNXOUT= 0
##$USERA1= <user>
##$USERA2= <user>
##$USERA3= <user>
##$USERA4= <user>
##$USERA5= <user>
##$V9= 5
##$VALIST= <valist>
##$VCLIST= <CCCCCCCCCCCCCCC>
##$VD= 0
##$VDLIST= <DDDDDDDDDDDDDDD>
##$VPLIST= <PPPPPPPPPPPPPPP>
##$VTLIST= <TTTTTTTTTTTTTTT>
##$WBST= 1024
##$WBSW= 4
##$XGAIN= (0..3)
0 0 0 0 
##$XL= 0
##$YL= 0
##$YMAX_a= 2051
##$YMIN_a= -1642
##$ZGOPTNS= <>
##$ZL1= 120
##$ZL2= 120
##$ZL3= 120
##$ZL4= 120
##$ABSF1= 10
##$ABSF2= 0
##$ABSG= 5
##$ABSL= 3
##$ALPHA= 0
##$AQORDER= 0
##$ASSFAC= 0
##$ASSFACI= 0
##$ASSFACX= 0
##$ASSWID= 0
##$AUNMP= <proc_1d>
##$AZFE= 0.1
##$AZFW= 0.1
##$BCFW= 1
##$BC_mod= 2
##$BYTORDP= 1
##$COROFFS= 0
##$CY= 11.3945322036743
##$DATMOD= 1
##$DC= 2
##$DFILT= <>
##$DTYPP= 0
##$F1P= 15.7292609196834
##$F2P= 12.9074282941183
##$FCOR= 0.5
##$FTSIZE= 0
##$FT_mod= 4
##$GAMMA= 1
##$GB= 0.15
##$INTBC= 1
##$INTSCL= 1
##$ISEN= 128
##$LB= 0.24
##$LEV0= 0
##$LPBIN= 0
##$MAXI= 10000
##$MC2= 0
##$MEAN= 0
##$ME_mod= 0
##$MI= 1.114404
##$NCOEF= 0
##$NC_proc= 0
##$NLEV= 6
##$NOISF1= 3.799351
##$NOISF2= 2.8
##$NSP= 1
##$NTH_PI= 0
##$NZP= 0
##$OFFSET= 15.70392
##$PC= 1
##$PHC0= -21204.97
##$PHC1= 9.45272
##$PH_mod= 1
##$PKNL= yes
##$PPARMOD= 0
##$PSCAL= 0
##$PSIGN= 0
##$REVERSE= no
##$SF= 200.130013532006
##$SI= 16384
##$SIGF1= 3
##$SIGF2= 2
##$SINO= 400
##$SIOLD= 16384
##$SREGLST= <1H.CDCl3>
##$SSB= 0
##$STSI= 0
##$STSR= 0
##$SW_p= 3612.71676300578
##$SYMM= 0
##$S_DEV= 0
##$TDeff= 0
##$TDoff= 0
##$TI= <>
##$TILT= no
##$TM1= 0
##$TM2= 0
##$TOPLEV= 0
##$USERP1= <user>
##$USERP2= <user>
##$USERP3= <user>
##$USERP4= <user>
##$USERP5= <user>
##$WDW= 1
##$XDIM= 8192
##$YMAX_p= 0
##$YMIN_p= 0
$$ End of Bruker specific parameters
$$ ---------------------------------
##NTUPLES= NMR FID
##VAR_NAME=  TIME,          FID/REAL,        FID/IMAG
##SYMBOL=    X,             R,               I
##VAR_TYPE=  INDEPENDENT,   DEPENDENT,       DEPENDENT
##VAR_FORM=  AFFN,          ASDF,            ASDF
##VAR_DIM=   8192,          8192,            8192
##UNITS=     SECONDS,       ARBITRARY UNITS, ARBITRARY UNITS
##FACTOR=    0.0002768,     1,               1
##FIRST=     0,             0,               0
##LAST=      2.2672688,     0,               0
##MIN=       0,             -1642,           0
##MAX=       2.2672688,     2051,            0
$$ Real data points
##PAGE= N=1
##DATA TABLE= (X++(R..R)), XYDATA
$$ [...]
481E36k43m13N09L00n79n5N45k56m98M16J63o06n9M55k70n08M32J79n74k1N79
502C2k40m30M62L12n35J03N50j58l72M25L33m59j6N62j26m77L41L28n54r2M81
523D70j84o30L55K49n62j21N67k59n50M38L35n92k9N40r4l93L36L91m43o9N67
544C22%m73M25K87m36o0M13Ln06K48K63m78j86M42j02n58K09L42m52k16M45m9
566a17m86K31L99l25k07N73Jl90K98M20l62j40N37J0m25J71M76m16k80M14M8n34
588a04P8L90m11l21M36M0o16J76M23l59l40M98J13n07K08N14l01k55N19J73n13
609a59K08M60l25k51M98R6n58J96L93l86l38M27N9n11K4L88l58m03M43J67n79
630e09J18M09k74k50L81K54m84P6N42k10k66M42K25m64M6M79k39l08L64J80n27
$$ plain form
481 536 293 -120 389 689 110 55 600 344 -154 262 425 -181 -240 215 -55 -563 -131 48 -526 -547 32
502 32 -208 -638 -176 136 -399 -296 254 96 -276 149 482 23 7 569 443 -34 307 635 81 -11 470
523 470 286 -344 11 260 -302 -423 144 -115 -665 -227 108 -484 -513 27 -67 -460 -124 267 -176 -245 322
544 322 322 -151 274 561 125 65 478 481 -25 223 486 8 -178 264 162 -396 -187 155 -297 -513 -68 -117
566 -117 -603 -372 27 -298 -505 68 69 -321 -23 397 35 -105 432 442 17 188 664 248 -32 382 430 -104
588 -104 -26 364 -47 -368 68 108 -508 -332 91 -268 -608 -110 3 -504 -296 218 -83 -338 181 354 -159
609 -159 49 509 184 -67 431 527 -31 165 558 172 -166 261 320 -191 -167 221 -137 -540 -97 70 -509
630 -509 -391 18 -256 -506 -125 129 -355 -279 263 53 -213 229 454 -10 36 515 276 -32 332 512 -15
651a5j6M53l03l64L01K15o41K5M33k47l98L42K19m55O7M72j80l13M46K46m51L9
673a25M98j43k67K76L04m97L3M29k53l40L15J62n10n9L65j02m70K47L20n38o2
694d17M11j29l56K47L08l80n9N16p3l61K99L81l89j00N20q7l58K79K34l36j52
715bL93j45m02K01K19l86k29M45j02m58L07K37m03j71M40K3m11K39L45l41o9M78
737B08K5l83K44L55l24j49M15M6m82J94K74l57j92L26Qm45J45K63l33k51L70k6
759f9l85J31L55k83j74M11O3l51K03M31k83j81M13R6m02J85L54l25j89L04R2m73
781g7J64K57k96l16L33K8m56O3L01k11k70L97M8l71J01M37k72k24M14J14l77J95
803a8M20k27k35L78J14m20J01L57k82k51K72J16m71j1L10j81k98K43J61l96n0
$$ plain form
651 -15 -31 422 119 -245 56 271 -370 -345 88 -159 -557 -215 4 -451 -384 88 -92 -405 41 287 -164 -125
673 -125 373 230 -37 239 543 46 79 508 255 -85 230 392 -118 -177 188 86 -384 -137 183 -355 -417
694 -417 -6 -135 -491 -244 64 -316 -375 141 68 -293 6 387 -2 -102 418 331 -27 252 486 150 -2
715 -2 391 246 -156 45 264 -122 -351 94 -8 -466 -159 78 -325 -496 -56 -33 -444 -205 140 -201 -270 208
737 208 233 -150 94 449 125 -24 391 437 -45 149 423 66 -126 200 208 -237 -92 171 -162 -413 -43 -69
759 -69 -454 -323 32 -251 -425 -14 49 -302 -99 332 49 -132 281 377 -25 160 514 189 0 304 396 -77
781 -77 87 344 48 -268 65 93 -363 -300 1 -210 -480 -83 -35 -406 -305 132 -140 -364 50 164 -213 -18
803 -18 402 175 -60 318 432 12 113 470 188 -63 209 325 -146 -157 153 -28 -326 -83 78 -318 -368
824c68L97k24k52L97J62m10O8L45p5k90L58K20l50N7L64j17l27K98K04m23o8L84
846C50k22k61K35J39m91qL56j99l39K46K30l46l0L96j84k89L13K66k93o0M50p4
868A85k86K61K14k73rK76p2l23K06J63l26j46L28j45l07J48J70l27j24L42j34
889a79k60J92K79l11j17M96p3l24K75K83k45p4M01p5l03K21K56l54j15K97k8l50
911a08J40J77k87j27K67m2l97J68K15k40j79L52J7l14J77L08k59j14L57M5l08
932a52J47L39k07k22M10Q1l70R0K78k73k36L44p1l09O1K21k39k20K83N6l64Q2
954b71L29k44j70L03J05l51J71L50k09j93L59N4k44O2L19j88j90K56K5k97O3K87
976C26k21l27K63J03l56lK70j76k45K63J34l52K6L68k14j64K77J91k96N4L35j65
$$ plain form
824 -368 29 -195 -447 -50 112 -298 -230 115 40 -250 108 328 -22 35 399 282 -45 253 457 34 -34 350
846 350 128 -133 102 241 -250 -258 98 -101 -440 -194 36 -310 -340 56 -128 -417 -104 162 -131 -191 259 185
868 185 -101 160 374 101 92 368 296 -27 179 342 16 -130 198 53 -254 -106 64 -263 -387 -45 -179
889 -179 -439 -247 32 -279 -396 100 27 -297 -22 261 16 -58 343 268 -35 186 442 88 -27 270 242 -108
911 -108 32 209 -78 -205 62 20 -377 -209 6 -234 -413 -61 -44 -358 -181 127 -132 -246 111 156 -152
932 -152 -5 334 127 -95 315 396 26 116 394 121 -115 229 158 -151 -90 131 -108 -328 -45 11 -353 -271
954 -271 58 -186 -356 -53 52 -299 -128 222 13 -180 179 233 -11 51 370 182 -8 248 273 -24 39 326
976 326 105 -222 41 144 -212 -215 55 -121 -366 -103 31 -321 -295 73 -141 -305 -28 163 -133 -79 256 91
998I1j51K84J25l10j1K77j13k40K03Q1k93p3L09j98k67K63J04l23p9L50j43k62
1020c76J98J90k63m3L77n2k46K69J59k41K3K90q5k63K64J20k50j00L29j09l37
1041a46J78J93l54o2K29j24k47J67J60k43r4L15k7k96K54K10k42m6L93o5k81K21
1063I3K25k50m7L28j11k91K16J04k59j41L77q6l95J49K07l32j24L44o3k62J72
1084a46J94k54p7L19ok41J49K29k03n9L38Nk63J07K53k38p0J69O4k93K1K41k37
1107Bj77K27j8k57R7K17k65j15K60l3k73J16L48k53j15L03O7k33Q8K64j23k22
1129i5L19L4k51K1K81j84k18K31J06k99K8K00k54k01K86Kl02J02J85j52j23J96
1151h8J11k42O7L08j16k30K67J18k19P0K56j57k05K76L7k66ML03k33k04J90P9
$$ plain form
998 91 -60 224 349 39 28 305 192 -48 155 236 -57 -130 179 -19 -286 -23 81 -242 -321 29 -114 -376
1020 -376 -178 12 -251 -294 83 31 -215 54 213 -28 -5 285 200 -63 201 321 71 -29 300 191 -146
1041 -146 32 225 -129 -191 38 -86 -333 -166 -6 -249 -343 -28 -55 -351 -97 113 -129 -175 218 153 -128 93
1063 93 318 68 21 349 238 -53 163 267 8 -133 244 158 -237 -88 119 -213 -337 7 -56 -318 -146
1084 -146 48 -206 -283 36 30 -211 -62 167 -36 -95 243 248 -15 92 345 107 37 206 270 -23 -2 239 2
1107 2 -175 52 34 -223 -126 91 -174 -289 -29 -62 -335 -219 129 -124 -239 64 131 -102 -14 250 127 -95
1129 -95 224 258 7 28 309 125 -93 138 244 -55 -27 173 -81 -282 4 6 -296 -194 -9 -161 -284 -88
1151 -88 23 -219 -152 156 40 -190 77 195 -24 46 302 145 -60 216 253 -13 -9 294 61 -143 47 126
1173A26k66o3K88k15j39J42J31k90K8L10j02k56K46J54k36QL15n7j92K27J34k74
1195A9j9K49p4j80J29J29k39n8K41j29k55J48J75l42p9K75q2k46K20R3k14J7K93
1218G1n9k22J65K20j67p4L08nk62J43J96j99j20K12k5k51J53P0k10j02K28j06
1240c6k36J66J40k07j13K51o5j81K00J35k08o6K89N1k33J72J92j45j46L04l0k09
1262B5J5K34k08j26K24N6l90J23J77k81n6J57K2k40P6K10j26j67K81ok00J09K72
1285A81j77j21K78R7l13J09J98j27j33K12%k27O5J83k25r3J44L5k62L8K06j73
1307a05j90K45j8j67R2J73j23r0J75J25k72O8L12j54j29J95J61k62m4K67j14j92
1329d7J95K4k47L4J96j29k14J35R1k54rK11Lk62K04K4j31LK63r3j56J74J70k30
$$ plain form
1173 126 -140 -203 85 -130 -269 -127 4 -286 -258 52 -50 -306 -60 94 -142 -134 181 124 -68 159 293 19
1195 19 0 249 175 -5 124 253 14 -44 197 68 -187 -39 136 -206 -285 -10 -92 -338 -118 -25 -239 -222 71
1218 71 12 -210 -45 175 8 -66 242 237 -25 118 314 115 -5 207 182 -69 84 154 -56 -158 70 -36
1240 -36 -272 -106 34 -173 -286 -35 -100 -281 -81 54 -154 -220 69 120 -113 59 251 106 -40 264 234 25
1262 25 40 274 66 -60 164 220 -170 -47 130 -151 -207 -50 -28 -268 -192 18 -108 -275 6 0 -200 -91 181
1285 181 4 -117 161 258 -55 54 252 125 -8 204 204 -23 42 225 0 -93 51 86 -176 -138 68 -105
1307 -105 -295 -50 -68 -235 -143 30 -93 -183 -8 117 -155 -87 225 71 -58 137 298 36 -8 259 145 -47
1329 -47 148 172 -75 -41 155 26 -188 -53 38 -216 -225 -14 -11 -273 -69 -45 -176 -173 90 -3 -159 15 185 -45
1353d5N0K53j34j85K27P6j47j09K41r5j98J11P6j76p7K15r6k32J39J31k75L9K26
1376A5o6k10K47J01k00k5K64k3j80J51J59j97l4K04j8k54J79J58k05j17K01o2
1398H8k66J32J36j78j28J94k4k02J30Q7j93OK13J8k09J83J90j82q5L09n9j76R6
1421H0K12k04p0K18m4k77J80P3j74j12K04q0j78R4J00k15n2K23k8j39P1J23o9
1444f4j06K40L4k20Q1K61j73q6K47mk03L3K23j50j43J57M6k75RK61k37j47J62
1467e4J08k48L8J71j53j33K22O0j69O5J75q1j51K18J27k24N1J82l3j63J75K0k15
1490a2O3J45j24j80K44Ok83L2J84j50k18K52K5j94O1J31l1j57J92J13k27P0K51
1513A93j24j97K43J22j85j7K04j03j35J28Q2k03n4J46m3j32O6P6k31L2J59r6j40
$$ plain form
1353 -45 5 258 124 -61 166 242 95 -14 227 132 -66 45 121 -55 -132 83 -13 -245 -106 25 -250 -211 15
1376 15 -51 -261 -14 87 -113 -138 126 103 -77 74 233 36 2 206 188 -66 113 271 66 -51 150 88
1398 88 -178 -46 90 -88 -216 -22 -46 -248 -118 -31 -224 -218 -5 13 -196 -13 177 -5 -90 219 160 -16 80
1421 80 292 88 18 236 192 -85 95 168 -6 -118 86 6 -172 -78 22 -193 -245 -22 -50 -189 -118 5 -64
1444 -64 -170 70 104 -116 -35 226 53 -33 214 210 7 40 263 113 -30 127 173 -102 -93 168 -69 -216 -54
1467 -54 54 -194 -156 15 -138 -271 -49 11 -158 -93 82 1 -150 68 195 -29 22 204 171 8 183 203 -12
1490 -12 51 196 72 -108 136 142 -141 -109 75 -75 -293 -41 -16 -210 -149 -18 -49 -206 -14 99 -128 -58 193
1513 193 69 -128 115 237 52 35 239 136 1 129 211 8 -46 100 57 -75 -9 67 -164 -132 27 -69 -209
1536b09J67R0k13K2J89l9j80J81J47j33n6K15n9j46J45J17j80j16K68m1k09N1
1558A1J00j42o9J46p0j99J53N1j35m6J70K1k47K06J08k19L4J97k0j38R9J94j63
1581D2n1K15j6j58O6J22k03l8J61j2k42J11J13k37k8J44J6k22J02R4r2j07K13
1604gM9j95J43J00j13q1K35lj50P0J41j20q7K02j9k17P2J04p8j45J90k9j85K1
1628a02J39j55o7J34N9k06J21J12j06r0J79M2j34M3J99j31r6J76K4k10J36J55
1650B22j41p4R8N6k30JJ91j73j59J84K0j42J5J87r5j53J66N3j76L6J79r7j03K02
1674F7O4j94P8J62n8j24J09M3j05m5K01j03j82R3P2j48l5J82j17j59J28J36j86
1697a21k8J44m3j56J68R3j08M2N0K5j19J39O2r0nJ09q8o8M5J14j04q3K18j77j69
$$ plain form
1536 -209 -42 48 -165 -143 46 7 -173 8 155 22 -34 181 122 -24 121 238 58 -58 210 169 -40 11
1558 11 111 -31 -100 46 -24 -223 -70 -19 -154 -200 -30 -9 -256 -50 58 -161 -127 70 50 -88 11 205 42
1581 42 -9 206 190 32 98 220 17 -21 140 128 -114 -3 110 -127 -155 -11 5 -217 -115 -21 -113 -220 -7
1604 -7 42 -153 -10 90 -23 -104 131 128 -22 48 189 69 -18 184 165 -52 20 124 46 -99 91 62 -123 -102
1628 -102 37 -118 -185 -51 8 -198 -77 35 -71 -161 18 60 -74 -31 168 37 -59 117 141 -69 67 222
1650 222 81 7 105 161 -69 -68 123 -50 -209 -25 -5 -147 -132 55 -40 -193 -27 26 -150 -114 65 -32 -135 67
1674 67 131 -63 15 177 119 -5 104 147 42 -3 198 95 -87 6 78 -70 -105 77 -40 -199 -71 65 -121
1697 -121 -149 -5 -48 -204 -36 57 -51 -9 41 66 -53 86 148 58 53 162 74 6 51 165 61 -22 196 19 -150
1722a50J44Q3k21qJ13k1j18J30O2j54RJ76k0j53J87M4j45k5K21m8r7N9Q1o5o1
1747B3Q7Q0k16M6J44j79n2J35k9j79N4J02q4j61K42l2j76P3J56r8q8J84P3k28
1771a23J17J63r4j13J87J0j69K8K28j94o6O0Q7k01M0J05j71J2R0j3j62J2J94j30
1795a03q3J83N9j82M4J51q1n9J26J16j58j0J87j04q5J25O0j74M3J08j49j22J82
1818G4j5j88lJ75q7j84J56P4j73O3J26o2j09J63O1j17K0J43j17o9J76J1r5P3M9
1843A45p2q8J04O4j44p8J62k2j76O3M9j01m4K06j16j61J44M0j02L4J99q6j00O6
1867a4J19j25LJ03k3r7J23P3j98M3J06j5j83J45L9j73J8J18m4j06N8Q8j82m0J44
1892b0j0j15R2R2p6j00J82l3k7Q8R1j26n1J55l9j15O5Q5j40n4J95l3j61J7J04
$$ plain form
1722 -150 -6 77 -144 -152 -39 -60 -178 -48 14 -140 -131 45 25 -128 59 103 -42 -67 154 106 9 68 149 84 23
1747 23 110 190 -26 20 164 -15 -67 68 39 -140 -86 16 -68 -229 13 -19 -195 -122 34 -64 -152 32 105 -123
1771 -123 -6 157 63 -50 137 147 -22 6 234 40 -26 34 121 -80 -40 65 -106 -94 -4 -17 -179 -167 27 -103
1795 -103 -186 -3 56 -126 -82 69 -12 -71 55 171 13 3 190 86 1 126 186 12 55 163 14 -108 74
1818 74 59 -129 -132 43 -44 -228 -72 2 -171 -108 18 -44 -153 10 71 -46 -26 117 0 -69 107 118 23 96 145
1843 145 73 -15 89 153 9 -69 93 71 -105 -42 7 -94 -138 68 -48 -209 -65 -25 -127 -93 106 20 -80 -14
1867 -14 105 -20 -17 86 63 -34 89 162 -36 7 113 98 -85 60 99 -74 -56 62 18 -88 -30 58 -124 -164 -20
1892 -20 -30 -145 -53 39 -37 -137 45 12 -15 73 164 38 -13 142 103 -12 53 138 -2 -56 139 106 -55 -38 66
1917F6j39m2J17%j63R2J03j38l9J40L9k02J10J37j29m4K09l1j26R6J60j40o6P3
1941H3Q4k51Q1J02r9p3J15L3j54j4J21j45m0J22L0j30L2J76j08j07J49N6j59Q7
1965iR2m5p1J43k2n7LJ08n1j08J29j7j32K5R4r7j03J09K6j99P9J25j14m2N5J24
1991D5j44k2J45k5k9O2Q8j93J20R2m1j20R3M4r3L1K5l6p7L9J12k11O7R2k7j69
2017a32J04P7j58j8J32j5j36J48J8n5n9J60j6q6J19L0q2m0J29qj81J47N2j29J7
2042A8M4Jj32J08l3j17m1J76l4j28O7P9j04mJ09L3j31J03Q9j11kJ06j8j02J23
2067I9O1j44J7J15n2q5m2J54j72j07J67M0j59N1P4q3q7J02L3j21P7J44r5p3J18
2092C2N0j26K7J52q9q5J40N6j49K9J14j42n8J57m6j27P0P2j03p8J10nj24L5J06
$$ plain form
1917 66 -73 -115 2 2 -161 -69 34 -104 -143 -3 36 -166 -56 81 -48 -92 117 86 -40 56 216 76 10 83
1941 83 167 -84 -3 99 0 -73 42 75 -79 -93 28 -117 -157 -35 -5 -135 -103 73 -35 -142 7 63 -96 -9
1965 -9 83 38 -33 110 88 31 34 142 91 -17 112 95 -37 -12 82 -15 -118 -9 17 -182 -103 22 -92 -134 -79 45
1991 45 -99 -121 24 -1 -30 32 120 -73 47 139 98 -22 71 115 22 53 78 42 -35 4 116 -95 -28 64 37 -132
2017 -132 -28 49 -109 -127 5 -10 -146 2 20 -35 -94 66 50 -36 83 113 31 -9 120 112 -69 78 130 1 18
2042 18 62 63 -69 39 6 -111 -152 24 -10 -138 -71 8 -96 -100 9 42 -89 14 103 -8 -10 96 78 -24 99
2067 99 160 16 33 148 96 11 -31 123 -49 -156 11 51 -108 -57 17 -66 -153 -51 -18 -139 -62 82 -13 -86 32
2092 32 82 -44 -17 135 46 -39 101 157 8 37 151 9 -49 108 62 -65 5 77 -26 -104 6 1 -123 -88 18
2117A8n1r6R8J4p3lJ56j02L3L9J9n7PJ52r3j08J40N4j13pM6o6m1L9N9j39J3J44
2145H2j35o7J11Q8k30Q2J08r2o7J50k8n0k8J11j7l5R1M5j17OJ31j15p4N7J15j69
2171d7L0J29j02j04J08N1j77j9J23m3j31J70rr0M8J30q2q3J41N8j39nJ18j9q7
2196c1O5J06r6KMj7o5R6kj89LJ25m2p4Q8O9j67J9J18l8n2J10J2j09J2J69q6l1
2224an9K03j51J0J31m0j40Q5J08j59k8J38k2j40L8P8q5j02J01N7j53O3M4q3N9
2249d8k7O3r8J24Q9j58k5J93m8q9O6M6q7QQ1l8r4R5Rm7m4P5Pj44N9Q2j30o5J46
2278Ak8j24M4R0n2l6J21Pp5NJ27q7j8J52j7j17Q7M1q0r3J31J1j08j3J15j07m1
2305f4K9O0j31K4J38j10o7J41l2p0L4M9m7k8J55n2n3lJ46l0q9N9L2j04K7J22r9
$$ plain form
2117 18 -33 -129 -31 -17 -90 -93 63 -39 -6 33 52 -5 2 154 61 -47 93 147 34 27 73 7 -34 5 64 -75 -62 82
2145 82 -53 -120 -9 79 -151 -69 39 -53 -120 30 2 -48 -76 35 18 -17 74 119 2 8 139 24 -50 7 122 -47
2171 -47 -17 112 10 -94 14 65 -112 -131 -8 -51 -182 -12 -21 -111 -63 67 -15 -98 43 101 -38 -43 75 56 -31
2196 -31 34 140 44 46 50 33 -32 64 62 -127 -124 1 -41 -115 -27 42 -125 -106 12 -26 -78 32 44 -65 -53 116 30 -1
2224 -1 -60 143 -8 2 133 93 -47 38 146 -13 -41 97 75 -65 -27 51 -34 -136 -35 22 -131 -68 -24 -107 -48
2249 -48 -75 -12 -110 14 103 -55 -80 113 65 -24 42 88 1 9 90 52 -42 53 62 15 -29 46 53 -91 -32 50 -80 -145 1
2278 1 -27 -151 -107 -17 -69 -105 16 23 -52 -47 80 -7 -25 127 110 -7 80 121 41 -52 79 90 -18 -31 84 -23 -64
2305 -64 -35 25 -106 -82 56 -54 -121 20 -12 -82 -48 1 -46 -74 81 29 -24 -27 119 89 0 59 91 -13 14 136 37
2332C7r6J33jk03K3J22q3m4P9L5j09K4N0j6l6Q9L6j23L2J49p2r5J13N2q4M8N0
2359A10o1j9K9Qq2l1J85j93mL5O9n9j15J65p8j06O3Q3j09l6J96q1j8J19oq7J1
2386a2P5Pr6O6R5j21J6J12m9j72Q8J04j52QP6o1p9L7N2m5m8M1K8o8K7Q5o3l7R6
2415A0K0j06N5J18j18K9O5jj21J00L2r2n0R7K7j25MO7k6r1J42m1j16M0J07j06
2441h0m0J25Qj18M8J02q4l0J37pq8J04om2l5J10Jj54M9J07r1k4J8K9j06J3P1o1
2469d4l4P2jj39J0J93r1m9N5M5o0OQ9j3m3P0L1r4P9J7o3l9N0Lm8N4j2Qp3K5M3
2500D7j08J6P2p4j07J72mp7k8J59o3m7M5J7p4N3J3M3j1k2Nn5L1R4l0q8R7pq2k0
2530c3P6o5p1J3R8j09J2O5l4j4M2L2n5m5J13j0o3K1J20r1k6Q4k2j2L4J5l0q1P3
$$ plain form
2332 37 -59 74 73 -130 -107 15 -68 -112 -33 2 -107 -83 -33 -49 -85 4 40 -83 -51 98 26 -69 44 96 12 60 110
2359 110 49 30 59 67 -15 -46 139 -54 -58 -23 46 -13 -128 37 -41 -147 -84 -1 -110 -146 50 -31 -49 70 64 -23 -12
2386 -12 63 70 -26 40 135 14 30 142 93 -79 9 113 -39 -31 45 -16 -95 -58 -6 -51 -99 -58 -30 -98 -71 14 -49 -86 10
2415 10 30 -76 -21 97 -21 8 73 72 -49 51 83 -9 -59 38 65 -60 -56 11 -15 -106 36 -5 -121 -81 26 -80
2441 -80 -120 5 13 -105 -57 45 -39 -69 68 61 -27 77 71 29 -6 104 105 -49 0 107 16 -8 10 39 -67 -54 17 -44
2469 -44 -78 -6 -7 -146 -136 57 -34 -83 -28 17 -43 -37 52 39 -4 66 97 3 82 99 36 -3 47 50 2 56 44 52 -21 4 47
2500 47 -61 -45 27 -47 -154 18 14 -63 -91 68 5 -42 3 20 -54 -1 12 55 44 22 27 -28 3 97 67 -21 76 69 -13 -33
2530 -33 43 -22 -93 -80 18 -91 -79 -14 -48 -62 -20 12 -43 -88 25 15 -48 -27 93 2 -24 60 38 26 60 75 45 -36 37
2559C7K0j81J51Qq1n7J16o3n3Q0k5m1L9O3l0r8P7Q9k9p4P7K0j01J10N8j42M2P7
2587H9%j15O2Qm5l2J10l0j76R8O5o8n9J03l8q9Q9N7n3n6J44o4j09J33N0n6m6J02
2615G4J0q7P2Om6m0M8K0q4lQ2l0r5R1qr6kJ20n7k8J06k8j00k6J25n3nP8j5p7M4
2646dJ02l6r6J54k5n8lN9n7m7L1L1r6m7J28q0m2J16j4j09n0J73n4k0J0P4o7n6
2674h3R8o5K6NJ05q4K4K8L3p5L4N6j43K4O2k2j12R5L8q2k6Q6q9qJ6O6r7L4R8n0
2704hl2J1M9p2M6K9K9k3O0m8n8j1J23Pq8J7N1m5j12J40r8m5Q5l8m3L8P2p4l3L7
2734c4K6p0K7O2Nj3L4Lj2m3L1P2j16L3J22j10mQ3l4j17jP0j4j9N8l9q3L7N3n8
2764e1p5J27j2m6l0J15n2j0P9l4k4R9l0p2j1J33l9q5KP4q0k3O8J0o1J0O2p3J0
$$ plain form
2559 37 57 -124 27 35 -46 -103 13 -50 -103 -23 -48 -89 -50 13 -17 -115 -38 51 22 -52 25 45 -56 54 112 -30 12 89
2587 89 89 -26 36 44 -1 -33 77 47 -129 -31 34 -34 -93 10 -28 -117 -28 29 -24 -80 64 0 -109 24 74 18 -28 74
2615 74 84 -3 69 75 29 -11 37 57 -27 -30 52 22 -73 18 10 -86 -88 32 -25 -53 53 25 -75 -101 24 -29 -34 44 29 -48 -4
2646 -4 98 62 -34 120 95 37 34 93 36 -11 20 51 -45 -92 36 -44 -86 30 16 -93 -143 30 -24 -44 -34 40 -27 -83
2674 -83 15 -50 -24 -19 86 2 26 54 87 12 46 102 -41 -17 45 23 -89 6 44 -38 -64 22 -67 -75 -59 7 -90 -56 42 -8
2704 -8 -40 -29 20 -52 -6 23 52 29 89 41 -17 -28 95 102 14 31 82 37 -75 65 -33 -78 7 -31 -74 -36 36 -38 -71 -34
2734 -34 -8 -78 -51 11 16 3 37 40 28 -15 16 88 -28 5 127 17 13 96 62 -55 -56 14 0 -19 39 0 -83 -46 7 -51
2764 -51 -126 1 -11 -57 -87 28 -24 -34 45 11 -13 86 56 -16 -27 106 67 -18 -16 58 -22 -45 23 33 -28 -18 44 -29 -19
2793a9l7O0n4j7O4Kj01J21k6j0MM2m1q6J74mm0j2M3n8m2M4M0m2rO9p1j1K4m4j
2824c8J1R0j43j0L4K3m3J7Q7n8NpN9p3j4J10J5o9P1l0m5j2J28p9n9P7m3Pl5P2
2854D8J2j32J02m7m9PR7p8l9J22l5q2M8N1j5j0J1M3l7m9J17n4pQO5j14M6K7p1
2883a5m0N5L1p1k7Q6n2KJ0K2n8K2J8n3KK8R1n9m6Q4L3q3O3OJ4o5O1k9ll1Q7p1
2915A2p2M1K9j00Q1K1m5o0M6P4q7J0P7q5j9J00k9n2N5N2k4p8Q6Nql1R6m6r8J52
2945A03j08QN4L8o0q5J09o1n5L4M1n1l7M9M7o9j0N1k5j5M4P7j19P3R1l2j62P8
2973HN2n6l2J38j34nL1K3p5L2M9l9m5P6Pj22K7J26q3l8M6K1k7J0L7L4j19N9Q5
3002H6j06M8Q6p6n8J21m0l4j7N8k8r1qP5q8NN8M4j25O1N8m6o2Q1J1o3J06J6j06
$$ plain form
2793 -19 -56 4 -50 -67 -3 -1 -102 19 -7 -17 -13 29 -12 -98 76 72 32 20 63 5 -37 7 47 5 -4 65 -6 -17 7 -37 -38
2824 -38 -27 63 -80 -90 -56 -33 -76 -59 28 -30 -25 -32 27 -46 -60 50 65 -4 67 37 -8 -20 108 29 -30 47 4 11 -24 48
2854 48 60 -72 30 -17 -66 -59 38 -40 -79 43 8 -74 -26 25 10 0 11 54 17 -32 85 31 24 32 97 -17 29 56 -15
2883 -15 -55 0 31 -40 -67 19 -33 -31 -21 1 -57 -35 -17 -70 -68 -40 51 -8 -54 30 63 -20 43 49 63 -2 59 30 27 -4 83 12
2915 12 -60 -19 10 -90 -9 12 -33 -93 -47 27 -60 -50 27 -58 -77 23 -6 -58 -3 49 25 -53 33 38 30 -1 95 49 -49 103
2945 103 -5 3 57 95 35 -50 59 -2 -57 -23 18 -33 -70 -21 26 -43 -53 -2 -27 -42 2 79 -40 33 124 92 -70 8
2973 8 60 4 -28 110 -24 -29 2 25 -50 -18 31 -8 -53 23 30 -92 -65 61 -22 -60 -14 7 -20 -10 27 61 -58 1 86
3002 86 -20 28 114 38 -20 101 61 27 10 68 40 -51 -59 16 -72 -67 -9 35 -90 -29 29 -17 -79 2 13 -50 56 72 -34
3031c4K2L9K4m2L5Pp0M4QL0p0L8l7lk0P2o6q3J02j2Lq7R0k5K4O5o7Nq1Q0K0mJ8
3064B5L5k8qJ1N1o7NK0l6JK1Pl5m5J09l0n5N0pm5j6L4k4M1kj7q2J17l0Pj7Q6k0
3097E6j09P5lL5l8%J2l5K5J05j36k3P8n9kl2M2k9k0O7J0q1L8oL0o6N7M4r7O3J3
3128A4j8L3LJ9rm1M6l4nR6l3o5o3P2M7r6O0no5N2NK1r2J5M2j03J49l9m6j1J08
3159E7k4k2k9J09p7m0J01j6n4K3jk1k0L4l5Pk6N7l9o2P1M1j24O5L4k0k1KJ4mn
3190b5j0N4p5L3M0j0RP5l9LKj7o5N8J2Rk2m9M5l6j0K8Pj25R2pk6N9J3o1L9j9Q2
3223F4r2J7L3J5K1j7J0q5N1K8K9p3M8n1l6K1L4l2j1L5kk6j7R2j31j2P6N3m1m0
3253c9P1j4o6Q3m5J8o5O8lL4l9Q2q6mL8k3m8P6mj05J10n5pj5J8OJ4nJ1J3q3M3
$$ plain form
3031 -34 -12 27 51 9 44 51 -19 25 33 63 -7 31 -6 -9 -29 43 -23 -106 -4 -16 -13 -100 -10 -35 -11 54 -13 -8 -89 -9 11 7 25
3064 25 60 32 24 35 86 19 24 44 8 9 30 37 2 -43 66 36 -19 31 24 -21 -37 -3 -27 14 12 -5 -87 30 0 7 -10 76 56
3097 56 -53 22 19 54 16 16 28 -7 18 123 -13 -36 42 -17 -19 -51 -9 -38 -58 9 19 -62 -24 -30 0 -66 -9 35 -62 1 14
3128 14 -4 29 32 51 42 1 47 13 8 104 71 6 -57 15 62 -34 26 21 -44 8 13 34 -58 -43 -1 -104 45 6 -40 -51 57
3159 57 33 11 -18 91 14 -26 75 59 5 28 27 6 -14 20 -15 -8 -34 23 -16 -78 -7 34 -90 -25 9 -11 -32 -30 -16 -20 -25
3190 -25 -35 19 -56 -23 17 7 16 91 52 55 57 40 -25 33 45 54 32 -17 28 -8 -18 10 17 -108 -16 -23 -49 10 23 -38 1 -18 64
3223 64 -28 -11 22 37 58 41 51 -34 17 45 74 1 49 -2 -38 -17 17 -15 -26 9 7 -19 -36 56 -75 -87 -11 42 1 -39
3253 -39 32 18 -48 35 -10 8 -57 11 8 42 3 85 -1 -5 33 10 -38 38 34 -71 39 -16 -23 -38 -20 -14 0 -5 6 19 -64 -21
3285b1j1KqL9M9m7K3j3L2l8pL6p1K5N3n2k2M2k9k4M5j1J9m1mjJ7%M3p7oP4l5l9
3319e8L5K4k8lM7J5k8lM5j9o4M9J0m1OO2l5j6J8%j9j1N2o6q7J22m7L7NPoo5R9
3352C7k9k0nQL2j8L4m6K3j3J4Nl8L8Ok3nJ9L0r3Q1k9n5J1K8K2n9J6M9n5J2Q%M7
3386C2j6L9o8J3M4o7L8j3N0l4k4Pkm0O6lm6J8k5L2m1K0mm8O5L1J1p4M4O2o8pO9
3419F1m2m8KQ3Mo6O6l9j2l1N5l8l0M0j2nqM4p1M2Jk4oQN1p9M3j4N2o8N9Q0j06
3452hK0L3m2m9L8M8l8J6L0j4k7K3k7p6M5M9Qq8M8n0L0j8O5Nm4k8K7lJ0mJ0ln2
3485f6J06m0m4Q3l6p1R1rLn9N8L9n8k4N7k9o0M2K1l1PJ8j8o8J02J0m8L1M0k9m9
3516c1Q7j3l8K7o0N9J7p1N5n0N0l6K7n7O2J4n2k1j0N1k9M8j2qj2L9l6k2l7O9j7
$$ plain form
3285 -21 -32 -30 -38 1 50 3 26 13 45 7 0 36 -35 -10 43 -9 -31 11 -18 -42 3 -8 11 -30 -34 -35 -18 -18 25 -52 -58 16 -19 -58
3319 -58 -23 1 -27 -30 17 32 4 1 46 27 -37 12 22 -19 -13 49 14 -2 16 16 -3 -14 38 -28 -115 7 -40 -3 2 9 3 -62 37
3352 37 8 -12 -17 -9 23 5 39 -7 16 3 17 22 -16 22 28 5 0 19 49 -44 37 8 -47 -36 -8 14 -45 -29 20 -35 -23 -15 -15 32
3386 32 16 55 -13 0 44 -23 15 2 52 18 -6 1 -1 -41 25 22 -24 -6 -31 1 -40 -20 -24 -72 -7 24 35 -39 5 67 -1 -8 61
3419 61 19 -29 -27 56 60 -6 60 21 9 -22 33 -5 -35 5 -7 -12 -20 24 -47 -5 -4 -28 -34 -26 25 -54 -11 -25 27 -41 18 98 -8
3452 -8 12 45 3 -46 -8 40 2 18 48 34 7 30 3 -73 -28 21 29 -59 -11 -61 -31 -49 16 21 -23 -51 -24 -27 -17 -21 -11 -14 -66
3485 -66 40 0 -44 39 3 -68 23 14 17 -42 16 55 -3 -27 30 1 -59 -17 4 -27 -20 -2 -20 -88 14 24 -24 7 47 18 -31
3516 -31 56 43 5 32 -28 31 48 -23 32 -18 32 -4 23 -34 28 42 -10 -31 -41 10 -19 29 17 9 -3 36 0 -22 -59 10 -7
3547gJ8j2L0j9M1J3m6o6O2J5oJ1J3l7J6j2l5K7l2O3p6K0PN5j11R3Lj6OPL0r7P8
3580C6K0k9J0j8K5m4J0J6Ol6RL2rMNl2L9m6K0o7O2K1n4j7K0N8j10N2N0n4M9j0
3612A8K6p6L0L4k9QjK1j7l7J17j11JL8l3M4o8K7k7oJ2Jj0K2L3j5m0K3K2pm2R9
3644E7r2J2M3K9m8J7K3Mp9L3R4j20O2Ml6PqJ8n0j0L9m4K9k5R5o9j7M1l6l7N2N2
3676D0oo2O5m8j2M2l1N2l2k3j1J4J2K8j7nk1L2n8M3o0L6j5O2n6K7j8K7J4j2O7
3707G4o4k6M4Lqj7M9l0mPkj0jLj2K4n4O0n5L8rPo9P3nm7j6O2o3mO0N1q0J1J7j
3743FL0l3J6l0NP9p8L3M4p1j9M5K3l4Qm9K6Jn1M8L5n9l3K8k9O3K3k6QPK7l6P%
3777A4k2n7Q0M8m6oN3k8o8Q5j0q1pO9m4LJ4o7M5J2Q1p4p9K9P8o0L4QN1m7J1L7
$$ plain form
3547 -7 11 -1 29 10 51 64 18 -48 14 29 23 34 47 10 26 14 -21 6 -26 37 -39 -19 -12 43 -68 25 28 12 18 25 55 -42 36
3580 36 56 27 37 19 44 0 10 26 32 -4 5 37 28 32 37 5 44 -2 18 -49 13 34 -20 -37 -17 41 -69 -17 33 -21 28 18
3612 18 44 -32 -2 32 3 11 10 31 14 -23 94 -17 -16 22 -11 33 -35 -8 -35 -41 -29 -28 -38 -16 17 2 -38 -15 7 0 -42 57
3644 57 -35 -23 20 49 1 18 41 45 -34 -1 93 -27 35 39 3 10 2 20 -30 -40 -1 -45 -16 -41 54 -15 -32 9 -27 -64 -12 40
3676 40 34 -28 37 -11 -23 19 -12 40 8 -15 -26 -12 0 28 11 6 -15 17 -41 2 -58 -22 -37 25 -31 -4 -22 5 19 7 74
3707 74 10 -16 28 31 23 6 55 25 21 28 26 16 15 18 6 30 -24 36 -19 19 10 17 -52 21 16 -31 -47 15 -48 -52 8 59 -21 -10 7 6
3743 6 36 3 19 -11 -6 73 -5 28 72 1 -18 27 50 16 24 -25 1 2 -49 -1 34 -25 -58 -30 -59 4 27 1 9 16 43 7 14 14
3777 14 -8 -65 15 63 17 11 64 36 -32 53 43 -38 -45 24 -20 -17 -3 -70 -25 -13 68 -6 -85 -56 22 -38 -4 4 55 8 19 56
3809E6l8M1m3J3k6M6k8m3j3J4L5K8p1N4k2m2J6M9k5M1j7m0L0l1K9pkL7K0n7Qj6
3841dN1n7M8Mj7J5n3pJ7L3p5M9rJ3lm5L6Ok6M9M0n5k4PL0n3MQ8q6N6k4K9n1K7
3875A3J1n2KQ1o9j9N2K8r2M0Q5n9k7j4Nl8jO2Nn1P0Lpoj7j0m4Q5%m1LqkK1J7J1
3911C7k9j8J5k3j3K9L5j7r2M4NJ5nj0K4JL5J0j14K3O3l1rL3O2l7l1M8l1LRj7K3
3944C7l6L0l6L4rl1nm3M6NK6K0o3M8l1Mj4j8N5K3l0ok2J8Nl3R5q8N1k1k2QK2M
3978B3j6k0L0o1K2L9k1k3j2N3k3K4o7O5n7P8Nj2o0J6P1m7qK6Ll0J1N0l6j9J5k
4010A7qL3l3j5K2Qj6m5K0M3n3N1m2L5J4r8J6M1qK5Q%k6O3p6L7J7k2j9L9j5k8n
4043b0N0k3J2j4J9m0Kj7%K0J4J0o4K1KJ4j4M6K3n9M6j6j4L6J2n4M5j9J8q4Q0j
$$ plain form
3809 56 18 59 16 29 3 49 21 -22 -35 -21 14 42 -29 25 3 -39 -23 26 1 42 25 -15 15 -16 13 6 4 41 61 4 12 -4
3841 -4 47 -10 38 42 25 40 -13 -20 -3 30 -45 4 -5 8 5 -40 -4 2 -24 25 65 10 -14 -7 23 -30 -26 62 -24 32 8 37 -14 13
3875 13 24 -28 -26 55 -14 -33 19 47 -45 -5 80 21 -6 -20 -15 -53 -54 8 13 -38 32 35 28 22 5 -5 -49 36 36 -5 -2 -10 -12 9 26 37
3911 37 8 -10 5 -18 -31 -2 33 16 -76 -32 -27 -12 -17 -27 -3 -2 33 43 -71 -48 15 -16 -25 8 70 33 2 50 19 22 31 14 37
3944 37 1 31 -5 29 20 -11 -16 -59 -13 -8 18 38 -25 23 -8 -4 -18 -36 19 42 12 6 -16 2 7 -26 69 -19 32 11 -11 -3 19 23
3978 23 7 -13 17 -44 -22 17 -4 -27 -39 14 -9 15 -52 13 -44 34 39 27 -33 -17 54 7 -1 25 28 -2 9 59 23 4 19 17
4010 17 9 42 9 -6 16 24 8 -37 -17 26 -27 24 -18 17 31 -67 -51 -10 -18 7 15 15 -11 52 -24 13 30 8 -11 28 13 -15 -20
4043 -20 30 7 19 5 24 -16 -14 -31 -31 -11 3 13 -51 -30 -28 -14 -28 18 41 -18 28 12 -2 34 46 -8 37 18 36 -48 32 31
4075C1j1n8O5J5o7J3Q2k6p2M4k0rm4M8l9J6k4J02m6o2Q3lj1l0k9P9o2N0L0Qp7
4106b4O7pm9J4J7n0K2J5l9N1qj6l2RK4MLn8M3oM9j6j0lO0j8k5l7L7pKM8m6Qn8
4141c6Q7k0n4L8K2j5l0k3L1Ok1j1J2j8P7n0l9K8K8J6o2k4N8l8N8jk7J4k4Q5q3
4172a6M6L9o1l8M1M8q4k1Q0n3L5KM2p8K2k6K1k3k2O7l8k6R7l3n7O6k4L3l1k4L4
4203A8nQL7o0K0l9N6j1j7Mk1n7O9m1M5k2J6K7j1Jl2J3jJ9nk8K0K2n5N6j5J5k0
4236FO7p0k5RK7kJ0o1nL4n4K2M4J3j6j8K4pK3l9KM0j7j0J4L5q9N0j5L8J3k3j4
4269FJ4j3Qp0nL8K5K2q2K9K5k6nK8l5J9K3j5M5k4NK4m4K1L4o6J9J7n1M9K2p0n2
4302h5R7k1L9m9J5RJ8J2l6rM2o4j3L2MK4J3l5N2p0J2m8J14k1On7MrJ7l0OK6L6
$$ plain form
4075 31 20 -38 27 42 -25 -12 70 44 -28 16 -4 -13 -57 -9 -48 -32 -56 46 0 -62 21 18 7 -23 -52 27 -35 15 45 53 -24
4106 -24 43 36 -13 1 18 -32 -10 5 -34 17 9 -7 -39 -30 -6 -2 1 -57 -14 -20 29 13 3 0 60 42 17 -20 17 10 12 60 14 22 -36
4141 -36 51 31 -23 15 37 22 -8 -31 0 6 -15 -26 -14 -32 45 -5 -44 -16 12 28 -34 -58 0 -38 20 19 -8 6 -18 67 -16
4172 -16 30 69 8 -30 11 59 -25 -46 34 -19 16 18 60 -18 4 -22 -1 -24 -46 21 -17 -43 54 21 -36 30 6 39 8 -16 18
4203 18 13 21 58 -2 18 -21 35 24 7 11 -10 -67 2 -39 6 -16 0 27 16 17 -15 -2 -3 16 11 -17 3 25 -30 26 11 26 6
4236 6 73 3 -22 -13 14 12 22 -39 -44 -10 -64 -42 2 15 -1 -19 5 -2 21 -18 -16 24 7 -3 11 46 -43 7 -8 30 43 20 6
4269 6 20 7 15 -55 -60 -22 3 25 -57 -28 -3 -29 -34 -6 -41 -22 1 -14 31 7 12 36 -8 13 47 -19 0 17 -34 15 37 -33 -85
4302 -85 12 -9 30 -19 -4 5 23 35 -1 -10 32 -32 -45 -13 -9 15 28 -7 45 -25 -13 -61 53 32 38 -19 -15 -24 -7 -37 -31 -5 31
4335C1K5n6k4J7M0j36R9n7K1M7j2m4N7l3M6O0m7k5m6M6kj3k7M9o4M5K5m8K1K3
4365A8l9P7j9m8N8o4K7m2M0mPN2j10O6mk0lLj7Q3l5k7M7l8mj8L0mK8rl3L9l3P
4399A1k6N0qn0pJ0N9n1J4L8ro0rO3Oq1N8l5P6j36P2k0N0K4m7L8m6Rj1l8M7K0n6
4432d5M2K9k8k4M2J9l1PL4J1p7O0j03J05n3m4N0J0M0o9KrN7k7L8ll3n3P7k5m9
4463e0K8LK7l3M1Qp2L9nJ1oJ1L2l2l1L3K4jk2J0J4m2L1j4l4N8l0L4j7k8L3Ll5
4496a2P8n2k0M0l1l5l3O1m4J08n5m5oprQ2l8L0j4rl2nQ3n2N7Qkn2L9p1J8L7K8
4529D5o0mM3j7j1j1Oj6K9j3Qj0L8j3p7K7M5k8%M2K5m5l2K4mO0p4l0M2M5o6QP9
4562E5k9j2JOJ2j4Kl0Mq%P2j21P1k2j2k0M4K8m1J0k2K3k7QJ0N4m4K9j4k2J9m1
$$ plain form
4335 31 56 0 -24 -7 33 -103 -4 -61 -40 7 -5 -49 8 -25 21 81 34 9 -37 9 7 -6 -33 16 -48 -3 22 -26 -5 18
4365 18 -21 56 37 -11 47 -17 10 -32 8 4 11 63 -47 19 15 -5 -8 -5 -22 61 26 -1 46 8 4 -14 16 12 40 31 -2 37 4 11
4399 11 -15 35 27 -23 -30 -20 39 -12 2 40 31 -29 -38 25 31 -50 8 -27 49 -87 -15 -35 15 39 -8 30 -16 -7 -18 -56 -9 11 -45
4432 -45 -3 26 -2 -26 16 35 4 11 45 56 -21 39 -64 41 -12 -56 -6 4 44 -25 -23 -32 25 -2 36 33 0 -53 24 -1 -50
4463 -50 -22 -19 8 -25 16 24 -48 -9 -14 -3 -9 2 34 2 -29 4 28 27 5 15 29 -13 18 4 -30 28 -2 32 15 -13 20 23 -12
4496 -12 66 14 -6 34 3 -32 -65 -4 -48 60 5 -40 -46 -53 -62 20 -18 12 -2 -11 -43 -48 35 -17 40 48 46 -6 33 -38 -20 17 45
4529 45 -15 -19 24 7 -4 -15 -9 -25 4 -9 -1 -11 27 14 -63 -36 9 -19 -19 23 48 3 -29 -5 -9 51 -23 -53 -11 34 -32 -24 55
4562 55 26 14 15 21 33 19 21 -9 -5 -13 -13 59 -62 9 -13 -25 -45 -1 27 -14 -4 -26 -3 -30 -22 -12 42 -2 27 13 -9 10 -31
4595c1oK7l8O1J2l3K7m7N3k8K3mJ5j6K3pML8n8k3j0k2Q0m7J3j5LKM2Jp6P4m3l7
4629d3J8N1n8Q3k1r7O5%O5p2Pm2M4Nj5P7j4o7M0n5l9J05k5l1NJ20j42JM3K6k1
4660A3K0n2L0l2L0J0p5K1L4oqO9Po2M1qo3K1J7rJ1l2L1%J3J5m9L6oK0l7k6K0n
4694a1KQL8k9J7n6M2n6K4L6k2O4o9K3m4J9K4M2n3k7j0L1Jj9J6K2k4j1J1LJ1L6
4726C9l9j9N6n1PK0K6o7J9pK0L1p4O2k5L1J2p2N1lpMK7k4o5L5rqRk7J8L5m1N9
4760B3K8l9o2J8K1K2Mm9K2K4Rn6lJ9MM5%k7mJ4m9P4k6pL6l8rm4K7M5J7m9NK2l4
4795a7l9M6k0M3m1L0k3N8j6j9m9mN3J0j5k3L3Qk4L3m0K4OmqK3k5K1%m6K8npM4
4829C5qk1n7NN9k6K2J6lj5PM7p5oM1%n9O5nq2M8M1n9N4jj3k9k8O4j1J0k3k3L0
$$ plain form
4595 -31 -37 -10 -48 13 25 -8 19 -28 25 -3 20 16 31 15 38 31 35 73 15 -8 -18 -40 40 -7 6 -9 -6 -4 38 39 -37 37 -6 -43
4629 -43 -25 26 -32 51 30 -67 -2 -2 63 -9 -2 -44 0 5 -10 67 53 -14 26 -29 -68 37 12 -19 -14 106 -36 -35 8 34 13
4660 13 33 -19 11 -21 9 19 -56 -35 -1 -7 -15 54 61 -1 40 32 -31 -10 7 -2 9 -23 8 8 21 36 -13 23 17 37 0 -26 -6 -11
4694 -11 -9 -1 37 8 25 -31 11 -45 -21 15 -7 57 -12 11 -33 -14 10 52 -1 -28 -38 -7 -6 -25 -9 13 -11 -22 -11 -8 3 39
4726 39 0 -19 37 -14 -7 13 39 -28 -9 -16 4 35 -39 23 -2 29 41 -31 20 17 10 14 41 17 -48 -13 -22 -30 -21 -48 -30 5 -36 23
4760 23 51 12 -50 -32 -11 11 15 -34 -12 12 21 -35 -38 -19 -15 30 30 3 -1 13 -36 38 12 5 41 3 -6 -50 -23 22 39 -10 -5 17 -17
4795 -17 -56 -10 -30 13 -28 2 -21 37 21 2 -47 -51 2 12 -3 -26 7 15 -9 24 -16 8 14 10 2 25 0 21 21 -25 3 -2 -9 35
4829 35 27 6 -51 -46 13 -13 9 25 22 7 14 61 -14 -20 21 21 -38 27 22 -60 -12 29 -30 24 23 10 -19 -47 17 6 16 -7 -30 0
4863@j8NM5k2j0J3j6K0mOKj4k1QJ6o1O6Nk4j6nJ23j09J1j8N2o6O7l5M4mn8L4n
4897A1NK5o2L8j1L5m7jkK5l7Q0m8lK2J6l9pjJ6pm8%K2K6Kj1m4OmJ6K8K6n5P6q0
4933c2L2lk2M6kn1J26p9l5P3j22O4L2k7L8p3K6rjM9l5O8m3jM6k4k0Jn3K2lM7m2
4966gnM0k4L1K7n4K4l3N1mk1oL1qj1l2J4l8K7K1k1K3l2M8n1lK0l4J0M2O1m2k5
4999A9r4R1j5J4K1o0M8rk6J8L5m4J6j0Ko5N9J7k0K2k0j2J1J4J0lo3N6m5M7k1M9
5031D2j7p8J23k0n3j7Pj4J2O9q2kM3PK6m5j1mL3m1l2L1M4o4P3o4PrJ15p3J7qJ1
5064B6pL4p6j2K7m5K8M7J2n6J4J1j6L3l0PJ6j1J0k0L2p4O8l8K2Jl6nj3L5j7J4
5096a9O3l9j8m6M2M0L5o3k7RJ4N1l3J8m4L0m3J7l5O9Mk3k5k1K9N8n8K8k1L0Mo5
$$ plain form
4863 0 -18 -13 32 10 0 13 -3 17 13 19 21 7 -14 -6 10 -51 15 20 -4 -20 -25 98 -11 0 -18 34 -32 35 0 44 40 -18 16 11
4897 11 16 41 -21 17 6 41 -6 -7 -9 16 -21 59 11 8 30 46 7 0 -1 15 8 -40 -40 -18 8 10 -1 -45 -39 -43 -27 1 27 -28 48 -32
4933 -32 0 -3 -25 21 19 -32 94 15 -20 53 -69 -5 27 0 38 -35 -9 -18 -19 30 -5 63 20 19 65 41 21 22 -31 -9 -12 35 -7
4966 -7 -12 28 4 35 62 8 32 -1 50 46 25 19 50 42 31 -1 13 -25 2 23 2 25 -7 41 -10 -13 7 -27 -17 25 86 44 19
4999 19 -75 16 1 15 36 -24 24 15 -11 7 42 -2 14 4 6 -59 0 17 -3 19 -1 -13 -2 12 22 19 -44 12 -33 14 -7 42
5031 42 25 -53 70 50 -3 -20 -13 -27 -15 54 -28 -30 13 20 46 1 -10 -14 19 -22 -54 -23 21 -43 30 -34 -27 -36 79 6 23 15 26
5064 26 19 53 -23 -35 -8 -53 -25 22 34 -22 -8 3 -13 20 -10 -3 13 2 12 -8 24 -50 18 -20 2 3 -33 -38 -51 -16 -33 -19
5096 -19 44 5 -13 -59 -17 23 58 -5 -32 -23 -9 42 9 27 -17 13 -30 -13 -48 21 25 2 -23 -44 -15 43 -15 13 -8 22 26 -39
5128c9N5LJ3m4M1n6N3l6l7L2J0N1L1j08Q7q4J1RL7j4j0JJ4k9Oj7J4ol6M7k0N5
5160C4l9J2Po1K5N5n8J08j40Q8o9L0J6M1Jq4L5kL5m4k1L1lMk8J2O7q3L2L9n2J5
5192CL8o5M3J1l9N6m5J3m6O9M5r1jM7l0j6L9jl3n7O4Pm3O9k5j0l7k8M2n9M4NN4
5225B3J6l8j3M8j8rK1n4P8r0k1L6rK3m7k3P5LK3j4l4MR4r6j3oM0j8K9j1q9P4m9
5258f5O8J1Qk3oK3o6P1k8J2m4K0MjL9k7j9L5qk7K5l4L2J8k3nl9L2L4Ro1M5LN2
5292F5l9j0Pjj9JL1j6l0M3p0K8K4k9K1j2m4K1K0Ll3O2Nm9K7k0j5K0mk1M0M4m7
5325Cj3K1j3L4k6j2l6N1LJ7O3o4k2km0O9n1J5J1m9P4%q7RJ3J6K3L2j8K9o5N2m7
5358a0mK7K9l7m8k0J22n5L3k7m5J9QMl8K8k9O2rj3noP3n4o3L9j1L0n2O6j3M1l4
$$ plain form
5128 -39 16 19 32 -12 29 -27 26 -10 -47 -15 -5 46 77 -31 56 -28 -17 -8 29 15 5 6 20 -9 -3 -20 -6 -12 -48 -1 -21 34
5160 34 -5 7 14 -47 -22 33 -25 83 -57 31 -38 -8 8 49 50 -34 1 -1 34 -10 -31 0 -3 1 -27 -15 52 -31 1 40 -12 3
5192 3 41 -24 19 30 -9 47 2 15 -31 38 83 -8 -9 38 8 -8 31 30 -3 -60 4 11 -32 37 12 2 -35 -63 -21 -80 -36 -31 23
5225 23 39 1 -12 36 18 9 30 -24 54 -36 -57 -21 -30 -7 -54 -77 -2 1 24 10 -24 -20 74 -22 -35 -41 -1 -19 10 -1 -90 -16 -65
5258 -65 3 14 22 -1 -7 16 -50 21 -7 5 -39 -19 -15 -16 23 -4 -23 12 4 -23 2 -32 0 18 -5 -10 -49 -17 17 26 -35 10 13 65
5292 65 26 16 23 22 3 4 35 19 -11 32 -38 -10 14 -15 6 -6 -50 -29 -9 -6 -39 23 28 -21 6 -14 -29 -9 -13 -34 6 50 3
5325 3 -10 11 -2 32 6 -6 -42 9 12 29 92 28 6 4 -36 33 -18 -3 8 -41 33 33 -54 -45 -32 -16 7 39 21 50 -15 37 -10
5358 -10 -14 13 42 5 -43 -63 59 4 37 10 -35 -16 -8 -4 -42 -14 -43 19 10 -3 -8 -14 59 5 -58 -19 -30 0 -52 14 1 42 8
5391HJ5l7qN3k9l1j3R0m2j1k4L7j8Jj3L7J1l0M3q8Q0n1J0J3j0J6ml3M6j0r%M1
5424D0j7o3P3n5K7L%L3o5l1M0O2p6P0p4oK1j0Q%%%kK0O7n2k3N0n2Lk5K7J5j6O
5459bJ5l7NP1n7M2m6J4KoK8L7r2O3kMJ6l1Jj2k7J0Jl5k6K5P5n7K1mJ8j2k4J7O3
5494E8n2m4P1m3K3k7ML0k4nj3M6Rk0J5r0O8k9nP8q6M6on6P7n2J5J1pJ7l3J1M7
5527C4m4k9L5Kk6N1n4M2nMj1nJ7J8nm4M6L%m4J3mJ9ll2OO0k4l0K0K0l9M1r0L3
5562b5K8%Kk4P3k4k7mj5J1l5j1N1l3P6j5l9j9K0K1K7l8qj9O1Mj9j4M6o2j6K7m
5595dj8N0j16N7L3rJ8p4L1j6O1l2L9kk2Jpk2M0K6Ml2j1k0L0LJ6Nj8l0Pj0n1R5
5629B2o4J08l5k4M6q0qL3j7O7j9n4O5o5QJK3pRKm6QK9j6kM4Jj8m1Pj2KL6L1k8
$$ plain form
5391 8 23 -14 -22 31 2 -29 -42 48 6 -5 -29 8 -10 -9 -22 15 26 -4 39 -49 31 -20 -10 3 -7 9 5 -28 18 8 -1 -1 40
5424 40 23 -40 33 -22 5 8 8 41 -24 -55 -15 47 -29 41 -33 -39 -18 -28 -20 -20 -20 -20 -22 -2 65 13 -10 40 -12 -9 -34 -7 8 -8 -2
5459 -2 13 -24 -19 52 -5 37 -9 5 7 1 29 66 -26 37 35 39 55 24 25 13 -14 -4 -3 -38 -64 -39 36 -21 0 -4 14 2 -22 -5 58
5494 58 6 -38 33 -10 13 -14 -10 20 -4 -9 -22 24 33 13 28 -62 6 -23 -28 50 -36 10 4 -52 25 -27 -12 -1 -8 9 -24 -13 34
5527 34 -10 -39 -4 -2 -28 23 -31 11 6 10 -1 -6 11 29 24 -20 26 29 29 -15 -2 -6 13 10 -22 -16 44 20 -10 10 30 -9 32 -58 -25
5562 -25 3 3 5 -19 54 30 3 -1 -16 -5 -40 -51 0 -33 43 28 -11 -30 -10 11 38 0 -8 -27 34 38 19 5 51 -11 -27 0 -4
5595 -4 -22 28 -88 -31 2 -7 11 -63 -32 -48 13 -19 20 18 -4 -3 -10 -32 8 34 38 6 -5 -25 5 8 24 29 11 -19 -12 -22 -73 22
5629 22 -42 66 31 7 53 -27 -35 -2 -19 48 29 -25 40 -25 -17 -16 7 0 9 11 -35 -27 2 -14 -16 28 29 11 -30 -23 -35 -33 3 34 6
5664FKk6L4Mj7J2j9l4O1K0o8N1k4j6J8pk5K3k0O0m5P0kKj13J6O8l4k0rMj2O4l6
5698a2QM0l1lq4M8O2l3K3l4L9k2o7N9PK6l6L7k8poN0m1l4J7j3M5m8M2%m9M6m2
5731d1L4j8K8LNL4j01R3l4L0j9L1l2Oj4M7l4M5o6jMJ8o3M2l6J6L1K7r%k2K3n2
5764b5ML1m9O6l1l7N5ROn2k3L0N6k3K5q3J3K5j8K0l0K2m1L3k1N7l2L7Jp3nJ11
5796E8j18O3j5k1j0j4M7L5On5O1k3LO2r5J3%j1ROm2P6l8L8o9L1Kp5J05n9nO0k6
5829ak6O9l3omQJl4L2J1nj3K0jk0QK0k0J4Qj3j9P5p9L6qk8m4L2K7Rn8QO8p2K5
5865a3K6j8j0J9L3l5j9l6J26p9N7k9l7j9N6J6l2mk7j1J5l2kN0j7K5k1RK7n7L5
5896dl9N4k6ML3l1n1N8kMklpM2Kl9l2M1j1j6Q1r3N9J0p9O8m5M4k2J4k8K0pM4l0
$$ plain form
5664 6 8 -18 16 20 3 15 -4 -38 23 43 -25 26 2 -14 4 -3 -28 -5 -25 35 -10 60 58 60 -53 -37 31 -3 -23 -32 -28 -40 24 -12
5698 -12 -4 36 5 2 -82 -34 28 -5 18 -16 23 1 -66 -7 0 26 -10 27 -1 -8 -14 36 -5 -39 -22 -35 10 -38 4 4 -45 1 -41
5731 -41 -7 -25 3 6 11 45 -56 37 3 33 14 45 13 19 5 52 18 63 -3 -4 0 18 -45 -3 -39 -23 8 35 26 26 4 27 -25
5764 -25 -21 10 -39 27 -4 -41 14 23 29 -23 -46 -16 40 17 42 -41 -28 -3 -21 -1 -31 -9 -50 -17 -38 19 -13 24 25 -48 -53 58
5796 58 -60 3 -12 -33 -43 -57 -10 25 31 -24 37 14 17 79 -16 -3 -3 -14 -5 1 -41 35 -3 35 -34 -3 -1 -76 29 -30 -35 25 -1
5829 -1 -27 42 9 3 -1 7 8 -26 6 17 12 -1 19 18 -2 6 26 6 20 28 15 -4 71 -8 28 20 -8 -52 -20 7 16 -42 -34 34 -38 -13
5865 -13 13 -5 -15 4 37 2 -17 -53 73 -6 51 22 -15 -34 22 38 6 2 -25 -36 -21 -53 -55 -5 -22 3 -18 -9 18 -39 -4
5896 -4 -43 11 -15 -11 22 -9 -60 -2 -4 0 -2 -5 -12 30 32 -7 -39 2 -9 -25 56 -37 22 32 -47 21 -24 20 -2 12 -16 4 -3 41 11
5931A1L9p1M2j4KO0n9j1k9L0j8Knj2NK5Kj6L8nj3l9M6k5O8o3M3j7k6J7k1J5J4
5964A5lj9J8m4L1N4l6K3pOr2O4j2rK4J6j6k3K8k2j2L0Mq2O8J5nj3N4m2j8K0Kj1
5998FP6k3k9j3ol0L8J7k5K0j9J6o7L3N0rj1M2p8j0N5o1J08j03M2n0M0M4k6m5P
6029a1j7j8P2m1j7M8J4q1R1q5K9J6pk7J3N%K3j3J4qo1N2kl9Q2Jn8M6l9L2k6LJ7
6063HJ4%J6o6N6mm1K3p9L7M5k5K4n4O8n9K4j2M1l3j3N9nk6k1Q3k5l2l7N2M1k8
6095C1n0L6Km2R4n2OjjM2p1n3L6M0Pm8L4k8J8L7l8mj6P5ol7m2Q0l0on4N6k6KN0
6130D1k9nK8k8l2Q9n1L0m3k7RJ3N5l2k0rJ5kj9mk4N3l3J0j3P0k6j0JL4j19P5K2
6163A9n8N4K6mk2K7p2K3pmO5j1l4m1j5P7k8k8N2J1Kl1qj8Mj2O1k2l7QO6q0L7O
$$ plain form
5931 11 50 -21 21 7 9 69 10 -1 -30 0 -18 -16 -21 -33 -28 -3 -1 -17 21 16 3 -36 10 -15 53 -10 33 16 -10 7 -14 1 15
5964 15 12 -7 11 -33 -2 52 16 39 32 38 -54 10 -2 -11 13 29 13 -10 18 -4 -16 14 18 -64 4 19 14 1 55 13 -5 15 17 6
5998 6 82 59 30 17 11 -19 19 36 11 31 12 28 -39 -6 44 35 24 66 -12 -22 33 -28 80 -23 19 -31 9 53 27 -18 -11
6029 -11 -28 -46 26 -15 -32 16 30 -51 40 -45 -16 0 -7 -34 -21 -16 -16 7 -6 8 0 -61 -9 -11 -50 32 33 -25 21 -18 14 -12 -9 8
6063 8 22 22 38 -28 28 24 -17 6 -73 -36 9 -16 8 -46 22 -37 -13 -25 16 -17 -30 29 24 -2 -23 60 35 3 -34 18 59 31
6095 31 -19 17 19 -23 71 19 25 24 23 65 -6 -59 -23 17 24 -24 10 -18 0 37 -1 -5 -21 54 48 11 -31 49 19 13 -41 15 -11 -9 41
6130 41 12 7 35 7 -25 64 13 43 0 -27 -18 -5 50 18 -2 -11 4 2 -17 -21 -45 8 -25 -15 -28 42 16 6 7 41 -78 -3 19
6163 19 -39 15 41 37 15 42 -30 -7 -14 -18 47 36 2 -39 -54 23 -5 -33 19 30 32 1 -7 -25 -21 -33 28 6 -31 -23 43 -37 0 6
6197Fk3J2NJ8JL1o8LL2L7q6K7k6K5NokjK7m3P4n0K6j9j2K8l2l4O4J6Jm6j5k5L9
6232a1P0n0M3J2o4PK8K4o3k7RP7k1l1Rnlnj8k4P1l5kJ4M1p8M8j4J8k8Oj3J6K3
6266B4k5J5k3L3k5o2J04l7n8Q0l6N8r4J6N9%m8N3L1n2l5J1Qpl2j9J54p0K5n2j6
6297b0k9N9k0JM8p0O2%n3oJ5kj3L2k1J5l3L8rj5N9J6n2j3K8o2M2LJK7m5Rk1OK4
6332Aj6rKJ6K4k6qK4j8L8j8jL9k4J3p8M2L7l8p0O4K6j7j4NJ9j0L0m5Jk3NK4L7
6366C2j1m8Q8o2M7l3rMj1Mjj9k6K5J9L7o3M6l4N6m3k3J9j2lj1oK8%LM0k6k6J3
6400fj8JL1lk0j7J1K5l2J1M6Mm7j2O0l7mL5j6J2m0k1R3m7L6q7KO6m0K0K4nl4L3
6434B4n2RP3m7mjJ6j3pL0l6NjnP6j13P0J9l7K9P9p1n9l7L2J0rKN6j1Ml2j0J6o5
$$ plain form
6197 6 -17 -5 0 18 19 50 -18 -15 17 54 -32 -5 -31 -6 -1 -7 -9 -10 17 -26 48 -2 24 5 -7 21 -11 -45 19 35 36 -10 -25 -50 -11
6232 -11 59 9 52 64 0 7 35 59 -4 -31 -22 55 34 3 12 7 4 -1 -19 -43 28 -7 -9 5 46 -32 16 2 20 -8 -2 -15 1 24
6266 24 -1 14 -9 24 -1 -63 41 4 -54 26 -10 48 -46 -30 29 29 -19 34 65 13 -22 -11 -3 -10 -42 -61 93 23 48 -4 -20
6297 -20 -49 10 -10 -9 39 -31 31 31 -22 -28 -13 -15 -28 4 -17 -2 -35 3 -6 -21 38 54 2 -11 17 -45 -3 0 1 28 -17 -8 -29 -23 1
6332 1 -15 -24 -22 -6 18 -8 -16 8 -10 28 10 9 48 24 37 -41 1 38 0 -70 -6 20 3 -11 -6 13 3 33 -12 -11 -34 -29 -5 32
6366 32 21 -27 61 -1 46 13 4 8 -3 1 0 -19 -45 -20 -1 36 -27 19 -15 41 -2 -25 -6 -18 -21 -32 -38 -10 -10 -7 33 7 -19 -6
6400 -6 -24 -23 8 5 -15 -32 -21 4 -28 -17 29 33 -14 -26 34 -3 -7 28 12 24 -16 -37 56 9 45 -42 -40 26 -14 6 30 25 -9 24
6434 24 -28 -19 54 7 3 2 18 5 -2 28 -8 -3 -4 -9 67 -46 24 43 6 35 114 43 -16 -53 -21 -11 -20 -18 38 27 31 -1 -11 5 -60
6469f0J01k2L8j0j9l6KQOk9k7M0j0L6l5M5Pn2o%PL3K5m5l0K6L6ll4O4j9k4l2N4
6503C5l4L0J4r2P7mM5j07J7N6M0j12M4k7J6L2kn0O1Jk1Nk6L5n0k4J4K3k3O4p0
6534c3J3K8M7o6L7l0K0%l0pO4m0l4M1J3Lp3ML2N1q3O6J3o0j8J9J6N3o8L9j0k4
6566a7l4M4K3J7m7j8oL4N6o7N4m7j6J2j4N3l2l5P1r8M1K7L1qn4N9n3QM1K0Lp0
6598b2l0J00n9rJ9mLL3k3lO5q6M9m2LpK4j7qL2j3J9K1l7K6m7M2m8K5k5K6j2L8
6631C3j0l7ol5M3K1r0P6qk1J2J8Ok0M3l7J5qO3n7knM5Rl0Nl6Mk1K0JJ0m2L4PL6
6667C6j6j9J1j2kqN3q3K2M8l2K9PJm6j4QK7k2PN9o4L1m5J0L9k7LL6m7M7jm2JJ
6702djp3M9L8J%l2rL7Qp0N8MJ1m2M5lK1l6J8k8oK7oK6p7Q1l9J8J0l1k2P1m4l6
$$ plain form
6469 -60 41 19 57 47 28 -8 -6 2 8 -21 -48 -8 -18 18 -17 28 35 -17 -23 -23 -16 17 42 -3 -33 -7 29 26 -8 56 37 13 -19 35
6503 35 1 31 45 -47 30 26 71 -36 -19 37 77 -35 9 -18 -2 30 28 -22 39 40 19 24 -2 33 -17 -41 -27 -4 -27 37 -33
6534 -33 -20 8 55 -11 26 -4 16 16 -14 -21 43 3 -31 10 23 26 -47 -43 -11 40 -43 23 36 -24 -42 -23 -7 46 -22 17 7 -17
6566 -17 -51 -7 16 33 -14 -32 -38 -4 52 -15 39 -8 -24 -12 -26 27 -5 -40 31 -67 -26 1 32 24 -30 29 -24 -16 25 45 48 -22
6598 -22 -52 48 -11 -20 -1 -5 -2 31 8 5 70 -16 33 -9 -6 -13 11 -6 -14 18 5 24 45 8 34 -13 29 -19 6 -19 7 -5 33
6631 33 23 -14 -20 -55 -12 9 -81 -5 -13 -34 -22 -4 2 -18 25 -12 3 -5 58 1 -1 -6 39 48 18 23 -13 -9 -30 -10 -9 1 -41 -7 0 36
6667 36 20 1 12 0 -2 -10 43 -40 -18 30 -2 27 34 35 -11 -25 -17 10 -12 -5 54 -10 21 -24 -14 25 -2 1 37 -10 37 36 -6 -5 -4
6702 -4 -5 -78 -29 9 10 10 -22 -31 6 14 -56 2 6 17 -25 20 17 38 2 20 -8 -14 13 7 33 -44 37 -2 16 26 -5 -27 44 0 -36
6737c6O3l1k0N2nm0RJ4k7L3p3L3K0L6j7k1oMl1N9K2o9N2j8m5P7K3n4N1p5M0%j6
6770DL5o8L9lj9O3p0M1k7Jm1P1l7l5K4L1o1j1P8L1l5j1l4J9ql2P1k0%k2J9L7L3
6803F3l9L3op5K2j2N3k9K%J0K3l0p9O0l1O0K8n7K1j7L6q0O3j0J9m8J6l0N4mLj8
6836A%J1J3l7l3R1m8l1k1M3%l6K3jMO4l5J5j8m2lKJM6k9L2nO1r5J2K3kj6K1j3
6871bk9J00o0k2O1l6MJJ2o6O3k5LL7o6N1Rm3pL6J5n6Kj7K2m2K7J5lj6M3j8%L4
6905B7r7J17k7M5o7N7l4k0Kkm8Q4l9mK3j6l0K0j7n7L5K2j0L0NqJ7J0o8PK8M2m2
6938a5LL2kj8K0l6O6k4o9N6m8P4q5M4Nj7lJ6pOknM6l3j%Lj0rJ9j3Ql1J5j3K1M
6975cOon4P8m3LOM4k9K4m7jN1l9j8M0j4J9j4l5RQ6m6k5JNl6kJ3j0lN3Rl7K7j3
$$ plain form
6737 -36 27 -4 -24 28 23 -17 -8 6 -21 12 -61 -28 -8 28 11 -10 -16 -12 -43 16 38 -31 21 3 -42 35 58 4 55 -20 20 20 4
6770 4 39 -29 10 7 -12 51 -19 22 -5 -4 -45 26 -11 -46 -22 9 -52 -63 15 46 11 0 -34 -15 -23 -55 16 -4 -4 -26 -7 30 63
6803 63 24 57 51 -24 -2 -14 39 10 12 12 22 45 15 -64 -4 -35 25 53 -4 17 0 36 -44 19 9 28 -20 -4 -34 20 16 19 1
6836 1 1 12 25 -12 -45 46 -2 -33 -54 -11 -11 -47 -24 -25 -21 43 8 23 5 -37 -40 -38 -37 9 -20 12 7 68 -27 -15 8 6 -10 11 -2
6871 -2 -31 69 9 -13 48 12 16 17 29 -37 26 1 4 41 -25 26 35 -8 -15 21 36 -20 -18 -35 -13 -55 -28 -13 -16 -32 11 -7 -7 27
6905 27 -70 47 20 65 -2 55 21 1 3 1 -47 37 -2 -6 17 1 -29 -9 -26 -83 -48 -26 -36 -6 -1 -9 8 18 -50 -43 -15 27 -15
6938 -15 -12 20 18 0 20 -16 50 26 -43 13 -35 39 -46 -2 3 -14 -17 -1 -8 -2 -4 -9 37 4 3 3 6 -4 -13 6 -7 1 -30 -15 -28 -7 -3
6975 -3 3 -3 -57 21 -22 -19 -13 31 2 26 -21 -22 29 -10 -28 12 -2 17 3 -32 -23 63 17 -8 -7 -2 -38 -40 -27 -37 -40 13 22 -15 12 -1
7011aJ0k8RmJ7o0N0Pm7L5K1rK5k3j3jK0l9K7k0K6K4oJ9l5rj0J3L2j4k2lJ7QL6
7046E2k4k9K7J8m9K1K4kj7m3M4q1P4l6Q3j0q4O2p9K9kqM2J7m3L6m1OM1k0K0J5
7078D3j6m7l0O5pj2J6rJ7J3m9mJ6k0J2j1L3j8lK3k2K5QL1l5q8J12k5Pl1k5L3k0
7111a8ML1Mklk0l7O3j1p0M2PK5m2R6r0L6K3p5L8p6O4m0N7kmJJ0J4K5m7j6K8Lp3
7146e5K5O7o3J8N7l3J1l7O6n5j1j7J4J0jk0J7Qk0J9J5l3J3l8M9l5J4KOPK6J8p5
7179c1j8L8K4j3J8j4oN8j11K2lR0k6p0O9o8M8J7L0k8p1M6j0LL8J2m5m8R6m2QJ
7211A4l3k7M6lmk1K%J1j8k8J1M2K6k%kK6o2qO9l1Qn4O5n1J6nJ3L0l0N7o0pL0r
7247A1k9J4K9l8mJ6L8m6M9q7R8o2K4J1o1Q2q7Q1n6J6J8j1j1M9n2L6ml5J1n1O2
$$ plain form
7011 -1 9 -19 -10 -14 3 -57 -7 0 -47 -12 9 0 25 2 -11 -12 8 -31 -4 -24 2 26 20 39 4 -5 -15 -2 30 16 -6 -9 8 16 52
7046 52 28 -1 26 44 -5 16 40 38 21 -22 22 -59 15 -21 62 52 -32 30 -49 -20 -22 -30 12 29 -14 22 -19 -13 28 8 28 43
7078 43 27 -20 -50 15 8 -4 12 3 20 33 -16 -20 -4 -24 -12 -23 10 -8 -11 12 -10 15 23 54 19 -69 43 18 25 -6 -31 2 -18
7111 -18 -14 17 21 19 16 -4 -41 22 11 -59 -17 -10 15 -27 69 -21 15 38 -37 1 -75 -11 -51 6 4 0 1 11 25 50 3 -13 15 18 -55
7146 -55 -30 37 -26 -8 49 16 27 -10 56 1 -10 -27 -13 -3 -4 -24 -7 1 -19 0 15 -18 -5 -43 6 -29 -15 -13 -7 0 26 44 -31
7179 -31 -49 -11 13 0 18 4 -2 56 -55 -33 -36 54 28 -42 27 -41 7 24 54 26 -45 1 -9 -6 32 44 -1 -49 47 5 13 14
7211 14 -19 -46 0 -3 -7 -28 -26 -26 -15 -33 -61 -50 -8 18 16 16 14 40 -22 -30 39 8 16 -38 27 -24 -8 -13 0 30 0 57 -3 -10 20 11
7247 11 -18 -4 25 -13 -17 -1 37 -9 40 -47 51 -11 13 24 -37 45 -42 39 -17 -1 17 6 -5 44 -8 28 24 -11 0 -51 11
7278A1J2j12J16k8j9J5nLj8M3M0k4K5l9l0L7k1kL5m2J2J6o4k2L2qQQm3L3M1m3
7310c3M4m3O7k2K9q4K0QKKK2Pj5qj1J2J1%J3qPm7M6J9o1L1Kk9P3l0jK8p0PL7p
7346A8j0o3R4k9K0l6mj5P1k9o4O2K8m6j7M7l3l8RO8j6k4K5m5j0P5po5M6lj2k4
7378b7oKP5k9n1K7K0j4K4K4k2j5l6L0J7j0J9k7J2Ml0J6J6%j0k2j2j5J2N0k5J6
7410A3L9k7q4J2J02J8n4k4rL5M6r8N2oomp0KK9M9lMm2mm0Q6k2J8j7j4JM6l6NL2
7445B9m6K0M3l5J2M8r8P0m5P4n3j9K1l4j6L6j3kJ7k1rK5K8L4l3n1L6Pj0nML4j5
7478C3k4m2rK6J3k0O3o4O6r0N5j4j3o2J07L2o4K7NoL3m4K3rM3q0M6l0k6K4K5k
7510B2L6k6l5qk7P7q5l6N0L7qk0PN0j9l0L5n4N6M2p2K1k8L6j3Pj5K4Ln4mM4l3
$$ plain form
7278 11 23 -89 27 -1 -20 -5 -10 -7 -25 18 58 34 59 20 -10 27 6 4 39 -3 9 25 -39 -61 -29 -37 -29 -21 -64 -31 10 -33
7310 -33 11 -32 35 13 42 -42 -22 -14 -12 -10 12 19 4 -4 -15 -3 8 8 21 13 20 -27 19 38 -23 8 10 -19 54 24 23 51 -19 -12 25 18
7346 18 8 -55 39 10 30 -6 -10 -25 46 17 -47 15 43 -3 -20 27 -6 -44 -35 33 17 -7 18 -27 -37 38 31 -34 12 9 -3 -27
7378 -27 -33 -31 44 15 -36 -9 11 -3 21 45 23 8 -28 2 19 9 28 1 13 17 -13 3 19 19 9 -13 -25 -40 -28 22 -3 13
7410 13 52 25 -59 -47 55 73 19 -5 -14 21 67 -31 21 15 9 5 -65 -63 -34 15 12 16 -26 -30 -70 16 -6 12 -5 -19 -18 28 -8 -3 29
7445 29 -17 3 46 11 23 71 -27 43 -2 72 19 0 21 -13 -29 7 -6 -8 9 -12 -21 4 32 66 33 -18 18 25 15 10 14 48 33
7478 33 9 -33 -42 -16 -3 -23 40 -24 42 -48 7 -7 -20 -82 25 57 -7 20 25 19 52 8 31 22 65 -15 31 1 -25 -1 24 22
7510 22 58 32 -3 -11 -38 39 -46 -82 -32 5 -3 -23 -16 34 15 -15 20 -34 22 64 -8 13 -15 21 8 15 0 24 27 -27 -31 13 -20
7543b0NL5o3kN6k7J9M9p1oL1nmj%qJ6p2J02n2L8m1rJ6K6k5k9PO4n1N2l9jl0K2
7578a8P0o3J0k0N3o5N1PKn8K5M8l1J4kl7j5K0L7j9j0K4Kl7Qm4J7j4R5m1j5P4j14
7611d6O9mk6K7j1J4Jkk3m2N6Kj5k8j9O2L1k3k6j5J9JJ6J3m9L1j6L0k6k4N1m1M
7644irK5J9MNm1n3nM6L6q4J56j45M2K2o2O5j4J6ol0J5L3l8K8k6l8KK3l1M1Mj3
7677b2nL6n7N2K4q7O6jJ6q0N2l9M1Nl4N2k6j4M1j9jl5N7l5oM7l1j0N1j4o4R1j5
7710C6lk2j3l2N4k9K5j9k7P1k3K6k7n5N5J5l6%M4k7l3K3OM2n1j1K9j4QM3o7J9
7742Gm5L6%J2o7M9PrRmM4o1M4k2j7OpM1J1k1n1L5K7n4LJ6k6L8JJ4M8o5K3J4o1
7777b5MJ5j3L3L5p8J0O6j3j4j2ol7O2o6N8n0P7n0L1k9K9m3L3pL1nl4Lp1M9N2m3
$$ plain form
7543 -20 -15 20 -43 -45 11 -16 3 52 -19 -25 6 1 -3 -4 -4 -12 4 -68 34 -18 20 -21 -30 -14 12 -13 -42 -35 29 -22 30 -9 -10 -40 -18
7578 -18 52 -11 -1 -21 32 -33 18 25 27 -31 -6 42 11 25 23 -14 -29 -9 28 9 -1 23 25 -12 -4 -48 -31 -45 50 9 -6 68 -46
7611 -46 23 19 -7 20 9 23 24 22 -1 -43 13 15 0 -28 -47 15 46 23 -3 -18 1 2 18 31 -18 13 -3 27 1 -23 28 -13 -9
7644 -9 -18 7 26 30 35 -6 -59 -64 -18 18 -66 90 -55 -13 9 -53 12 -2 14 8 -22 -7 26 -12 16 -10 -48 -46 -23 -54 -13 -9 -22
7677 -22 -27 9 -48 4 28 -59 7 6 22 -58 -6 -45 -4 1 -33 19 -7 -21 20 1 0 -35 22 -13 -19 28 -3 -13 38 24 -40 51 36
7710 36 33 11 -2 -34 20 -9 16 -3 -30 41 18 44 17 -38 17 32 -4 -4 40 13 -20 3 9 51 0 -11 18 4 12 55 -12 7
7742 7 -38 -2 -2 10 -57 -8 -1 -10 -1 -5 39 -22 22 0 -17 -11 -18 23 34 13 -38 -3 24 -30 -27 -11 -37 1 2 16 64 -1 22 36 -25
7777 -25 -21 -6 -19 14 49 -29 -19 47 34 20 8 2 -35 27 -39 19 -31 46 -4 27 -2 27 -16 17 10 41 36 2 5 -66 -17 35 -8
7810h%J4J0J1m7J4PNj7K7n2N6K1k2m5L2l8L5qN2o9J6J2K2m7L3Qk2M4j9j7K8k5
7843A1N8pj42R4k3j6RM0l7k5Q7q3M0L4r9Q3l3jk%J3J0k2Qk3L0l3K6kk2O8m8M6
7876C9m9Rj5J9K0j2O7o9oQnl1LP5k7J0k0J%j7K0l7K2pJ1j0k2mK4L1l4lK8Pj5Q
7912A9k4J5k3RrK2Lj1j6K8J3lJ3p9P1k3j1J6k1JK8n4K0N0m7K0J8j27P2k4N9Jk4
7945a8n3P3J3k5nM1p2O1kJ5m6pN1n2P1l9k6M9j7qK8p9K8O4m5L9Jk9oj5j4j5L0
7978iJ8nL3l4nJ0k4J7j9N2n4L3Kk8O9p8L3m7j5R5p0JM0J8Ln0N9p4KN8k6J4K9n2
8012dj7L1J9l7JL5m5j6K1K9l4N6l1k5O5o6O0m3j3K5j5nK4nJ4J5l4k6L8J7k1J5
8044B8j0j2L8l9lJ0oj9O3k9l7Rj3L6l3L1j1L4k2l1R6p5m7O6m9jN3l1J8l7K3k1
$$ plain form
7810 -8 -8 6 16 27 -20 -6 1 6 -11 16 -36 20 41 19 -26 6 -32 3 -5 47 -22 -6 6 28 -19 14 22 0 44 25 8 36 11
7843 11 69 62 -80 14 -9 -25 -16 24 -13 -38 49 -34 6 40 -59 24 -9 -10 -12 -12 1 11 -11 -3 -26 4 -29 -3 -5 -27 41 -7 39
7876 39 -10 -1 -16 3 23 11 78 9 3 11 6 -25 -22 53 26 36 16 17 17 0 20 -17 5 -2 9 -1 -23 -27 -3 28 -6 -9 19 26 11 19
7912 19 -5 10 -13 -4 -13 9 12 1 -15 13 26 23 36 -43 28 5 -6 10 -11 -10 18 -36 -16 34 -13 7 25 -102 -30 -54 5 6 -18
7945 -18 -71 2 15 -10 -15 26 -46 15 13 28 -18 -25 26 -26 45 6 -20 29 12 4 32 -47 -19 45 0 39 40 11 5 -10 -24 -39 -9
7978 -9 9 4 37 3 -2 8 -16 1 -18 34 -20 13 15 -13 56 -22 11 -36 -51 44 -26 -25 15 33 36 -14 45 -29 -27 31 5 19 48 -4
8012 -4 -21 10 29 -8 -7 28 -17 -33 -12 17 -17 39 8 -17 48 -18 42 -1 -14 11 -4 -9 15 10 24 39 5 -21 17 34 13 28
8044 28 18 6 44 5 2 12 6 -13 50 21 -16 -7 -20 16 -17 14 3 37 15 -16 80 5 -42 24 -25 -26 27 -4 14 -23 0 -21
8076b1M0%m5k9P6j1k6N1r0N8k6L1l0k8O2K1o0R2rr6K8N3J2r4NM1k7j1P1m6K4m6
8108c0J8K3j1K8Jo0NM4l7N9l3k6N1k8l4J5j6j1L7K2k6K2m2M8l3J9p4P1k0J6J7
8139A5L1j2j2m3J4jj9K9l9O2k6jj0J9j4oJ8Ok5k0N1k7J9k7RJ0M2n3J1Ljl7M0K6
8173C2m0M5K1m4n1MK4K4K3l0oj2j3J9k6k5P9q
$$ plain form
8076 -21 19 19 -26 -55 21 10 -16 35 -55 3 -23 8 -22 -50 12 33 -27 65 56 -40 -12 41 53 -41 -36 5 -22 -33 38 -8 16 -30
8108 -30 -12 11 0 28 29 -31 -26 18 -19 40 7 -19 32 4 -30 -15 -31 -42 -5 17 -9 13 -29 19 -14 5 -69 2 -18 -2 15
8139 15 46 34 22 -21 -7 -8 -27 2 -37 25 -1 -2 -12 7 -7 -13 5 11 -14 -34 17 -10 9 -18 -9 1 43 -10 1 4 3 -34 6 32
8173 32 -8 37 58 14 -37 -33 -9 15 38 8 2 -10 -23 -4 -30 -55 24 16
8191A6
$$ Imaginary data points
##PAGE= N=2
##DATA TABLE= (X++(I..I)), XYDATA
0@%%%%%%%%%%%%%%%%%%%%%%%%%%%%%%%%%%%JmPj0J4j6J6j6J6j6J6j7K0k4K8l1
51a6L3l6L9m3M8n2N7o5P3q2R4j08J27j50J83k37L27n24K144j526m29J959j092
74G24o37J098K15j734M09J097q60j249J196J50j470J25J183q85j004J208M09j312
92a337L24J265n94q46J316N82j222K49J448n73q34J080N70j311N6J173n52j009
110b15P89M00j298j62J102o50j114Q65M90j243r4J185n24r40R63P25j086k9J322
129D86l64q08J015O95j040n2J272l13j008Q10N72j107j50R57l77j049N52M90j125
148e44k59R97l61j069P60N89r70k00J069j47q81P29P66q27j45J227j36q26N77
167C49P33p67l00R67r1r86M38O43r04m00Q64j60j094M04N59q47l75R16j10r46
$$ plain form
0 0 0 0 0 0 0 0 0 0 0 0 0 0 0 0 0 0 0 0 0 0 0 0 0 0 0 0 0 0 0 0 0 0 0 0 0 1 -3 4 -6 8 -8 8 -8 8 -8 8 -9 11 -13 15 -16
51 -16 17 -19 20 -23 25 -27 30 -35 38 -44 50 -58 69 -81 102 -135 192 -332 1812 286 -143 1816 724
74 724 87 1185 1400 -334 75 1172 312 -937 259 409 -1061 -936 247 -638 -1642 -434 -25 -1337
92 -1337 -1013 252 -342 -1188 128 710 -512 -263 1185 612 -222 858 1428 117 173 1346 794 -215
110 -215 574 974 -324 -486 616 -34 -1148 -283 207 -1036 -1130 55 -469 -1409 -446 279 -807 -836 486
129 486 122 -686 329 1024 -16 -68 1204 891 -117 693 1265 158 8 965 588 -461 91 581 -544
148 -544 -803 194 -167 -1236 -476 113 -857 -1057 12 -135 -1016 -287 479 -348 -493 734 598 -228 349
167 349 1082 315 15 982 891 -95 343 986 82 -318 546 386 -708 -304 255 -592 -967 -51 -161 -1107
187a107M68Q14p58l40J068Qp94N12Q42n82l90R98N9r04M41P30o90m37P84K6r46
208a98J76P17p82n32P13M8r79K48P36o99m39P67J93q61L05Q03m13m71R24K63q27
229c08K69Q66m76m79Q23J72q57K01O93n65n32O27Q9q92J16O37n48o66O95J90q96
250h41R4Q17m33n64P50K62o71J95Q61m62l99P65K95o79Q0P81l74n45O93J82q05
271BJ6O95m81o61N53K11q07p7P26l91o68N89K87o61K7P45k25n77N99M84o64K2
293b56Q00k19n37O14L99o91r9P94k39p54N13L75p96j12O04k69p30M48L62p97j38
314g28P49k44o36N93L67n92n5P05o3n84M66O24o00q5P19q9n91M19M00o14k11P52
336G02k11p12L26L70o75k94O55j56p53L76M30n55k34O46m5n94M35N34m57k30P62
$$ plain form
187 -1107 -639 175 -583 -923 145 153 -641 -129 713 131 -259 739 798 -106 335 1065 375 -62 722 748 -198
208 -198 -22 695 -87 -619 94 142 -837 -589 147 -552 -991 -224 -31 -892 -587 216 -197 -668 256 519 -308
229 -308 -39 827 351 -128 695 867 10 211 904 339 -193 434 523 -369 -253 384 -164 -830 -135 55 -841
250 -841 -747 70 -363 -927 -177 85 -586 -391 470 8 -391 374 669 -10 70 851 477 -68 625 807 2
271 2 18 713 232 -429 124 335 -472 -549 177 -214 -882 -293 -6 -667 -640 105 -120 -697 -98 386 -278 -256
293 -256 544 325 -212 402 801 110 11 805 566 -188 325 700 -96 -208 396 127 -603 -155 207 -590 -728
314 -728 21 -223 -859 -266 101 -491 -546 159 96 -488 -22 602 2 -83 636 547 -44 375 775 161 -50 702
336 702 491 -221 105 475 -200 -494 161 5 -748 -372 58 -497 -731 -85 -130 -724 -289 245 -212 -442 320
357C20K0n58M10N69n56k53O92J2p32L83M43o18k71M80k3p63K41M78o01l55O06
378g6N1p12K48M95m29k34O33J69o43L51N73l86k72O13J15n51K23N65l95l33N05
399E10N5o55R1N63n21m70N60Q8p16J09N37m84m05N38J49n50J90N61l55l14N96
420G7K16n64K28O09l47l45N60K37o38O9O04l76m91N26J03o96K1N48l61n15M78
441e7J99o97l4O41k98m59N17K86n51N2O86k23l74M90L52n79O7O36k48m50L86L08
463F50n41j33N57k68n78M25J67n37j88O05l01m98L84K89n80l2N87j55m30M06M06
484B35m44p4O41m5m62M02L29m69q9N23n9n34L33K91n22k39N10j65n69K83K61m83
506c46j94N37j22n38L71L28l91k17N74N2m18K80M98m37j49N82M8n16K39M47l96
$$ plain form
357 320 340 -218 192 761 205 -48 644 656 -76 307 750 132 -139 341 318 -445 -204 274 -327 -682 -76
378 -76 -25 -737 -489 6 -423 -657 -24 145 -498 -147 426 40 -232 381 496 -55 168 733 338 5 510
399 510 565 -90 1 564 43 -427 133 221 -495 -386 151 -333 -738 -200 -51 -601 -411 150 -205 -519 77
420 77 293 -271 -43 566 219 -126 434 671 33 102 706 330 -161 365 468 -228 -207 341 -20 -535 -57
441 -57 142 -555 -589 52 -246 -705 -188 98 -453 -401 285 62 -312 178 530 -49 18 654 406 -44 342 650
463 650 109 -24 533 265 -313 112 279 -258 -446 159 -142 -640 -256 33 -547 -579 8 -147 -577 -171 235
484 235 -209 -283 358 313 -149 253 582 113 24 547 488 -46 287 578 56 -183 327 162 -407 -124 137 -346
506 -346 -540 -3 -125 -663 -292 36 -355 -572 2 54 -364 -84 414 -23 -172 410 458 -58 181 628 232
527B32k64N01k3n67J87L03l98l65N03l5n89K11M31m43k48M42J26n57K29M86l67
548b05k55O50R9m69K09M65l28k66N48P9m99J34M69m52l68M84K8n65P6L88l66l27
570d71M17P3n34J67L99l31k78M54J86m93J92M79j87l41N05J70m68J52M76l09l54
591i6M28K23o09N4M37l20m07L63J54n57M2L74k98l73M30J57m97L2M84j35l28L88
613e4K74m00N5N13j63l57M61J73n13N6N06k21m16L27J53m82k7L74j84m82L36J56
635H5m38p0M29j76m06L59K63l62q2N20o2l39L01L74l99j12N26n1m63K89L56m47
657I5j00M52j78m01J95K36m03k44M35r6m08J94K55l99j24M98j02l81K72L12k81
678a73q2M76jl94K67M25l85j38M46n2m22K39K70l96k16L54k4m70K12K37m27j88
$$ plain form
527 232 -32 469 446 -121 66 369 -29 -394 109 74 -515 -304 127 -316 -564 -122 4 -553 -324 162 -205
548 -205 -460 190 289 -180 29 494 166 -100 448 527 28 162 631 179 -189 295 323 -242 -166 222 -144 -471
570 -471 -54 19 -515 -348 51 -280 -558 -104 82 -411 -219 260 73 -268 237 407 -61 91 567 258 -96
591 -96 332 555 -54 0 437 117 -290 73 227 -330 -288 86 -212 -585 -155 2 -495 -463 21 -114 -442 -54
613 -54 220 -180 -125 388 225 -132 329 502 -11 45 551 330 -86 241 394 -88 -115 259 75 -407 -71 85
635 85 -353 -423 6 -170 -576 -217 46 -316 -398 122 60 -279 22 396 -3 -115 411 360 -103 186 542 95
657 95 -5 447 269 -132 63 299 -104 -348 87 -9 -417 -223 32 -367 -491 7 -95 -476 -204 108 -173
678 -173 -255 221 220 -174 93 518 133 -5 441 389 -33 206 476 80 -136 218 194 -276 -64 173 -254 -442
700d42M10p6l81K06K66l76n3M65Rl55K31L07k06j43M19J1l40J30M52l78j61L73
722C68K8m47P0L38l37k97M09qn01P8M02l08k72L82L4l99J48M25k85k05M90Q1l31
745a37O6M35j98k98M78O0l95J00L16j97l23K99J21m99Q0K92k44k98K69J21m12
766c64k7M43k67k81L85J60m63J77M01k03k22M14K16m00kN16k01l28L63J12m07
787B2J8L55j84m11K73J73m58l0L42k13l59L55R1l80k2M76j84k70L27K08l28K2
809a77M96j60k65L47K12l72m1L77r6l85K75J65l60q4L21j64m06K17K41m07j13
830c79M08j35l11J81K99m05QM13q3k86L08K67k95o3M25j06k97K43K44l27j59M18
852C68r3m00J84K50l88j77L90q8l98J62K71l27j11K72N6l25J66L04k88n9L39K4
$$ plain form
700 -442 -32 -108 -489 -283 -17 -393 -446 19 28 -327 -96 211 5 -138 281 292 -48 82 534 156 -5 368
722 368 396 -51 19 357 20 -277 132 124 -377 -299 103 -205 -477 -95 -61 -460 -312 113 -172 -377 113 194 -137
745 -137 -71 364 166 -132 346 406 11 111 427 230 -93 206 327 -172 -92 200 -44 -342 -73 48 -364
766 -364 -391 52 -215 -496 -111 49 -414 -237 164 -39 -261 153 369 -31 -33 483 282 -46 317 429 22
787 22 40 395 211 -200 73 246 -212 -242 100 -113 -472 -117 -26 -406 -428 48 -136 -406 -79 129 -199 -177
809 -177 319 159 -106 241 453 81 40 417 321 -64 211 376 16 -68 253 89 -317 -100 141 -266 -379
830 -379 29 -106 -417 -236 63 -342 -334 79 -4 -290 18 285 -10 -73 352 246 -51 192 436 109 -50 368
852 368 275 -125 59 309 -79 -256 134 46 -352 -190 81 -246 -357 -85 -29 -354 -188 116 -172 -231 108 132
874A32k79J92L20k70j38L35O2l39O9L07l08j38L15o8l41J27K48l52j95L02m7l70
896d36J68K91k39j72L82M3l57J67L14j67j62L62P6l03J17L17j90k80L66N5l43
917IJ0L42k52k98K91j1l12M3K66k31k28K94Q3l85J10L20k35r9K61J14l00J51L63
940C06j75k18L21J19l16M8L22k22k35K35J27l64m1K82j87l11L15J11m06L7K69
961A7j65k61K65J28k54L6K98j16j88K81K08l11Q2L22j16k56K59J74l60k0L05j29
983A99k74J70J41l51r9K47l6l30K41J61l11j2K40o8k90K97J48j99n6L72q0k96
1005a86L56J94l00n9L60r5k71J77K16l65q6K70o3l36J61J41k66j38K86j4l17J59
1027a76K01k83m8L06J6k71K46K19k28r6L62k6k95J74K43j79j93K55K2k67J26K03
$$ plain form
874 132 -147 45 365 95 -43 292 354 15 84 391 83 -55 260 192 -149 -22 226 -126 -321 -19 -66 -436
896 -436 -268 23 -216 -388 -6 37 -320 -153 161 -6 -168 194 270 -33 84 401 211 -69 297 352 9
917 9 19 361 109 -189 102 91 -221 -178 88 -143 -371 -77 6 -379 -269 51 -184 -283 -22 92 -208 -57 306
940 306 131 -87 234 353 37 85 407 185 -50 185 312 -52 -93 189 2 -309 6 117 -289 -252 17
961 17 -148 -409 -144 -16 -270 -234 64 -52 -240 41 249 -62 20 342 226 -30 229 403 43 23 328 199
983 199 -75 95 236 -115 -214 33 -3 -333 -92 69 -242 -254 -14 -82 -372 -75 73 -126 -182 190 110 -186
1005 -186 170 364 64 5 365 270 -1 176 392 27 -59 211 148 -188 -27 114 -152 -290 -4 -18 -335 -176
1027 -176 25 -258 -306 0 16 -255 -9 210 -18 -114 248 222 -73 101 344 165 -28 227 249 -18 108 311
1049C11k81j84K83p7k71N3K30k35j37K86Mk72P8K77k18j40M10n9k02Q3L17j85
1071G1j13K89L8l28J53K20j77j99K12Q3l30L7K41k14k05K16J4k72K5K24j58j92
1093c65K88R7k68J04K42q0j71K37J08k96R2K93j19k52L00Q6l31K6K71j58k46K45
1115A03M9l31L9J97j44k37K11J08k56J7L09k04j44K35K03k71J9L00r3j81K29O3
1137B21k64P0K49o6k44J92J01k88j2K37r4l06J39J70l04m5K25o4k49J89J17k20
1159b46KL08j06k23K98J62k87L9L17l1l42L00J32k75n6K88j08k60J68J19k56j12
1181a69K45m5k90J77J25k70JJ97k6k79K01K17k70j1L31j6k36J39K81k75o2K80
1203B45Ok78J55J55k21j38K38j1k94R3K18l15pJ34m3j68R5J73k13o2K09L3j90
$$ plain form
1049 311 30 -154 129 52 -219 -166 64 -171 -308 -22 -18 -290 -212 65 -153 -293 117 58 -144 -61 256 71
1071 71 -42 247 285 -43 110 330 153 -46 166 249 -81 -44 197 -17 -222 -6 8 -264 -239 -15 -173 -365
1093 -365 -77 20 -248 -144 98 18 -153 84 192 -104 -12 281 162 -90 210 296 -35 -9 262 104 -142 103
1115 103 152 -179 -140 57 -87 -324 -113 -5 -261 -244 65 -139 -283 -48 155 -116 -97 203 110 -71 158 221
1137 221 -43 27 276 210 -34 158 259 -29 -41 196 102 -204 -65 105 -199 -244 -19 -83 -332 -143 -26 -246
1159 -246 -244 64 -42 -265 33 195 -92 -53 264 233 -109 191 323 48 -8 280 172 -88 80 199 -57 -169
1181 -169 76 31 -259 -82 43 -227 -226 -29 -55 -334 -133 84 -186 -197 134 118 -118 21 302 27 -35 245
1203 245 251 -27 128 283 62 -76 162 151 -143 -50 168 -147 -154 -20 -63 -231 -136 37 -176 -238 -29 4 -186
1226a86Q4K21j38j76L06M9k01J19K32k05j02K92r1k30R9J91k10j53K56j10k43
1247a96Q5J98k01j55K14Jk62R7K66j41j33K56M4j69J8K40j08q7K19L7j86K0K64
1270C21j86j26J77P4k92l8K54k01j30J01J31k82r2L21j54j66K27P1k30P7J80q4
1292d7j58K65J03k08K4K75j55p7J87M2j66j9J75j02k07J24O4k57M6J80q2k51J58
1315h6J18k50j5K14j16j14J55J88k44O3K05o5j73J91J29j97pK43n8k15J78Q9k20
1338A3j3J39j6k40R7J10j74j33K77j03j10J8J98k88K8K95j10j95J67J90k05o2
1360a17K90Nk26J81N7j34p4K81r9k09N6K28k66j01K35o1k21L8J96j41j78K19J6
1383b5k57J90J71j74o4K04N4k18J38K05j93m8K49l1k11J07J75k63k8J81J0l31
$$ plain form
1226 -186 -102 119 -19 -195 111 160 -41 78 310 105 3 295 204 -26 73 264 54 -99 157 47 -196
1247 -196 -111 87 -114 -269 -55 -54 -316 -219 47 -94 -227 29 73 -96 -78 162 54 -33 186 223 37 57 321
1270 321 135 9 186 260 -32 -70 184 -17 -147 -46 85 -197 -289 32 -122 -288 -61 10 -220 -143 37 -47
1292 -47 -205 60 163 -45 -21 254 99 22 209 251 85 66 241 139 -68 56 120 -137 -91 89 7 -244 -86
1315 -86 32 -218 -233 -19 -135 -249 -94 94 -150 -87 118 53 -120 71 200 3 -4 239 181 -34 144 233 13
1338 13 0 139 123 -117 -20 90 -84 -217 60 -43 -153 -135 63 -225 -197 98 -12 -207 -40 150 -55 -117
1360 -117 173 178 -48 133 190 56 -18 263 164 -45 11 239 -27 -128 107 46 -175 -137 59 -82 -260 -41 -25
1383 -25 -282 -92 79 -95 -159 45 99 -119 19 224 31 -17 232 201 -10 97 272 9 -19 162 172 -159
1405a59J50J42k22q2J49M7k38L1K13j95j71L17M3k62P5J97p4q8J91Q4k09J09J51
1428A99j31j40K72K9k57R3J65j45j59J78J4j93pJ19q4j85K16M3k73L9K52j28j53
1451b36K36J03k24L3K19m9j84K53K0j36J4J93r7j82J92L2j82j5J27q1j58J16N0
1474D4j51o0J80r4j07J05R6j36o8J94m8j01K01Q4k34P7J88k1j68J06J10k04lK22
1498B12r9j72J54L2k07J6J25n1j73Q8P2j55m0J56Mj87J30J66j70m5K54pj73J10
1522D0J74j91l0K14n6j45R2J78k15p7J70p9j84Q4J60k57j4J39k5k25J52Q9j55
1545a61l3J94l1j74J31J63j25q3K70j7j56L6J62j10q1K19k8j84O8J74k26j12J63
1568E9L1k99J41J06j51j13J85N5k15O2J32j14m5K28m8j31P6J71o9o7J06L6j56
$$ plain form
1405 -159 -9 133 -89 -171 -22 25 -213 -182 31 -164 -335 -18 25 -237 -162 35 -39 -127 64 148 -61 48 199
1428 199 68 -72 200 229 -28 65 230 85 -74 104 118 -75 -82 37 -47 -232 -16 27 -246 -207 45 -83 -236
1451 -236 0 103 -121 -88 131 82 -102 151 171 35 49 242 145 -37 155 187 5 -10 117 36 -122 -6 44
1474 44 -107 -167 13 -81 -188 -83 13 -123 -191 3 -45 -146 55 139 -95 -18 170 149 -19 87 197 -7 -10 212
1498 212 113 -59 95 127 -80 -64 61 10 -163 -75 -3 -158 -198 -42 -38 -225 -95 71 -99 -144 110 103 -70 40
1522 40 214 23 -7 207 151 6 98 276 61 -16 154 75 -109 -25 135 -122 -136 3 -22 -247 -95 -6 -161
1545 -161 -194 0 -31 -205 -74 89 -36 -119 151 134 -22 14 176 66 -15 204 176 -8 60 234 8 -104 59
1568 59 90 -209 -68 38 -113 -226 -41 14 -201 -139 -7 -121 -166 62 14 -117 -41 130 61 -6 100 136 -20
1591b0L2K06r8j20Q2P8k14O9N5q8j38J76Jj88N0J17n2j50K25k3j71K5J98l4j79
1616a61K37N5j13n3K29j23j02J68M5k26O4J65l8j54Q9%j69jJ86r9j97J30Q1j79
1640a66j2J39oj39J83P5j66L5J60q9p6J01J32j21o6K49j36j02J38N2j79m6J72
1663A32p5j68J14Q7k10l5J75q9j09M6J99k04oJ71m0j67K09M2j12l4J88rj57J02
1687E0J89j82q5J46J3j44P9J02j97p8J70l1j97P6P8r5p2J77n8j34Q6J49j37o4
1711a59K52m2j65J50J00j67k8K00M5j65M8J41j94kR3Mj83R7R7j34p2P1K9k15J31
1736f8P3j23p2J33L3j48Q7J18p0pJ14M4j48J5K65j42j11J08J35k32J8J37p4j62
1760g7J61J0j76L5R7o8q3L6M7j23J3J26p1l5J14M0j67Q7J55j01p8J52M1j34J4
$$ plain form
1591 -20 12 218 120 0 82 160 -54 15 70 -18 -156 20 21 -167 -117 0 -52 -202 23 0 -171 -146 52 18 -161
1616 -161 76 131 18 -35 194 71 -31 137 182 -44 20 185 147 -7 82 82 -87 -88 98 -1 -198 -68 13 -166
1640 -166 -178 -39 -45 -184 -1 74 -92 -57 103 14 -62 39 171 50 -16 233 97 -5 133 185 6 -40 132
1663 132 57 -111 3 90 -120 -155 20 -69 -178 -132 67 -137 -143 28 -12 -179 30 72 -40 -74 114 105 -52 50
1687 50 239 57 -28 118 131 -13 66 168 -29 -107 63 32 -165 -89 -11 -106 -178 -1 -59 -193 -107 42 -95 -159
1711 -159 93 51 -114 36 136 -31 -59 141 186 21 69 210 16 14 107 111 -72 25 122 -12 -84 -13 16 -199 -68
1736 -68 5 -118 -190 -57 -24 -172 -85 33 -37 -44 70 114 -34 -19 246 104 -7 101 236 4 22 159 85 -77
1760 -77 84 94 -82 -47 50 -18 -101 -65 -18 -141 -128 -2 -73 -108 6 46 -121 -34 121 20 -58 94 135 1 15
1785A5J51l5q3K9J06k10j0J36n5j50R5M9j52J2J76j42p3R6j1p4k2J86n2r2J48
1810C8Q2j55L0J43n0j33J60P0j80L0J27n3j63P2P8j19%Q3l9j40P4O6j75j9J39
1835c4m5j00J09J24j29p2J79J7j42J70N4j09j8J66n1j24O7J27r8j03J69p2j73
1858h8R4N2r4o0J22j3j13K6R9j46n7K00n2p9J02Q3j20l4J44L2j15Q2R2r9k2Q8
1884A24l7j35P4J15j41m6J09mj76K7J44j10r2J40J9j50N1J56j49j00K26L6j69
1907h8L1K19j37q5J53M4j23QJ07p5m7J31j8j85j4K34j54n8N7m5o3L9O1o7j01J66
1933a0K7j23K3R8Jj31J82J9r6J4R7kj12J48Rr6l6J30j02q5J13L2j23k2J06j23
1959f2p7J24M4k00M4J42n5r1J43Jr0J9J38q0p7J05J54k01K7J54l2j44R8P0j85
$$ plain form
1785 15 166 131 48 77 183 -27 -37 99 44 -106 -11 38 -114 -102 74 -68 -141 -45 -56 -130 -152 34 -18 -110 38
1810 38 120 -35 -5 138 88 -45 115 185 5 35 162 109 -54 18 96 -23 -23 60 21 -119 -45 21 -154 -173 -34
1835 -34 -79 -179 -70 54 -75 -147 32 49 -93 77 131 22 4 170 119 -5 62 189 91 -12 157 85 -88
1858 -88 6 58 -36 -96 26 13 -100 -74 25 -121 -178 22 -30 -109 -7 76 -44 -78 66 98 -17 65 157 58 36 124
1884 124 87 -48 26 141 0 -46 63 59 -117 -90 54 -56 -148 -8 11 -139 -88 68 -81 -181 45 81 -88
1907 -88 -57 162 25 -60 93 137 14 22 129 54 7 138 120 -65 -79 155 1 -57 0 -45 -108 -69 -8 -75 -176 -10
1933 -10 17 -106 -83 15 16 -115 67 86 -10 4 101 99 -13 135 144 48 12 142 40 -45 68 100 -23 -45 61 -62
1959 -62 -139 -15 29 -171 -127 15 -40 -131 12 13 -77 -58 80 0 -77 28 182 -19 8 162 130 -14 84 154 -31
1984c1J2J05o0j07M4J24j89QO1l1j10J05M7j32K6R7N8j18O6J28j57J8J81j30m8
2009c3J08M5n0p0J26m3j64J24P5j22r6J86m1j60R8M6j34k1R7k8q1O5Q9j36J4J04
2035bL0r8O2J62j01p2J42J2r2K2M0j38mR6m3n8L8J05j92l6J41k3j81J01N3l4m0
2062a10P9K8j07M8J02q8nJ31K0o8J3J24o5j00J46n5j14K6R1o1k5Q2l6j34j2J10
2088B0j04p8J47M4j30MP2n4rQ5N2q8QJ49p0l7N1M1j07j9J66n8p2J7N2q5J1R5j22
2117a9m0K5O9j31JJ11p9q7P9L2o0RJ12rj04J46K7j44O0J27l7j23J45M6j81nJ97
2144A67m8j67J31L5j81K4Q9%j75N7J42j92RJ50l4j72J36N9q9k1N3L8n9O7J10j11
2170A8rJ13m1p4M8O8j18m6J47l6r6M3J8j06l0J06k7q3O0P8j41rJ16K8j05N6J11
$$ plain form
1984 -31 -19 86 26 -81 -37 87 -102 -94 -33 -64 -174 -69 -22 -154 -128 -31 27 -91 -25 103 -54 -36 145 15 -33
2009 -33 75 120 70 0 126 83 -81 43 118 -4 -100 86 45 -115 -17 29 -105 -126 -29 -57 -138 -73 16 -120 -106 -2
2035 -2 28 -70 -8 154 53 -19 123 135 43 65 105 -33 -37 59 16 -42 -4 101 -91 -127 14 -9 -190 -89 -36 -70 -110
2062 -110 -31 -3 -110 -62 40 -48 -53 78 98 30 43 167 102 2 148 93 -21 5 96 35 10 92 56 -78 -90 20
2088 20 -84 -162 -15 29 -101 -97 -25 -79 -88 -3 49 -39 -31 118 48 11 62 103 -4 -23 143 85 13 30 82 -3 8 103 -19
2117 -19 -59 -34 35 -96 -95 16 -63 -150 -71 -39 -99 -90 22 13 -91 55 82 -62 -2 125 88 -35 110 156 -25 -30 167
2144 167 119 -48 83 118 -63 -39 50 50 -125 -68 74 -118 -109 41 7 -165 -29 30 -59 -80 -27 11 -48 19 129 18
2170 18 9 122 81 7 55 123 5 -41 106 70 -26 17 35 -71 -101 5 -22 -105 -45 33 -108 -117 -1 27 -78 -22 89
2197H9j35K9J07K6q1J1J04j06o3J78l6j13J1K4m4m1R0k1j16K0Q9r6m5O0L0j09
2223a38L1J27j03k7J33kn0jJ93j47nQ4jq8P3OL0j05J34p8j28K7J22j27p3J48k0
2250A5r9J0R3q8l5O7J2o0N6K8k9o1J06K8j07M4J46o2q4J03M0j28L5J21r5n5K6
2277B7K3q1o1J58k9j21K1Q0j34L2P8n4k9P1j3K0o9J29n9QR0n2k7NP5n1l4J2P7
2306I2o7o4J07q5k0L5lj17N7J34j05q3N1J16j18L3O9k5r8Q0R7r6j6R2oj6N2K1
2334A17q8QQ9q3j17R1N0q0j6P6n0r0L6N6l3p5J10l2r7P9R2j09K3Q8J0j61J40P1
2362A05p1m2O6Pr8R4P7q2r8J06o3Lk0O7r3m4R5qr2L6K4q8M0O8k1p7N9M4M8r8R4
2393C8R4j91P2J16j15m2J13n2l0lP8l5r8J26o2n0L9N3q9n8R7M2j56N4L1l4p3J40
$$ plain form
2197 89 -46 -17 90 116 35 46 150 44 -19 159 123 10 21 45 1 -40 50 29 -87 -67 22 -74 -119 -59 -29 -138
2223 -138 -107 20 -83 -110 23 21 -29 -30 163 16 11 95 94 6 79 85 115 10 144 66 -62 -35 87 -40 -113 35 15
2250 15 -84 -74 19 -69 -104 -37 -25 -85 -29 -1 -30 -91 15 43 -64 -20 126 64 -20 83 123 -5 30 151 56 1 27
2277 27 50 -31 -92 66 37 -84 -63 17 -117 -85 -7 -61 -90 -19 -32 -12 -81 48 -11 -3 87 35 8 13 88 37 3 15 92
2306 92 25 -39 68 -17 -37 -2 -5 -122 -65 69 -36 -119 -68 48 -70 -37 32 7 -91 -11 86 -10 -26 66 60 44 96 117
2334 117 29 37 126 43 -74 17 67 -13 -29 47 -3 -93 -57 -1 -34 -109 1 -31 -128 -49 43 -66 -43 45 55 -106 34 105
2362 105 34 -8 58 65 -33 61 138 56 -42 64 1 4 -16 51 -42 -86 9 1 -91 -55 -31 -119 -79 -11 -32 -109 -50 -6 42 -56 38
2393 38 132 -59 13 129 14 -28 85 33 3 0 78 43 -55 71 9 -41 -2 51 -38 -96 1 43 -113 -59 -28 -62 -135 5
2421El1j8M2J01o1q2J27Q0j62K3Q1q1j6J08Mj48J0Q5m3r9J10j6m5j6O4r9q8J49
2449a6m2k0j5J48o3l9N2P2j33Q6J3j3n4J37jr5k2N0k3q2J07Rj39M2R3p9r0R7M7
2478B7l6m0Q8r3l2Q6P8j37j1J53m8p0P8K4r2K3J18o8l9O4J1o4l4Q5k5p6J6O6r3
2507d1j8lM4q0KP0l8l8J00l2p9J09M2j01J7P3O4j21P9O3j09n7J88n7n9k3J01j11
2535a5nN9Lo3k2P4r1N7J4m3n6mQ3n5MO6j0j9%J07r2n9J31rn4N0L6n4OL1k5r0J6
2568b9J48o8r3O8K8j81J75qj33j8O6N3j32Q6N2j0n4O5O3m5l3O9l8n1R2km0LQ3
2597A16k5m5k9Lo2j2Q9q0j8N5J6n4JP7q1p2J16M8p3o3P8M8q1J08Q4j27k1J18j00
2626A4m4J03M2j65N1N1n5q3J12k8m5j2N7l8l3jJ4n3OJ34q5k2R9O3j92M9P1O4j01
$$ plain form
2421 5 -26 -44 -2 99 38 -44 83 163 1 24 105 24 8 116 120 -28 -18 67 24 -75 35 19 -26 -42 22 -77 -165 -16
2449 -16 -58 -78 -93 55 -8 -47 5 77 -56 30 43 30 -24 113 112 17 -5 45 22 -60 47 56 -83 -41 52 -27 -117 -20 27
2478 27 -9 -49 39 -54 -86 0 78 -59 -70 83 35 -35 43 67 -25 -2 116 48 9 73 84 20 -14 71 46 -30 -14 52 -41
2507 -41 -59 -62 -18 -98 -96 -26 -64 -102 -2 -34 -113 -4 38 -63 -46 27 91 -30 49 112 3 -54 134 77 18 -5 96 -15
2535 -15 -20 39 42 -21 -43 31 -60 -3 11 -32 -88 -92 -9 -64 -60 6 -4 -23 -23 84 -8 -67 64 55 1 51 87 33 39 70 45 -45 -29
2568 -29 119 51 -42 26 54 -127 48 40 -93 -111 -45 8 -124 -38 14 4 -50 15 78 33 0 69 31 -20 72 70 30 33 116
2597 116 91 46 17 20 -42 -54 35 -45 -63 -8 8 -46 -45 32 -49 -121 -5 43 -30 -93 -15 33 -48 60 144 17 -4 114 14
2626 14 -30 73 115 -50 1 52 -3 -86 26 -2 -47 -59 -2 -40 -73 -74 -60 -113 -107 27 -58 -80 19 82 -110 -61 10 74 -27
2655b7R8k4l6K9J7k9q8J29jr5k4P9l5l8L2M0j00LO7m0p1J08m8Pk1N8J8m7J0Q8
2685E9o0n2J40n5o4K5R6r8J4L0k1kK2K4q0m2N7J2l9l1P5k4m1O0k2o5N2R0l4l5
2715iO7m2l9N4M6q6O4K5k8q4N4M0n7POK5j11J4R2j01j5N0rl5RJ18q1m1J10mm6
2746gL3K0rp6O1Q4j43K3R7k9l2M6Qj14P6l0mq6Q5Oo3l3N6j0l6K9K1m8J1Q8J2o6
2778c0P2k0n3L7N2om5Q4q3l5O4J4r0KP2J8r2rO1jm3RL2j8p3J04j06o8J77j6q2
2809g2J0K1OM6LQ8o1RJ5K9j01M3L4p9K7P0p8o8M4M7mo9J06n9p8K9R9n6q6P9Np4
2841g5O3O4q3LJ04l9o3R4K2p8J7M0J9o4L3Om4k1M2j1r1mP0Lmk3LrL1J5p1NN2O5
2875G1j00N6Kk4L7KP5q1L5j1o3J4M4Nm4j1O6p4q3J51r0k5J7J4l5MQ3n0qK4J7l6
$$ plain form
2655 -27 71 47 11 40 57 28 -60 69 68 -27 -51 28 -7 -45 -13 27 -73 -70 -3 -43 -114 -6 -54 -47 -68 -10 8 -39 -29 59
2685 59 -1 -53 87 32 -32 -7 89 -9 5 35 14 12 34 58 -22 -64 -7 5 -34 -65 10 -14 -55 5 -17 -82 -30 60 26 -9
2715 -9 58 16 -23 31 77 -9 55 80 52 -32 22 62 5 12 18 43 -68 -54 38 -63 -78 -28 -37 -72 -63 55 -26 -67 43 39 -7
2746 -7 26 46 37 -39 22 106 -37 -14 83 54 22 68 76 -38 38 8 4 -82 3 9 -54 -87 -31 -41 -77 -48 -27 -75 -64 24 36 -30
2778 -30 42 22 -31 6 58 52 7 91 8 -27 37 51 -39 -37 35 53 -39 -48 13 12 -31 -22 10 -8 -81 23 -83 -151 26 10 -72
2809 -72 -62 -41 -35 11 14 102 41 50 65 94 -7 36 70 -9 18 88 10 -58 -14 33 29 -40 66 7 -71 -42 57 1 -85 -6 -1 -75
2841 -75 -12 52 -31 -28 76 37 -26 68 90 12 29 69 88 24 57 63 19 -2 40 29 -62 -66 4 7 3 -20 -17 -26 5 20 -51 -46 6 71
2875 71 -29 27 29 5 42 44 119 38 73 62 -1 13 57 62 18 7 73 -1 -84 67 -23 -48 -31 -17 -52 -48 35 -15 -23 1 18 -18
2907a8nN5O4j09L7M8l5QM5j8o0k0N9l9n1N7N4j04L2L0Rp9J2J0m6JN7k1K6k6l0
2938e7k6M3P4Mr9J25K4j10KP9Mp5N5pj2PM3q5PJ2P3j22NJ30j01%J3J9l1l6P1n1
2970b2n7J11J4q4K1OL4j9Q1j2r2kR7j6q9O1M8j39N5L2o2O7l6O0r2l6N9j5m1O4
3000dL5m9j9Q4m9M3jk6lk5Q2jp2P0J1o5J6R3n2j30P0M8n9n6O0Rm1o2J31q9k4P9
3032Dlm8K9L5k7j8L5M5q5Q5K5m7k0N9l1m1lJ23m9p2M3J6o8l0O0l9l6P2j3n3L0
3063b2M8q8R1p2N2o4K2L3M3m7J8J8J5LPJr4R9m1l6N1J9p1KJ5K2n8l4K7j9J3L4
3095a3K0p9M0M3q2O8j8M0j5k3O1mm9N0lp2MN6LJ0ml0Jm3O6l2o5R1K1j13PR9q6
3128e1j9O8j3l7L6P0J4p6K3N7r8P2l6O1r1M8j1mJ0K0o2k7M4M5r4l7J07n8Rl0L2
$$ plain form
2907 -18 -23 32 96 -13 24 72 37 45 90 72 12 -8 51 12 -39 18 72 -32 0 30 39 -40 -28 -18 -64 -63 -6 -27 -1 -27 -57
2938 -57 -83 -40 34 38 -61 64 88 -22 -20 59 63 -12 43 36 24 31 74 -11 -4 8 81 -41 -36 94 -7 -7 6 25 -6 -42 29 -22
2970 -22 -79 32 46 -38 -17 -11 23 4 85 73 -19 -21 76 60 -29 32 80 -59 -4 28 -34 33 -3 57 -35 -71 -12 -27 -68 -4
3000 -4 31 -18 -37 47 -2 41 40 14 11 -14 68 67 -5 65 76 11 27 120 68 -62 8 56 -3 -59 1 10 -31 -93 38 -51 -75 4
3032 4 1 -47 -18 17 -10 -28 7 52 -33 52 77 30 10 69 38 -3 -6 117 68 -4 39 55 -13 -43 17 -22 -58 14 1 -52 -22
3063 -22 26 -62 29 -43 9 -55 -33 0 43 -4 14 32 47 50 57 58 -36 63 22 -14 37 56 -15 -13 2 24 -34 -68 -41 -60 -47 -13
3095 -13 7 -72 -32 11 -71 -3 -21 19 4 -19 42 38 -11 39 36 -36 -32 24 27 37 33 3 4 -39 27 -5 -70 21 42 -71 -64 35 -51
3128 -51 -70 -2 -15 -52 -16 54 68 -8 15 72 -26 46 10 71 -20 28 17 13 23 43 -19 -46 -2 43 -51 -88 19 -39 -30 -60 -28
3159b8q1R3M2l4k7M7K6j5m3mL9m7J25m7j7LL1j7m7N4m3RQJl0k3j4M3p9j6J18J6
3191D3j44J7L7K1J4J9M5q9J4O8p5J8R8k1j6m7O5p3j8J05l7j9pJ2N4k23J05O0l4
3220hK1J6k8o3J5Q2o5nK4L5o3J00p9K7K8O1q6j8Q3n7l1O3k8k6l2O2M8j34N5J8
3250A5K1j01L9L0o4M1M8r7M4L8j9mj2K3L5n9M9K9n6P7n1J7k1K2ok4j0L0j8r8O5
3281a7L2j8K0j7k0l0jM7l6QK2Qk4RL4o3N7L2n8O5j7J1k9K2l0N5m2l4J6m2JL5J3
3314In2P6l6k3k1L3K5m4N6K0p6m0N4J8m5O2j6k1N4L6No6K1j4l6N4op9N1K9j0p8
3346f0lQ3k2j4J6p5N6K4L8p5n6J16J7q2PL8L1p6L1O0n2pO1j2k5LmM8p3N5o7K4
3378Ej5O1o3QPL0m2J0jm1R7l6nm9K4J3pj1M4l7j7nQ2j10O0L9n6K4j8j2N8m7J2
$$ plain form
3159 -28 -109 -16 26 -8 -35 12 38 23 -20 -24 15 -32 93 46 29 32 63 46 -1 53 10 19 27 28 -2 -25 -39 4 -75 -91 27 43
3191 43 -101 -84 -47 -26 -12 7 52 -37 -23 45 -30 -12 86 65 49 2 67 -6 -24 81 44 25 18 30 84 -139 -34 26 -8
3220 -8 13 29 1 -62 -47 35 -30 -35 -11 24 -39 61 -18 9 37 98 12 -6 77 20 -11 52 24 -2 -34 28 76 -58 -3 15
3250 15 36 -65 -26 4 -60 -19 29 -68 -24 14 -5 -9 -21 2 37 -22 27 56 0 77 26 43 22 44 38 14 4 34 16 -82 -17
3281 -17 15 -3 17 0 -20 -50 -51 -4 -40 -32 -10 -2 -26 -17 17 -46 11 43 -15 50 33 44 15 37 7 62 20 -14 2 -40 -39 -4 9
3314 9 -43 33 -3 -26 -47 -14 11 -33 23 43 -33 -73 -19 -1 -46 16 0 -21 33 69 74 8 29 15 -21 33 27 -52 -1 28 18 -60
3346 -60 -63 20 -2 -16 0 -75 -19 5 43 -32 -88 28 45 -37 -30 8 39 -37 -6 54 2 -5 56 44 19 22 18 66 -7 48 -19 5
3378 5 -10 51 -12 -4 3 33 -9 1 0 -41 56 20 15 -34 -10 3 -4 -15 29 -8 -25 -30 52 -58 2 41 -15 9 -9 -21 37 -10 2
3411Bqj0l1M3j0MJ4Nm7pJ12n0q7R3k5J3k9O2k1j0O0Mq8%M6l1rljk2mN0mn5k9P9
3447Fn8M4K7qj03O7j6K6J0N1n8l2J1R1rj9Rj7j3K0M4n7n1J06l6r0R1m8j3m7O7
3478ej1nM4j7LK2n2k8O8k0l2L4k0K6K7ql6K6K5k9J5j0l5k8K7RkK5Ml7K0J5n6L6
3512eK3m1n0M9M6l0jL0rk6L4%l2J8Mkj8j3N1rm4N1nPj6J8m6o1Q7Nn9L4M0m6n5
3547g1N1lm4N9J0m4K1L4J3n4j9R6q2R4k5Rn4%P1p4K2Nk0j5rP6l1k1k1No4P6k9
3580c8L7m1m1M8j2L1L5O3j22L0J6n8N0J9j3j1JN5o9P1rl6l3J7k8M4m7J8J4n0R6
3611C7n7Pn4Q7l2lK1o1m6P3L1m1N7QJ4p3O1lK9j42R7PJ2olKm4L6K7k9PQn3J1M1
3646B6Mj11N5O2J8p9L0O5q1L7k6R3j39M7%J0n2N5p3M1L3Km3k6J7O8l6m4M2k5l5
$$ plain form
3411 2 -6 -16 -47 -4 -14 -10 4 9 -38 -45 67 17 -70 23 -2 11 -18 44 23 13 73 77 -11 -11 35 4 -5 -8 -9 -31 -35 15 11 -44 -73 6
3447 6 -52 -8 19 11 -92 -25 -41 -15 -5 46 -12 -44 -33 58 49 30 39 22 9 29 73 16 -35 71 35 -55 36 -12 -25 -72 -5
3478 -5 -16 -21 23 6 9 31 -21 -49 19 -1 -33 1 -19 7 34 26 -10 16 41 12 27 17 -18 -46 -19 -10 -12 13 17 -20 0 15 -41 -5
3512 -5 18 -23 -73 -24 22 -8 -9 21 12 -14 20 20 -12 6 10 8 -10 -23 28 19 -25 26 21 28 12 30 -16 -77 10 15 -44 -10 30 -16 -71
3547 -71 -20 -23 -67 -8 2 -42 -21 13 26 -28 -47 49 -33 61 36 45 -9 -9 62 -12 10 15 -5 -20 -29 47 16 -5 -26 -21 -85 -9 -38
3580 -38 -1 -42 -83 -35 -47 -16 19 82 -40 -10 6 -52 -2 17 4 -7 -6 49 -20 51 42 6 -27 -10 -38 6 -41 -23 -9 -59 37
3611 37 -20 -13 -67 20 -12 -15 6 -55 -101 -28 3 -38 19 27 41 -32 29 26 55 -87 10 17 29 23 20 22 -22 14 41 12 19 27 -26 -15 26
3646 26 30 -81 -26 36 54 -25 5 70 -11 26 0 93 -46 1 1 11 -41 14 -59 -18 15 17 -26 -52 -35 33 -3 -47 -5 -30 -65
3677f5O4m2J7R1o7k0MrLL8qL2k7L8L1m6m3M7l6Rn4O8L6p7j3P4p2r3Q1nO6Ro1n1
3711h1N9K0M3p7QJ4k9L7K2k1J7mRJJ5k5K5k1k2N2k7mrOn8M6l5J2l5M1M9m0KK1
3745A1n7QQ5ko6pN2j6jQn4O8j9rLlL3L8j13M5Q4r0Om1O7m1Km0l1L8O4Qq3J4P4
3780C5k8j4M7l2K2j6K3n5lJ5j4J5J4M3q0K4oK3k1lPO1o2J8m7J3PRM1p8K0L6l6
3813b2L5J3l7N9l4N6p5K1PNp6P8l7J0KJ3oj3J4op0J5qN6j9L4n3j1J1M9jr3N3K2
3847hK7j2J6m7qN9j9K1p1N9J2n2l5M2J8o6R6l1jk9K8M3q0J3M4j8Jml9M3P8r5k6
3880d1O3L5k2l9N1q7N0j1k2N0n5N0j5KLrj3J%J7o2pP7m4jN7po8M2L1j08J13q3
3913e2Q8o9M5n2N7kpk6M1l6N2m6k7jM4l7K7Ln8L7M8p6N3o6J01k8k0NL5k8POrK3
$$ plain form
3677 -65 -1 -43 -26 65 -2 -22 -18 -27 -24 14 6 38 11 49 80 34 -9 38 2 11 -43 25 61 -16 -29 45 -27 -120 -39 -44 22 31 -30 -81
3711 -81 -22 -2 41 -36 -28 -14 -43 -6 16 -5 12 8 17 18 33 8 33 12 -10 42 15 11 2 8 -50 -4 -39 -27 -62 -21 28 -12 -10 11
3745 11 -46 -38 47 45 -21 -28 24 8 7 15 -39 29 10 1 4 1 34 72 -41 4 88 -2 4 -37 30 -11 -9 -49 -80 -42 22 30 -53 -39 35
3780 35 7 -7 40 8 30 14 37 -18 -21 -6 -20 -5 9 52 -28 -4 -10 13 -8 -11 -4 57 -5 13 -34 -21 -14 -5 36 -42 -22 14 -22
3813 -22 13 26 -11 48 14 70 -5 16 23 28 -48 30 -7 3 5 18 12 -1 13 7 -63 -48 -56 0 -19 15 -38 -49 -38 11 10 -83 -30 -8
3847 -8 19 7 23 -24 -32 27 8 29 -42 17 29 -23 -58 -16 2 -64 32 1 0 -29 -1 42 -38 -25 19 1 2 -2 -41 2 80 -15 -41
3880 -41 22 57 35 -4 47 -40 10 -1 -23 27 -28 22 7 9 12 3 -10 -9 -9 8 -54 -61 16 -28 -29 28 21 -47 -5 26 -82 31 -52
3913 -52 36 -33 12 -40 17 15 8 -18 23 -13 39 -7 -34 -35 9 -28 -1 2 -56 -19 29 -47 6 -60 41 13 -7 -2 33 5 12 18 9 32
3947C2m8M7j7k8ML0oJ1k7k2L9l5L3k7n0O0j9k9O7k6m3N8N0r3M9K8k8j3k4P4l0
3978A7k4M9j3K5o7J5K0p5M1K2J6j5j6L6l7L0n9NKK0k1%J9K6k1k1QJ3n0M0K0rK4
4011B0Kj8J8l5L5k6N6o2M0J6o7K5Qj2L6m2jK6m1M3pk1k8L9L5l4LM7o3K8m7L8l4
4044b3j3L3M3oq3L2K3l7J5K4k8K9k8N4k9J0Rl3Kqk3O8j3q8N9L8k8J3K3l9PL4k8
4077Ik3O0Qk0j4j3m4Q4j6k6J3n7K7k2K0M0n3J0L5L8o5pL5n0J8nM2o3M6K9m5MP0
4110F5o0j8P3mJ8n8k4n5J11m6J7n7PP4n4l2O7n7QL3l1j2K7l1qQ1m2J2Ml8K1J5
4142FqOj8KOK0MN7q5M5Mk9J1l1J0PKJ9m6l3O8n4lN1J4n3L2M8o0jL0k1l2K8QJo6
4179f1J17q0j3J2K7k7M1O5j9p1j1K7n4L5L4k8J9j2L1qo6M3j9J7K8rLrl9L6n5L8
$$ plain form
3947 32 -16 31 14 -14 -10 20 14 25 -2 -24 15 -20 13 -14 -64 -4 -23 -52 15 -11 -54 4 54 -39 10 38 10 -3 -27 47 17
3978 17 -7 42 29 54 -13 2 22 -53 -12 10 26 11 -5 31 -6 24 -35 -30 -28 -8 -29 -29 -10 16 -5 -26 -18 -5 -55 -15 5 -4 20
4011 20 22 4 22 -13 22 -4 52 -10 30 46 -21 4 12 0 36 -6 -7 19 -22 21 14 -7 -35 4 39 5 8 55 -8 20 -27 11 -23
4044 -23 -36 -3 40 34 -49 -17 6 -31 -16 8 -20 9 -19 35 6 16 25 -8 -6 -14 -37 31 18 -70 -11 27 -1 12 35 -4 3 37 9
4077 9 -14 46 54 34 20 7 -37 47 31 5 18 -39 -12 -34 -14 26 -27 -17 18 56 -9 -16 19 -31 -13 -18 24 -39 7 36 -9 -5 65
4110 65 5 -13 60 56 74 16 -8 -63 48 2 19 -38 -31 43 -11 -43 24 -33 -25 8 -23 -35 -8 -39 -47 34 -8 4 8 -30 -9 6
4142 6 -2 4 -14 -12 -6 14 18 75 -10 35 39 10 21 -10 0 7 9 28 -18 -51 17 -37 -40 11 25 -28 4 52 -8 -9 21 0 -32 -4 4 5 -61
4179 -61 56 -24 -37 -25 2 -25 16 81 62 -9 -20 7 -47 -12 22 -6 13 1 32 24 -42 1 -18 -1 27 18 21 12 -27 9 -46 -8
4211hJ1nkPJ5l3nM6l3K7l1j8PrJj8N1KJm4M8kK0nM0n1o7N5rO2m6J4Lm6P6m4k7
4248a7k3O5n3M5l2l6J5N3n8N3m8mM9l5K3k7L9j3kJl1Q4q0L2j3j0M6nn2P5n6K3
4280HO4r3L8jl1M3k1l0M2k5mk0L6n6nM1oRM9n0L5jm9M0k2J8j3j6O5J3n1l5J5L
4314a0o2M4O4o5K3knj3L3k2N3j07Q8mk0k3N4Rj8n2M3m0LN2j2l9K4k1J1L6m2J1
4346im2pO5j4L3j5k4k6j5P8m6J7MO6o5jk1P6n9j4L7pj0J6K7l3NLj4M0k8pj7K6
4380A9J6p2QM1n6L5qL5RKk3j3k3L5m9M4J6L0n8m9Q2L7r1M3J4n2K2L1K5n8N3k9
4412A6j5k7J9L3o9O2k4n3kJ05k3m0J7L9o8J7L7ko1M6Rk0J8QJ4p5L6L1m2k0M7J
4444A4n9M5J9l2l1P2k3ll9P5nn1M0n2NK0k2J9J3l9P4q8J5k1Q1q6O7K3j8n9P4j5
$$ plain form
4211 -8 3 -2 -4 3 18 -15 -20 26 -7 20 -11 -29 -22 -31 -30 -48 3 5 6 -38 10 8 28 23 63 12 -55 0 -9 53 7 21 24 -22 54 10 -17
4248 -17 -40 25 -28 17 -15 -51 -36 17 -41 12 -36 -40 9 -26 -3 -30 9 -4 -6 -5 -36 48 -32 0 -13 -23 23 18 -34 41 -15 8
4280 8 72 -21 17 16 -15 28 7 -23 19 -6 -10 -30 6 -50 -55 -14 -20 -11 38 -12 23 22 -27 13 -9 9 -4 -20 45 58 7 -28 -13 -10
4314 -10 -72 -28 36 -29 -6 -8 -13 -26 7 -15 38 -69 19 15 -5 -28 26 35 17 -35 8 -32 -29 23 11 -28 -4 -25 -14 22 -20 -9
4346 -9 -51 -58 7 -7 26 11 -13 -39 -54 24 -22 -5 -1 65 0 -1 -22 54 -5 -19 18 11 1 17 44 11 16 19 5 45 17 10 -7 19
4380 19 35 -37 -29 12 -44 -9 -17 18 27 29 6 -7 -30 5 -44 0 16 46 -12 -61 21 58 -33 10 24 -28 -6 25 50 -8 45 16
4412 16 1 -26 -7 26 -43 19 -5 -58 -60 45 22 -18 -1 38 -30 -13 24 22 -39 7 16 -4 14 22 36 -39 -3 28 -14 -34 13 14
4444 14 -45 0 19 -13 -44 28 5 2 -37 38 33 -18 22 -30 -25 -5 -27 -8 5 -34 40 -48 -33 -54 27 -59 8 31 13 -46 28 13
4476A3k8oM4n0L9rL9o2J3O5o1M0k0K1q6R1l1J2k9L9l1LjL8j6j7j1rJ7J2m8J0O
4509a3NOj9M5n7L1L5Lrq9M4L5o5P7p6N6K5n6j5O6n4kk3L7J9mMl8P2m2K5j5N6k8
4543C6k7K0k7k2J1J9n2K5rk8O1o2K7K4k0N8n8L8p2O4pJ8qk3K6K0pN2o1%j6j2K8
4576A6p5N6RqJ2k6J5N9r0L4K1k1KQK0j6J1kM7m4m6NmKj4O5k3p7L4M3j6l2oK7K9
4611A5l5rM3l8K2k6M4L2m9J7QJ8K0q6P4k7l5L0J5p1K6k6K5J5k0k3N9m6K7qrK9
4643A1K7l9pL2m9Q9K0n8n9M6rM9m9L0l1NK7j1P0r7J5k3N6q0O8k7L0j8j8L3l7n4
4675e8M8N3q1Q5n6Rm8M7L3n4O7o5O0k0m0OPN0OK1o8K0n1K3J3JJl5K8k7L5J1m6
4708b5K9Jl1P0k0J4k1pQm5l3N7j4K2o7P1M1o8MM3p4L2Ll2L2LjK5k9Qm1lL7J1k7
$$ plain form
4476 13 -15 -21 23 -27 12 3 42 -20 -7 58 -3 37 17 38 -48 43 12 24 -5 34 3 6 5 43 27 10 -1 -10 7 19 -29 -19 -13
4509 -13 -8 -2 -21 24 -33 -2 33 36 27 -62 -18 17 -48 29 -47 9 34 -22 -37 29 -25 -27 -50 -13 6 2 6 -32 40 -2 23 8 64 36
4543 36 9 29 2 -20 -9 10 -42 -17 -26 -54 7 -55 -28 -4 -24 34 -24 14 -58 6 -1 17 9 -14 12 32 25 77 16 16 0 -12 16
4576 16 -59 -3 6 -2 10 -16 -1 58 -32 2 23 2 4 12 32 16 27 25 72 28 -18 -13 -17 -15 -29 36 13 -64 -30 13 -3 -35 -41 -14 15
4611 15 -20 -29 14 -24 -2 -28 16 48 -1 16 24 42 62 -24 50 23 -12 18 33 -38 -12 -38 -13 2 -18 -41 18 -28 -1 -9 -18 11
4643 11 38 -1 -8 24 -25 64 84 26 -33 13 4 53 4 34 3 8 35 24 94 -3 12 -11 45 -35 33 6 36 18 0 33 -4 -58
4675 -58 -10 43 -38 47 -9 0 -48 -1 32 -22 45 -20 40 20 -20 -14 -7 43 49 70 2 22 -29 -6 7 8 9 -26 2 -25 10 21 -25
4708 -25 4 5 -26 44 24 38 17 10 18 -27 -60 -3 -17 5 -62 9 50 -18 -14 29 -45 -13 -10 -42 -10 -7 -8 17 -12 -4 -45 -48 -11 0 -27
4743b7LK0pJ4LK4n2j4l2J19Km0J8o5J1MM7m8L8l1k1J1L1Ql9N3p5K0L2qm3k6L2
4776c8O0n1K8j1lRN8l7O4p4KJ1roJ8m3M4l8JK0L4n2M6l3PL1l8n5J8L2m7K1OM0
4810A5n3J5pK1K0j5Om8NN1J5J7k5nk5PN3m6l6P1J0n5nM1j09O6M6m6J3J7Qk7k4
4843b9P4n9pPJ5Qmm1P5o4J7N9j02P3o3K0k6N7k9l2Q1Ol6J3m1K3k7j7J05m0j8Q
4875Fm4L1k9N5j4PJ1Qj0Jl2l5N5J7j4k7Qj8J4l1J00o2rQMn3K4k2R1l7k0L7lk7
4909a0M1m0J5L7r2L9j5KJ8lk1O0j5j2kj1l2J00k6l7K4M1k0J8m3j0m7j4J4M9J6
4940B4k4j2j6k8Q7k6L7k5KJ7m1J4lj0%k1M0l5RM4k4j7K4j5l1JM3m0M3qo9J03o1
4973a8K0On3M5k2L6N4n8pj0%L1q6K7j3P8l3Qk2K3M7o7L2M4p8N7n1M1o7J2L4m7
$$ plain form
4743 -27 -24 -4 -11 3 6 30 -22 -36 -68 51 53 13 31 -34 -23 -19 28 -20 18 -13 -34 -23 8 16 -23 30 -45 -25 7 -1 -44 -70 -38
4776 -38 22 -29 -1 -12 -15 -6 52 15 79 5 7 18 9 3 21 -22 22 -16 -15 5 39 -13 33 0 7 38 0 -55 -37 -5 -52 -31 -25 15
4810 15 -38 -23 -30 -9 11 -4 2 -46 -41 10 25 42 17 12 -13 -6 47 1 -35 36 46 -9 -14 27 -82 -16 30 -16 -3 14 22 -5 -29
4843 -29 45 -14 -21 -14 1 9 5 -36 39 -25 -8 51 -51 22 -41 -21 -47 10 -19 -51 30 36 0 13 -28 -5 -32 -49 56 16 -2 6
4875 6 -38 -7 -36 19 5 12 23 31 21 22 -10 -45 10 27 13 -14 -6 -24 -10 -41 59 -3 -12 -4 0 -53 -29 -51 40 3 -17 20 17 -10
4909 -10 31 -9 6 43 -49 -10 -25 -23 -5 -8 -29 31 16 4 2 -9 -41 59 33 -4 20 61 41 59 16 6 -41 -55 -41 8 24
4940 24 0 -12 -28 -56 31 5 42 17 19 36 -5 9 6 -4 -4 -25 15 -20 -11 33 9 -8 16 1 -30 -29 14 -26 17 9 -60 43 -18
4973 -18 2 8 -45 0 -22 14 68 10 3 -7 -7 24 -62 -35 -48 30 -3 5 -17 6 53 -14 18 62 -16 41 -10 31 -36 -24 10 -37
5005c7Q6q1pL7j2L2Nj1Nm1K6koOj4l5J2K3l6M7KK2o3N4K0j9kn0N5k6k9L3KK1r
5040Hj6nK3J3ok3j2L5K0o9O2J4q5M4J5L0l9k1NkN2o2Qn9N4N6o6M0n5K7j7MM1J0
5074B4m1M3p2N9n5L6L5m3M5m4j9L3J3kj3n0O9l7K6k7M0J7j5l0J2J3nj1m5O7k1
5105Bk0QQ7j52N9k2OJ9j0L6j6K3K3p3K4L1M5j07J7m7Q1J4Ln6N2k3J6m9J9nL5Q
5137B8k4J7j8j5K7n7j4NP7J1k5J2l5Rj4R0j32M0J5pj1J5l2J18r7L0k9K8m3l7O2
5168fJ0k0K8k2k8P4m1j3MLM2n9J2%lL3lj6K9ll7K5k7jlmM8o4J8M2J6m1L0l0kL2
5204B3k4K5q1O6K2o6P1n6O7q2M3M6k7q8N4M2p4J8j3O2k8L6qk6ok9QJ0J3mj5L0
5236Il3L8r2J7O1L8n9jJ4K2pJ8p4K7K9LNJ1n0RKJ0j7nK4k9L4k2N1l8j8N1m9M1
$$ plain form
5005 -37 49 -32 -39 -2 -14 18 23 12 17 -24 2 0 -6 0 -14 -49 -37 -14 -50 -3 -1 21 -42 12 32 13 11 -39 16 -10 -39 -6 -4 17 8
5040 8 -8 -13 10 23 17 -6 -18 17 37 -32 30 44 -41 3 18 48 9 -12 -7 -9 43 -19 -11 -70 -16 40 -26 14 -41 -14 -31 -27 14 24
5074 24 -17 26 -46 13 -42 -6 29 -14 31 -13 -32 1 14 12 -1 -51 18 -19 7 -20 20 37 22 -8 4 17 12 1 -44 23 2
5105 2 -18 -10 77 -75 -16 -38 -32 -13 -23 13 -3 20 43 -30 -6 25 70 -37 -20 -67 14 28 31 -25 27 4 20 -29 -10 -15 20 28
5137 28 4 21 3 -12 15 -42 -56 -51 26 37 12 24 -11 -2 -16 74 -58 -18 -3 -10 -21 -6 -38 80 -17 13 -16 12 -31 -68 -6
5168 -6 4 -16 12 -10 -38 36 -5 -18 -14 -11 31 -28 -16 -16 -19 14 11 -5 24 21 -16 9 -18 -19 -22 -26 22 -42 -24 18 34 -7 23 -7 -9 23
5204 23 -1 24 -57 9 31 -35 36 -20 47 -35 8 54 27 -61 -7 35 -39 -21 -34 28 0 36 28 2 -4 -33 -25 -15 -2 -6 -21 9
5236 9 -24 14 -78 -61 0 38 -21 -22 -8 14 7 25 -49 -22 7 10 15 26 -24 -15 -13 -3 -20 -25 -1 -30 4 -18 33 -5 -23 28 -21 20
5270B0o5R5p4L1OJ6l0J2j0j4L8l7J9j6l2K4j1J7J3MJ2o2L8O9o8j8J4N4j9k8L8
5301C6o5k6M0QOJmm8K1J5k1K8K7npk3j8K9K8k9PK0n3M0n0K5L7j8jM9k7l2Nl3O4
5336B6p0M3J7pj0JL7j7n3j6P7k7J2m1N1k2m1L0J7k9m0K6j8P9k2j8J5PN0p0PK1
5368A5l0ljM8K7j13Q6k1K8l0K3j7l9j6M8KJ1J2l7j3Q4q1M1j6o7K3K7J9nk9k6M
5400d6M5K3Qm0LMj5m2J31m6K5l1j0K7q7K5K2p9P1J6qj5J2KM3l4O8n4n2R0o2N0
5432D4n8P3j9o2K9j1J9K5p0N6m0K4j3l4j3K3M1n1J3K0j4l8l1N9J7K1J3Pn6M9J3
5463C6n2K5jK5l5j7K5j2j0NoJ5k9Q4J2n6k3ML1k3L0l2J3nm9m8R5oM4l6l5qLnK4
5498a7k6J4J06q5L0k8LK7l7K0m4jR5m7J9lLNj8L8p4J1%%RJ0k9L5J0l6k2J4m2M1
$$ plain form
5270 20 -45 50 -24 7 13 29 -1 11 1 -13 25 -12 7 -9 -41 -17 -28 -11 2 6 18 -44 -6 63 -5 -23 -9 45 26 -2 36
5301 36 -29 -55 -15 -7 -1 0 -4 -52 -31 -16 -37 -9 18 13 6 -17 -35 -6 22 -7 0 20 -33 7 -43 -18 19 1 0 49 22 -10 -5 -38 26
5336 26 -44 -1 16 9 -1 0 37 20 -33 -49 28 1 13 -28 23 1 -40 -10 7 -22 -62 -36 -54 25 3 -15 0 7 57 -13 -6 15
5368 15 -15 -18 -19 29 56 -57 29 8 36 6 29 12 -27 -43 5 7 18 30 -7 -20 64 -17 24 8 -59 -36 -9 10 5 -24 -50 -46
5400 -46 -1 22 30 -10 -7 -3 -18 -60 71 25 50 19 9 36 -51 -26 -4 -83 -12 4 -4 -19 -7 -5 38 4 72 18 -34 56 -6 44
5432 44 -14 59 40 -22 7 -4 15 40 -30 26 -14 10 -3 -37 -50 -27 14 -37 -24 -4 -18 -56 -87 -28 -11 10 23 30 -26 23 36
5463 36 -16 9 8 33 -2 -19 6 -6 -16 -11 -17 -2 -31 53 65 9 -14 -10 21 -2 28 -4 9 4 -45 -93 2 -4 40 4 -31 -39 -36 -41 -17
5498 -17 -43 -29 77 -8 22 -6 -3 24 -13 7 -37 -38 57 10 29 26 29 34 16 54 -20 -9 -9 -9 0 10 -19 16 26 -10 -32 -18 -60 -19
5532a9K1j2j2L5l0m4L1N8K6j31P4J9k0N0o8L7l8j3K2L7l0J8k2M5m0L4n8K7j0L9
5562B6l8K2k0O1m1rJ9n2K4J6m0Q2Jr3K6L6k3M8l1Rm7K2J4j2j1J7k5nJ1kJ1L1J0
5595C7l9K3RrJ6j5rK4j2pJm6K0M8n8k1L4lJK0l7L2j1M0m2m2M9qj5KJ3OK1j3ql4
5631c3LL0oL5l0j3rJ6rN5k7j8j6M7k0L4m7K2j9qK2j4m6N0J6n2L7L1q1P5Pk0n0
5664c8J6k7L0J9K5jq2K7P5Kn8J6M7k2r2N5j0K0l5M1J2m9N0o2k2L4O5k7MROk6m9
5697d7J5O4n6L8j6M7j4l0j9m3P3k8j1Rj2k4J4N2m4L0J6j1pqM7k4K2PjK7n3PmJ4
5731C0l2J4k2oj9rL0J3QJ0n5l9Q2n6J02p7L9k6k9L2n5J45q7L6l2PMno%oRm1J6
5765b5MNJ9k9J01p9L0k5oL3pl5K7%l4K4m1K6M6l8L2m7n6J31o0m9P2j5q9O1O5o9
$$ plain form
5532 -19 2 -10 -22 13 -17 -61 -30 28 54 -77 -3 16 -4 46 -22 15 -23 -36 -14 23 -7 11 -11 34 -6 28 -30 -3 -13 26
5562 26 -12 10 -10 51 10 1 20 -32 -8 8 -32 50 51 -42 -16 20 -3 45 14 23 -24 -2 12 0 -11 6 -19 -24 -13 -15 -4 27 37
5595 37 -2 21 30 21 37 22 13 37 25 18 19 -27 -7 41 -17 -38 -4 -7 -6 14 -23 9 -2 38 -4 -46 3 -5 -20 -18 -5 1 22 9 1 -33
5631 -33 -30 0 -6 29 -1 -14 -23 -7 -16 39 12 -6 -22 25 5 39 -8 14 -5 -13 9 -5 -51 -1 15 -37 0 31 -50 25 32 12 -38
5664 -38 -22 -49 -19 0 25 24 -58 -31 44 46 -12 4 51 29 -63 -8 -18 2 -33 8 20 -29 21 -41 -63 -29 36 9 13 22 28 2 -47
5697 -47 -32 32 -24 14 -2 45 31 1 -18 -61 12 -16 -27 -18 -30 -54 -40 12 -32 -2 14 3 -4 -12 35 11 33 40 39 66 13 20 16 30
5731 30 -2 12 -10 -16 -35 -44 -14 -1 7 17 -38 -77 5 -51 51 -26 13 -13 -42 -10 -65 80 -7 29 -3 4 8 3 -3 -3 -9 0 -41 -25
5765 -25 -21 -16 3 -26 75 -4 26 1 -5 28 21 -14 13 13 -21 3 -38 -12 34 -4 28 -19 -75 56 -4 -53 19 4 -85 -24 41 -28
5797b8M8J1k5n5N0N4m0l1l2K5N8m0Rj4N5K1m2m4K8K7k7l8N2p8N3J2k3Km4J1M7
5828BK8j9Qj8K1n9K7n0O5j2K1k9L5j6moL1J1q7O7J7l7j5kK2QL1j2Mm8M9j7k9M8
5862C5l8L5lp1L2M9n7%j9M2J3k7k1l4N7L8n0O0n1k3L6j0Nk9Ok0N1K2k6qj6L7l0
5895a5R7k0p5J4L6q0P0o2J5M6l8L5Jq6M8K7k3L4p5Q8m3M1m5nN7q6M7J9J8l8m1
5926c9K3rM5k9L0m3KqM6j6oN0n3N6l4l4M3Ol0J8Rl4M7m1l8L4Kk5N9m1kl5M5J6
5960A4J1k9k1J4K4K2m6l3P6k7LMk1O0Ol0n4J5jJ5J9k7K5n4L8j9J3k9P8l8l1L2
5992Im2k3K7L6m4J3lJ2k5J6Rk9L5L9n6K5J5k1j0j3lM8j9M0m4KnL9J8l2k8O8m3
6025A1NlJ1pk8J3K0j3J5p1L9l7J00p4J4%N9n9k8j6L1j6j7k2O3lM1m1O6n3QoPj0
$$ plain form
5797 -28 20 31 6 -49 1 55 15 -16 -48 -23 35 -5 4 -10 45 66 24 -20 8 35 8 -30 22 -56 -3 9 -14 -12 -56 -45 2
5828 2 30 11 19 1 22 -37 -10 -60 5 -7 14 -15 20 4 0 -6 25 36 -51 16 33 -4 -19 -21 1 9 40 28 32 -16 33 16 -13 35
5862 35 -3 32 29 -42 -10 39 -18 -18 -37 5 18 -9 -30 -64 -7 31 -19 41 -10 -33 3 -7 -2 -31 -25 -45 6 28 2 -6 -22 15 -15
5895 -15 82 62 -13 1 37 -43 27 -35 -20 26 -12 23 24 -62 -14 13 -10 24 -51 37 -6 35 -10 -15 42 -44 3 22 40 2 -39
5926 -39 -16 -25 20 -9 21 -22 -20 -28 18 2 -4 46 -7 49 15 -19 24 30 0 18 27 -7 40 -1 -39 -5 -3 -28 31 -10 -12 -47 -2 14
5960 14 25 -4 -25 -11 13 35 -11 -44 32 5 8 12 -9 51 57 27 -27 -12 -13 2 21 -6 19 -35 3 -16 -3 -32 46 8 -23 9
5992 9 -33 -56 -29 7 -37 -24 -27 -15 -40 -24 -15 -44 -9 30 -26 -1 14 -7 -17 -30 -33 15 -4 36 -8 -6 -11 28 46 14 -14 54 11
6025 11 16 13 24 17 -11 2 22 9 24 -47 -8 -45 55 -19 -5 -5 54 -5 -33 -49 -18 -34 -51 -73 -10 -13 28 -13 53 0 8 2 9 -1
6059aN3j8j09O2k3J8l1J5K9rK2l0J4L6l5K7nl4O4l9K3Jm7rN9l7K1n0j4L7J1n9
6091e8J8M8M7o0J9Mlk5L9l8Kql3L6L2Oj9Mn3PO8n2M9l2lK9j0m2qM0m3Q4p8N4k8
6126gK0l4k1P3l6J0k6koP1o9J4L6k0n5O5j1M3r0L1NPM5nk4l7N6k6j8NpJ9oK7M
6161C1n2Rj4K7j6J5Jj6k5K1M0l8k2J9L8j7L1n1klO8m1m2NN0L1p8L5K1m4L8knJ2
6195B4m0J4QJ2j5kj4J2K5j3K5j3l3J5N7n2J8l5k1OK3k5l7J6M6k1jJ7nk2l7O6n5
6228e7O8lJ3q3P6J0k4jL1o2L1l7J7M8m4L2J1k0k9N8k2m0L8j6n1k5O9L5q0%J02
6259D5l0l1K2kk5l5J9j3LN6oJ3K8m8Qj6M1j7o6K2M6j6l0L8N6o3J7l5nlJ5j4J1
6292a5P5q0j7N9o4N1m6J5M8K8j04M9kk8j9M3l8RpL0j9n5O4j7K2m0J04k3l2j6M
$$ plain form
6059 -1 52 34 -75 -13 -36 -18 -49 -34 -5 -14 8 -22 -8 28 -7 20 15 -19 45 6 29 30 -17 -26 33 -4 17 -33 -47 -10 1 -58
6091 -58 -40 8 55 -5 14 18 15 -10 29 -9 -7 -15 -48 -12 20 26 7 11 -42 -35 33 -19 30 -2 -5 24 14 -28 -36 4 -39 45 -33 21 -7
6126 -7 13 -21 -42 31 -5 5 -21 -23 -29 42 -27 -13 23 3 -52 13 2 45 -45 -14 -9 -2 43 38 14 -23 33 7 -11 -6 -13 6 0 27 31
6161 31 -21 -12 -26 1 -15 0 1 -15 -40 -19 21 -17 -39 -20 18 1 32 -19 -21 -24 44 3 -39 -34 16 47 -31 4 25 -19 19 17 12 24
6195 24 -16 -2 6 18 3 1 -13 -1 24 11 36 23 -10 5 62 10 28 -7 -28 -22 1 -24 -61 -45 1 -20 -21 -4 -9 -31 -68 -2 -57
6228 -57 11 8 21 -62 14 24 0 -1 30 -32 -1 -38 -21 27 -17 15 26 6 -23 35 13 -27 11 -5 -56 -81 -12 23 -57 -57 45
6259 45 15 -16 6 4 -21 -56 -37 -50 -47 9 3 16 44 -4 4 -12 29 12 -54 -32 14 -2 -32 6 62 -1 16 -19 -24 -27 -12 -26 -15
6292 -15 60 -20 -37 22 -42 9 -37 -22 26 54 -50 -1 -3 -31 -50 -7 -45 -36 -43 -13 -32 -87 -23 -40 -18 -58 46 23 -9 -25 -21
6323b1PK3M1n2J7K2K3o3Rj0P0n1o0JL7nK0K3l9%j2J1j8MM2n7J7M5m6oK4rmP0l9
6358A4pJ0Ml9K2j9L9l1j4O7n3j6J4JJ1J6L0p7M3j4n0Q1p1P0p9J1Qj3P9j04O7J6
6390A6l1O0o9LK4R%mJ4j1j8J1JMJ2KN8p0K2l4m8Q8j7pKm8K0k8O5l7O6j48O2Q9
6424E8q7kM7PL1k8k1jkm3j5O4Qj5j0m1J20l0k1k8K4n9O1M4p0k5M0Kj0mK1J4l9
6457a0j8J9M3Jm6K1kmRNk2O1l4n4K4p6M5j0P7l7orj6L1jJ1RM6r5RJ20p0NJ8qj4
6493B2pm2j1K9O7Jr9K6J6rN3o1mO0q6N5l7L0k8NqL4l9L4K7k1j3N2m4K2l0J8J1
6526B3jqm2J08j32R4m5l6R9j00O7m6J3N4l5r5O1O2lm5j2K6l8N0p4P7RpL2q2lK2
6558goRm8K5M0Qk9QQL1pq7LJ03l3k5j3J7L5l5k1JRj5O0m1M0l5m0P6k8N3n2l1q
$$ plain form
6323 -21 -14 9 50 -2 15 37 60 -3 6 -4 66 15 -45 -44 -7 -12 8 31 -8 -8 -20 -9 -27 -23 19 -38 -21 24 -22 -28 -4 -13 -17 53 14
6358 14 7 17 21 -18 4 -15 24 -7 -21 46 -7 -23 -9 -8 3 19 49 -28 15 1 -49 32 -39 31 -48 -37 -29 -42 37 -67 0 16
6390 16 -15 45 -24 -21 3 12 12 8 22 11 -7 4 5 9 21 23 81 11 33 -1 -49 39 22 15 17 -31 -11 -39 26 -11 55 -93 -31 58
6424 58 -29 -31 16 23 54 26 5 4 2 -41 -56 8 16 1 -9 -50 70 40 19 -9 15 -44 17 61 -9 -34 6 8 -2 -6 15 29 -10
6457 -10 -28 -9 34 35 -11 10 8 4 13 18 -4 57 23 -31 -7 -83 -38 -48 29 -8 -14 -23 -39 -8 -9 2 11 57 -38 -29 91 21 26 44 36 22
6493 22 15 -27 -38 -9 58 59 -40 -14 2 -7 46 -15 -19 41 -45 10 -27 3 -25 -20 -28 6 -33 1 28 7 -6 46 2 24 -6 12 23
6526 23 22 14 -28 80 -52 42 -3 -39 60 -40 27 -19 -6 48 13 -82 -21 41 38 -7 -19 7 -31 19 -55 22 31 24 56 -26 -29 -7
6558 -7 -13 -4 -52 -27 13 21 -8 0 8 39 32 -55 -52 51 18 -7 -20 -3 32 -3 -24 -23 -14 -29 31 -10 30 -5 -45 31 3 56 4 -27 -35
6593c5J9K6J3m7K8k1QM1l9J4m9k7N3j5k1N7k4L4k1J7K3j4oNJ1J8l1Qk5qK0J3o1
6626c6jP8p6L7Qn8N4K9l7k4POl5J8N8l5n8P9kN1p7jJn3N3oJ7%j4J4K2k0L9jl5
6661Bj6M8m4qK7l0J8n8M1M5m7K4J0q0L4O6l8j9J1N2j03L9K8mK9n9O6k1K4m4L5
6692B8l4qj0J5rLK4nM1o8MMl9M0pM0m7rk7O0O1k8L1q2r%j6L0nM2j3o2M6Jl3K8
6728a3j9J07n4l3M8l9J8l8N3O%k3%L1k0%k1nL0J0lNo0J3k2J8K5K3m3N0l5k0N3
6761D2n4J0jk5N6j6Kj5Nol3J0K3j8J2k2KL3n4O1j5L8n4P2p5M8J7j7J5ko3nL9M0
6795E0n1MJ1rL1n3J3K2j1j0jn9Q4nl7M5m1J8L9j05O1Kk7j5j7J9N1lppk7J33r1
6828GL1m7M4J1j0q1kL7mj1M8L9m1LRp7L8LM6om4j4nK2%N8r4KP4o1ML0p1m7R5K1
$$ plain form
6593 -35 -16 10 23 -24 4 -17 -9 32 -7 7 -42 -69 -16 -31 -52 5 -19 15 -6 11 34 20 14 19 30 48 17 25 0 -8 12 25 -36
6626 -36 -37 41 -35 2 10 -48 6 35 -2 -26 -19 -13 -48 -30 28 -7 -65 14 12 63 -14 -15 -14 -67 -14 -20 -3 -3 -17 -3 19 -1 38 37 2
6661 2 -14 34 -10 -18 9 -21 -3 -61 -20 25 -22 2 12 -68 -34 32 -6 -25 -14 38 -65 -26 2 -2 27 -32 34 13 37 -7 28
6692 28 -6 -14 -24 -9 -18 -15 9 4 45 -23 -19 -15 -54 -14 -21 19 -28 -37 -64 -4 57 29 60 -22 -31 -31 -47 -17 -22 20 7 -55 -9 -8 -41 -13
6728 -13 -32 75 21 -12 36 -3 15 -23 30 36 36 13 13 44 24 24 3 -2 28 38 35 40 -20 -7 -29 -11 14 37 -6 44 9 -11 42
6761 42 -12 -2 -3 -28 28 12 14 -1 4 -2 -35 -25 -2 -20 -8 -30 -28 5 -49 12 -3 35 -19 53 -22 26 43 26 41 39 -24 -29 10 50
6795 50 -1 3 14 5 36 -17 -4 18 7 -3 -4 -63 21 16 -21 24 -17 1 40 -65 -4 -2 -29 -44 -61 -42 9 6 -1 -8 -35 98 7
6828 7 38 -9 35 46 36 -45 -47 -10 -14 -25 23 62 21 24 33 -44 -6 -3 43 37 -7 -21 -26 -4 -4 54 -40 -38 36 -25 -21 9 -62 -109 -14 7
6864GJ2k6L2m1J9K0J4l6L1J3m2n%lKM2n2M2m3O6n2N3o6P7p6n6P8m5J1k3K3K2j0
6897a2M7m2j1j7M1l1J5K9p0P0k5J3Oj0P8p4%l3O6o9N9l4j0J5J1j3L8qm2M4k3l1
6929b3L5m7L7k3MN7m7O0p7on0J31n3l5J12j46L5J0rMM1k4J9K5m8L8j9j9N6p9K0
6960b1J4J3k5N6n9J2K1o2P8j3p2P9Lm1K5k1L9Jq1lL3O9J7j16N9%n5j4M1O1l9m2
6992d3O1mq6L9mK1l6M4K0L1m1L0k3k1N8n2j3Onj7L7K0j3n1K0N1n8J4K8J7l9ql
7025b0L8pJ8k0n9N8rk8K0L3Kn4K8LK6n3J4j7N4j6l5R8Nj21N6ol0L5Ok4k4Q4J9
7058G4j48L2N1k6Q8l9p8l0J18n7m7P8Rl2j6KN4k8pJ7k0pJ6J7p7N4j4j0J6K6l9
7089b3k0P2m0k0mJ13l3o4l8O5J5n7K1mJ3J6n7O2mk5k3L5Qm2oK5K7Nk2J0k8MP9
$$ plain form
6864 7 19 -7 25 -16 3 23 37 1 32 45 3 -2 -2 -5 -3 39 -13 29 -14 52 0 53 -13 64 -12 -68 10 -35 -24 -47 -24 -2 -12
6897 -12 35 -7 -18 -35 6 -25 -10 19 -51 19 -6 7 13 3 81 7 7 -26 40 -29 30 -4 -14 1 12 -1 37 29 -13 31 8 -23
6929 -23 12 -35 2 -21 -17 40 -7 53 -24 -30 -80 51 -2 -37 75 -71 -36 -26 -35 -31 10 -14 5 30 -18 20 1 -18 38 -41 -21
6960 -21 -7 6 -19 37 -22 -10 11 -51 27 14 -58 21 24 -17 8 -13 26 27 -54 -57 -24 45 62 -54 5 5 -50 -64 -23 38 -1 -43
6992 -43 18 14 -72 -33 -37 -16 -52 -8 12 43 2 32 9 -12 46 -6 -19 -13 -18 -35 2 22 9 -42 -22 29 -29 -15 13 30 -9 -17 -20
7025 -20 18 11 29 9 -50 8 -1 -29 -9 24 26 -28 0 3 29 -24 -10 -27 27 11 -24 74 79 -42 14 8 -22 13 19 -5 -29 55 74
7058 74 -74 -42 9 -17 71 32 -46 -76 42 -15 -62 16 25 -7 -23 -21 33 5 -2 15 -5 -12 4 21 -56 -2 -16 -26 -10 16 -23
7089 -23 -43 29 -11 -31 -35 78 45 -19 -57 8 23 -34 -13 -17 -4 12 -45 17 13 -12 -35 0 8 -34 -40 -15 12 17 -5 5 -23 -19 60
7122F0k1k5k6O8l3k6l6M9J%PJ8jk4k5%%O4q7N4J0o4M5n2Q9k3l5JM3p4J6K1rJ3
7156bNJ3m7N4j7n3P3q4P8K3q1Q8l2J3l9R7p2m0L9j5%n6P9l4qK4pm0K5M5p6M7l9
7189c9N0j9N1j7o0J8O7l0oj9qpJ4k0L4j8L9nmJ7m6K5O9j12k2P5jJ0kK1k3j5l7
7222b0K9Lkm6M4Pk1PL3l9K1M6j1n3Nl3M4JNj6J8J8k6J9l5K3l7k3P1j6l0J9Kj5
7256hK6p0O2K4j09Q3j9J3N5k6l8Rj7O9%o7M1l2K2rkJ2n8KN3J8pj2r4J52j8n4M4
7289D5L8j09N2m9nML8K1l5mj0M3np0L7m2O2Lj3O6o5jkk4j9Q6p0N7q6N8k3J09p6
7322A1j0k0lpM1p1N3OK6k8j1Ql3M3k7J8oL9o7Q2m1m1P2m4m3N4J7%n3K6pkj6N2
7356A8k7K3k8J0K2J4m4lOj9J9l9L3j1M7j2j8j9L0jL3l7J6Lqn8M5j6K3M7rkn8N1
$$ plain form
7122 60 39 14 -12 56 23 -3 -39 10 11 11 18 36 35 11 -14 -14 -14 50 -37 17 27 -37 8 -44 45 22 -13 -12 31 -43 -27 -6 -15 -2
7156 -2 3 16 -31 23 6 -47 26 -58 20 43 -38 50 18 31 -8 89 17 -23 16 1 1 -55 24 -10 -18 6 -1 -41 -16 29 -47 0 -39
7189 -39 11 -8 43 26 -34 -16 51 21 15 -4 -12 -19 -5 -25 9 -9 30 25 21 38 -8 17 86 -26 -48 27 26 36 34 55 32 17 -20
7222 -20 9 12 10 -36 8 15 -6 1 34 -5 16 62 51 -2 3 -30 14 15 20 4 22 40 14 33 -2 21 -16 -39 32 16 -14 5 7 -8
7256 -8 18 -52 10 34 -75 8 -11 2 57 31 -7 2 -15 54 54 -13 28 -4 18 9 7 19 -39 -37 16 34 27 15 -79 73 55 1 45
7289 45 83 -26 26 -23 -28 -24 14 35 0 -4 -14 29 24 -46 -9 -51 11 14 1 67 2 1 -1 -25 -44 42 -28 29 -57 1 -22 87 11
7322 11 1 -19 -22 -29 12 -59 -6 0 26 -2 -13 -5 -38 5 -22 -4 -10 29 -38 44 3 -38 34 -10 -53 1 18 18 -35 -9 -16 -18 -34 18
7356 18 -9 14 -14 -4 18 32 -12 -15 -9 -28 -9 -48 -15 -26 21 9 -9 -28 2 1 34 -3 13 16 8 -50 -5 -21 2 49 40 38 -20 31
7390C1l2k7L8J3l0K9j3M3m8j5j1L2o0Q5Kq4R5k5J3n8kK8k3j4K4l6J7oM3rk3M1
7422A8Lk8P9q0kK0nMK2Mk4J4rO0j23M6j9N6k7L3r3Q2qm4K3o5L3K3k3KL3J0Om9
7456b8P8k9l3L6m2nQ3n9k6L9J3%Rlk0j5k6O1m2l6Q4po7N0k3j3K7Lj6O9n7j9Jk5
7490c8L6J0k9QJ0j1j4K6J6n8M7M2kol4n1K8o2J18k9lj3K7k3ML8jp4jQ0o8N5n1
7523b3j0N5j6Po9M5MPl5MJ7R2m4k1l6M6k6Op%QJp9N3O3o0O5pk0k4R2p0Rl7n0P0
7559A0Km1R1J2q1L0o1k4R0n4J2OM0n6M0m3L8j1q1R7p8N4m3O5J0k7P9p9rJ7QKo
7592IK7m8j5L6mJj0l3Q2k4k6P5q5K0j1L3j3j4m2PK2L3jK7p4J0L5m7n3O6L7p4O6
7625A2q0R0m7O3j2n7L7k9J6J3L2q7P2Nm3N3q5N3K2j9K4Mk5J2k3l2M5k6k6N8j6
$$ plain form
7390 31 -1 -28 10 23 -7 22 9 52 4 -11 -22 10 -50 35 37 -47 48 23 36 -22 -24 4 -19 -33 -9 -45 -28 -34 9 0 -23 18
7422 18 21 -7 72 -8 -10 10 5 9 31 35 11 25 16 76 -47 -1 -20 36 9 42 -51 31 23 -21 2 -63 -30 -7 -30 -28 5 15 21 -28
7456 -28 50 21 -12 24 -18 -23 60 1 -25 14 27 27 36 33 13 -2 -28 33 -9 -45 39 32 -35 15 -8 -21 6 9 -7 62 5 -14 -13 -38
7490 -38 -2 8 -21 -13 -3 -14 -28 -2 14 -44 3 45 43 37 3 -48 -20 -82 36 7 4 -9 18 -5 -1 37 36 -38 -39 41 -27 28 -23
7523 -23 -33 22 6 13 -56 -11 -7 0 -35 -31 -14 78 34 13 -23 23 -3 3 -4 -4 4 5 -74 -21 42 -18 47 40 20 -4 88 18 27 -10 -60 10
7559 10 12 -29 62 74 -7 23 -38 -62 28 -26 -14 -8 32 -24 16 -27 11 0 -81 16 -62 -8 -51 14 24 -3 76 -3 -12 5 13 15 9
7592 9 36 -12 -27 9 5 6 -4 -37 45 21 -5 70 -15 5 -6 27 14 0 -42 -35 -13 20 19 46 -28 -18 17 -30 -83 -17 20 -54 12
7625 12 -68 22 -25 38 26 -31 6 -23 -7 6 38 -49 23 28 -15 38 -47 6 28 9 33 37 12 24 1 -31 14 -12 -38 20 4
7656Dj3k0oK2k7K9L3l2j9J0ql0K7L5l9M1j8Qm5L8j2J2LJ3j4L8k2m0N5k5Pj3k5
7689c3N9J3o6J7L6j7K0k7j2k0qN9m1K3n6N5J0k9K7m5J2K9m6R2Or0R5r5M2K4j4
7720B0rlm5O3j4Plk5O1l4l3L0j9K2rk3K6l2m0P2J4j1m2M1l5L2n8J9P0Qp0k4MK0
7754b0k9QJ6NL0k3K9j6J6K4o1k8N0Lj5JM0J7j4j8JNl2k4N5m3M9l1nj3L1oJ0m3
7788c1K6k1L0jN1j08J5M6K3kn1L0K1l2J7Rk5J8rj3m6O1K0l7K6k0O2m4JP3n4k7
7820HqK5j3K2q5OOK6l3K5j8R3p1K0l7L1j0J6p8J06l5o0P9l9rO3l1k2J1j1J3k6
7852c6K0m1O3j0k4O6m1M0j7k0K0k5j9m5N2J3j8Kl1K2O6n1jj4j9Oj2N2j2K6ml3
$$ plain form
7656 4 -9 -29 -35 -13 -40 -11 22 -10 -29 -19 -27 -57 -30 5 -34 7 -11 -3 -48 -10 -22 -10 -7 6 -8 30 8 -32 23 -2 5 -8 -33
7689 -33 26 39 -27 -10 26 9 29 2 -10 -30 -38 21 -20 3 -53 2 12 -17 10 -35 -23 6 -40 52 58 -32 63 -32 10 34 20
7720 20 11 8 -37 26 12 19 16 -9 52 18 -15 15 -4 18 9 -14 12 -20 -60 12 26 15 -27 14 -21 11 -47 -28 42 50 -20 -44 -40 -20
7754 -20 -49 -41 -25 -20 10 -13 16 0 16 40 -21 -49 1 4 -11 -10 30 47 33 15 16 21 -11 -35 20 -23 26 -5 -10 -23 8 2 12 -31
7788 -31 -5 -26 4 3 54 -54 -39 7 30 28 -23 7 28 -4 13 22 -3 15 6 -7 -53 8 28 -9 17 -3 59 15 16 89 35 8
7820 8 0 25 12 34 -51 -45 -39 -13 -46 -21 -39 54 -17 3 -34 -3 -13 3 -75 31 -4 -64 15 -24 -33 30 -1 -23 -12 -23 -10 -36
7852 -36 -16 -57 6 -4 -28 38 -3 37 20 0 20 -5 -24 -69 -17 -4 -22 -20 -51 -29 37 -14 -15 -29 -48 -42 -54 -2 -14 12 8 -25
$$ [...]
8191e0
##END NTUPLES=NMR FID
##END=
