##TITLE=1H_AM_NvBuMA23
 CDCl3
 8 sc, 
 23.09.2022
##JCAMPDX= 6.0         $$ Bruker NMR JCAMP-DX V2.0
##DATA TYPE= NMR FID
##DATA CLASS= NTUPLES
##ORIGIN= UXNMR, Bruker Analytische Messtechnik GmbH
##OWNER= root
$$ XWIN-NMR		Version 3.5
$$ Fri Sep 23 16:10:02 2022 Russian Standard Time (UT+4h)  she@DPX200
##.OBSERVE FREQUENCY= 200.1313499994
##.OBSERVE NUCLEUS= ^1H
##.DELAY= (6, 6)
##.ACQUISITION MODE= SIMULTANEOUS
##.ACQUISITION SCHEME= undefined
##.AVERAGES= 8
##.DIGITISER RES= 18
##SPECTROMETER/DATA SYSTEM= spect
##.PULSE SEQUENCE= zg30
##.SOLVENT NAME= CDCl3
##.SHIFT REFERENCE= (INTERNAL, CDCl3, 0, 15.7039)
##AUDIT TRAIL= $$ (NUMBER, WHEN, WHO, WHERE, WHAT)
$$ ##TITLE= Audit trail, XWIN-NMR		Version 3.5
$$ ##JCAMPDX= 5.01
$$ ##ORIGIN= Bruker BioSpin GmbH
$$ ##OWNER= she
$$ F:/spectra/data/she/nmr/H-F/1/audita.txt
$$ ##AUDIT TRAIL=  $$ (NUMBER, WHEN, WHO, WHERE, WHAT)
(   1,<2022-09-23 16:08:38.51 +0400>,<she>,<DPX200>,
      <created by zg, POWCHK disabled, PULCHK disabled
       configuration hash MD5:
       00 E9 B6 7A A2 85 ED C7 34 08 36 98 17 FE 4E 26
       data hash MD5: 16K
       F6 2C DD 8D A0 56 97 08 9E C6 2F BA 04 5E AF BA>)
$$ ##END=
$$ 
$$ hash MD5
$$ 85 90 DB 9E F2 9C AD 06 58 A1 92 FC 46 F0 48 80
##$RELAX= 
##$RELAX= 
##$RELAX= 
##$RELAX= 
##$RELAX= 
##$RELAX= 
$$ Bruker specific parameters
$$ --------------------------
##$DU= <F:/spectra>
##$EXPNO= 1
##$NAME= <H-F>
##$PROCNO= 1
##$TYPE= <nmr>
##$USER= <she>
##$AMP= (0..31)
100 100 100 100 100 100 100 100 100 100 100 100 100 100 100 100 100 100 
100 100 100 100 100 100 100 100 100 100 100 100 100 100 
##$AQSEQ= 0
##$AQ_mod= 1
##$AUNM= <au_zg>
##$AUTOPOS= <>
##$BF1= 200.13
##$BF2= 200.13
##$BF3= 200.13
##$BF4= 200.13
##$BF5= 200.13
##$BF6= 200.13
##$BF7= 200.13
##$BF8= 200.13
##$BYTORDA= 1
##$CFDGTYP= 0
##$CFRGTYP= 5
##$CHEMSTR= <none>
##$CNST= (0..31)
1 1 145 1 1 1 1 1 1 1 1 1 1 1 1 1 1 1 1 1 1 1 1 1 1 1 1 1 1 1 1 1 
##$CPDPRG= <>
##$CPDPRG1= <>
##$CPDPRG2= <>
##$CPDPRG3= <>
##$CPDPRG4= <mlev>
##$CPDPRG5= <mlev>
##$CPDPRG6= <mlev>
##$CPDPRG7= <mlev>
##$CPDPRG8= <mlev>
##$CPDPRGB= <>
##$CPDPRGT= <>
##$D= (0..31)
0 1.2 0 0 0 0 0 0 0 0.06 0 0.03 0 0 0 0 0.0002 0 0 0 0 0 0 0 0 0 0 0 0 
0 0 0 
##$DATE= 1663934917
##$DBL= (0..7)
120 120 120 120 120 120 120 120 
##$DBP= (0..7)
150 150 150 150 150 150 150 150 
##$DBP07= 0
##$DBPNAM0= <>
##$DBPNAM1= <>
##$DBPNAM2= <>
##$DBPNAM3= <>
##$DBPNAM4= <>
##$DBPNAM5= <>
##$DBPNAM6= <>
##$DBPNAM7= <>
##$DBPOAL= (0..7)
0.5 0.5 0.5 0.5 0.5 0.5 0.5 0.5 
##$DBPOFFS= (0..7)
0 0 0 0 0 0 0 0 
##$DE= 6
##$DECBNUC= <off>
##$DECIM= 32
##$DECNUC= <off>
##$DECSTAT= 4
##$DIGMOD= 1
##$DIGTYP= 9
##$DL= (0..7)
0 120 120 120 120 120 120 120 
##$DP= (0..7)
150 150 150 150 150 150 150 150 
##$DP07= 0
##$DPNAME0= <>
##$DPNAME1= <>
##$DPNAME2= <>
##$DPNAME3= <>
##$DPNAME4= <>
##$DPNAME5= <>
##$DPNAME6= <>
##$DPNAME7= <>
##$DPOAL= (0..7)
0.5 0.5 0.5 0.5 0.5 0.5 0.5 0.5 
##$DPOFFS= (0..7)
0 0 0 0 0 0 0 0 
##$DQDMODE= 0
##$DR= 18
##$DS= 0
##$DSLIST= <SSSSSSSSSSSSSSS>
$$ [...]
##$SUBNAM2= <"">
##$SUBNAM3= <"">
##$SUBNAM4= <"">
##$SUBNAM5= <"">
##$SUBNAM6= <"">
##$SUBNAM7= <"">
##$SUBNAM8= <"">
##$SUBNAM9= <"">
##$SW= 18.0517283424941
##$SWIBOX= (0..15)
0 0 2 0 0 0 0 0 0 0 0 0 0 0 0 0 
##$SW_h= 3612.71676300578
##$TD= 16384
##$TD0= 1
##$TE= 0
##$TE2= 300
##$TE3= 300
##$TEG= 300
##$TL= (0..7)
0 120 120 120 120 120 120 120 
##$TP= (0..7)
150 150 150 150 150 150 150 150 
##$TP07= 0
##$TPNAME0= <>
##$TPNAME1= <>
##$TPNAME2= <>
##$TPNAME3= <>
##$TPNAME4= <>
##$TPNAME5= <>
##$TPNAME6= <>
##$TPNAME7= <>
##$TPOAL= (0..7)
0.5 0.5 0.5 0.5 0.5 0.5 0.5 0.5 
##$TPOFFS= (0..7)
0 0 0 0 0 0 0 0 
##$TUNHIN= 0
##$TUNHOUT= 0
##$TUNXOUT= 0
##$USERA1= <user>
##$USERA2= <user>
##$USERA3= <user>
##$USERA4= <user>
##$USERA5= <user>
##$V9= 5
##$VALIST= <valist>
##$VCLIST= <CCCCCCCCCCCCCCC>
##$VD= 0
##$VDLIST= <DDDDDDDDDDDDDDD>
##$VPLIST= <PPPPPPPPPPPPPPP>
##$VTLIST= <TTTTTTTTTTTTTTT>
##$WBST= 1024
##$WBSW= 4
##$XGAIN= (0..3)
0 0 0 0 
##$XL= 0
##$YL= 0
##$YMAX_a= 574619
##$YMIN_a= -438727
##$ZGOPTNS= <>
##$ZL1= 120
##$ZL2= 120
##$ZL3= 120
##$ZL4= 120
##$ABSF1= 10
##$ABSF2= 0
##$ABSG= 5
##$ABSL= 3
##$ALPHA= 0
##$AQORDER= 0
##$ASSFAC= 0
##$ASSFACI= 0
##$ASSFACX= 0
##$ASSWID= 0
##$AUNMP= <proc_1d>
##$AZFE= 0.1
##$AZFW= 0.1
##$BCFW= 1
##$BC_mod= 2
##$BYTORDP= 1
##$COROFFS= 0
##$CY= 11.3945322036743
##$DATMOD= 1
##$DC= 2
##$DFILT= <>
##$DTYPP= 0
##$F1P= 2.36226072786647
##$F2P= -0.459571619588291
##$FCOR= 0.5
##$FTSIZE= 0
##$FT_mod= 4
##$GAMMA= 1
##$GB= 0.15
##$INTBC= 1
##$INTSCL= 1
##$ISEN= 128
##$LB= 0.24
##$LEV0= 0
##$LPBIN= 0
##$MAXI= 10000
##$MC2= 0
##$MEAN= 0
##$ME_mod= 0
##$MI= 1.114404
##$NCOEF= 0
##$NC_proc= 0
##$NLEV= 6
##$NOISF1= 3.799351
##$NOISF2= 2.8
##$NSP= 1
##$NTH_PI= 0
##$NZP= 0
##$OFFSET= 15.70392
##$PC= 1
##$PHC0= -17953.45
##$PHC1= 21.00069
##$PH_mod= 1
##$PKNL= yes
##$PPARMOD= 0
##$PSCAL= 0
##$PSIGN= 0
##$REVERSE= no
##$SF= 200.130013532006
##$SI= 16384
##$SIGF1= 3
##$SIGF2= 2
##$SINO= 400
##$SIOLD= 16384
##$SREGLST= <1H.CDCl3>
##$SSB= 0
##$STSI= 0
##$STSR= 0
##$SW_p= 3612.71676300578
##$SYMM= 0
##$S_DEV= 0
##$TDeff= 0
##$TDoff= 0
##$TI= <>
##$TILT= no
##$TM1= 0
##$TM2= 0
##$TOPLEV= 0
##$USERP1= <user>
##$USERP2= <user>
##$USERP3= <user>
##$USERP4= <user>
##$USERP5= <user>
##$WDW= 1
##$XDIM= 8192
##$YMAX_p= 0
##$YMIN_p= 0
$$ End of Bruker specific parameters
$$ ---------------------------------
##NTUPLES= NMR FID
##VAR_NAME=  TIME,          FID/REAL,        FID/IMAG
##SYMBOL=    X,             R,               I
##VAR_TYPE=  INDEPENDENT,   DEPENDENT,       DEPENDENT
##VAR_FORM=  AFFN,          ASDF,            ASDF
##VAR_DIM=   8192,          8192,            8192
##UNITS=     SECONDS,       ARBITRARY UNITS, ARBITRARY UNITS
##FACTOR=    0.0002768,     1,               1
##FIRST=     0,             0,               0
##LAST=      2.2672688,     0,               0
##MIN=       0,             -438727,         0
##MAX=       2.2672688,     574619,          0
$$ Real data points
##PAGE= N=1
##DATA TABLE= (X++(R..R)), XYDATA
$$ [...]
2120B097l912j506K907L334n96l705j700K935L107j191l400j063K136K708p3k905
2136h27j869K014L202l2l391k373K089L704o4l571j882K213L232J20l130k269
2152b834J625L119J43k562j829R11K884J395k618l020J251L485N50l086k214J469
2168a331L005R39k407k898J219L361N61k363k479J38L266J935k326k941K50L236
2184A165J991k680l133R56K652J034j457k527K47K986J194k012k307M7K565J802
2200B523j860l251L82L451J629j830l165n20L611K124k733k441K74J595K549l78
2216A960l583o07K720J500p98k464j173K448K258j237k592l98K597J963j625k919
2232a950k72K685J833j277k471r06K059L208q27l797p76K167K132J73k853j945
$$ y = [2097, -1815, -3321, -414, 2920, 2324, -1381, -3081, -146, 2961, 1770, -1630, -2693, -557, 2151, 2078, -827, -2696, -682, 2520, 2488, -903, -3276, -1187, 2517, 2453, -1118, -3000, -787, 2445, 2565, -565, -2834, -1209, 1910, 2053, -509, -2338, -1427, 1457, 2852, 234, -2786, -1535, 1950, 2500, -586, -2800, -1331, 1674, 2613, 206, -2692, -1473, 1888, 2449, 86, -2393, -2255, 1011, 2946, 620, -2321, -2071, 1165, 3156, 476, -2657, -1701, 951, 1985, 528, -1999, -1752, 1234, 2428, 416, -1891, -1844, 721, 2523, 663, -2588, -2206, 1245, 2874, 1044, -2121, -2641, 970, 3094, 361, -2080, -1806, -211, 2338, 1960, -1623, -2230, 490, 1990, 1192, -1272, -2445, 3, 2261, 1024, -1568, -1966, 631, 2594, 969, -1950, -2222, 463, 2296, 1019, -1452, -2358, -299, 2909, 2082, -1715, -2491, -324, 1808, 1981, -872, -2817]
2248b817K332K649l72k359j498J596K281n53k283r82J566K284j64k535j435K000
2264b90K717p04k990j207J525K851O79l194k234J940K865M85k592k479J203K808
2280A383N53j809k186O95K963N08k405j489Q54K119N15k137j643J047K595P71
2296B334k610k206J540K643L68k122k292N21L050J445k177k654N38K632J129j566
2312E73k353r5K393J428j352k058K5K277J227j878j852M52J658J297j049k632
2328a939J79K899J224j786k292r3K252J776j294k684k53K404J864j081k418n52
2344a794J964J519q71j872o73J521K058o40k563k30K105J181r37j933p75J897
2360d3K183j103k481l14J947J781o30k546p72J756J749o2k124j559J924K371q14
$$ y = [-2817, -485, 2164, 1792, -567, -2065, -469, 1812, 1259, -1024, -2006, -440, 1844, 1680, -855, -2290, -290, 2427, 1723, -1267, -2474, -949, 1902, 2581, -613, -2847, -907, 1958, 2443, -149, -2628, -1425, 1383, 1936, 127, -2059, -1364, 1599, 2107, -298, -1787, -933, 1186, 1701, -436, -2079, -1032, 1563, 2334, -276, -2482, -942, 1701, 2069, -53, -2345, -1824, 1226, 2671, 494, -2160, -1622, 1010, 2139, 573, -1780, -1875, 518, 1946, 594, -1464, -1439, 838, 2065, 187, -1665, -1213, 445, 1742, 693, -1939, -1760, 1139, 2363, 577, -1715, -1808, 444, 2220, 926, -1758, -2011, 393, 2257, 1176, -1242, -1794, 170, 1689, 818, -1054, -1727, -206, 1852, 1212, -1351, -1581, 524, 1705, 768, -1165, -1940, -43, 2140, 1037, -1444, -1758, 189, 1970, 1340, -1206, -1978, -222, 1527, 1465, -659, -2218, -294, 2077, 1263]
2377A263k125p11J037J945ok352r91J856J890n34k060q40J360J760j86k064j231
2394a989J370K227J14k371j344J678J884j97j758j460R17K343J93k035j293J149
2410e72J944P5j752j314N82K070P30k086j569J187K010M41j838j747R70J860M57
2427A448j221k047M53K654N07j862j259K39J730J110j543j992M98K233Q96j776
2443F8j608O51J646P80j191j962J92K106J027j268j926J92K106R20j250j775k28
2460a520J904J349j207j919K3J983J084j228j472k40J262J616q61k199N3J822
2476D50J112p00j993k85J778R55n70j622r17J899J710j207j560r1R57J449l59
2493A006j970n56J462J457n35j771l44J387J088l30j508q67J207J627l70j779
$$ y = [1263, -862, -1573, -536, 1409, 1403, -949, -1940, -84, 1806, 1272, -788, -1628, -268, 1492, 1306, -758, -1989, -619, 1608, 1722, -649, -1993, -315, 1569, 1372, -386, -1846, -929, 1414, 1607, -428, -1721, -572, 1372, 1447, -305, -1619, -1037, 1033, 1763, -323, -1892, -705, 1305, 1746, -92, -1839, -869, 991, 1448, 227, -1820, -1367, 1287, 1794, -68, -1327, -1088, 642, 1752, 209, -1783, -1285, 948, 1844, 68, -1540, -889, 757, 1537, 346, -1616, -1424, 682, 1709, 441, -1485, -1293, 813, 1733, 483, -1292, -1520, 384, 1733, 526, -1393, -1370, 613, 1697, 469, -1003, -1243, 19, 1635, 774, -1425, -1372, 450, 1562, 862, -1131, -1416, 362, 1317, 747, -875, -1792, 107, 1817, 610, -950, -1041, -84, 1365, 1006, -964, -1520, -58, 1399, 864, -907, -1251, 136, 1224, 894, -614, -1481, -274, 1353, 983, -796]
2509g96o36J400J387l73j509q39R44J660j38j716q77J207J574k71j420p19O06
2526e16J459L70j815j081J191J514N1j524j064J094J390q9j143j272O11K076j2
2543A240j774n76O72J175O33j418j501Q20J705J94j362j141P71J591J54j257j087
2560a161L96J511N34j337j316N88J601M29j224j133K91J375P90j122j683N11J843
2577H93L02j134r39RJ242R43r94j520K30J418P31q24j388J69J394O63p73j342
2595i20k55J570R81j203j244L74R63P80m00j542k41J356R14n37j412m28J524J045
2613A325q27j148l61Q99J357n58j679n1J182Q09l01j134m97R16J093j73j474p28
2631a350J352J183o39j161l68Q49J226k85j461m59J031J042k32j217n10Q88R96
$$ y = [-796, -1432, -32, 1355, 982, -527, -1366, -422, 1238, 1100, -616, -1493, -286, 1288, 1017, -403, -1122, -516, 943, 1313, -502, -1583, -392, 1122, 1173, -351, -1415, -321, 1069, 980, -163, -1435, -824, 1252, 1240, -534, -1110, -438, 737, 1370, -48, -1549, -729, 976, 1170, -192, -1333, -562, 1029, 1183, -74, -1161, -765, 746, 1280, -57, -1373, -785, 816, 1245, 21, -1112, -821, 554, 1344, 222, -1461, -950, 893, 1195, 61, -878, -869, 373, 1316, 322, -1198, -968, 450, 1181, 357, -1031, -862, 532, 1195, 422, -920, -1175, 395, 1376, 173, -1071, -697, 266, 1046, 646, -896, -1137, 219, 1133, 596, -816, -1244, 280, 1325, 498, -650, -1011, -112, 1245, 687, -992, -1043, 139, 948, 647, -487, -984, -68, 1025, 852, -622, -1350, 2, 1185, 546, -615, -983, -134, 1092, 807, -654, -1113, -82, 960, 728, -489, -999, -111, 885]
2648H85q1j091q07O97J407j59j488l65R98P76n7r18p94O97J202j64j178n18O89
2667b69J064l4r80p17L95J336K85j412p84P62J103J47j038p96O03R40K12p21j113
2686a017L89J383M3r88n52K43J029N14j096r73N65J097K73j058q97O09J059J31
2704G54o59q82m0J326O34j159j002N25R17M22n05j159J5J377M37r26r00J48J057
2723C80N62q21q35J17Q67P29o29j273J02J226N11p26r31m8J015P05n25j153j57
2742h84J182O21o92q10n2P23P42l85j046j75R00P62m75j160k5R81N87l56r06m12
2762h80R00R87n09j161r8P97O81j50r08n25P33R05j43j017n00Q48P92l37p91l17
2782f93N21R11o6j107m44Q02Q39k56r01l90O01Q58M6r13p34N97J127j36r98l46
$$ y = [885, 804, -287, -1094, -397, 1010, 851, -637, -1002, -4, 772, 715, -203, -997, -300, 902, 738, -440, -958, -269, 795, 761, -219, -936, -541, 795, 1080, -332, -1116, -354, 749, 896, -142, -938, -335, 605, 817, 96, -1017, -628, 755, 798, -190, -742, -499, 530, 1044, -52, -1025, -460, 637, 910, -148, -1045, -436, 623, 754, 95, -787, -827, 499, 1133, -26, -1028, -503, 414, 836, 331, -828, -813, 564, 1001, 75, -825, -677, 380, 942, 121, -714, -597, 270, 999, 370, -903, -801, 425, 936, 210, -721, -769, 246, 951, 426, -727, -884, 298, 919, 227, -583, -635, 88, 830, 445, -601, -776, 124, 886, 411, -749, -774, 207, 794, 438, -468, -880, 20, 1007, 498, -663, -761, 36, 717, 567, -341, -866, -133, 772, 629, -388, -888, -40, 752, 415, -376, -693, -172, 739, 673, -434, -878, -76, 763, 507, -394, -784, -183, 675, 721, -192, -926, -329, 798, 662, -336, -682]
2802f82M21P13K90q61o97N97Q45n6p87n08N32Q09n0p54m82L14R80J96j095o51
2822i26O86Q14R8p54p16L41R70K96q07p67L31Q70K01o47n68J60P51K99n81p08
2842f57K25R33J56q29n09M16O35L06n64q70K19J114J88p77o70J57P36N43m82r16
2862f46K3Q64N03m82q45J1Q31L26m67n01j55O56O30n64q61K20P35L13l39p88j01
2883f37Q35N54m00r38j85R68O01m97p50j82N85P04j46q98k62O69N91k80o97j30
2903d95M91N24j27p76k50O79O17l64p84j09O49N25j83p16l73O04P57j44q16m26
2923g17N92O90j29n69m67K87Q09J12q66l70N38N32m4n22m09L88N94L1o58m64M74
2944a68P56j36o47l50K74P27R6o63m90L39P23J22p00m35K98N46K08m34o00J60
$$ y = [-682, -261, 452, 742, -119, -816, -219, 626, 570, -217, -725, -193, 616, 566, -188, -670, -356, 624, 820, -275, -926, -240, 574, 672, -82, -798, -457, 513, 809, 2, -765, -434, 436, 637, -10, -578, -418, 333, 632, 51, -657, -432, 501, 657, -172, -681, -265, 370, 676, 112, -758, -539, 575, 763, -14, -684, -527, 209, 752, 270, -646, -623, 241, 744, 262, -583, -572, 259, 585, 118, -383, -538, 118, 748, 184, -677, -457, 278, 591, 252, -536, -637, 198, 752, 352, -586, -771, 197, 798, 301, -449, -631, -46, 658, 512, -386, -648, 21, 612, 332, -365, -495, -4, 520, 393, -383, -633, 46, 663, 299, -485, -594, 55, 580, 397, -319, -692, -88, 669, 525, -291, -717, -125, 565, 436, -133, -600, -313, 496, 608, -258, -628, -90, 442, 398, -124, -533, -145, 449, 480, -178, -642, -168, 588, 452, -195, -545, -271, 456, 552, -111, -601, -262, 461, 583, -117, -552, -254, 292, 500, 66, -534, -374]
2964c74P96J15o47m25L06N41J71m95n10K09O75J79n50n71J96P58J49n28m51M9
2984d07O26M54n74o89K61O07J84l82n53R5N82K86l85n70O0O68K58m87m81J23M89
3005A65L49l49o31L6O34L61m12o10R0N42K95k55n62j58O10N05l77o46NN25L40
3026D57k07o00j15N18M28j76o50j58O14M07k91n02j75L71O05j46p74j46N91L95
3046D46j73n49j75L68N53j25n90k79M61N56j66n75j96L69M90lo16l57M67N75q5
3067C96o01l03M50M57l0m59l80K70O22J4o32k47K95M56J32n43m44L88N13L9m70
3088g7m54L15N98l1m46k61J20M94K09m79n03L18N15R0m34l94K13M98J15l64m76
3109d34J56N65J10m24l05R2M26K12l27n15J30N45J89l77m50J28N35J63l79l92
$$ y = [-374, 422, 537, -110, -535, -229, 312, 483, -12, -522, -313, 362, 541, -9, -580, -384, 374, 523, -5, -456, -407, 219, 673, 99, -590, -329, 278, 462, 80, -473, -378, 204, 490, 105, -465, -405, 263, 521, 34, -447, -324, 165, 514, 165, -466, -430, 204, 565, 153, -457, -367, 175, 470, 215, -347, -505, 105, 610, 233, -413, -408, 117, 457, 250, -350, -465, 53, 481, 305, -345, -503, 111, 518, 227, -275, -450, -79, 526, 380, -394, -540, 51, 446, 273, -276, -451, -83, 470, 345, -245, -524, -63, 493, 327, -248, -444, -75, 415, 412, -204, -561, -94, 481, 396, -205, -508, -58, 399, 369, -90, -470, -200, 422, 436, -196, -443, -148, 308, 440, -103, -547, -159, 354, 393, -77, -531, -216, 382, 351, -95, -356, -236, 258, 467, -12, -515, -197, 318, 408, -26, -420, -207, 291, 406, 42, -434, -278, 287, 397, -27, -332, -240, 186, 398, 71, -444, -314, 231, 420, 43, -407, -279, 256, 419, 40, -352]
3129c52K7M93K87l64m47R3L89K60k40n01LM83K96k62n28k6N75K40l58l84N5L62
3151A01L16k44n05k8N08K67k59m66k8M17L09j86n12p3M93L19k69m35n5L77L31
3172C78j86m16j34L53L74j53m75j23M17L10r8m31k29L71M58j90m90o8L36L48q4
3193B68m26j99L20L54l4l75k88K98M36q0m38j70K07M11K6m45k57L19L50l9l20
3214h2k80K40L80%l48k78J91M67O2m07l32K87L99ll14l23J72L98J10l66k98J86
3236a39L65Q0k78l03L9M03J77l45l38J89L49R6l07k93J28L56J47l09l40J18L76
3257A71J46k95l04M3L49K15k51l65M9L43K15k42l21L9L20J58k01k91k6L39J96
3278B87k32k73K3L09J92j72l67J7L03K30j60l86o0L55K11j61k86r0K76K59r9l25
$$ y = [-352, -325, 168, 455, 91, -356, -263, 126, 386, 146, -355, -352, 131, 427, 165, -363, -389, 186, 426, 68, -316, -261, 101, 417, 173, -332, -360, 148, 415, 156, -310, -338, 79, 388, 202, -310, -383, 110, 429, 160, -275, -330, 47, 378, 192, -224, -358, -5, 369, 216, -259, -382, 35, 345, 247, -184, -413, -42, 416, 226, -264, -332, 4, 352, 268, -158, -357, -37, 317, 283, -92, -380, -82, 354, 274, -164, -334, -127, 284, 310, -135, -392, -73, 277, 238, -82, -362, -122, 258, 258, -90, -368, -177, 290, 352, -55, -387, -100, 299, 296, -18, -341, -169, 229, 339, -27, -325, -139, 226, 306, 28, -275, -236, 167, 344, -1, -339, -150, 199, 295, -12, -305, -177, 179, 326, 17, -323, -205, 171, 317, 22, -282, -239, 110, 325, 74, -291, -242, 101, 316, 74, -247, -208, 112, 270, 69, -222, -248, 91, 287, 55, -218, -195, 114, 306, 134, -233, -216, 87, 317, 157, -229, -289, 66, 277, 116, -170, -260, 16, 275, 176, -149]
3300a49q7K64K24j26k88l8K13K41j13k94j01K63K79j40l24k8K02K48m3l49j58
3321c04L21K68j00l21j14J82L27m9l37j52K12K70k2k79j52J98K60nl26j02J74
3342e1K52j0k96j50J94K95l9k54j86J24L30K7k89k03J85K54M7k71j88J22K44N7
3364A94k37j70J02K67R7k62k03J01K51R8k20k57R3L16O6k41k26M8K93J29k24k29
3386b14O2K75Q6j61k47K1K48J35j76k27J7K75J29j78k48N7K41J41k11j90J3K35
3408H3J61j66k58LK47J28r0k70mK23J44j36j85k9J75J50j19k05qK10J09r7k11
3431a45KJ82J49j23k04k9J80J75n2k38o6K02J51p6j97p3J40K05n8k41k2J49J63
3454A74o8k01m8J54J30p5j57l8J26J63o9j87p3J42J93l3k12j33J94J94o2j81q8
$$ y = [-149, -236, 28, 252, 126, -162, -200, 13, 254, 141, -153, -254, 9, 288, 148, -176, -204, -2, 246, 203, -146, -304, 17, 285, 185, -136, -250, -68, 259, 210, -127, -279, -67, 203, 181, -98, -250, -52, 208, 203, -123, -225, -51, 201, 191, -105, -255, -61, 234, 195, -59, -245, -121, 209, 236, -53, -256, -71, 183, 230, -41, -229, -107, 137, 194, -43, -213, -111, 156, 253, -9, -212, -111, 140, 238, 18, -239, -146, 170, 236, -5, -231, -183, 110, 239, 15, -214, -152, 123, 209, 48, -199, -178, 70, 205, 29, -198, -181, 94, 223, 45, -203, -146, 95, 236, 25, -165, -152, 83, 244, 78, -180, -177, 70, 198, 108, -162, -166, 57, 201, 65, -120, -149, 26, 176, 57, -148, -156, 54, 163, 66, -145, -143, 39, 188, 65, -139, -168, 12, 187, 135, -103, -169, 33, 184, 108, -89, -162, -22, 183, 125, -116, -138, 11, 174, 106, -95, -143, 11, 141, 66, -91, -129, -3, 160, 91, -96, -169, -27, 166, 133, -79, -212, -18, 176, 114, -67, -155]
3477a55P7K24J1k23r1J26J65mj95o0R9J76m5j43r5J05J74l6j54j40J45J80kk26
3501h7o8R7J69J4j53j25Q3J93K7j51j49R3J53J1j23j31O5K02Mj39j32J07J33K7
3525A20r1j52N4J69N2j46j40Q1J55K0j05j83R2J75Qp6j34L2J29Q2j34j34M0J34
3549D8M5p9j36K7J70M9j14r8K1J33N0r1j29L6J41M3o4j63K6J30N7n8j43J6J20
3574C7J12j13j11LJ16P9p5j32mJ05J33j21j03J2P2J07n1j51j5J04J13p1j27KJ21
3599D2P4r9j05j1J09Q1l8j23l4J45O5n7j23KO7J03l5j40k5J26P6n6j18j5J02P3
3625H6mj36l9P2J28n6j15l6R0R6l3q9p8Q6J16n0p9m6P4J02k7j16l4J00O5l2r1
3652d6k2O3J24m4r8m9R3P1j5r4p9R1J01l0r2o0O1J15j2j21o2Q6R2jq0q4J09Q2
$$ y = [-155, -78, 146, 157, -66, -157, -31, 134, 130, -65, -125, -26, 150, 105, -38, -133, -28, 146, 110, -44, -184, -39, 141, 139, -87, -155, -58, 111, 125, -28, -153, -70, 123, 150, -1, -150, -57, 96, 107, -16, -147, -82, 120, 124, -15, -147, -40, 93, 120, 29, -123, -69, 100, 152, 6, -134, -53, 102, 122, 17, -166, -74, 101, 109, 33, -101, -69, 60, 142, 8, -126, -86, 48, 93, 14, -122, -95, 75, 124, 10, -88, -67, 66, 116, 25, -104, -68, 73, 116, 52, -111, -85, 45, 102, 44, -99, -83, 37, 149, 36, -75, -72, 44, 123, 48, -84, -88, 17, 150, 29, -74, -62, 10, 117, 66, -85, -100, 4, 117, 46, -81, -79, 42, 116, 17, -88, -99, 10, 91, 53, -70, -104, 41, 106, 49, -74, -72, -5, 98, 63, -77, -102, 24, 100, 44, -74, -89, 13, 86, 82, -54, -93, -21, 107, 51, -64, -100, -10, 86, 53, -36, -114, -28, 88, 38, -41, -87, -13, 89, 62, -54, -88, 12, 77, 45, -46, -68, -5, 119, 75, -23, -72, 21, 92, 77, -17, -96, -5, 96, 66, -26, -86, -25, 90, 78, -43, -105, -19, 73, 72, -8, -92, 17, 99]
3680I9j7j20o1Q1Q3K8j22q2R9Q4Pj01o5M5J16K1j36n3N4J44Mj13q6N1J10J9q2
3707Gp3K7J18J3r1o9J1J20M6j20j08O4J21J0j02o3N4R0M8j03r1M6J03L4q7q5j4
3734i4J36M5q2r4QJ21L9m6j28M8R8M8o0j41J1J37R3j31j22L2J21M4n8r1J8J02
3760E4O1r4r6j8J20M6o3j13K1R1O7k7j32NJ07R2j01q6j5J02Q6n9j08l2J13Q3p9
3787B5j01J8P4Q4l3j23l4J19P9l6j34JQ6N7j1j23l4R9R0m0j25j9P8Q9m0p6p3Q1
3815b2J02pj16n2R3Q4kj19p4R5R7nr9o1Q6J04k9q2p2M1J08J5j39m1N4J50Lj58
3843d6m6P0J09K6j05j38R6J21Rj12j06Q2J01J1n9j53O2J48L2j03q5M1J04J4o7
3868Fp3KJ26L7r3q9N1R8M0j18q5J9J37N7r0j34L2J23P3q5j01k1Q9R0o7r1j1J40
$$ y = [99, 82, -38, -99, -18, 65, 93, -29, -111, -12, 72, 79, -22, -87, -42, 74, 95, -41, -94, -40, 104, 108, -5, -91, -40, 70, 89, 7, -66, -39, 79, 92, 1, -68, -57, 63, 109, -11, -119, -55, 66, 76, -26, -89, -35, 55, 103, 0, -91, -45, 58, 92, 5, -80, -94, 42, 87, 5, -89, -81, 40, 79, 33, -95, -47, 51, 99, 39, -102, -91, 46, 139, 8, -114, -82, 39, 83, 25, -66, -48, 54, 115, 21, -75, -93, 27, 73, 10, -103, -82, 9, 76, 49, -83, -78, 29, 121, 20, -66, -81, 21, 107, 48, -60, -92, 21, 104, 25, -76, -58, 16, 100, 67, -56, -90, 29, 108, 72, -62, -61, 25, 82, 71, -52, -86, 13, 103, 63, -62, -81, -3, 86, 46, -30, -103, -22, 80, 73, -43, -95, -2, 82, 80, -39, -113, -18, 79, 74, -25, -86, 0, 104, 75, -7, -79, -38, 70, 85, -54, -95, -41, 109, 112, -46, -92, -22, 87, 113, 8, -130, -34, 87, 96, -16, -122, -40, 61, 72, 13, -140, -78, 70, 102, -1, -86, -45, 59, 73, 6, -67, -65, 61, 98, 5, -84, -33, 65, 105, -13, -98, -79, 58, 115, 25, -109, -77, 46, 119, 34, -67, -88, 1, 91, 24, -67, -78, 62]
3896F2M6q5j11K7J03O6p0j21j7J33Q9n2j75J5J31Q1o4q8p0J13J09l5j59j6P3J20
3922A05k6j25n5R8J19n2j18k9P4J12m2r1o1O3J19m4r2q9J11R7J4j44o2R6J29K1
3948A28j40j38J01J59m6r8m3K7R9M9j07j09R2J05L8j46n6N9R5L8r3r4LJ80M0j61
3974a8j11J07R9J6p5j27L0J74L8j29j25M0J68Ko2r3j4J20P9r0j38M5J25N1o4j20
4000g2j9J29J06p6j51n4J82Q7r5j16jR9R3l7j38m4J43R6p6j16k4J01Q2m3j22m7
4026a13J12J35r8j43L4J15N0l6q5r6J14J31j5j68m0Q4R7j2r4p6N0J18M9j36p3
4051i6R3J12Jj17j04O4J37%j16j10R2J26M0j55n0K9J27Qp7j24L2J68M5j39q8L0
4077g2J07N8q5q9K1J59M7j35j16P4J11L5o8j22mJ05J18j26j42N8J37Q7j51r3m
$$ y = [62, 108, 23, -88, -61, 42, 108, 38, -83, -100, 33, 122, 70, -105, -90, 41, 122, 58, -30, -100, 13, 122, 87, -72, -88, -15, 105, 79, -46, -101, -3, 116, 64, -54, -83, -9, 103, 61, -30, -91, -28, 91, 47, -45, -134, -23, 74, 88, -56, -118, -22, 107, 128, -12, -150, -49, 110, 64, -34, -77, -50, 49, 98, -9, -118, -26, 79, 117, -29, -85, -26, 69, 107, 14, -80, -77, 103, 143, -18, -129, -22, 77, 93, 18, -109, -79, 95, 133, 4, -121, -81, 87, 89, 27, -66, -80, 40, 119, 29, -109, -64, 61, 112, 48, -72, -91, 38, 144, 68, -83, -137, 45, 132, 37, -79, -80, 19, 112, 75, -63, -107, 36, 132, 56, -60, -84, 17, 99, 56, -66, -113, -1, 134, 36, -107, -73, 42, 92, 56, -29, -125, -11, 120, 105, -63, -103, -19, 78, 66, -28, -104, -54, 64, 113, -23, -96, -3, 109, 110, -7, -111, -47, 90, 90, -26, -136, -44, 82, 122, -33, -83, -54, 73, 81, 4, -120, -88, 80, 125, -14, -102, -72, 35, 93, 8, -81, -60, 99, 146, 11, -105, -31, 80, 115, 47, -75, -79, 26, 144, 18, -124, -66, 71, 158, 7, -86, -90]
4102i0J22R8p7j33J3J23L5o2q2m5J15Q3m5j66JJ59R1q8j10k0Q2J07l3j72k4J50
4128C2R8o5j22m4R2J05kj29r0J01J92o0j91k2Q8J10k1r7j48J16J55J5j76q7J32
4153a8J21K3j61j10L7J78R7j97j57J39J57jj39o9RJ64P5j26j48P6J54L4j37r2
4177i1LJ65P9j47j57K9K15M8j30j52P2J49M0q9j33l5J58J84k03j33M8J15R1p8
4201D8j51k0J59J34j36j42M0J54N8j26o8n8R4J65m8k35pJ89Q3l0j36o9J12J26
4225A36m5j49j17J65J84r1j76kO5J34K6k22p4J64J55m5j75m9J00J24j3j35j11
4248a51P4K40m6j95p1J29J46Oj19k08J27J98L1k13r1J36J50j2j59r5J1J99O6j72
4272a9j59R8K33k4j29j02%J61R4j48j71O9J80M7j73p8M4J32J20j25k19L7J86J24
$$ y = [-90, 32, 130, 53, -80, -67, 56, 91, 29, -53, -98, 17, 100, 55, -111, -110, 49, 140, 52, -58, -78, 4, 111, 78, -94, -118, 32, 130, 65, -57, -101, -9, 96, 94, -35, -125, -24, 168, 108, -83, -105, -17, 93, 72, -25, -173, -57, 98, 113, -63, -150, -18, 103, 126, -35, -145, -108, 70, 167, -30, -187, -48, 109, 108, -31, -100, -91, 73, 148, 22, -126, -50, 104, 138, 1, -91, -88, 77, 156, 9, -148, -119, 96, 144, 14, -138, -66, 83, 123, 34, -99, -134, 24, 208, 5, -128, -80, 35, 126, 48, -103, -123, 36, 170, 34, -108, -68, 86, 144, 18, -50, -108, -14, 151, 103, -132, -139, 50, 133, 103, -33, -102, 10, 136, 91, -58, -175, -10, 174, 83, -93, -95, -30, 104, 130, -92, -166, -2, 153, 108, -67, -116, -16, 108, 95, -40, -151, -77, 163, 117, -78, -149, -20, 126, 132, 13, -195, -68, 130, 161, -52, -143, -7, 143, 131, -28, -123, -112, 87, 153, -19, -178, -80, 153, 129, 0, -102, -102, 59, 153, 5, -166, -97, 83, 130, -43, -121, -77, 55, 175, 50, -169, -132, 54, 178]
4296A78j67j82Q0J52Q7r2j61m2J82J65j48j98N4J64P0m7j64o9J34K05j23k11j7
4319a50J57J43r2j41o3J34J89j2k90n9K15J06m6j80o6J24K07j9k33r2J50K29j03
4342A08j93o2J34J69J6k23j48J54K18l0k34q3R6K09K0j55j66Q4K54K6k72j15J27
4365f6J60M3j22k04N5K62M3k08j63J10J90N3j08j91K6J73J50j73k34R3J96Q8j26
4388D7j56k4J95J27r8k56pK70Q4j55j60RJ50J82j11k68nK31J38j45k03oK20J26
4412A85o2k30r5K10K10j37k31k6K06J10k9j93q5J82K14r3k78k4K19J24r0j73q6
4435a72J13K55j9l42m2J96J77n9k08q0J13K35L8k62j50J75K21o9k18m4N4K20M4
4458A76j99j78J32K48k7k22j37J65J85O0k01k14R7K90N6k56k09J13K39J00j67
$$ y = [178, 11, -171, -91, 61, 148, 56, -105, -147, 35, 200, 52, -146, -92, 72, 142, 95, -69, -138, -4, 201, 78, -133, -150, 7, 150, 58, -83, -146, -12, 177, 165, -125, -184, 31, 137, 91, -89, -155, -31, 176, 157, -76, -168, -18, 211, 108, -85, -147, -13, 156, 172, -51, -199, -45, 173, 143, -91, -174, -78, 131, 151, -4, -170, -86, 168, 194, -78, -193, -66, 94, 137, 15, -189, -134, 128, 171, -37, -200, -90, 100, 153, 45, -146, -120, 53, 203, 30, -204, -111, 85, 173, 47, -109, -133, 62, 189, 91, -165, -172, 98, 182, 27, -133, -124, 26, 208, 97, -171, -176, 55, 193, 48, -155, -161, 59, 185, 123, -107, -202, 8, 218, 81, -150, -176, 30, 140, 111, -82, -167, 15, 229, 136, -142, -166, 53, 177, 87, -86, -172, -59, 196, 177, -165, -207, -11, 166, 107, -101, -181, -68, 167, 205, -57, -207, -32, 189, 120, -98, -142, -88, 132, 176, -23, -201, -69, 179, 152, -70, -207, -42, 143, 203, 2, -212, -115, 175, 231, -25, -234, -121, 118, 218, 51]
4479E1j86JK37J50k22k43P3K65J9j42j83oK71J64k42k23N7K34J38j97j99OK41
4502F4J69j27l35lL40J26j61k32k8K10K09r2k78k7K18J74j43k49j1J96J53o2k27
4525a16j00K53K18j57k55l4K11J87j06k52j15K30K63m6l08j27K53J98o6j85j79
4546b33J64K63jk86j33K18K30o1k31j20J04K42O3k83k21K42K78m4k64j31J06K35
4568A37J03k61k21J35L12J4k64j92J40K08P8j59k75P1L43J06k87k10J04K58O7
4589B07k37j71K1K94J63k50l15J63K82P9j97k49NL15J96k51l16M9L39J27k01k52
4611a99M4K17J76j54l18JL66J52k23k38j2K00K49j46l35k1K78K47j91k88k3K59
4633D1J64p9k71j23K64K93j21l28p2K67K04q3k83j23K17K74l5l26j30K75K24n9
$$ y = [51, -135, -134, 103, 253, 31, -212, -139, 126, 145, 3, -180, -186, 85, 249, 7, -216, -159, 75, 213, 16, -183, -177, 64, 233, 106, -229, -232, 108, 234, 73, -159, -187, 23, 232, 140, -138, -165, 53, 227, 84, -165, -176, 20, 173, 111, -116, -216, 37, 255, 98, -157, -191, 20, 207, 101, -151, -266, -36, 227, 181, -127, -254, -1, 197, 131, -54, -233, -69, 194, 193, -93, -226, -8, 222, 161, -70, -190, -86, 156, 219, -64, -285, -43, 235, 191, -73, -204, -98, 137, 240, -21, -242, -107, 205, 219, -45, -237, -97, 111, 189, 30, -245, -174, 169, 275, -12, -222, -118, 140, 207, -30, -201, -180, 114, 277, 27, -288, -125, 157, 236, 39, -210, -205, 110, 306, 55, -261, -212, 127, 254, 53, -199, -155, 62, 238, 84, -234, -233, 133, 285, 62, -176, -188, 12, 261, 115, -220, -241, 37, 284, 93, -195, -218, 41, 205, 126, -145, -268, -4, 289, 168, -160, -232, 35, 239, 156, -127, -250, -33, 241, 206, -120, -250, 25, 249, 190]
4655A90k84j59J82K78ql09k08K37L41n5k98j68J85K73L2l06k14J80L57k5k70k00
4677b49J38K74N8k49k82J63L90M4l35j92J47K77L4k20k76N6L73J31k96k52J36
4698a30K97P6k31k50N4L11J60k61l24J35L09J05k44j75k8K74K12k08l21K8L37
4719A26J42j87k61l0K64J97j42k86n3L39J82k25k52qK56J77j03l10q0L11K47j80
4741A24l04m9K71J90p2l47q9K90K86j54l60n3K89K38r7k99j09J98L19o6l62j49
4763c05K99K91j04k82j60K24K72J4l82j69K49L14o5k90j70J93K66M4l13k48K15
4784a07L48J2l15k07J85K81K1k39k79J54L52M6l39k02J93K76P0k34l06R2L89J10
4806C01l17k96J74L19O4k00k94L1L72J46k56l15O7L43J32k19k64pL24J91j92l59
$$ y = [190, -94, -253, -71, 207, 199, -110, -318, -81, 260, 205, -93, -261, -76, 197, 229, -77, -291, -111, 246, 221, -49, -249, -111, 163, 221, -28, -310, -147, 243, 287, -48, -240, -93, 184, 218, -2, -278, -222, 151, 282, -14, -266, -130, 167, 243, 12, -238, -184, 127, 287, 26, -298, -163, 146, 251, 7, -168, -196, 78, 290, 82, -239, -211, 126, 268, 81, -180, -210, 54, 251, 109, -177, -230, 109, 291, 66, -186, -194, 62, 239, 136, -174, -254, 57, 304, 124, -180, -229, 42, 232, 160, -187, -276, 14, 300, 146, -214, -267, 22, 260, 163, -136, -245, -47, 272, 206, -156, -305, -6, 285, 181, -101, -261, -37, 235, 249, -133, -302, -53, 261, 196, -94, -264, -71, 195, 239, -74, -322, -107, 241, 253, -62, -269, -84, 197, 218, -21, -300, -146, 206, 252, -87, -289, -96, 180, 250, 16, -290, -198, 191, 301, -16, -312, -138, 181, 245, 45, -249, -218, 154, 300, 44, -271, -204, 139, 271, 52, -212, -219, 105, 296, 104, -255]
4828b55L6L39J69j99l13j9L40J84j93l11o2L59K48k27l29J8K58K08r9l43j09L23
4850B3L05k12l25k1K90K34j50k84j06K72K39o4l85p2K98K28j13l04j22K41K82
4871B54l8l68j63L26K56q9l13j30J94L01ol61j59K18L43p4l11j46J96L09K2l52
4893i1k17K00L48J7l60j91K11L08N1l42k33J72L50N7l62k30J86L55K5k76k60P9
4915b03L59J53l11l14J63L60M1k58k39N8L53J56l00l28J29L55J26k89k68M4L25
4936A12K11k49l71Q1L72J57k29l27kL64J98k29l19%L33K35k56l86O4L24K03j50
4958A36l75j8L23K56k09l55mL18K07j15l52j10L04L01r7m11q6L09K52r5l27j28
4980b76K50L04n6l90j41L16K69q7l50j28K50L06l4l75j80K39L99o1l98j75K60
$$ y = [-255, -219, 120, 289, 90, -223, -242, 98, 282, 89, -222, -284, 75, 323, 96, -233, -215, 43, 251, 152, -191, -300, 23, 328, 116, -209, -230, 60, 294, 144, -140, -246, 26, 265, 201, -184, -256, 42, 270, 157, -147, -269, -28, 254, 216, -152, -315, 11, 267, 178, -135, -265, -71, 230, 224, -137, -296, -78, 265, 191, -120, -266, -70, 239, 261, -91, -308, -108, 240, 257, -103, -294, -83, 225, 276, -66, -299, -127, 223, 280, -82, -312, -126, 229, 254, -22, -282, -203, 156, 309, -2, -316, -153, 207, 248, -10, -249, -191, 162, 318, 18, -310, -181, 174, 300, 11, -257, -213, 112, 323, 74, -297, -216, 156, 313, 84, -243, -245, 119, 317, 88, -231, -231, 102, 337, 81, -305, -241, 83, 286, 136, -239, -257, 66, 322, 113, -242, -246, 72, 279, 164, -188, -298, 6, 307, 210, -201, -287, 22, 274, 179, -148, -276, -26, 278, 222, -168, -309, 7, 276, 189, -161, -289, -39, 267, 233, -142, -322, -83, 316, 255, -143, -318, -58]
5001e8K98j7l14k04J65M04Pl86k00K39K71L9k86k62J57L78N9l86k09J84L40L9
5023B58l18k55J39L94J28l73k82J57L80O7k70k90O8L56J57k88l34J05L57J45k82
5044A9k88P0L38J50k55l35Q6L58J87l04l48J09L23J88k11l50J0L55K35k18l70
5065b51k0L95J82j88l47j5K92K93k08l70pL18K21j23l67p1K99K98j51m03q2L21
5087A6L19j69l57j12K88L03p4m16j47L12L52j17l68j45K66L30n9l70j75K82L39
5108B98p8l81j65K53L88m6l77k12K50L98m0m15k21K30M25k4l69k53K20L73M0l52
5130e8k65J64M17Ol07k55J24L72P7l17k89J90L79M0l06k68J54L82N3k72l48J12
5152b15M37J22l51k66P5L65J88k75l61M9M26J46k82l27M3L41K19k69l59M0L68
$$ y = [-58, 240, 223, -91, -295, -130, 274, 281, -105, -305, -66, 205, 244, -42, -304, -147, 231, 290, -96, -305, -121, 219, 258, -60, -315, -176, 218, 346, -27, -309, -152, 228, 295, 25, -265, -197, 159, 316, 28, -306, -201, 156, 301, 19, -269, -199, 139, 289, 34, -301, -215, 143, 330, 26, -322, -213, 110, 298, 87, -263, -253, 102, 337, 119, -251, -271, 124, 306, 118, -229, -244, 48, 341, 133, -237, -244, 74, 295, 172, -195, -266, 33, 331, 180, -223, -305, 16, 335, 166, -191, -303, -15, 288, 214, -202, -349, -37, 315, 198, -170, -315, -49, 281, 222, -148, -323, -41, 298, 220, -161, -326, -73, 315, 269, -108, -320, -70, 328, 288, -127, -348, -118, 307, 283, -86, -339, -119, 254, 294, -58, -323, -159, 258, 264, -43, -298, -174, 198, 275, -42, -331, -141, 238, 278, -28, -296, -142, 240, 293, 21, -327, -215, 222, 344, -7, -273, -198, 167, 355, 80, -281, -232, 194, 340, 58, -269, -226, 115, 334, 65, -294, -254, 114]
5173A14K26k50l69J4L62K20j89l94lL59K40j87l96k8L60K50j82l72m5L04K95j37
5195A92m33q3L95K62j78l93o8L64K72j41m09o8L30L00j41m08j21L24L15q7l78
5216a54j87L47K97m9m38j31K81L33p0l72j84K60L61m6m10j71K65L74k8l85k24
5237c31K18L89J7m13k28K27L71P5l97k61K15L48Q9l70l17K27M08N9l70k91J53
5258a82M17Q1l58k93J46L89J27l48l01J49L40J56k93l72J24M31J30k97l41R1L92
5279A88J68l07l42O0L64K34k82l87N2L93J91k44l55RL79K25k34l74j9L94K39k66
5301H6l55qL76K19j54m35l1L86K32j88l75p8L68K93j57m12o5L47K72j65l88o0
5323b92L28K98j45l74j27L29L15r9m21j39K97L48j05l59j75K55L63n2m47r7K54
$$ y = [114, 340, 90, -279, -265, 97, 317, 128, -266, -269, 90, 330, 143, -253, -281, 79, 329, 147, -225, -270, 34, 329, 192, -241, -324, 71, 333, 155, -238, -306, 58, 330, 189, -220, -288, 42, 342, 201, -207, -328, -4, 311, 224, -154, -341, 6, 303, 254, -184, -315, -34, 299, 229, -143, -327, -67, 294, 248, -162, -333, -68, 306, 278, -107, -331, -113, 276, 293, -120, -348, -121, 250, 325, -72, -333, -118, 230, 319, -51, -368, -141, 267, 326, -44, -335, -182, 235, 316, -42, -335, -189, 200, 327, -21, -322, -173, 167, 323, 30, -342, -218, 213, 343, 46, -295, -204, 188, 356, 49, -293, -233, 131, 365, 83, -304, -252, 141, 332, 88, -267, -258, 121, 346, 112, -262, -281, 113, 352, 86, -269, -277, 99, 318, 164, -271, -302, 84, 316, 128, -247, -325, 43, 336, 179, -233, -298, 49, 321, 156, -232, -292, 36, 334, 189, -185, -312, 17, 332, 233, -188, -327, -30, 318, 213, -146, -321, -66, 297, 245, -202, -299, -45]
5344d5L34l5l87k14K82L94p2l94j91K49L86p0l46k30K39L85k3l48k51K17M16K8
5366C24l87k80K25L74L3l52k78J85M29N5l82k49J62L93N0l09l01J07M30Q8l37
5387b0l21J45L85J46l36l24J03M33J22l44l12R7L85J77k88l47M9M36J60l00l29
5408b83K9M20J92k90l57Q8L31K19k76l50j8L87K78k43m00qL95K05j72m14p2M13
5430G4K84k42l78l7L37K84j23m25r8L52L10j73l50j54L49L55j85l84j13L27L29
5451C39p5m86q4L23L19r5m12j83L22L56p7l88k18L13L65m8m32j81K65L79l3m09
5473a40k01K38L68L5l83k31J64M04ml02k73J96L93M3l86k33J40M31N9l51l07J67
5495a73M25P2l53l28J85M00J06l51k90J05M05J08l38k75J45L17J63k97l51J25
$$ y = [-45, 289, 254, -133, -347, -65, 329, 257, -137, -328, -79, 307, 237, -109, -339, -100, 285, 262, -86, -337, -120, 296, 324, -63, -343, -118, 256, 289, -63, -341, -156, 273, 328, -54, -303, -141, 252, 302, -7, -308, -201, 229, 317, -20, -341, -196, 189, 335, -1, -325, -222, 211, 333, -11, -323, -226, 159, 336, 48, -299, -250, 186, 346, 46, -283, -254, 166, 358, 68, -289, -201, 130, 349, 73, -277, -295, 92, 370, 127, -273, -281, 114, 319, 147, -267, -339, 74, 358, 116, -262, -299, 38, 322, 199, -226, -324, 28, 338, 165, -185, -339, 10, 365, 180, -204, -317, 10, 339, 264, -222, -306, 17, 336, 241, -171, -354, -32, 324, 247, -141, -359, -46, 319, 271, -161, -342, -77, 302, 269, -140, -341, -103, 265, 300, -83, -314, -150, 254, 250, -52, -325, -129, 264, 307, -79, -312, -172, 259, 318, -33, -340, -173, 252, 324, -29, -357, -172, 228, 334, -17, -307, -202, 203, 311, -27, -302, -157, 160, 323, 26, -325, -200]
5515b00L79J28k68l36L8M51J61l01l74P4L77K51l06m05N5L75K33k15m12J8L97
5536A20K30k16l60o0L86K83k69l73l1L94K14j64m14j8L55K77j95m08p9L68L14
5557C54j64l82j43L30L20q9m31r5K81L49r6m20j70L45L51r5m01j73K87L77p4m16
5579a55j69K91L71o8m21j94K80L67l2l91k52L01L45ll60k46K22M04J9m01k41K20
5601a13L62O0l68l15K36L94O3l21l31J73M12N1l08l11J16M09J35l31l50J21L95
5622A79J60k94l60J04M21J16k68l73Q5M06J46l08l02M2L86J85k44l60M8L64K12
5643C45k84l36lM09K13k45l78j2M10K39k31m13M0L35K48k03l72m0L69K37k09l43
5665b24l3L32K80k24l37q3L39L10k06l66j27L86K45j09l53j55L01L58j34l92j26
$$ y = [-200, 179, 307, 39, -297, -259, 192, 353, 52, -322, -248, 129, 380, 74, -331, -276, 99, 332, 117, -295, -277, 120, 350, 134, -226, -286, 100, 383, 114, -259, -290, 104, 318, 154, -260, -278, 77, 354, 159, -249, -328, 40, 354, 190, -192, -335, -5, 315, 226, -205, -300, -19, 330, 234, -186, -356, -11, 340, 245, -156, -329, -42, 335, 261, -155, -324, -33, 338, 270, -151, -345, -65, 302, 270, -121, -373, -72, 273, 270, -90, -336, -114, 290, 309, -92, -333, -113, 249, 309, -59, -374, -138, 256, 319, -2, -333, -160, 252, 303, -5, -316, -200, 209, 344, 13, -337, -216, 179, 339, 45, -315, -211, 210, 326, 58, -315, -230, 176, 322, 14, -288, -246, 140, 325, 81, -279, -231, 133, 345, 61, -275, -278, 131, 344, 99, -279, -291, 119, 358, 127, -286, -246, 89, 337, 134, -238, -278, 91, 328, 119, -224, -257, 75, 355, 131, -206, -289, 50, 360, 154, -212, -339, 47, 292, 183, -170, -325, -24, 334, 200, -192, -318]
5686c18K76L38o7m04j47K80L18n5l93j61K46M08o7l98j98K64L77l9l53k52K62
5707h3L75j0m09k42K75L63Ml54k46K14L79J6l48k46J47M26M1l48k74J58L96O5
5729B99l57k69J47M05P9l20l26J31M13J14k68l46R9L54J47k62l21Q1L66J56k65
5750E7l49Q0L64J54k26l55N5L49K12k59l59N6L34K21k31l67J0L44K25k03l58l3
5772b79L63K39k22l26r2L65K58j64l43p2K84K69j32l65p9L44K57j43l53j12L09
5793FK97j27l83q1L05K73q2l68j42K57L33o6l80j22K43L48j03l76j40K60L34p6
5815B10l73j21K12L21j2l86j72K34L51l9l31j76J81L50L7l62k44K07L43L0l54
5836i4j71J30L43R2l51k40J71L10Q4k77k91J22L70O6l01k63J12L97P8l06k70J30
$$ y = [-318, -42, 296, 229, -175, -322, -42, 276, 221, -172, -333, -87, 321, 254, -144, -342, -78, 299, 260, -93, -345, -83, 292, 282, -127, -369, -94, 269, 273, -81, -327, -113, 266, 282, -66, -312, -165, 261, 302, -46, -320, -162, 234, 299, -58, -327, -180, 225, 304, -16, -342, -211, 202, 316, 48, -298, -199, 155, 302, 40, -281, -200, 166, 322, 57, -292, -212, 152, 306, 80, -275, -220, 129, 341, 82, -277, -221, 113, 334, 103, -264, -254, 90, 315, 112, -246, -279, 84, 323, 101, -225, -317, 48, 306, 142, -201, -273, 11, 280, 148, -217, -296, 48, 305, 162, -191, -303, 6, 303, 176, -207, -288, 17, 290, 208, -160, -302, -45, 288, 222, -158, -280, -37, 311, 208, -168, -308, -48, 286, 210, -163, -284, -72, 249, 237, -149, -321, -87, 264, 225, -106, -282, -101, 249, 286, -76, -320, -113, 230, 260, -94, -265, -135, 208, 300, -51, -291, -120, 190, 274, -3, -294, -172, 198, 264, -37, -300, -188, 209, 287, -19, -289, -159]
5858a59L15J30k51l63J07L63J49k36l44M7M02J59k80l06N0L71J76k55l13J6L40
5879A18J74k15l20K1L36K07k31l34ML39J99j94l30k7L17K46j68l65n0L26K65j83
5901A35l42m0K56K42j11l31q8L08K52j41l24o1K58K57j05l19j01K28L01p0l14
5922a10j55K41L38j16k88j67K09L13m1l48j38K08K78l7k86j56J80K81J3k90k14
5943b85J97L27nl10j75J20L12O2k90k26J74K96P1l19j90J16L05O0k57k59J09L56
5965A89O6k60k33R0L22R7k73k51J01L11J04k13l21J16K87J16k50k33M6L16J31
5986B58k50k65N8L15J30j99k75N0K71J39j36l17QL26J11k05j98m4K60K18j69k83
6008a97j8L11J70j64k92k5K61J94j13l00m8K20K67j31k89m6K13K30j03k87p4K23
$$ y = [-159, 156, 286, 35, -328, -221, 142, 291, 55, -289, -242, 160, 319, 39, -267, -217, 154, 330, 75, -238, -222, 118, 292, 77, -243, -222, 114, 321, 90, -244, -240, 99, 298, 104, -226, -253, 64, 310, 142, -223, -273, 53, 318, 135, -207, -247, 9, 251, 140, -191, -279, 29, 281, 140, -184, -245, 13, 270, 165, -154, -255, -27, 274, 204, -110, -265, -24, 314, 198, -90, -257, -48, 265, 224, -124, -262, -54, 224, 187, -99, -255, -75, 206, 219, -71, -285, -88, 239, 234, -76, -251, -131, 181, 243, -47, -273, -99, 197, 268, -51, -241, -125, 180, 240, -17, -276, -167, 189, 255, -5, -238, -148, 174, 271, -2, -253, -152, 159, 263, 50, -271, -155, 132, 248, -2, -235, -189, 127, 258, 8, -257, -199, 116, 246, 47, -228, -178, 93, 232, 96, -221, -213, 113, 224, 19, -179, -223, 37, 255, 86, -197, -215, 96, 266, 102, -190, -215, 46, 240, 127, -173, -221, -1, 266, 135, -154, -200, 13, 243, 140, -147, -221, 2]
6030BK22q6l00r9K43K35o4k57j38K18K59n5l15j10K07K72n4k61j85K12K52J6k85
6053g1j77J74K89l7k50j36J52K40J1k92j29J17L05K6k87j61J35K44K0j62k70J51
6075a08K79L6k55j89J22K43Q1j92k26O9K59J13k26k47R4K73O8j61k00K4K38J29
6097B24j70k64P4K29J34j87k02K1K30J23j65k33KK56J28j65j92LJ73K10j33k29
6119a33m5K12J60j05k42k9K42J22q1k11q6K16K07j08k66j4J96J68p0k22j11K11
6141A1K03m5l05o4J95J83m7k23j05J57K30o1k34j10K05J88n5k13r4J50K00j2k47
6164i3j18J60K05mk49q9J44J76K0j78j48R2K54L1k34j50J13K14M0j66j95N9K72
6187A56N1k44j48J00K13K0j64j47N1K24Q8j99j80P6K07O3j62j64J9K02J14j42
$$ y = [2, 224, 138, -162, -261, -18, 217, 153, -104, -242, -24, 235, 180, -135, -245, -38, 234, 180, -81, -266, -54, 198, 214, -71, -248, -74, 215, 178, -72, -208, -56, 184, 195, -97, -226, -109, 196, 222, -65, -226, -91, 153, 173, 11, -259, -108, 171, 207, -48, -237, -115, 128, 209, 17, -209, -140, 119, 232, 6, -241, -147, 126, 194, 33, -167, -143, 95, 224, 54, -210, -136, 93, 227, 40, -162, -141, 89, 212, 47, -186, -184, 72, 200, 35, -157, -154, 19, 229, 96, -133, -178, 34, 194, 89, -153, -182, 60, 182, 101, -110, -196, 20, 227, 119, -147, -161, 35, 203, 133, -89, -200, 11, 214, 169, -136, -200, -5, 178, 131, -92, -197, -40, 190, 129, -105, -215, -10, 178, 123, -90, -184, -34, 166, 154, -93, -211, -51, 154, 150, -99, -188, -44, 132, 152, -26, -174, -82, 172, 203, -31, -181, -68, 146, 186, 20, -175, -116, 156, 207, -37, -185, -85, 128, 148, -16, -163, -112, 112, 200, 1, -179, -103, 104, 167, 5, -159, -140, 62, 176, 34]
6209C4j98K6K28J05j70j67K6J69J39j35k11NK26J28j50k01J6J70J37r7k11m2K21
6232D8J48j25k29M1J52J28p3j93q7J60K14j17k02k8J93J13m8j60p7J14K06n3k37
6255a12m6J56J66q9j32r4J52J45j6j71j11J51J35m1j80p0J20J62j9j42j20J25
6277c1J99m7j84n6O7J59M2j79j23O7K21qj71j23J19J32N6j50j61R0J88M4j84j41
6301a74R4J75L6j41j16J0K18M6j30j77O9J99K8j24j28L6J45R2j23j81L0J94O7
6324A45j52j40L6J60P1p3j46k2J56J13j09j47L3R3R8n6j84k1J69J25p3j45l4J35
6348C2R7n1j68k7J06J69l3k11l2J26J19o0j42n8J15J44m7j64o8J35J45n2j45m1
6372a11O6J63mj79q7J41J18j7j38o5R2J27J2j44q1L4J83jj52p0Q2J57j9j38j20
$$ y = [34, -164, -138, 90, 195, 25, -142, -116, 53, 192, 57, -154, -149, 77, 205, 55, -146, -130, 40, 177, 80, -131, -173, 48, 196, 71, -158, -117, 35, 163, 90, -103, -190, -30, 184, 67, -135, -163, 30, 143, 95, -65, -142, -28, 178, 125, -112, -158, -2, 164, 75, -57, -151, 1, 146, 130, -41, -152, -1, 134, 93, -87, -157, -37, 125, 106, -36, -156, -31, 168, 121, -63, -119, -52, 107, 149, -30, -153, -86, 135, 127, -44, -167, -48, 84, 140, -10, -171, -81, 107, 151, -33, -174, -80, 95, 131, -10, -126, -116, 102, 148, 18, -159, -90, 109, 137, 13, -115, -79, 66, 158, 35, -146, -116, 78, 145, -7, -147, -111, 49, 120, 47, -99, -121, 35, 148, 39, -108, -75, 18, 116, 60, -124, -145, 24, 149, 76, -69, -103, 32, 129, 78, -90, -117, -11, 158, 125, -86, -118, 8, 127, 67, -75, -133, -18, 126, 79, -85, -153, -18, 127, 75, -70, -111, -45, 118, 114, -65, -152, -11, 107, 90, -48, -113, -21, 106, 118, -26, -107, -73, 110, 109, -43, -113, -31, 126, 107, -31, -151]
6397a51O2K21J5j72p1Q0J06j4l1j47J8J89K0j40j05N3J49K6j06r4OJ21R8j05j33
6422a05J3J61K1q9r1OJ08R0p0j28j5J45P3o4j27K0P5O8k3j45m1J61R3r1j29PQ9
6449A2Q6l8j39o2J29J46p5j51j4J04J14m3j36n4O7J61m1j46k6J20Q2j2j23m6R0
6474EO9K5j20j18J54J02n8r0n0O1J07K3j24j20J11J30j0j19m8N6Q2K5r9j47Q0
6499g3J59Nj19n0L0P6P6q8j22L1J56N3j80n6L0J21O4j03r2j6J59R1j39j18Q3P6
6525E4N0m0j25l9J36N4n9j39J0J17Q1q4o4k9N7J29l1j93J6J06J20q9j11k6R7O2
6551F0J7r3j08J30J12p3j00lP3N7K1r9p6O1J47n4j12o1R9P5np5p0N4J28oj59k9
6579h9P6Q9n3n5q8N9J00M4j25o6Q7J01kr9k8J7J17Pj17j09N5J68k3r1k3K7O6P5
$$ y = [-151, -89, 132, 147, -25, -96, -16, 90, 76, 45, -102, -84, 105, 125, -15, -120, -67, 82, 108, 2, -92, -86, 35, 133, 28, -105, -92, 69, 90, 1, -90, -84, 24, 114, 44, -84, -99, 46, 119, 55, -72, -52, 23, 91, 68, -77, -118, 43, 136, 45, -84, -77, 12, 98, 60, -79, -141, -12, 134, 59, -92, -106, -2, 112, 69, -67, -121, -54, 107, 66, -80, -106, 14, 96, 84, -39, -85, 5, 74, 99, -21, -139, 15, 117, 59, -31, -81, -20, 87, 110, -14, -134, -23, 107, 97, -22, -70, -14, 68, 93, -6, -153, -73, 86, 91, -28, -78, -48, 28, 104, 16, -106, -75, 81, 134, -46, -102, -72, 49, 113, 10, -82, -98, 61, 152, 13, -105, -22, 54, 104, 64, -61, -100, 36, 90, 31, -108, -98, 19, 100, 16, -48, -77, -20, 109, 78, -115, -99, 7, 127, 38, -73, -99, -2, 60, 77, -16, -124, 6, 118, 45, -55, -58, 15, 72, 93, -6, -82, -21, 126, 72, -40, -101, -2, 73, 68, -7, -77, -23, 105, 99, -60, -89, -13, 76, 23, -32, -120, -61, 39, 83, -42, -108, -21, 80, 78, -21, -49, -32, 85, 92, -25, -134, -79, 89, 66, -25, -48, -21, 45, 120]
6607A20m3j70QJ48K4j24n7N9O6L7j3r7l8Q9Q5r9p6M7N8L6j7j00j9J07R3r0j32
6634i8N2P2N5l8p8o9R7J38o2j66j7J61M6q1j4o7O5J06m3j33l4J36P6n3j04KK5
6661b6J37m1j31o2Q7J36o0j01j5N3O8M5j09r6Q1J57m3j16l0L0P7K9m1q8J7Q5O2
6688A05j36p4P8O0K5n6p9RJ20Q5j18j07J5J10L3p7n1rM6J38p6j54N1J14K2m4r7
6715f7qP5J15q9q1l3J69L1j14p2L9L9O6k2j02j1J04P7q0j07j0R4P3j1r9p0P5J56
6743A37p5j65M4O2L5j6l3r3O4J32pj44m8R7O8l7o1k5J9J17L7j42o4R8P6k8n8p0
6771h0K6R5M7q6r6O8J30mj19l5M0P3M8p8j30O6J23J9j38n2M3Q7Rm7q3k1J44P0
6799A19j13r8L4P7N8p2n3m5J20J01j08j19N2J26J8o4j08mJ09Q7q5j06K5Q8N7p3
$$ y = [120, 77, -93, -85, 63, 87, -37, -94, -35, 31, 68, 55, -42, -80, 9, 94, -5, -81, -34, 24, 60, 43, -57, -76, 31, 124, 34, -98, -46, 26, 81, 43, -35, -104, -7, 131, 69, -97, -114, 47, 93, 12, -2, -69, -4, 102, 59, -74, -108, 28, 104, 51, -53, -51, -26, 111, 70, -61, -123, -36, 100, 40, -61, -76, -23, 45, 90, -19, -115, -34, 123, 80, -36, -66, -36, 41, 70, 29, -59, -42, 43, 105, -31, -105, -27, 33, 58, 2, -77, -68, 52, 137, 19, -88, -73, 37, 70, -7, -58, -67, -21, 117, 41, -113, -62, 52, 74, 30, -67, -75, 0, 115, 26, -55, -88, 81, 112, -2, -74, -35, 4, 70, 48, -54, -65, 39, 116, 36, -71, -81, 13, 86, 75, -24, -94, -19, 137, 62, -103, -59, 3, 38, 22, -11, -104, -40, 92, 85, -59, -107, -10, 58, 21, -40, -65, -46, 71, 108, -34, -98, 0, 76, 48, -10, -80, -54, 41, 88, 2, -94, -26, 104, 100, -19, -54, -14, 59, 107, 29, -101, -35, 88, 107, -31, -83, -40, 47, 56, 9, -74, -95, 49, 119, 6, -92, -58, 19, 77, 5, -48, -93, 27, 128, 20, -99, -47, 79, 97, 33, -75, -79, 30, 117, 32, -74, -49, 39, 96, 23]
6825B3q7J4O9J08o6j38NJ34K0o2r4LO1R9l9j15m9J18J08n5j19j2O1P7Nj07q0P2
6853d6J82o5j44k7R7R9l9o1j22P8J78j9j35j00J32O5j2o6q5K4J55J0j25r7O8J49
6879I4k1j02p3L1J29N1j24j17N2J75%j36j0mR4R6q8j43J8J56P3j58p2N5Q9K7o0
6906C2j38K4J79L3j29r9O5R8L0q3q8j9J08J03o8j72N6J00L7l2r6m8J08J27r0j50
6932a12J8J27P0q7q9MJ00P6k7j51n8J51J05r9j07LP0J12oj38q0J34J16o8j54Q
6958h2J09N1nq6j23R5J58o3j12m2R8Q8J5j34r6Q7J31Nj44r4J23J55r1n7p8J8J71
6985I7L7j37j20R5J49j0j38n4N4R9K9q2j44J15J12j0j14p4O2J00J0j01q7L4J69
7010I1M9j84p8R3Q9L3r4j11pJ89P0j34j20L1J53K6n5j12rJ34P7p1j78L2J69L8
$$ y = [23, -64, -50, 19, 127, 61, -77, -72, 62, 82, 20, -74, -71, -10, 89, 50, -65, -114, 4, 112, 57, -62, -74, -13, 64, 69, -38, -118, -46, 136, 71, -73, -100, -3, 96, 57, -4, -126, -48, 130, 111, -24, -124, 8, 73, 61, -5, -90, -66, 89, 99, -26, -123, -55, 94, 73, -29, -102, -71, 58, 109, -15, -132, -80, 95, 95, -41, -51, -55, 39, 135, 47, -96, -78, 78, 151, -7, -79, -24, 65, 92, 32, -106, -82, 97, 130, 1, -98, -33, 65, 95, 12, -76, -95, 13, 116, 48, -124, -68, 32, 69, 37, -59, -107, 1, 128, 38, -112, -94, 33, 103, 16, -73, -69, 31, 107, 80, -71, -129, 22, 127, 28, -79, -76, -6, 106, 100, -38, -118, 16, 132, 64, -90, -82, 27, 78, 73, -13, -136, -41, 117, 54, -58, -100, -2, 86, 101, -33, -129, -42, 89, 94, -50, -144, -21, 134, 43, -14, -92, -74, 97, 134, -3, -123, -28, 121, 111, -27, -81, -27, 72, 101, 19, -125, -10, 102, 92, -22, -96, -34, 66, 76, -25, -112, -78, 91, 140, -44, -122, -29, 60, 93, -1, -112, -119, 70, 140, 6, -114, -83, 70, 96, 41, -71, -80, 54, 131, 60, -118, -86, 83, 121]
7036A21q1j32K2J07J23j07j29m0J49R0q7j06k6J01R9j7j80n9J70J28r9j15j3O8
7060a3J05j7j69l2J05J56k8j95kJ42N2k0j25q3P5J98n1j82j8J24R5k8j23o8O8
7085c4J40pj51r4J35J25q0r1m6N6J52Qj89o8J17J13oj36o8P3J19K5j07j07M1K07
7111A27jj82n0N1J14M0r9j48N7J66N7j61p6O1J22K7o9j29j9J65Q1j69q5K2J80
7136H2K3r3j11RJ46Q2r3j86N0J59O0r9j10l1J58J01j12j66M2J78P4j35j25jJ27
7161B9R2l6j81n6J99J46j52j20j7J26P7m8j70l2J34J51n4k00j6J38R1m4j27o4
7185a34J02J80l7k24l8J49J45n5j29p9O5K03j5k11o7J41J51j2j66p8O0J59L8j93
7209d5q1J00J64j7j74m5N7J32K9j16k00J39J83j1j74j05Q8J68K2j44j33N4K02
$$ y = [121, 40, -92, -70, 37, 160, 53, -76, -116, 33, 123, 36, -70, -96, 5, 104, 87, -93, -152, 18, 146, 47, -68, -81, -13, 92, 75, -94, -126, -21, 135, 107, -88, -90, 52, 104, 84, -41, -124, -49, 149, 98, -84, -102, 22, 117, 89, -34, -102, -34, 106, 99, -52, -146, -11, 114, 34, -57, -103, -47, 105, 113, -76, -144, -27, 86, 80, -56, -124, -51, 68, 93, -14, -121, -80, 127, 126, -56, -106, -55, 59, 99, 0, -148, -91, 75, 132, -29, -105, -44, 78, 105, 36, -93, -112, 53, 134, -35, -120, -98, 82, 105, 12, -99, -90, 56, 138, 45, -141, -91, 68, 128, 29, -81, -112, 46, 147, 35, -131, -89, 89, 163, 28, -97, -98, 29, 121, 85, -96, -152, 47, 193, 41, -79, -96, 30, 107, 59, -111, -143, -9, 142, 88, -112, -128, 10, 101, 57, -70, -134, -32, 148, 111, -113, -151, -2, 143, 88, -41, -120, -55, 148, 133, -78, -145, -4, 147, 135, -31, -109, -49, 110, 148, -45, -126, -26, 138, 121, -53, -98, -41, 91, 120, 4, -196, -57, 126, 115, -59, -164, -76, 92, 114, -30, -163, -109, 93]
7232I3M3j64j30J06J72Qj35j24N1J82O7j71j37Q0J64L0j06j45K4J82P9j54j77
7255a62Q4K01lj08j43K9J59J15j51k00O1K09O0j37j53L7J37Q0n1j85m1K15J17
7278A70j62j41L4J49R4o4j65m5J61J29j13j66J4J52J05q6j62k1J22J75o7k26p5
7301a88K03J44m9j97q0J36J90n5j95j03K06J46q2j67q1J55J48Mk13j04J81J82
7323A81m4k06j01J58J25J0j57j25J16K30o8j60j08J30J56Oj57j23R4J81K8k10
7345d4j13R3K16j9j76j04M3J90P4j63j83J24J62O4j85j51M3K03O1j20j85O2K36
7368A28N1j63j43N3J52J19j89j32NK17O8j34k03Q8J62P0n6k27J7J95R3j21j89
7391a39J0J76J02j14j75m2K23J39j30k33K1K30Q8r8j67l8J41K04j09j99l6J67
$$ y = [93, 136, -28, -158, -52, 120, 128, -7, -131, -80, 102, 169, -2, -139, -59, 105, 135, 29, -116, -92, 90, 169, 15, -162, -78, 123, 120, 12, -131, -102, 57, 172, 21, -179, -118, 91, 151, 14, -139, -102, 35, 115, 64, -121, -162, 53, 170, 8, -133, -99, 50, 144, 80, -85, -130, 31, 160, 47, -119, -105, 47, 152, 66, -96, -117, 5, 180, 113, -113, -188, 15, 159, 110, -87, -167, -31, 159, 104, -91, -194, 12, 158, 76, -91, -172, -17, 131, 135, -78, -182, -1, 181, 137, -69, -170, -12, 113, 123, -34, -159, -43, 187, 119, -41, -149, -19, 137, 143, -14, -137, -43, 138, 166, -44, -157, -64, 152, 133, -43, -147, -104, 86, 160, -3, -186, -62, 100, 164, -21, -172, -129, 74, 135, 15, -170, -108, 128, 179, 16, -127, -74, 78, 197, 8, -124, -119, 98, 166, 32, -171, -83, 79, 149, 93, -134, -117, 78, 171, 50, -139, -129, 47, 149, 35, -140, -182, 41, 180, 50, -183, -162, 68, 156, 58, -109, -147, -6, 198, 89, -110, -146, 21]
7413B1J51p4j93m7J46J67l4k58m7J86J83j20j73n0J68J32n1j64j18J45J90n2j94
7436h6m9Q0J86lj69j38J30K22l7k17r5J59J50k1j56j39J20K09L7k16j56J42K05
7459A58Rj76j48O3K38M0k00j72J19K06K6j73j66Q1K14Q0k05j95J14K21J1j59j59
7482a73P2J76Q1j20k10O1J97J01j69j59M6J77J00j43j80J7K33J06j84j87L9K30
7504A11Q3j32j86jJ64J55j26k33J9K06J39j06k29k4J81J46q9k38%K08J23j31j77
7527a37k1K08J13o3k18o9K01J76q8j97p1J88J39l9k12q9J80J94p7k16o7J66J71
7550A72m6k05r9J54J89m0k24q3J75J64l9k04q4J18K26m6k12r8J53J76j7j91j31
7573a92J40K01J5j89j76J33K05N1k28j12R2K16K7k03j63J09K42l2j69j48J05K14
$$ y = [21, 172, 98, -95, -142, 4, 171, 137, -121, -168, 18, 201, 81, -92, -142, 26, 158, 107, -57, -175, -30, 160, 108, -86, -135, -55, 131, 128, -41, -179, -49, 173, 136, -81, -176, -17, 133, 112, -44, -183, -63, 146, 183, -33, -189, -47, 158, 167, -9, -157, -94, 144, 184, -16, -188, -69, 137, 163, -10, -176, -95, 119, 199, -6, -201, -87, 134, 145, -14, -173, -101, 75, 156, 36, -174, -113, 84, 185, 16, -143, -97, 80, 180, 37, -143, -126, 107, 213, 29, -158, -119, 111, 194, 62, -124, -125, 39, 194, 68, -165, -146, 60, 199, 93, -136, -160, 21, 167, 78, -160, -160, 48, 171, 40, -137, -158, 50, 163, 100, -118, -187, 14, 190, 102, -95, -166, 22, 161, 122, -90, -179, 1, 195, 118, -98, -165, 1, 172, 126, -79, -178, -24, 165, 125, -99, -182, -7, 157, 118, -86, -170, -52, 174, 128, -84, -182, -29, 147, 130, -61, -192, -52, 149, 164, -25, -201, -68, 137, 188, -40, -152, -60, 156, 183, -20, -183, -74, 168, 136, -33, -181, -76, 138]
7595A38L3j89j78P7K42N5k03j76R2K31K6j67j65O8K37O1j72j98R2K44Pj55j81
7618a81N1K26J07j41k59P2K37P7j52j99L9K04J27j61k13L4J97J12r0k40NK11J14
7641A77p9k43jJ83J86j64j90j0K26Q9q3k15m9J89J69r6k24k9J87J79r6k00q6J69
7665a1J96n5k66m8K04J81q0k02j21K20J68n3k16j19K14J66k4k13r6J26J92kk28
7688f7j25J52K00j7k09r9J28J78K7k42j06J39J79J0k19j10J48J98mk06j40R6K48
7711A59Mj87j43J28J86M4j83j87J03K09N3k01j57P7K14O2j78k00Q0K44M5j56j73
7734a57J5K36P1j72j51K7K15Q7j55k14Q1K11P5j44k07M7K25J26j83k12M6K09J40
7757B16j30k59J6K27J31j31k21J1K22J29j49k09k4K43J11j08j90n9K08J92j42
$$ y = [138, 171, -18, -196, -119, 123, 178, -25, -201, -109, 122, 148, -19, -184, -116, 121, 182, 10, -188, -96, 148, 155, 0, -181, -130, 96, 203, 62, -197, -125, 112, 189, 37, -162, -123, 81, 208, 47, -166, -132, 65, 177, 87, -153, -148, 63, 177, 98, -145, -146, 37, 223, 59, -131, -141, 85, 174, 91, -124, -173, 16, 185, 89, -135, -164, 23, 202, 106, -94, -180, -11, 185, 130, -136, -184, 20, 201, 121, -81, -202, 18, 186, 133, -83, -202, 12, 178, 154, -59, -155, -29, 163, 161, -67, -192, -40, 160, 143, -66, -165, -37, 141, 168, -74, -180, -41, 138, 148, -71, -181, -33, 165, 161, -45, -185, -89, 159, 163, -24, -167, -39, 147, 191, 8, -179, -76, 133, 186, -15, -172, -95, 119, 181, 3, -197, -117, 127, 172, 16, -157, -142, 94, 165, -7, -158, -131, 84, 171, 16, -198, -117, 94, 169, 25, -182, -135, 90, 216, 33, -179, -133, 76, 216, 86, -173, -157, 70, 201, 70, -151, -140, 82, 211, 62, -147, -171, 72, 183, 75, -115, -174, 34, 226, 84]
7778H4k34l0K19J45p1k37l1J57J64m7k47m7J48K05q4j95o2J52J75l1k45m9J58
7801cJ93m9k28q6J68J79l8k04j38J82J79%k66p7J68J66ok14r8J12K06Pk42j02
7825a91R6K59k9j73j27Q2K37K4k27j58J45K27J6k17j41J07J97M6j99j31R0K00
7847A33N9j96j65P7K21N5j60j91N6K06P8j73j67M2K31M8j51j52K0K40O8j75j77
7870a73N0K33N0j27j81J3K14J30j50j88J3J74J05q0k38J9K12J04q6k15K1J57J30
7893A87j03j69m7J61J64j10k29k5J86J61j02j86o4J83J29n6j83q8J97J67q5k27
7915a39l9J69J77m3k05r9K11J82q9k04j02J94J58m8k25q5J75J71k3j85r7J02J95
7938A51lk28j13J30J90J3k09j27J44J82K3k05j39J21J88J2j67j48Q9K59K4k30
$$ y = [84, -150, -180, 39, 184, 113, -124, -155, 2, 166, 119, -128, -175, -27, 178, 94, -101, -163, -11, 164, 133, -112, -161, -3, 190, 141, -87, -173, -5, 174, 136, -68, -206, -24, 155, 155, -111, -188, -20, 146, 140, -74, -172, -60, 146, 153, -89, -191, -95, 164, 135, -38, -165, -83, 154, 178, -49, -207, -62, 165, 181, -36, -177, -70, 127, 173, -26, -157, -67, 133, 192, -4, -169, -92, 129, 184, 24, -167, -111, 95, 173, 0, -167, -125, 106, 154, 3, -149, -129, 111, 179, 4, -173, -123, 110, 160, 33, -148, -135, 79, 209, 59, -129, -116, 58, 163, 83, -155, -136, 76, 180, 94, -121, -100, 57, 187, 84, -85, -132, 29, 193, 83, -146, -171, 15, 176, 74, -112, -176, 7, 136, 80, -103, -191, 6, 173, 88, -139, -178, -9, 168, 125, -80, -179, 32, 214, 125, -79, -181, 13, 171, 123, -102, -187, -12, 159, 136, -49, -146, -44, 151, 148, -80, -193, -63, 127, 140, -69, -196, -52, 130, 153, -52, -191, -70, 118, 130, -37, -185, -96, 163, 187, -43]
7960d3j36R4K21K1j77j70J00K18O3j88j63P0K22N4j93j19NK24R0j82j72O2J81
7983H2P8j54j67L3K18Q5j49j61K5J96R6j50j75rK41Q5j44j75J8J88J20j34j98
8006a51K3J92J17j11j79j6J88J15j35j52m7J70J69j14k07J2J65J29p7j82o9J89
8028B9J38o7j91n1J54J57o7k10m9J64J40p4j45p8J35J84q7j27p8J02J58m0j68
8051g1o8J37J51k6j85r3J31J56J4j96j17J46J73j1j90j28J32J94k2j87j00J15
8073d5J84j1j94j30J51J43L8j69j33Q9J94K6j75j12L8K25L0j20k08J18J59O1j39
8096B0j74N8K06N6j70j35J8K22M8j39j35RK04Q6j49j87O5K04M1j19j82PJ98R6
8120A48j20j47%J90R8j67j25j7J98Q8q5j92L0J69P6p1j65j4J53J29j00j65l7J98
$$ y = [-43, -179, -85, 136, 157, -20, -190, -90, 128, 191, 3, -160, -90, 132, 186, -7, -126, -121, 103, 193, 11, -161, -99, 82, 160, 6, -161, -128, 90, 175, 26, -135, -110, 86, 182, 32, -143, -152, 89, 174, 30, -145, -127, 61, 181, 47, -151, -128, 64, 181, 70, -109, -125, 63, 178, 43, -109, -156, 14, 183, 69, -138, -126, 39, 168, 91, -91, -160, 29, 167, 100, -91, -142, 12, 169, 102, -108, -157, 7, 147, 73, -72, -150, -15, 169, 82, -45, -123, -21, 137, 97, -71, -139, -2, 149, 123, -62, -155, -24, 132, 146, -50, -167, -21, 152, 141, -49, -177, -45, 149, 127, -60, -160, -45, 139, 128, -66, -196, -45, 98, 136, -33, -166, -77, 117, 143, -32, -144, -106, 119, 149, 29, -179, -61, 98, 159, 20, -154, -96, 110, 166, -4, -139, -121, 101, 149, 10, -125, -116, 88, 174, 25, -162, -97, 107, 148, 29, -153, -146, 52, 148, 28, -119, -119, 71, 169, 2, -123, -140, 58, 146, 61, -131, -101, 68, 144, 73, -92, -106, 47, 176, 76, -89, -126, 72]
8144G2P8o6j64q0J72J49r1j75j5J34J53o1j78k7P6J68o9j50p9J18J54l4j94l8
8168a47J49J46o6j69n5J31J65m8j44q5Q4J72mj61q2J17J24K8j78j21J04J63K8
$$ y = [72, 150, 84, -80, -160, 12, 161, 70, -105, -120, 14, 167, 106, -72, -99, -23, 145, 76, -74, -153, -35, 119, 85, -109, -147, 2, 148, 82, -87, -142, -11, 154, 106, -38, -123, -39, 133, 129, -32, -114, 3, 127, 155, -23, -144, -40, 123, 151]
8191A51
$$ Imaginary data points
##PAGE= N=2
##DATA TABLE= (X++(I..I)), XYDATA
0@%%%%%%%%qJ6j6J6k4L2m0M8n6P2r1J15j40J64j95K35k78L24l77M38n05N80o68
31c58P65q69R87j118J260j419J594j783J992k222K471k743L043l369L724m113
47b158M539n003N511o071O688p368Q123q967R914j0982J2198j3600J5237j7175
61i114J9511k2394K6058l0894L7602m7602O4294r8928K90112m36370k31002O42927
73B04200k09375J15395M2611m38666R0004M23367j30087j02662m4351o6398R5483
84b0479K04029n8502l10538l8301L95723O0957k79636j38238O6690K43582J04173
95B29460l00799j50215J52861J47729P0922q3985j77263l9959J49455K45765q8837
106A55134l63697R220K58308R0726n5845k22291o7393K59369J10413j31073j50768
$$ y = [0, 0, 0, 0, 0, 0, 0, 0, 0, -8, 8, -8, 8, -16, 16, -24, 24, -32, 40, -51, 64, -76, 88, -107, 128, -150, 174, -203, 235, -270, 310, -358, 407, -462, 525, -593, 667, -752, 842, -941, 1051, -1171, 1300, -1443, 1600, -1769, 1955, -2158, 2381, -2622, 2889, -3182, 3506, -3862, 4261, -4706, 5208, -5774, 6424, -7176, 8061, -9114, 10397, -11997, 14061, -16833, 20769, -26833, 37461, -61467, 228645, -207725, -438727, 204200, -5175, 110220, 152831, -285835, -195831, 227536, 97449, -5213, -49564, -115962, -20479, 183550, 125048, -185490, -223791, 171932, 232889, -46747, -184985, -118295, 125287, 229460, -71339, -221554, -68693, 79036, 149958, 65973, -111290, -151249, -1794, 243971, 155134, -208563, -199343, 58965, 149691, 93846, -128445, -195838, 63531, 173944, 42871, -107897]
117a07897j3727J98535K9287j14694J9188j43238K7169L79526j50443l68469J47046
128i7717J41461N8014M2355k93776p5862L06461P5315p9340j21363j19876J69424
139E096J48238q9540q7337j13997L1457K42483j778k13849o8793J14897J82630
150A49507l1609k25530k1231J49632Q0605j5320j31651r7228J22462J61847m1633
161I9851j68144o5615Q4752J32732M8212j58315j54578J29129J87033j511j41713
172h167j47984J00285K03560p4992j23212j8966l5959J59917J22374k35828q7994
183a46966J59890L5808L4228l7762j90505N7719K05758j4191j11753r1806Q249
194i1331J78003N5819j75950r6412P6188R7569M8382n6710j41979K095J94115
$$ y = [-107897, -121624, 76911, 106198, -8496, 10692, -132546, -105377, 274149, 123706, -244763, -97717, 43744, 101758, 144113, -149663, -225525, 80936, 156251, 76911, -44452, -164328, 5096, 153334, 63794, -23543, -137540, -106083, 136400, 134622, -79227, -148020, -33123, 149507, 117898, -107632, -128863, 20769, 101374, 86054, -45597, -142825, -20363, 141484, 99851, -68293, -133908, -49156, 83576, 131788, -26527, -181105, -51976, 135057, 133546, -8167, -156151, -55866, 147694, 72702, -50510, -69476, -105435, 54482, 176856, -58972, -146966, 12924, 48732, 82960, 45198, -145307, -87588, 118170, 103979, -7774, -99580, -91331, 86672, 142491, -33459, -129871, -53683, 43886, 92268, 35558, -106421, -104326, 89789]
205H9789N2443j57170o9445L5823N4672J01530m8926j96780K8379J92237K2931
216A05483r8328q5216j3659J28905R2671j13117j14137K9632Q6656Q9263l5451
227G2702j74810o702J71188K8889p9683n9831o3299Q9992J67665r2386j69918
238a16193N5729J05022L3242j5298j17189n7405J25090Q4414o0467r2470m5445
249a00970Q7256J31725n6329j43045L306Q3411O3572Q039j16413q1537J26122
260E137J13029p5695r7346j1338M5582Q2312J1306j17221o8670R8312J08286k9044
272F4650j01429m4986O8149J01505j7875j11899m4301N6290R1128K1199j15606
283c3175p6614J00466Q9114l3324n9336n5134J3044J19529L1221j26503o0763
$$ y = [89789, 142232, -14938, -84383, -48560, 6112, 107642, 58716, -138064, -109685, 82552, 105483, 7155, -78061, -91720, 37185, 129856, 16739, -97398, -67766, 18890, 108153, 72702, -102108, -108810, 62378, 91267, 11584, -48247, -111546, -21554, 146111, 53725, -116193, -60464, 44558, 77800, 62502, -54687, -112092, 12998, 97412, 36945, -55525, -100970, -13714, 118011, 61682, -81363, -78057, 5354, 68926, 76965, -39448, -120985, 5137, 118166, 42471, -54875, -66213, -20631, 61681, 72987, -44234, -112904, -14592, 93694, 64650, -36779, -81765, -13616, 87889, 70014, -41885, -86186, -29896, 61232, 82431, -33175, -109789, -9323, 79791, 46467, -12869, -68003, -54959, 64570, 95791, -30712, -91475]
294i1475Q1301P4006m851o4127p2600K5343J07372J7629r3911o0705L9951R9637
306E7570L3576j01832p2609O3527O9270R959m5571r6078J0405J36116J8354j08721
318b6034l8992L3412N3841N3952n0600j11694K3799J18754K2537p5041o7268J0714
330e2620R3105M3172q3300p2488K2643O5025N4957m2485j09220K1349J15620J0693
342F6451n6772m1697k8573O1955R0717o4233j12198K9375Q5504K7752l1266p4768
354d7753k1139Q6254N7877n1326p3967j2089P1403P2662m6366r4235P127O8571
366A7019L4222j5064p1367n0294P9733R0765n5346q4980J1162M8067M8319P432
378E9668q9390n3378Q3875O9786l8181o8179k8313N2013P6906k2006p9954j6743
$$ y = [-91475, -10174, 63832, 58981, -5146, -77746, -52403, 54969, 72598, -21313, -82018, -42067, 57570, 91146, -10686, -83295, -19768, 49502, 59461, 13890, -82188, -71783, 64333, 82687, -26034, -65026, -31614, 22227, 76179, 25579, -86115, -62316, 56438, 78975, 3934, -63334, -52620, 40485, 83657, 357, -72131, -49488, 15537, 70494, 28009, -81211, -59862, 55758, 66451, 9679, -32018, -60591, 1364, 92081, 27848, -84350, -54975, 30529, 58281, 27015, -47753, -68892, 17362, 75239, 23913, -50054, -62143, 9260, 81922, 35556, -58679, -51552, 17019, 51241, 36177, -35190, -85484, -5751, 85014, 29668, -55312, -44150, 3917, 52236, 59668, -29722, -83100, 775, 70561, 32380, -35799, -64112, -12099, 64807, 42801, -37153, -53896]
390e3896M1881N5574J3674p8521n6311P5537P0047l6900m7427k6647M483Q4496
402D5990K5522j11357m0616P9198M6322l206m5534n9383M0791Q0251j0198n8004
414a0224m3881J5342Q2894J7769q2881l9670M3076N0619J3755m2838o2405J6746
426d1698Q9582J3440q3677k8297M2695L2149K3927l1720p9994K1160Q5883K730
438D6180n2062m5081O268Q0190K9295p0738l9674K3679L7929L5767l0688p7992
450e6927J4873P7350K006l6932k0491k3352M1204P1206n2999q0522L6408N5731
462B7555J4449k3830o5196R464P5373M83l3241k8012l0772N5934O2366n6189n3681
475d5297J4616L0457M7469l493q0718k2173P4279M6800m8424n9569J6154M2119
$$ y = [-53896, -12015, 43559, 57233, -21288, -77599, -2062, 67985, 31085, -16342, -42989, -38506, 45990, 71512, -39845, -80461, -1263, 45059, 41853, -3681, -63064, -22273, 57978, 47780, -10224, -54105, -38763, 44131, 61900, -20981, -60651, -17575, 33044, 46799, 3961, -58444, -41698, 47884, 61324, -22353, -50650, -7955, 24194, 48121, 16401, -63593, -42433, 43450, 46180, -5882, -50963, -44695, 35495, 64790, -5948, -45622, -21943, 15986, 51753, 21065, -56927, -42054, 35296, 37302, 370, -20121, -43473, -2269, 68937, 15938, -64584, -28176, 27555, 42004, 18174, -47022, -37558, 37815, 38298, 5057, -22955, -53727, 2207, 64573, 8384, -45297, -30681, -224, 47245, 43752, -36966, -59139, 15140, 61940, 13516, -46053, -29899, 12220]
487A2220J5777m772m3077k7196M9920M0281k4065m0018k3138L4954O5337j8868
499C7355p6374p478N5716L6406j7471n8845k6044N9539M7713l9158l4946K434
511b1153L020M4079K9268o8975m4281N1946M7557o191n3198l7306N0217N2092
523D7075k3412m3009k1930K8069N5457j2801n2884p350K2332L0115J7023l3181
535E504m8870R302O9344J9284p7034l3833N3788K8574j652j8441m7394J8270O5467
548D2309j3987m1539n444l764L0768L8598m3200n0590K5493M2135J6647k5389
560A2037o0054J0678P6839j110n2688o989M200K1411L8605l1500m8878J8748K7540
573H839J6333n839n5187k252O4513P273l1813k2110j4595M7454M4670n8770m5570
$$ y = [12220, 27997, 23225, -19852, -47048, 2872, 43153, 19088, -20930, -44068, -9114, 56223, 37355, -39019, -46497, 9219, 45625, 28154, -30691, -56735, 2804, 50517, 11359, -23587, -21153, -18133, 25946, 55214, -13761, -58042, -6096, 41461, 35270, -17928, -55234, -5017, 47075, 23663, -19346, -41276, -13207, 42250, 29449, -23435, -30785, -8453, 21662, 38685, 5504, -43366, -34064, 35280, 54564, -22470, -56303, -2515, 26059, 24407, 5966, -41428, -23158, 42309, 28322, -13217, -18661, -22425, 8343, 46941, 3741, -46849, -21356, 20779, 37426, 12037, -48017, -37339, 39500, 38390, -14298, -21287, -17087, 4324, 42929, 11429, -37449, -18701, 8839, 25172, 19333, -35854, -38106, 26407, 33680, 1867, -20243, -34838, 12616, 57286, -1484, -47054]
586d7054L7377K4251M631K098m1287k4954N0967L8383l2719l8754q47K6154L3422
599C1668n783m8579j0513M3193K1706k1002l0372p552L2786K4866k7220k7065
611b3867P758J6429K4204K997n0202j9131N4129K7073k8222k7129j6996K0549
623a2408N2450j0091n7061n405L1024K2647K904l3395k2399K8750K3911o328j4400
636A99k0686O048L9610m63m4279r095L0886K0127o586k7964k0099K6035M1032
649C4765q979m4262j3616K8530K7613m29k4218k8973N320M4355J5258l7664k8515
662c0815J2045L3357J5071l2094k6063K2808K1299K52j1938k7707R586M1884j0457
675A7228l3020q5M125J9447K6578l1682m3813K4039M4782K421k9388k9589M826
$$ y = [-47054, -9677, 14574, 19205, 21303, -19984, -44938, 6029, 44412, 11693, -27061, -27908, -1754, 31668, 25885, -22694, -33207, 9986, 31692, 10690, -19682, -27234, 5552, 30418, 3198, -23867, -16109, 320, 24524, 27521, -22681, -41812, 12317, 39390, 11168, -15961, -32957, -12408, 40042, 29951, -27110, -32515, -1491, 21156, 24060, -9335, -31734, -2984, 20927, 14599, 199, -20487, -14439, 25171, 24708, -19571, -28666, 2220, 22347, 15761, -12203, -32302, -6267, 34765, 25786, -18476, -32092, -3562, 24051, 23622, -596, -29569, -24249, 20106, 35364, -2300, -30815, -18770, 14587, 29658, -2436, -28499, -5691, 15608, 15860, 3922, -23785, -14199, 27685, 17228, -15792, -15877, -11752, 7695, 34273, 2591, -41222, -17183, 27599, 30020, 632, -28957, -24131]
688b4131M1195J6256l2057k3990N530J7849K4285r366m0266M828L0939J206l304
701H974j5130k0620L3182K8746l7441k3932J9581J6781Q419j2326l0024L015L2551
714A1776J2255j6046k4131r513K6247L2386j7503l7988K210K0662J6545O376l4890
727a1614k2292M0758J7281k5323m166n451m58L0948k733l4126J911J9663J1178
740A5576j049k6643j3111K8642K0195j5130k1356o981J3974K7202Q0l5593j0662
753b4856K7213J3010k931j0601k4226Q444L6599n423k8860m286J0914J7418K958
766A5373k3603r650J6102J4667J372j8093j6778J5819K4275m861k3198r979J2229
779f325J9033N665k0368k3427J5844L0611o276k1473o303L599J7682J1839k0499
$$ y = [-24131, 17064, 33320, 1263, -22727, -17197, 652, 24937, 15571, -24695, -19867, 11072, 12278, 8974, -6156, -26776, 6406, 35152, -2289, -26221, -6640, 10141, 18560, 6234, -23790, -20775, 11776, 24031, 7985, -16146, -25659, 588, 32974, 15471, -22517, -20307, 355, 16900, 23276, -11614, -33906, 6852, 24133, -1190, -5356, -10807, -11265, 19683, 16950, -17176, -15265, 4398, 15576, 14527, -12116, -25227, 3415, 23610, 8480, -12876, -19857, -5883, 21319, 21399, -14194, -24856, 2357, 15367, 12436, 1835, -22391, -13947, 22652, 17229, -11631, -15917, -5003, 12415, 15373, -8230, -17880, -1778, 12889, 14261, -3832, -20610, -4791, 19484, 14623, -8575, -18554, -6325, 12708, 18373, -1995, -25422, -9578, 21033, 14757, -6716, -13019, -9420, 8262, 20101, -398]
792c98j8915J1266J8577M253j4191j7482N990K2031M469j7190j3449N333J8113
805H407J0456j6513k2297J0244K3230o53j2297j1518n052K0847J8062k1518k1059
818a9661J1182J5727O291o635k0341j805K2812Q838j2335j4975m629J8429J7743
831B0641j6279k1015N871J4517R753l263k2778o578K6829J2124j8735j1770K104
844h579O805J5042r53k4731m268K0402Q943m372j4336j2559J8310K0077j4002
857E779j5723o94P008J8398j275k6862j481J9890M457l504q043j2282Q182K1011
871A4861k666k0889m825J2804J1195P47j4893j3007J4143J6339o620j1204p809
884a1824M436K0337p75k0649j677Q138P015P892j2417j6992J1452J7571l441j3029
$$ y = [-398, -19313, -8047, 10530, 14783, 592, -16890, -10900, 11131, 15600, -1590, -15039, -9706, 8407, 18863, 2350, -19947, -9703, 13527, 12874, 577, -10941, -15993, 4854, 22916, 1398, -19661, -8479, 7248, 13539, 6904, -13437, -15242, 7570, 16408, 4073, -10902, -15531, 2898, 20641, 4362, -16653, -10782, 3735, 13488, 10225, -12553, -19131, 7698, 19822, 1087, -10683, -8579, -1774, 13268, 12315, -12416, -16684, 3718, 12661, 8289, -6047, -18606, -296, 19781, 5779, -9944, -10638, -3630, 14768, 13493, -13369, -14850, 5040, 9497, 5993, -2050, -14332, -6150, 14861, 12195, -8694, -13519, -715, 10480, 11227, -3666, -16673, -2530, 13809, 7189, -4015, -11824, -7388, 12949, 12174, -8475, -10152, -2014, 5001, 12893, 476, -16516, -5064, 12507, 9066, -3963]
898c963n602M559J0085O659j0739j5487Q840J5301j616o664j1146r84K1506K131
912A2880j8715j769K431O784J3565j4640j7335J4693R927k908j041j1471m103
925a1702J7837P990j3766j2083M749J2980M674q561j2811J817J5871L080j0089
938a4o987j609J1509J0387j2609j0451N292N640Q077k355j7970M24J7506L541
952A0381r657q812P18J0148O846n249j2471j139J2806N238m296q760q393J3194
966E54J4353j3632r104L518M50J3203J329k2853L356J6295m656L84j931j3001
980a1735R263J4845q173j0273j811N663J2109j858j5473l115J1372Q438l033j0406
994d187n469P453J0493r82r732n878L781R984L644r184r520L686J2994K511j3467
$$ y = [-3963, -9565, -5006, 5079, 11738, 999, -14488, -5648, 9653, 8037, 1373, -9773, -10757, 10749, 12880, -5835, -7604, -5173, 1611, 15176, 536, -16799, -2106, 7821, 4913, 3872, -7599, -11702, 6135, 14125, 359, -11724, -6975, 6005, 10679, 2118, -10693, -8876, 6995, 10075, -14, -7001, -8610, 2899, 13286, 677, -9774, -4482, 1158, 9235, 6880, -11090, -10666, 6840, 10381, 724, -8088, -7370, 2778, 9624, 4375, -8096, -9235, 3571, 8809, 4513, -4247, -12640, 554, 14907, 1275, -7829, -4311, -3861, 9342, 10671, -12182, -8826, 7469, 2813, 3197, 1266, -11735, -2472, 12373, 4200, -6073, -7884, -2221, 9888, 8030, -7443, -10558, 814, 9252, 6219, -4187, -9656, -2203, 8290, 7308, -2424, -8302, -4521, 5463, 9107, -77, -9597, -5911, 7083, 9594, -3873]
1009c873n033Q919M373Q26m730j0259O890J2113n710n752k861j985J3816M746
1023A1480j6106m003N416N647R876j0179j6888J1386J1473m393j016o968n215
1036i490J3464M939j0164k685N86K698P648m265j0272L894Q264K97m735o245J129
1051d937R873K998q899o961M133P906J747l255o564n074R322J0691q264q808J908
1066d184J667P910L160j4758j695J2567k013k399P09p166O220Q110j0750j411
1080d033N528m890P534M302j7364P20J4768k380j384l067j1893J1087J5030j2945
1094A013p611M875j839P190M834j2800j354P083j805M517m70j1735N279J0078
1108G255n431m540j167J977Q837k890j0746J989O448L266r83p889k234O037M000
$$ y = [-3873, -8906, 13, 4386, 5212, 482, -9777, -2887, 9226, 3516, -2236, -5097, -7082, 6734, 11480, -4626, -8629, -3213, 2434, 12310, 2131, -14757, -3371, 8102, 3709, 2693, -4275, -9490, 3974, 8913, -1251, -3936, -3350, -652, 6996, 2731, -7541, -3647, 4617, 4914, 179, -6066, -4937, 4936, 7934, -965, -7926, -3793, 4113, 5860, 2605, -3959, -9033, 289, 10980, 2716, -6092, -4184, -2517, 5393, 8553, -6205, -7900, 4667, 2654, 255, 964, -6202, 18, 8128, -2622, -4033, 1495, -3395, 4139, 8441, -8923, -8203, 6565, 4185, 2801, -266, -12159, -1072, 13958, 1013, -6598, -1723, -3562, 3628, 8462, -4338, -5692, 1391, -414, 4103, 3633, -8102, -2823, 7255, 1824, -2716, -3883, -1906, 6931, 4041, -6705, -4716, 1732, 4998, 4015, -3874, -6108, -71, 3929]
1123C929J500n377p829M517Q196P61m808q037K437J1259k077p594Q70J78K862
1138G87N043o583n387O367K663j008j6o439j231J0953J831r427l054K853N164
1153B516L890n942o428L476M299J963o64o462j811O054L589j276o441l171Q609
1168B201L921o329l160o19M666O812p507o439O336O23J182M071r432l662J0071
1183B735Q52j504j002q622M588J2018o869p294L740M76L387K181q651m77Q005
1198C563j813k012R59m921K282Q028l996n734J116M19N317L718j0057m233Q653
1213A289K155j464n11o055O52Q454j485n026J195m96N13M340k457n285L537M255
1229C611k894k314Q1k08M214K141p271k799O061K146oj284o761R71Q878m06m483
$$ y = [3929, 5429, 52, -7777, -3260, 4936, 5697, 889, -7148, -4711, 6548, 4471, -3123, -2253, -2075, 787, 5830, -753, -6140, 227, 2890, 1882, 1866, -4573, -5804, 5149, 6980, -2447, -5501, -2648, 2516, 6406, 464, -5964, -2488, 1811, 3774, 3110, -3352, -5163, 891, 4480, 3204, -3237, -6408, 2201, 6122, -207, -3367, -3986, 680, 7492, -15, -6454, -118, 505, 1687, 5758, -3674, -7336, 2735, 3587, 2083, 1081, -7541, -2953, 9065, 2196, -5098, -1358, -882, 2505, 4686, -3965, -4442, 3563, 1750, -262, 697, -4224, -1942, 6086, 2090, -3644, -2528, -2109, 3208, 6926, -3131, -7364, 1289, 3444, 1980, 1469, -4586, -3934, 4520, 3035, -1991, -796, -1292, -779, 3561, 1104, -4181, -644, 3611, 717, -1597, -1516, -1724, 2490, 4631, -2640, -5439, 622, 2768, 2762, 1478, -5283, -4312, 4566, 4160, -323]
1246c23j526k582M165O453n343m677L224N8J518K522n687j147O429j509l339J620
1262a44j395J663M681n013n501M618M346k69k124m779n28O590L243m200m660j61
1278c633L741L624p77m605k342L344L834j205l442p44K030K108n81l068m88L543
1294A339J429k660k383q4L041L374k562m955j8L616L778n67o042j924M484K805
1310B671N77k696n097K068N786o04k842j657r04L572K964m065l405L141L164j548
1326A125k139o60L12L363J543n102k245L605J744J332j302o359J089P386k9l633
1342C0k519j479N117M213n312l422K404R87J748R89m774j536N033J027k391p93
1358f78k022J956N552l837n523L767K275j59J230m958k052O828O60l395J95k583
$$ y = [-323, -1849, -4431, -266, 6187, 844, -3833, -609, -551, 967, 3489, -2198, -3345, 3084, 1575, -1764, -144, -1539, 124, 4805, -208, -5709, -1091, 3255, 2986, 862, -3917, -4445, 2145, 5388, 1188, -3472, -3633, 108, 3732, 2955, -1650, -3992, -648, 3186, 1981, -1461, -2205, -175, 1933, 1352, -1716, -2204, 1339, 2768, 108, -2275, -2359, 682, 4056, 1494, -3461, -3479, 137, 3915, 3348, -2694, -4618, -134, 2671, 3248, 552, -4545, -2477, 3309, 2705, -137, -1794, -2698, 874, 3838, -227, -3632, -491, 2673, 1125, -1014, -1674, -1362, 2001, 3544, -1558, -3803, -198, 1546, 2878, 1576, -4783, -3694, 3692, 3663, 30, -2489, -3968, 1149, 5362, 50, -3372, -968, 19, 1767, 2756, -2018, -3554, 1479, 2506, 115, -678, -2700, -744, 4808, 971, -4552, -785, 1490, 1331, 2561, -2397, -4449, 2379, 3039, -356, -161, -2744]
1374b744P05O133j410n324rK536K619m55l524r54K209K393l89l294o04K143J114
1391A145Q11k189l160K882L275j305j851k323Q36N316p83n184N72J989M50K040
1407B521j975m155K652L368j259n70k030j827N335K077n914p81K445L66K798k191
1423H60n538M019L823k809M9j559k152N157J804m511j346M91K462K883l520l354
1439c241J911K357J858j954m294J682L478J70p58l513q31N229Q01l098r90j613
1455b806K683M860m532m166L677O70N68K193n330k073O480M29k650j0l363J997
1471a373O459l829m815K461Q13K236J452o203p59N512m52n64m18m179K365M964
1487C670k047k482j723J93N810O4o202o2K452J738K198m352l705M787K089j411
$$ y = [-2744, -2039, 4094, 2684, -2640, -2649, -113, 2506, 2051, -1473, -2427, -218, 2175, 1786, -1508, -2112, 31, 1145, 1956, -233, -3393, -511, 2764, 1459, -392, -2715, -1879, 3437, 2654, -2530, -1958, 31, 481, 2521, 546, -3609, -957, 2411, 1152, 582, -1448, -3275, 2060, 4137, -1777, -2558, -113, 253, 3051, 860, -4678, -659, 3164, 355, 404, -1155, -3307, 1850, 3654, -857, -2203, -1712, 750, 3633, 113, -3241, -1330, 1027, 2885, 931, -3363, -1681, 1797, 1967, 1209, -2304, -3135, 2094, 2895, -203, -1193, -2806, -123, 4737, 205, -3961, -284, 386, 954, 3147, -2183, -4256, 2224, 2653, 3, -7, -3370, -1373, 5086, 1257, -3558, -1097, -284, 1952, 3404, -2799, -3558, 1954, 1502, 938, 520, -3659, -1294, 3670, 1623, -859, -2582, -2389, 3421, 3485, -2717, -2779, -327, 1411, 3609, -743, -4448, 339, 2428, 1017]
1503A017j61l557q5N636j30l198j472j156M868L354o700k333L874Q50K144j588
1519A363o251L481M928k845j4j607l419N990K842n589p72R0J009N640l222o858
1535e234M078L846j561k05k711j124M698Q63k832j030q42J889L465j849l956l66
1551b871L094L609j947n389O88M274J225j369l388q96L993P87j436M83l446j24
1567b713O864j793n352K145O7J515L854p122k868R041p38m397J895l045J162O273
1583D788m131l299K177j909L787M365p650l337N485K082N54k813n059L880N102
1598D022k973k284J54j01K545Q08l072q75J097J454K014k565m571K901N644j125
1614C073m980k320L126M905q62m453j669J319L799J793l727k509M85J419M257
$$ y = [1017, 856, -2701, -2786, 2850, 2720, -478, -1950, -3106, 1762, 5116, -1584, -3917, -43, 807, 2951, 1363, -4888, -1407, 3521, 676, 662, -945, -4364, 1626, 4468, -1121, -1893, -1803, -794, 4846, 1624, -5234, -1156, 2690, 1129, 924, -1787, -2911, 1787, 2650, -182, -1212, -2054, -165, 3300, 1451, -2505, -2871, 223, 3832, 1885, -3504, -2816, 1458, 2683, 1314, -2074, -2970, 1023, 1810, 374, 857, -2589, -2713, 4151, 2358, -2994, -849, -782, 733, 4587, -2535, -5403, 3638, 2900, -1497, 398, -2647, -1485, 4788, 657, -2642, -465, -2374, 1413, 5778, -1872, -5209, 276, 2358, 2912, 99, -4960, -1080, 4022, 1049, -1235, -1081, -1182, 1363, 2171, -901, -1776, -679, 775, 2789, 224, -4347, -1446, 4198, 3073, -1907, -4227, -1101, 3804, 2942, -1511, -3180, -1861, 1938, 3731, 4, -2505, -2020, -601, 3656]
1629C656q59o949J103N522k46j692k589n07N344M2n160N82J561P36K556k884l978
1646c762K372K885J672r67o027r41O696K869l290m678j158N256L460l207l001
1661a821n90J185L635O5m002p15J926J938Q79l784k483M980K439l471k451p41
1677c011L144N044l611o028K152L110J495J357n056m295N110M445j172k789l821
1692c926J210O392j67n193j012J726K453J119l601j866L432J452j133j190k329
1707b633J285M685q49m474j308K076M247J190n473l488L541M119J78l235l255
1722c394R02M129J940l086l283J226K400J199n68m034m25N545K85m275l70Q07
1738a002K157K516m078l861L296L178L01j774m051K47N236J807l336l558k36L828
$$ y = [3656, 2797, -4152, -3049, 2473, 2227, 535, -2054, -2561, 2783, 2825, -2335, -1753, -192, 544, 3100, 216, -3762, -1390, 1495, 3167, 2200, -3827, -4768, 1928, 4797, 1507, -3171, -4329, 927, 4387, 1180, -1821, -2411, -1226, 2409, 2474, -1528, -2243, -317, 1621, 2500, -1284, -3767, 1213, 3652, 181, -2270, -3011, 133, 5177, 1566, -4462, -2310, 800, 2295, 3652, -1404, -5699, -589, 3856, 2684, -105, -3926, -2716, 3676, 3509, -1684, -2696, -970, 1483, 2602, -999, -2865, 567, 2019, 886, -304, -2633, -1348, 3337, 2488, -1986, -3294, -1218, 3029, 4219, -1254, -4742, -1201, 2918, 3096, -139, -3394, -2492, 1637, 3577, 491, -2792, -1566, 834, 2033, 1465, -2569, -2994, 2551, 2836, -1439, -1809, -1002, 1155, 3671, -407, -4268, -972, 2206, 2507, 733, -3318, -3071, 2165, 3972, 636, -2922, -3158, 670]
1754F70L254k516m681O10L962J462j370l229j250M132K339l296k315j4K515L706
1770C979k705m952J532L502J643j143m987p22N120K282j962l772j467M134L206
1785C688j989l506j918L354M352k469l997J47K283L144o79m779q51L432K666o73
1801B205m157j730L548L545n00m433k589L663L739r34l521k632K592M442p83l279
1817h24j859J019M154O71m441k063K100L526J043m221k973L091L757o0l753k923
1833c756K157L964Q83l322l731J941M401M70k252l856m35N954J517n021j617J124
1849a579K532K966l498m307K737L113J22j459l506JM821J795l305l490M35M095
1865A473K460l031m583N11M833J880k738l177l86L585K731k655l354Q1K431K777
$$ y = [670, 3924, 1408, -3273, -2663, 1299, 2761, 1391, -1838, -3088, 1044, 3383, 87, -2228, -2242, 273, 3979, 1274, -3678, -2146, 1356, 2999, 1856, -3131, -3853, 1267, 3549, 1587, -2185, -3652, 482, 3688, 1699, -1807, -3725, -371, 3981, 1512, -2485, -2338, -55, 3089, 2410, -2369, -3220, 212, 2878, 2205, -1952, -3682, -134, 3411, 2911, -1522, -4111, -448, 3291, 2357, -1164, -3796, -1204, 3238, 2455, -824, -2683, -1664, 2490, 3161, -1280, -3343, -1243, 2283, 3326, -895, -3868, -777, 2980, 2920, -833, -3756, -1599, 2365, 3248, -74, -3805, -1864, 2537, 3007, 755, -3101, -3536, 2418, 3935, -1086, -2703, -1579, 953, 3919, 421, -3886, -1149, 1964, 2086, 627, -2879, -2878, 1943, 3738, 433, -3057, -2622, 1473, 3933, 902, -3681, -3170, 1663, 3543, 805, -2372, -2758, 827, 3558, 903, -2451, -2370, 61, 2838]
1881B838j241m200L2L748J872j776l670o37L924K474k422l730l7L810K384j743
1897A626l573j387L415L507k082l677o44K179L693k77m812j026L349K093m39l215
1913a270k353L217L652j490l308j151K225L650o14m507j530L045L206k96l751
1928a275k307K896L981n67l890k209K076L840K08l737k501K285M025J76l847k370
1944c216J952L616N51l851k808K573L875J26l163k838J482M343N18l913k561J429
1960a885L646J792l324l841J842M089O20k620l348K33M641J588l653k600R80L216
1976A376K215k920m035J221L571J381k014l776K68M452J693k657l192k61L542
1991H64K421k312l669k86L726K884k327l751r3L084K665j711m287k02L758K123
$$ y = [2838, 1597, -2603, -2571, 1177, 3049, 1273, -2397, -3034, 890, 3364, 942, -2788, -2825, 985, 3369, 1626, -1947, -3334, 81, 3588, 1506, -2171, -2815, -636, 3057, 2780, -2032, -3058, 291, 2384, 1945, -1270, -3623, -406, 3246, 1756, -1552, -2703, -478, 3172, 2558, -1949, -3479, -434, 2772, 2476, -1275, -3582, -686, 3295, 2728, -1162, -3371, -1295, 2545, 2753, -984, -3485, -1200, 2825, 3001, -846, -3216, -1264, 2352, 2903, -948, -3756, -1183, 2692, 2818, -345, -3183, -1701, 2642, 3160, -753, -3314, -1885, 1761, 3553, 229, -3612, -1770, 2319, 2939, 319, -3029, -2796, 1845, 3433, -220, -2820, -1840, 1376, 3591, 671, -3364, -2143, 1428, 2809, 795, -2981, -2713, 1739, 3432, 775, -2417, -2678, 864, 3285, 973, -2696, -2982, 744, 3628, 1301, -2450, -2543, 541, 3206, 1495, -2792, -2994, 764, 2887]
2007B887j457l242r69L175K861j589l667j097K800L271p38m217j473L804L178
2022C527j676l534j468K684L613j337l955m77K448K691l8l773j754K620K783j52
2038B202l405k515L082L925j103l581j447K365L263o39l612j665K316L369l00
2053B255l229j519J512L154R03l832k882K511L356J72k890k683J970L940k04l323
2069g89j704J133K785J208k868k913J820L499M73k452k789L87M216J250m034k467
2085c245J863L028J353k678l243J473L179O44j827l113j72M150J829k908k785
2100b452L79L252K210k661l886P41L870J400k506k827N00L171J795j952l264m36
2116b666L074K605j771l749l44L642K502j776l718o25L444K494k177l413M8K974
$$ y = [2887, 1430, -1812, -2781, 394, 3255, 1666, -2001, -3098, -298, 2973, 2235, -1982, -3455, 349, 3527, 1851, -1683, -3151, -467, 3146, 1809, -2146, -2623, -175, 2516, 2478, -1295, -3049, -429, 2354, 2202, -1203, -3718, -636, 3289, 2186, -1395, -2842, -477, 2786, 2147, -1465, -3130, -814, 2555, 2255, -974, -2493, -981, 2173, 3076, -756, -3638, -1127, 2229, 2401, -489, -3172, -1202, 2738, 2534, -789, -2493, -1360, 1425, 2633, -235, -3148, -1328, 2171, 2644, 192, -2597, -2210, 2006, 3256, -778, -3245, -1382, 1646, 2999, 321, -2922, -1449, 1730, 2374, 547, -2566, -2738, 1412, 3241, 333, -2452, -2073, 1179, 3389, 728, -3158, -2417, 1453, 2853, 347, -2480, -1980, 1191, 2986, 1034, -2230, -2666, 408, 3013, 1242, -2507, -2851, 791, 3293, 1517, -2201, -2826, 618, 3112, 935, -2478, -2430, 544]
2132E44K006j117k938r89K614K635j136l496j191K874L231j122l749r71L035K679
2148B909j107l376j336K454K909p44l004r90J850K494K58k962k322J997L355l48
2164B037l436j425K488K734k83k836k049J868L355m50l059j535J338L092J001
2179B840l001k533J346L152R12l054k789J896L129K5k077j856Q86K866M78k674
2195d54j871J095K525Q79k241k633J234L575O27k851k510O36L518J501l394k468
2211b832J705K157J239j001l355j34L323J050j843k043k12K609J818j929k506
2226a954M65K666J170k281k505P13K936J171k096k303L00K385K188j552l813K6
2242b484L169J512r71k590j150K773K391j439k606o32J997J966j130k340j79K063
$$ y = [544, 2550, 1433, -1505, -2494, 120, 2755, 1619, -1877, -3068, -194, 3037, 1915, -1834, -2805, 230, 2909, 1802, -1574, -2910, -456, 2453, 1709, -1295, -2285, -435, 2059, 2317, -645, -2967, -970, 2385, 2037, -1399, -2824, -336, 2398, 2115, -721, -2770, -902, 2453, 2003, -1056, -2591, -1253, 1839, 2840, -161, -2694, -1348, 1804, 2716, -338, -3127, -1231, 1898, 1923, -154, -2010, -1124, 1742, 2220, -454, -2325, -1230, 1295, 2174, -67, -2700, -1466, 2109, 2736, -115, -2625, -1989, 1529, 3030, -364, -2832, -1127, 1030, 2269, 1268, -2087, -2221, 1102, 2152, 309, -1734, -1946, 663, 2481, 552, -1954, -1489, 1177, 2347, 66, -2439, -1726, 1210, 2381, 285, -2018, -1718, 667, 2855, 1303, -2510, -2484, 685, 2197, 1226, -1364, -2514, 259, 2650, 1211, -1395, -2027, -30, 1936, 806, -1534, -1713, 350]
2258C50J714r11k576o32K389K130j450l057j61K402K136l94l246j548K754K659
2274B559q44k854j613J973K915l32k405j439J250K728r5k879j022J656J876j29
2290A345k253j076J784K153j87k722j617K194K576o40k528j429J473K890M51k790
2306c76k149J390K787L27k242j857P75K573Q28j957j823O80K229O34k210j612
2322b003J237J831M66j421k024O99K885M95k501j865Q92K388J018j825k345N33
2338a540K703J096j809k264K23K269J117j491j796J47J826J445j137k462K27K418
2354I72P01j610j613M8K079J597j596k403M10K291J087j336k376q1K329J331r34
2371H96j972q03K085K092j481k392L3J643J389n07k187n38K227J518j236k085
$$ y = [350, 2064, 1153, -1423, -2055, 334, 2464, 1014, -2043, -2204, 198, 2334, 1940, -1306, -2854, -100, 2559, 1715, -1139, -2752, -779, 2136, 1804, -601, -2040, -790, 1938, 1843, -1036, -2058, -402, 1474, 1345, -908, -1984, -200, 1953, 1766, -956, -2573, -379, 2197, 1557, -971, -2400, -927, 1963, 2414, -376, -2525, -1135, 1652, 1979, -263, -2120, -1345, 1228, 2056, 99, -1724, -1044, 1185, 1819, -391, -2003, -766, 1065, 1531, 110, -1914, -1215, 1670, 2165, -336, -2201, -1309, 1079, 2097, 272, -2073, -1540, 1163, 2259, 450, -1814, -1591, 678, 1795, 304, -1492, -1345, 481, 1926, 789, -1673, -1446, 972, 1673, 63, -1550, -1502, 577, 2174, 578, -1825, -1415, 876, 1963, 627, -1749, -1830, 499, 1830, 896, -1076, -1879, 206, 2298, 817, -1575, -1542, 101, 1490, 983, -1204, -1742, 485, 2003, 767, -1318]
2387a318k10J764J352q30k027m77J864J803o67k417p95K097J743j030j934o67
2403a749J444K066l82k286p86J644J678n48k028p08J236J787J18k192j204J773
2419a37J860m38k031j203J508J888l16j575j228Q32K513N2k467q47R95J595N05
2436A506j770j626J142K196K28k061j388J254J698N4j472j487P54K194M01j726
2452a03j534P02K138L77j806j426N66J920Q67j595j720O27K031O00j748j363N46
2469i21J469R50j063k046N26K096N27j294j658J42K058O16j267j279k08J877J459
2486A984j677j749O16J268Q16p23j790r4J845J024j008j712J13J669P31r50j360
2503i97k79J467J301q57j732j34J630J122r89j546k66J299J307n32j740m08J573
$$ y = [-1318, -1528, 236, 1588, 758, -1269, -1746, 118, 1921, 1254, -1163, -1958, 139, 1882, 852, -1082, -1749, -305, 1761, 1379, -907, -1693, -49, 1629, 1081, -947, -1655, -419, 1368, 1486, -706, -1910, -137, 1723, 1285, -746, -1949, -441, 1447, 1131, -444, -1672, -840, 1673, 1725, -742, -1589, -594, 1001, 1506, -264, -1890, -748, 1448, 1676, -385, -1773, -519, 1179, 1233, -239, -1726, -972, 1222, 1623, -103, -1637, -935, 1203, 1580, -226, -1652, -1086, 834, 1701, 106, -1614, -987, 1044, 1644, -104, -1467, -921, 548, 1498, 435, -1611, -1085, 1011, 1538, 244, -1414, -1272, 786, 1402, 135, -1144, -1352, 525, 1984, 307, -1442, -826, 442, 1258, 535, -1255, -1349, 496, 1520, 512, -1200, -1087, 582, 1313, 363, -997, -1276, 191, 1492, 635, -1097, -1231, 399, 1521, 532, -1014, -1280, 19, 1326, 794, -946, -1354, 219]
2520B19J271p72j602k71J091J162j26j756p53J626J355o20j542o24J355J336o71
2537F78j357o14R38J764l02k057k56J243R12m9j334j124J201J652l19j564p13
2554a301J126J432l08j502o88Q53J360R5j503r75J072J518r0j493q56P93J328
2571H61K84j338j287Q91J835j21j514o89N65J125N48j216j317P06J526K77j158
2588b2j129M65J508K69j178j028K72J488P04j490j136Q06J191K23p21j260P5J545
2606E82O38j056j202P6J528Q20j264j147K27J012R62p60j624K92J554M35p66j078
2624g71j18J126Q06n77j314l27J483J025j045j229J49J026Q45n98j446q2J346
2641B99P83o48j214j64J169P91n11j139l97R50J215m64j513j29J298O28n40q75
$$ y = [219, 1490, 718, -884, -1155, -64, 1098, 972, -784, -1537, 89, 1444, 824, -718, -1342, 13, 1349, 678, -679, -1293, -355, 1409, 1107, -950, -1206, 37, 949, 900, -434, -1558, -357, 1295, 976, -588, -1301, -175, 1257, 949, -553, -1241, -388, 972, 1067, -436, -1411, -339, 1179, 1089, -404, -1260, -467, 861, 1145, -193, -1480, -589, 1246, 1125, -389, -1078, -513, 612, 1160, -56, -1373, -667, 859, 1136, -22, -1151, -686, 822, 1091, -87, -1115, -843, 645, 1349, -141, -1277, -471, 720, 943, 222, -1038, -963, 582, 1220, 164, -1038, -962, 566, 1386, 122, -1025, -798, 214, 1176, 416, -1208, -916, 638, 1073, 307, -771, -889, 237, 1043, 466, -848, -1175, 308, 1333, 288, -941, -792, 234, 1079, 481, -965, -1047, 299, 1082, 434, -780, -944, 225, 1016, 505, -634, -1031, -81, 1134, 670, -843, -972, 326, 954, 414, -461]
2659d61m30Q52J048m88j229k18R80Q80l51j129l56P60J055j11j423n47J141J008
2677I81l22j116n08Q55R18k28q63o97N66J333j66j276k54O37Q33J57j138p79Q42
2696b25J080j62j074o51Q90J071k84r29n42L26J172L78j323q77R38R54k3p45q44
2715h70K32J322K36j215o58N58J015K41r81p30M98Q83L18q02j059L71J348K00
2733I07j027p55L86J007L53q00r38J80J215M20r86p68L61Q09M33o00r69J28J029
2752C85M36o93r87K40J139L10p14p63j9R11P44p26j151J84J038M41m78q76j74
2771g53Q66P30m39j012k04R90P07o29q50K5O56O75l04j090j85J028O74n60r32
2790f07j28Q33O92l12r16m14P75R75l59j137j11P55N77j07q22n04P24Q45l55q54
$$ y = [-461, -891, -39, 1009, 521, -708, -926, 54, 934, 583, -546, -902, -142, 913, 802, -621, -1168, -27, 981, 659, -457, -965, -110, 808, 580, -283, -980, -414, 919, 753, -523, -777, -140, 693, 850, -288, -1067, -225, 855, 693, -381, -1032, -142, 929, 645, -284, -826, -500, 672, 1050, -273, -1150, -212, 742, 719, -26, -870, -638, 684, 920, -295, -953, -395, 620, 861, -120, -850, -352, 531, 849, 47, -1012, -641, 707, 907, -120, -875, -489, 518, 871, 71, -867, -687, 528, 948, -38, -806, -445, 364, 797, 197, -772, -644, 385, 821, 128, -859, -619, 520, 830, 116, -647, -666, 245, 989, 263, -888, -704, 334, 775, 297, -579, -753, 113, 843, 404, -608, -812, 178, 885, 256, -594, -569, 87, 762, 458, -632, -817, 211, 885, 325, -607, -735, 98, 790, 478, -438, -852, -77, 898, 539, -598, -709, 46, 623, 516, -306, -810, -86, 759, 404, -450]
2810d50k57P07P15l22q26j97N68P48q1j094m23R42P29k74q04m62N61R23k7r32
2830b56n73N77Q72p0q01m20M18P25P7p02n15M13Q22J1r45l15O76N68p0o49o05
2851g62M18J039rr96m90N30P44K26o90p37K62R44K40o93p10K59Q69J96o93m62
2871e15J90N59M35o24q10M29Q34M6n37o34J85Q72L24p07p50P7J041M14p83p07
2891f61J91O51M90l65q45l1P78M80n25o96P9O47L51l35o70q1P60M59n65o97R7
2912d88P72L59m63o79q9O91N95l68q55j41P36N90l72p01j49M88O22o6q54k53O97
2933G2M46k54n66j84M79N18j64o60k85N79O86l53p74o9N10N31n3p71k90N29O38
2954E65j20p39k99N25N24o2n35m20L42P22j0p65k73M76M91l7n76l63L93O67q7
$$ y = [-450, -707, 0, 715, 393, -433, -630, -62, 686, 605, -489, -912, 30, 759, 485, -319, -781, -220, 703, 676, -256, -829, -252, 620, 550, -251, -671, -253, 472, 549, -153, -668, -255, 567, 578, -367, -682, -6, 562, 492, -157, -762, -344, 695, 686, -310, -800, -270, 474, 700, 10, -727, -465, 479, 719, 26, -684, -425, 444, 640, -53, -515, -325, 234, 669, 45, -765, -336, 498, 544, 7, -627, -442, 430, 754, 47, -703, -626, 415, 829, 46, -661, -470, 181, 671, 306, -539, -570, 208, 688, 163, -533, -454, 193, 544, 209, -461, -542, 218, 677, 112, -585, -488, 284, 643, 180, -499, -588, 103, 698, 330, -525, -666, 70, 660, 288, -413, -562, -74, 548, 482, -372, -625, 72, 518, 264, -302, -486, -7, 511, 347, -313, -598, -19, 667, 314, -460, -529, -19, 512, 459, -312, -602, -73, 565, 445, -294, -593, -68, 456, 394, -141, -561, -219, 503, 493, -272, -545, -69, 422, 385, -191, -554, -161, 506, 419]
2975D19o04m05L91O99m6o84k88L02N70K14o33o00M42P01n6n08m21K45O15P8n19
2996h8m31K24O93J02n98m52L53N01J53m38n77K53O54J96n56n39K71N96J64m48
3016C3m66P1N80L36n27n58K08N90J88l76n38O6O21K66l95n44KO58L37m94m84P2
3038c54M65L98k56p73K6P06L21m22n06l1N11L69k79n44r0N40M28k82o17l5M92
3059F7L85k11n64j53N06N15k93o32j22O20L60k52m65k16L99N45j28o72j47M63
3079EM09r4n43k80M81N02j90n15k69M09N53j79n78q9L05L78N1n14l51L74N74j19
3101C20n46k44L83M35k3m62k92K86N02k5n10k01K85L56O4l82m01K49N73K1m99
3122a11l40K51N36L1m73k89J95M46J77m54m02K41M56P4l30l97J18N30J08l56m29
$$ y = [419, -185, -590, -199, 500, 454, -230, -518, -216, 354, 568, -65, -665, -223, 478, 422, -86, -507, -262, 353, 431, -88, -519, -295, 398, 500, -98, -550, -197, 304, 457, 19, -558, -305, 349, 545, -11, -550, -279, 317, 481, 33, -433, -362, 218, 554, 27, -531, -323, 267, 455, 79, -459, -393, 228, 494, 99, -445, -443, 215, 552, 58, -426, -354, 111, 509, 253, -520, -494, 212, 533, 111, -395, -426, 85, 454, 175, -369, -459, 81, 509, 227, -390, -425, 67, 452, 241, -323, -476, 30, 545, 252, -380, -502, 118, 478, 226, -239, -455, -56, 489, 361, -311, -458, 5, 414, 320, -223, -503, -22, 480, 290, -225, -494, -85, 468, 289, -289, -378, -73, 305, 356, -158, -509, -135, 439, 320, -226, -470, -87, 348, 325, -137, -429, -143, 359, 334, -176, -377, -92, 264, 328, -54, -455, -206, 367, 388, -111, -451, -200, 336, 367, -106, -395, -200, 246, 423, -31, -433, -192, 264, 338, 8, -389, -271, 259, 367, 11, -418]
3143d18J32N96J21n29k97K04L88J70l29m24J21N35J05l39m20J30M40J79k64m84
3163c83M0N65K11m07l91J42L96J87k83l93L1M15K62k67m56K1M61K21k81m02LL97
3185H9L18k59n57R7M63K25k53l92o4M05L03k17l79j23L60M00k27m54k8L09K99
3206C15q4m54j22M00K88j55l69j30L05L45j45l89j64L31L46o1m68j81L57L71r8
3227B38m15j86K79M14k3m69k14K89L69l4l38k10J51M08K0l69k72K78L64k0l80
3248a20k19K53L54j8l31k53K16L79jl56k35K08L32P0k63l69J41M24P6l23k45J12
3270a68L39J05l01k17Q9L07J28l11k35J19L18P3k51k76Q8L58Q4k33k96N6L83J42
3292C01k64l06O4L06K10k20l45M7L27J62j99l06M8K73J55k02k60PL19J59k20k94
$$ y = [-418, -286, 310, 431, -98, -395, -191, 197, 367, 38, -386, -265, 270, 375, 36, -384, -254, 186, 365, 101, -383, -343, 222, 433, 26, -365, -223, 173, 360, 77, -316, -285, 130, 392, 125, -331, -310, 151, 372, 91, -311, -308, 89, 407, 148, -409, -312, 151, 376, 123, -269, -333, 72, 375, 158, -221, -344, 16, 416, 189, -265, -293, 16, 315, 231, -223, -345, 55, 343, 188, -181, -311, -6, 339, 194, -195, -359, -28, 318, 257, -211, -392, -35, 336, 238, -177, -363, -84, 330, 307, -162, -376, -87, 282, 248, -90, -300, -149, 259, 279, -90, -362, -84, 280, 260, -120, -339, -86, 268, 250, -81, -334, -118, 261, 260, -96, -331, -123, 209, 279, 16, -353, -212, 212, 288, -35, -280, -168, 171, 276, -25, -242, -153, 154, 282, -29, -264, -145, 173, 246, -5, -281, -193, 165, 249, 16, -280, -224, 159, 301, 37, -269, -205, 101, 311, 91, -254, -207, 120, 282, 83, -223, -175, 98, 253, 51, -209, -202, 117, 276, 56, -238]
3314b38M6K95J39j40l07o8L43K46k52l06J5K59K13q8l36p1K68K50j20l09n8K44
3336B5K35j38k98m7K56J55m3l05j07L09J96j24k76o5K21K37q3l18q3K07K61n2
3358A63k97j24J91K80o0k21j62J53K67k8k65j01J48K33l9k12j71J51L28m9k74
3379h9j49J66K74Nk49k05J39L00K1k17k49J38K62M1j92k12R8K53N6k20j64J07
3401h6K11P9k21j90R9K20O0j87k11J16K44O0j77k28O4K74N2j59j76J6K10J47j66
3424E1k44Q6J84P0j53j72M9K10J03j70j92M4K15Q2j32j88K4K15J02j50j71kJ74
3447C5J44j16j91jJ80J10r0k16j0K18P2r2j81K1J53J32j10j89%J86J29j19j90
3470a25n3K15J48j10k02k9J49J58l7k44n1K24J10p9j47l2P7J75n5k10j6J19J38
$$ y = [-238, -192, 103, 242, 102, -205, -273, 70, 316, 64, -242, -227, 32, 245, 157, -179, -250, 18, 268, 148, -161, -219, 25, 260, 122, -176, -223, 33, 188, 145, -160, -267, 42, 238, 114, -162, -227, -6, 231, 148, -170, -253, -46, 215, 163, -134, -258, -67, 213, 153, -68, -230, -77, 190, 162, -103, -204, -56, 177, 138, -74, -245, -94, 234, 185, -89, -238, -72, 202, 207, -42, -247, -108, 192, 213, -4, -253, -115, 147, 188, -4, -216, -118, 135, 191, -29, -193, -86, 125, 204, -17, -207, -108, 112, 172, -15, -226, -110, 134, 194, 17, -211, -147, 127, 179, 20, -156, -140, 70, 217, 51, -193, -107, 77, 147, -6, -178, -129, 81, 184, 14, -178, -134, 81, 163, 31, -157, -133, 82, 184, 34, -137, -139, 35, 179, 63, -128, -129, 51, 161, 71, -145, -155, 63, 135, 43, -138, -117, 36, 168, 58, -131, -131, 55, 184, 65, -125, -178, 37, 185, 75, -127, -156, -7, 151, 114, -130, -181, 43, 153, 74, -73, -105, -28, 147, 92, -118, -134, -15, 123]
3493A23j3k35o1J87J67r2j94l8J52J79n0j94q0J19J80l1k04p7J13J77l5j65n5
3516a27Q7J51J2j88q6J43J22n2j22o5R5J55J6k18n7J05J25Lj67r2J03J68Lj41
3540b7r3M9J47Mj25r7P0J66J0j00j43P6J48K5j41j10O2J64K5j39r6N4J41L4j25
3565b1p6K7J37L7j16j08K0J67N0j40q6M4J22L8j04r4K3J39M2r1j15M5J44M2j08
3590A8j06J8J30M5r3j15J3J44N7j00j14L7J00N6o0j23J0J40L5r8p5%J14N3n9j24
3616i7OJ22N9o9j11K8J21K9n8j10KP6J09q5j13K0P6Q1n2q6j8P6O5m5p1k0P5N9
3644F9l3j00n2J44M9m3j12LR3J11p8j35J3R3O6m3r7o1J18J10p2j21J8N2J11m2
3670F1j25l8J28P5m0j15m7Q2R8j1j67L3P1O8j8j16j3O0R0l4j06m2Q4J09l8j24
$$ y = [123, 110, -125, -186, 1, 168, 76, -118, -156, -4, 175, 125, -69, -149, -30, 150, 119, -85, -162, -49, 128, 93, -72, -127, -40, 111, 123, -65, -151, -8, 114, 62, -60, -125, -30, 125, 141, -77, -134, -29, 96, 99, -68, -160, -57, 111, 114, -27, -120, -71, 76, 80, -45, -142, -72, 94, 104, 4, -139, -63, 85, 110, -31, -141, -79, 85, 110, -29, -125, -71, 70, 104, -21, -97, -70, 67, 104, -12, -120, -100, 67, 117, -23, -109, -65, 57, 95, -9, -103, -80, 59, 101, 10, -105, -60, 84, 126, 18, -88, -70, 60, 105, 12, -103, -90, 54, 111, 11, -103, -66, 34, 90, 30, -93, -83, 57, 92, -6, -81, -81, 33, 86, 27, -97, -91, 31, 90, 21, -90, -62, 59, 88, 30, -80, -78, -2, 107, 22, -91, -71, 5, 86, 34, -52, -70, 6, 71, 26, -45, -65, 10, 69, 36, -64, -116, 28, 77, 34, -78, -75, 18, 129, 51, -84, -71, 22, 88, 45, -52, -113, 5, 115, 43, -78, -60, -8, 103, 61, -64, -102, 26, 101, 61, -54, -101, -19, 79, 68, -99, -66, 5, 73, 55, -61, -74, -14, 76, 42, -64, -106, -22, 87, 49, -75]
3696g5j8O9Q4Nj23k2N7O3J0j18j5O4R3Kj17k8O0Q1j4r9o3R3R9k9q8n7O0R3%j01
3726c4p3Q6J14rr1j04P5R6J9j03o7M9J15or6m6M7O1M9p8r8K1J35M2j28p9L7J23
3754E7L8j07n4L1Q8K6q7q2O7Q2Ko1r3M8P9L1o5j06M5J04M6j11p5M7J06L4p8r3
3782h1nJ16Q8q7j22J6R4O2m8j06lJ10N5o2q1k1J02O1o3j00J1Q7P9p2j30L2J32
3809F4J5k7j12m4J22P4n1j13l7J14Q8l0j27j6R4R4l8j31n9J17J15o1j14m3J07
3834AR3l2j36p7J60R8qj59m2J00R5Qj46o3N4J41Nj47n2Q7J02j8p1p5M9J27J1j59
3862e4o2Q6J13Oj26p3O0J25j6j17o1Q2J26K5j45m3K9J25K5j28q4N5J35J5r9j02
3888a03N4J09M2o0j26J6J07M1r3p6M7Q9L7p1j15J7J25L9r1j10K7J43M3r3r5j1
$$ y = [-75, -93, -24, 60, 65, -58, -80, -23, 40, 50, -68, -83, -19, 74, 76, -41, -69, -9, 72, 58, -41, -104, -11, 88, 59, -29, -86, -26, 67, 67, -34, -107, -21, 93, 84, -7, -111, -36, 60, 79, -24, -91, -42, 73, 67, -29, -75, -28, 33, 82, 4, -94, -73, 62, 104, -24, -103, -66, 57, 95, -12, -66, -35, 53, 79, -8, -90, -23, 59, 61, 0, -93, -45, 34, 65, 0, -106, -61, 43, 89, -22, -97, -50, 56, 90, 12, -81, -86, 30, 118, 31, -91, -75, 19, 81, 33, -73, -76, 34, 89, 27, -54, -75, 27, 88, 25, -75, -64, 23, 102, 30, -100, -68, 64, 79, 52, -60, -104, 18, 92, 41, -72, -109, 5, 93, 63, -64, -80, 14, 108, 70, -61, -120, -3, 112, 51, -63, -106, 1, 94, 62, -74, -151, 9, 107, 99, -60, -102, -2, 93, 101, -45, -108, -54, 87, 92, -55, -107, -20, 82, 64, -7, -82, -33, 94, 105, -54, -116, -30, 83, 89, -37, -110, -50, 75, 59, -58, -119, -37, 89, 114, -31, -74, -45, 80, 105, -23, -107, -52, 83, 98, -1, -103, -49, 60, 102, 42, -84, -68, 39, 80, -13, -89, -42, 47, 84, 13, -102, -85, 40, 79, -12, -122, -95, 48, 91, -2, -97, -108]
3914a08J23Q0m0j82NJ97J3n5j08k7J29J11r4j32K5J06N9p3j06l2J26N7j7j53k1
3939a17J50Q5r6j13J6R3R7m9j22o9J10R4l2j25j8J07M9M2j49q0J12J08l9j23l9
3964a08R3R8k4j24m3P4J24J6j62p2R4J37j1r5p9K7J59J9j57j06P7J60l0j13o4
3989a10N7J15Q0j55j10O8J56oj08j13O0J44K6j07j26J6J80M1j30r3M5J07M7m3
4013D1j31J9J24Q7j17j52N4J00P4o1j10j7J38R1j14j32L3J45M5p4j20k5J07J10
4037A15o9j32j9J06J02m9j26pL1J59mj76m7J35P9n2j13mO7Q6j6j34n2J05J24k4
4063H5j86J3J10O1oq5r8O1J44j6j24q5R3J33k1j03n4L7J22L7j62j12J43R2k7r5
4089d3o5K5J29Q7j46j15Q3J50j9j04p0K8J10N5j07j47R8J25Qj21o9M6J10R0j11
$$ y = [-108, 15, 95, 55, -127, -122, 75, 88, 33, -75, -102, 27, 138, 44, -88, -63, 43, 102, 29, -77, -109, 17, 74, 57, -96, -117, 33, 118, 22, -91, -75, 18, 115, 66, -56, -125, -15, 79, 47, -78, -96, 11, 60, 102, -47, -127, -15, 93, 54, -69, -108, -15, 83, 59, -65, -108, -34, 90, 106, -56, -128, -34, 103, 92, -3, -82, -55, 104, 123, -34, -140, -63, 97, 67, -46, -110, -53, 62, 142, -13, -123, -55, 101, 95, -13, -126, -66, 78, 104, -3, -129, -113, 67, 108, -22, -115, -70, 37, 84, 41, -90, -71, 53, 140, 23, -129, -75, 25, 99, 38, -72, -89, 49, 140, 26, -106, -73, 72, 117, 43, -77, -102, 5, 115, 46, -86, -105, 1, 103, 54, -72, -79, -48, 111, 107, -69, -116, 19, 98, 46, -67, -71, -4, 82, 66, -68, -120, -15, 109, 85, -101, -88, 22, 83, 77, -8, -106, -45, 99, 83, -41, -126, -33, 100, 79, -24, -78, -41, 81, 118, -44, -156, -13, 79, 52, -43, -108, -83, 46, 133, -13, -128, -45, 105, 86, -18, -88, -60, 50, 105, -2, -149, -51, 74, 82, -39, -108, -62, 48, 138, 27]
4114B7j21J0J53R4j52r8K0J20L6p0j41KJ52P9q6j43NJ46M6m0r5n5J24J27q5j90
4140a35M0J06R6n9j11n5J26J24j4k18n1J83J01p2j27o3Q4J61k7j71j18J56J83
4163A39o2j42o8J00J32Kj21j00N9J91rj67r6R2J40kj23r6M9K21Pj99j04J05J78
4188A26m4j00j31M6K04N4j81j19J04J42Oj16j21K7J94N6j28j75J11J49Nj30j07
4211a28M0J04J18r2j83LK35P2j59j19kJ51Q9o4j57n9J69J19j00j64M4J08P9l3
4235G1j81o9K06J55j07j88k0J71P4l5j81n3J47J52l7k31nJ69R4n0j47p9Q0J85
4259A21j4k30n4J62J62n6j75o7J15J62qj83j28J91J47m3j66o4P3J38M1j63j41
4282a80J00K47n0j55p3P7J59mj11j50K0K21L7j75j54J01J96K5j35j61L3K29Q8
$$ y = [27, -94, -84, 69, 163, 11, -87, -67, 53, 89, 19, -122, -120, 32, 111, 25, -118, -113, 33, 79, 39, -56, -111, 13, 140, 55, -135, -95, 11, 107, 48, -63, -118, 8, 132, 118, -100, -151, 32, 133, 61, -66, -129, -45, 116, 89, -82, -200, -44, 139, 77, -65, -133, -33, 99, 101, -20, -120, -61, 130, 121, -46, -142, -50, 90, 88, -35, -131, -82, 139, 146, -53, -157, -52, 126, 82, -18, -149, -103, 101, 155, -26, -145, -41, 101, 107, -9, -130, -103, 91, 147, 19, -156, -45, 104, 109, -21, -128, -88, 16, 134, 42, -141, -138, 97, 169, 10, -109, -111, 40, 129, 65, -92, -151, 18, 137, 37, -127, -83, 25, 104, 71, -110, -179, 27, 182, 75, -113, -133, 38, 112, 77, -104, -157, -10, 142, 105, -126, -131, 38, 132, 82, -65, -144, -64, 121, 107, -123, -177, -15, 147, 91, -84, -151, -36, 126, 118, -65, -193, -2, 145, 102, -64, -128, -55, 83, 124, -39, -180, -80, 167, 117, -38, -111, -34, 125, 121, 10, -140, -120, 101, 138, -37, -191, -90, 106, 131, -4, -165, -132, 97, 185]
4305A85j86j68J07J58L1j13j35k8J80J72j69j91L9K18P6j39j41PJ23J39p7k72
4327a84j6K71J11j39j52l4J37J53o4k11p9K53J64j27k65N1J30J52l8k07j28K01
4349b1K16j26k02k4J61J45j8j85j09J37J79j4k41p5J95J11j6j51j23O8K54j5k29
4372h3j31J67J82Jk14r3R6J76N8j77k27J39K47j9j60j20P1J90O3j56k21N6K89
4395A34M8k36j06J27J18Q6j61j86M5K47R9j96k17J08K07N1j20j68o7K56J25j78
4417A6k52R3K36O3j09j50m3J85J60j12k85L3K53J12j85j41J1J14K26p7l34j7K89
4440H6J20j16k35l0K05J77p2k59j21K53J99j21k32QJ45J69n0k25r4K09J96q1k75
4463a44o0K19J44o0j82j40J57K59j3k94j34K09K07J2k33j35J03K27N9k14k26J49
$$ y = [185, -1, -169, -62, 96, 127, 14, -121, -149, 31, 203, 34, -157, -118, 100, 176, 37, -104, -97, 26, 165, 88, -184, -200, 71, 182, 43, -109, -143, -6, 147, 83, -128, -207, 46, 210, 83, -182, -131, -1, 151, 113, -94, -222, -21, 195, 69, -133, -157, 4, 149, 131, -54, -163, -26, 153, 139, -102, -177, 18, 129, 113, -38, -161, -93, 161, 146, -83, -214, -47, 135, 136, -78, -171, -75, 101, 159, -18, -245, -106, 141, 122, -38, -158, -87, 103, 166, 10, -211, -155, 134, 182, -54, -160, -33, 85, 171, 10, -176, -131, 116, 215, 19, -198, -90, 117, 168, 48, -120, -187, 69, 194, 16, -236, -143, 93, 156, 47, -103, -146, 39, 199, 87, -198, -165, 88, 200, 15, -126, -115, -1, 225, 148, -186, -203, 86, 206, 90, -145, -175, 30, 207, 135, -124, -245, 8, 207, 86, -146, -138, 7, 176, 126, -99, -193, 16, 212, 131, -144, -204, 15, 159, 99, -83, -223, -66, 193, 180, -114, -248, -39, 168, 180, -53, -188, -85, 142, 201, -13, -239, -90]
4485i0K66l7j81j42Q5K46J07k82j94J17K82Kk26j82J15K78M7j91k82O1L69J10
4507B78k75k15Q3J96J42j30k72J1K77J03j69k55P5K51N8j35j68k9K48J85k07k83
4529b31P5K39J14j23k44k5K38J98j07l32l7K99J64j54k04m9J69K44q0k97p1K51
4551C7J65j45k04k0J63J91l0k56j52K68K36j42k41n5J76J94Pk79j76K02L23q3
4573A79k74j42K12K18m2j87j95J43L33j0l22j61J92K43j5k68j41J53K79M1k58
4594b2k54J89L17p0k30j74J09K89J15k70k91J78L25kk79j55J30K16R6j89k49L3
4616a88L64P9k91k19J21K61R0j62k75K2L35J73k97k68R8K58P8r8k60l1K66K31
4638B87j96k87LK54J63j61k59k8L05K14j70l14m9L45J74k18k53l5K00K84q2l26
$$ y = [-90, 176, 139, -42, -184, -99, 147, 254, -28, -222, -105, 177, 179, -47, -229, -114, 164, 211, 20, -262, -201, 168, 278, 3, -212, -129, 67, 209, 79, -193, -182, 95, 198, 29, -226, -151, 100, 158, 23, -145, -174, 74, 259, 52, -231, -156, 83, 197, 74, -170, -195, 43, 241, 134, -198, -235, 64, 228, 74, -130, -179, -10, 234, 154, -143, -214, 37, 202, 57, -147, -167, -4, 187, 157, -99, -251, 17, 253, 111, -130, -185, -9, 185, 192, -87, -263, -61, 262, 179, -95, -237, -25, 193, 151, -36, -231, -88, 245, 235, -87, -248, -56, 187, 172, -96, -237, -84, 195, 236, -22, -276, -87, 230, 160, -70, -244, -135, 154, 269, -1, -292, -114, 211, 209, -70, -225, -95, 121, 217, 28, -221, -188, 176, 255, -36, -255, -134, 127, 217, 55, -220, -198, 137, 310, 13, -255, -157, 101, 179, 81, -179, -210, 56, 287, 91, -196, -193, 61, 224, 63, -196, -224, 81, 295, 125, -189, -238, 107, 281, 63, -190, -225, -25, 259, 177, -149]
4660a49j01K73K76j88l26k0K39K17l9l12j61L02K75j14l31j09K82K23p6k73j86
4681b98K38L54p8l57j68K64K73n7k63j77J83L25j9l06k02K42K97l9k89j76J32
4702a21L05N9k92k13J89L11k8k92j62J06K86J12k59k99J57L34O2k81k33J50K21
4723A12J13k03k57M4L59Q8k59k76J10K80J24k15k37J4L32J71k54k93P2L19J15
4744B59j96k92oL32K20k15l56J3L69J42k02k86pK71K40j65l50o0L67K19k13k87
4766b03k2K70K33j07l65r3L23K82k07k77m7K11K55q2k77j60K49L12j33l31j13
4787b82K69K87j11k88j52K39K95k5l79j54K83K60n6k78j78J54L49Ll41k31K52
4808h4L39l3l09j92J56L35O3l30k26J71L42K0k93k28J24L22J01k97k73J14M13
$$ y = [-149, -250, 23, 299, 111, -215, -235, 4, 221, 182, -130, -291, 11, 286, 172, -159, -268, 14, 237, 161, -112, -298, -60, 294, 216, -141, -309, -45, 228, 171, -92, -269, -86, 239, 220, -86, -288, -46, 251, 212, -77, -253, -121, 184, 243, -49, -262, -73, 238, 210, -82, -244, -138, 148, 260, 1, -298, -141, 193, 255, -26, -259, -109, 112, 225, 22, -235, -191, 168, 256, -3, -279, -169, 111, 235, 20, -217, -203, 129, 300, 46, -247, -175, 144, 259, 63, -229, -235, 97, 317, 102, -254, -241, 128, 270, 68, -218, -225, 46, 286, 121, -229, -289, 78, 297, 84, -203, -225, 45, 278, 171, -194, -287, 36, 318, 111, -166, -213, -2, 253, 171, -106, -266, -17, 295, 162, -169, -282, -13, 274, 163, -125, -277, -38, 257, 232, -147, -301, -18, 242, 186, -92, -270, -116, 233, 236, -105, -336, -84, 255, 222, -87, -279, -123, 212, 275, -55, -281, -110, 232, 252, -41, -269, -145, 177, 278, -19, -292, -178, 235]
4829B35L9k93k67J39L43O6k31l14P3L90J41l15l00J25L19J21k31l04K8L32K23
4850C19k82l20P6L24J45k16k85RK94K38k16l39M4L24J89k45k84J3K93K05j74l55
4872b43m7L62K15j96l01QK27K19q5l62o7L17K33j68k93n7K67K23p2l28j57K89
4894a6L14j53l27j12L17K11p9l09j22K57K86m7l72j58K76L25q4l58j24J90L32
4915B47K6l89k06K34L54m5l06j97K06K86L2k94k96K18L86k0l30j69J42K98R6k86
4937a3l10J50M06R0l70k49J33L76O9k75k91R6L60J49l28l05J74L22J00k64k80
4958b60O6L62J56k84l37J07L83J14k80k67oL67K19k43l83N0L28K12k33k95k9L56
4980A03K03j86l79k4L65K37k25l09k6L06K36j58l81o9L31L04j68l73p1L19K62
$$ y = [235, 274, -19, -286, -147, 196, 262, 31, -283, -210, 180, 321, 6, -294, -169, 150, 271, 40, -264, -236, 96, 319, 37, -283, -207, 117, 262, 46, -239, -230, 64, 302, 86, -253, -209, 115, 304, 59, -225, -212, 81, 286, 112, -243, -290, 72, 287, 91, -210, -202, 25, 244, 159, -203, -270, 47, 280, 112, -181, -238, 29, 252, 180, -148, -305, -16, 298, 145, -182, -294, 23, 234, 155, -154, -276, -19, 267, 220, -152, -310, -34, 291, 207, -151, -275, -85, 247, 273, -116, -322, -88, 266, 221, -85, -282, -76, 210, 242, -52, -348, -130, 256, 236, -94, -263, -121, 177, 273, -13, -323, -173, 233, 323, -47, -296, -163, 213, 282, 7, -284, -188, 172, 321, -7, -312, -138, 184, 284, 20, -260, -194, 168, 324, 40, -297, -190, 193, 307, 27, -240, -246, 121, 340, 97, -286, -236, 92, 304, 71, -224, -253, 103, 306, 120, -259, -283, 82, 319, 94, -215, -241, 65, 301, 143, -238, -307, 24, 328, 160, -213, -284, 35, 297]
5001B97j14l70j32L05L04j09l86q3K81L11j38k89j68K55L32r6l66j55K97L20j16
5022A80l19j50K26L12J6l97k07K60L52l2l31k28K14L57J6l18k49J82L50K8l56
5043i4j94J67L22O5l33k37J70L72L4l44k41J61L51N4k90k86J49L77J13l34l29
5064c47J57L60J15k87k70O2L62J41k60l24R9L52J51k85l08P8L09K24k36m03O0
$$ y = [297, 183, -187, -319, -14, 290, 181, -205, -288, -7, 304, 166, -123, -291, -36, 296, 200, -166, -321, -24, 296, 180, -139, -289, -63, 249, 265, -132, -339, -79, 273, 241, -90, -318, -104, 253, 269, -49, -298, -116, 234, 262, -94, -288, -121, 201, 266, -67, -304, -134, 238, 272, -72, -313, -152, 199, 253, -37, -323, -174, 203, 316, -18, -347, -190, 170, 285, -2, -272, -210, 152, 293, 33, -291, -192, 160, 311, 26, -282, -204, 105, 329, 93, -310, -250]
$$ [...]
8191f9
##END NTUPLES=NMR FID
##END=
