##TITLE=1H_AM_NVBuMA223.1(2)
 CDCl3
 8 sc, 
 17.10.2022
##JCAMPDX= 6.0         $$ Bruker NMR JCAMP-DX V2.0
##DATA TYPE= NMR FID
##DATA CLASS= NTUPLES
##ORIGIN= UXNMR, Bruker Analytische Messtechnik GmbH
##OWNER= root
$$ XWIN-NMR		Version 3.5
$$ Mon Oct 17 16:22:18 2022 Russian Standard Time (UT+4h)  she@DPX200
##.OBSERVE FREQUENCY= 200.1313499994
##.OBSERVE NUCLEUS= ^1H
##.DELAY= (6, 6)
##.ACQUISITION MODE= SIMULTANEOUS
##.ACQUISITION SCHEME= undefined
##.AVERAGES= 8
##.DIGITISER RES= 18
##SPECTROMETER/DATA SYSTEM= spect
##.PULSE SEQUENCE= zg30
##.SOLVENT NAME= CDCl3
##.SHIFT REFERENCE= (INTERNAL, CDCl3, 0, 15.7039)
##AUDIT TRAIL= $$ (NUMBER, WHEN, WHO, WHERE, WHAT)
$$ ##TITLE= Audit trail, XWIN-NMR		Version 3.5
$$ ##JCAMPDX= 5.01
$$ ##ORIGIN= Bruker BioSpin GmbH
$$ ##OWNER= she
$$ F:/spectra/data/she/nmr/H-F/1/audita.txt
$$ ##AUDIT TRAIL=  $$ (NUMBER, WHEN, WHO, WHERE, WHAT)
(   1,<2022-10-17 16:20:26.62 +0400>,<she>,<DPX200>,
      <created by zg, POWCHK disabled, PULCHK disabled
       configuration hash MD5:
       00 E9 B6 7A A2 85 ED C7 34 08 36 98 17 FE 4E 26
       data hash MD5: 16K
       23 93 E0 4F AD 58 A1 56 69 D8 A6 F1 B4 75 40 E9>)
$$ ##END=
$$ 
$$ hash MD5
$$ 04 2F B5 AD C4 C1 4B 0A D3 22 67 70 0F 51 BC 24
##$RELAX= 
##$RELAX= 
##$RELAX= 
##$RELAX= 
##$RELAX= 
##$RELAX= 
$$ Bruker specific parameters
$$ --------------------------
##$DU= <F:/spectra>
##$EXPNO= 1
##$NAME= <H-F>
##$PROCNO= 1
##$TYPE= <nmr>
##$USER= <she>
##$AMP= (0..31)
100 100 100 100 100 100 100 100 100 100 100 100 100 100 100 100 100 100 
100 100 100 100 100 100 100 100 100 100 100 100 100 100 
##$AQSEQ= 0
##$AQ_mod= 1
##$AUNM= <au_zg>
##$AUTOPOS= <>
##$BF1= 200.13
##$BF2= 200.13
##$BF3= 200.13
##$BF4= 200.13
##$BF5= 200.13
##$BF6= 200.13
##$BF7= 200.13
##$BF8= 200.13
##$BYTORDA= 1
##$CFDGTYP= 0
##$CFRGTYP= 5
##$CHEMSTR= <none>
##$CNST= (0..31)
1 1 145 1 1 1 1 1 1 1 1 1 1 1 1 1 1 1 1 1 1 1 1 1 1 1 1 1 1 1 1 1 
##$CPDPRG= <>
##$CPDPRG1= <>
##$CPDPRG2= <>
##$CPDPRG3= <>
##$CPDPRG4= <mlev>
##$CPDPRG5= <mlev>
##$CPDPRG6= <mlev>
##$CPDPRG7= <mlev>
##$CPDPRG8= <mlev>
##$CPDPRGB= <>
##$CPDPRGT= <>
##$D= (0..31)
0 1.2 0 0 0 0 0 0 0 0.06 0 0.03 0 0 0 0 0.0002 0 0 0 0 0 0 0 0 0 0 0 0 
0 0 0 
##$DATE= 1666009226
##$DBL= (0..7)
120 120 120 120 120 120 120 120 
##$DBP= (0..7)
150 150 150 150 150 150 150 150 
##$DBP07= 0
##$DBPNAM0= <>
##$DBPNAM1= <>
##$DBPNAM2= <>
##$DBPNAM3= <>
##$DBPNAM4= <>
##$DBPNAM5= <>
##$DBPNAM6= <>
##$DBPNAM7= <>
##$DBPOAL= (0..7)
0.5 0.5 0.5 0.5 0.5 0.5 0.5 0.5 
##$DBPOFFS= (0..7)
0 0 0 0 0 0 0 0 
##$DE= 6
##$DECBNUC= <off>
##$DECIM= 32
##$DECNUC= <off>
##$DECSTAT= 4
##$DIGMOD= 1
##$DIGTYP= 9
##$DL= (0..7)
0 120 120 120 120 120 120 120 
##$DP= (0..7)
150 150 150 150 150 150 150 150 
##$DP07= 0
##$DPNAME0= <>
##$DPNAME1= <>
##$DPNAME2= <>
##$DPNAME3= <>
##$DPNAME4= <>
##$DPNAME5= <>
##$DPNAME6= <>
##$DPNAME7= <>
##$DPOAL= (0..7)
0.5 0.5 0.5 0.5 0.5 0.5 0.5 0.5 
##$DPOFFS= (0..7)
0 0 0 0 0 0 0 0 
##$DQDMODE= 0
##$DR= 18
##$DS= 0
$$ [...]
##$SUBNAM2= <"">
##$SUBNAM3= <"">
##$SUBNAM4= <"">
##$SUBNAM5= <"">
##$SUBNAM6= <"">
##$SUBNAM7= <"">
##$SUBNAM8= <"">
##$SUBNAM9= <"">
##$SW= 18.0517283424941
##$SWIBOX= (0..15)
0 0 2 0 0 0 0 0 0 0 0 0 0 0 0 0 
##$SW_h= 3612.71676300578
##$TD= 16384
##$TD0= 1
##$TE= 0
##$TE2= 300
##$TE3= 300
##$TEG= 300
##$TL= (0..7)
0 120 120 120 120 120 120 120 
##$TP= (0..7)
150 150 150 150 150 150 150 150 
##$TP07= 0
##$TPNAME0= <>
##$TPNAME1= <>
##$TPNAME2= <>
##$TPNAME3= <>
##$TPNAME4= <>
##$TPNAME5= <>
##$TPNAME6= <>
##$TPNAME7= <>
##$TPOAL= (0..7)
0.5 0.5 0.5 0.5 0.5 0.5 0.5 0.5 
##$TPOFFS= (0..7)
0 0 0 0 0 0 0 0 
##$TUNHIN= 0
##$TUNHOUT= 0
##$TUNXOUT= 0
##$USERA1= <user>
##$USERA2= <user>
##$USERA3= <user>
##$USERA4= <user>
##$USERA5= <user>
##$V9= 5
##$VALIST= <valist>
##$VCLIST= <CCCCCCCCCCCCCCC>
##$VD= 0
##$VDLIST= <DDDDDDDDDDDDDDD>
##$VPLIST= <PPPPPPPPPPPPPPP>
##$VTLIST= <TTTTTTTTTTTTTTT>
##$WBST= 1024
##$WBSW= 4
##$XGAIN= (0..3)
0 0 0 0 
##$XL= 0
##$YL= 0
##$YMAX_a= 503191
##$YMIN_a= -253690
##$ZGOPTNS= <>
##$ZL1= 120
##$ZL2= 120
##$ZL3= 120
##$ZL4= 120
##$ABSF1= 10
##$ABSF2= 0
##$ABSG= 5
##$ABSL= 3
##$ALPHA= 0
##$AQORDER= 0
##$ASSFAC= 0
##$ASSFACI= 0
##$ASSFACX= 0
##$ASSWID= 0
##$AUNMP= <proc_1d>
##$AZFE= 0.1
##$AZFW= 0.1
##$BCFW= 1
##$BC_mod= 2
##$BYTORDP= 1
##$COROFFS= 0
##$CY= 11.3945322036743
##$DATMOD= 1
##$DC= 2
##$DFILT= <>
##$DTYPP= 0
##$F1P= 2.36226072786647
##$F2P= -0.459571619588291
##$FCOR= 0.5
##$FTSIZE= 0
##$FT_mod= 4
##$GAMMA= 1
##$GB= 0.15
##$INTBC= 1
##$INTSCL= 1
##$ISEN= 128
##$LB= 0.24
##$LEV0= 0
##$LPBIN= 0
##$MAXI= 10000
##$MC2= 0
##$MEAN= 0
##$ME_mod= 0
##$MI= 1.114404
##$NCOEF= 0
##$NC_proc= 0
##$NLEV= 6
##$NOISF1= 3.799351
##$NOISF2= 2.8
##$NSP= 1
##$NTH_PI= 0
##$NZP= 0
##$OFFSET= 15.70392
##$PC= 1
##$PHC0= -18180.38
##$PHC1= -3.999313
##$PH_mod= 1
##$PKNL= yes
##$PPARMOD= 0
##$PSCAL= 0
##$PSIGN= 0
##$REVERSE= no
##$SF= 200.130013532006
##$SI= 16384
##$SIGF1= 3
##$SIGF2= 2
##$SINO= 400
##$SIOLD= 16384
##$SREGLST= <1H.CDCl3>
##$SSB= 0
##$STSI= 0
##$STSR= 0
##$SW_p= 3612.71676300578
##$SYMM= 0
##$S_DEV= 0
##$TDeff= 0
##$TDoff= 0
##$TI= <>
##$TILT= no
##$TM1= 0
##$TM2= 0
##$TOPLEV= 0
##$USERP1= <user>
##$USERP2= <user>
##$USERP3= <user>
##$USERP4= <user>
##$USERP5= <user>
##$WDW= 1
##$XDIM= 8192
##$YMAX_p= 0
##$YMIN_p= 0
$$ End of Bruker specific parameters
$$ ---------------------------------
##NTUPLES= NMR FID
##VAR_NAME=  TIME,          FID/REAL,        FID/IMAG
##SYMBOL=    X,             R,               I
##VAR_TYPE=  INDEPENDENT,   DEPENDENT,       DEPENDENT
##VAR_FORM=  AFFN,          ASDF,            ASDF
##VAR_DIM=   8192,          8192,            8192
##UNITS=     SECONDS,       ARBITRARY UNITS, ARBITRARY UNITS
##FACTOR=    0.0002768,     1,               1
##FIRST=     0,             0,               0
##LAST=      2.2672688,     0,               0
##MIN=       0,             -253690,         0
##MAX=       2.2672688,     503191,          0
$$ Real data points
##PAGE= N=1
##DATA TABLE= (X++(R..R)), XYDATA
$$ [...]
2306A194K882k606m022p01K180L357J437l074l812P95L690J829j910l444r25K575
$$ 1194 4076 1470 -2552 -3253 -1073 2284 3721 647 -3165 -2370 1320 3149 1239 -2205 -3130 -555
2322e55K984J70k706l045P16M189K390k493m113j015K476L311R97l184l811M79
$$ -555 2429 2599 -107 -3152 -2436 1753 4143 1650 -2463 -3478 -1002 2309 3306 122 -3689 -3210
2338c210M182K826j614l565j526J766L086R99k390l430k20L563K797j541l533
$$ -3210 972 3798 2184 -1381 -2907 -1141 1945 2944 554 -2876 -3096 467 3264 1723 -1810
2353a810j166K491K982O01k543l521j39L890K738j848l461j547J645L638J734
$$ -1810 -2976 -485 2497 3098 555 -2966 -3105 785 3523 1675 -1786 -3333 -1688 1950 3684
2368C684k453l807n80L342L222j051l871j815J746K996J193j784l099n89L377
$$ 3684 1231 -2576 -3156 186 3408 2357 -1514 -3329 -1583 1413 2606 822 -2277 -2866 511
2383E11K949j367l364j519J307L039J613k426l612k98L204L451o24m076j892J966
$$ 511 3460 2093 -1271 -2790 -1483 1556 3169 743 -2869 -3167 37 3488 2864 -1212 -3104 -1138
2399a138K622J334j305l826j285L352K947n99k765k110J098L209J481j668l232
$$ -1138 1484 2818 1513 -2313 -3598 -246 2701 2102 -663 -2773 -1675 1534 3015 1347 -1885
2414a885j187K848L202p55l335j930J238L056J810j556l206j285K371L554q4l561
$$ -1885 -3072 -224 2978 2223 -1112 -3042 -1804 1252 3062 1506 -1700 -2985 -614 2940 2856 -705
2430g05k353J025K744J773r96k986j488K355L500j25l182j929P58K244J818q71
$$ -705 -3058 -2033 711 2484 1488 -1498 -2986 -631 2869 2744 -438 -2367 -1609 635 2453 1582
2446A582l389j403K365L226N05l048k564J053K593J660n52l299k197K281L319
$$ 1582 -1807 -3210 -845 2381 2886 -162 -2726 -1673 920 2580 2028 -1271 -3468 -1187 2132
2461B132K68k304k424J05K885J971q48k350k293J357L678N00l005k078L62K125
$$ 2132 2400 96 -2328 -2223 662 2633 1785 -565 -2858 -1501 2177 2677 -328 -2406 -2044 81
2477H1K428n30l014j670J593L093J064k713k829L29K397J957k25k646k194J367
$$ 81 2509 1979 -1035 -2705 -1112 1981 3045 332 -2497 -2168 229 2186 1961 -685 -2879 -1512
2493a512L454J015k461k568Q3K045K015k62k625k049J109L173J430k303k820K94
$$ -1512 1942 2957 496 -2072 -1989 56 2071 1809 -816 -2865 -1756 1417 2847 544 -2276 -1982
2509a982K390J684Q1k422k732J174L366R76j945k427m73K186K363j93k065k250
$$ -1982 408 2092 2173 -249 -2981 -1807 1559 2535 590 -1837 -2310 -124 2239 2046 -19 -2269
2525b269J86L285J762k509k584M5J662K204L41k434k127J116K634J367j629k888
$$ -2269 -2083 1202 2964 455 -2129 -2084 -422 1782 2123 -311 -2438 -1322 1312 2679 1050 -1838
2541a838n13K118J825K30j730k542K19L409J699j927k576l96J605K130K09k009
$$ -1838 -2351 -233 1592 1822 92 -2450 -2231 1178 2877 950 -1626 -2022 -417 1713 1922 -87
2557h7k098J63K566J969j333k682n06J755J881N35j794k710J80K880J760j441
$$ -87 -2185 -2022 544 2513 1180 -1502 -2008 -253 1628 2163 369 -2341 -2161 719 2479 1038
2573A038k640o56J791K073L12j430k130n32K607K220j351k729p50J262K262Q18
$$ 1038 -1602 -2258 -467 1606 1918 488 -1642 -2174 433 2653 1302 -1427 -2177 -915 1347 2165
2589B165j796k357J28K407J828r11k831q43J793J501L43q90k246p66K859K280
$$ 2165 369 -1988 -1860 547 2375 1464 -1367 -2210 -417 1084 1427 537 -1709 -2475 384 2664
2605B664j321k258r93R98K464P23k030j995j69J799K354n94k841q08J576J345
$$ 2664 1343 -915 -1908 -910 1554 2277 247 -1748 -1917 -118 2236 1642 -1199 -2007 -431 914
2621I14R15p29k569q32K245K128o29k332j393J388K230M40j279j710o21J809K214
$$ 914 1829 1100 -1469 -2301 -56 2072 1443 -889 -2282 -894 1336 1776 497 -1213 -1834 -25 2189
2638B189o03k580r62J147J598Q92p85k194q82K015K342m23k353j372J001J907
$$ 2189 1586 -994 -1956 -809 789 1681 896 -1298 -2180 -165 2177 1754 -599 -1971 -970 937
2654I37O45r57j763q02J579K212k56k075j190P36J807Q36j043j815q97J345K605
$$ 937 1582 625 -1138 -1940 -361 1851 1595 -480 -1670 -934 873 1709 666 -1149 -2046 -701 1904
2671A904m0k829j089J369J393J026n10k420q61J818J680J78j661j845N75K116
$$ 1904 1864 -965 -2054 -685 708 1734 1224 -1196 -2057 -239 1441 1619 -42 -1887 -1312 804
2687H04P62p11j393j368J158K528p7k317j089P41J410J032o96j840o39J276J861
$$ 804 1566 855 -538 -1906 -748 1780 1703 -614 -1703 -962 448 1480 784 -1056 -1695 -419 1442
2704A442M48j854j921O56K021P52o34j474j393Q58K595L80k110j262N23J226J077
$$ 1442 1890 36 -1885 -1229 792 1544 910 -564 -1957 -1099 1496 1876 -234 -1496 -973 253 1330
2721A330m04j571r51P65J871O90j794j641O73J719P85l82j605j243R95K151M47
$$ 1330 926 -645 -1596 -831 1040 1730 -64 -1705 -1032 687 1472 1090 -515 -1758 -763 1388 1835
2738A835j813j696L76J631R22j71j228j460M65K166O48j480j413J3J259J216m43
$$ 1835 22 -1674 -1298 333 1255 1084 -144 -1604 -1139 1027 1675 195 -1218 -1205 54 1270 827
2755H27j299q33O01J615Q26j632j656M45J556O89j20j308j539N95K143Q48j224
$$ 827 -472 -1305 -704 911 1737 105 -1551 -1106 450 1139 1019 -289 -1828 -1233 910 1758 534
2772E34j726l43J544J369k19j211j030k6J414J320j124j756K72J219N24J26r30
$$ 534 -1192 -1535 9 1378 1159 -52 -1082 -1108 306 1626 502 -1254 -982 237 761 887 -43
2789d3j272M11J627P39j186j663j32J639J189l38j167j092m0J883J401j131j912
$$ -43 -1315 -904 723 1462 276 -1387 -1519 120 1309 971 -196 -1288 -1328 555 1956 825 -1087
2806a087j56J084R06K91p54j334r6J408J047o64j477j93J081P67m3r01j088K64
$$ -1087 -1243 -159 747 1038 284 -1050 -1146 262 1309 645 -832 -1025 56 823 780 -121 -1209 -945
2824i45J584Q28r98j524l00J286J373j57j042j204k93J493J499p31j648n03P51
$$ -945 639 1467 469 -1055 -1355 -69 1304 1147 105 -1099 -1392 101 1600 869 -779 -1282 -531
2841e31J180M29q42j016q5Q07J033k02j568l51J277P03k86m94q65k34J388J334
$$ -531 649 1078 236 -780 -865 -58 975 773 -795 -1146 131 834 548 54 -811 -1045 343 1677
2859A677r48j713l61R98J163L30q23j270l87J138J404m8j525q17P89Q25K96j84
$$ 1677 729 -984 -1345 -347 816 1146 323 -947 -1334 -196 1208 1160 -365 -1182 -393 432 728 544
2877E44r97o77J037J154m38j132m98O75J093N7q49p88j53Q74J286j89j722o00
$$ 544 -453 -1130 -93 1061 623 -509 -1007 -332 761 818 -31 -819 -972 -98 1188 999 -723 -1323
2895a323P80J189M54n97j042o04P68J427K17j538q87P86Q19K32k97p12n86P04
$$ -1323 -543 646 1100 503 -539 -1143 -375 1052 1269 -269 -1156 -370 449 681 384 -328 -914 -210
2913b10J107r2j172o43O15R65K26n53q76m57Q13J337O3j489q02O39J008M03l05
$$ -210 897 805 -367 -1010 -395 570 796 243 -633 -1090 -277 1060 1123 -366 -1168 -529 479 882 577
2932E77r59p02N94J175K54q83r17J68J063L33m66m35m71K63J120K63j301o09N19
$$ 577 -382 -1084 -490 685 939 56 -861 -693 370 703 237 -198 -669 -406 714 977 -324 -933 -414
2951d14Q16L60l30q52m66N11R80N25j085j200M30J110K11k05m86p63K06J200M86
$$ -414 402 762 432 -420 -886 -375 605 1130 45 -1155 -725 385 596 391 -95 -858 -652 548 1034
2970A034r61q31K25O58N28k09o25n00J45J079M80j021r53M05Q03L64j12p01o90
$$ 1034 73 -758 -533 125 653 444 -181 -681 -536 543 1023 2 -951 -546 257 621 509 -192 -882
2989h82L14J083M32o86r72j1Q82N68k55n18n24n6R07O68p92q90J71O33M54m8p18
$$ -882 -568 515 947 261 -711 -722 160 728 473 -45 -569 -625 282 950 158 -732 -561 72 526 478 -240
3010b40m25J64P28O89n79j168P7R58L83j67l93o72K5R48N83n80q44j55O17O56
$$ -240 -665 -501 227 916 337 -831 -754 204 587 420 27 -645 -620 328 911 331 -513 -668 -51 605
3030F05j21m38n27j42P48P90n12j101Q9P11K70K9l34o72Q2P75M85k72r20l20O78
$$ 605 484 46 -481 -623 125 915 403 -698 -609 102 372 401 67 -605 -523 252 737 465 -455 -775 -97
3051i7N54p6k58n10m10P81Q29m55q03j41L97N64J91n88l92l8M33O46l2j006l82
$$ -97 457 381 123 -387 -797 -16 813 358 -445 -586 -189 375 566 -22 -414 -452 -19 627 595 -411 -793
3072g93P34M78J1j86o07l90O90P72k23p74l67M25N89J18l55m16k40K94Q51L1r43
$$ -793 -59 419 430 244 -363 -753 -63 709 486 -288 -655 -230 359 477 122 -294 -534 -240 611 642 -301
3093c01l37N25L68K12j02p59k56O17N84n9o65m78L79N98O8k49k78n03K69R58O3
$$ -301 -638 -113 255 467 365 -394 -650 -33 551 492 -173 -651 -272 326 394 145 -133 -636 -367 591 654
3114F54p86m49K95M87L43k91m75k62K36P33J45p66m04L13L80J71M4m89m54K97
$$ 654 -132 -581 -286 201 544 253 -222 -484 -248 485 630 -136 -540 -227 153 324 368 -121 -575 -278
3134b78O90J71o26o03K06P21K29l31l32m26J95Q03J49o79k67O2K90L18J35n07
$$ -278 412 583 -43 -646 -440 281 510 179 -153 -579 -384 419 568 -111 -378 -316 -26 292 427 -80
3154h0m80K95N07L39l40p32M4P11J47k85q1m65M5O98K06m31n22k0M24M45o4m07
$$ -80 -560 -265 242 581 241 -491 -447 264 411 126 45 -420 -375 323 529 98 -424 -444 -20 425 361 -46
3176d6m54k1O11O67n25q26J88M40J31J53j23o60J2O02L66k46n05j06J87M68J33
$$ -46 -500 -521 90 757 232 -594 -406 34 165 318 195 -465 -453 149 515 269 -236 -342 -155 313 446
3197D46m38m49P7N51M16l58o09m4L65L78J1k58m17k48N48O76k33p08k58M15L06
$$ 446 8 -441 -364 187 603 245 -364 -408 -43 335 346 88 -329 -577 -29 647 414 -294 -552 -137 169
3218A69L08k26p27j4M91M15j39l79l58K67M46O1k32k71j81K24O85p9q10j93M35
$$ 169 477 251 -476 -490 1 416 277 -102 -460 -193 253 314 82 -189 -370 -146 539 460 -350 -543 -108
3239a08L18K12k03o18j14M31N87Ln79n05L36M37J41K3l71n59K64Q43j18n87o9
$$ -108 210 422 219 -399 -513 -82 505 508 -71 -576 -240 197 338 361 -10 -569 -305 538 420 -167 -236
3260b36M0J11M70j33n78k33N54L68On33l23J33M91M07k66m93l27L03O38K19m34
$$ -236 -196 -85 385 252 -326 -559 -5 363 369 -164 -487 -354 137 544 278 -215 -542 -239 399 618 184
3281A84o01n0N03M12n5l96m26J53N00K79l65n39N2N14J91j02l70k45N5O06L52
$$ 184 -417 -467 36 448 393 -3 -429 -276 224 503 138 -401 -349 165 356 254 -116 -361 -306 300 652
3302F52o66n45J97M16L06Q1m04p32J94Q33J54l49m04k28K49O85L2m18m72R2M75
$$ 652 -14 -559 -362 54 360 441 37 -695 -501 332 486 137 -267 -495 -246 439 471 53 -419 -327 148
3323A48L45l65m46l1L55L35P1m30n59K48O28K26l16n54k89M61O50%l99o14RN59
$$ 148 493 128 -318 -349 6 341 412 -18 -577 -329 299 525 209 -345 -634 -173 477 477 78 -536 -527 32
3345C2N84k20o37k28K97M35J70l07m86j7M34L29j43n08k56M25M77J6l37n24j10
$$ 32 616 396 -241 -469 -172 263 433 126 -360 -377 57 386 243 -265 -521 -96 381 397 60 -464 -574
3366e74O93N18k25p43l11L81O08L04l07p22k51N61O08p9m59m74J21M58L83k72
$$ -574 119 637 412 -331 -642 -261 347 651 344 -378 -629 -68 540 461 2 -472 -351 107 490 218
3386B18o13k1L79M47j20m68l80L34N67K02l29o36k44O47O17p3o28m75M3O89N31
$$ 218 -395 -416 -37 410 290 -178 -558 -224 343 545 216 -420 -664 -17 600 527 -101 -576 -533 156 687
3407F87l34o03l57L00O20K32m71n44J46M95K41j77l90l41M31N45Kn91m32J76N24
$$ 687 353 -250 -607 -307 313 545 74 -470 -324 171 412 235 -155 -496 -65 480 482 -109 -541 -365 159
3428A59M65l45o88l29M67P26J53n83o68N7N53N88m1o18m96K75N95L10l94m83j42
$$ 159 624 279 -409 -738 -271 455 608 25 -643 -586 -33 555 514 -104 -600 -325 270 580 186 -297 -439
3449d39N32L91j83n17k56K63O03J37m78o31NN66N97j08p53m31K81P61M11l70q47
$$ -439 93 484 301 -216 -472 -209 394 531 53 -578 -573 -7 590 482 -271 -702 -421 340 751 381 -466
3470d66k05N67O38P7o30n22Q9N92L50k57n98j80M66N36o4n42m79J77P61L92n14
$$ -466 -671 -104 534 611 -19 -541 -452 140 490 233 -365 -545 -79 457 393 -149 -628 -451 310 702 188
3491A88o32j75N42O93Q3p17o81K00P64M41l16o87m06L74P50J60n36n92K4O69L93
$$ 188 -444 -619 -77 616 699 -18 -699 -499 265 706 390 -297 -703 -329 421 581 45 -547 -523 146 539
3512E39j99o14l39M27P21N6n95n53J63N30N63k31q35m60N43P50K32o40p51j9P70
$$ 539 340 -274 -613 -186 535 591 -4 -557 -394 136 699 468 -367 -827 -284 466 698 58 -693 -712 58
3533E8N62j30p03n51L45Q56K24m75o09j29N88O46j70o45m97L39O58L55o02p53
$$ 58 620 490 -213 -764 -419 437 661 186 -423 -552 36 682 512 -133 -630 -291 367 722 120 -633
3553f33K8N78N89m4p09o44K81Q96M52n66p08j96N94P08N3p11o03J83P60L85m06
$$ -633 -605 -27 562 518 -191 -835 -554 342 794 228 -480 -676 -82 626 679 -32 -635 -452 308 693 287
3574B87p73j27M44O32J52o11p58K08P97N12m45p90k09N36P34P7o28p38J21Q34
$$ 287 -486 -613 -169 463 615 4 -754 -546 251 763 318 -472 -681 -145 589 666 38 -700 -579 255
3594B55N13l44p75l99M73Q06J49o77p07K5Q19O51m96q11j95M83P03K22o02o63
$$ 255 768 424 -351 -750 -277 529 678 1 -706 -681 138 789 293 -518 -713 -230 473 695 93 -570
3614e70n0Q12O36l06q25m21M56P24K79n75q43p7Q00P40m04p27l40L05P13M55n65
$$ -570 -620 192 828 522 -303 -724 -268 456 735 160 -683 -760 40 780 376 -351 -691 -386 327 782 217
3635B17r07l8Q15O65j06q57n80M29Q34L14m98q87k40P49Q01j16q94m54L00O91
$$ 217 -690 -728 87 752 646 -211 -791 -362 472 786 288 -599 -839 -90 711 595 -299 -753 -453 238
3655B38M90l61r22l03P16Q94j09q05n26K96P56M63m03q50l86P24Q45r4q41o19
$$ 238 728 367 -555 -858 -142 752 643 -162 -688 -392 364 827 424 -426 -812 -88 757 663 -178 -797
3675g97K11Q02N32l01q92m88P18R03R9q53o97K51P27N51k21q69n29N85R71N4q41
$$ -797 -586 216 748 447 -445 -933 -215 688 787 -66 -763 -512 215 766 545 -324 -853 -268 703 757 -84
3696h4o48J61O11O42j89r08n64O84R00J41p51p18J54Q42N84k96q04n95M76J042
$$ -84 -732 -571 40 682 493 -415 -979 -295 605 746 -5 -723 -569 273 857 561 -243 -838 -362 680
3716F80K57q66p62P8O67O91j47q77o95M71J041K40p98o93pP56P10j63p66o49L27
$$ 680 937 71 -691 -613 54 745 598 -279 -974 -503 538 778 -20 -713 -720 36 746 583 -183 -832 -505
3737e05J121L34q62o82p2O97P22N8r73q39M61R85L86o13q79j35O76P94j8p71p13
$$ -505 616 950 88 -594 -666 31 753 811 -162 -1001 -540 445 831 218 -661 -796 -120 674 656 -115 -828
3758h28K12R97N66n64r85k4O15P26O1p59r22K48J083M82o83r53j14O71Q18Q7p77
$$ -828 -616 381 947 383 -602 -626 -11 715 776 17 -905 -657 426 908 225 -728 -842 -171 647 734 -43
3779d3q36J20J112P55o45j133j16O74P40K76p38r54j8J130O84o16r70j73M58P81
$$ -43 -879 -759 353 1108 463 -670 -786 -112 628 904 166 -788 -806 324 1008 392 -578 -751 -293 488
3799D88L15q08q63J10J039P30n24j071k64O92Q05K38o91j066k0J108Q24n16j008
$$ 488 803 -5 -868 -758 281 1011 487 -584 -848 -156 649 887 196 -870 -890 218 1042 526 -482
3818d82m74N16R34L24o15j012j36R79Q98l75j045l62O03P58L45n67r36j83J104
$$ -482 -956 -440 494 818 203 -809 -945 34 932 557 -488 -850 -247 511 856 289 -647 -830 274
3837B74Q42m63j108m64M92R76M65p48j093j54Q83J032j52j145n92M57Q12M54k97
$$ 274 1116 653 -455 -919 -427 549 1014 266 -827 -981 -98 934 782 -363 -955 -498 314 768 471
3856D71j012m02R03J003k67r68n08M58P50L99m75j017l35Q74J118k76j099o33
$$ 471 -541 -943 -40 963 696 -272 -780 -322 428 827 352 -665 -1000 -126 992 716 -383 -1016
3874a016M41R66O07m26j133m97Q50J291j26j054p73K81Q99N73k61j075n00O70
$$ -1016 -575 391 998 572 -561 -1058 -208 1083 957 -97 -870 -589 310 883 622 -453 -953 -283
3892b83J107K9j091p87M48R17M59l72r23o00P68J303J01j260p10L13Q41P17k01
$$ -283 824 853 -238 -1025 -577 340 799 427 -496 -1096 -328 975 1076 -184 -894 -581 260 977 776
3911G76j173p89P62J235R9r21q94J42Q98O78k34r98o11N01J317J96j127p01K11
$$ 776 -397 -1186 -424 811 910 -11 -905 -763 135 813 579 -419 -1030 -529 788 984 -143 -844 -633
3930f33R12P26k32j120p43N74J336L42j109j059M9R76P34m5r14r41M42J339M16
$$ -633 279 1005 773 -347 -1090 -516 820 1162 53 -1006 -957 19 753 708 -206 -1147 -705 634 1050
3949A050r03r81P0P84P97m3q77q64L97J341L34r29r92L6Q69P95r1j020r86L74
$$ 1050 147 -834 -764 20 817 774 -103 -967 -570 771 1105 176 -816 -780 89 884 793 -227 -1213 -839
3969h39J327O27p79j186p5Q33Q67J52q48j091K63J261N98q24r59j57P22Q41J23
$$ -839 488 1115 336 -850 -925 -92 775 927 79 -1012 -749 512 1110 286 -673 -830 -108 733 856
3988H56r56q79J74J183P77q46j234n7Q74Q33J64p83j110J16J291Q24n83j278l21
$$ 856 -100 -979 -805 378 1155 309 -925 -982 -108 725 889 106 -1004 -888 403 1227 644 -634 -955
4007i55Q17Q20J66o46j043j44J217R18o68j200j89O87Q61K17p91j030rJ227R36
$$ -955 -138 682 848 202 -841 -985 232 1150 482 -718 -907 -220 641 858 67 -963 -972 255 1191
4026A191n43j261m05P68R32L90p53j161k23J210R75n04j132n52O08R45L73o36
$$ 1191 648 -613 -1018 -250 682 1072 319 -842 -1065 145 1120 616 -516 -1068 -460 485 858 222
4044B22r65k44J045J051l59j283m15O51Q58L95n25j155k92J073J077k62j346p03
$$ 222 -743 -987 58 1109 750 -533 -948 -297 561 956 431 -724 -1016 57 1134 872 -474 -1177
4062a177O69J015L12m40j140m45R43J313j55j268n82M32J017M97n11j068m71R32
$$ -1177 -508 507 819 379 -761 -1206 -263 1050 895 -373 -955 -523 494 991 480 -588 -1059 -127
4080a27J219j73j320o00N58R19N36m78j217n72J011J290j28j219q07L95J117O34
$$ -127 1092 919 -401 -1001 -443 476 1012 534 -683 -1255 -244 1046 918 -301 -1108 -713 404 1038
4098A038m39j044n98P49J364Qj274p84L38R59N57l41j104o07Q14J192K05j249
$$ 1038 599 -445 -1043 -294 1070 1078 -196 -980 -642 317 874 533 -571 -1178 -364 828 1033 -216
4116b16q94L89J069N31k87r97p74O97J491K01j219r39K40J012O99k67j132q05
$$ -216 -1110 -721 348 879 592 -405 -1179 -482 1009 1210 -9 -948 -708 304 1003 736 -396 -1201
4134a201N81J385L52j205j037L13J127N41k05r27r30N97J442M52j279j046J86
$$ -1201 -620 765 1117 -88 -1125 -812 315 856 651 -276 -1206 -609 833 1285 6 -1040 -854
4151h54J025Q17j67j063r04M62J443M63j085j116P9Q50Q30j04r60q23L94J352
$$ -854 171 988 821 -242 -1146 -684 759 1222 137 -979 -900 -50 780 676 -284 -1107 -713 639
4169F39O33r31j248K5J014P92q9j017r13L67J413N76r10j251m8J027Q68j81r15
$$ 639 1272 341 -907 -882 132 924 835 -182 -1095 -728 685 1261 351 -900 -948 79 947 766 -149
4188a49r61J51J464P36r21j281J02Q74Q06O3q71r79J06J356P31q31j274j78Q94
$$ -149 -1110 -959 505 1241 320 -961 -859 15 821 884 13 -966 -860 496 1227 396 -878 -1056 -162
4207a62R50O3r13r49Q6J343Q94p90j430m1Q48Q93J14q31r98lJ282R50o35j265
$$ -162 788 851 -62 -1011 -925 418 1312 522 -908 -949 -101 792 906 75 -923 -926 356 1306 671 -594
4227e94m60Q55J013N3q21j057m3J281R61n95j371l59R56R04J73p26j054j66J267
$$ -594 -1054 -199 814 867 46 -1011 -1054 227 1188 593 -778 -1137 -181 723 896 170 -884 -1050 217
4246B17J053n11j403n13R28R47K71p11j024k46J085J076m44j345n27P91Q93L21
$$ 217 1270 759 -644 -1157 -229 718 989 278 -746 -992 93 1169 725 -620 -1147 -356 537 858
4264H58n69j100j98J082J168l81j401n67P88R72K79o26j053l21J044J166j94j404
$$ 858 289 -811 -1009 73 1241 860 -541 -1108 -320 652 931 305 -748 -1069 -25 1141 947 -457
4282d57p34P14J014L78n82j071m04R36J342k23j381n76O40J022M36o16j101l59
$$ -457 -1191 -477 537 915 333 -738 -1142 -206 1136 913 -468 -1044 -404 618 1054 438 -663 -1022
4300a022Q57J165m9j270q55O15J123L74n22r82o29R44J333q3j274q75N24J056
$$ -1022 -165 1000 951 -319 -1174 -559 564 938 416 -566 -1195 -251 1082 999 -275 -1150 -626 430
4318D30N91o06r41n29P36J348J19j376r04N81R85L99l76j049o56Q42J343J06j226
$$ 430 1021 415 -526 -1055 -319 1029 1148 -228 -1132 -551 434 833 457 -592 -1248 -406 937 1043 -183
4337a83r10M82J063O21m83j094o02O57J337K90j197j074L85J089N98l53r80o89
$$ -183 -1093 -611 452 1073 590 -504 -1106 -449 888 1178 -19 -1093 -708 381 979 626 -354 -1043
4355a043N20J188L63j161j015L53J090N04j77r23p65O14J308L47j130j123J81
$$ -1043 -523 665 1028 -133 -1148 -795 295 799 622 -301 -1066 -452 856 1203 73 -1050 -869
4372h69J135O60l54r25p03L61J466M81j089j177Q7J064O71r3r70q53N14J224N57
$$ -869 266 926 572 -353 -1056 -695 771 1252 163 -1014 -927 137 808 715 -255 -1108 -594 630 1187
4391A187r25j193J34J138O52l41q93p57K32J329O67j124j137R3J025Q05j24r10
$$ 1187 262 -931 -797 341 993 652 -241 -998 -766 563 1230 106 -1031 -938 87 892 768 -142
4409a42r02K45J240P59q28j292q8J002Q05np60q42J59J125O69p08j246k03R86
$$ -142 -1044 -799 441 1200 372 -920 -1008 -6 799 794 34 -808 -649 476 1145 437 -809 -1012 -26
4428b6Q52k28p54p89J16J243Q45q06j313j26J001Q98o6q48r31P7J116R35n47j397
$$ -26 826 598 -156 -945 -829 414 1259 453 -860 -986 15 913 847 -1 -932 -855 261 1196 649 -748
4448g48k83R67P81L8p06q72p2J113P71o09j121l28R22R86k1q05p47k9R52J056
$$ -748 -1031 -64 717 755 49 -823 -895 218 989 380 -741 -1069 -147 839 818 13 -734 -763 189 1245
4468A245n39j490l28Q84R48J38o64r52j87J063J046m56j207n92P82R28N6n78q16
$$ 1245 706 -784 -1112 -228 720 858 194 -758 -945 118 1164 708 -499 -1091 -309 619 675 97 -719
4487g19k01J013R88l97j206l62O95R07J66p39r87j16R41J023k38j319n37P91J020
$$ -719 -920 93 1081 684 -522 -884 -189 718 884 145 -842 -958 -17 1006 768 -551 -1088 -297 723
4506G23J65n61r64k85P96J059j22j102p81O79J047K19o56o96l48P37J139j86j335
$$ 723 888 327 -637 -922 -126 933 811 -291 -1072 -393 654 873 217 -479 -827 -90 1049 863 -472
4525d72o44O36R91K97o06q23l01P76J105P5j241r00N92R82L34m32q29n63Q01J155
$$ -472 -1116 -480 511 808 202 -621 -922 -146 959 1034 -207 -1107 -515 467 801 369 -460 -1023 -222 933
4545I33k8j110o96L98R93L99o20q61l54O48J066J45j141p65M53J059M59n02r38
$$ 933 905 -205 -901 -503 490 889 269 -592 -946 -298 768 913 -228 -993 -540 519 978 476 -462
4564d62m17N63J023J68q96j005K58J121M72m72p02m43L54J064L52j040r53L58
$$ -462 -879 -316 707 875 -21 -1026 -768 353 825 353 -349 -792 -438 626 978 -62 -1015 -657
4582f57R84M52m30p69m12N08J014L96r95j090K99J023M73l12p89o98M46J085M59
$$ -657 327 779 349 -420 -832 -324 690 1086 91 -999 -700 323 796 484 -305 -1003 -557 528 987
4601I87q71r31J40R33N26k99p79n17L31R56N04q22j036K12R19N57k07q12o78L70
$$ 987 116 -815 -675 258 784 485 -294 -811 -480 476 980 158 -878 -666 253 810 603 -209 -887 -517
4621e17R37M93p28j067k5R35P39j93p56m88J62Q96N96o02j085j09Q60P17k05p66
$$ -517 420 913 185 -882 -907 28 767 574 -182 -670 -508 388 984 382 -703 -812 48 765 560 -206
4641b06m89J40Q92O72o26j134n1Q72O60j39p36o81J11J017O36n02j004k55Q19
$$ -206 -695 -555 337 1009 383 -751 -802 70 730 591 -145 -826 -715 302 938 436 -568 -823 -4
4660dP61j44o41o00j7P87P13m52r77k78P96O92m0n73o82N5P81P68n19j046k94
$$ -4 757 613 -28 -628 -645 142 855 403 -574 -852 -56 636 596 23 -659 -604 177 945 426 -620 -914
4681i14P79Q25k6o27o51KP36P98l34j027m33O69P48M5n20p35m3Q38P14k83j002
$$ -914 -135 690 664 37 -614 -612 124 922 588 -439 -872 -203 545 590 70 -665 -708 130 844 561 -441
4702d41m26O87P91l5n35o74m4O81Q02k05r58m17N43P28J64n01o93j96O54P73j15
$$ -441 -867 -180 611 576 41 -633 -677 4 806 601 -357 -774 -231 497 661 160 -533 -729 -75 698 583
4723E83q64n72N41Q12K15n64n72j21M96P05m6q60n79N31P59K01n35o27j83N28
$$ 583 -281 -853 -312 500 715 151 -421 -542 -46 659 613 -247 -826 -295 464 665 130 -497 -680 -152
4743a52Q35l9q70n93L74P87K67m48o06j89M39P89J07p34o55K78Q46J91m17o03
$$ -152 683 644 -226 -819 -445 342 609 161 -445 -634 -195 594 701 -33 -688 -410 436 627 210 -393
4763c93k19L53Q37M4p49o28L86P17L05l80o75k52M33P22J93p01p82K66Q24L42
$$ -393 -612 -259 578 622 -127 -755 -369 348 653 273 -402 -654 -221 501 694 -7 -789 -523 301 643
4783F43l43n63l28K98P77J55o96o06J31P69L36k69o28k63L50O88K32o20p06J33
$$ 643 300 -263 -591 -293 484 639 -57 -663 -532 237 573 304 -324 -587 -237 451 683 63 -643 -510
4803e10P77L39k90o18k81K77P12K69n47o84R0O84L51k11n60l33J99O46L51n48
$$ -510 267 606 316 -302 -583 -306 406 675 128 -556 -466 218 569 358 -202 -535 -336 310 661 113
4823A13p27N7O85N01k42n92k98J94N91L77n13p71K4P59L46j40n61l14J40O48M17
$$ 113 -614 -557 128 629 387 -205 -503 -309 282 659 146 -625 -601 158 504 364 -197 -511 -371 277 694
4844F94m89o64j91P21N17k24n15k90O6O09M73m30p32q8O30L78p4m90m26J60N50
$$ 694 205 -459 -650 71 588 364 -151 -441 -375 234 707 277 -455 -543 87 465 391 -99 -525 -365 185
4865A85L81k89o85j82N66N00j29m24l66JN52M45l20o48j88N54M96k8m36m11N1
$$ 185 566 277 -408 -590 -24 476 347 -77 -443 -442 110 555 235 -413 -601 -47 449 421 -15 -426 -375
4886c75M87L97j65o80k58N06M72L1m76l11K5M56M21r8p49k41M89N01l3m24l98
$$ -375 112 509 344 -336 -594 -88 384 415 -61 -372 -347 109 530 432 -317 -558 -69 432 399 -25 -423
4907d23m3N14M83j12o79k73L57N33P5m44m02k2L73N31r5n90l72M51M94O9l40m30
$$ -423 -466 48 531 419 -260 -533 -176 357 432 -12 -414 -436 -63 468 373 -217 -589 -138 356 425 85 -345
4929c45j13M67N16j61n66l45L00O01J72m21l76p3K31N84N9o87l90L49M04K45k86
$$ -345 -458 9 525 364 -202 -547 -247 354 526 105 -271 -344 -113 471 530 -157 -547 -198 206 451 165
4950A65m59j22L52M20O8n18m06K60N08J32l57l12j53L41M63N6n59l50K46M42K43
$$ 165 -294 -416 -64 356 424 -94 -500 -240 268 400 43 -269 -422 -81 382 438 -121 -471 -225 217 460
4971D60k87m32j43K60M49J66m34m60Q7N69J53j92l28k21J90M00J96m38m40J33
$$ 460 173 -259 -402 -142 307 473 39 -421 -334 235 388 196 -132 -353 -163 237 433 -5 -445 -312
4991c12N45J87l13l16j83J48O03J16n03m38O6N10K86j51m15k46K10M04K51l56
$$ -312 233 420 107 -209 -392 -244 359 475 -28 -466 -400 110 396 245 -170 -416 -206 198 449 93
5011I3m54k6M22L21j09l42k47J39M43J30k59l48j39N01K74j30m19k19J76L07L22
$$ 93 -361 -387 35 356 247 -95 -342 -203 240 370 111 -237 -376 125 399 269 -150 -369 -193 114 436
5032D36k54n24j19M83L40j34k98k46J01K87L03j48m81j19L44L36o8k76k05l3L68
$$ 436 182 -342 -461 22 362 228 -70 -316 -215 72 375 227 -254 -373 -29 307 239 -37 -242 -275 93
5053I3L34k76m31o9L67K89n9k39l04N2L44L10j75m56j57K57M50J4k65l69j7L85
$$ 93 427 151 -280 -349 18 307 248 9 -295 -243 101 411 236 -220 -377 -120 330 344 79 -290 -307 78
5075G8K33k5m28j74J55L73Q9k67k70PJ83L11m1m09k50L10M20J1l03k56o9K69L23
$$ 78 311 286 -142 -316 -161 212 301 34 -236 -229 -46 265 224 -185 -435 -125 295 306 3 -253 -322 -53 270
5098B70ll69k80J46M51O7j42k72j49K14L16L7l65k33K30L07m6j07k36q4J63L40
$$ 270 267 -102 -382 -236 215 282 140 -132 -281 -67 249 286 -79 -312 -82 225 179 72 -164 -248 -85 255
5120B55K5l38l27J97L05J70j98k95j49K19M09Lk79l10J26K42J92p8k99r9J26L33
$$ 255 280 -58 -385 -188 117 287 89 -206 -355 -136 273 276 -3 -313 -187 55 247 169 -130 -229 -103 230
5142B30Q6l03k28PL52J75k06k39j44J80K93Q4k52k95K5K97K39j10k62k21J04L24
$$ 230 316 13 -215 -208 144 319 113 -126 -270 -90 203 287 35 -260 -235 62 301 191 -71 -292 -188 136
5164A36J67j84l85O1K31J73j2k38j80QL03J84j39k92o5K24K33j4k81j79O5L32
$$ 136 303 119 -266 -205 26 199 187 -51 -231 -223 80 264 125 -167 -232 -8 225 211 -70 -249 -184 148
5186A48J77j53l86k9K63J55rk69j05m7K92K86j41l04j45K31K67m4j56k19k7K74
$$ 148 325 172 -214 -243 20 175 166 -103 -208 -255 37 323 182 -122 -267 -36 231 187 31 -188 -215 59
5208E9J50p0l14p1J48K45N9k04j86j3J80K64k1l17k02J94K32O2j27k12n7J64K54
$$ 59 209 139 -175 -246 -98 147 206 2 -184 -197 -17 247 226 -91 -293 -99 133 195 68 -144 -201 -37 217
5231B17j4k56j88J48K64L5r3k75n3J59L10j3k84j77Q3K79J41j62l23J8J16K46
$$ 217 203 -53 -241 -93 171 206 113 -162 -215 -56 254 241 -43 -220 -137 142 283 121 -202 -184 -68 178
5253A78N5k77k48J07K75J05r5k18j52J59L28J0k56j37J6J92J84r4k15j29P9L37
$$ 178 233 -44 -292 -185 90 195 100 -118 -270 -111 217 227 -29 -166 -150 42 226 132 -83 -212 -133 204
5275B04Q5k85k37P1K41J48l4k55j50N8L17N6j95k07n9K40J73o7j15k41Q2K95O8
$$ 204 289 4 -233 -162 79 227 193 -62 -212 -154 163 219 24 -183 -242 -2 171 104 -11 -252 -170 125 193
5298A93j30k20p8K23K58o3k25k08J50J87J38j14k77j29K74J83O4k13k27O7K09
$$ 193 63 -157 -235 -12 246 183 -42 -250 -100 87 225 111 -166 -295 -21 162 226 13 -214 -147 62
5319F2J58o4l07j03K29J67J10k67k06k3K89K02j27k27j09J29K47Q4k44k95J00
$$ 62 220 156 -151 -254 -25 142 252 -15 -221 -244 45 247 120 -107 -216 -87 160 244 0 -295 -195
5340a95K48J88j02k79j51K21K52M9j88k78L1K31K38j30k21j87J62K45J18k08k05
$$ -195 53 241 139 -140 -291 -70 182 231 43 -235 -204 27 265 135 -86 -273 -111 134 252 44 -161
5361a61o1K41K62n0k62k22J44K42R2j53k38p3K49K11Lk83j62M5K86J14j44k90
$$ -161 -222 19 281 231 -31 -253 -109 133 225 72 -166 -239 10 221 224 -59 -221 -176 110 224 80 -210
5383b10r3K27K89L1l23k02O1K53K09j31k37j26J55L18L9k93k40J35K40J91j43
$$ -210 -303 -76 213 244 -79 -281 -220 33 242 111 -126 -252 -97 221 260 -33 -273 -138 102 293 150
5404A50k98j29K55K53M5j39m49M5L79K05j55k83j81J59L50R9k08l02r8K57L02
$$ 150 -148 -277 -22 231 276 137 -312 -267 112 317 162 -121 -302 -143 207 306 98 -204 -302 -45 257
5425B57n9l01j83J09L27J60k68l23rL49J65l8k92k18J28L83J42l01k38l6K78K19
$$ 257 198 -103 -286 -177 150 310 42 -281 -290 59 224 186 -106 -324 -196 187 329 28 -210 -246 32 251
5447B51nk68k44N5L64J92k95k39m0J93K84N7l24l04R7L40K03j80l59n8K36L04
$$ 251 246 -22 -266 -211 153 345 50 -189 -229 -36 248 305 -19 -323 -226 114 317 137 -222 -280 -44 260
5469B60m6k33l06R3L54J89j70l47j26K25L50J7k50k64kK68L24j31l49j55K18L08
$$ 260 214 -19 -325 -232 122 311 141 -206 -332 -107 243 260 10 -254 -256 12 336 205 -144 -299 -81 227
5491B27M3k60l00P9L49J61q7l50k23K81L29K0k59k35n0L07L02j41l33j30N8L70
$$ 227 270 10 -290 -211 138 299 212 -138 -361 -80 249 269 10 -225 -275 32 334 193 -140 -270 -212 158
5513A58J71k41l81RK81K89l7l67k31K06K89J22r9l76r1K97L17k7l37k31P4L60
$$ 158 329 88 -293 -284 -3 286 249 -118 -349 -143 146 268 169 -207 -298 -1 316 289 -48 -279 -205 155
5535A55K04k73l40o6K33L51n7k89k04L4K93L15k41l40j13K94K84P0l00l57J00
$$ 155 359 86 -254 -320 -87 264 207 -82 -286 -252 41 356 115 -225 -338 -44 240 310 10 -347 -247
5556b47M33R6j64k10k74K33L90P7l86k57O0L62K28j77l72p4J77L29R8l19k88K3
$$ -247 186 282 118 -92 -366 -133 257 334 -52 -309 -249 113 341 164 -208 -282 -105 224 322 3 -285 -262
5578b62L31K74j24l43j94J83L72K5k56k60ML05L23j27l96k07J67L73J07k37l84
$$ -262 69 343 219 -124 -318 -135 237 262 6 -254 -250 55 378 251 -145 -352 -185 188 295 58 -326
5599c26R1K55L00q9m55q8J40L39J95k17l96j12M45K39l9l70k12J29L58J22j85
$$ -326 -235 20 320 231 -224 -312 -172 167 362 145 -251 -363 82 321 282 -88 -300 -171 187 309 124
5620A24l84k8K99K99o1l70j78Q8L97J73k19l67j06K78L22ll34k77J21L60K24k62
$$ 124 -260 -288 11 310 249 -121 -299 -211 186 359 140 -227 -333 -55 267 264 -70 -347 -226 134 358 96
5642I6l12j01K15L48R2l46l00R6K86K58j94m22p4L18L07J02m30k83J18M06J88
$$ 96 -216 -317 -102 246 338 -8 -308 -212 74 332 138 -284 -358 -40 267 369 -61 -344 -226 180 368
5663C68j37m04j58K57L21R5l04l58l6M51K03p4m30j26K12L01J43k78l50N9K87
$$ 368 231 -173 -331 -74 247 342 38 -320 -356 95 298 224 -206 -332 -120 181 324 46 -304 -245 42
5684D2K23o7l69j59J56M09O7j88m24l6L86L43j49l04k99K43L41J30k43l67kK68
$$ 42 265 198 -171 -330 -174 235 302 114 -310 -346 40 383 234 -70 -369 -126 215 345 102 -265 -267 1
5706AL89r8m03k47K06L29J18j90l49q9L11K58Ol39k98J88L89J75k59l65n2K29
$$ 1 390 292 -111 -358 -152 177 295 105 -244 -333 -22 236 242 -97 -395 -207 182 357 98 -267 -319 -90
5728i0L89k5l83k65J61L28K90k65l71j15K84L84l1l25l04J23L92J46j70m43n4
$$ -90 299 274 -109 -374 -213 115 405 140 -231 -346 -62 322 291 -34 -338 -215 177 323 153 -290 -344
5749c44L26L91mm45k59P4L83K46k16m06j02L26L12O9l46l86R0M51J90k02l43q6
$$ -344 -18 373 369 -76 -335 -261 122 368 152 -254 -356 -30 282 351 5 -381 -291 160 350 148 -195 -281
5771b81K15L16L3l18k83P9L50K40k02l20j30J92M01N5l07l49L2L45K84j29m20
$$ -281 -66 250 283 -35 -318 -239 111 351 149 -171 -301 -109 292 347 40 -309 -277 68 352 223 -197
5792a97j34K04L58J38k75m38P3L26K58q3l71k19K27L77L5k47l15K2L40L22j82
$$ -197 -331 -127 231 369 94 -344 -271 55 313 230 -141 -360 -133 244 279 32 -283 -261 79 401 219
5813B19l83j76J54L92J76l28l40oL31L07r2l48k81J50M42J57k71l96QK83L27o7
$$ 219 -164 -340 -186 206 382 54 -286 -292 39 346 254 -94 -375 -225 217 374 103 -293 -285 -2 325 258
5835B58l77j74J05L54K25k36m10n9L13K85jl67k45P6M46J50k35l64q2K98K92M2
$$ 258 -119 -293 -188 166 391 155 -255 -314 -1 284 283 -84 -329 -253 193 343 108 -256 -338 -40 252 294
5857B94l54k80J06L75J62k11l20j07K72L73Ol14k68Q6K92K53j76l71j52K81L36
$$ 294 -60 -340 -234 141 303 92 -228 -335 -63 310 316 2 -266 -180 112 365 189 -182 -334 -53 283
5878B83L6l67k40K1L42L14j68m44j13K75L21n7k06k93L7L22K20j02l80j00J84
$$ 283 319 -48 -288 -267 75 389 221 -223 -336 -61 260 203 -3 -296 -259 63 283 181 -199 -299 -115
5899a15L93l0k01l67N8L33K53j08m15j51K13L79J58l63l09K1L44K90j80l18k10
$$ -115 278 248 47 -320 -262 71 324 216 -199 -350 -137 242 400 37 -272 -251 93 383 203 -115 -325
5920c25J97L93M8k69l19m1L23L59j48l79j53J26L97P9k58k74o9K68L78p0m52j78
$$ -325 -128 265 313 44 -275 -316 7 366 218 -161 -314 -188 209 288 30 -244 -313 -45 333 263 -189 -367
5942c67K12K78K24k57l28m7K67L27J9m10k44J55L50J79k75k57j49K93L20j9m52
$$ -367 -155 123 347 90 -238 -285 -18 309 328 -82 -326 -171 179 358 83 -174 -323 -30 290 271 -181
5963a81j03J09L92Q4k07k61j33K94K69J7l41l25K07L49J80j96l60j38K32L50Q0
$$ -181 -284 -175 217 301 94 -167 -300 -6 263 280 -61 -386 -179 170 350 154 -206 -344 -112 238 318
5984C18l85k34M4L93K41k63k97q0J94L66O4l90k09L5K98K60j89l43j10J76M02
$$ 318 -67 -301 -257 136 377 114 -183 -263 -69 297 361 -29 -238 -203 95 355 166 -177 -287 -111 291
6005B91J5k70l36Q7L87J33j37k73k18J70L57J28l06l19J4L18K58j53k76j45J55
$$ 291 306 36 -300 -213 174 307 170 -103 -321 -151 206 334 28 -291 -277 41 299 146 -130 -275 -120
6026a20L08J30k91l21L8L65J51q0k51k39J20M23L6k04l24l3L21K86r7l19j66J51
$$ -120 188 318 27 -294 -256 109 260 180 -71 -310 -190 233 269 65 -259 -292 29 315 218 -101 -267 -116
6048a16K68J55k13l74j3L05K98q6k71k88K15K76Q9j34l64p2L40K51j10k55k45
$$ -116 152 307 94 -280 -293 12 310 224 -47 -335 -120 156 245 111 -253 -325 15 266 156 -99 -344
6069c44J51L29K12k72l13l5K54K46K5k55k43L1L42K00j12l67r4K35K40qk23k68
$$ -344 -193 136 348 76 -237 -272 -18 228 253 -2 -245 -214 128 328 216 -151 -245 -10 230 222 -1 -269
6091b69P4K88K53k48l09r9K69K96kk62l27J03K95K32j34l87r1K36L10Jk20k19
$$ -269 -195 93 346 98 -211 -310 -41 255 253 -9 -336 -233 62 294 160 -227 -318 -82 228 229 9 -210
6113b10m3L13K06r6k97j56K40K92n3j62k66M6K81J89q9k79j76J36L13P2j85k70
$$ -210 -253 60 266 170 -127 -283 -43 249 196 34 -232 -186 95 284 195 -84 -260 -124 189 261 76 -194
6135a94l5K44K55o3l21j45J28L27M1k35k07l3K29K78j6m24p3J23K83R9k03k56
$$ -194 -229 15 270 207 -114 -259 -131 196 237 2 -205 -238 -9 269 253 -171 -244 -121 162 261 58 -198
6157a98j8K30K63m8l51j82K06K86M6j42k73l1K56K36l0k80k03J20K59J12j89j91
$$ -198 -216 14 277 229 -122 -304 -98 188 234 92 -181 -212 44 280 250 -30 -233 -113 146 258 69 -122
6179a22j37K07K38N4k45k56K8L39J63j96k40l9J98K33L4k70k95P8L43P5k7k98
$$ -122 -259 -52 186 240 -5 -261 -233 106 269 73 -167 -206 -8 225 259 -11 -306 -228 115 190 163 -135
6201a35r8J41K76M0k26k51R8K54J08q0k42p4J21K63O9k70k17L5K55K02j77j95
$$ -135 -233 -92 184 224 -2 -253 -155 99 207 127 -115 -189 -68 195 264 -6 -223 -188 67 269 92 -103
6223a03r8Q6K80N8j59l63P1K59K06r7k65j26Q7L08J10k07l23O3K04K55j15k99
$$ -103 -201 -115 165 223 64 -299 -228 31 237 140 -125 -251 -164 144 254 47 -276 -213 -9 246 131 -168
6245a68o6J28K31J42j97k07lK91Q1m8k90q8R9K11J63k27k23k0K08K15m0k46j01
$$ -168 -234 -106 125 267 70 -137 -140 151 232 184 -106 -194 -95 116 279 52 -171 -191 17 232 192 -54 -155
6268a55J1K44J65j56l35l0K04K52l3k24j64P1K31J26j11l05l4K41K11k7j90k11
$$ -155 -144 100 265 109 -226 -256 -52 200 167 -57 -221 -150 81 207 96 -209 -243 -2 209 182 -8 -219
6290b19J0K95K08j45l29j03L24J52L6k47j80M9K47J64j46k32j21K49J60k1j81
$$ -219 -209 86 294 149 -180 -283 41 193 229 -18 -198 -149 98 262 116 -116 -237 12 172 151 -30
6311c0j69L5K03J66j03k53q8K57J61N3k67j51pK43K32j07l23j14J94K08J00j77
$$ -30 -199 -164 39 205 102 -151 -239 18 179 232 -35 -186 -193 50 282 175 -148 -262 -68 140 240 63
6333F3j98K3J83J68o2l16o7J72K36l6j37k02l9K28J92l0k64j64J31K54P4j99j67
$$ 63 -135 -112 71 239 177 -139 -206 -34 202 166 29 -173 -212 16 208 178 -86 -250 -119 135 209 10 -157
6356a57m7J58K58o9k59j22J86J96M8j32k06o2K24J39L2k56j90K24J78K7o2k55
$$ -157 -204 -46 212 143 -116 -238 -52 144 192 60 -146 -208 16 155 187 -69 -259 -35 143 170 108 -147
6378a47j4J31K92l0k96j68J68J31J50j30k39j1R5K83J0l03j54J16J68J28j43j39
$$ -147 -161 -30 262 232 -64 -232 -64 67 217 87 -152 -163 -68 215 225 -78 -232 -116 52 180 37 -102
6400a02j12K01J78P5k93j75R6K75J45k27j68k2N8K75N7l20j41R1K12J06j14j73
$$ -102 -214 -13 165 240 -53 -228 -132 143 288 61 -107 -129 -71 204 261 -59 -200 -109 103 209 95 -78
6422g8r8J03K11J7j35k51R2K47J13j30j66j54J93J71O6j97k04N0J87J36j14j22
$$ -78 -176 -73 138 155 20 -231 -139 108 221 91 -75 -229 -36 135 201 4 -200 -150 37 173 59 -63
6444f3j60J25K71Mj68k32O8K40R4p0j68r8M2K03J45j46k19j4K68P5m3j65j43N9
$$ -63 -223 -98 173 177 9 -223 -155 85 179 109 -59 -157 -115 88 233 87 -132 -146 122 197 154 -11 -154 -95
6468i5J80J42k26j75k1K26J53m5k41r2P9J76J66j55k74m6K49J82j10j45o7J4J59
$$ -95 85 227 1 -174 -195 31 184 139 -102 -194 -115 61 227 72 -202 -248 1 183 73 -72 -139 -125 34
6491C4K01j46k75MK19J12o0j52j14L9J92J52j19j78p7K04J28Pk11j15jK56Q7o9
$$ 34 235 89 -186 -182 37 149 89 -63 -177 -138 54 206 87 -91 -168 36 164 171 -40 -155 -156 100 187 118
6515A18k97K6Q7K58o3j83r6J6J48J42o3k55L8P1K33j03n4j64J6J87J57j13j96
$$ 118 -179 -153 -66 192 129 -54 -150 -134 14 156 93 -162 -124 -53 180 77 23 -141 -125 62 219 106 -90
6538i0j20J01K70qk10r2L5J49J65l6k32j12J61J40K9j35j67L3Q1K12j6k32j42
$$ -90 -210 -109 161 153 -57 -149 -114 35 200 164 -68 -180 -19 121 150 15 -152 -119 -38 174 158 -74 -216
6561b16J48K23o1j15j26pJ89J42q6j12j65J17J60K4r8j41m5J29J66j3j16j52Q0
$$ -216 -68 155 94 -21 -147 -154 35 177 91 -21 -186 -69 91 115 17 -124 -169 -40 126 113 -3 -155 -75
6584g5K64J9j64j25o9J59J24Q8k69j50R2K28Q3j99j06m4J23J93K0k59j07J6K54
$$ -75 189 208 44 -81 -150 9 133 221 -48 -198 -106 122 205 6 -100 -144 -21 172 192 -67 -174 -158 96
6607I6Q3j61o9r8O7J83K6j25j75RK91Q2k03r1o6Q8K06K2k03r8L5K34L8j44o0m3
$$ 96 179 18 -51 -149 -82 101 127 2 -173 -164 127 209 6 -85 -151 -63 143 165 -38 -136 -101 133 171 27 -33 -76
6633g6M1J26J36k35k03P8J79Q5p2j49o0Q8K30M6j78k03NJ76J53q2j74q1R5J76
$$ -76 -35 91 227 -8 -211 -133 46 131 59 -90 -150 -62 168 214 36 -167 -162 14 167 85 -89 -170 -75 101
6657A01J07j53k69O4K05P9o3j51o1K4J62P0q4k26O2J25J83q1p6j51N3J85N4q0
$$ 101 208 55 -214 -150 55 134 71 -80 -141 -117 45 115 31 -195 -133 -8 175 94 18 -133 -80 105 159 79
6681G9k30J6J95O7k2j60j31N9J67R6j09j65q1K32J00o2j10j06O9K15M1j07j93
$$ 79 -151 -135 60 127 105 -55 -186 -127 40 136 27 -138 -219 13 113 51 -59 -165 -96 119 160 53 -140
6704a40q0J61K53p7j83l1QJ41J29j04k18j8K53R4q9j14j18R1J13J31j21k00q6
$$ -140 -220 -59 194 117 -66 -97 -89 52 181 77 -141 -159 94 188 99 -15 -133 -42 71 202 81 -119 -205
6727b05K03J45m0j02j82P4J58J21r4k06j29K39J87p4j42q1k4J60J45l0k74p6J78
$$ -205 -2 143 103 1 -181 -107 51 172 78 -128 -257 -18 169 95 -47 -128 -152 8 153 123 -151 -227 -49
6750d9J68o5p1j36J8J56R9rj55j57J92J89l0j69n7LJ05J51l9k01o2J27R0N0j92
$$ -49 119 54 -17 -153 -135 21 120 111 -44 -201 -9 180 150 -19 -76 -73 32 183 144 -57 -119 8 98 148 -44
6775d4p3j8J08J67j0j71k09J75K14m5r0j48QR6J52K0j95j52J24K45l0j22p0oN0
$$ -44 -117 -135 -27 140 130 -41 -250 -75 139 94 4 -144 -136 -40 112 132 -63 -215 -91 154 124 2 -68 -74 -24
6800b4J27N2j80j46J43J50N3j75p9mJ20O5Nj85q8N7J54J25j10j71m7J37J22K1
$$ -24 103 155 -25 -171 -28 122 175 0 -79 -83 37 102 107 -78 -166 -109 45 170 60 -111 -158 -21 101 122
6824A22j53j12O8J49J7j39q5K7J11O1P6j62j52Q1J83J3o0j06m7R7J28k7r4j02
$$ 122 -31 -143 -75 74 91 -48 -133 -106 5 66 142 -20 -172 -91 92 105 45 -61 -108 -11 117 90 -4 -106
6848a06K1K09Lp1r5q2Q4Q2M9j43j42LJ93R0l9j43k5R7J01M5j02j69O0J28P8q2
$$ -106 -85 124 127 56 -39 -121 -37 45 94 -49 -191 -188 5 95 56 -87 -112 -15 86 131 29 -140 -80 48 126 44
6874D4p5k7K9R3N9l0k28O2J28J17j01j42l6O9J34N4j47j74Q4K13Qp2p7j01O7J38
$$ 44 -31 -58 -29 64 123 93 -135 -73 55 172 71 -71 -107 -38 96 150 3 -171 -87 126 134 62 -15 -116 -49 89
6900H9J18k04j81NK11J26j51q7l7P3J31O4j63r9m4R5K08n8j27l0qJ09J15p5k34
$$ 89 207 3 -178 -173 38 164 13 -74 -111 -38 93 157 -6 -105 -149 -54 154 96 -31 -61 -69 40 155 80 -154
6925a54L0J26J30m3j86nM0J01O5jk10m2K57P3j21j23p7R9R4J03l6k65J7J33J40
$$ -154 -124 2 132 89 -97 -102 -62 39 104 103 -107 -149 108 181 60 -63 -140 -41 53 156 120 -145 -128 5 145
6950A45p5j21p6M8J22L3k1j67l0J29Q1m6p9m6P0P1R3q4j51mJ30O8nj02j26O4J21
$$ 145 70 -51 -127 -79 43 76 55 -112 -142 -13 68 22 -57 -103 -33 38 131 47 -104 -108 22 90 85 -17 -143 -79 42
6977D2J04m1j60j15K05J01m9r7j09pJ10J21p2j54r4J42K15j00r6m9J5P1R6L0j94
$$ 42 146 105 -55 -170 35 136 87 -10 -119 -126 -16 105 33 -121 -215 -73 142 42 -54 -103 -88 -17 79 109 -85
7002h5o6J57J33k6j28o3k0J82J1k6j34o5J33J19j4j33m5K4M7J11j2j75j7M1J33
$$ -85 -151 6 139 113 -15 -78 -98 84 95 69 -65 -130 3 122 108 -25 -70 -46 1 112 100 -75 -92 -51 82
7027H2Or6o4jN9R5j9j08j09N6J93Jr2p1m5Q4J48j13l8p6N8J86k1j6j84PL9J14
$$ 82 88 -8 -72 -73 -14 81 62 -46 -155 -99 94 95 3 -68 -113 -29 119 6 -32 -108 -50 136 115 99 -85 -78 -39 75
7055G5M3j05j49Q4J42N0j24j36N4N5J09M2j75r1L4J31N0o8j32O9J0J10Qq4j10
$$ 75 118 13 -136 -52 90 140 16 -120 -66 -11 98 140 -35 -126 -92 39 89 21 -111 -42 -32 78 86 2 -108
7080a08J7J49N6j16r0%O3O1N9r1j32N2J54M4j67m2O2M0J15mj81k8K7J09Q2p5j12
$$ -108 -91 58 114 -2 -92 -92 -29 32 91 0 -132 -80 74 118 -49 -91 -29 11 126 122 -59 -87 -60 49 131 56 -56
7107e6l7Q7J08K7j22j48M0J57M4r0j19N9K7N9M0j30p2K9J61N9j25l6n1P0M4N1
$$ -56 -93 -6 102 129 7 -141 -101 56 100 10 -109 -50 -23 36 76 -54 -126 -97 64 123 -2 -38 -89 -19 25 76
7133G6n4q4k9K12m0m1m7r8K0K06k1l2j64k8J70K1J0j08J7k7M8M5j9j27j6J60J10
$$ 76 22 -62 -91 121 81 40 -7 -105 -85 121 100 68 -96 -124 46 67 77 -31 -14 -41 7 52 33 -94 -110 50 160
7160A60j70q3K0k3R5J06m5j10q1J26J15p0j56L6Q1L8N0m7p7j08J38J07m8o9p6
$$ 160 -10 -93 -73 -96 -1 105 60 -50 -131 -5 110 40 -116 -80 1 39 89 42 -35 -143 -5 102 54 -15 -91
7185i1N7P0Q4j07r8K0R2L3k7q0J0k3J00J4J7j17r8J26J41j03m4p1O1P4J1n0o6
$$ -91 -34 36 120 13 -85 -65 27 60 33 -47 -37 -60 40 54 71 -46 -144 -18 123 20 -24 -95 -34 40 51 1 -65
7212f5o9J03J33m3o5r4L5O0J25j11m6q2P2J71n2p4q3J0Q1R9m9j08l0M7R6L8j19
$$ -65 -134 -31 102 59 -6 -100 -65 -5 120 9 -37 -119 -47 124 72 -2 -85 -75 6 105 56 -52 -82 -35 61 99 -20
7239b0p4O3PN7K9r4p9K2J26K7r2n0L9Q4jP2j13j02Q4Q4j4n0j10P7L6P1N3j04j28
$$ -20 -94 -31 -24 33 62 -32 -111 -89 37 64 -28 -78 -39 45 44 116 3 -99 -15 69 55 5 -105 -28 8 79 132 28 -100
7268a00J3J47M2j07k3qO2M4J0m6j06L7Q9O5r6o6j2K9N1l5J1j49Q4J10O7j08n5
$$ -100 -87 60 102 -5 -28 -36 26 70 80 34 -72 -35 54 119 23 -43 -55 -26 25 -10 1 -148 -64 46 113 5 -50
7295e0oL8N2P7j21k1r0J24J08j10o1L9MM3L7n1n0J5M1J7j6n4q4J05N5P9j11l8
$$ -50 -56 -18 34 111 -10 -31 -121 3 111 1 -60 -21 -17 26 63 12 -38 -23 18 35 19 -35 -119 -14 41 120 9 -29
7323b9k3R6J3r2j2l0M8M0J9m0p9j3P8J12p0j5q4L4Q8j8J4j15N3Q2l0%p9J0J6N5
$$ -29 -52 44 57 -35 -47 -77 -29 11 30 -10 -89 -102 -24 88 18 3 -81 -47 41 23 37 -78 -25 57 27 27 -52 -42 -26 29
7353B9L5k6j13mJ26Lj6j11J8L8L8J00j07p2k7J11N7mj11k7L5j0J55q8j03J4Q6
$$ 29 64 38 -75 -79 47 50 34 -77 -59 -21 17 117 10 -62 -89 22 79 75 -36 -63 -28 -38 117 29 -74 -60 26
7380B6J8k4o8nk5P8P4k0p5m7N8N7J7q0l4N8l5Q7M2j88j9J42J6Nk8q8MP5O0l0j42
$$ 26 44 20 -48 -53 -78 0 74 54 -21 -68 -10 47 64 -16 -50 8 -27 60 102 -86 -105 37 53 58 30 -58 -54 21 81 51 -91
7411i1J5j1J07K3k8p9%O7L1J3o6q7R2N7J2m9nr0Q5M5nj2j07Q3M9O8j31J0l8P4
$$ -91 -76 -87 20 43 15 -64 -64 3 34 47 -19 -106 -14 43 55 6 1 -89 -4 41 36 24 -83 0 49 117 -14 -4 -42 32
7441C2QN3l7j59L1R5N0l1r1J5MJ42l1q8j11K8J38L2k0n4n8N1L1N0n4j31Q8P0n
$$ 32 40 93 56 -103 -72 23 73 42 -49 -34 -30 112 81 -7 -118 -90 48 80 60 6 -52 -1 30 80 26 -105 -17 53 48
7470D8n9l5l5L6N2O7l3n9k7J05M2j10j5k0LJ03l0L7j18lQ8K5m3l2l5nR0j1J0o7
$$ 48 -11 -46 -81 -45 7 74 41 -18 -45 60 102 -8 -23 -43 -40 63 33 70 -48 -51 37 62 19 -13 -48 -53 37 26 36 -31
7500c1q2R2O4J6j01l8M0M1N4k0q0p4J21P2Om4j38J8J47K0n6Oj07L9J32n4k0p4
$$ -31 -113 -21 43 59 -42 -80 -40 1 55 35 -45 -119 2 74 80 36 -102 -84 63 83 27 33 -74 -35 97 43 23 -51
7528e1PQ4K0L8r1n3k2J56Jq8q2L8N6O5N5j75m9N0J09r4m2M3j0L5N6k5q2K2j0J10
$$ -51 -44 40 60 98 7 -46 -68 88 89 1 -81 -43 13 78 133 -42 -91 -41 68 -26 -68 -25 -35 0 56 31 -51 -29 -39 71
7558G1K0q0j14O9L1M8O0j18r3R4L5L1j5o4J7l7J41k5q8m0k1J10K3q9l2K8J9L1
$$ 71 91 11 -103 -34 -3 45 105 -13 -106 -12 23 54 39 -25 -8 -45 96 71 -17 -57 -78 32 55 -34 -66 -38 -19 12
7586A2J9p2l6L9R0L9p0p5k9K2J13pr3J1m3R6O8p9r8J7P8O2L1l2j23lP1Q1k6q0
$$ 12 31 -41 -77 -38 52 91 21 -54 -83 -61 52 45 -48 -37 -80 16 84 5 -93 -76 2 64 95 63 -60 -63 8 89 63 -17
7616a7j1j1O3L8l6j57N6O0N4K0j28k2K4J18J0j2j36K0O1J50j31n9JRJ20J3r8p4
$$ -17 -28 -39 24 62 26 -131 -75 -15 39 59 -69 -91 -67 51 61 49 -87 -67 -6 144 13 -46 -45 -36 84 97 -1 -75
7644g5j8J43O5p3j18k4L6R6J7Pj21j6Q6P5Jj45o4L1J46j5nj08RO0M1%o9n1JP2
$$ -75 -93 50 115 42 -76 -100 -64 32 49 56 -65 -81 5 80 81 -64 -128 -97 49 34 29 -79 -70 -10 31 31 -38 -89 -88 -16
7674a6J34j07p1p7J33R8p8n1m9N5P4K3Rj84l8J38J37o8p5n4J2R7L1K3j05p7M9
$$ -16 118 11 -60 -137 -4 94 16 -35 -84 -29 45 68 77 -107 -145 -7 130 62 -13 -67 -55 42 73 96 -9 -86 -37
7701c7J12k8l2q2m4J11J15Mj68p9J37P0mo9o1o1J20L0K6j43n2J11J02Oq1p7j4
$$ -37 75 47 15 -67 -111 0 115 119 -49 -128 9 79 75 6 -55 -116 4 34 60 -83 -135 -24 78 84 3 -74 -88
7728h8N1J46K4j75n9L6J37Lk4r9p5J24O2k2p7p4Q1J25l6oj54oP4J08l5p3p0M9
$$ -88 -37 109 133 -42 -101 -65 72 75 51 -48 -123 1 63 41 -36 -110 -29 96 60 54 -100 -106 -32 76 41 -32 -102 -53
7756e3J09j0l4r5l5R0J42o5r0k9MR8R2m9j20r8J11J69o7o3r1J0R8J69j57r1k6
$$ -53 56 46 12 -83 -118 -28 114 49 -41 -70 -66 32 124 75 -45 -143 -32 137 70 7 -84 -74 24 193 36 -55 -81
7783h1J24J2Q7j17j58P2O4R8j6j66q3P3J50L0r8j13l6J66R0k7q6j21O1J89j8m7
$$ -81 43 55 142 25 -133 -61 3 101 85 -81 -164 -91 59 89 -9 -122 -158 8 98 71 -15 -136 -75 114 96 49
7809D9j26n5J85Q8m5j24m8L9Q7R6j37p9qJ00Q0oj18p1J6J38K5Mj74k8J50O0r5
$$ 49 -77 -132 53 141 96 -28 -76 -37 50 146 9 -70 -78 22 102 96 -22 -93 -77 61 86 90 -84 -112 38 98 3
7836Cn3o1m0K01J4rj74PQ9R5M0j03j30J9J55Q8j25j11n4J21J47j2j44p9O0J27
$$ 3 -50 -111 -151 50 64 55 -119 -112 -23 72 112 9 -121 -102 53 141 16 -95 -149 -28 119 107 -37 -116 -56 71
7862G1Q6q1j57j8O7O8J16k06m2K8Q6J25r0r6j01P9J15L2p6o8J6J00J01p6j67p7
$$ 71 157 76 -81 -99 -32 36 152 -54 -96 -68 18 143 53 -43 -144 -65 50 82 6 -62 -46 54 155 79 -88 -165
7888a65J19J12J00j63j09l9J77J63r5j89j02J68J44N2j62j12K7J03J08o3j18j13
$$ -165 -46 66 166 3 -106 -145 32 195 100 -89 -191 -23 121 173 11 -101 -74 29 137 74 -44 -157
7910a57J24J22P5j23j37n6J28J41j6j63m0N6R6J00j00j32m9J20J51j4j94p8N4
$$ -157 -33 89 164 41 -96 -152 -24 117 101 -62 -102 -46 50 150 50 -82 -131 -11 140 126 -68 -146 -92
7933i2J47O1r8j19j7J25R4K2j89r5P3J50J07q6j49p5J86J11o7j82o2J10J42P1
$$ -92 55 116 18 -101 -118 7 101 123 -66 -161 -88 62 169 83 -66 -141 45 156 89 -93 -155 -45 97 168
7957A68j43j12m7J28J37k4p9j91M6K21Mq4j03n5N8J95k6q2j09PJ33R0m6k12mJ08
$$ 168 25 -87 -134 -6 131 107 28 -163 -117 104 108 24 -79 -134 -76 119 93 11 -98 -91 42 132 86 -126 -130 -22
7983b2J53rj49q8N0Q2J68r3j48n0R7J52Kl5j91M2J17M0j6j92k7J24J05m2n7j42
$$ -22 131 122 -27 -115 -65 17 185 92 -56 -106 -9 143 145 110 -81 -39 78 118 102 -90 -117 7 112 70 13 -129
8009a29pJ85J37j09j67j08J40J75P2k30q8j5J82Q1q1n5j14J03J75m9j04q7j4J33
$$ -129 -136 49 186 77 -90 -198 -58 117 189 -41 -129 -144 38 119 38 -17 -131 -28 147 98 -6 -93 -107 26
8033B6J20m1j90k7J08R0J4o4j82K0J35J21o4r9m1J6J52M1o5k57N9J57N7Mj62j04
$$ 26 146 105 -85 -112 -4 86 100 36 -146 -126 9 130 66 -33 -74 -58 94 135 70 -187 -128 29 86 90 -72 -176
8059a76L4J73J30j45j31k5J72J12j7j28j61P0J64R6j40q8r2J34J73k8j59j05Q3
$$ -176 -142 31 161 16 -115 -140 32 144 127 -1 -162 -92 72 168 28 -60 -152 -18 155 127 -32 -137 -54
8082e4J57J9n7j71k4J04J35J9j61o6rJ15J55q6k22JJ24R0O5j65r6K1R5J32r4r1
$$ -54 103 122 65 -106 -130 -26 109 128 -33 -99 -108 7 162 76 -146 -145 -21 69 134 -31 -127 -106 -11 121 27 -64
8108f4q4Q4J83J2j27r9l2J54J49p5j67o1Q9J66k1n1k03P8R0J08m8j44j01J08J18
$$ -64 -148 -64 119 131 4 -95 -127 27 176 101 -66 -127 -38 128 107 56 -147 -69 21 129 81 -63 -164 -56 62
8133F2N7q0j37j7J10J14m2j36q2N0J85K4q3j49n3K14R9n2j36k6K0J32Q2j04j35
$$ 62 119 39 -98 -115 -5 109 67 -69 -151 -101 84 108 25 -124 -177 37 136 84 -52 -78 -58 74 156 52 -83
8158h3LQ4J53m6j62o9J32J01M6p1j56r1J30J71r8q4p9M6J34N9o6j65n0J27J62
$$ -83 -80 4 157 111 -51 -120 12 113 159 88 -68 -159 -29 142 44 -40 -119 -73 61 120 54 -111 -161 -34 128
8183A28rj64j14Q6J36O9n4j69
$$ 128 119 -45 -159 -73 63 132 78 -91
8191i1
$$ Imaginary data points
##PAGE= N=2
##DATA TABLE= (X++(I..I)), XYDATA
0@%%%%%%%%%%%%%%%%%%mRj3J6j6J6j6J6j7K1k5K7l1L7m0M0m6N2n5O2o6P1p9Q6
$$ 0 0 0 0 0 0 0 0 0 0 0 0 0 0 0 0 0 0 0 -4 5 -8 8 -8 8 -8 8 -9 12 -13 14 -17 20 -20 20 -26 26 -29 33 -33 38 -41 45
42D5r2R9j09J17j25J37j50J66j84K02k24K52k84L21l68M27n02N99p29R06j158
$$ 45 -47 52 -57 60 -65 72 -78 88 -96 106 -118 134 -150 171 -197 230 -272 327 -402 504 -654
63f54J534k122L114m971R042k0986J10639M07595m77580k43869K60915j32815
$$ -654 880 -1242 1872 -3099 5943 -15043 95596 503191 25611 -218258 42657 -90158
75i0158L8789L17599j64118k90403Q5029J22116K8670J2652k8429q9580r4930
$$ -90158 -51369 266230 102112 -188291 -103262 18854 47524 60176 31747 -57833 -152763
86a52763J45532K44810j71783k86924J10846J75345K5866J4052j54190j66843
$$ -152763 -7231 237579 65796 -221128 -110282 65063 90929 104981 -49209 -216052
96b16052J68960K11902n4192j01213k7884p0329j0508K08144J22110k47597j93655
$$ -216052 -47092 164810 110618 9405 -18479 -88808 -99316 108828 230938 -16659 -210314
107b10314J37732J03059K6779N8792j57726j60663J84960J60400q5920q9100l6943
$$ -210314 -72582 30477 57256 116048 -41678 -202341 -17381 143019 57099 -32001 -68944
118f8944L1636P4353l16J7642l9607j69702Q3455K50029o3049j58909k7233k9744
$$ -68944 -37308 37045 36729 54371 14764 -154938 -71483 178546 115497 -43412 -70645 -100389
130a00389J26031J58141j39673j46446P684N239J43643J01836j91229q0619R6533
$$ -100389 25642 183783 44110 -102336 -94652 -89413 54230 156066 -35163 -115782 -19249
141a9249k1099Q0830J29699j74573j53706J27951J08081Q551m9489j33560n908
$$ -19249 -40348 40482 170181 -4392 -158098 -30147 77934 86485 36996 -96564 -102472
152a02472J52372M9813o0485o4768o6364L3098J42080L4271j30034r7040K8369
$$ -102472 49900 99713 39228 -25540 -91904 -58806 83274 117545 -12489 -109529 -81160
163h1160P1724P7601L1100j16377j26286P6610J55972L6886q0818j26813j8187
$$ -81160 -9436 68165 99265 -17112 -143398 -66788 89184 126070 45252 -81561 -99748
174i9748J31633O1436n1716m7637q0243q426J60445N1561j35059n9790K9023L9865
$$ -99748 31885 93321 41605 -6032 -86275 -94701 65744 117305 -17754 -77544 -48521 -8656
186h656P9784O457j07087p0697L1292J15753P5824j07142j20120M8156Q0652M2036
$$ -8656 71128 77585 -29502 -100199 -68907 46846 122670 15528 -104592 -56436 24216 66252
198F6252K2941q3907j02621M8219J04375K4022n7817r2349j5708Q2170N5989m202
$$ 66252 89193 5286 -97335 -49116 55259 79281 21464 -70885 -86593 -4423 51566 47364
210D7364m3653q0443J530J25211N6266r0428q5509P108O2856O1111j061o6151
$$ 47364 3711 -76732 -75202 50009 106275 15847 -69662 -62554 302 61413 60352 -5799
222e799n9407R808Q3946P1400n1263j09351p518O8948L7077J2131l2123r8167
$$ -5799 -65206 -55398 28548 99948 48685 -60666 -68184 764 37841 49972 17849 -80318
234h0318j5092J22261O1204p1772o5863k570L9675O4623J7682o0008o3993l439
$$ -80318 -95410 26851 88055 16283 -49580 -52150 -12475 52148 69830 9822 -54171 -57610
246e7610O7362P2655l1878j02642k3500O6654N7006J3223l8388q1478k1536R0900
$$ -57610 9752 82407 50529 -52113 -75613 -8959 48047 61270 22882 -58596 -80132 10768
258A0768P4260m8481r0655k0834N0739O1461J9600l7664o4388k0477P4039Q5928
$$ 10768 85028 36547 -54108 -74942 -24203 37258 56858 19194 -45194 -65671 8368 94296
270I4296l5086j03706k1044N4865M6774J8708l5361q0345j7212Q5006P2724l3519
$$ 94296 59210 -44496 -65540 -10675 36099 54807 19446 -60899 -78111 6895 79619 46100
282D6100q7072k8633N0027N8628J6197l8656o9018j7332P0228P0043j8994p9193
$$ 46100 -40972 -69605 -19578 39050 55247 16591 -52427 -69759 469 70512 51518 -27675
294b7675l4706N1097N9107M511l0013n2580l6265N4904Q1083k6456q8402k2321
$$ -27675 -62381 -11284 47823 52334 22321 -30259 -66524 -11620 69463 43007 -45395 -67716
306f7716M6571N0188J7103k8003n4008k1608N3576P0071j6352p8262k8082L8115
$$ -67716 -21145 29043 46146 18143 -35865 -57473 -3897 66174 49822 -28440 -56522 -18407
318a8407M4815K0631k0352n4817k6422M7588O7616o603p4130l8870L3953M5492
$$ -18407 26408 47039 26687 -28130 -54552 -6964 60652 54049 -20081 -58951 -24998 20494
330B0494J4375j9531m7195k8519L9790O8608N530o4954m1061L2727M8450J4258
$$ 20494 34869 15338 -31857 -60376 -20586 48022 53552 -11402 -52463 -19736 28714 42972
342D2972j5310m3039l8437L1060P0558N205o4564l9172K4709M3415K1960j0441
$$ 42972 27662 -15377 -53814 -22754 47804 53009 -11555 -50727 -26018 17397 39357 28916
354B8916m4775m1473K6528P1810J1445o5991m3749K5746M7595K6819j0882m6137
$$ 28916 -15859 -57332 -30804 41006 52451 -13540 -57289 -31543 16052 42871 31989 -14148
366a4148l1702K9701N9475J3731n4737n4478J6190N2119J9817j2926l5933m1922
$$ -14148 -45850 -16149 43326 57057 2320 -52158 -35968 16151 35968 23042 -12891 -54813
378e4813K0991P5955J6197o3406m5996J7964M6971K5514j6784l8194k7567J5892
$$ -54813 -33822 42133 58330 -5076 -51072 -33108 13863 39377 22593 -15601 -43168 -27276
390b7276O0261K5172n3984m6832J9845L8501J9574o562m0217l6115J9005N5077
$$ -27276 32985 58157 4173 -42659 -22814 15687 35261 28699 -11518 -47633 -28628 26449
402B6449J8298m7844m7300J8507M6817J7745j0273k7959l1014R393N3472K6141
$$ 26449 44747 -3097 -50397 -31890 14927 32672 22399 -5560 -36574 -27181 26291 52432
414E2432m3776n0614J0194M1492K2898l076l2559l4100J4822M4872J7047k9880
$$ 52432 8656 -41958 -31764 9728 32626 29550 -3009 -37109 -22287 22585 39632 9752
426I752m6134J44M3091J2687j1167n171l2064j1082O1286L0839m4436l4650p86
$$ 9752 -36382 -36238 6853 19540 8373 3202 -28862 -39944 21342 52181 7745 -26905 -27691
439b7691K7418M1472j1675m5222j0648M418K4573M3375k4447n8869J0221L0051
$$ -27691 -273 41199 29524 -15698 -26346 -21928 2645 46020 21573 -37296 -27075 2976
451B976O442J7955j1252n1303o457M6964L3192j7096m9594j1856M5630K8222j5069
$$ 2976 9418 27373 16121 -35182 -41639 5325 38517 21421 -28173 -40029 5601 33823 18754
464A8754j7579j6851q043L1595L3404k4183m5873k186K5064J9781J6330j6662
$$ 18754 1175 -15676 -23719 7876 41280 17097 -28776 -30962 -5898 13883 30213 13551
476A3551n1790m751N6104L1988k3511m5599j8022L8180L4279j4751j5229j0400
$$ 13551 -38239 -42990 13114 45102 21591 -24008 -42030 -3850 30429 15678 449 -9951
488i951j7308K4917L8851j4469l2274j3621P963L7687J1819l9172k3835L367K1680
$$ -9951 -27259 -2342 36509 22040 -10234 -23855 -15892 21795 33614 -5558 -29393 -26026 -4346
501d346M2678j3838o3539O847M4478J368L220p99l5425p445K7834J9599R591k8196
$$ -4346 38332 24494 -39045 -32198 12280 13648 16868 16069 -19356 -26801 1033 20632 30223 2027
515B027m4214K5043M8842r390k2285r506j5471J8551L9220j5965m3251J148K4870
$$ 2027 -42187 -17144 31698 22308 23 -9483 -24954 -6403 32817 16852 -26399 -25251 -381
528c81Q365J675j186j6488j7247J3816M0261J0101m6338l1261L2072K8301p796
$$ -381 7984 9659 8473 -8015 -25262 -11446 28815 38916 -7422 -38683 -6611 21690 13894
541A3894j091j6774l2889K8784M3523k6779k1762J2649j5513M827L9518j5566
$$ 13894 12803 -3971 -36860 -8076 35447 8668 -13094 -445 -15958 -11131 28387 12821
553A2821l5728P793P599J3964K6259k9622m3043K7029L9169k744j5108j7917j2529
$$ 12821 -22907 -15114 -7515 6449 32708 3086 -39957 -12928 26241 23497 8389 -9528 -22057
566b2057J2815K5201J1810k2204l5940O309L3108N831m135n239k8324l533M4321
$$ -22057 -9242 15959 27769 5565 -30375 -24066 9042 14873 10738 5499 -22825 -26358 17963
579A7963J4234l6698k0455J4696J9973P612j0561j7071m734R988K1534J1607k7622
$$ 17963 32197 -4501 -24956 -10260 9713 17325 6764 -10307 -15041 -5053 16481 28088 466
592D66l1197J5716K7503K105j075j3973l3289P467M7032J0707k8996k1757q06
$$ 466 -30731 -15015 12488 14593 13518 -455 -33744 -26277 20755 31462 2466 -19291 -20097
605b0097K1321J9402r208j3795m564n182J4558J8314j8871j7511J3108N794K902
$$ -20097 1224 20626 11418 -2377 -6941 -12123 2435 20749 1878 -15633 -2525 3269 6171
618F171R489k0614k3061K1826K4809k490j3236k6315p657M0380K1393k6446j0404
$$ 6171 15660 -4954 -28015 -6189 18620 16130 2894 -23421 -31078 9302 30695 4249 -6155
631f155J548j5364J5598L6670j2916l3021j066P380R194J6891q493k5192K12J7593
$$ -6155 -4607 -19971 -4373 32297 19381 -13640 -14706 -7326 1868 18759 10266 -14926 -14714 2879
645B879J0056p095j9710Q17K3116L83j4864J668k982r140J7385K2398j1745k8417
$$ 2879 12935 5840 -13870 -13053 10063 10446 -4418 -2750 -5732 -14872 2513 24911 13166 -15251
659a5251p682J9319K3078L975j7108k5315o577K6471K2932j1631k0206n374L558
$$ -15251 -22933 -3614 19464 23439 6331 -18984 -25561 910 23842 12211 -7995 -13369 -9811
672i811J0240R866j988r863r883K371J9617N306k4039j0579K1082J4570q387j2101
$$ -9811 429 10295 8307 -1556 -11439 -9068 10549 15855 -8184 -18763 2319 16889 8502 -3599
686c599q641P2J8914J6638j4059k4341k968J1742J3909R271r206j9792p986J0231
$$ -3599 -12240 -12168 6746 23384 9325 -15016 -17984 -6242 7667 16938 7732 -12060 -20046 -9815
700i815K4380J0368k6972j9854J8651J2164n478L418n871j3457J1440J2906r121
$$ -9815 14565 24933 -2039 -21893 -3242 8922 3444 6862 991 -12466 -1026 11880 2759
713B759p812r79J797J1567L708j2672q932j055P787J8668J623k5198j2822J5598
$$ 2759 -5053 -6032 -4235 7332 11040 -1632 -10564 -11619 -3832 14836 16459 -8739 -21561 -5963
727e963J6377J834n046r486j0836M390J8952N594j3527j1127N4P819Q821j767
$$ -5963 10414 12248 7202 -2284 -13120 -8730 10222 15816 2289 -8838 -8784 -965 7856 6089
741F089q466m504K53R858R072j3549j4247J1992J1755m056j823l485j0349M050
$$ 6089 -2377 -6881 -6628 3230 12302 -1247 -15494 -3502 8253 4197 2374 -1111 -11460 -7410
755g410J8202N349j4868j3869L099J2159Q028l09j0821j3357K888J6742P718r966
$$ -7410 10792 16141 1273 -12596 -9497 2662 10690 10381 -440 -13797 -10909 5833 13551 3585
769C585j3759L76J1447M397j746k176r089l479J5508Q790j2590j0939K205Q306
$$ 3585 -10174 -9798 1649 6046 4300 2124 -6965 -10444 5064 13854 1264 -9675 -7470 836
783H36R414q45j3049p835N161J1911P592q846j6200K35J3402N955k502m257p871
$$ 836 10250 9405 -3644 -11479 -6318 5593 13185 4339 -11861 -11626 1776 7731 5229 972 -6899
798f899l541J1940J2396p708j4676j30R663N694k61n935q016J84J0191P851o193
$$ -6899 -10440 1500 13896 6188 -8488 -8618 1045 6739 6478 543 -7473 -7289 2902 10753 4560
813D560j3088j136J0992N481k826l536o469m004J0745J1479p266j2386L58O831
$$ 4560 -8528 -9664 1328 6809 3983 447 -6022 -10026 719 12198 4932 -7454 -7096 -265
827b65M910K239l605q109k852P385R477j943j1914m676P524O762L29l678o752
$$ -265 4645 6884 3279 -4830 -7682 -297 9180 7237 -4677 -9353 -1829 4933 5262 1584 -5168
842e168l110P362Q993k335j0058l462N598N183J874j81o778p307O464J2133m59
$$ -5168 -8278 -916 8077 5742 -4316 -7778 -2180 3003 4877 4696 -2082 -9389 -2925 9208 8749
857H749j0647o679M214R143K047m815n309m283L503J1540R68j1802m732M878N068
$$ 8749 -1898 -8577 -4363 4780 6827 2012 -3297 -7580 -4077 7463 8431 -3371 -8103 -3225 1843
872A843M052o47q263o132N467J1294J778j0929p298M778P350K948k052o822n300
$$ 1843 5895 5248 -3015 -9147 -3680 7614 9392 -1537 -8835 -4057 3293 6241 4189 -2633 -7933
887g933L859J0084K920j0051p781M727O945K677p96p221n523N587Q391J488o550
$$ -7933 -4074 6010 8930 -1121 -8902 -4175 2770 5447 4651 -2570 -8093 -2506 5885 7373 823
902H23q263K204Q875Q66j565k119q367R23J3150J353r273l921M2N180O594l268
$$ 823 -7440 -5236 3639 4505 2940 821 -7546 -6623 6527 7880 -1393 -5314 -5272 -92 6502 3234
918C234n726j391r27O761P331q288p874M802K947J417L708n292p665L334O703
$$ 3234 -2492 -3883 -4810 1951 9282 994 -6880 -2078 869 2286 5994 702 -6963 -3629 3074
933C074K161k351p008k751O704M981j606k840m258l103P160Q904n649r532J726
$$ 3074 5235 2884 -4124 -6875 -171 4810 3204 364 -3894 -6997 163 9067 3418 -6114 -4388
948d388M167J880L913k368q551L16O084L421P22o211o028N354N144k74K62o868
$$ -4388 -221 1659 5572 3204 -5347 -5031 1053 4474 5196 -1015 -7043 -1689 3455 3181 3443 -3425
964c425n770J0817P297p805n062n01J286P931J457p403k263j092J552J0371K30
$$ -3425 -9195 1622 8919 1114 -3948 -4449 -3163 4768 6225 -1178 -3441 -4533 -2981 7390 7620
979G620j1852k133L903L018O811j905j1552r89P346M199J006o342o131O186M784
$$ 7620 -4232 -6365 -2462 556 7367 5462 -6090 -7079 267 4466 5472 -870 -7001 -815 3969
994C969l485J333j028p406M838R663n226o677J399p41L855Q293o140j0745L177
$$ 3969 484 1817 789 -6617 -1779 7884 2658 -4019 -2620 -3361 494 8787 2647 -8098 -4921
1009d921N371K782M095o851r614O327N839j991M275k384j1493M245R664k603r65
$$ -4921 450 3232 7327 476 -9138 -2811 3028 1037 5312 2928 -8565 -4320 5344 2741 1776
1024A776j725o531O284P013p616k092L414l568M553N425j0215l249Q083j484P47
$$ 1776 51 -6480 -196 6817 -799 -2891 523 -3045 1508 6933 -3282 -6531 1552 68 815
1039H15O343q173q742O974O800K265j152j0718l782J0828L981k710K36o089m022
$$ 815 7158 -1015 -9757 -2783 4017 6282 5130 -5588 -9370 1458 5439 2729 2965 -3124 -7146
1054g146Q634L153m457J484k265n353O598N412o197l912J208L735N833m716j0280
$$ -7146 1488 4641 184 1668 -597 -5950 648 6060 -137 -4049 -2841 894 6727 2011 -8269
1069h269L990P801O4P16m296q261M824P482j303J926k487j1404K915J2163j74
$$ -8269 -4279 3522 3586 4302 6 -8255 -3431 4051 2748 4674 2187 -9217 -6302 5861 5687
1084E687l100l797p342O390J1122o986o864N112m09p03M671m107m046N062j18
$$ 5687 2587 -1210 -8552 -2162 8960 1974 -4890 222 -187 -890 3781 -326 -4372 690 572
1099E72l73N156o476q214Q861O731l312n37n977o464J1649Q285r319k658J741
$$ 572 199 5355 -1121 -9335 -474 6257 2945 2408 -3569 -10033 1616 9901 582 -2076 -335
1114c35n134M390P877m805l050j77m295O523P211r853m257P280p00P06K566q807
$$ -335 -5469 -1079 6798 1993 -1057 -1234 -5529 994 8205 -1648 -5905 1375 675 1381 3947 -4860
1130d860j273J0925j073m858K603m311l284Q187L614l143k564o153k4J1059L122
$$ -4860 -6133 4792 3719 -1139 1464 -2847 -6131 2056 5670 2527 -37 -6190 -6214 4845 7967
1145G967p931m307L86L210N043j195m953n18J377J322K290j384l747j85K373L275
$$ 7967 36 -4271 -3885 -675 4368 3173 -1780 -2298 -921 401 2691 1307 -2440 -2625 -252 3023
1161C023J575o116o188N388P762l26l868n718l293Q223P356n231m272k75l471
$$ 3023 4598 -1518 -7706 -2318 5444 5118 1250 -4468 -7761 462 7818 2587 -1685 -1960 -5431
1176e431M502Q641n112o443K403o55K168O260n917o937O053L762j321P2n999k346
$$ -5431 -929 7712 2600 -3843 -1440 -2095 73 6333 416 -6521 -468 3294 1973 2045 -3954 -6300
1192f300R306K758m881j233m495j747J0428M299p444l471j748m60Q718M613q006
$$ -6300 3006 5764 883 -350 -4845 -6592 3836 8135 691 -2780 -4528 -4988 3730 8343 337
1207C37m960J566J845M224J557n426k647L008J380P98j84m324n32N827J625l852
$$ 337 -4623 -3057 -1212 3012 4569 -857 -3504 -496 884 1682 1498 -2826 -3358 2469 4094 242
1223B42k779j857K045P558J438q081m940K388M397M578Q95o411o095J895O565
$$ 242 -2537 -4394 -2349 5209 6647 -1434 -6374 -3986 411 4989 5884 -527 -6622 -4727 1838
1238A838L650j766m871l714J169O093L267n194m589K593L086K68n60l205j878
$$ 1838 5488 3722 -1149 -4863 -3694 2399 5666 472 -4117 -1524 1562 1830 1270 -1935 -3813
1253c813M787L851k954m149k256J372O292L573m731o391k221L973Q281K021q042
$$ -3813 974 4825 1871 -2278 -4534 -3162 3130 6703 1972 -4419 -6640 -2667 5614 7635 -407
1268d07n518J408L729N726J273q006m322M930L305M53j83m586k167N979L013m242
$$ -407 -5925 -4517 -788 4938 6211 -1795 -6117 -1187 2118 2571 2388 -2198 -4365 1614 4627 385
1284C85l175k88K479M628n1n229l849Q14N788N419l346p519k360L538O082L602
$$ 385 -2790 -3078 -599 4029 3978 -1251 -5100 -4286 1502 6921 3575 -3944 -6304 -2766 3316 6918
1300F918m526p623n95O070M388j083l704k950k38L876L982k434n021j99L195K900
$$ 6918 2392 -5231 -5826 244 4632 3549 -155 -3105 -3343 533 4515 2081 -2940 -3139 56 2956
1316B956K79m663l751L240N709R93m473n100L02N080M207k40n422n043K238N875
$$ 2956 3235 -1428 -5179 -1939 3770 4763 290 -4810 -4508 572 4779 4539 -883 -5926 -3688 2187
1332B187K959j307o282m244N098O157k38l740m697j47O157K403l016k513k750
$$ 2187 5146 3839 -2443 -6687 -1589 4568 4330 590 -4107 -4254 1903 4306 1290 -1223 -3973
1347c973J398P127R1o460j944Q06L016O111k393q603q48N051M499J545n261n822
$$ -3973 -2575 4552 4643 -1817 -3761 -2955 61 6172 3779 -4824 -5672 -621 3878 5423 162 -5660
1363e660J919M726L210K48n946m867L962O161J098l481n413r20N708M920k273
$$ -5660 -3741 985 4195 4443 -1503 -6370 -2408 3753 4851 1370 -4043 -4963 745 5665 3392
1378C392o175k338L578N097J300m423n305Q11N044L209k67n255n338L829P112
$$ 3392 -2783 -5121 -1543 3554 4854 431 -4874 -4063 981 4190 3923 -1332 -6670 -2841 4271
1393D271L62l366m746k525O182N995l175m421k608n5P098L679o648l860R07J292
$$ 4271 4633 1267 -3479 -6004 178 6173 2998 -1423 -4031 -4086 3012 6691 43 -3817 -2910 -1618
1409a618N872J483q178l088L997K880L416j524q093m09O159K121Q63k644p440
$$ -1618 4254 5737 -2441 -5529 -1532 1348 4764 3240 -4853 -5262 897 3018 3881 1237 -6203
1424f203J329Q739J323l977l398k815L092O919j58n934l322Q12M857M429l068
$$ -6203 -4874 3865 5188 1211 -2187 -5002 -1910 5009 4851 -1083 -4405 -3593 1264 5693 2625
1439B625o146r16L003M309K826m859p047K170O306K114r71n258m963N044O902
$$ 2625 -3521 -4437 -1434 2875 5701 842 -6205 -4035 2271 4385 3414 -1844 -6807 -1763 5139
1454E139j294l444l689k606O606O446n046n264k93J11N772M870p090o003K702
$$ 5139 3845 401 -3288 -5894 712 7158 2112 -3152 -3445 -3334 2438 7308 218 -5785 -3083
1469c083L266M364J092q658l774O500L223Q85m69q241k396R825L272m290j883
$$ -3083 183 4547 5639 -3019 -6793 -293 2930 3815 3346 -4895 -7291 2534 5806 1516 -367
1484c67m319n46R602K430p630k843j1J640P845n7r728j025M390J376M251p02r748
$$ -367 -4686 -5232 4370 6800 -830 -3673 -3684 -2044 5801 5744 -3984 -5009 -619 757 5008 4306 -5442
1501e442m43P899J852n17k595p049J835Q871N95m047l482l506M662P863k763n984
$$ -5442 -5885 2014 3866 3349 754 -6295 -4460 4411 5006 959 -2523 -6029 -1367 6496 3733 -2251
1517b251j265j90M262N730l682o479l50K428N090L015o579o050L771M734J937
$$ -2251 -3516 -3706 556 6286 2604 -3875 -4225 -1797 3293 6308 -271 -6321 -2550 2184 4121
1532D121m67o761l838P177N231k829k822l332j597O799M865m479m577k436Q20
$$ 4121 3654 -3107 -6945 232 5463 2634 -188 -3520 -5117 1682 6547 2068 -2509 -4945 -4125
1547d125Q667L182r093m330K767K208N878J055j0291k379P098J323J243M51q486
$$ -4125 4542 7724 -1369 -5699 -2932 -724 5154 6209 -4082 -6461 637 1960 3203 3654 -4832
1562d832j147Q797J132k006j299o866J749J1361r94q137j255q19L330Q593l183
$$ -4832 -5979 2818 3950 1944 645 -6221 -4472 6889 5895 -2242 -3497 -4316 -986 7607 4424
1577D424r339R2K787L313N656l621r458O97N962K992J720m339p945K716Q694M11
$$ 4424 -4915 -4823 -2036 1277 6933 3312 -6146 -5449 513 3505 5225 886 -7059 -4343 4351 4762
1593D762m327l033j548L712N448j682n389k018J238N290L857n283o408P63L942
$$ 4762 435 -2598 -4146 -434 5014 3332 -2057 -4075 -2837 2453 6310 1027 -5381 -4618 -676
1608f76N402K239q184o949M932O262K065j098p180l956O144M838rj744o006j786
$$ -676 4726 6965 -1219 -8168 -3236 3026 5091 3993 -3187 -7143 -999 3839 3830 2086 -3920 -5706
1624e706P656L166l726k596k871J592P600n50p352j439J726L612N442l619q764
$$ -5706 1950 5116 1390 -1206 -4077 -2485 5115 4565 -2787 -4226 -2500 1112 6554 2935 -5829
1639e829P32N195L110K893m198r212J031Q440L354j298n106o235L182Q462O33
$$ -5829 -5097 98 3208 6101 1903 -7309 -6278 2162 5516 4218 -888 -7123 -3941 4521 5154
1654E154m175l452k399M069O335k906n794L74J445K757M089m197p487K301O545
$$ 5154 979 -2473 -4872 -803 5532 2626 -3168 -2794 -1349 1408 5497 1300 -6187 -3886 2659
1669B659K209r74o250n534N128Q189L19m668n722k100O550O789k090n695l442
$$ 2659 4868 3894 -2356 -7890 -2762 5427 5746 1078 -4644 -6744 -194 6595 4505 -1190 -4632
1684d632L90N673M438l500n840j015L652M900K14n993l385L649M744J213l390
$$ -4632 -4242 1431 5869 2369 -3471 -4486 -834 4066 4280 -1713 -5098 -1449 3295 4508 1118
1699A118n822n61O316M568j878n488m453K284P234L023l584o089l374M779P605
$$ 1118 -4704 -5265 1051 5619 3741 -1747 -6200 -3916 3318 6341 2757 -3332 -6706 -1927 5678
1714E678n95o025l400J78M686N121k935o123k94L189L754J375n254m787K987M900
$$ 5678 5083 -942 -4342 -4164 522 5643 2708 -3415 -3709 -520 3234 4609 -645 -5432 -2445 2455
1730B455J939j860o332k702O323N889j274m761m855J19O834M630l424o121k284
$$ 2455 4394 2534 -3798 -6500 -177 5712 4438 -323 -5178 -5059 1775 6405 2981 -3140 -5424
1745e424K701N974K609m992n812J282N022K756o60n000m252M001O391o31m481
$$ -5424 -2723 3251 5860 868 -4944 -3662 1360 4116 3456 -1544 -5796 -1795 4596 3965 -516
1760e16l622l24N693N098l149o013k552K689O720K316n908n563K50M417N651l20
$$ -516 -4138 -4462 1231 6329 3180 -2833 -5385 -2696 4024 6340 432 -5131 -4881 -464 5187 4867
1776D867o858l491L118N125K518l661n875L0M668L835o32n695l594L844N403J371
$$ 4867 -1991 -5482 -2364 2761 5279 1618 -4257 -4227 441 4276 3644 -2051 -5645 -1801 3602 4973
1792D973l369o179p61O422M375j666n060m893J862P537K708m381n138j440M006
$$ 4973 1604 -4575 -5336 1086 5461 3795 -1265 -6158 -4296 3241 5949 1568 -3570 -5010 -1004
1807a004N652M2n339m178J626N154K546k850m940j404M447M980r25m856l567J292
$$ -1004 4648 4690 -649 -4827 -3201 1953 4499 1649 -3291 -4695 -248 4732 3807 -1049 -4616 -3324
1823c324O142L359m775n761n86L658N702J117o390m773K277M848L787j619o667
$$ -3324 2818 6177 1402 -4359 -4945 -1287 4415 5532 -858 -5631 -3354 1494 5281 3662 -3005
1838c005k425M226M367J021l684n372R33N824K706k143m749k561L986N410k71
$$ -3005 -5430 -1204 3163 4184 500 -4872 -3939 1885 4591 2448 -2301 -4862 -876 4534 4263
1853D263m752m307M74N817M079k711n674k734L354O274J683m932n455k36N180
$$ 4263 -489 -4796 -4322 1495 5574 2863 -2811 -5545 -2191 4083 5766 834 -4621 -4857 323
1868C23M733j533n887k847K974N138J760l543m764l70M840M106j803n371k800
$$ 323 5056 3523 -2364 -5211 -2237 2901 4661 1118 -3646 -4016 824 4930 3127 -2244 -5044
1883e044K641N742J992m910n343P67N075M469j194o333l342L166M978K160k999
$$ -5044 -2403 3339 5331 421 -4922 -4155 920 5389 4195 -2138 -5480 -2314 2664 4824 1825
1898A825o068j110N320M283l49m274m651J822O400J815m001m491r72L884N076
$$ 1825 -4243 -5353 -33 4250 3901 -373 -5024 -3202 3198 5013 1012 -3479 -4451 -567 4509
1913D509q98n374k755K077M757L119l206n909j021M211M677K05n180m890K154
$$ 4509 3611 -1763 -4518 -2441 2316 5435 2229 -3680 -4701 -490 4187 4392 -788 -5678 -3524
1928c524N784K575k545n180k019M343M912m59m327l795L31N331L670l341m995
$$ -3524 2260 4835 2290 -2890 -4909 -566 4346 3887 -440 -4235 -3904 1427 5097 1756 -3239
1943c239j021L239N021J052n282m521J699M589L017j770n670k684M088N189O49
$$ -3239 -4260 -1021 4000 5052 -230 -4751 -3052 1537 4554 2784 -2886 -5570 -1482 3707 4356
1958D356l786m719m1N756L776k825m997k188K595N144J439m659m134P99M212M024
$$ 4356 570 -4149 -4190 1566 5342 2517 -2480 -4668 -2073 3071 4510 -149 -4283 -3484 728 4752
1974D752j016n978k742L609M555J241l546n626M0N937L463j898m521k923K746
$$ 4752 3736 -2242 -4984 -1375 3180 4421 875 -4751 -4711 1226 4689 2791 -1730 -4653 -1907
1989a907N505R39l743m390j018M630M742j855n175k219K162N187K356m119m886
$$ -1907 3598 4537 794 -3596 -4614 16 4758 2903 -2272 -4491 -2329 2858 5214 1095 -3791
2004c791J39M056L776p04n287l235K748M670K069k695n186j085M974M349j275
$$ -3791 -3652 404 4180 3476 -1811 -5046 -2298 2372 4441 1746 -3440 -4525 449 4798 3523
2019C523m759l322J690N158K099l457m307n82L312M583L72n197l604K279M081
$$ 3523 -1236 -4558 -2868 2290 4389 932 -3375 -3957 -645 3938 4310 -887 -4491 -2212 1869
2034A869K336j927n895j813N442M186j125l640l603J234N785J922l453l599j807
$$ 1869 4205 2278 -3617 -5430 12 4198 3073 -567 -4170 -2936 2849 4771 1318 -2281 -4088
2049d088K371N482M53n311l232J229M081L934j886n890j847M103M314J66m298
$$ -4088 -1717 3765 4218 -1093 -4325 -3096 985 4919 3033 -2857 -4704 -601 3713 3879 -419
2064d19m071J133M673K578j725m200k243K955M987R32m437m245N57M570L290j731
$$ -419 -4490 -3357 1316 3894 2169 -2031 -4274 -1319 3668 4600 163 -4082 -3525 1045 4335 2604
2080B604n250k392L639N083O21m209l746O59L998L061j268m842k734K777M732
$$ 2604 -2646 -5038 -1399 3684 4305 96 -3650 -2991 1007 4068 2800 -2042 -4776 -1999 2733
2095B733J226l375m482K11N069L223j942m326k681K267N330Q59m418l358J61L422
$$ 2733 3959 584 -3898 -3687 1382 4605 2663 -1663 -4344 -2077 3253 4112 -306 -3664 -3503 -81
2111h1M276m14n264k791K417M240K372l255n795r5M996K810r83l251l276J672
$$ -81 4195 3781 -1483 -4274 -1857 2383 4755 1500 -4295 -4390 606 3416 2433 -818 -4094 -2422
2127b422N456J319l830l260l48K599L918p2m857l313K145N103K531l407n207j02
$$ -2422 3034 4353 523 -2737 -3085 -486 3432 3360 -1497 -4810 -2665 2438 4969 1562 -3645 -3747
2143c747M278L410m62m216l778J454M813J938k236l632j579K696M485N79m185
$$ -3747 531 3941 3479 -737 -4515 -3061 1752 3690 1454 -2178 -3757 -1061 3424 4003 -182
2158a82l592J018M289K554k589n055o68M305L515m67l468l218P30M744K956k727
$$ -182 -3774 -2756 1533 4087 1498 -3557 -4225 80 3595 3128 -340 -3558 -2828 1916 4872 2145
2174B145n010j680L137M327J076l578m597L49N295L146k376m141j561K342L639
$$ 2145 -2865 -4545 -1408 2919 3995 417 -4180 -3831 1464 4610 2234 -1907 -3468 -1126 2513
2189B513M82l287k916J24L738L499k104m780p21L175L406R88l906m856J071N058
$$ 2513 2995 -292 -3208 -3084 654 4153 2049 -2731 -3452 -277 3129 4117 211 -4645 -3574 1484
2205A484K608j776m475k364K853M603J202k573m226j290L787M022j063m481k216
$$ 1484 4092 2316 -2159 -4523 -1670 2933 4135 1562 -2664 -3954 -167 3855 2792 -1689 -3905
2220c905K237L531J284k441l684K34M073K417j830l685k085K303M277O89l196
$$ -3905 -1668 1863 3147 706 -2978 -2744 1329 3746 1916 -1769 -3854 -1551 2726 3415 219
2235B19l460q50M104N001j276n408k333J967L942K153k584m451r15L182L629K9
$$ 219 -3241 -4091 13 5014 3738 -1670 -4003 -2036 1906 4059 1475 -2976 -3891 -709 2920 2949
2251B949l661k392J638L187J376j790l649j015L217L465p03m433k384K622M022
$$ 2949 -712 -3104 -1466 1721 3097 1307 -2342 -3357 -140 3325 2622 -1811 -4195 -1573 2449
2266B449J489k130m377j718L971M311o09m169l269Q11M270K660j770l605j726
$$ 2449 3938 1808 -2569 -4287 -316 3995 3386 -783 -4052 -3241 1029 3689 1919 -1686 -3412
2281c412K352L971M28l622k792J072L013J582j405l268j500L018M215m51m053
$$ -3412 -1060 2911 3339 -283 -3075 -2003 1010 2592 1187 -2081 -3581 -563 3652 3201 -852
2296h52k606J308L878K261k291m353j459K578M201J314l763l785R99L479K248
$$ -852 -3458 -2150 1728 3989 1698 -2655 -4114 -1536 2665 3979 216 -3569 -2570 909 3157
2311C157l50l721k801K045L961N27l018k823N08L365K258j324l163j679J886L844
$$ 3157 2807 -914 -3715 -1670 2291 2818 -200 -3023 -2515 850 3108 1784 -1379 -3058 -1172 2672
2327B672R46l789l590Q06L672K589r45l590k643K178M453J204l163l528j63K936
$$ 2672 3618 -171 -3761 -2955 717 3306 2361 -1229 -3872 -1694 2759 3963 800 -2728 -2891 45
2343D5K558n11k984k392J244L787J662k672l390J84L219K287j053l134k268J344
$$ 45 2603 2092 -892 -3284 -2040 1747 3409 737 -2653 -2469 750 3037 1984 -1150 -3418 -2074
2359b074M083J558l088l420K68K870K845O0l410l124R91L844K099k446l852m59
$$ -2074 2009 3567 479 -2941 -2673 197 3042 3102 -308 -3432 -2441 1403 3502 1056 -2796 -3255
2375c255L126K749k85k619k329P20L449J931k609l490r3K496K552J46l012k826
$$ -3255 -129 2620 2335 -284 -2613 -1893 1556 3487 878 -2612 -2705 -209 2343 2489 -523 -3349
2391c349J282L811K060k168m068q26L223K520l51k204k894J17L968K337k166k968
$$ -3349 -2067 1744 3804 1636 -2432 -3258 -35 2485 2134 -70 -2964 -2847 1121 3458 1292 -1676
2407a676q74K026K973J04k776k530K62L217K542k001l617n36K516K878L60k691
$$ -1676 -2550 -524 2449 2553 -223 -2753 -2491 726 3268 1267 -2350 -2886 -370 2508 2868 177
2423A77k780J43L040K680j376l939j265K467K902N64k111k696j52K957K565j275
$$ 177 -2603 -2460 580 3260 1884 -2055 -3320 -853 2049 2613 502 -2194 -2346 611 3176 1901
2439A901l684j133K138K366N35j785k835j26L149K579r75l526j694K266K881K72
$$ 1901 -1783 -2916 -778 1588 2123 338 -2497 -2623 526 3105 2130 -1396 -3090 -824 2057 2329
2455B329j750k743q90L105L126j132l110j409J233L074R37k122k460p89K016L243
$$ 2329 579 -2164 -3054 51 3177 2045 -1065 -2474 -1241 1833 2770 648 -1812 -2601 -585 2658
2471B658m51l689j319J776K449J142j469k965o77K566K558l04l235k210J682K937
$$ 2658 2207 -1482 -2801 -1025 1424 2566 1097 -1868 -2545 21 2579 2275 -960 -3170 -1488 1449
2487A449R30j423k511r83K190L020j59l249j988J271K521J147j302k576r12K122
$$ 1449 2379 956 -1555 -2538 -348 2672 2513 -736 -2724 -1453 1068 2215 913 -1663 -2575 -453
2503d53K858J87k902k436J407K881P31j350k274j564J963L384j64k790j838P22
$$ -453 2405 2592 -310 -2746 -1339 1542 2273 923 -1351 -2915 -952 2432 2268 -522 -2360 -1638
2519a638K603J605j347k482j109J195L044Q11l160k366J378K389J260n80k720
$$ -1638 965 2570 1223 -1259 -2368 -1173 1871 2682 -478 -2844 -1466 923 2183 1603 -1117
2534a117j297J907K475K39k308k402N27K800J286j056j968j426J156L220Q43k862
$$ -1117 -2414 -507 1968 2207 -101 -2503 -1976 824 2110 1054 -914 -2340 -1184 2036 2879 17
2550A7k401P26K338J429r08k240j237J332K466J010k100k556M27K427J285p30
$$ 17 -2384 -1658 680 2109 1201 -1039 -2276 -944 1522 2532 432 -2124 -1697 730 2015 1285
2566A285k021j842J145K962R19k338k330L77K534J455q20j903j401N23K616J393
$$ 1285 -736 -2578 -1433 1529 2448 110 -2220 -1843 691 2146 1326 -577 -1978 -1455 1161 2554
2582B554k087k767L34K278J611k38k135j757J174K454Q36j789k532J6K454J382
$$ 2554 467 -2300 -1966 312 1923 1685 -450 -2207 -1033 1421 2257 468 -2064 -2048 406 1788
2598A788q34j289j360O1K821J606k302k452J34J818J894j48k601j485J137K121
$$ 1788 954 -335 -1695 -1634 1187 2793 491 -1961 -1827 -9 1885 1737 -864 -2349 -1212 909
2614I09J371j287k850j81K437J244l11j297j943L6K694J508j515k371m34K005
$$ 909 2280 993 -1857 -2038 399 1643 1332 35 -1908 -1872 822 2330 815 -1556 -1990 15
2630A5J982m14k006j243L59J984J490j377k594k37K065J493j70j266j734k9K441
$$ 15 1997 1583 -423 -1666 -1307 677 2167 790 -1804 -2041 24 1517 1347 81 -1653 -1682 759
2647G59J662j349k550o33J904J843j45j675j320J14J828J678j003k340n37J504
$$ 759 2421 1072 -1478 -2111 -207 1636 1491 -184 -1504 -1390 438 2116 1113 -1227 -1764 -260
2663b60J605P5j618j466J67J616J938o68k935n46K263J381j51j073j910j81K251
$$ -260 1345 1420 -198 -1664 -1497 119 2057 1389 -1546 -2092 171 1552 1401 328 -1582 -1763 488
2680D88J419q46j940j050J220K230J14j542j251l67J425K015o28k664m66J627
$$ 488 1907 1061 -879 -1929 -709 1521 1635 93 -1158 -1525 -100 1915 1287 -1377 -1843 -216
2696b16J385J75j177j528Q6J688J381n46k007j283J252K187J40j468j321l61J345
$$ -216 1169 1344 167 -1361 -1275 413 1794 1248 -759 -2042 -790 1397 1537 69 -1252 -1613 -268
2713b68K144k61k537q97J342J507K59r32j461k68J276J527J5j995j344J362J863
$$ -268 1876 1615 -922 -1819 -477 1030 1289 357 -1104 -1372 -96 1431 1446 -549 -1893 -531 1332
2730A332R7j208j334n35J512J794k70k154j178J147J862L70r96j147p63R36K071
$$ 1332 1429 221 -1113 -1648 -136 1658 1388 -766 -1944 -797 1065 1435 439 -708 -1471 -535 1536
2747A536O6k090j123Q33J449O61q45j487j53J100J309P5j751j400J045J823J53
$$ 1536 1602 -488 -1611 -778 671 1332 487 -1000 -1153 -53 1256 1331 -420 -1820 -775 1048 1201
2764A201r49j129p34J123K033R1j812j412N12J703J034r74j552m29O94J362P40
$$ 1201 252 -877 -1611 -488 1545 1636 -176 -1588 -1076 627 1661 687 -865 -1294 -600 762 1502
2781A502j434j608P64J583J72o10q91o92P16J598J52j587j248N92J794P71j040
$$ 1502 68 -1540 -776 807 979 369 -522 -1214 -498 1100 1252 -335 -1583 -991 803 1574 534
2798E34j363m22O35J721P35j713j781M90J628O33l77r41r49L89J487N83j037j419
$$ 534 -829 -1251 -616 1105 1840 127 -1654 -1164 464 1097 720 -221 -1170 -781 706 1289 252 -1167
2816a167K99J362N10n90r56n16N85J503L64j482j306L21J610R17q16j325o49M66
$$ -1167 -868 494 1004 414 -542 -1058 -473 1030 1394 -88 -1394 -1073 537 1454 638 -687 -1336 -870
2834h70J469J045j211j784J27J365R22j23j063q76M30R94N97n88j392n9J483N86
$$ -870 599 1644 433 -1351 -1224 141 1063 940 -123 -999 -569 425 1022 434 -958 -1017 466 1052
2852A052q22o95k80J85J159P95j238j645K93J476R82m51j171q48M04J277R87o47
$$ 1052 230 -465 -745 -560 599 1394 156 -1489 -1196 280 1262 811 -360 -1208 -804 473 1460 813
2870H13j722l58J235R02k80n31p37k13J099R60q02j228M4Q76R13l47j157m32M84
$$ 813 -909 -1267 -32 870 590 59 -678 -891 208 1168 366 -862 -818 58 971 624 -533 -965 -481
2889d81R01P52o53j546k82J417J016j77r65r12lJ048J116l38j530o69J163R61
$$ -481 420 1172 519 -1027 -1309 108 1124 947 -18 -930 -933 115 1231 893 -637 -1306 -143 818
2907H18j97n95n25k22Q05Q24l54j180l27R32Q56j78q80n76J21Q87R96m73j478
$$ 818 621 26 -499 -721 84 908 554 -626 -953 -21 835 657 -223 -799 -678 209 1205 732 -746
2926g46n74J178R89m6p96p27k50Q90J152l04j115o25O34J095Q7q57n43N4M34Q36
$$ -746 -1320 -142 847 801 5 -722 -972 -82 1070 766 -349 -974 -340 755 842 -15 -558 -504 -70 766
2946G66m4j236n13R21Q46r8n84p51q5Q06P74Jj152r74Q58J263l1p66m27k60M02
$$ 766 722 -514 -1027 -106 740 642 58 -693 -778 28 802 803 -349 -1323 -465 798 767 1 -426 -686 -284
2967b84J118K5j118n87M73Q45K18n19o43j21M66Q91R3j164q07P74J030j1n46o27
$$ -284 834 859 -259 -846 -373 472 690 171 -472 -593 -127 764 857 -307 -1114 -340 690 679 133 -494
2987d94l01N96R59%q53p76K77J063L46p24n38j56K26Q69K85q83q18M97Q05K52
$$ -494 -795 -199 760 760 -93 -869 -592 471 817 93 -445 -601 -375 494 779 -104 -922 -425 380 632
3007F32m04o61j91M68O73K69p21j010L43J152K04o03m29l15J97Q77L57q32p91
$$ 632 228 -433 -624 -156 517 786 65 -945 -602 550 754 151 -278 -593 -396 481 838 6 -785
3026g85K62P49L93l51n66k88K61O47N23o56j106L31J043J27l47m52l71K69P48
$$ -785 -523 226 619 268 -298 -586 -325 322 845 189 -917 -586 457 584 237 -215 -586 -317 431
3045D31K65n67p64m1R04M26l91n01k76qP66O25p23q92K53O08M43j22o69l06L01
$$ 431 696 129 -635 -676 228 654 263 -238 -514 -522 244 869 146 -746 -493 115 558 436 -233 -539 -238
3066b38M54L68k08r53j37R32M05l59l34l92l4O93N94n31q67r4O90O23k11n42l03
$$ -238 216 584 376 -577 -714 218 623 264 -70 -462 -496 197 791 260 -607 -701 -11 612 401 -141 -444
3087d44K1M16O67k47q78j56P54K94j22k68n10m1P36M32l70o50k42N00P27j97n16
$$ -444 -423 -7 660 413 -465 -621 133 427 305 37 -473 -514 222 654 284 -366 -608 -108 619 422 -94
3108i4k27j41L36P92j28r35k53N23N71L8n25l62k0M24M79l2p23m30N89N11j43
$$ -94 -321 -462 -126 666 538 -397 -650 -127 444 482 -43 -405 -425 -1 478 446 -277 -707 -118 393 250
3129B50j32m01j85L33O99j01o79m45M34P54k5n42k46j33K24P67m8p41l54M99K43
$$ 250 118 -283 -468 -135 564 463 -216 -661 -227 527 502 -40 -286 -419 -195 572 524 -217 -571 -72 171
3150A71J46l2n74k86M80M94M3m05o37K05R04m5n55j00j19O0O47J73o85m52L05
$$ 171 317 285 -289 -575 -95 399 442 37 -600 -395 509 464 -91 -191 -310 -250 397 570 -115 -567 -262
3171b62M24L17k11n32k06K46N27L59o10p78L30P20jj03k57m94J52P35J60m70m28
$$ -262 162 479 268 -264 -470 -224 303 662 52 -726 -396 324 323 220 -37 -531 -379 356 516 46 -382
3192c82L9M84L20j92m28k35J68N41K19m74o23J93N92J95j81m08k28L1N64M45m04
$$ -382 -343 141 461 269 -159 -394 -226 315 534 60 -563 -370 222 417 236 -172 -400 -369 195 640 236
3213B36p89j9O32L70r4k95n47Q5P17J88l35m01q6K93M19j3m90j29K1K99M81k25
$$ 236 -553 -572 60 430 336 41 -506 -421 296 484 149 -252 -338 -45 374 361 -129 -258 -237 62 543 318
3235C18q06l8O85K78j55k78m45o3O86M14k98o25k64M66N36q7k98k56l05L67P36
$$ 318 -488 -526 159 437 282 4 -441 -504 182 596 298 -327 -591 -125 411 324 26 -230 -535 -168 568
3256E68j82p71K1K98J62K39j94n62m7N86M12l31m36j96K98N26J51m52n48k0M81
$$ 568 386 -385 -364 -66 96 335 141 -421 -468 118 530 199 -237 -433 -135 391 542 90 -458 -478 3
3277CN66r9o42l98J85O07K75k99m77k05K59N80Q1m14m80K47N26J3k56l11o7K17
$$ 3 569 470 -172 -570 -385 222 497 198 -279 -484 -225 355 436 22 -458 -211 315 328 72 -239 -306 -89
3299h9N23L2o24m91M60N51L8k64l48m39L62Q71j6o78m16J55L94M71r3n56l02K50
$$ -89 434 466 -158 -649 -189 362 400 136 -212 -651 -289 582 566 -112 -528 -373 21 492 399 -157 -459 -209
3321b09M74K44m16n56K23M77J37j74m05k98L38O60qn61m06lN75N26j79o57l35
$$ -209 265 509 93 -463 -240 237 374 200 -205 -503 -165 495 487 -74 -480 -483 92 618 439 -218 -553
3342e53K17O61L27m43o42k4M51M18p7m07l86K29M61J90l40l76j50N18L97j73m99
$$ -553 -336 325 652 209 -433 -457 -6 412 335 -72 -458 -229 232 422 82 -294 -444 74 471 298 -201
3363b01k87J69O79L41m82p95N6O00M39jn18n77N2O59M26k74o02j70K99M87J19
$$ -201 -488 -319 360 701 219 -576 -520 80 519 518 0 -577 -525 134 560 286 -316 -486 -187 300 419
3384D19l44n40R0N89K77k84n49j22M85N30p3n89m20J00O81L75l36o82k49L70O66
$$ 419 75 -465 -375 214 491 207 -342 -464 21 551 478 -111 -531 -431 250 625 289 -393 -642 -272 394
3405C94K17n50o35L7N56M47J4o26m13L01N88P4l30l49j74M99N50l04o49k03M39
$$ 394 611 61 -574 -537 19 466 480 -146 -559 -258 330 404 74 -275 -449 50 600 296 -353 -556 -117
3426a17N18J75n94o37J11O07O31j64p56m84L27P25L16k62p54k62N14O40m1n17
$$ -117 401 576 -18 -655 -544 63 694 530 -226 -710 -383 342 658 396 -358 -620 -106 534 493 -24
3446b4m54Q7N82L44l61o17m2M54M97r0n72m41L12P04K83l95p68q6N15O72J32o77
$$ -24 -478 -391 191 535 174 -443 -485 -31 466 376 -196 -637 -325 379 662 267 -501 -587 -72 600 732 55
3468E5o99R2P41M52k56o67l49L67O36Q5m15o15J65N62L79k67n60k35L75O89J75
$$ 55 -644 -552 189 641 385 -282 -631 -264 372 457 42 -573 -408 154 533 266 -294 -529 -154 535 710
3489G10p25o20J70O94M79k68q57l58N21P34J86n46o84j31O32O31j45o67l71K77
$$ 710 -15 -635 -465 229 708 440 -417 -775 -254 480 666 120 -564 -695 -63 568 423 -244 -615 -338
3509c38O94K19m20o26k0N38N90j25p81l28M21N91J86n00p31j38P97O27j57o65
$$ -338 356 575 155 -471 -491 47 637 512 -269 -597 -176 415 601 101 -630 -768 29 656 499 -166
3529a66n84L34P43L60l98p13k80N90P74Jp10n45J74O80M76m95p54j44N63N85N5
$$ -166 -750 -416 327 687 289 -424 -704 -114 660 661 -49 -594 -420 260 736 241 -513 -657 -94 491 546
3550E46p53n34L05P46L64l90o90l04N35Q80L1p84n76J63P35M40k72q42k99M49
$$ 546 -207 -741 -436 310 674 284 -406 -710 -175 705 736 -48 -624 -461 274 714 442 -400 -699 -250
3570b50O91J90p02o08J07P28M62j87p77m38N17Q40J86o82p09J22P94N18l19p27
$$ -250 441 631 -71 -679 -572 156 618 431 -346 -784 -267 573 759 77 -632 -510 284 802 483 -244
3590b44m96M14Q07K61p60o43MO52O50j91p62n51M52Q51L00o09q41J74O74N06j24
$$ -244 -740 -326 481 742 -18 -661 -657 -5 645 454 -308 -859 -407 444 744 135 -706 -532 142 648 524
3611E24o63n20K93Q80L21o37q07r7P17O31r0o96p19K62R02N28o48q38P1N66O32
$$ 524 -139 -659 -366 514 835 198 -609 -706 11 642 552 -144 -863 -601 301 829 181 -657 -586 -20 612
3632F12L4o86p16K61R57L45m87q06l83Q20P23q9o92o69J89P82O30n03r02j63O46
$$ 612 646 -40 -756 -495 462 807 320 -486 -869 -49 674 585 -107 -776 -587 195 825 322 -580 -743 -97
3653i7P06R4n88p52k5R63O24m64r14k49O27O43O4n95p78pQ88O29m08q88l21N67
$$ -97 609 703 115 -637 -662 301 925 461 -453 -702 -75 568 632 37 -741 -748 140 769 361 -527 -848 -281
3675b81P96K08o15p81qQ66P15k77j007l95N29Q46J49n82p98r2Q12P01j96j080
$$ -281 515 723 108 -673 -681 185 900 623 -384 -779 -250 596 745 163 -635 -727 85 786 590 -490
3695d90l99O17P17J74m35p74k10Q30Q42k34r39m59M11Q96L22o49q12j64P11Q18
$$ -490 -889 -272 445 619 184 -590 -800 30 872 638 -301 -760 -349 547 869 220 -592 -756 -45 773
3715G73l5r93o40M53R42J31l93q05l37P81R69j76r15n87M62Q93L34m71q17l30
$$ 773 738 -255 -895 -442 500 631 238 -567 -904 -123 846 670 -245 -832 -370 523 857 386 -431 -761
3735g61N94J026m0j090o73N30P62L99l33r08n55Q33R71L7r16p13L02Q19N52l56
$$ -761 -167 859 819 -271 -944 -414 348 747 414 -494 -1049 -216 755 792 -124 -837 -535 284 836 480
3755D80q81l85N57R18J17q71p76L15Q36M06k97q27m61N06J053R1r21p72K80R39
$$ 480 -401 -786 -229 689 806 -65 -841 -526 310 716 419 -408 -869 -363 690 781 -140 -912 -632 307
3775C07N96m23q34m24M50J067L42j025r72K54Q61N62k54p66o61L59J125L21r60
$$ 307 903 480 -354 -778 -328 739 1081 56 -916 -662 199 761 507 -259 -920 -561 564 885 -75
3794g5q08K41P46N85j31r05n35N20J049L31q64r70J05R61O17l60p70p39L45J193
$$ -75 -883 -642 104 689 558 -347 -882 -362 687 1018 154 -816 -711 250 867 507 -263 -1002 -657 536
3814E36M98q78j022N5Q42O71K5r22p25K96J102N19p06r81KQ67N45j06p62o51K26
$$ 536 1034 156 -866 -811 31 702 727 -195 -920 -624 478 997 291 -690 -688 179 724 618 -144 -795 -569
3835e69J111N12q73j140M0Q85P93k2q43r15K87J107P24n97j195k57R08Q20m8o36
$$ -569 542 1054 181 -959 -919 -34 759 737 -106 -1021 -734 373 1097 500 -695 -952 -44 776 728 92
3855I2q55K6J014P13n50j120j86P65P31j5o60q89J24J117P37o06j153k73Q92R07
$$ 92 -763 -737 277 990 440 -680 -866 -101 630 615 -45 -934 -810 307 1044 438 -715 -988 -96 811
3875H11J46q57r27l0J100R45n17j250n04Q11Q61K39o40r16k04R83Q79m02j069
$$ 811 957 100 -827 -857 243 1188 671 -579 -1083 -272 589 828 188 -728 -932 51 930 528 -541
3894e41m71Q21R90op23p75r6R90J004m15j389m79Q58Q48K19n25j115l16J069J075
$$ -541 -1012 -191 799 793 70 -705 -801 189 1193 778 -611 -1090 -232 616 835 310 -805 -1121 -52 1023
3914A023k96j165o01N44J041L10n98r22j93Q11J056j74j267n27P17Q99K73o37
$$ 1023 727 -438 -1039 -495 546 856 258 -664 -857 -46 1010 836 -431 -958 -241 658 931 294
3932B94j038k33Q37J175j69j297q53P39J100L23m79r42m99Q26J234k6j184p84
$$ 294 -744 -977 -140 1035 866 -431 -1284 -545 555 878 399 -543 -1042 -216 1018 992 -192 -976
3950i76M90R64M09m47r10m64P08J156L0j309p61N34J061L90n44r54m35O73J242
$$ -976 -486 478 887 440 -470 -934 -226 930 960 -349 -1110 -576 485 875 331 -623 -1058 -385 857
3969H57K44j210r94M54J139M54l85r66n76N60J264J94j137q94L46R55N32m28r12
$$ 857 1101 -109 -1103 -649 490 944 559 -407 -983 -423 841 1035 -102 -996 -650 305 837 409 -503
3988e03n23O00J151K97j068j068L90J165O17m33r04p04N38J340K85j074j080N7
$$ -503 -1026 -426 725 1022 -46 -1114 -724 441 1058 625 -279 -983 -445 895 1180 106 -974 -917
4006i17J115O51l60q75o02L64J174N76j040j104L20R52O08k45q73p46M93J227
$$ -917 198 849 489 -386 -988 -624 550 1126 86 -1018 -698 254 862 617 -256 -1002 -509 718
4024G18M96r74j178L0J084Q29l23r13q48L17J245O67q76j185m6R97Q69j46q82
$$ 718 1214 240 -938 -908 176 1005 682 -231 -1079 -762 483 1150 274 -911 -957 40 909 763 -119
4043a19p59K31J135O90p48j346l1J149O63j97q63p91J97J251O72p66j272j89J004
$$ -119 -878 -647 488 1178 430 -916 -947 202 865 668 -195 -986 -789 462 1134 368 -904 -1093 -89
4062h9R49n7q93p94M5J154J024o47j407k62R56Q86o4q11q40K4J104Q91o13j352
$$ -89 860 803 -90 -884 -839 315 1339 692 -715 -977 -21 865 801 -10 -850 -826 278 1169 556 -796
4082g96k66R73Q96J1q13r99o7J347R65o69j305l21Q56J104M8q44q71j54J017J086
$$ -796 -1062 -89 807 818 5 -994 -1061 286 1251 582 -723 -1044 -188 916 964 120 -751 -905 112 1198
4102A198m13j499m46Q43R37J91o82r90o8J022J018l53j346n91R53J085J2p34q68
$$ 1198 785 -714 -1160 -317 620 811 129 -861 -929 93 1111 758 -588 -1179 -226 859 871 137 -731
4121g31k12R46J233k83j411o96P80J074K82q09j029j96R30J087o2j378p43Q32
$$ -731 -943 3 1236 953 -458 -1154 -374 700 982 173 -856 -1052 -122 965 903 -475 -1218 -386
4139c86J168J48o80r14k86P67J332j78j426p06O87J155L05o24j028m37Q77J235
$$ -386 782 930 250 -664 -950 -183 1149 971 -455 -1161 -474 681 986 362 -666 -1103 -226 1009
4157A009L1j397r12P02J032M72n17j009l63Q01J226M3j256j037N56J205L78o39
$$ 1009 1040 -357 -1269 -567 465 937 420 -589 -952 -151 1075 1118 -138 -1175 -619 586 964 325
4175C25r40n46Q19J314J06j280j016M36J338M71n86j087m20O60J259L43j200j101
$$ 325 -615 -1161 -342 972 1078 -202 -1218 -782 556 1027 441 -646 -1066 -406 853 1196 -4 -1105
4193a105N00J277L43n08r13o49N71J300K66j195j098L78J222O16m74j024n69N55
$$ -1105 -605 672 1015 507 -406 -1055 -484 816 1082 -113 -1211 -833 389 1005 531 -493 -1062 -507
4211e07J309L92j111j276L81J196O20m10q79p11M79J233M50r70j301J77J118P75
$$ -507 802 1194 83 -1193 -812 384 1004 594 -285 -996 -517 716 1166 196 -1105 -928 190 965
4229I65m44r95n79M52J251N84r59j348J53J300O97m21r34p27K85J301O45q90j376
$$ 965 521 -474 -1053 -601 650 1234 275 -1073 -920 380 1077 656 -278 -1005 -720 581 1226 336 -1040
4248a040J6J283P74l06r89p34K83J190P15q69j377P5J086Q55k52q35p58K64J206
$$ -1040 -1024 259 1033 727 -262 -996 -713 477 1192 323 -1054 -979 107 962 710 -125 -883 -619 587
4267E87P14q76j355j48J149Q08k36q46p97J65J200Q45p53j354k32J092J006k06
$$ 587 1301 425 -930 -1078 71 879 643 -203 -1000 -835 365 1210 457 -897 -1129 -37 969 763
4285G63r49p63J42J187R42o14j486k10J049Q78q0r75q52R9J065Q98n81j338l60
$$ 763 -186 -949 -807 380 1322 708 -778 -988 61 939 859 -116 -968 -869 196 1094 513 -825 -1185
4304a185J053J082j45q85p51q3J075J017n05j398m29J007J042pq91p99K8Q98J015
$$ -1185 -132 950 805 -80 -831 -914 161 1178 673 -725 -1154 -147 895 888 -3 -802 -774 124 1139
4323A139l37j466n95R95J085n9p92p60j16R97J134l76j462m98Q76J144Mr22q44
$$ 1139 802 -664 -1259 -264 821 762 -30 -790 -906 91 1225 849 -613 -1111 -235 909 913 -9 -853
4342h53o0J011J011k60j374o63Q38J138J40q21r20j37Q47J040q6j325o80P66J177
$$ -853 -913 98 1109 849 -525 -1188 -350 788 928 107 -813 -950 -103 937 851 -474 -1154 -388 789
4361G89K06p89p89l08Q43J153k49j316p79O56J228L77q63r12j74P73J051K03j390
$$ 789 995 206 -583 -891 -48 1105 856 -460 -1239 -583 645 1022 159 -753 -927 -154 897 1100 -290
4380b90r12O27J197K96o06r69k78Q36J001R7j149r48N34J246K67q40p80l11O06
$$ -290 -1202 -575 622 918 312 -657 -935 -99 902 999 -150 -1098 -564 682 949 109 -671 -982 -376
4399c76J214J97j321r19O51J218L66o33r95l55O48J166J95j091j095L85J281M61
$$ -376 838 1035 -286 -1205 -554 664 1030 397 -598 -953 -305 861 1056 -35 -1130 -745 536 997
4417I97m87r44m57N25J113J83j026r94K95J300M20o04q75l07N73J073M12j107
$$ 997 510 -434 -891 -366 747 930 -96 -1090 -795 505 925 321 -554 -861 -288 785 1197 90
4435I0j252L65J198O07m97j024n14N91J126M40q97j265J16J259O02n27p94m85
$$ 90 -1162 -797 401 1008 511 -513 -1027 -436 690 1130 233 -1032 -916 343 945 418 -376 -861
4453h61L48J085M44q90j040J71J091P30n52r80m33M22R87N27q27j336J04J254
$$ -861 -513 572 1016 126 -914 -743 348 1078 526 -454 -887 -465 522 1049 222 -1114 -1010 244
4471B44P47m22q52o06K96J090O01q34j174p4J087P93l01q24n22K67R71O54q05
$$ 244 991 569 -283 -889 -593 497 1098 264 -910 -984 103 896 595 -229 -751 -484 487 1141 336
4490C36j270L6J062P12k82r95o59M89J055N81o19j303k29J145R36l21q97o11J30
$$ 336 -934 -898 164 876 594 -401 -1060 -571 484 1065 446 -857 -1086 59 995 674 -223 -834 -704
4509g04R92P22n23j112l73R31R81k10q62n49J34P43P26m35j262k51J102Q86k40
$$ -704 288 1010 487 -625 -998 -67 914 704 -158 -707 -573 170 896 461 -801 -1052 50 936 696
4528F96q75n89J29R27P79m13j329m84R61J073k14p52n81r0R15R67m90j263k63
$$ 696 -179 -768 -639 288 1067 654 -675 -1159 -198 875 661 -91 -672 -762 153 1120 630 -633 -896
4547h96P04R69m4q84o87J14Q74Q05k36j216n29Q41J049k4q83p31k2Q52Q05k32
$$ -896 -192 777 733 -151 -838 -724 150 955 719 -497 -1026 -185 864 840 -43 -774 -796 56 861 629
4567F29j097o17O16J217J60q40o35l4N81Q35o8j144o65P56J032J26p28p19k3P07
$$ 629 -468 -1085 -469 748 908 68 -567 -601 -20 815 747 -397 -1062 -306 726 852 124 -595 -618 89
4587H9P54j08j074p95O67J151O8o83p57q1O17J009L9j145p19N08J052K61p07p29
$$ 89 843 735 -339 -1134 -467 684 752 69 -688 -769 -152 857 896 -249 -968 -460 592 853 146 -583
4607e83j53N98P94J93j077p44N18J047K27n90p82l12O35R10N8q70q41L51J178
$$ -583 -736 -138 656 849 -228 -972 -454 593 820 230 -552 -864 -229 681 739 -131 -972 -621 557
4626E57L82o56q19j30M90Q11K36r15r00K16J118N08o17q06j29M75P75K15p79r36
$$ 557 939 283 -536 -666 -176 635 871 -44 -944 -728 390 898 281 -525 -654 -179 596 811 32 -904
4646i04K01J190L56n63p67k91M84R09L12q22r60J58J052N21n09q00l01L74Q29
$$ -904 -703 487 843 280 -487 -778 -294 615 927 105 -855 -697 355 876 367 -433 -734 -360 469
4665D69L48p21q52J09R51N05m08o92m01L17Q58L48o82r45R8R07O62m10q09l77
$$ 469 817 96 -756 -647 304 809 401 -291 -692 -375 483 831 149 -796 -698 209 871 461 -348 -725
4685g25L95P68L53n68r82p1R66O04k78p66m00L25P85M47n62r25j04Q45O81l24
$$ -725 -330 438 791 223 -759 -830 136 740 462 -304 -704 -379 406 853 291 -634 -738 107 788 464
4705D64p88l40K99P40M26m40j029j31R22O53l08o56m79J73O87N42l47r25k62P64
$$ 464 -324 -664 -365 375 801 361 -668 -799 123 776 468 -188 -667 -494 193 735 388 -537 -799 -35
4725c5P77j81p53m18J98O39M33k97q74l59Q33P55j62p28m23J59O61N09l50r14
$$ -35 742 561 -192 -610 -412 227 660 363 -511 -870 -37 718 556 -172 -595 -436 225 734 384 -530
4745e30l35P78P69j15o55n17J10O73N36k21q50l87M94Q86j08o67m15L9O03O06
$$ -530 -865 -87 682 567 -88 -605 -495 178 714 493 -357 -744 -250 636 528 -139 -554 -515 88 694
4765F94k18r08l43O57P66p9n98m99%N97M96j41o89n81N96Q41J9o31m71j8M83O43
$$ 694 476 -432 -775 -118 648 569 -29 -528 -528 69 565 424 -265 -846 -250 591 610 -21 -492 -510 -27 616
4787F16p4p86n37M72P41J73n81m95K0M88N65l3p83n23M00Q00J50n98m84o2N32
$$ 616 542 -244 -781 -309 432 605 24 -471 -451 37 602 569 -214 -737 -337 463 613 15 -469 -531 1
4808AN88Kp26o18M33O92K16n39m71o8M01O34M3p26m92K97P64J93m92n70o9M29
$$ 1 589 591 -135 -753 -320 372 588 49 -422 -490 -89 545 588 -138 -630 -333 431 624 132 -438 -507 -78
$$ [...]
8191a40
##END NTUPLES=NMR FID
##END=
