##TITLE=1H_AM_NVBuA:Diox
 
 8 sc, 
 3.10.2024
##JCAMPDX= 6.0         $$ Bruker NMR JCAMP-DX V2.0
##DATA TYPE= NMR FID
##DATA CLASS= NTUPLES
##ORIGIN= UXNMR, Bruker Analytische Messtechnik GmbH
##OWNER= root
$$ XWIN-NMR		Version 3.5
$$ Thu Oct  3 14:19:03 2024 Russian Standard Time (UT+4h)  she@DPX200
##.OBSERVE FREQUENCY= 200.1318
##.OBSERVE NUCLEUS= ^1H
##.DELAY= (6, 6)
##.ACQUISITION MODE= SIMULTANEOUS
##.ACQUISITION SCHEME= undefined
##.AVERAGES= 8
##.DIGITISER RES= 18
##SPECTROMETER/DATA SYSTEM= spect
##.PULSE SEQUENCE= zg30
##.SOLVENT NAME= DMSO
##.SHIFT REFERENCE= (INTERNAL, DMSO, 0, 15.7039)
##AUDIT TRAIL= $$ (NUMBER, WHEN, WHO, WHERE, WHAT)
$$ ##TITLE= Audit trail, XWIN-NMR		Version 3.5
$$ ##JCAMPDX= 5.01
$$ ##ORIGIN= Bruker BioSpin GmbH
$$ ##OWNER= she
$$ F:/spectra/data/she/nmr/H-F/1/audita.txt
$$ ##AUDIT TRAIL=  $$ (NUMBER, WHEN, WHO, WHERE, WHAT)
(   1,<2024-10-03 14:16:12.73 +0400>,<she>,<DPX200>,
      <created by zg, POWCHK disabled, PULCHK disabled
       configuration hash MD5:
       00 E9 B6 7A A2 85 ED C7 34 08 36 98 17 FE 4E 26
       data hash MD5: 16K
       E5 15 D0 C8 9C E8 92 15 F7 FA 7A 4D 67 A2 F3 8B>)
$$ ##END=
$$ 
$$ hash MD5
$$ 2F 71 25 3C 17 28 7D 49 7D B3 F9 AF 75 8D 2F 0C
##$RELAX= 
##$RELAX= 
##$RELAX= 
##$RELAX= 
##$RELAX= 
##$RELAX= 
$$ Bruker specific parameters
$$ --------------------------
##$DU= <F:/spectra>
##$EXPNO= 1
##$NAME= <H-F>
##$PROCNO= 1
##$TYPE= <nmr>
##$USER= <she>
##$AMP= (0..31)
100 100 100 100 100 100 100 100 100 100 100 100 100 100 100 100 100 100 
100 100 100 100 100 100 100 100 100 100 100 100 100 100 
##$AQSEQ= 0
##$AQ_mod= 1
##$AUNM= <au_zg>
##$AUTOPOS= <>
##$BF1= 200.13
##$BF2= 200.13
##$BF3= 200.13
##$BF4= 200.13
##$BF5= 200.13
##$BF6= 200.13
##$BF7= 200.13
##$BF8= 200.13
##$BYTORDA= 1
##$CFDGTYP= 0
##$CFRGTYP= 5
##$CHEMSTR= <none>
##$CNST= (0..31)
1 1 145 1 1 1 1 1 1 1 1 1 1 1 1 1 1 1 1 1 1 1 1 1 1 1 1 1 1 1 1 1 
##$CPDPRG= <>
##$CPDPRG1= <>
##$CPDPRG2= <>
##$CPDPRG3= <>
##$CPDPRG4= <mlev>
##$CPDPRG5= <mlev>
##$CPDPRG6= <mlev>
##$CPDPRG7= <mlev>
##$CPDPRG8= <mlev>
##$CPDPRGB= <>
##$CPDPRGT= <>
##$D= (0..31)
0 1.2 0 0 0 0 0 0 0 0.06 0 0.03 0 0 0 0 0.0002 0 0 0 0 0 0 0 0 0 0 0 0 
0 0 0 
##$DATE= 1727950572
##$DBL= (0..7)
120 120 120 120 120 120 120 120 
##$DBP= (0..7)
150 150 150 150 150 150 150 150 
##$DBP07= 0
##$DBPNAM0= <>
##$DBPNAM1= <>
##$DBPNAM2= <>
##$DBPNAM3= <>
##$DBPNAM4= <>
##$DBPNAM5= <>
##$DBPNAM6= <>
##$DBPNAM7= <>
##$DBPOAL= (0..7)
0.5 0.5 0.5 0.5 0.5 0.5 0.5 0.5 
##$DBPOFFS= (0..7)
0 0 0 0 0 0 0 0 
##$DE= 6
##$DECBNUC= <off>
##$DECIM= 24
##$DECNUC= <off>
##$DECSTAT= 4
##$DIGMOD= 1
##$DIGTYP= 9
##$DL= (0..7)
0 120 120 120 120 120 120 120 
##$DP= (0..7)
150 150 150 150 150 150 150 150 
##$DP07= 0
##$DPNAME0= <>
##$DPNAME1= <>
##$DPNAME2= <>
##$DPNAME3= <>
##$DPNAME4= <>
##$DPNAME5= <>
##$DPNAME6= <>
##$DPNAME7= <>
##$DPOAL= (0..7)
0.5 0.5 0.5 0.5 0.5 0.5 0.5 0.5 
##$DPOFFS= (0..7)
0 0 0 0 0 0 0 0 
##$DQDMODE= 0
##$DR= 18
##$DS= 0
##$DSLIST= <SSSSSSSSSSSSSSS>
$$ [...]
##$SUBNAM2= <"">
##$SUBNAM3= <"">
##$SUBNAM4= <"">
##$SUBNAM5= <"">
##$SUBNAM6= <"">
##$SUBNAM7= <"">
##$SUBNAM8= <"">
##$SUBNAM9= <"">
##$SW= 24.0689170037331
##$SWIBOX= (0..15)
0 0 2 0 0 0 0 0 0 0 0 0 0 0 0 0 
##$SW_h= 4816.95568400771
##$TD= 16384
##$TD0= 1
##$TE= 0
##$TE2= 300
##$TE3= 300
##$TEG= 300
##$TL= (0..7)
0 120 120 120 120 120 120 120 
##$TP= (0..7)
150 150 150 150 150 150 150 150 
##$TP07= 0
##$TPNAME0= <>
##$TPNAME1= <>
##$TPNAME2= <>
##$TPNAME3= <>
##$TPNAME4= <>
##$TPNAME5= <>
##$TPNAME6= <>
##$TPNAME7= <>
##$TPOAL= (0..7)
0.5 0.5 0.5 0.5 0.5 0.5 0.5 0.5 
##$TPOFFS= (0..7)
0 0 0 0 0 0 0 0 
##$TUNHIN= 0
##$TUNHOUT= 0
##$TUNXOUT= 0
##$USERA1= <user>
##$USERA2= <user>
##$USERA3= <user>
##$USERA4= <user>
##$USERA5= <user>
##$V9= 5
##$VALIST= <valist>
##$VCLIST= <CCCCCCCCCCCCCCC>
##$VD= 0
##$VDLIST= <DDDDDDDDDDDDDDD>
##$VPLIST= <PPPPPPPPPPPPPPP>
##$VTLIST= <TTTTTTTTTTTTTTT>
##$WBST= 1024
##$WBSW= 4
##$XGAIN= (0..3)
0 0 0 0 
##$XL= 0
##$YL= 0
##$YMAX_a= 212081
##$YMIN_a= -226863
##$ZGOPTNS= <>
##$ZL1= 120
##$ZL2= 120
##$ZL3= 120
##$ZL4= 120
##$ABSF1= 10
##$ABSF2= 0
##$ABSG= 5
##$ABSL= 3
##$ALPHA= 0
##$AQORDER= 0
##$ASSFAC= 0
##$ASSFACI= 0
##$ASSFACX= 0
##$ASSWID= 0
##$AUNMP= <proc_1d>
##$AZFE= 0.1
##$AZFW= 0.1
##$BCFW= 1
##$BC_mod= 2
##$BYTORDP= 1
##$COROFFS= 0
##$CY= 11.3945322036743
##$DATMOD= 1
##$DC= 2
##$DFILT= <>
##$DTYPP= 0
##$F1P= 15.6554695791079
##$F2P= 12.8336369535428
##$FCOR= 0.5
##$FTSIZE= 0
##$FT_mod= 4
##$GAMMA= 1
##$GB= 0.15
##$INTBC= 1
##$INTSCL= 1
##$ISEN= 128
##$LB= 0.24
##$LEV0= 0
##$LPBIN= 0
##$MAXI= 10000
##$MC2= 0
##$MEAN= 0
##$ME_mod= 0
##$MI= 1.114404
##$NCOEF= 0
##$NC_proc= 0
##$NLEV= 6
##$NOISF1= 3.799351
##$NOISF2= 2.8
##$NSP= 1
##$NTH_PI= 0
##$NZP= 0
##$OFFSET= 15.70392
##$PC= 1
##$PHC0= -26434.47
##$PHC1= 9.38747
##$PH_mod= 1
##$PKNL= yes
##$PPARMOD= 0
##$PSCAL= 0
##$PSIGN= 0
##$REVERSE= no
##$SF= 200.130013532006
##$SI= 16384
##$SIGF1= 3
##$SIGF2= 2
##$SINO= 400
##$SIOLD= 16384
##$SREGLST= <1H.CDCl3>
##$SSB= 0
##$STSI= 0
##$STSR= 0
##$SW_p= 3612.71676300578
##$SYMM= 0
##$S_DEV= 0
##$TDeff= 0
##$TDoff= 0
##$TI= <>
##$TILT= no
##$TM1= 0
##$TM2= 0
##$TOPLEV= 0
##$USERP1= <user>
##$USERP2= <user>
##$USERP3= <user>
##$USERP4= <user>
##$USERP5= <user>
##$WDW= 1
##$XDIM= 8192
##$YMAX_p= 0
##$YMIN_p= 0
$$ End of Bruker specific parameters
$$ ---------------------------------
##NTUPLES= NMR FID
##VAR_NAME=  TIME,          FID/REAL,        FID/IMAG
##SYMBOL=    X,             R,               I
##VAR_TYPE=  INDEPENDENT,   DEPENDENT,       DEPENDENT
##VAR_FORM=  AFFN,          ASDF,            ASDF
##VAR_DIM=   8192,          8192,            8192
##UNITS=     SECONDS,       ARBITRARY UNITS, ARBITRARY UNITS
##FACTOR=    0.0002076,     1,               1
##FIRST=     0,             0,               0
##LAST=      1.7004516,     0,               0
##MIN=       0,             -226863,         0
##MAX=       1.7004516,     212081,          0
$$ Real data points
##PAGE= N=1
##DATA TABLE= (X++(R..R)), XYDATA
$$ [...]
2476a718J132L176k841k393L923J9k619J278J444k564n72M383j676l758K825J608
2492A647j993n93K214j262k259L781m3l307J487J507j252j218K348j52k775K509
2508F39L27k404J456J685j868k150L085R18k860J453L21k280R86L362j542m419
2524c291K843K325k167O15L96k082p84M260Q23n442R40K604j043M24P38j427k637
2541b905L334K791m172k19J544r03K12J725p3l862J630L106k696J40J377j425
2557c96j427K308K123l910R6K506k158K35K244m58l499J046L802k649o05J777
2573A035j827p24K381J687l869q00L614j493l93J555j101j876J275L147k963j281
2589a633K826j517n45J673M51k456k35L518k395j082K965j250j747R20K328k002
$$ y = [-1718, -586, 2590, -251, -2644, 1279, 1298, -1321, -43, 1401, -1163, -1735, 2648, 972, -2786, 39, 1647, -346, -939, 1275, 13, -2246, 1535, 1492, -1815, -328, 1179, -73, -1291, 1057, 905, -1870, 639, 966, -1438, 18, 1703, -165, -2315, 770, 1688, -1172, 281, 602, -1678, -692, 2670, 1128, -3291, -448, 1877, -290, 325, 721, -1361, -2145, 2115, 2938, -2504, -1564, 1040, -3, 421, 1159, -268, -2905, 429, 3220, -952, -1171, 373, -530, -318, 1407, 1334, -2528, -898, 2208, -488, -348, 1029, -396, -1823, 485, 2608, -1302, -1206, 1300, -858, -623, 1621, 1163, -2336, -1290, 2512, -137, -742, 1035, -792, -1516, 865, 2552, -1317, -2117, 1497, 4, -389, 1166, 65, -1811, -536, 2611, -352, -1633, 1193, -324, -869, 804, 1255, -1201, -1436, 2082, -313, -1395, 1570, 320, -1427, -507, 1821, -181]
2605a81j370L327k134j477L001L94k341j013L156j030j650L132j728k112J907
2620a19J980j376k382K680o23j647L180p70k395K91K446l22k389K464q33k170
2636a985K829P35k044j126K428j41k279K885l61k795J321K024r51k221K538r2
2652G65k844K860Q10k337o37K139L74k859K589M54l327J812J549r37j737J513
2668A87J049l078K367J230l068M70J518K15k016J284J189l263J858J805k166o60
2684a079J330Q35k421J496J577l424J008K091j070j562J192J522l011J181K291
2699A956k891k08K003J47k326Q99K367l191K89K560j559j202J232J438k750L30
2715i06L028k773n35J969j71j295J65K150k619k88L318k133j018J238N59j016
$$ y = [-181, -1551, 1776, -358, -1835, 1166, 1560, -781, -1794, 1362, 332, -1318, 1814, 86, -2026, -119, 1861, 485, -1897, 783, 160, -1487, 1693, 923, -1472, -1181, 1265, 943, -1446, 1018, 185, -1985, 844, 1579, -465, -1591, 837, 696, -1583, 1302, 941, -1854, -533, 1491, 540, -1681, 857, 765, -2079, 781, 1591, -746, -1383, 756, 1130, -1729, 860, 1314, -2013, -201, 1348, 411, -1326, 187, 1236, -1842, 525, 1755, -1313, -843, 675, 890, -1126, 158, 1347, -1916, -58, 1747, -419, -1079, 251, 1086, -1335, 161, 1738, -1686, -678, 1413, 343, -1219, -27, 1495, -1516, -335, 1956, -935, -1143, 860, 1007, -1319, -420, 1947, -1244, -955, 1605, 46, -1156, 76, 1514, -1236, -906, 2122, -651, -1186, 783, 612, -683, -518, 1632, -987, -1275, 2043, -90, -1108, 130, 689, -327]
2731c27l06K287k488p63L368j260j618Q46J170j400k90K684k365j439K933K21
2747A253k164j0K415j965j020L342j468j981J479J516j630j378L390j448k425
2762b094L002j8j417n1J393p02j937L350l02k975J545P26m30j78R15j090j810
2779b073L265M96k665L29Q26m05j9K074j770k837L289J407k159o14J284n80j390
2796a542L392k55m113J725K349j085j546J636K50l001K480J898k931m96J708J98
2812F67j778J571J079l102P79J773o56n77L28J68j774J973J483l028M27R28m41
2829a80K58P44k31k836K047K681l193l28J771p49j000J736J002l511L87L599j744
2846D53k262K108J120k643O19K272k138q25K189L18k643M19K952k048q38J541
$$ y = [-327, -633, 1654, -834, -1597, 1771, 511, -1107, -261, 909, -491, -781, 1903, -462, -1901, 1032, 1253, -911, -921, 1494, -471, -1491, 1851, 383, -1598, -119, 1397, -233, -1611, 1779, 331, -2094, 908, 890, -527, -578, 815, 113, -1824, 1526, 1224, -1751, -206, 520, 90, -88, 827, -263, -2073, 1192, 1688, -977, -648, 178, -227, -246, 1828, 58, -2779, 510, 1917, -242, -856, 428, -152, -1542, 1850, 1595, -2518, -793, 1556, 471, -1075, 561, 811, -2190, 290, 2188, -743, -1239, 469, 667, -1111, 460, 1539, -1563, -784, 989, 333, -244, 84, 252, -1522, 451, 1934, -1094, -667, 261, -180, 78, 822, 591, -2245, -198, 2483, -710, -1038, 733, -16, -1016, 720, 1722, -1789, -1402, 2197, 453, -1809, 299, 1419, -1224, -605, 1667, -471, -1296, 893, 1211, -1432, -1013, 1939, -109, -947, 594]
2862E94j091K54R20J36j647n59K731j042o46J130j989L67K152j05k260l20K588
2879A213j186p77K259j511k143K299K226k871j319K998p95j895K070J287k971
2894a116q69L711q88k303K098Q9j937M02K477p19k733J645P39j056J235j57j647
2911a029k0J898J58j417L69n48k69K061K11k622l52K782o60j393J763q62j820
2928a750J757K312k350k593L553N98l074J636J273k141p10K775K46l550J559K331
2944A872k499m45K026l28j737R72J206j661J16J382r43p96J158K41j071P41m7
2961A87j121J340O06j555m89J778k0k002J740O39k695J159K273j707k136K319
2977C16J607l169L04K637j948j380K607N38l127N97K885j728j609J932M90j912
$$ y = [594, -497, -243, 677, 813, -834, -1393, 1338, 296, -350, 780, -1209, -842, 1310, 1205, -1055, -1375, 1213, 27, -750, 1509, -2, -2145, 154, 2380, -491, -1810, 1188, 393, -1502, 568, 1855, -1116, -1985, 1726, 838, -1465, 633, 722, -1215, -813, 1664, 945, -1788, -143, 596, -460, 775, 618, -1029, -1049, 849, 1007, -410, -41, -589, -858, 1203, 1414, -1208, -1560, 1222, 562, -831, 932, 70, -1750, 7, 2319, -31, -2624, 929, 1527, -1547, 89, 1362, -779, -1489, 1286, 1532, -2018, -459, 1872, -627, -1072, 954, 626, -1111, -139, 1067, -594, -478, 904, -39, -835, 323, 564, -507, 234, 187, -934, 406, 1012, -543, -1032, 746, 726, -1276, 464, 1103, -1592, -433, 1840, 133, -2003, 316, 1923, -1246, -942, 1695, -253, -1633, 974, 1512, -1615, -1018, 1867, 139, -1470, 462, 952, -960]
2993i60O12J639j752m69J727m68q98M77N59p43J00Q36j335L81J392j424n35J419
3011E58O9j529P79J442k223k16K758j049k414J740J854k475n68K755j131k117
3027a767K169J381k816m11K986j027k014J816P61j822j6J869r47j312J728j1j345
3044g78O74O49o19k41P21p00k80J575p91j291J218N97j230K39J397j694r50K775
3062A271j3k656O19K109j443j073K519o72k656J823K123k057j501K301M6k059
3078a319J700R93k250l23K054k1j692Q71N39j444Q33J052j089o14Q43J4n43J053
3096F57k43j587R86J197j163m55J355p88j354K183O31k517O2K119o99j615J951
3113G20L79k767J104K309j576j559J679P00k086Q85J761k076p16J903J17j448
$$ y = [-960, -348, 1291, -461, -930, 797, 329, -569, -92, 467, -276, -176, 660, -675, -294, 1098, -326, -861, 558, 627, -902, -123, 1319, -904, -1120, 1638, 589, -1825, -85, 1769, -706, -1274, 1481, 350, -1767, 402, 1783, -1033, -1444, 1542, 515, -1499, 317, 1078, -744, -760, 1109, 162, -1150, 578, 567, -778, -104, 545, -74, -315, 406, -294, -574, 1001, 210, -1081, 137, 734, -496, -257, 1140, -554, -1504, 1271, 1258, -1398, -779, 1330, -113, -1186, 1333, 661, -1995, -172, 1951, -106, -1607, 694, 740, -1319, 381, 1374, -876, -1199, 855, 834, -858, 13, 552, -892, -59, 993, -96, -710, 133, 147, -396, 657, 414, -1173, -187, 1010, -153, -608, 747, -41, -1395, 788, 1419, -1098, -1036, 1083, 384, -1231, 720, 1099, -1668, -564, 1745, 169, -1390, 289, 989, -1097, -212, 1549, -527, -1243, 660, 777, -671]
3129f71N44Q87j459J78J516q54q35Q27J49r00R04N89j721K84J360p42o48J121
3147E29nj873J218J762k125n49J768l86j352J266J217k540k54K733q55j631J227
3164A50O16j676L73K119j526j537J798N15j270K92R06j359k20J892o37j262Q04
3181b2M29q05L27J049j475m95J902n24j169R35N44j392R2J928j329j289J926R6
3199G28j623N55J577j456j127K290k50j811J150R16j395n07J988m73j864J551
3215B49N52j447L81J058q29r52J587J02j640R86O67j213N2J243o79j127J519J72
3233F81j609P90J092j197o97J700k45j656J474O03j745J68J609n32j641J441O74
3250I10j870Q64J112j371o03J488L67j850P28J123j496K36J226q11j063J221P64
$$ y = [-671, -127, 760, -699, -521, 995, 141, -694, 133, 282, -618, 286, 875, -846, -562, 798, 56, -592, 529, 524, -1349, -131, 1631, -494, -1043, 725, 339, -1013, 253, 1470, -1070, -1324, 1409, 554, -1077, 150, 766, -910, -537, 1582, 56, -1481, 317, 832, -438, -146, 760, -599, -819, 1073, 436, -826, -22, 407, -398, -71, 978, -497, -992, 910, 386, -783, 152, 696, -696, -604, 1324, -5, -1294, 632, 728, -895, -340, 1237, -219, -1346, 944, 694, -1117, 33, 949, -446, -953, 1035, 562, -1302, 249, 801, -646, -265, 793, -36, -988, 599, 701, -939, 47, 714, -499, -447, 796, 117, -1010, 509, 681, -928, -138, 954, -243, -940, 760, 515, -1141, 333, 936, -809, -641, 968, 436, -1205, 236, 910, -960, -96, 1016, -355, -958, 530, 897, -953, -225, 898, -598, -362, 864, 53, -1010, 211, 975]
3267I75j708M17J147j219j65J246k74j452J000J131j769J49J418r39p90J183M86
3284H36j731N35J539j582m10J553k20j379O58J221j541o4J558j071q27J269N46
3301H90j508K5J469j131k75J375p70j037R56J107j440m40J532r18m69J413l16
3318D63j469N20J674j176q97J512n57r18J239N92j627l38J928o47j106J283j01
3335C75j181N34J370j075j108J663k72j047J122K70j195k32J595l66j322J312
3351D43j78j155J066Q02j181q72J549Q1j254J107Q3j448N46J568q33j501J370
3368A93M12j254Q18O23j336m58J877p3j858J000O80j112L02R38p38j131J520N76
3386I79j816O06Q60q94j39R71j95j385J130Q86j636K41J019o54n70J024J84j603
$$ y = [975, -733, -316, 831, -388, -553, 693, 419, -1033, -33, 1098, -671, -522, 896, -43, -833, 350, 836, -895, -360, 1179, -403, -813, 740, 520, -859, -201, 1020, -521, -585, 973, -98, -925, 344, 890, -618, -593, 876, -255, -530, 845, 75, -962, -6, 1101, -339, -779, 753, -165, -634, 779, 463, -1006, -486, 1188, 12, -885, 627, 70, -848, 391, 983, -644, -982, 946, 299, -807, 476, 375, -806, -272, 1098, 23, -1085, 578, 306, -741, 381, 651, -544, -776, 819, 453, -869, 443, 265, -890, 176, 978, -203, -1075, 474, 555, -699, 408, 491, -957, -411, 1157, 324, -1177, 193, 605, -649, 169, 792, -544, -1002, 875, 802, -1056, -56, 624, -488, -186, 752, 14, -1117, 403, 979, -837, -231, 629, -265, -404, 567, 372, -1013, 117, 1003, -633, -392, 627, -27, -597, 427, 611, -992]
3404i92Q58J188j422k32J118k38j068J002P50j829L38J488r28p18R66K94j431
3421h56O69J403j629m52J415j67r51O45O83j549J80J728r68r66Q92L67r23M49
3439c0J004j574k93J664k89r86L64N86r88K91J400j397p73J417J98r39J68Q14
3457F37j174j40J812q78j252J018O62j006p0J276j099q21J761m3j406L69J095
3474G41r04n87J614n84j298J168O04j059k67J200n10j008J405N9j308N63P70p01
3492a02m52J087k92j077J104L81j149J57R89o85o82J348k45j252R50O71j037l94
3510f80J397m02j343J467L02j524M55J129o55j066J274M40j706P86J037j234l38
3527f61J172k0j259P22Q14j225M5J028n40p25R07K56j143N85O44r40pQ12k75q67
$$ y = [-992, -134, 1054, -368, -600, 518, 280, -788, 214, 964, -865, -527, 961, 33, -685, 281, 575, -856, -187, 1216, -413, -865, 550, 383, -568, 77, 760, -789, -609, 1119, 151, -815, 77, 444, -479, -30, 974, -600, -893, 771, 482, -504, -140, 446, -542, -251, 1149, -248, -1021, 396, 594, -345, -177, 637, -537, -677, 1135, 257, -995, 23, 685, -321, -391, 885, -214, -1035, 726, 683, -723, -354, 741, -163, -750, 864, 280, -1018, 150, 754, -305, -572, 628, 118, -890, 515, 574, -734, -171, 599, -102, -554, 533, 241, -836, 268, 649, -500, -343, 646, -39, -721, 627, 382, -870, 80, 751, -286, -680, 717, 315, -1028, 439, 741, -783, -328, 801, 146, -920, 354, 794, -912, -126, 911, -323, -661, 511, 491, -768, -46, 768, -457, -412, 616, 76, -649, 258, 514, -629, -44, 600, -340, -347, 465, 190, -677]
3547f77Q96M43j422O48R26j158k43J097m2j290P34J090j576r5J588p02j164J114
3565A67P02j473O1J430q22r38J184M46j432L12J225j068l54J034k15p25L60P11
3583F05q82j69J103q23k96R58l91n83N31M90q95j00J208p82p94J330N2j367N86
3602b19J158j206n53J468j47j384P16J235j462n33J832n65j250J011O04j028l43
3619f66J363l95j233J247K53j097L99N51m88l06O99q1p69O71K86q73L60O44q97
3638c32r6J096n50q55R19M68j104p7J432q52j155J733J22j636N50J171p60j008
3656i34J375L46j799P86J285j307n10J178N8j079M91Q09j012k20J081l25p72O99
3674A50J27o71N07K32o53O3O28k54o55Q38P7j180R17O66j271p2J168k37j188Q34
$$ y = [-677, 219, 662, -760, -112, 814, -344, -587, 510, 468, -822, -88, 1002, -574, -669, 919, 217, -947, 167, 869, -604, -543, 887, 65, -873, 311, 757, -675, -363, 862, -206, -560, 474, 259, -466, -106, 605, -277, -446, 657, -166, -462, 496, 105, -478, 53, 543, -352, -452, 756, -26, -820, 510, 562, -805, -219, 939, -267, -820, 648, 501, -883, -167, 1068, -394, -927, 905, 340, -910, 101, 705, -323, -666, 697, 302, -931, 316, 569, -528, -129, 422, -66, -372, 327, 246, -523, 148, 434, -439, -79, 565, -332, -428, 668, 118, -737, 182, 650, -454, -531, 901, 49, -1106, 627, 749, -887, -337, 834, 74, -934, 441, 787, -1012, -226, 1059, -248, -758, 420, 478, -601, -110, 699, -313, -533, 548, 223, -549, 150, 277, -394, 113, 345, -308, -245, 383, 129, -526, 312, 389, -791, 126, 792, -479, -551, 617, 380, -808, 26]
3694B6R12j610K4J691q50j228J231O69j404j7J357o92j027J254M68j484K53J136
3712G09p42m18P23m0o59L25O58p81j34P69n60q1O80m77m71O34L88q67K9R42p98
3733a71m81J331j92j400O99J151j106n59J311j91j287R28J072j551m77J656l01
3750D32j136P31N64r89j44J314n04j095R31L69p54K16L91n15j78P42j59o30N30
3769A16R7o19M99M49r37q5J061m25p86Q59L14j154K14J319q74j029J375K60j336
3788f82M33J105r57q26J448K05j511N37R92r10l81J033j31j072O67P27r11r9O68
3807C35l23l74O55k9p58M84M31o84R8N87n58l70R46m8j068O12P37j002j81J148
3827F38l92j089R70P16j356k6J287n98r78J067N24j345J25J191o76p04R54J95
$$ y = [26, 938, -672, -648, 1043, 193, -1035, 196, 865, -539, -556, 801, 109, -918, 336, 804, -680, -427, 709, -33, -451, 272, 232, -427, -102, 556, -225, -359, 410, -150, -231, 449, -28, -499, 135, 523, -344, -315, 627, -171, -652, 679, 487, -913, -214, 937, -169, -728, 583, 392, -895, 33, 1105, -446, -923, 733, 432, -704, 27, 591, -398, -542, 772, 268, -827, 104, 473, -281, -65, 326, -189, -367, 375, 216, -414, 116, 213, -406, 93, 542, -395, -480, 581, 156, -630, 229, 543, -611, -397, 922, 48, -981, 394, 654, -682, -249, 856, -101, -927, 521, 726, -785, -248, 744, -166, -547, 486, 355, -717, -50, 677, -234, -333, 335, 12, -362, 293, 264, -494, -10, 421, -263, -165, 422, -136, -506, 440, 392, -676, -64, 673, -329, -510, 638, 246, -843, 127, 843, -513, -539, 748, 150, -828, 239, 763, -582, -457, 734, 58, -646, 308, 503]
3845E03j094L92Q83q09l43P79j51n37N20K52q35K24P66o75k01O70k89n18O77L62
3865E76j096J30J110p48n92J010kj031N17R49j051n46J351j31j184O97P37j030
3883c34j77J132m20r29Q35N46j056J1R36n50m70Q32j01p42M33N56o45k38Q19m44
3903fn03R17r8q27L95O35o31l31R76l57r43R71N06j103j8R49m81o61J020J74j299
3924g15L30J151o83o67Q82p1q61P57O04j031l66J030j3p35N81N1q56N31P82p00
3944An77O95J38o10O04K01j072K59J000m35p27O48J78q47N90O95j033l74J081
3963D15mr22N49M92j016R6J076n07p97O95L59q51K79P76q08m18R42J9q01M25M26
3984D25q15J07Q52m81o67P03K85q54L83O37q91j47Q98j74p75M95N67r53L3J034
$$ y = [503, -591, -199, 684, -125, -468, 311, 160, -377, 143, 395, -440, -216, 550, -125, -326, 344, 55, -463, 214, 576, -520, -390, 720, -28, -620, 390, 388, -643, -126, 823, -228, -774, 577, 446, -738, -41, 696, -334, -511, 621, 201, -728, 107, 653, -403, -392, 544, -6, -476, 356, 255, -487, -54, 502, -143, -381, 438, -6, -509, 408, 310, -517, -122, 513, -118, -449, 527, 170, -773, 198, 704, -399, -417, 532, 51, -610, 410, 584, -715, -385, 766, 83, -584, 298, 227, -634, 123, 727, -304, -670, 360, 347, -388, 193, 244, -612, -81, 701, 1, -576, 119, 257, -353, 251, 452, -620, -361, 639, 204, -523, 125, 303, -544, 46, 741, -292, -666, 415, 411, -511, 38, 530, -486, -390, 686, 179, -618, 77, 436, -415, -136, 640, -168, -586, 356, 375, -426, -1, 425, -390, -283, 569, 88, -579, 124, 409, -445, -62, 575, -316, -463, 435, 261, -514, -19, 548, -405, -372, 662]
4004F62o62n64Q11J30q15K28Q57p69n04J059j49p58N54L44p71j4R37m13p45P16
4024A34K16p35L69N59q16k37R65j46p53M47L93p65J17R30p13o34R23J40p58K42
4044a22O31p19l63J137k55r31O45L96o78m8Q32m50p48R28J88q70L00N33n46k97
4064d37Q41r5q89O17M08p69J43O39m79n26Q17J72r25L82N90p23j53Q66k74q18
4084f13O93M63q73M1Q01n13n91R20J35r92L65O66o02l17P79r9q83O87M95r18O6
4105b90O71l57m40O09K11r11L60P10p60j45P00k44n64N37M29q98P0Q41n82l97
4125d50P69Qq28L87P04p82k51Q66k77o71O42M29r16j1Q98m64n05P15O0q22L61
4146a38P67p41l64P67j22n79N29L46q68M1Q84m54m71N87L2o24L31O58p78k91Q79
$$ y = [662, 0, -564, 247, 377, -438, -210, 647, -122, -626, 433, 284, -474, 80, 424, -347, -361, 576, 163, -582, 134, 350, -385, -16, 543, -273, -510, 455, 309, -444, 3, 396, -369, -252, 678, -35, -669, 254, 394, -364, -122, 509, -210, -573, 564, 309, -622, 23, 419, -259, -307, 525, 75, -673, 255, 443, -427, -127, 406, -140, -437, 404, 309, -580, 37, 445, -324, -181, 458, -21, -547, 270, 442, -483, -101, 489, -234, -387, 479, 205, -613, 80, 543, -330, -289, 512, -1, -592, 328, 463, -529, -164, 502, -100, -417, 362, 263, -620, 67, 562, -356, -290, 381, 24, -416, 193, 404, -507, -147, 563, -197, -342, 358, 114, -450, 87, 516, -382, -312, 529, -53, -450, 319, 327, -501, -114, 590, -192, -443, 423, 146, -525, 117, 546, -370, -381, 517, 53, -452, 263, 323, -499, -138, 629, -112, -476, 291, 169, -410, 119, 465, -403, -362, 522, 68, -403, 184, 216, -408, -77, 581, -197, -488, 391]
4167C91k87m88N69J63p15J7R01m57o15Q27j21p01N76N14p26m18Q64Jp00O02J87
4188C84r37K62R56m78p19N61K01n27L53N15q76l37J084n5p29L59J22m52J96O95
4208E78n05p70Q34K43o88L87K30o65J9P61j37p87M96L48p30L05O60o93m64Q10
4228B32J10p16L79M18p68j02R78k05r12N59M27p41K34O23n79n16P35L62q39J36
4248a85N77o12r0P47k72o21M47L70n81K3N88m15m14O72K3o74M93L34p50K7P05
4269C92j67o16M06L19q06M01Q02r43m12Q45J74o20R6N17p26j26J177m22r86N98
4289i7M75m65l9M54m06n00Q32L13r17R5N29m44N5N02l39m72L93L98m87k1N32o18
4311b27k05R09k38o35L38L05m53j4P79n00q36R33M16q80Q9N78n25k75Q69M4j073
$$ y = [391, 104, -384, 185, 348, -367, -350, 551, 94, -521, 306, 185, -516, 60, 574, -152, -570, 294, 295, -405, 197, 384, -553, -291, 665, 187, -532, 29, 230, -297, 56, 571, -305, -642, 442, 387, -342, 17, 139, -313, -117, 578, 73, -697, 137, 380, -308, 79, 309, -356, -337, 424, 287, -500, -4, 344, -386, -81, 579, -114, -578, 232, 342, -374, 5, 423, -345, -447, 531, 326, -586, -27, 400, -341, -107, 516, -63, -579, 156, 518, -321, -185, 392, -220, -310, 437, 165, -456, -9, 361, -220, -197, 391, -24, -438, 234, 257, -417, 76, 410, -340, -313, 392, 225, -391, 15, 334, -472, -71, 731, -212, -624, 221, 395, -225, -129, 388, -338, -464, 713, 291, -695, -97, 378, -87, -126, 328, -78, -578, 254, 567, -350, -255, 274, -170, -115, 387, 48, -424, -31, 367, -120, -141, 391, -227, -432, 477, 239, -396, -58, 247, -206, -220, 559, 59, -777, 156, 572, -308, -219, 359, -166, -441, 428, 472, -601]
4332f01K49R15n30m04O59k44n43O37L44o67k38O57m8m90M91Po31M80L19n31l6
4353b05M11j32l84M42J95p39L05N88o99j42P74k24o78M43N38o74k23Q66l45p42
4373f25Q58K98r54P0P64k38n90N02K67q03L22O95p01k86N92N6m02J18K62m29M6
4394a78N85m41l36N44o5l41L33J26n20P0O37l68n05O67J32p73L42O06o61k98P61
4415C17j3p75L94O76q23k92R66j92o92M56L30n89n2P45l01o79N65K79m98J32K75
4436B29l86o9M90j12m20K57J80l73J83L64n46j15O25j94m55M23K41o40MP98l76
4457A08o33P15J05p17L09O66n81o08Q11K83p72K20M64o25j04P83p7p80K05N19
4477B91l31k7L54m05l01O06J75n19M9J58k24J53M34m05n05N82K17n24K77K52o35
$$ y = [-601, -352, 563, 33, -371, 288, 44, -499, 138, 482, -185, -423, 234, 186, -304, 187, 194, -437, 43, 362, -169, -205, 206, 74, -310, 132, 327, -412, -107, 481, -218, -360, 414, 190, -488, -45, 493, -181, -404, 462, 117, -625, 233, 531, -423, -353, 411, 173, -417, 85, 352, -451, -129, 566, -135, -421, 171, 227, -175, -57, 205, -224, -178, 407, -34, -370, 174, 109, -232, 101, 227, -293, -223, 414, 46, -459, 208, 340, -433, -91, 515, -146, -444, 317, 304, -471, -77, 599, -224, -516, 450, 258, -434, 22, 352, -237, -289, 456, 155, -524, 41, 320, -178, -46, 229, -157, -226, 264, 152, -268, -11, 169, -204, -21, 343, -203, -318, 307, 113, -342, 81, 322, -318, -314, 484, 108, -525, 190, 295, -422, -113, 553, -28, -636, 175, 458, -314, -94, 370, -255, -359, 424, 347, -433, -228, 291, -40, -67, 287, -118, -419, 187, 362, -157, -108, 50, -174, -21, 413, 8, -497, 85, 302, -222, 55, 307, -328]
4498c28m4Q05j02q02L60M85o38M3P66m77p07O49N20o92q1N57l92l68P41J69q30
4519c66O7N63k48j29L58k07m44L92M29m82r4L06l20L0M94j98n07K53L95m11J6
4540a03N04n42l53P52J28o78R9N15m53k34P84j02q69L76O52n43k00N80k70n25
4560d82N31M56o66k08N95k05k72N35r4n53J96M69k38k42L42k29k73N93O8n95Q6
4581a86L85k42j18N00k75n71N28M57o22j31N53k71l99O51J24p67Q3P02l13m41
4601c53N55No21L65M64m87k81N22j6m60L77K30n52M0M72k27k44L61l1m66L66L18
4623C37m78q4M38j91l04M84N3o61K65N45m22k98M87mn36M05L85o54j18O72j52
4644A69n25L92K64n66R4N31l59l47M95J08n40K16L87m39j00M35j45l25L20J83
$$ y = [-328, -372, 433, 331, -471, -111, 374, -264, -221, 545, 68, -639, 10, 530, -162, -243, 314, -78, -446, 295, 464, -366, -299, 264, 16, -113, 245, 38, -406, -14, 415, -67, -161, 145, -175, -145, 349, 151, -356, -103, 292, -119, -103, 401, -141, -494, 258, 386, -292, -193, 322, -131, -365, 419, 317, -552, -176, 476, -67, -267, 313, 43, -482, 49, 505, -161, -369, 226, 21, -251, 284, 190, -363, -167, 302, 64, -178, 164, -65, -338, 255, 323, -272, -186, 199, -43, -161, 339, 64, -507, 21, 478, -144, -275, 278, 7, -392, 259, 383, -384, -301, 401, 88, -353, 202, 207, -414, -49, 415, -72, -353, 169, 153, -307, 70, 300, -252, -212, 260, 33, -211, 150, 119, -347, 19, 337, -141, -225, 213, 22, -282, 202, 255, -406, -141, 404, -18, -316, 171, 167, -369, 36, 421, -233, -351, 321, 169, -356, 36, 300, -266, -172, 359, 0, -347, 148, 256, -284, -68, 319, -120, -220, 215, 70, -255, 65, 248]
4664B48n33J34M96m01k11M30n4l74L09K95n92m1O42k37m45L69J89m82J58N06n04
4685i8l35O41Q9n52J51L55m06n5N49k59m75M19K87m67lM12l09k17M95m7m49K41
4707c3L21m45o9N52k58l93L88J39l98J29M26m96k87P10J3n64J62K59k88MN44l81
4729C5n89N91L57m66p2K53k48r4N77p9o96K31M99k72j35L03k87k70N49J80n66
4750a99j2M08k36j62N06j53n72L58L65l56r8L84k55m07O14K53o65j4M03j77j35
4771a50M48j38o81M01N63m22k53K82r4j87M83Q8p15Q8N77j73k60K24n4l52L92
4792F7L45o07r1M88j29l07L34J31m99J36M57l88k10N02k4n80K96M41m27j24L74
4813A85j93l04M93K22o84k4N63j96j83K83j24l91L38M66n23k49M61j05j89L29
$$ y = [248, -285, -151, 345, -56, -267, 163, 109, -265, 44, 339, -253, -294, 348, 111, -334, 35, 224, -258, -100, 406, -98, -433, 208, 297, -255, -104, 251, -155, -210, 339, 80, -395, 24, 311, -156, -159, 253, -56, -273, 222, 175, -274, -33, 288, -157, -226, 326, 68, -325, 63, 202, -196, -67, 359, -137, -424, 286, 299, -265, -103, 156, -132, -128, 416, 35, -554, 37, 394, -72, -144, 109, -139, -233, 344, 265, -431, -200, 299, 27, -108, 195, -92, -362, 187, 367, -199, -211, 197, -39, -201, 305, 152, -420, -62, 303, -53, -151, 233, -22, -429, 185, 438, -227, -241, 162, -15, -150, 298, 160, -521, -120, 443, 21, -232, 50, -44, -231, 252, 340, -375, -287, 290, 117, -143, 81, 27, -325, 67, 412, -195, -286, 202, 73, -234, 100, 231, -268, -132, 325, -63, -273, 229, 205, -375, -79, 362, -65, -189, 185, -8, -312, 181, 403, -281, -305, 258, 62, -121, 162, 38, -353, -15, 451, -72, -321, 140, 35, -154, 175]
4833A75J0m85J06N27l08k69M15j13l73L61L08m69j67M66j60k81M74M3o21J05N92
4854C36k20l15L16j07l49M41L66o15k85N88L0l08K34l2m37K53N59l72m70M08J02
4875A23k50K52P7m53k6O01j49m57L11J13l57J97L35l83k54N08j0m50L01K28m46
4896a89m7M84j38l91L63J18n05K24M48l92l32M66R3l90J94K25m53KN49j94m47
4917c12L09K05l47J03K87l56j85N13K2n14K12K92l58K3L33k22l07L92J82n21J22
4938a27M13l73j41M29q4l93K60L03m59m6N15k46l96M25J57m34Q4L67l18k35N20
4959B21rn37K37L46l44p2L70k15l03L98K03m89J2M04k59j43L93j30l71K85K79
4980B76l68j04L96j82k87M37O4m91J39L88l20j84M65j08m55L24L18m32r8M57k18
$$ y = [175, 185, -300, -194, 333, 25, -244, 171, 58, -315, 46, 354, -115, -282, 184, 24, -257, 217, 260, -361, -256, 336, 116, -199, 117, 10, -339, 102, 468, -147, -432, 156, 186, -122, 112, 80, -357, -104, 455, 83, -387, 21, 123, -127, 125, 202, -251, -277, 324, 175, -282, 29, 142, -215, -18, 317, -66, -320, 188, 178, -272, 29, 257, -189, -236, 248, 110, -281, 82, 200, -305, -81, 367, -25, -357, 109, 202, -188, 6, 231, -222, -220, 329, 135, -312, -3, 202, -145, -42, 245, -111, -296, 217, 239, -275, -63, 229, -129, -106, 227, 5, -302, 90, 272, -249, -127, 286, -87, -228, 201, 117, -276, -16, 287, -172, -218, 297, 51, -345, 80, 237, -197, -113, 254, -64, -299, 221, 212, -325, -88, 258, -86, -158, 212, -3, -306, 92, 295, -194, -182, 222, -37, -180, 213, 83, -288, -3, 276, -92, -196, 200, 18, -269, 168, 232, -259, -120, 268, -52, -236, 229, 121, -334, -10, 308, -124, -222, 235, 17]
5001A7l43M84J28n42N8M33k04k44L71l1m85L30L78m27j39L20p9k09L26P9n06R2
5023a93M63k37j96K86j24k89L84K40m81r9M13j23k41M12l9n57K81M69l67k49L57
5044A10%m16L66L36n94j01N22j02l06K55J24m51P9N11k72l17L26Mk71K35K46m16
5066a32j29M07n3k38K62om05K37L90l51k12L27n6k35L17J71n59lN69j97l27L13
5088I0N7m22J86M95m10l38M66L8l68K34K73m53j60N32m3l58K19N7l07J50L86k79
5110D5l46L09R1j69K00Jm07O7M97j47l52K05L7k08K80K17n16j89O10Jm33K15J33
5133A41l73R4N10k83m99M53K30m36P5L19k88k32M39O4m41J63K69l02o4L58q3l32
5155b18K04J61k72J34J92l26r0L82k8l22J82J26l12J65L14l56k69M49J45m71J30
$$ y = [17, -326, 158, 286, -256, -198, 235, 31, -213, 158, 127, -358, -28, 350, -77, -216, 104, 25, -184, 142, 221, -285, -193, 270, 33, -163, 123, -1, -290, 94, 334, -147, -246, 167, 44, -197, 215, 176, -381, -100, 369, 2, -247, 110, 110, -306, 60, 396, -198, -299, 223, 121, -185, 70, 194, -257, -178, 333, 61, -256, 70, 74, -197, 38, 284, -132, -261, 146, 93, -145, 117, 111, -294, -57, 333, -18, -230, 97, 41, -194, 123, 294, -265, -268, 301, 104, -223, 90, 147, -275, -89, 406, -4, -342, 124, 162, -206, 28, 301, -152, -312, 220, 177, -181, 38, 95, -212, -62, 324, 45, -301, 8, 99, -70, 130, 131, -276, -209, 288, 141, -211, -6, 31, -177, 103, 320, -196, -385, 225, 226, -207, 8, 141, -232, -138, 372, 89, -410, 43, 273, -163, -88, 231, -57, -289, 150, 214, -227, -64, 205, -97, -161, 197, 114, -218, -14, 147, -125, 9, 201, -125, -215, 167, 139, -183, -1, 125, -187, -22, 292, -64, -333, 116, 261, -210, -80]
5176h0L06l32j04M57j01n07L24L70m57j05M07q7l10K56J63m26J06M06l09k16K92
5197E3J08k65O2J82l04O0L68k65k37K91J05k58P2J90l16QM29j85m14L18K72m07
5219a33LL29k36j95M08O5n44J38N06l60k35L79j7k86J59K57l67j20M98j46l49
5240b46K60J28k13j6K16k03j28M09r8l60K21J95k12j9J96k28j06M40n3m60J32
5261a45L90k33j69L28j87k61M04J94m85j55N26p1l37L03K3l66J74L46k49l21L65
5282G4Q2l29J88J58k82o2L03n3k32K50%l20J77K80k13j95K20m4j74L47K4m68M7
5305b22M53n4l50J91J6k80L45K71m92k71M86J77l56O3J29l45J53M05k16m38K88
5326d7K72k69L3J30k31m9L25K1l91J54K15k69N1K14j79j51K30Q8l35J60K73l78
$$ y = [-80, 226, -106, -210, 247, 146, -361, -37, 333, -124, -229, 178, 91, -219, 37, 200, -226, -120, 286, -23, -239, 53, 161, -104, -42, 140, -164, -104, 264, -1, -238, 53, 158, -100, -28, 162, -154, -146, 283, 98, -316, 2, 274, -133, -130, 199, -37, -232, 176, 241, -303, -165, 341, -19, -254, 125, 108, -178, -19, 238, -129, -249, 249, 103, -246, 14, 142, -71, -87, 129, -74, -202, 207, 109, -251, -30, 165, -47, -66, 130, -98, -204, 236, 183, -277, -145, 245, 12, -157, 171, -16, -277, 127, 321, -164, -319, 207, 136, -201, 102, 125, -241, -67, 279, 30, -291, 74, 156, -173, 15, 173, -109, -171, 132, 79, -153, 97, 97, -223, -46, 234, 21, -174, 46, 2, -172, 175, 199, -269, -222, 231, 177, -173, 18, 34, -246, 99, 370, -122, -393, 93, 270, -86, -23, 106, -239, -86, 319, 103, -335, -47, 225, -44, -11, 119, -112, -161, 164, 185, -206, -52, 163, -106, -55, 159, -20, -171, 59, 147, -188, -28, 245, -133]
5348a33p1L61n4k72J73J59l31L8M12k51l16L14J61l30P1K74k83j26L59ql48J44
5370e7K90l41m1L28j53j63J76O7k27O4L17l20j90L87l5j99J43K5k46P6M20k54
5392F7l52K95J23k10R5J61l47r3N13m2m26J00K45j71k0L02k78k75M08J40l14l8
5414a17K12j24j24L38q3l51K36J81k22l1K47j75k07L28N4k99O5K18k07j02L72
5435B09j05l71K73J62k22m3K55j42k79M01R7m31J02K43j68j01K30pl44K22K58
5456B39l27n9K71j15j68K37O3l08Q8K59k00j38K69k5k99K36J45l02L0K55j26k20
5478a95K63J25l93J27K62k45q7K70k3k91J53K82l38n5L14j49j71K18Q9k93L2L06
5500B01k10j52K57j8k23J50J72k92l2L05j32j83K21L1k67J05K75k45j65L19m5
$$ y = [-133, -204, 157, 103, -169, 4, 163, -168, -130, 282, 31, -285, 29, 190, -140, -69, 205, -78, -204, 155, 147, -201, -57, 233, -108, -149, 179, 26, -137, 39, 106, -121, -57, 260, -60, -250, 137, 102, -97, 46, 71, -175, -99, 321, 67, -285, 10, 133, -77, 18, 179, -168, -261, 252, 210, -216, -116, 129, -42, -62, 240, -38, -313, 95, 235, -79, -117, 95, -29, -153, 185, 102, -249, -13, 168, -54, -85, 162, -13, -220, 108, 162, -137, -72, 146, -61, -163, 209, 104, -267, 6, 168, -54, -97, 158, 16, -263, 138, 235, -196, -94, 149, -19, -120, 110, 103, -241, -19, 239, -88, -147, 124, 9, -159, 78, 141, -167, -79, 180, -20, -158, 111, 86, -213, 23, 168, -134, -104, 151, 25, -195, 68, 193, -200, -73, 189, -56, -143, 127, 104, -187, -34, 248, -90, -145, 169, 20, -151, 67, 156, -137, -105, 201, -9, -161, 96, 78, -145, 5, 177, -115, -147, 158, 26, -157, 64, 95, -172, -67, 208, -37, -202, 117, 72]
5521G2k39J77J54k94j9L47j49k46K32J13k82O0K77k44j51L15k7k46J13K05k55
5542h7o9L28j09k45K31N5k31J02K10k04j90L05L9k72J57R1k61N8L05j52k92K46
5564A5J32k55P4J79k51q3L62j7l60J17K36k10k9K57j78k20K90J33l16J1K37j43
5586a9j19K41j7k81J70K02k66l5K53r7j85J97R3k71Q2K11k15j01K79j9k65J57
5608eJ63k52j1K82j54k20K64Q6k87O0K70k35j34K83jk73J62J69k92k8L35j10k73
5631b01J92J29k04N0J83k44j21L66K3l30O1J74j34K8K25k43k26L28J92l05o5J93
5653G1j46pL12j45l74K30K97k04j40J84r7j65L58L5m00M1L00p5j86K01k4k87K34
5676A3K11k84j04K46l0j98K14P9l17O3K82j39j78K14j0k47K09J80k83r7K68j1
$$ y = [72, -167, 10, 164, -130, -149, 198, 49, -197, 35, 148, -134, -74, 203, -41, -192, 123, 96, -150, -37, 168, -87, -156, 172, 63, -182, 49, 104, -127, -25, 185, -19, -209, 96, 135, -137, 20, 111, -150, -92, 213, 61, -231, 15, 147, -108, -34, 145, -106, -189, 173, 156, -204, -87, 149, -61, -90, 167, -11, -231, 59, 192, -124, -113, 124, -19, -138, 103, 86, -195, -25, 177, -89, -124, 129, 32, -153, 44, 137, -134, -52, 159, -56, -157, 122, 103, -162, -5, 158, -94, -105, 177, 23, -197, 67, 153, -134, -74, 196, -39, -173, 110, 109, -164, -2, 167, -125, -153, 182, 72, -201, -9, 120, -84, -34, 149, -95, -216, 150, 173, -157, -96, 78, -56, -28, 197, -46, -272, 56, 248, -57, -122, 71, -75, -82, 230, 85, -289, -59, 238, 34, -106, 78, -19, -184, 174, 209, -191, -150, 150, 75, -111, 90, 66, -221, 13, 224, -60, -164, 82, 52, -146, 68, 147, -170, -107, 175, 36, -142, 72, 62, -185, 24, 204, -79, -176, 92, 81]
5698H1k07K02K8l22J65K81k27k00K37O4k29J40J63l46J9L68j30k96J82J74k23
5719g6K1K19k35j32L34L9l36N8K74k01n2K13j27j85K28J69l30j9K91j57j02K16
5741A10n8k15J46K12k65q8K96j06j95K21R5k92M4K87k17j59L12j7k89J30K56k61
5763e3j06L14j34k10K62J17l20k4L38j34k13K48j0k27J48J98k53j38L00j9j98
5784a14J48M8k18P1K70k06j99K96j0k05J39J03k34m1L43j28k85K81Q3k82O6K54
5806A80j96k03L30M6l45J47K26k56r8L32n6l16J94J75k56J9K32j55k07L04P1k74
5828a06N9J37j42j8K30j16k79K73J57k75K4J46j60n1K99m3l88K00K70k59n9K20
5850A19j09k33L18J44m12RL29j17j93K27L6l32J69K98k88j45K68kk08J48J35l06
$$ y = [81, -126, 76, 104, -218, -53, 228, 1, -199, 38, 102, -127, 13, 176, -170, -151, 217, 87, -209, -27, 147, -76, -55, 164, -71, -203, 131, 170, -166, -108, 166, -35, -87, 126, -1, -186, 42, 211, -119, -138, 153, -4, -106, 110, 52, -163, -17, 195, -70, -158, 138, 32, -163, 58, 153, -139, -95, 192, -25, -184, 128, 111, -178, -48, 208, -53, -159, 155, 21, -189, 73, 190, -130, -154, 184, 50, -163, 85, 75, -152, -4, 194, -59, -197, 103, 84, -114, 34, 82, -136, -65, 205, -1, -200, 96, 86, -119, 20, 123, -111, -152, 191, 63, -222, 59, 142, -140, -74, 180, -16, -219, 111, 157, -188, -41, 185, -71, -169, 163, 107, -209, -15, 160, -96, -77, 155, 0, -207, 97, 168, -106, -47, 90, -52, -70, 160, 44, -235, 38, 195, -80, -56, 90, -70, -121, 178, 135, -253, -53, 217, -42, -101, 119, 10, -223, 95, 239, -173, -164, 165, 48, -145, 82, 118, -214, -45, 253, -35, -180, 88, 86, -122, 26, 161, -145]
5872a45L5K91j51j50J67L8k21J55J80l15j5K68q2j95J70J15l30J20L14l02j42
5893a95K98K5k63Q7K66l29o9L98j38l00K11J89k68l9L02j80k05L02O3l15N9K58
5915A57j93q5K45r8j88J81J51k67m4K96j96q6K61q1k14J34K36k79j04L48j52k23
5937b01L00N5l16L7L37j71k67L39K2l22J67K41k71j74L70k8k92J92J22k20l3K91
5959A78j36k45K78L4k48J26J39j91o0K40l8k90K60P9k77R5K17j78j63L12pl27
5981b02J95K05k85p0L17o9l36L06J25l40M2K74j11k56K73J03l71J63K39k63p7
6002a38K23K2k60J44J78k98M3K69j82j66K46Nk44J72J39k61j7K69p6k61K29J34
6024A70l69J37K68k57j35K59R7l54R6L35l68m8L52j29k17J42K11k69n3L33k07
$$ y = [-145, -110, 181, 30, -120, 47, 85, -136, 19, 199, -116, -131, 137, 55, -140, 30, 145, -185, -65, 249, -53, -195, 103, 128, -135, -48, 218, -111, -180, 218, 80, -220, -9, 180, -88, -127, 175, -5, -210, 92, 155, -160, -101, 157, -36, -121, 124, 26, -162, 19, 170, -97, -141, 155, -41, -127, 134, 53, -161, -27, 209, -70, -174, 174, 22, -201, 99, 154, -162, -125, 212, 41, -226, 113, 135, -187, -20, 221, -50, -224, 146, 118, -174, 18, 140, -80, -113, 178, 42, -203, 75, 109, -139, -13, 126, -65, -125, 115, 77, -213, 47, 126, -151, -56, 161, -17, -180, 132, 125, -202, -7, 198, -87, -157, 160, 91, -245, 61, 186, -154, -112, 162, 51, -205, 68, 171, -200, -37, 202, -61, -138, 85, 107, -153, -9, 169, -129, -86, 183, 1, -165, 81, 86, -158, 14, 153, -108, -125, 144, 68, -193, 36, 170, -199, -62, 206, -51, -186, 73, 170, -184, -88, 247, -121, -169, 183, 54, -163, -21, 190, -79, -132, 201, -6]
6045fj78K84J5k61Q4K18k23n1K60j03k04J74J69k89J4K77k39r7K95m1k64J14K55
6068B03k71r8L56j61k35K76J07l07rL30j79k16L22J8l19J23K66k51j52L35q7k09
6090a58J88J26k51n4L16j30k27L13n6k25J72J47k08j11K83m1k78K77N8l27J11
6111g5K78k02k06K82M2k73J52K05l07j03M09q2l12J97J11k26M6K57j81k74L41
6132G9J02l19J03J28k01J5K68p0l43J92K18k57L6J65k22o6L24K0l77J13K64k07
6154c5m9K46j51k72L25J82l65k0K74j45j21K55ll60J50L36k49j51K61q6j83K28
6176F7J41l50l0L32r4j83K00l0k42J88K32k90j40K79k5j59J81N1l17P4L82k46
6198B1k34K41O9k09J31J69l28p7M41p1l53J57J45j71L4K31k38k27L70J05l35L6
$$ y = [-6, -184, 100, 115, -146, -62, 156, -67, -118, 142, 39, -165, 9, 178, -111, -97, 180, -59, -156, 139, 98, -166, -52, 203, -68, -166, 190, 29, -206, 70, 177, -130, -139, 191, 12, -204, 118, 136, -183, -60, 206, -45, -197, 138, 51, -158, 30, 156, -95, -149, 167, 37, -190, 123, 67, -158, 14, 161, -47, -158, 125, 84, -194, 83, 141, -186, -75, 203, 1, -205, 77, 119, -154, -2, 203, -104, -207, 202, 120, -192, 5, 116, -110, -64, 193, 12, -262, 79, 181, -138, -35, 93, -108, -93, 175, 105, -238, -46, 172, -85, -49, 116, -106, -172, 152, 172, -205, -92, 172, -35, -84, 162, 11, -261, 64, 246, -119, -139, 135, -10, -131, 124, 121, -239, -89, 247, -2, -153, 108, 22, -161, 67, 208, -142, -172, 160, 66, -117, 83, 53, -189, -1, 231, -59, -199, 80, 55, -104, 77, 128, -189, -115, 267, 21, -213, 28, 97, -112, 19, 188, -140, -217, 224, 153, -200, -43, 102, -69, -35, 196, -42, -269, 101, 206, -129, -93]
6220i3J85j58pK49j42k84K80J86k76l2K02j58p6L00m5l65J81K52k20p8K15j02
6242A4k30K89J52l75J3K91j44j46K62k0l44J82K75k32j42K32o0j92K68J12l69
6263a64KL33j09j61J64k1k25K07K31l40j17L12k7j80J49L5k76J30L29k72k13K70
6285E7O0k23J19J67l09k7L86j27l04J99J54k46JK80k07j80L19J2k85R7K27k10
6307d0j05K93r3k28K10R4k45J0K88j91j82K99nk37J21J65k48m5L48j52k92K85
6329E0J06k41J6K25j83j72L62j7l56J63K11j86j09K63p1k80K86J26l25K0K65j19
6351C4j86K33K4k77J67J91k38j03K80n2k51K31Q9k76P3K10j59j66K81K9l33J83
6373a6K04k77l7K64p9k61K55J43l72Q7K53j66j66K47O0l19J57K27k92n8K89n7
$$ y = [-93, 92, -66, -73, 176, 34, -250, 30, 216, -60, -92, 110, -48, -124, 176, 131, -234, -53, 199, -21, -99, 116, 14, -216, 73, 225, -150, -137, 154, 10, -136, 126, 106, -238, -56, 219, -13, -155, 77, 17, -175, 93, 205, -164, -162, 171, 62, -99, 65, 44, -181, 26, 257, -83, -200, 112, 85, -95, 54, 89, -187, -57, 272, 0, -213, 57, 117, -106, 13, 180, -129, -156, 230, 103, -201, -2, 152, -94, -93, 187, -20, -200, 119, 131, -154, -57, 170, -40, -145, 148, 55, -173, 37, 131, -114, -104, 184, -7, -189, 110, 105, -132, -11, 154, -94, -139, 209, 57, -235, 50, 156, -85, -69, 156, -27, -199, 163, 146, -210, -47, 164, -22, -131, 132, 61, -219, 67, 193, -132, -112, 153, 34, -152, 81, 105, -172, -5, 186, -52, -155, 125, 73, -178, 53, 142, -134, -61, 149, -10, -176, 105, 134, -199, -16, 188, -89, -126, 138, 59, -202, 53, 196, -176, -89, 164, -2, -168, 79, 139, -180, -23, 204, -88, -146, 143, 86]
6395H6k47J64J67l01O8K49k26j31K57N8k88Q5K23k42j6K55j45k32K41J75l19J2
6417a07K47j87p5K50k0l13J41K77k69o9K47j21j68K32J28l48kL42j70j55K39k8
6439G1k56J53K56k64j45L12q0k00K02R1k72LL06j76j49K50l0k28J44K01k51q1
6461a43K78j05j97K39P7k81K1K92j83j59K91o3k65J96K07k52j42L20r0k28K74
6482H7O8l08J3L29j38k33K55Nk54J71J84k29j40L01m0k28K28N4k77M8K76j35j95
6505a58K41k2k41K20J53k73j04L01l4k19K18J2l03J47L09k11k66K77O4k48J82
6526D5J34l22m8L77l1l66J83J54k35R3J85k02j97L21R9l35R4J66j79j1J98q0k42
6549a99K28J65l27O8K09j59r8K13j9k67K06J88l04m7K89p7k42K18J12l34J21K80
$$ y = [86, -161, 3, 170, -131, -63, 186, -40, -171, 86, 144, -144, -59, 164, -78, -94, 161, 16, -216, 25, 200, -119, -107, 140, -47, -122, 128, 108, -205, -64, 213, -56, -125, 122, 1, -167, 65, 193, -155, -157, 185, 15, -140, 99, 71, -185, -32, 224, -40, -185, 127, 47, -153, 49, 140, -132, -129, 177, 1, -148, 102, 72, -156, -12, 189, -62, -143, 135, 30, -167, 72, 149, -132, -111, 181, -2, -161, 130, 67, -198, -2, 205, -47, -189, 131, 41, -187, 87, 155, -153, -140, 189, 51, -182, 73, 78, -176, -5, 179, -50, -190, 111, 71, -157, 71, 125, -152, -104, 172, 37, -158, 83, 61, -180, 40, 193, -80, -184, 117, 83, -136, 82, 94, -209, -62, 247, 36, -230, 47, 111, -137, 45, 179, -143, -191, 186, 155, -211, -28, 126, -109, -16, 169, -33, -230, 91, 190, -145, -51, 115, -64, -75, 123, 43, -199, 29, 194, -133, -65, 144, -15, -113, 100, 81, -186, 20, 208, -96, -143, 146, 69, -173, 45, 157, -177, -56, 224]
6571B24k57j67K78R6l39J04K63k86k7K62j00k34J78K22l30l7L07j60j18J93k6
6592D6k00J26K42l03r5K99n8j54J24N9k49J23K85k93j73K99M5k24N8K08l02OL83
6615B52j91k83K22J85k44p3L05j88j69L51n0k97J00K75j95j51K55o5j86K08O2
6636A23k31jK99j80k04K91j9j79J04R4j88l2L40j77l05L16J11k30MJ64j44j22
6658a66L87p0m40K01L06j76j63J86p1j76L32O9m03l1L54J0k66J61k2k16K84J23
6680B13k72j45K52R4k49J67K4k96J83K06j73j61K13M1k83K04J87l33l1K79n7k16
6702a53K39M3l61J21L56j69k81J87J15k38K07J43l93l1L58N4l02J3J68j92J41
6723B5K21l57j33L06J29k39l4J52j77P5K57k35k40K87J80k91k2K14j77k9K39p1
$$ y = [224, -33, -200, 78, 174, -165, -61, 202, -84, -111, 151, 51, -183, -5, 217, -113, -150, 157, -3, -121, 72, 46, -154, -28, 214, -89, -184, 115, 57, -97, 27, 86, -163, -40, 245, -48, -221, 78, 123, -101, -43, 165, -137, -131, 252, 61, -222, 0, 185, -59, -132, 173, -15, -184, 167, 117, -180, -80, 195, 0, -151, 104, 39, -147, 61, 123, -108, -109, 190, 10, -194, 97, 78, -101, 3, 97, -91, -123, 217, 40, -265, 51, 162, -68, -64, 100, -44, -166, 221, 151, -289, -88, 218, 42, -121, 65, -6, -182, 150, 219, -184, -215, 139, 149, -117, 44, 22, -194, 90, 213, -59, -204, 48, 142, -107, 60, 84, -212, -29, 177, 4, -157, 56, 97, -186, 18, 205, -128, -159, 120, 63, -153, 86, 129, -232, -111, 245, 76, -205, -18, 97, -141, 66, 209, -184, -215, 143, 197, -105, -92, 76, -116, 25, 246, -111, -244, 62, 191, -48, -82, 70, -107, -32, 225, -10, -250, 37, 217, -74, -96, 118, -59, -88, 151, 80]
6745H0l26J97L43l54j28K91p9j10J62M9l03M0L99k20k60K59L4j74J02J45k36q6
6767a75L41o1k59J58R8k21N4K49k08j45K70m0j89J49J61l04p2L84r6k38J84J7
6789E7k11J31L01k70l20L66J26k62R9P0k54L7L95j20m13J86K28j59MJ41k44r6
6811b08L83K5l75O1K11j16l1J84j42k29L10J21l30N6K05j48j12K47ml07J72K27
6833B00k87n4L05j01k59J96J77k78K3K58k11j51L06K8l29R1K46k07n6K27j17j87
6855a80K25J49l08lK70j60j11K26m1k58J79K08k76o9K83j01k07K27P1k65M8K92
6877A99k36j62L06Kk68J23J95k28p8K90r1k65K55J33k99J1K46j30j54K57rk95
6899a98J80J94k43o3K43q3j81K31N0k87R3K40j72j70K61kk72K01J59k87o0L09
$$ y = [80, -246, -49, 294, -60, -188, 103, 24, -86, 76, 125, -178, -138, 261, 41, -219, 40, 74, -100, 2, 147, -89, -175, 166, 105, -154, 4, 102, -119, -65, 184, -24, -169, 101, 61, -128, 21, 182, -122, -194, 190, 94, -144, 40, 57, -154, -23, 278, 8, -312, 54, 180, -82, 17, 87, -167, -130, 265, 145, -268, -82, 146, -13, -9, 132, -112, -208, 175, 200, -175, -114, 97, -19, -50, 134, -8, -237, 73, 194, -136, -80, 125, -23, -135, 112, 108, -199, -27, 200, -87, -141, 164, 63, -196, 0, 177, -101, -78, 180, -31, -182, 124, 152, -177, -86, 160, -47, -103, 124, 7, -180, 45, 194, -114, -117, 153, -7, -118, 108, 67, -191, -12, 196, -80, -149, 134, 33, -174, 53, 124, -141, -93, 199, -37, -199, 107, 109, -159, -36, 159, -69, -147, 143, 52, -213, 42, 175, -124, -113, 133, 3, -151, 106, 97, -198, -18, 176, -67, -130, 113, 30, -151, 80, 130, -157, -64, 176, 4, -166, 95, 93, -179, 22, 181, -106, -166, 143]
6921A43n8k59K03J09l10J06K47j83j85K57N0k87J44K05k80n2K84o7k24J70J27
6942A40k88Q3K39j82j47K22K7k48J67J79l13k1L02q7k02J41R8k75J21K87k80j89
6964b26L06N2k49J04J61k86JL44j10l14K00J74k44M0K06k29j08L04J3k90P6K25
6986A50k19m7K80j76j51K33M5k49L9K87k04j81L05m6k05J76J09k82k8L66j04k95
7008a97K01J05k25R3K39k92j55L50M3k79P0J53j82k9L10j64k79K79R4k14J5K13
7030A49j82j68L23J2k72J45R4k17K1K94j24l15K35J40j91O6J30k69j01M18M8m27
7052a91O3K10j35N6J89k23k99M03K26l63q3J86p0j9K46j19l77K49L20k57j37J68
7074D3m2j22K45M0l61J12K77j75j56K25%k56J85J61k94PK84j41k32K43J44l26
$$ y = [143, 85, -174, 29, 138, -172, -66, 181, -2, -187, 70, 120, -167, -23, 182, -98, -150, 134, 67, -157, 13, 140, -148, -65, 174, -8, -155, 67, 94, -154, 13, 192, -121, -142, 160, 73, -129, 12, 110, -165, -44, 243, -37, -226, 80, 132, -117, -13, 148, -138, -137, 207, 97, -217, -17, 157, -87, -47, 159, -70, -178, 126, 139, -151, -75, 150, -69, -116, 164, -12, -163, 70, 115, -134, -95, 192, -12, -193, 112, 66, -139, 37, 146, -136, -164, 202, 98, -197, 4, 109, -116, -23, 216, -76, -231, 119, 162, -117, -47, 106, -76, -105, 205, 41, -238, 41, 135, -79, -64, 149, -33, -201, 122, 134, -138, 7, 101, -116, -95, 199, 75, -240, -5, 135, -56, 10, 140, -129, -230, 188, 236, -191, -128, 82, -53, 3, 192, -31, -330, 73, 299, -64, -147, 39, -31, -50, 196, 77, -300, -51, 269, 12, -125, 43, 1, -121, 124, 164, -197, -85, 192, 17, -139, 86, 86, -170, 15, 176, -118, -111, 173, 32, -200, 43, 187, -139]
7096a39N5K24j88o5K65o8l14K02K73k96r3K44p3j58K19L2l13J11L11k30j75K33
7118E7O4k20J14J23k76K8L46j71k88K16J72k24K3J64k56ML35q6l59J38K93k09
7140a2o4J98j87r7L27L8m02L1L57j39j74K04o9j88K28J82l54o5L44q0k16J73N7
7163I2k14O9K37k58j11L26k5k69J07J77j77m4K31j67j59L26L1l37L5L07j43j74
7185a40K40r4j84K70J46l55j03L89n8k33J75j2j98J66K50k93k58L99O1k76J20
7206A2N8j83K4L10j60l26K87J41k49N0J41j73q7L12n1l00K01J43k49rK69j11k50
7229b00K59M9k50J66J44k46j47L68O9l80J42J22k26J25K34k25l20L38K49l43k3
7250i5J52j48K0L08j03m24K05L00k13p4J25r1j24K92P7m31J11K76j70q0J55k0
$$ y = [-139, -84, 140, -48, -113, 152, 84, -230, -28, 245, -51, -144, 100, 27, -131, 88, 120, -193, -82, 229, -1, -176, 57, 121, -99, 15, 138, -138, -110, 236, 65, -223, -7, 165, -59, -36, 128, -128, -124, 211, 125, -234, -96, 197, -12, -76, 122, -65, -162, 165, 203, -199, -168, 189, 50, -124, 80, 11, -177, 51, 233, -121, -186, 158, 78, -138, 35, 92, -122, -53, 184, -74, -185, 141, 116, -153, -46, 131, -46, -90, 141, -26, -185, 141, 172, -165, -130, 177, 34, -140, 100, 6, -178, 92, 238, -117, -220, 169, 111, -122, 53, 41, -157, 9, 259, -34, -292, 107, 168, -108, 12, 70, -113, -89, 221, 61, -265, 22, 163, -86, -36, 105, -68, -155, 157, 106, -194, 7, 150, -99, -108, 161, 50, -200, 59, 108, -142, 24, 168, -78, -225, 143, 212, -168, -26, 96, -130, -5, 229, 4, -316, 22, 271, -72, -95, 57, -91, -71, 237, 134, -290, -85, 215, 2, -72, 53, -38, -162, 130, 207, -224, -113, 163, -7, -87, 68, 48]
7272D8k38K11J88l58K2K96j66j55K01R8k81Q3K42k82n4L11n3l33J65K53k76j6
7294i4K51j71j51K48J10l40K5L12k23q8K50q3j96J23K06k41o1L14j96j78K55N1
7316A23k24L3K11k27n2L33j28k91J78K24k16n9K41k36j16L77K3l43l5L34j18j48
7338a16L03j86k50K85J96k62j74K88j9j96K80m8l01J20K69j48j90K31m9j97K27
7359F3Q3k47l4K77j08k11L10l9k71J44J96j84j37K73n0k85K92J23l29NK45p4k07
7382a65K50N4l55J52K73k24j47K39lk44K12J34l00qK53n7k06J96M8k85J79J97
7404A93k40p9K04Jk25J79J58l56P8K74j77j51K07N9k86J14K80k99j09L13o5k45
7426a72K01J64l28j1L18j29k02K05O2k67J01K74k78j20K71k2j79J17J31k78N5
$$ y = [48, -190, 21, 209, -149, -127, 169, 3, -152, 49, 147, -134, -51, 191, -91, -145, 166, 113, -220, -55, 198, -78, -94, 157, -14, -165, 83, 193, -147, -122, 190, -33, -121, 129, 46, -150, -27, 179, -62, -123, 191, -5, -183, 72, 123, -101, -68, 143, -84, -136, 197, 69, -222, -44, 180, -36, -95, 146, -90, -206, 171, 194, -149, -184, 150, 32, -116, 187, 1, -249, 36, 232, -30, -204, 84, 65, -131, 149, 101, -200, -80, 189, 41, -149, 82, 33, -164, 63, 146, -101, -135, 142, 34, -177, 133, 94, -177, -33, 163, -21, -158, 115, 65, -220, 72, 195, -134, -129, 116, 42, -165, 85, 139, -216, -64, 209, -15, -162, 77, 74, -170, 42, 176, -124, -132, 121, 64, -142, 54, 102, -183, -4, 193, -47, -126, 78, 79, -146, 33, 191, -165, -87, 187, 10, -141, 66, 125, -161, -47, 233, -66, -175, 138, 73, -172, 29, 193, -135, -146, 172, 43, -159, 46, 108, -159, -58, 216, -62, -182, 89, 67, -112, 5, 136, -142, -87]
7447h7L08k25j76K26N8k01P9J65k47n8L54j03k87J86J62k38RK48k02j72L25K6
7469A50l00O0K69k14j28L01o3k57J94J40k40j6K63j20k36K64O8k52Q2J64j93p3
7491a37L07r3k95K03J69k17K0J70j95j06L33K9l92R6K59j61p7K24j43k22K91J73
7513B36l45o3L17r2j69K06nk86J80K47k69j36K70J5k45J43J33k58O3K35j96j68
7535a87K66P8k84O8K02k24jK59j50k34K31J66k77l7K72j64j32K67j9k86J35K48
7557A97k33j23K82n3k45J83J37k35LK40j94j52L12M4l01K4K22j19l3K14j94k26
7579b50L00J78k74j06J96n9l0K58j62l59K35L56k25k20J70m0p9L05j5m04K1L99
7601A95o5k73J68%j95K14J77k94j42L12L5k55J62P9k83R6K33j52j42J92J8k42
$$ y = [-87, 221, -4, -180, 46, 104, -97, -18, 147, -100, -158, 196, 93, -194, -8, 154, -84, -75, 173, -29, -201, 124, 150, -150, -90, 179, -35, -163, 138, 75, -182, 12, 152, -88, -104, 159, 39, -197, 67, 135, -117, -35, 129, -64, -137, 170, 77, -218, -15, 154, -63, -43, 127, -68, -174, 159, 188, -204, -108, 151, -10, -87, 137, -6, -228, 63, 236, -109, -172, 145, 53, -116, 90, 85, -201, -21, 226, -43, -179, 91, 106, -139, 4, 137, -121, -58, 177, -19, -187, 79, 157, -127, -59, 143, -81, -82, 177, 27, -207, 24, 190, -87, -124, 148, -16, -148, 119, 100, -186, -51, 197, -36, -159, 123, 70, -175, 8, 145, -90, -87, 153, -41, -193, 119, 163, -138, -114, 108, -11, -44, 170, -24, -250, 50, 228, -46, -152, 44, -15, -45, 213, 51, -308, -73, 283, 58, -162, 8, -32, -111, 194, 179, -225, -204, 195, 130, -143, 25, 25, -170, 44, 221, -73, -215, 97, 132, -123, 39, 118, -165, -69, 164, 12, -130, 62, 80, -162]
7623a62J81J88k75r6K68m3j86K04M7l26J21L09j79k45K15J03k41J81J04l19NL31
7645A85n1l04J09K25k43M6K05k31j10K95M8l20M5K51j70m8J74j22j62K58J17l47
7667a50LK91j13j10J46k8k28K07K27l33j00L15p4j56J42P0k63P7L18k41k17K85
7689F8N4k38Q5J85k35n8L05j06k24K00J20k66NK59j41j53K23k3k04J50J70k54
7711g8r6L13p0j85J57L5k07Q8K53k32k03K90N8k28Q4J21k17j1L28j42k86K40J53
7734A65k27j3K06j71j25L11k0l01J29K01j83r0K33q0k06K24Q4k52M2K17j45j54
7756a55K59lk49J28J61k17k1K69j32k46K57J11k50RJ82j49r2K80l5l35J80K16
7778A68j74j16K01o8j75K55Q8l24J1K75j01j48J66Jk34K00J62k57o6K28k4j91
$$ y = [-162, 19, 207, -68, -164, 104, 61, -125, 79, 126, -200, -79, 230, 51, -194, 21, 124, -117, 64, 168, -151, -146, 185, 134, -170, -61, 164, -79, -33, 172, -59, -169, 126, 174, -146, -101, 150, -20, -68, 106, -16, -178, 80, 197, -150, -147, 144, 31, -79, 67, 39, -189, 18, 245, -88, -188, 127, 53, -103, 39, 109, -154, -77, 241, 0, -217, 68, 122, -116, -31, 154, -81, -139, 166, 60, -164, 36, 156, -110, -105, 154, 13, -140, 83, 60, -144, 6, 176, -78, -174, 139, 69, -116, 41, 76, -131, -43, 210, -22, -225, 65, 123, -105, -21, 100, -117, -128, 200, 58, -228, 12, 165, -62, -75, 131, -40, -165, 146, 126, -175, -46, 155, -28, -118, 115, 35, -171, 53, 137, -115, -73, 144, -1, -155, 104, 101, -148, -20, 141, -76, -97, 172, 40, -206, 51, 162, -88, -79, 103, -46, -138, 142, 107, -228, -48, 168, -6, -122, 79, 11, -164, 91, 179, -145, -134, 141, 40, -108, 58, 59, -175, 25, 187, -70, -136, 92, 68, -123]
7800a23J82M8k56R1K30j70j43K27Nk52J73J61k68k8K57q2j94J92J05l07P5K58
7822A81j80j28K08J2k60J71J80k71m2K42m5j90J48J07k68O5K48k00j05K05rk05
7844a36J39J63k54k7K46j06j46J73P9k74P0K72k13j11K12l0j94J42J98l01m7K93
7866A48j03j48J54O7k50N4L03k24j58K36k3j68J27J34k49n7L24j01k05J63N7j99
7888a18O7K36k16j58K93k7j94J14J20k12k3K92j46k13K53L6k04M3K06j62j47K79
7910A19n0k29J70J38k15p5K75o9k19K22L8k47Q1K25j51j94K44K7k29J79N7j96
7932i9k9K74o2k65K12O2k04J03J47j64j40K57J5k66J64J03k15J9K20p6k34K09
7954C1R8k67J13J81j93j22K32O5k78J30J36k35M2K14q7k40J62J83k56N4J66k02
$$ y = [-123, 59, 107, -149, -58, 172, 2, -141, 86, 91, -161, 12, 173, -95, -123, 134, 52, -142, 50, 155, -152, -77, 181, 1, -127, 81, 93, -167, 4, 184, -87, -129, 113, 68, -122, 26, 133, -135, -70, 178, -22, -127, 78, 69, -136, 3, 166, -88, -115, 131, 25, -121, 52, 131, -143, -73, 199, -14, -125, 87, 57, -137, 5, 203, -98, -145, 148, 45, -103, 51, 118, -132, -78, 225, 1, -157, 79, 56, -112, 15, 149, -100, -157, 167, 66, -139, 24, 81, -118, -51, 185, -31, -189, 104, 77, -117, -3, 117, -95, -118, 174, 28, -185, 68, 104, -100, -57, 149, -13, -160, 119, 69, -160, 10, 148, -67, -142, 133, 64, -155, 67, 105, -142, -61, 164, 13, -181, 63, 90, -139, 40, 97, -99, -128, 146, 84, -181, 31, 93, -111, -8, 139, -25, -165, 92, 107, -159, 5, 108, -107, -88, 132, 56, -178, 31, 129, -138, -25, 156, -37, -159, 73, 138, -140, -10, 126, -109, -67, 147, 60, -180, -18, 165, -91, -37, 129, -73]
7976g3m7K29J3k79J00K01k03J7J68j48j24K13J04l00L9K23j78l9J73m4k14J54
7998a5K10k91k9K59j27j33J50R5k38M7K43k24r2K44l4k04J07J77k05o1K58j54
8020a7j23K11M1k00j5K49j43j03K00q5j54J72J14k17p6K61o5j52J84l3j86J02
8042c5K37k09j81K70qj63J13P3j94j8K91j22k48K33O3j84L9J68j63j19K77k5k48
8065a53J48J15j70k4J96q1j89K15M9k24J08J37j56r8K25Kk46J44J18k06K9K00
8087A39j21j97K44R6k79N1J73j40n0J99m0k67J75K13k42o4J67m4j10J75L7k90
8109a75P7K65j33j51J28Oj18J50J02k81j2K70n2j64Q6L4j59J38J81k43j38K70
8131H1Nj55P7R1k13L2K70j50k14J70J13j76M4J83k21r7K70Kk12O6J22j57j3K52
$$ y = [-73, -120, 109, 122, -157, -57, 144, -59, -42, 126, -22, -146, 67, 171, -129, -90, 133, -45, -84, 89, 45, -169, -15, 195, -96, -125, 134, 7, -126, 24, 119, -119, -72, 171, -53, -145, 99, 65, -139, -32, 145, -60, -121, 137, -17, -140, 71, 112, -88, -103, 146, 3, -100, 100, 15, -139, 33, 147, -70, -146, 115, 50, -102, 82, 49, -137, -35, 202, -7, -188, 82, 74, -89, 24, 97, -97, -115, 176, 54, -194, 39, 102, -82, -43, 125, -38, -157, 120, 95, -153, -5, 110, -60, -84, 112, 31, -158, 57, 106, -118, -10, 127, -29, -127, 98, 100, -146, -2, 116, -90, -61, 139, 18, -179, 65, 161, -118, -67, 106, -34, -84, 115, 75, -192, -17, 196, -46, -110, 57, 13, -97, 78, 115, -175, -98, 167, 34, -117, 11, 17, -101, 49, 151, -130, -142, 128, 76, -88, -2, 32, -127, 11, 192, -51, -189, 81, 86, -69, 8, 99, -114, -82, 188, 38, -176, -6, 107, -69, -25, 158, -63, -160, 110, 112, -100, -34, 88, -69, -82, 170]
8155A70j39k01J91Q9j53J3J18j44n9K58m7k60J19J44j24j9J57j51j32K73M8k54
8177a03PJ96j09q9K20r5k13K04J41k11q3K11k8j57
$$ y = [170, 31, -170, 21, 110, -43, -30, 88, -56, -115, 143, 96, -164, -45, 99, -25, -44, 113, -38, -170, 103, 151, -103, -96, 100, -9, -98, 122, 27, -186, 18, 159, -52, -135, 76, 48, -109]
8191a09
$$ Imaginary data points
##PAGE= N=2
##DATA TABLE= (X++(I..I)), XYDATA
0@%%%%%%%qJ6j6J6k4L2l8M6n6P2q8J04j22J46j73K01k35K74l15L61m14M74n39
30b86O09o89P78q73R79j094J219j360J514j682J865k066K286k529K800l101L433
47A803l802M221m696N238n864O599p475Q533r848J1525j3735J6778k1112L3936
61B2101k48964K48298K8240p4297J05521j70860J80110k03849P1515K54266l05865
72i3784L1805Q7388l2816N7647q0051N2043m8845r355Q4805l1278m1891J7505
84f827K0609n7073R1784k4736j02634J42167p8572q999L3744n779P3822k04060
96a26554J39455J00637k25890J52743j2141n5473l993J6051J55577k37089K2395
107g4282J85356j39447J6767N928M7144p7048k6380J86095j59959k0702Q2652
$$ y = [0, 0, 0, 0, 0, 0, 0, 0, -8, 8, -8, 8, -16, 16, -22, 24, -32, 40, -48, 56, -66, 80, -93, 108, -127, 147, -168, 193, -221, 253, -286, 323, -366, 412, -461, 518, -576, 643, -717, 797, -885, 980, -1086, 1200, -1329, 1471, -1630, 1803, -1999, 2222, -2474, 2764, -3100, 3499, -3976, 4557, -5291, 6234, -7501, 9277, -11835, 22101, -226863, 21435, 49675, -24622, 80899, -89961, 90149, -113700, -42185, 212081, -93784, -61979, 25409, -7407, 50240, -29811, 22232, -26613, -35968, 48837, 17559, -24332, -6827, 13782, -43291, 48493, 23757, -78877, 63290, -15282, -24281, 9463, 3684, 77506, -126554, 12901, 113538, -112352, 40391, 28250, -27223, -31216, -15165, 140412, -96677, -74282, 111074, -28373, -11606, -5678, 41466, -35582, -61962, 124133, -35826, -56528, 26124]
118B6124j4756J9343j01328J19484m4075o3589J44173j39670M9032L4203n7384
129b8443P6006r8231O7779j3251l7053J23558j52812J2826J14375n3657k7420
140a6323j1169O2090n3484j1557J00398o4106q4202O4803J15973j27706m2594
151f7877J29325q1976N958K6306J8898k8219j05512J92581n5846j22598J44975
162E6015p7987K7431l180k1045P8434j33743R6333K0861j10885J18012o1709m316
174a5779L6195m1404M1816m3631M6979j2296p2447R4745k511n8598N388N1279
186B9736k8505m4350R2798l4777o8729M2526O0886k4944j00436J01979J2121r7783
198e9478Q9519m807m4973j6245M8734N3586j24996M5240N6556p5217M1154L060
$$ y = [26124, 11368, 30711, -70617, 48867, 4792, -58797, 85376, -54294, -5262, 28941, -28443, 47563, -50668, 17111, 3860, -33193, 90365, -62447, -49621, 64754, 11097, -16323, -27492, 34598, -18886, -30443, 69955, 5849, -78353, -13550, 102423, -25283, -67877, 61448, -20528, -14570, 11736, 30634, 2415, -103097, 89484, 33638, -88960, 56015, -21972, 5459, 2279, -18766, 59668, -74075, 22258, 43119, -67766, 50246, -11463, -15779, 20416, -20988, 20828, -22803, 24176, 11880, -60567, 34178, 31667, -26931, -21543, 29736, 1231, -43119, 49679, 14902, -53827, -11301, 49585, 24641, -75795, 26184, 38305, -59478, 30041, 25234, -19739, -35984, 12750, 66336, -58660, -13420, 43136, -32081, 9073, 12133]
210A2133q855k7607J5160N5438p2925K1080K2651l7883K8311Q13j70l4238L0988
223D896K5008p0090N4364J0894m9054J2092K2782J7704o7377L9987M4717r4634
235d8711M0507N0109l8532l7669K3631N7729p1287N726O3836o6972j1200N4673
247B1840J4388n9892p984O4821l8289r077L9520k5833k6931K1794M3240m4130
259f533j6022M1835l3183P820K7904j6579k5065O605M3536m0353m770M6491m8081
272a6395o743M1981J465l8155p50N1495m3944j7550O3751k4643m2695K6164L6377
285C0358l6815j8640N6372k9165l9362M9049J8217m1909j1270M3142j8808k5251
297b4082M8914j0075m3529J8338L2906j7415k0651L0138j7402k4749M6485M919
$$ y = [12133, 3278, -24329, -9169, 46269, -26656, -5576, 17075, -20808, 7503, 8316, 8146, -26092, 4896, 29904, -40186, 14178, 25072, -23982, -11890, 10892, 28596, -38781, 1206, 45923, -48711, -8204, 41905, 3373, -34296, -10665, 47064, -24223, -18497, 45339, -21633, -32833, 21840, 36228, -23664, -31648, 33173, -5116, -14193, 25327, -506, -27437, -5643, 37597, -6533, -22555, 19280, -13903, -6083, 21821, 5242, -19823, -13218, 30318, -10035, -14805, 31686, -16395, -23138, 18843, 20308, -17847, -18597, 32898, -11046, -28596, 35155, 10512, -32183, -6019, 30358, -6457, -25097, 31275, 2110, -37252, 11797, 30014, -11895, -23165, 19977, 1169, -24082, 24832, 14757, -28772, -10434, 22472, 5057, -15594, 14544, -2858, -27607, 18878, 23797]
309B3797m0350J7K8680j0819j3164L5908j9973m0883M0669K6199l5593j1683L0214
322A3019j4142k3059M6192K779n4862J3621M1634k1553k1743L3558o462m0221
334c1239L2909L0709m0723j3418L5427q453k5403L3099Q904m5257P786L7653j7883
347D111j8471K5838o420l0782K9879K5198l9291j0465L2429p986j7586K7272J68
360A3894m0251J6581L8087k7503k0781L0126l205k6245K4639J7665l7930l243
372a8166L9228j5637k7386L0630Q917l4916P865K8901k2098j3330L3187r070l5102
385b6977K6946K6603l1674j1565K6117r491j4091L2202j919m4194J3877L9766
397B5600j7883k2356J9165m557j8859L2142J3574m5672n644M0856l348k4344J6229
$$ y = [23797, -16553, -16536, 12144, 1325, -11839, 24069, 4096, -36787, 3882, 30081, -5512, -17195, 13019, -1123, -24182, 22010, 24789, -30073, -16452, 25182, 3629, -18114, 15444, 8982, -31239, 1670, 32379, -8344, -21762, 13665, 5212, -20191, 12908, 21812, -23445, -15659, 21994, 4111, -14360, 11478, 5058, -25724, 4155, 29353, -9938, -20403, 12026, 4040, -13546, 13726, 13894, -26357, -9776, 28311, 808, -19973, 10153, 6948, -19297, 5342, 23007, -14923, -18166, 21062, 5425, -21961, 8669, 17586, -17330, -9465, 19436, -2662, -15992, 17195, 8125, -26977, -31, 26572, -5102, -16667, 9450, -41, -14132, 18070, 16151, -28043, -14166, 25600, 7717, -14639, 4526, -31, -18890, 13252, 26826, -18846, -24490, 16366, 13018, -11326, 4903]
410D903J235k8207K1607K9403l2995j9810L1636M050k5024J6474J3784l3099K210
423a3833L3860j4992k1767K2829N871l0169J2733L0111k7460j6092K7261k269
435F083j8431J9192J0866l6403O48M1599j3725k6168J6898M714j7134J4981K1097
448B4217l5993j5118M3058N32k8132P681J0544j7226N330L0688k7089k7233L6484
461G743J0924k6163l70J7811j5003q398L4123j3744l1422K5730J6583k2014q981
474a3181K5053q209k1718K9970j436k7613J5203J7837j7464j7218L0298R25l0243
487a7796K1213N787j9651P497J8562j4171k6834L4551J0874l4526J1549R242j1791
500e494l82K2060p433l9829L3194K3088l3096O3J1018k491j1544K2783O346m6812
$$ y = [4903, 6138, -22069, -462, 28941, -4054, -23864, 7772, 11822, -13202, 3272, 17056, -16043, -13833, 20027, 5035, -16732, 6097, 11968, -18201, -5468, 24643, -2817, -18909, 8352, 6083, -12348, 6844, 17710, -18693, -18045, 23554, 9829, -16339, 559, 5273, -11861, 3120, 24217, -11776, -26894, 16164, 16696, -11436, -3755, 6789, -10437, -5107, 25581, -1508, -28741, 7743, 18667, -7496, -7866, 9945, -5058, -13456, 20667, 6923, -24499, 1231, 17814, -4200, -13181, 11872, 3663, -18055, 11915, 10479, -17134, -1931, 15906, -1558, -18776, 11522, 12447, -17796, 3417, 9204, -10447, -2950, 15612, 1441, -25393, 9158, 20032, -14494, -2945, 6297, -5494, -5876, 16184, 8751, -31078, 2116, 25204, -7892, -7829, 3189, 698, -10846, 11937, 18283, -28529]
514b8529K1166L0166k1882j0818Q799Q977k0701J6753J6838m0064R751K3877q646
527E687j5380N690J7643k6380J2222J7652l1442Q812J5294k340k0342O810K6832
540B0758l4250R708K0135k8229N214J4283P041l0840L186M0008l6801m37K4196
553A3972j5662p764O477K5291l3326q046M3763k7566r359J5321O226j0971j3716
566a5360L3950k3658r811L5409k2212p341J959J7518j387k3929K6282k1349j078
579a1007L4939k2355j2505j990K3485j679j7503K3251k9262l004L7222k035k6785
592i228j6323M1128j0138j5599L0277k8093r614J4370K8468j4480m7663N0644
604A3749p353k0734L2674k0694L85j6096K5387K0106n5739L6324k497k2666L1276
$$ y = [-28529, -7363, 22803, 921, -9897, -1098, 7879, -12822, 3931, 20769, -19295, -9544, 14333, 5687, -9693, -4003, 13640, -12740, -518, 17134, -14308, -5496, 9798, 7458, -12884, -6074, 20758, -13492, -3784, 16351, -11878, -6664, 7619, 14660, -16180, -12994, 27014, -9787, -10224, 13972, -1690, -9454, -2977, 22314, -11012, -19058, 24705, -2861, -12220, 3101, 9327, -1644, -15360, 18590, -5068, -14879, 20530, -1682, -9023, -7064, 10454, 9067, -14862, 11420, -9929, -11007, 23932, 1577, -10928, -12918, 10567, 8888, -8615, 14636, -14626, -17630, 19592, 17557, -9228, -25551, 15577, 5439, -10160, 20117, -7976, -17590, -3220, 25248, 10768, -36895, 13749, 6396, -14338, 18336, -2358, -1973, -18069, 7318, 27424, -28315, 8009, 5512, -17154, 14122]
617A4122j5499Q327j7470L664K3219l0950K6532n941k5431K2658L308p22j5011
630i194J3641k799j9816L3590k840k2713p351K8158O238m0336L6539n706l0330
643b2919K9097M184J492l8107K2349L5820n6590K7782R066k3617J1838n079K5864
656B1180l5848R45L9912l9768J3994J145l749Q223j5696K3534k6624R965K1038
669A8251l4335K3616j0004r45P157o906K1562m3816K3210K9734m5459J8355J877
682B297Q32r859q20L7714m8589l15M2347k1573j2469N934K1143k5307n855L5591
696B1071k0266j3129P369K1381j8963j4827M0058l1623J420J6079j4726K0068
708A3912l0231K1867J935k8041M7576m1034P052K5702l9998L4841j5203J938K870
$$ y = [14122, -1377, 6950, -10520, -6856, 16363, -14587, 11945, 6004, -19427, 3231, 6539, 5817, -9194, 4447, 1648, -18168, 15422, 12582, -10131, -17482, 10676, 16914, -23422, 13117, 7411, -22919, 6178, 10362, 11854, -26253, -3904, 31916, -24674, 3108, 12174, -11443, 395, -4684, 21180, -14668, -13723, 26189, -13579, 415, 1560, -2189, 6034, -9662, 13872, -12752, -2787, 18251, -16084, 7532, -2472, -3417, 3740, -3166, 18396, -25420, -2210, 27524, -17935, 420, 2297, 3129, -6730, -7550, 30164, -18425, -18740, 23607, 2034, -10435, -4501, 16642, -8665, -14520, 21071, 805, -12324, -4955, 16426, -2537, -17364, 22694, -8929, -7509, 8570, -6156, 13912, -16319, 5548, 7483, -20558, 27018, -14016, -6964, 18738, -21260, 13581, -1622, 316, 3186]
721C186k6756N4429l5603j7213M3765k7331J43L044J5724j1180k9603M5059m478
734A3186l0532J3271J8743j4990j9876L7810j0495k3885J7091O637K028k8496
746a9508K6068Q264l7829L5285j0393o824R567j5288K4958k3084Q165J1112k8274
759a7781L2789j7535o588J9826j4639O029j2952K2877n298k9960L7832r293j4194
772h887M400J3161K327l9294M0417O240m0118K3510M034J466k2256J2660K9327
785B6987n0551J8528K3246k3674K549k570J8126j7995n284K8160k3979J123Q205
798B871j548Q24o554R180j1473R452L586j5800J4873n779k2m307P560J0574l5367
813b1930K7140J0335l0684J5914K366O151k2692N125L6576m4595O257K7064k0348
$$ y = [3186, -23570, 30859, -4744, -21957, 21808, -5523, -5380, -2336, 13388, 2208, -27395, 17664, 13186, -17346, -4075, 14668, -322, -20198, 17612, 7117, -16768, 323, 6960, 8988, -19508, 6560, 14824, -23005, 12280, 1887, -4937, 4630, -10658, 14300, -8784, -619, 10493, -17781, 15008, -2527, -9115, 10711, -3928, 2101, -10851, 12026, 6728, -23232, 14600, 5307, -8887, -4487, 8674, 11001, -28293, 12124, 18364, -21754, 1756, 5790, 7256, -15000, -2340, 26987, -23564, -5036, 18210, -5464, -2915, -5485, 12641, -5354, -10638, 17522, -6457, -5334, 2871, 1323, 2147, -4407, 4773, -6700, 2752, 6338, -9462, 5411, -368, -390, -4697, 2863, 13437, -21930, 5210, 15545, -15139, 775, 3141, 9292, -13400, -8275, 28301, -16294, -10037, 17027, -3321]
826c321l188J764K3521k3546j6196L9504j6098j1304J0536K911o602r065K5531
839A4447j1331j5170J3934j861N430p288K616k963n762K1018j6369L96Q706j5559
853i756J1394K897K911j5806m272L1632k2262o355K0086j0519q432L529K3480
866A8527j9087k0520L3327n388j6875R102J1570j1648j6937K9873r99k4121J2465
879g11N876m906p589J3945P24k1618J6246M079p284K101l719L628m758J0018k254
894C778j4311J6006n449l918R313l840n370m977K0816o154k2687K2327J863j3807
908f410L522J0213m489j8889K3221Q017k9763Q114J7298p167j3128J0531P974
921I044j9803Q803J5333j5796r022J3567P734j4412K212O504r944N655O358m807
$$ y = [-3321, -6509, -4745, 18776, -4770, -20966, 18538, 2440, -8864, 1672, 4583, -2019, -11084, 14447, 3116, -12054, 1880, 19, 5449, -1839, 777, -2186, -7948, 13070, -3299, -2903, 5803, -9756, 1638, 4535, 7446, -8360, -12632, 19000, -3262, -9617, 10469, -50, -8482, -4953, 18527, -560, -21080, 12247, 6859, -10016, -914, 10656, -992, -17929, 11944, 10945, -13176, -711, 5165, 259, -7330, 6615, 7339, -14279, 1967, 6046, -1238, 863, -2856, 772, -3986, 6032, 3778, -10533, 5473, 24, -3894, 5419, 1579, -3791, -8768, 12048, 5894, -16793, 5534, 7397, -6410, -2888, 7325, 2836, -16053, 7168, 15185, -14578, -6464, 10834, 3667, -9461, 1070, 9044, -10759, -1956, 13377, -2419, -11441, 2126, 9860, -4552, -2340, 4164, -5780, -125, 6233, 1426]
935A426p733M172Q167r568O371J507j4794J0554P920p563o514O537N593j4942
949h867R608J2271k0801j746J7362j536j4367O963J1062j7624m99K0658p233j7542
963a2291R946J2433j3951j30J3058j1552p505J3611O758j4090m245J2995n729
976f92j825J0254r115o810Q980O024o806m072O492n335n70J2920p791j2289J1067
991D32P588j0841p17R424p568o534J4395K502j8353M189J6309j1667p089J3795
1005E865j947j2049O760J1187j2068o895J6237l231j2550J0658M630j1126L07
1018d222R662l973p415Q921J286j1227O596P819j0605j271Q855m130m604P688
1032C380Q11j1125M053J2093j0226o307J2265k914q479R004M353j2507j272J5105
$$ y = [1426, -6307, -2135, 6032, -3536, 2835, 4342, -10452, 102, 8022, 459, -6055, 482, 6075, -8867, 741, 13012, -7789, -9535, 7827, 6291, -8076, -1113, 9949, -7675, -8174, 12484, 5251, -12291, -2345, 10088, -3863, -3993, 9065, -2487, -9992, 3619, 10377, -3713, -7958, 5037, -692, -2517, 7737, -1378, -8188, 792, 6816, 10, -4062, 2430, -2905, -3475, 9445, 1654, -10635, 432, 8020, -2821, -3538, 5886, -1682, -8216, 6179, 8681, -9672, -5483, 10826, -841, -7930, 5865, 3918, -8131, -1371, 9816, -2252, -9147, 7090, 3859, -8691, 1967, 6597, -4529, -4222, 5440, 1467, -5948, 2973, 4259, -6968, -372, 7447, -3158, -4429, 4426, 296, -4308, 3380, 4191, -6934, -2881, 9212, -1014, -7321, 4944, 2030, -6449, 2555, 6908, -5599, -6871, 8234]
1046H234m362j2592J0324M119j1844M486R950r931o883J2661K146j2239M014Q217
1060F300r497j630J1836n364r215R233L680r195J405Q238o862n632J1920j131
1074D086j1120P588M826r261M82R751m930r739J0662M358j2408L876Q051q673
1088b451l339J1473q98j2934O725Q861r969j372R007m785p440J0510L899j3699
1102f412K352J0175n980m167P360r98r740Q253Q030j3190j258J0081k908n500
1116c902O065K269j1868N100J2041j1090n083R041L01o935M567O486j2940J3J4244
1131H309o327p680O024L466p800K166J0427j1426m941J2663j067p557K661N749
1145D667q563n75J3276q398p800Q962K489o444K17Q503r307m282J4729m299q899
$$ y = [8234, 3872, -8720, 1604, 5723, -6121, -1635, 8315, -1616, -8499, 4162, 6308, -5931, -1917, 6300, -3197, -4827, 7009, 1645, -7570, 1663, 5343, -3852, -2447, 5791, -1071, -6703, 5217, 4086, -7034, 554, 5380, -3881, -3399, 6352, 1422, -8317, 2345, 6703, -5705, -1829, 6222, -2451, -5790, 5683, 4785, -8149, -1424, 7437, -2532, -3904, 5103, 318, -7122, 3388, 7287, -6412, -4060, 6115, 135, -4032, 3328, 2330, -7410, 843, 8873, -4317, -5575, 4506, 1598, -3902, 2163, 4432, -7436, -2336, 9705, -1385, -6468, 2573, 2874, -4061, 506, 6992, -5948, -5935, 8309, 1982, -5698, 326, 3792, -4008, -1842, 8585, -2841, -7782, 4881, 3814, -3743, -1082, 4667, -3896, -4471, 8805, 407, -7393, 1569, 4058, -2386, -2169, 6334, -2973, -7255, 7474, 3175, -5724]
1160e724M637N334n728k845J2080q178q538J3478K65p909k31P711m214p013J4185
1175G310m655j1091R615L549n124m473Q874j858j0401J3481o21j0807M810N373
1189C982k412p520R559J13j1909J1032K156q445kO878j62j0463J0368J556j1881
1204g150P894L781m947n128Q289K676j3696J0667K909j0769M340M435j79j0293
1218g171Q242O654j6077R221M512q491L85L946N047j3501N771J0272j5366N470
1232a086N468m509l527K695Q821j3742K813J0593j1193J610M264N20o887J919
1246b241J0386j3135K306P956o858m47J978N403j0422J983J2117j4178K886O063
1260C797l569k388m68J1061j3708j50J5456j3728P11M658J159m397m441J6093
$$ y = [-5724, -1087, 4247, -1481, -4326, 7754, -424, -8962, 4516, 4781, -3128, -3359, 4352, 138, -6875, 7310, 2655, -8436, 1179, 4728, -396, -4869, 4005, 2147, -8254, 5227, 4606, -6201, -1391, 3982, 1570, -5950, 3609, 3722, -8187, 2845, 5001, -3444, -3446, 3432, 3270, -7193, 3175, 4731, -7150, 744, 4525, -422, -5550, 2739, 5415, -8281, 2386, 5295, -5474, -1134, 3301, 3122, -7171, 1071, 7725, -8352, 869, 5381, -3110, -2725, 1221, 6268, -7233, -1462, 8810, -6556, -1086, 4382, -127, -3654, -959, 7862, -5880, -3067, 7526, -3667, -2057, 2207, 2727, -4160, -2241, 8145, -4990, -2684, 5272, -1586, -2033, -55, 5348, -5074, -3091, 9026, -5152, -2266, 3797, 228, -2160, -2628, 8433, -5275, -5425, 10031, -3697, -2986, 1672, 2831, -1566, -6007, 10086]
1274A0086j2940m740J5496q350j824L93O320m285p972J6488r071n792R906k783
1288I32q07m263Q808m108p713J4319p749k995N071m46l89n614J1225o802o652
1303g183J4166p153k724K131M359l298q212J6657q233q554J2420k422k240n441
1317e727J1327k199j4954J9209m599q690N787O29M118j3065J1226L785j7760J5256
1331D343j646m612J698k177Q159j1562P014M768j4140J0911q77l256J233P6K806
1346B738q877R600J127j1091O833K752k303o417R712P17j5175J4009J443p832
1360b764n95L995O972j7609J1216Q995k0233J0170K741n47m631k927J5476j6893
1374f634L291J2817j4577M474m26L917j818o146J1256j0533K985P198r136L425
$$ y = [10086, -2854, -7594, 7902, -448, -2272, -1879, 4441, 156, -7816, 8672, -399, -6191, 3715, 932, 125, -4138, 4670, 562, -7151, 7168, -581, -3576, 1495, 1049, 660, -4954, 6271, -531, -7183, 6983, -170, -2894, -763, 3596, 298, -7914, 8743, 510, -8044, 4376, 1954, -286, -5727, 5600, 3401, -11553, 7656, 3057, -5633, 154, 783, 4901, -8164, 3062, 6847, -10913, 4343, 2697, -1915, -217, -2394, 5765, -5797, 1217, 5985, -8155, 2756, 1879, -1377, -144, -68, 2738, -6139, 3461, 4588, -6503, 330, 3082, 779, -5638, 4074, 4791, -10384, 3625, 5068, -2764, -3359, 636, 7608, -10001, 1215, 10210, -10023, 147, 2888, 2341, -2290, -5217, 10259, -6634, -3343, 9474, -5103, -629, -1055, 2862, 1044, -5102, 6154, -4379, -1394, 5804, -3332, 93]
1388I3j299L530l902P94P021j4127P702O585q014j129R51Q659j2102K533J3134
1403A0429j7328K452R363m13q038l639J6788j1397m532J4050q284m237K637J0010
1417G861o988j0171J4673m896k725M343j681k81o311J1843l185p862R559q651
1431d472N300K680m792K206o746J1281n412n022J3759j3860M19Q691l14l803q296
1446h381J4908n058r337J5266m783q977J712J2492k931j5039J2670Q27p948N255
1460F76M243l762j1670J3406N520j3381M837q09P11M15R74L412j1911O841M646
1475D148n847N404o667O9L904K088p14r253R487m94o798Q627j728n303k471J1493
1491E945j48j6007J2088L404r127J754N218J644j4316R733J0317j7452M231O671
$$ y = [93, -1206, 2324, -1578, -784, 6237, -7890, -188, 6397, -1617, -2746, -1795, 6864, -5238, -2705, 10429, -6899, -4447, 4916, 4503, -3535, -7174, 9614, -1783, -6315, 7735, -549, -4786, -2149, 7861, 873, -9298, 5375, 479, -2246, 2097, 416, 135, -6176, 5667, 2482, -5380, 4179, -4472, 828, 3508, -1284, 922, -5824, 5457, 45, -4977, 8782, -5078, -4659, 4032, 3718, -85, -8381, 6527, 1469, -7868, 7398, 2615, -6362, -4650, 7842, 4911, -10128, 2542, 3369, -4579, 676, 4919, 1157, -10513, 2893, 8413, -4968, -131, -940, -229, 186, 1160, 4572, -7339, -498, 4148, -1699, 3705, -2962, -2893, 1011, 3099, 2385, -6868, 2619, 2125, -4673, 3954, 2226, -3077, -5548, 5945, 5797, -10210, 1878, 5282, -3845, -2091, 3127, 4771, -9545, 188, 10505, -6947, -2716, 3955]
1505C955k379m754O37J0476j1977o99J1173p499n30J219J974j709k353O139n364
1520a691M87L216l825K710K51j367l323N229L308j0555M960M655n909o34N033
1535B545J988j2387N951J1848j2862k581P979J216p495J539J0665j2469k994J3585
1549F528k892p535j02Q884m304n490J0238n484m296N513J369q91n634N052L89
1564A345l738O294n666o38N152l273k3L93K432m106j572R229n808n690Q366J280
1580C977q204J307R447o362o900R049K967r199Q6J0686p219p092J2090l56q408
1595d131R08O808r11q139P808R10q967O830K258l939j556J299L329l683J928M43
1611A195n131N323J307m554J247K175k702j159O245k292p084N251N213o223l232
$$ y = [3955, 1576, -3178, -2541, 7935, -4042, -4741, 6432, -1067, -1597, -378, 1596, -113, -2466, 3673, -1691, -1204, 2012, -1813, 897, 1148, -219, -3542, 1687, 4995, -5560, -600, 4055, -1854, -2488, 2545, 4533, -7854, -1903, 9945, -2917, -5498, 2481, 3697, -3798, -2259, 8406, -4063, -7057, 6528, 3636, -3899, -4001, 4883, 579, -4911, 5327, -157, -4453, 1060, 2429, 1538, -4096, 956, 1345, -2393, 3901, -1765, -2403, 2749, -524, -547, -154, 2278, -1828, -3400, 5829, 21, -5669, 2697, 3977, -4227, -2920, 6527, 165, -6735, 2314, 5281, -3918, -3832, 6854, -365, -7457, 4633, 4277, -4131, -3223, 3585, 2674, -5465, 2343, 3253, -5714, 1116, 3374, -565, -2121, -822, 2507, -1176, 752, 1195, -3936, 1387, 2694, -1860, -613, 1562, -1140, -2299, 3946, 1654, -5430, -179, 5034, -1189, -4421]
1626d421Q665k338q637Q752L730r157q53P966m88r021O396N605j0992J317Q583
1641E107l588n408L540L731n707N05O239m807l704N389R20l505J686K24l171K816
1657B67K607l199k188L403L73m130N116Q98q402M123N950m829l661M734K341p631
1673d228K916P871q671l252R102p21p056K989N779o071l292Q231p05p393M359
1688a42M053o353K03N688k647l729K783K385l567O39L753n171l48N640k867j966
1704a646K575n42k724K393M296n931k745P467j605m814M900J194o704J384P627
1719E125l514o621N306L338o650J839O312o648l479P513R45n717L69M743l769
1734i08k286P229k592n642M551J768k953M3K851k456l012N742r6n157L220J605
$$ y = [-4421, 4244, 1906, -6731, 2021, 5751, -3406, -4259, 3707, 3219, -5802, 594, 6199, -4793, -3476, 5107, 1519, -3889, -349, 3382, -2325, -1820, 4419, -388, -4092, 1297, 2217, -1288, 398, 622, -2549, 267, 2874, -325, -2513, 890, 1263, -2867, 2249, 3147, -5255, -1132, 4818, -11, -3672, 1062, 3403, -4228, -1312, 6559, -2112, -5364, 3738, 3017, -4039, -1050, 4729, -1342, -4634, 3597, 2892, -4501, -142, 3911, -2442, -2239, 3449, 802, -2927, -144, 2241, -1326, -687, 3066, -2105, -2453, 3187, 320, -1646, 929, 387, -2337, 56, 4352, -1579, -4324, 3143, 1538, -3276, 1624, 2818, -3886, -2502, 5125, 1611, -5010, 296, 3634, -3016, -1177, 5135, -1513, -4992, 2521, 3466, -2251, -1882, 2861, -908, -3194, 4035, 1443, -4199, 352, 2120, -833, -790, 2061, -395, -3407, 2335, 2239, -2918, 302, 1907]
1750A907m157J129M778l499m109N233J232n006J966M177n311k470P894j335o381
1765c952L891K816m249r25O011k110o652O357K369o242J788L519k801l173M961
1780A608J489o400L043L001m898O73M466j831m751L768K391m651K397K439m817
1795b073j233O143N03o864K790K903m461K376L560l972m692N675M414p365P45
1810a551L689m131O31M586r59o866K861O366n554o14L551k821j727L952K391o894
1826c090P49N909m494o24L533j044l758K037M983o168j85N675m525j548L855J701
1842C006n033p00O483m786j219N720l320l521K818M844m781l133O251k921j749
1857b041M533q81m608N01O990l823m135N217j887j455K799J362m456k090Q228
$$ y = [1907, -2250, -1121, 3657, 158, -3951, 1282, 2514, -2492, -526, 3651, -1660, -4130, 3764, 2429, -3952, -61, 2755, -1494, -2419, 3592, 1482, -5170, 1187, 3556, -2686, -898, 2621, -180, -3353, 1608, 3097, -3303, -260, 2741, -2157, -1484, 2982, 1151, -3600, 168, 2559, -2092, 305, 2744, -2073, -3306, 2837, 3340, -3524, -734, 2169, -2292, 84, 3644, -328, -5020, 655, 5069, -2296, -1551, 2138, -1993, -1362, 3224, 2265, -4601, -1740, 4626, -928, -1542, 2009, -812, -2539, 1413, 3804, -3090, -2341, 3568, -926, -1550, 1983, 939, -2819, -782, 4201, -1967, -2152, 3523, -1002, -2550, 1305, 3006, -2027, -2727, 3756, -1030, -2249, 3471, 151, -3370, -552, 4292, -489, -3622, 2629, -292, -2041, 2492, 1611, -2997, -2496, 4494, 671, -3464, 1753, -134, -1589, 1210, 2572, -1884, -3974, 4254]
1872D254l024m538M845j285j615R67L506l402m562Q440j841n151M319M82k031
1887f36j713N047j340n911P097n06n105K543K918j350m801N211N65n368N229o
1903A874m144K9M805K94o946M537J110l945M080J00k928k649N820K136q126M091
1919A38J084l242L011P66j225n144N625L834q575L412J905k729P57J382J113o499
1935d387M513M804q077J725K997p65k087J065K976o593L539M921o470n90K778
1950C49K225l867M32L847o574K937M412l815k193R94M491m772N51M686o797J837
1966a257L275r07k220o16N269o141P40O469n946j17J241J342j667p09O075p952
1982c121r28Q007k621j642j575K513j708l99P857p770m202O469J930j121l761
$$ y = [4254, 1230, -3308, 1537, 252, -1363, -396, 3110, -292, -4854, 3586, 1745, -3406, 913, 1395, -636, -2349, 2698, 1358, -4553, 2544, 2038, -3067, -524, 2394, 1044, -3757, 1454, 2019, -3349, 1880, 1874, -2270, -2241, 2564, 2858, -4088, 449, 1559, -2386, 1694, 1794, -1134, -3783, 2037, 4173, -3953, 138, 1222, -2020, 991, 1757, 532, -4612, 1013, 4847, -3728, -316, 1589, -1140, -383, 999, 2112, -4387, 126, 4930, -3147, -1422, 1575, 810, -1277, -212, 2764, -3829, -290, 4631, -1839, -2429, 349, 2574, -1293, -861, 2986, -3588, -651, 3761, -54, -2247, -1253, 3238, -1534, -983, 3703, -3094, -1257, 2018, 1111, -1109, -1725, 3544, -2597, -1857, 4612, -1334, -1451, -210, 1132, -535, -1244, 4831, -3121, -4049, 3958, 1337, -305, -1880, 633, -1075, -1474, 6383, -1387, -5589, 880, 2810, 1689, -2072]
1997b072K615k474o38Q574m649n548J817M369M61l757L136m164j104P423j777
2012B212l360k008M176K40l159N845n259k474N872p19q82l008M420j278n125Q740
2028D233l024m361L489L89ql607N820p12q112P318J423l663l76J602P87m821N862
2045B239J144p265K792K662r4l180J902J488n232N146O02m100J311P72J574l960
2061b199K704J739n838N412l64l711J877J665R59o063L837L337o539M069J301
2076B186l820j154M402L074q797K204N144m408P59J859k44n189L159O634p775
2091a966m39L475r35r6m60L055n113J24O387m958L30R61j027P92p09L111m273
2108a741J38M694n048J390K468j680k156J022M602n540j7N329m472j615L630K714
$$ y = [-2072, 543, -1931, -2569, 6005, 1356, -4192, -2375, 1994, 2455, -1302, 1834, -2330, -3434, 3989, 2212, -1148, -3156, 1020, 1260, -1899, 3946, -1313, -3787, 2085, 1366, 484, -2524, 1896, 618, -4507, 4233, 1209, -3152, 337, 726, 718, -2889, 2931, 2219, -5893, 1425, 2848, -815, -1191, 411, 1198, -3623, 2239, 3383, -3882, -1090, 1572, 1478, -1702, 200, 1688, -3544, 1602, 2204, -1896, -585, 187, 1761, -2199, 505, 2244, -3594, 1818, 1454, -2257, -380, 1285, 2244, -3819, 18, 3355, -3184, 885, 2186, -1634, -2788, 1614, 4688, -4109, -1905, 3239, -1169, -410, 1449, 1205, -3984, -825, 5809, -1966, -2405, 1070, 135, 39, -421, 2634, -2479, -2355, 4032, -926, -596, 365, -662, 130, -579, 2532, -1741, -1603, 3091, -1957, -567, 1901, 221, -1935, -913, 3689, -1851, -1868, 3461, -1011, -2626, 1004, 3718]
2124C718n929j294P684m361k334M345n03l434k85O927l968m979O255q14j965P30
2140b07J479j290l091N603j108l588K832r49M10J9Q04j283j851M785k828j419
2156a682L642k288r83Q07L415l377l385P404k940l840M499Q41l049k627O651n93
2172B495p274N959J494m853O63L840l93n970L957L627n294O65K688j507k153K787
2188G31J551l898Q76J312o18K84L07n15k089L314q9l084L609j718k074K359J874
2205B132j264m855N239J542o427M564J773m445j025M353K265p504K139N491n839
2220a861k14M612p70m804J403N335m121j797M064j370k701K097K841l163j204
2235a653K219j003O99R55j085j650P90K290j966J138L73m337K585L816j934l847
$$ y = [3718, -2211, -3505, 4179, -182, -2516, 1829, 1326, -2108, -2393, 4534, 566, -4413, 1842, 1028, -937, -207, 1272, -18, -3109, 2494, 1386, -2202, 630, -319, 91, 110, 914, -369, -2220, 2565, -263, -1682, 1960, -328, -1311, -504, 2911, -466, -3851, 3553, 613, -3227, 1272, 2113, -936, -3563, 3088, 2495, -4779, 1180, 2674, -2179, -1516, 2324, 1931, -4039, -82, 3545, -1749, -1084, 1604, 97, -2056, 731, 2282, -1616, -740, 572, -46, 238, 545, 30, -2059, 1255, 1166, -1918, 1691, -27, -2101, 258, 2132, 868, -3987, 1252, 2794, -3633, 931, 2704, -1741, -2766, 1587, 3852, -3652, -1513, 3978, -1861, -2075, 2537, 1767, -3037, -1634, 3701, -420, -2217, 1847, 477, -2224, -127, 2714, -449, -1653, 566, -437, 262, 1217, 132, -1518, -728, 1562, -404, 734, 1107, -3230, -645, 3171, 1237, -2610]
2251b610J528L385l906J360M074n509k512N753K783o079j308N605k797k137M833
2266B463j72n509O05O382k628l981L800j67k422J288K532j795k930L218lj625
2282i44K232j156j272Q03Q94k94l93J386k644p45M696r43l877J547K498k791k91
2299a294M403k756m405M351L633m982k019N538j575m030M236J605m430p31M940
2314B484r72m870M029J990m364L10K479k47j729J276L51k886K216K169k421p67
2330i52L78K1J190J605k553l017L533K400k751o50J476k064m54N317j198o326
2346d045K210M852k026k965L018r5m429L995L601n297k034M295R82l756J397K698
2362B401l987m06L931q08k434J093J044k040Q76K326k109j303J403J84k44J468
$$ y = [-2610, -1082, 2303, -1603, -243, 3831, -1678, -4190, 1563, 4346, -1733, -3041, 2564, -233, -2370, 2463, 2291, -3218, -2613, 3769, 1141, -2840, 960, 793, -1629, -341, 2191, 396, -2534, 684, 681, -944, 1288, 132, -1140, -337, 557, 263, -130, 1256, -1388, -2133, 2563, 1620, -2257, -710, 1788, -1003, -1294, 3109, 353, -4052, 299, 3932, -1050, -3069, 2469, 894, -3136, 1100, 2705, -1725, -2456, 2484, 1512, -3358, 671, 2661, -1703, -1393, 1086, 839, -890, 386, 737, -2149, 67, 2236, -185, -952, -574, -553, 637, 2242, -311, -3328, 205, 2605, -146, -796, 680, -1384, -1838, 3479, 2281, -4045, -1835, 3017, 991, -1974, 1044, 949, -3480, 515, 4116, -1181, -3215, 1080, 2062, -1694, -297, 2401, -1586, -1992, 1939, 1131, -1303, -210, 834, -1206, -330, 1996, -113, -1416, -13, 171, -73, 1395]
2378A395r89l183K497K907k598j329J604m44j414L324Q76n864Q48N453j634l528
2394b079J822J637l153J348L866m228k739M728J582m076k99L225j867j161L017
2409A623r08k706J748K281k505r68K573j026q80J475n91j147J310J289k785j55
2425a372L331j859j427K132m27j857J669K388l885j530N067n12l651J434J902
2440A403k341j15L723k526l556L954K331l525j306L004p81j623L016q22l097J646
2456f15K664j574k289K334m3j682K397n47k215J213J904j427j909K821j65k524
2472a657K336L79k479P30K822j856l103L680J193l446P93J879j762j168L594m37
2488A498m486K599K633k463j001J883p3k505K691J301l999J107K272j354j272
$$ y = [1395, 406, -2777, -280, 2627, 29, -1300, 304, -140, -1554, 1770, 2646, -3218, -2370, 3083, 1449, -2079, -257, 1380, -1773, -425, 3441, -787, -3526, 1202, 2784, -1292, -1591, 1634, -233, -1394, 1623, 715, -1991, -243, 2038, -467, -1435, 1138, 112, -768, 707, 116, -1031, 279, 1568, -1217, -1372, 1959, 100, -1327, 805, 378, -1479, 190, 2578, -1307, -2837, 2230, 1718, -1933, -499, 1403, -938, -1053, 2670, 144, -3412, 542, 2873, -652, -1958, 1046, 265, -1358, 1658, 836, -2261, -615, 2049, 475, -1814, 520, 477, -1205, 1192, 645, -1570, -357, 1547, 120, -1789, 1032, 867, -1657, 679, 1058, -1421, -691, 2131, 275, -2828, 852, 2045, -1401, -608, 1271, -491, -1659, 1935, 1498, -2988, -389, 2244, -219, -1220, 663, 590, -1915, 776, 2077, -1922, -815, 1457, 103, -1169]
2503a169J620Q45k950J480J771k797Q47J875j638j930K436J851l354L87J644k019
2519a101O05K656j154m153K235L780k886o77J143j427l30L011J115n303M1M409
2535A964j287p79O27r98j544K212L208m199j544L104o27k83J096j16k846O48M029
2552B665k527j443K149j107j048J669K016l245j323L677j442r26K241o05k681
2567a930M90M077j972k478K553r77r73K109J149l044j664M247n00k104J788p52
2583A9j446J050K688k050k684L364l89j626J814J84j800o91L272r91k675L134
2599A173m64k243J193J875j130k343K984l95k688L078N25k520p92K699L88k920
2615a580K452j79k840K254J731j382k464K037J246k670K382K33l002Q50K141R9
$$ y = [-1169, 451, 1296, -1654, -174, 1597, -1200, -353, 1522, -116, -2046, 390, 2241, -1113, -726, 918, -1101, -496, 2160, 1006, -3147, -912, 2868, -18, -695, 448, -979, -1309, 1702, 2817, -2486, -2445, 1964, 677, -102, 525, -473, -2017, 195, 3403, -796, -2340, 764, 137, -146, 950, 834, -2012, -1364, 2665, 138, -1305, 844, -263, -1311, 358, 2374, -871, -2194, 1483, 41, -885, 1356, 751, -1930, -1440, 2637, 665, -1813, 740, -237, -1210, 899, 2048, -996, -2660, 1587, 1087, -1017, 771, 19, -1427, -377, 2311, 261, -2423, 941, 552, -1074, 740, 924, -876, -1567, 1705, 714, -1961, 1173, 709, -1534, -341, 1534, 404, -1939, 1045, 650, -2038, 1040, 1565, -955, -1747, 952, 1340, -1580, 872, 693, -2147, 107, 1838, 456, -2008, 29, 1275, -1395, 987, 1220, -1782, -932, 1209, 1308]
2631A308k769J412J031k752K307J268k522q35K028R08k713J678J042l233J262
2646e80K197r80k232J569J468l144J810J830k894m11J933Q75k705R80K053l500
2662a731J099K381j549j390Q09J856k569O18K552l296J9K173j55j570J46K053
2678A446k626L96K861k473r15J539Q82j782mK447k863j55K960j351j533Q14J800
2695A443k148m03L129k497j078K518L8j941J5K720k222j203L284j327j638J296
2711a4J298j796r38L345j832j866K713j82j306r8J814j225j647L513j264k220
2727a705J983M53p83p40J789r73j905L429n30k539J210J190q13j048K242j025
2743B35k359L049N99k453j90K253p55k085L032l89k811J762J478j244j741K594
$$ y = [1308, -1461, -49, 982, -1770, 537, 1805, -717, -1552, 476, 1384, -1329, 349, 1391, -1842, -580, 1617, 637, -1595, -26, 1442, -1702, 108, 1938, -956, -1367, 566, 1441, -1264, -284, 1769, -1731, -632, 1749, 200, -1190, -381, 1475, -1094, -476, 2076, -1220, -1201, 972, 817, -753, -607, 1446, -1180, -784, 2077, -396, -1311, 228, 1110, -672, -676, 1771, -1092, -1247, 1713, 362, -1171, -357, 1443, -705, -1108, 2021, -476, -1554, 964, 1002, -939, -924, 1796, -426, -1629, 1655, 328, -1310, -14, 1284, -512, -1450, 1895, 63, -1803, 910, 728, -578, -676, 1138, -87, -1734, 1779, 515, -1705, 278, 731, -52, -792, 997, 24, -1881, 1548, 1018, -1521, -311, 879, 66, -982, 1260, 235, -2124, 925, 1524, -929, -1119, 1134, 379, -1706, 1326, 937, -1874, -112, 1366, 122, -1619, 975]
2759I75J86l390K727J015k328K11J064P4j947K084J078l700J338J755j031k93
2775a82L65j72j597K341J319l358J56J625k44l83J086o87k810K808K242k969q59
2792a319J476L00j445J973Q11m261J296L273j495j797J052J177k490J144K745
2807B440l142r83K254L61j593M48J708k660p2K703j013r40K46M88r90P22K018
2824A995k927m51K169o78qL04j45j776R41L205k961j519K651m17j149J080J086
2841A400k654m72L861j217k956J946J702k370l51K686j569j514K263M27k267j36
2857a221L019j292k148K172m18n18J123l44j026o05K420j45k094J448r02l43K314
2874A440n04k049l34K584k79j955J923n28k211K035K184k545k008L105K67k508
$$ y = [975, 1161, -2229, 498, 1513, -815, -604, 460, 534, -1413, 671, 1749, -1951, -613, 1142, 111, -182, 183, 11, -1586, 755, 2074, -1284, -1128, 497, 253, -130, 956, 269, -2541, 267, 2509, -460, -1319, 157, 457, -988, 985, 1796, -2465, -1169, 2104, 609, -1188, -136, 1041, -1449, -305, 2440, -702, -1685, 569, 930, -663, -215, 1493, -1167, -1239, 1464, 451, -489, -243, 245, -745, -23, 1995, -932, -1383, 786, 108, 100, 404, 259, -1517, -576, 2629, -332, -1851, 800, 383, -766, 314, 1400, -1254, -1726, 2135, 918, -2038, -92, 1610, -760, -1111, 1575, 6, -1508, 755, 1182, -1085, -1221, 1798, 506, -1642, 530, 112, -406, 717, 373, -653, -1258, 1162, 1017, -1077, 371, -531, -874, 1440, 936, -1113, -1447, 1137, 858, -1097, 826, 298, -1913, 122, 2306, -239, -2247, 858, 1125, -1383]
2890a383J582J440k487j187L470J40l311J712J069k069L50K083m30k846J253J938
2906A324j587M70L16j553K23J749K35j874J07N31m13J479J59k391l57K803Ok349
2924a122J359J90j861J508J947j931k678K979J869l628P16K115k030p98K319O58
2940A612l316N91L204k280j281K320m6j827N79J598j404n78J625o40j041J077
2956A93N60j205K35O47j097P90Q88j537m81J582L98k017Q29J531k442L64K546
2973A784j537k168J922K068k834p61L110j290j992K346R35k878m4L170j241k312
2989a722J923J010j914J4J867j228j148J917j35j308N44O63n26l61R26p72l39
3006e89J579j045r69J500K58j421K33J603j521r53K675n01k612J406K172k089
$$ y = [-1383, 199, 1639, -848, -2035, 1435, 1575, -1736, -24, 1045, -1024, -674, 1409, 979, -1867, -614, 1324, -263, 207, 523, -1030, -807, 942, 1177, -697, -590, -59, -472, 1007, 1166, -1225, -1582, 1221, 1227, -1122, 237, 427, -1434, 74, 2021, 90, -2588, 391, 2260, -1368, -652, 1463, -567, -1365, 954, 1612, -1704, -1113, 2091, -189, -1470, 850, 804, -1023, -444, 1154, -250, -828, 797, 157, -884, 193, 753, -452, -217, 430, -667, 123, 1011, -526, -1007, 575, 973, -1044, -215, 1316, -1126, -762, 1784, 247, -1921, 1, 2069, -765, -1526, 1584, 294, -1698, 648, 1583, -1295, -1339, 1831, 590, -1722, 201, 1211, -703, -689, 1178, -50, -1198, 719, 584, -724, -180, 483, -43, -404, 522, -250, -589, 990, -55, -1024, 476, 734, -687, -454, 1149, -372, -1325, 1350, 849, -1763, -357, 1815, -274]
3022b74j322K725l23k493J754J736k509r65K993k96k631J555J341j853l60J841
3038I19l88j748J464O49j661M90R40o46m65O70j50o26J237k60j562J120R37j220
3056c00k27J333r22j306K392M54k828L41K399r51j691K027K38k742J403K395j981
3073C4j866K168Q98k293Q90J588k154n57K187J83j932L89J221j282K30J337j111
3090g0p97R61L68p04M83K16j462O95J463j132q50J233r1j434J552J048k505k34
3108a260K337l18j903J251J135k539M37K660j487j897J583J207j888M3K058j642
3124b23j244K098L80j653J34J239j046l76J632o42j202Q79N21q53L19Q66j429
3141f00j76J666n96r67Q92L49j499N38K003j807j210K057K7j503P55J328j908
$$ y = [-274, -1596, 1129, 806, -1687, 67, 1803, -706, -1671, 1322, 1026, -1605, -50, 1291, -562, -922, 919, 531, -1217, 247, 896, -765, -275, 665, 19, -446, 224, 74, -552, 685, 425, -1137, -17, 920, -300, -527, 806, -116, -1422, 970, 1424, -1404, -1063, 1336, 385, -1306, 721, 959, -1783, -380, 2015, 34, -1832, 336, 1234, -1059, -169, 1419, -735, -1292, 895, 1078, -854, -465, 756, -526, -296, 1041, -70, -867, 94, 462, -242, 241, 457, -1005, -310, 1153, 21, -829, 404, 313, -1121, 431, 1479, -1026, -1260, 1077, 759, -1144, 107, 1242, -1297, -860, 1800, 313, -1584, -1, 1206, -682, -639, 1419, -223, -1467, 631, 1011, -642, -508, 731, -315, -691, 941, 299, -903, -24, 497, -356, -37, 829, -600, -776, 890, 294, -673, 219, 568, -931, -393, 1610, -197, -1407, 650, 677, -826, -71, 1257, -651]
3158f51q59K839l74k259J104J084j389j76J972r97j943J809R96j535j28J097q22
3175b32o31J775k62j683Q25Q12p62r7R61q85r23J870n1j612P99P90j108k94J747
3194A039o86j774J794O52j802K59J553r09j501J988M92k217Q40J293j279o85J662
3211G19J30k106J111J272j639K7J200n73j051J188O54j774N02J218j184k63J196
3228F27l13j259J105P57j696L70J367j018q87J411L34j803R08J197j740j15J638
3245H83l29j659R41J328j840J67J562j261p57J387N43j736J29J648j242l80J416
3262H00o28j078R38J021j541k25J578r50o11J272j00j317N41J446j484n33J724
3279H53o47j062J040O80j466j03J807j154j002J676lj400L87J381j135p35J703
$$ y = [-651, -1510, 1329, 955, -1304, -200, 884, -505, -681, 1291, 294, -1649, 160, 1156, -379, -507, 590, -232, -863, 912, 650, -1033, -208, 604, -158, -255, 706, -179, -1102, 768, 717, -895, -96, 694, -414, -708, 1039, 353, -1421, 373, 1025, -777, -518, 1035, 126, -1375, 613, 1105, -1112, -272, 1021, -258, -943, 719, 849, -1257, -146, 1126, -513, -486, 714, 141, -910, 278, 932, -842, -340, 878, -306, -569, 627, 314, -945, 160, 917, -779, -409, 958, -60, -947, 464, 798, -1005, -97, 1100, -640, -755, 883, 554, -1105, -164, 1164, -676, -509, 1053, -208, -965, 422, 965, -771, -642, 1006, -236, -616, 800, 172, -906, 32, 1053, -488, -713, 865, -85, -696, 576, 476, -841, -300, 1146, -338, -871, 853, 206, -856, 184, 864, -602, -705, 1102, -52, -1054, 622, 619, -781, -394, 987, -148, -883, 820]
3296H20o20j177J243O27j346l55J609n98r75J416l86j175Q94J052j129r32J610
3313E78k31j093J310m7j413M08J605p93j454J469J31j264J022O71j408n42J864
3330H13r1j667J080M41j248L86J248p67j392J476M83j507Q67N40j154k28J366
3347F46P3j657R17O21j350P75R02j118q64J347O29j567N79O98j384L37J471o46
3365D09j633J116J081j440K83R11j117m94J586K97k021N53J371j177q2R67n07
3382A03j061J098J004j823O0J395q64l89Q63J9j195N86J318j545k99J400n19p17
3400e66P51M53j355K86J548j287o71J309n1j049N44J028j501k55J807p35j071
3417h15R34M96j156R4J564j250r70J649N5j139L70Q39j084l34J795o77j374R89
$$ y = [820, 200, -977, 266, 893, -453, -808, 801, 203, -772, 644, 258, -917, -23, 1029, -100, -1032, 578, 347, -746, 564, 517, -896, -488, 1117, 324, -1130, 339, 470, -794, 228, 899, -509, -1051, 813, 722, -945, 135, 576, -672, -286, 962, 195, -1197, 279, 762, -745, 122, 662, -492, -720, 646, 719, -938, -21, 600, -750, 25, 927, -191, -1055, 292, 921, -646, -67, 631, -753, -416, 1055, 409, -1224, -108, 973, -467, -184, 727, -390, -884, 702, 999, -1022, -469, 902, -275, -357, 610, 103, -958, 140, 1144, -679, -619, 776, -88, -477, 386, 405, -790, -204, 1114, -431, -730, 670, 151, -566, 185, 638, -717, -431, 1117, -170, -841, 468, 417, -632, -88, 940, -561, -816, 991, 256, -815, 119, 615, -541, -447, 1117, -133, -1103, 546, 601, -538, -168, 671, -413, -747, 1048, 371, -1003, -14]
3435a4O27q36n7J046j057p20J784r7j333L24P70n97k44J318r35j172J569M12j161
3454c73l4Q58n94n78J621m36j616J065R12r54m45J182m78j181J583L37j625K46
3472e10J213n40r53J296N9j597J019R09j135m03J077m8j204J031N86j513L68J020
3490F75o38o06Q66J60j192P60P64j223o1J067m02q91J055K71j420O90R39j001
3508a87n18J171Q7j493R89R18j662J77J290n52j071Q96Q86j621K07J472j151o10
3526g72J190J64j216L26J136j059l79J189l55q57P32N29j092J66R55q61k43Q64
3544D17j46q38N30P79j259Q4J295j033n33J138P1j144L02J311j234o36J705l92
3562D17j347Q92R76j312l75J546n16j206J060O94j326j25J433p39q45J168m2q19
$$ y = [-14, 613, -223, -280, 766, -291, -1011, 773, 676, -657, -333, 437, -160, -404, 914, -21, -1193, 376, 788, -373, -407, 451, -143, -721, 900, 464, -1152, -87, 825, -129, -574, 608, 130, -1051, 532, 869, -756, -510, 703, 163, -790, 506, 565, -1032, -13, 896, -239, -642, 435, 387, -817, 214, 800, -713, -345, 675, 37, -569, 297, 457, -735, 25, 789, -434, -495, 572, 170, -721, 334, 605, -815, -125, 814, -187, -705, 466, 553, -940, 49, 967, -695, -518, 772, 220, -851, 45, 931, -690, -483, 989, -162, -772, 418, 582, -634, -308, 828, -231, -610, 579, 224, -633, 99, 628, -464, -298, 657, -204, -447, 417, 271, -567, -37, 742, -517, -433, 862, -171, -704, 434, 505, -639, -337, 974, -260, -896, 809, 417, -930, -38, 938, -374, -749, 797, 281, -925, 135, 829, -497, -622, 811, 72, -773, 395, 353, -466]
3580d66K90P08n73n74J127l57p85J020j15p56M73N11o62l89J122l30j072J134
3598C06L91j370K65J331r26r19J416J73j443M32J333j071r87J765n1j602Q78Q55
3616G76r79m76J169N2j424Q83Q17j296J53P96m66m04N82J63p94L80N86q35M4P96
3636E23o53m12J070k50j012P94O22r97k94J289l35j416J371O76j797L11J366o48
3654B08j081J014P96j712K40J652j162q61J265K53j115J91R81p82n28J096n6r99
3672f00N70M74p50K33M58o45m4O30j30o63N21M53j106M51J013j223l28J238q8
3691D64j160M86J117j270m79J758n09j479J089R46j341l49J418l46j226R87P76
3708H82j407j14J365n60p69P80J50o59J48P07n58m81Q88k54m65O90k67n59N74
$$ y = [-466, -176, 532, -41, -615, 512, 155, -630, 390, 275, -481, -8, 503, -159, -548, 574, 244, -828, 306, 697, -673, -408, 923, -3, -922, 494, 667, -776, -344, 989, -82, -1069, 696, 645, -957, -79, 776, -203, -679, 490, 542, -882, 1, 818, -478, -325, 471, 5, -399, 183, 346, -448, -68, 518, -317, -273, 523, -130, -542, 528, 278, -734, 60, 682, -315, -609, 680, 345, -1071, 300, 976, -821, -510, 856, 208, -873, 141, 937, -775, -535, 1117, -45, -906, 359, 612, -503, -312, 669, -113, -641, 455, 399, -600, -30, 444, -306, -73, 385, -260, -304, 326, 196, -467, 54, 507, -599, -148, 865, -358, -686, 552, 464, -696, -210, 907, -363, -842, 916, 407, -1072, 17, 963, -378, -727, 691, 345, -881, 106, 882, -525, -639, 726, 166, -603, 177, 327, -332, -184, 523, -35, -516, 372, 118, -347, 343, 76, -483, 91]
3727I1M33p47k50R77m03p91J136J42j419M53J337r21r13J246J84j325N68J221
3745A019j260q42J714P0j452N75Q21q76l59J193j64j285P72P66r17j2N50l78k86
3764c51O43K9p43L61M05o33K27N52p46k82J039j68r57O62N50j017p0J295n61j245
3784a010J211O33j407J22J210o88r87J239N43j560J87J298p67o65R67J38j099
3801f35M18R41q44l97Q19j30n41N08J86p36K58O33o14j62O50l41m87P64J95j071
3821e86L43R52q49m73J107r2j160O77R53j204l85J369l06j163Q63P98j280j96
3839f32J314m31r64Q51M34j051J07J050o52o46Q47P5o51L35M05p00k6Q79m97n24
3859d77P25o8n94M85M55q94j58J162m52r00R55K65j034K59J027p97p89J256K10
$$ y = [91, 524, -223, -473, 504, 101, -690, 446, 588, -831, -378, 959, 38, -875, 371, 555, -770, -202, 1019, -241, -1083, 631, 701, -751, -176, 645, -231, -590, 603, 439, -846, -74, 692, -225, -237, 313, -65, -351, 292, 321, -422, -61, 344, -289, -62, 490, -256, -538, 501, 333, -624, 38, 588, -429, -499, 796, 235, -1010, 201, 834, -573, -451, 759, 71, -916, 323, 866, -694, -507, 791, 24, -641, 326, 464, -635, -217, 724, -120, -517, 302, 172, -369, 139, 325, -411, -153, 480, -134, -296, 354, 13, -474, 290, 485, -586, -243, 709, -140, -613, 494, 402, -758, -81, 872, -332, -717, 652, 346, -817, 46, 844, -436, -632, 682, 251, -713, 138, 572, -479, -372, 678, 26, -620, 227, 302, -349, -14, 391, -309, -335, 544, 47, -477, 248, 180, -414, 71, 526, -368, -526, 636, 184, -716, 239, 504, -530, -271, 756, -41, -830, 426, 636]
3878F36j321M44R77q78m72J115j35j063O58P49r77k78J048l02p43P51J57q01K89
3897a46O50n24m57P66q3p27P34K07r17K71P32m85n22Q18K1j035P14P63j100k61
3917e81J049k07q42P63M31j206R5J266n19r52Q09L10r21M84P07r17m92J060K13
3936E50r51L14M27p85K77Q63o64p12P14M08p00K33M53r04N9J083l62r07N29N19
3956D44p87K06Q20q83n41J089J86r98K47P56q17k02J089l25r62O05O14p96n5Q62
3976E52n82o15R23K22q93J88O49o51j55Q64l23p60O00M96p90K0Q01o91m05R59
3996D09n3q30L13O91p23l28J114m20q32P98L23p84J6Q44m89p38J002J70r58L83
4016i2N39o61j87Q79k08r08O04N15p54Q5O64o16m27R46L4q68K91N77o00j58Q90
$$ y = [636, -685, -241, 736, -142, -614, 501, 366, -697, -39, 710, -267, -545, 503, 201, -542, 209, 366, -435, -146, 504, -20, -477, 289, 206, -521, 213, 420, -497, -226, 506, 21, -501, 317, 338, -697, 17, 780, -320, -581, 468, 261, -581, 182, 613, -593, -498, 768, 249, -703, 106, 416, -505, -21, 686, -231, -723, 337, 550, -401, -87, 340, -445, -168, 695, 31, -681, 33, 441, -259, -26, 427, -477, -418, 665, 303, -604, -75, 444, -343, -137, 683, -200, -741, 348, 534, -464, -217, 539, -278, -480, 609, 284, -678, -73, 541, -255, -310, 552, -30, -645, 278, 500, -393, -205, 444, -207, -362, 502, 179, -581, 19, 515, -275, -255, 546, -145, -550, 409, 356, -474, -161, 530, -193, -521, 593, 173, -659, 139, 462, -322, -306, 538, 49, -689, 313, 483, -475, -92, 447, -214, -401, 478, 270, -638, -34, 481, -273, -188, 476, -140, -567, 379, 413, -455, -164, 413, -187, -345, 545]
4037E45m37q28Q80L85q63P3O70m50n48R85P0j121N08O66o71k27P37j49q68P37
4057I4N14r75R6O93m40m05O83J44r34L85P02p57r8O99l12o03O43M01r33J08Q00
4078E05n84l70Q22p7q70M94O82q09k24Q61k75p24P47L73j021J41Q70n41m74P08
4098B34J11q55L85P61q63j98Q13k39n27M58L64q07N0Q99o29m26P69r2n94L45N49
4119E08p50k12R41l64o41P11J88q06J76Q22o07n22Q63k9p67M70N78q24k40R68
4139D63k39p26O16K78p74J38Q40n77o17Q11J19p01L44M65o98k01R54k71p23N65
4159F6K31n86J44O60n48n65R17pp10M64L03o45r6Q45j99q52O89K66q19M12N79
4180E49o74m85Q17K51q30L08M84q40P0R88m05q51N17M71n40P9N19o23m53J028
$$ y = [545, 108, -720, 160, 545, -318, -245, 425, -25, -573, 412, 482, -639, -131, 535, -136, -363, 374, 225, -643, 94, 608, -367, -271, 422, -18, -423, 260, 404, -530, -145, 557, -200, -298, 401, 89, -514, 129, 530, -403, -295, 505, -79, -449, 373, 296, -574, -80, 602, -207, -431, 430, 155, -569, 178, 551, -470, -329, 541, 0, -474, 234, 345, -510, -125, 636, -227, -425, 388, 149, -378, 80, 444, -363, -313, 586, -43, -469, 300, 208, -386, -41, 508, -242, -454, 487, 123, -518, 193, 381, -425, -249, 573, -34, -556, 307, 278, -489, -19, 559, -265, -505, 463, 224, -502, 114, 392, -382, -244, 596, 19, -598, 213, 332, -369, -25, 440, -258, -459, 495, 224, -499, 66, 297, -289, -145, 515, -33, -598, 319, 312, -398, 66, 369, -276, -372, 473, 274, -578, 111, 377, -442, -30, 549, -125, -610, 207, 458, -372, -64, 420, -420, -350, 638, 233, -618, -101, 370, -170, -91, 428, -195, -648, 380]
4200C80J62r86K63M17m27Q5N58l49p69O77N67q21J04M55n79o1P06m1q15K96O14
4221D36o40jP17n40n75P76L19p96J19N89n84k63Q86k5r90L70P06o69p9P00m45
4242A1n64O61M58p89j51P46m22l32P46j38p00L86M95n07j99O13k23n25N85K13
4262C64p02K37N40o76j09P29j14o53K52N31o28MQ94p58o16R65K51p11p2N59l56
4283f9l74J001j49j164N62P45n31k65M37j84m82O48M43r29j23P67k94k42M96k20
4303G3n10L81M65m28k80N63l07m13Q41m8p99L06M51l62j68O15k24q58P54O62r63
4324b49j34P00l26l79P06J47r90R7J041l93o81O15N7o32N00M43o97k83O55J44
4344C41o11K61K92o25K64N02n46j53M51l5l90K60L36o17K5P27n42l82P73n8p33
$$ y = [380, 542, -444, -181, 236, -191, -106, 452, 103, -666, 11, 578, -243, -139, 316, -263, -324, 382, 341, -474, -178, 436, -204, -205, 512, -28, -603, 173, 492, -304, -185, 404, -180, -443, 443, 418, -572, -202, 504, -165, -244, 456, 11, -553, 108, 566, -223, -374, 372, -50, -382, 364, 226, -474, -88, 407, -100, -299, 314, 91, -434, 151, 364, -338, -101, 439, -237, -346, 383, 269, -384, -132, 399, -229, -225, 669, -89, -705, 260, 511, -200, -272, 287, -69, -443, 558, 409, -755, -193, 552, 21, -244, 193, 9, -473, 175, 618, -311, -434, 333, 39, -203, 293, 73, -437, -56, 409, -19, -299, 264, -43, -456, 385, 337, -462, -156, 295, -67, -235, 380, 156, -702, 52, 714, -249, -383, 317, -9, -388, 318, 465, -525, -428, 613, 220, -461, 154, 211, -421, 79, 522, -175, -458, 197, 341, -270, -9, 283, -342, -78, 424, -122, -275, 176, 141, -249, 11, 347, -270, -245, 482, -60, -442, 331, 273, -460]
4365d60L43O19n58m28Q10m2q46O35N24r63q0Q85j71o79L59M70o92J6Q05n87m75
4386e15O99J29m75L1L27k70j36N56k53m97N24J25m54K05K28m09l9N85k13o03N17
4407F2L73p77J07P35n47m36P17J40p78K04P54o28n27R57L5q49L36N13n24j80O66
4428C53j34p33M63N08n79p7M19k75j74M69l2m77J83L26l32lL91l86k57O28m9n55
4450c23L16L39n25j10P28j78p69N71L86p50J25O85m49o54O99M94q33l0O27m66
4470a17k48P25kq18J47O92k86k80L41k06l39N49K39n88o2L47j45K5L31k95m81
4491d71N10L91n86L5L95m90j15P13qq27J87O94n14k03P23l12p40O08O18o98l18
4512d08O44j52m74N91K70q25n0P35j79l50L19o5l99L04M74m72k79M50j53j39M50
$$ y = [-460, -117, 502, -56, -484, 326, 284, -562, 73, 597, -366, -446, 439, 268, -411, -52, 418, -274, -258, 547, -40, -515, 184, 313, -162, -131, 196, -74, -210, 346, 93, -404, 120, 245, -209, -4, 224, -185, -224, 361, 148, -455, 62, 435, -342, -235, 500, -47, -483, 234, 374, -404, -200, 554, -74, -601, 356, 391, -458, -122, 391, -133, -313, 353, 219, -514, -51, 457, -122, -199, 220, -55, -229, 240, 208, -269, -86, 240, -92, -95, 296, -90, -347, 281, 232, -323, -7, 332, -193, -303, 425, 247, -522, 49, 435, -315, -190, 495, 46, -608, 91, 585, -248, -278, 349, -117, -365, 360, 358, -460, -313, 379, 93, -187, 154, -52, -391, 158, 397, -191, -253, 94, -51, -26, 305, 10, -471, 39, 430, -156, -121, 274, -216, -331, 382, 374, -453, -266, 428, -86, -289, 434, 122, -618, -10, 608, -90, -408, 236, 84, -390, 201, 471, -354, -404, 331, 152, -198, 121, 56, -343, -39, 435, -37, -316, 134, -19, -158, 292]
4533B92j60m92K09M75l26k22M85k81m58O95K34p39k8O13k66l79O36O2q60K58P85
4554E33m70m40N86n2n59M28M90o09l86O74K6m80M01O5n47J71N14k06l90K92J7
4575E8l32M44J68o25jN19j43k71L66p0n76M33N55o01l26O06p4m75M83K35p16j5
4597c58P55j98n99M39K48o31K19N63m52l81N03J47n11K18L62n11r4N41j42l56
4617b38K87J28m40K20L99m43j99M66l7l88L31J85o10J27O37l77m17M54J60n19
4637b74K01M84n65k64P00j5o17K76M05m92r1N62k20m52M33K48n25L2M95l71k34
4658b84M62m4l70K25K93m46m7N41k90l44M14P5l92J54L60m63j89O59j14n51L18
4679c3L15m29j9N03l37m34O06K03o19K9M81k86k22N04j10n39L56L76m40j68M68
$$ y = [292, 132, -360, -151, 324, -2, -224, 261, -20, -478, 217, 451, -288, -316, 297, 31, -348, 288, 350, -510, -252, 533, 63, -377, 209, 157, -402, 26, 516, -93, -479, 195, 221, -259, 142, 207, -340, -169, 345, 139, -251, 41, 58, -274, 170, 338, -287, -288, 231, 88, -183, 183, 113, -463, -30, 525, -76, -402, 204, 130, -345, 138, 373, -343, -358, 397, 199, -400, 39, 287, -344, -125, 438, -14, -395, 108, 255, -256, -38, 324, -187, -281, 260, 118, -238, 49, 177, -263, -43, 356, -87, -286, 180, 143, -245, 86, 271, -339, -212, 425, 48, -369, 85, 245, -274, -73, 411, -154, -418, 282, 267, -350, -74, 331, -161, -252, 310, 90, -362, 71, 319, -206, -174, 321, -50, -284, 178, 134, -236, -11, 282, -164, -211, 330, 40, -304, 110, 185, -207, -53, 307, -156, -345, 314, 200, -351, -33, 282, -147, -166, 337, 0, -434, 172, 375, -244, -215, 266, -20, -242, 262, 152, -387, -31, 345, -95, -263, 205]
4700B05j67l33M41P9m79J17M11l47j97N18j04m99L49K71l84k6M04k90l86O56J49
4721C88o66R9L88k14j40M18j52o30N12N12n78k20L61p3j64M01K9o94J86O23k55
4742A31l38K83p1l06M64K26o04r6M92p7l13L90ln84L04M90l88k23L54q5l75M40
4764A11L43o93j20N54q9k50K86J0n90L03O43m38m09L23J02k11K80J54o42qP05
$$ y = [205, 38, -295, 146, 225, -254, -137, 274, -73, -270, 248, 144, -355, -6, 265, -119, -145, 259, -31, -417, 239, 388, -278, -179, 209, -5, -145, 273, 121, -509, 3, 515, -63, -283, 78, 5, -159, 242, 271, -423, -237, 386, 131, -207, 76, 5, -301, 163, 389, -215, -311, 181, 104, -209, 181, 178, -406, -102, 388, 0, -223, 131, 46, -329, 111, 454, -239, -359, 195, 106, -144, 142, 152, -438, -135, 508, 70, -339, -16, 86, -125, 155, 309, -333, -341, 364]
$$ [...]
8191A6
##END NTUPLES=NMR FID
##END=
