##TITLE=1H_AM_NVBuA:DMF
 
 8 sc, 
 3.10.2024
##JCAMPDX= 6.0         $$ Bruker NMR JCAMP-DX V2.0
##DATA TYPE= NMR FID
##DATA CLASS= NTUPLES
##ORIGIN= UXNMR, Bruker Analytische Messtechnik GmbH
##OWNER= root
$$ XWIN-NMR		Version 3.5
$$ Thu Oct  3 16:32:18 2024 Russian Standard Time (UT+4h)  she@DPX200
##.OBSERVE FREQUENCY= 200.1318
##.OBSERVE NUCLEUS= ^1H
##.DELAY= (6, 6)
##.ACQUISITION MODE= SIMULTANEOUS
##.ACQUISITION SCHEME= undefined
##.AVERAGES= 8
##.DIGITISER RES= 18
##SPECTROMETER/DATA SYSTEM= spect
##.PULSE SEQUENCE= zg30
##.SOLVENT NAME= CDCl3
##.SHIFT REFERENCE= (INTERNAL, CDCl3, 0, 15.7039)
##AUDIT TRAIL= $$ (NUMBER, WHEN, WHO, WHERE, WHAT)
$$ ##TITLE= Audit trail, XWIN-NMR		Version 3.5
$$ ##JCAMPDX= 5.01
$$ ##ORIGIN= Bruker BioSpin GmbH
$$ ##OWNER= she
$$ F:/spectra/data/she/nmr/H-F/1/audita.txt
$$ ##AUDIT TRAIL=  $$ (NUMBER, WHEN, WHO, WHERE, WHAT)
(   1,<2024-10-03 16:30:28.23 +0400>,<she>,<DPX200>,
      <created by zg, POWCHK disabled, PULCHK disabled
       configuration hash MD5:
       00 E9 B6 7A A2 85 ED C7 34 08 36 98 17 FE 4E 26
       data hash MD5: 16K
       B1 3B 89 EE 01 2F 52 9F 91 19 F9 2A E1 8C C3 B7>)
$$ ##END=
$$ 
$$ hash MD5
$$ 3C 71 EA 98 A0 B3 EA 8D 03 32 67 21 E6 49 BC 6F
##$RELAX= 
##$RELAX= 
##$RELAX= 
##$RELAX= 
##$RELAX= 
##$RELAX= 
$$ Bruker specific parameters
$$ --------------------------
##$DU= <F:/spectra>
##$EXPNO= 1
##$NAME= <H-F>
##$PROCNO= 1
##$TYPE= <nmr>
##$USER= <she>
##$AMP= (0..31)
100 100 100 100 100 100 100 100 100 100 100 100 100 100 100 100 100 100 
100 100 100 100 100 100 100 100 100 100 100 100 100 100 
##$AQSEQ= 0
##$AQ_mod= 1
##$AUNM= <au_zg>
##$AUTOPOS= <>
##$BF1= 200.13
##$BF2= 200.13
##$BF3= 200.13
##$BF4= 200.13
##$BF5= 200.13
##$BF6= 200.13
##$BF7= 200.13
##$BF8= 200.13
##$BYTORDA= 1
##$CFDGTYP= 0
##$CFRGTYP= 5
##$CHEMSTR= <none>
##$CNST= (0..31)
1 1 145 1 1 1 1 1 1 1 1 1 1 1 1 1 1 1 1 1 1 1 1 1 1 1 1 1 1 1 1 1 
##$CPDPRG= <>
##$CPDPRG1= <>
##$CPDPRG2= <>
##$CPDPRG3= <>
##$CPDPRG4= <mlev>
##$CPDPRG5= <mlev>
##$CPDPRG6= <mlev>
##$CPDPRG7= <mlev>
##$CPDPRG8= <mlev>
##$CPDPRGB= <>
##$CPDPRGT= <>
##$D= (0..31)
0 1.2 0 0 0 0 0 0 0 0.06 0 0.03 0 0 0 0 0.0002 0 0 0 0 0 0 0 0 0 0 0 0 
0 0 0 
##$DATE= 1727958627
##$DBL= (0..7)
120 120 120 120 120 120 120 120 
##$DBP= (0..7)
150 150 150 150 150 150 150 150 
##$DBP07= 0
##$DBPNAM0= <>
##$DBPNAM1= <>
##$DBPNAM2= <>
##$DBPNAM3= <>
##$DBPNAM4= <>
##$DBPNAM5= <>
##$DBPNAM6= <>
##$DBPNAM7= <>
##$DBPOAL= (0..7)
0.5 0.5 0.5 0.5 0.5 0.5 0.5 0.5 
##$DBPOFFS= (0..7)
0 0 0 0 0 0 0 0 
##$DE= 6
##$DECBNUC= <off>
##$DECIM= 24
##$DECNUC= <off>
##$DECSTAT= 4
##$DIGMOD= 1
##$DIGTYP= 9
##$DL= (0..7)
0 120 120 120 120 120 120 120 
##$DP= (0..7)
150 150 150 150 150 150 150 150 
##$DP07= 0
##$DPNAME0= <>
##$DPNAME1= <>
##$DPNAME2= <>
##$DPNAME3= <>
##$DPNAME4= <>
##$DPNAME5= <>
##$DPNAME6= <>
##$DPNAME7= <>
##$DPOAL= (0..7)
0.5 0.5 0.5 0.5 0.5 0.5 0.5 0.5 
##$DPOFFS= (0..7)
0 0 0 0 0 0 0 0 
##$DQDMODE= 0
##$DR= 18
##$DS= 0
##$DSLIST= <SSSSSSSSSSSSSSS>
$$ [...]
##$SUBNAM2= <"">
##$SUBNAM3= <"">
##$SUBNAM4= <"">
##$SUBNAM5= <"">
##$SUBNAM6= <"">
##$SUBNAM7= <"">
##$SUBNAM8= <"">
##$SUBNAM9= <"">
##$SW= 24.0689170037331
##$SWIBOX= (0..15)
0 0 2 0 0 0 0 0 0 0 0 0 0 0 0 0 
##$SW_h= 4816.95568400771
##$TD= 16384
##$TD0= 1
##$TE= 0
##$TE2= 300
##$TE3= 300
##$TEG= 300
##$TL= (0..7)
0 120 120 120 120 120 120 120 
##$TP= (0..7)
150 150 150 150 150 150 150 150 
##$TP07= 0
##$TPNAME0= <>
##$TPNAME1= <>
##$TPNAME2= <>
##$TPNAME3= <>
##$TPNAME4= <>
##$TPNAME5= <>
##$TPNAME6= <>
##$TPNAME7= <>
##$TPOAL= (0..7)
0.5 0.5 0.5 0.5 0.5 0.5 0.5 0.5 
##$TPOFFS= (0..7)
0 0 0 0 0 0 0 0 
##$TUNHIN= 0
##$TUNHOUT= 0
##$TUNXOUT= 0
##$USERA1= <user>
##$USERA2= <user>
##$USERA3= <user>
##$USERA4= <user>
##$USERA5= <user>
##$V9= 5
##$VALIST= <valist>
##$VCLIST= <CCCCCCCCCCCCCCC>
##$VD= 0
##$VDLIST= <DDDDDDDDDDDDDDD>
##$VPLIST= <PPPPPPPPPPPPPPP>
##$VTLIST= <TTTTTTTTTTTTTTT>
##$WBST= 1024
##$WBSW= 4
##$XGAIN= (0..3)
0 0 0 0 
##$XL= 0
##$YL= 0
##$YMAX_a= 161549
##$YMIN_a= -231116
##$ZGOPTNS= <>
##$ZL1= 120
##$ZL2= 120
##$ZL3= 120
##$ZL4= 120
##$ABSF1= 10
##$ABSF2= 0
##$ABSG= 5
##$ABSL= 3
##$ALPHA= 0
##$AQORDER= 0
##$ASSFAC= 0
##$ASSFACI= 0
##$ASSFACX= 0
##$ASSWID= 0
##$AUNMP= <proc_1d>
##$AZFE= 0.1
##$AZFW= 0.1
##$BCFW= 1
##$BC_mod= 2
##$BYTORDP= 1
##$COROFFS= 0
##$CY= 11.3945322036743
##$DATMOD= 1
##$DC= 2
##$DFILT= <>
##$DTYPP= 0
##$F1P= 15.6554695791079
##$F2P= 12.8336369535428
##$FCOR= 0.5
##$FTSIZE= 0
##$FT_mod= 4
##$GAMMA= 1
##$GB= 0.15
##$INTBC= 1
##$INTSCL= 1
##$ISEN= 128
##$LB= 0.24
##$LEV0= 0
##$LPBIN= 0
##$MAXI= 10000
##$MC2= 0
##$MEAN= 0
##$ME_mod= 0
##$MI= 1.114404
##$NCOEF= 0
##$NC_proc= 0
##$NLEV= 6
##$NOISF1= 3.799351
##$NOISF2= 2.8
##$NSP= 1
##$NTH_PI= 0
##$NZP= 0
##$OFFSET= 15.70392
##$PC= 1
##$PHC0= -26434.32
##$PHC1= 9.38747
##$PH_mod= 1
##$PKNL= yes
##$PPARMOD= 0
##$PSCAL= 0
##$PSIGN= 0
##$REVERSE= no
##$SF= 200.130013532006
##$SI= 16384
##$SIGF1= 3
##$SIGF2= 2
##$SINO= 400
##$SIOLD= 16384
##$SREGLST= <1H.CDCl3>
##$SSB= 0
##$STSI= 0
##$STSR= 0
##$SW_p= 3612.71676300578
##$SYMM= 0
##$S_DEV= 0
##$TDeff= 0
##$TDoff= 0
##$TI= <>
##$TILT= no
##$TM1= 0
##$TM2= 0
##$TOPLEV= 0
##$USERP1= <user>
##$USERP2= <user>
##$USERP3= <user>
##$USERP4= <user>
##$USERP5= <user>
##$WDW= 1
##$XDIM= 8192
##$YMAX_p= 0
##$YMIN_p= 0
$$ End of Bruker specific parameters
$$ ---------------------------------
##NTUPLES= NMR FID
##VAR_NAME=  TIME,          FID/REAL,        FID/IMAG
##SYMBOL=    X,             R,               I
##VAR_TYPE=  INDEPENDENT,   DEPENDENT,       DEPENDENT
##VAR_FORM=  AFFN,          ASDF,            ASDF
##VAR_DIM=   8192,          8192,            8192
##UNITS=     SECONDS,       ARBITRARY UNITS, ARBITRARY UNITS
##FACTOR=    0.0002076,     1,               1
##FIRST=     0,             0,               0
##LAST=      1.7004516,     0,               0
##MIN=       0,             -231116,         0
##MAX=       1.7004516,     161549,          0
$$ Real data points
##PAGE= N=1
##DATA TABLE= (X++(R..R)), XYDATA
$$ [...]
$$ plain form
1650 -1489 1025 1476 -5135 2580 5180 -5859 -501 3932 -2758 -765 3260 -428 -3255 1367 1555
1665 1555 -966 1412 -2169 -1536 4262 -1607 -2360 4408 -1776 -4341 5044 1351 -5069 1936 1975 -2557
1681 -2557 809 1438 -1407 -127 826 -1735 1294 2117 -4051 1422 3306 -5178 1045 4629 -3866 -1654
1697 -1654 3177 -625 -1201 2058 -718 -2171 1510 233 -142 1880 -2620 -2033 4454 8 -3509 2768
1713 2768 -492 -3546 3928 1907 -3391 -588 806 275 910 442 -2054 -429 1798 -1007 1567 1021
1729 1021 -4670 887 3759 -1695 -751 1067 -1412 -575 2390 235 -1818 -228 -81 867 1301 -1132
1745 -1132 -1184 937 10 -907 1971 -149 -2685 1535 986 -862 266 -239 -2 -703 357 1222 -610
1762 -610 -241 -731 262 997 -730 469 -194 -1029 370 994 804 -1541 -949 993 304 168 238 -227 -1575
$$ packed form
1650a489K514M51o611P715K600j1039N358M433o690J993M025l688k827M622J88
1665A555k521K378l581O33N798n869p53O768o184k565R385l693o420P005L9m532
1681b557L366O29k845J280R53k561L029Q23o168N473J884q484O223L584q495K212
1697a654M831l802n76L259k776j453L681j277l75K022m500N87O487m446l517O277
1713B768l260l054P474k021n298K803J394n31O35m68k496J625K227k805K574n46
1729A021n691N557K872n454R44J818k479Q37K965k155k053J590J47R48M34k433
1745a132n2K121r27r17K878k120k536M220n49j848J128n05K37p01J060Q65j832
1762f10L69m90R93P35j727J199o63q35J399O24j90k345N92J942o89j36P0m65j348
$$ plain form
1781 -1575 563 2021 -1066 -298 -382 -704 1595 275 -467 -479 -176 -234 212 2162 -1847 -1376 2221 -1301
1799 -1301 324 1755 -1623 -1194 819 858 -354 1159 -1125 -2475 2841 475 -1241 1226 -1640 -1411
1815 -1411 2488 2089 -2800 -1042 1441 -1861 2838 1499 -4430 585 1292 -20 1265 -322 -2764
1830 -2764 -671 4455 -903 -2126 2053 -3065 681 3996 -2343 -1868 1084 367 -451 2178 -1025 -3570
1846 -3570 3545 361 -2244 2414 -1168 -1733 2043 1128 -2462 369 2110 -3287 1722 1860 -3583 2245
1862 2245 490 -2512 1196 1450 -1077 -1388 2445 -1825 -863 4402 -3499 -1245 2697 -1534 1086 818
1878 818 -1711 -1592 2448 1491 -3080 1810 -1257 -1828 4788 -1031 -2687 457 620 351 701 677 -3845
1895 -3845 1154 3259 -2397 1207 -1036 -2030 2502 1190 -884 -2107 1609 -196 -622 3087 -3333
$$ packed form
1781a575K138J458l087P68q4l22K299j320p42j2L03n8M46J950m009M71L597l522
1799a301J625J431l378M29K013L9j212J513k284j350N316k366j716K467k866K29
1815a411L899l99m889J758K483l302M699j339n929N015P07j312J285j587k442
1830b764K093N126n358j223M179n118L746L315o339M75K952p17q18K629l203k545
1846c570P115l184k605M658l582n65L776r15l590K831J741n397N009J38n443N828
1862B245j755l002L708K54k527l11L833m270R62N265p901K254L942m231K620k68
1878H18k529J19M040r57m571M890l067n71O616n819j656L144J63k69L50k4m522
1895c845M999K105n656L604k243r94M532j312k074j223L716j805m26L709o420
$$ plain form
1910 -3333 -462 2336 -1377 1162 -644 -240 -264 220 1290 -2400 2097 -128 -2282 2659 -1408 249
1926 249 904 -1174 68 -878 2313 -532 -1213 900 -1977 2205 569 -1412 126 -1349 1926 313
1942 313 -196 -631 -1923 2602 -48 -200 -231 -1664 1977 -428 812 -692 -2093 2768 -669 206 -386
1959 -386 -1306 2134 -944 961 -1417 -1214 3349 -1734 843 -803 -2222 3355 10 -241 -2059 -383
1975 -383 2574 -966 2208 -2640 -2773 3996 65 597 -1364 -2299 1179 1772 1969 -3382 -799 917
1991 917 -904 4173 -1206 -3568 661 1387 1285 -923 740 -2798 -545 4570 -2292 616 -238 -3101
2007 -3101 2878 776 47 -1374 -144 242 -1960 5144 -1440 -4020 3073 -1957 1460 2405 -2050 -1655
2023 -1655 -854 2938 -74 788 -831 -4978 4521 2068 -2219 842 -2316 -931 2213 3444 -2655
$$ packed form
1910c333K871K798l713K539j806M04k4M84J070l690M497k225k154M941m067J657
1926B49O55k078J242r46L191k845o81K113k877M182j636j981J538j475L275j613
1942C13n09m35j292M525k650j52l1j433L641k405J240j504j401M861l437Q75n92
1959c86r20L440l078J905k378K03M563n083K577j646j419N577l345k51j818J676
1975c83K957l540L174m848j33O769l931N32j961r35L478N93J97n351K583J716
1991I17j821N077n379k362M229P26j02k208J663l538K253N115o862K908q54k863
2007c101N979k102p29j421J230L86k202P104o584k580P093n030L417R45m455L95
2023a655Q01L792l012Q62j619m147R499k453m287L061l158J385L144J231o099
$$ plain form
2038 -2655 -3601 2836 -914 2288 1366 -4819 838 1089 821 659 -678 -1613 -1808 5125 -776 -3610 3164
2055 3164 -1974 35 2179 -969 -744 -672 1815 -1148 527 718 -2778 3425 -987 -2533 3012 -434
2071 -434 -754 -440 1350 -950 -1183 3897 -2756 -1040 1834 -1513 2537 -1086 -1644 1050 95 801 -1280
2088 -1280 1550 -1359 -2029 4432 -1380 -1711 1016 -324 672 -835 1107 -544 -799 1055 -1118 1954
2104 1954 -1137 -1405 2509 -1446 -291 566 1013 -611 -2384 2896 -418 -985 1257 -1347 795 -879
2120 -879 915 1513 -2654 138 470 1411 -250 -2033 1683 -755 -32 1121 -186 -578 -2035 2737
2136 2737 985 -2354 384 -233 1039 -737 279 1126 -2735 1341 599 90 365 -2972 2495 672
2152 672 -2081 1298 -125 -9 -1478 1542 1684 -3682 1394 1152 -1295 784 -661 618 -153 -915
$$ packed form
2038b655r46O437l750L202r22o185N657K51k68j62j337r35j95O933n901k834O774
2055C164n138K009K144l148K25P2K487k963J675J91l496O203m412j546N545l446
2071d34l20L14J790k300k33N080o653J716K874l347M050l623n58K694r55P06k081
2088a280K830k909o70O461n812l31K727j340R96j507J942j651k55J854k173L072
2104A954l091k68L914l955J155Q57M47j624j773N280l314n67K242k604K142j674
2120h79J794N98m167K792L32R41j661j783L716k438P23J153j307l92j457M772
2136B737j752l339K738o17J272j776J016Q47l861M076p42n09K75l337N467j823
2152F72k753L379j423J16j469L020J42n366N076k42k447K079j445J279p71p62
$$ plain form
2168 -915 679 931 -375 -2195 2043 1104 -2750 1287 1307 -1784 -1005 2431 374 -2495 1363 -401
2184 -401 26 1381 -2100 1353 16 -1987 1829 1269 -1147 -2655 2518 1585 -3546 2513 225 -2814
2200 -2814 1754 609 304 -828 -1224 640 1210 481 -2348 1267 838 -3128 2731 1832 -3509 -698
2216 -698 2501 190 -1642 1357 -558 -1271 1552 -506 869 21 -2610 1414 2035 -1533 -1402 2343
2232 2343 -419 -2945 3155 975 -2914 624 691 -236 1 375 -95 -311 -396 -742 2743 -30 -3659
2249 -3659 1758 1241 -1509 747 1311 -1696 -2263 2969 1439 -1926 -229 -1239 1207 1557 -1327 602
2265 602 -755 -1759 1456 2716 -977 -3628 1429 1913 -1238 884 145 -1833 -435 1658 1452 -928
2281 -928 -1811 -260 1936 184 -1068 1075 -783 -1699 1273 2300 -755 -2714 968 1035 -654 1082
$$ packed form
2168i15J594K52j306j820M238r39l854M037K0l091P79L436k057k869L858j764
2184d01M27J355l481L453j337k003L816n60k416j508N173r33n131O059k288l039
2200b814M568j145l05j132l96J864N70p29k829L615m29l966N859q99n341K811
2216f98L199k311j832K999j915p13K823k058J375q48k631M024O21l568J31L745
2232B343k762k526O100k180l889L538O7r27K37L74m70k16q5l46L485k773l629
2249c659N417n17k750K256N64l007n67N232j530l365J697j010K446L50k884J929
2265F02j357j004L215J260l693k651N057M84l151K122p39j978J398K093k06k380
2281i28q83J551K196j752j252K143j858r16K972J027l055j959L682O7j689J736
$$ plain form
2297 1082 -59 -1040 -1193 663 2887 -915 -2287 -46 1049 998 -420 202 -821 -1836 1702 2446
2313 2446 -965 -2791 147 2215 -44 -418 8 -961 -614 1474 1567 -1527 -1606 481 1538 539 -1889
2330 -1889 177 1110 -1212 322 1290 -777 -1543 1244 1503 -2116 -267 1650 -343 -391 -500 157 966
2347 966 -376 -496 518 -380 -1082 1915 1247 -3109 -494 2529 -102 -974 483 -471 -906 1515 616
2364 616 -899 -323 -1128 1213 1935 -2029 -955 1616 -308 -1112 1688 447 -2653 865 1651 -1282
2380 -1282 210 339 -659 288 -85 -189 1245 -211 -2313 1157 1839 -1802 270 1108 -2039 -230 2701
2397 2701 -40 -2286 170 424 510 1392 -1693 -1032 1206 -286 836 1037 -2171 -1649 2707 1582 -2431
2414 -2431 -82 484 -993 1636 715 -1714 -544 493 660 877 -619 -1997 1135 1630 -1561 222
$$ packed form
2297A082j141r81j53J856K224l802j372K241J095n1j418O22j023j015L538P44
2313B446l411j826K938K068k259l74M26r69L47K088R3l094p9K087J057r99k428
2330a889K066R33k322J534R68k067p66K787K59l619J849J917j993m8j09O57Q09
2347I66j342j20J014q98p02K997o68m356K615L023k631q72J457r54m35K421q99
2364F16j515N76q05K341P22l964J074K571j924q04K800j241l100L518P86k933
2380a282J492J29r98R47l73j04J434j456k102L470O82l641K072Q38l147J809K931
2397B701k741k246K456K54Q6Q82l085O61K238j492J122K01l208N22M356j125m013
2414b431K349N66j477K629r21k429J170J037J67K17j496j378L132M95l191J783
$$ plain form
2430 222 732 -1452 182 1670 -507 -1470 937 319 -648 730 -602 55 715 -1202 262 1103 -500
2447 -500 -820 632 208 -1089 1388 578 -2045 103 1032 500 -121 -913 -495 514 1169 -242 -542 -558
2465 -558 -830 1921 1160 -1724 -1247 470 1416 126 -160 -834 -1267 1441 1201 -161 -1121 -1346 1276 1159
2483 1159 -27 -800 -1024 653 383 695 114 -1543 -161 836 870 -460 -753 367 -475 417 681 -369
2501 -369 -284 -509 380 317 278 -45 -872 446 -345 305 1381 -1243 -867 454 712 248 -304 -56 -1295
2520 -1295 751 1501 -915 -52 -739 -295 1516 233 -865 -751 759 -38 63 1124 -1752 -206 1448
2537 1448 -555 25 7 -222 -138 592 -19 -1122 1421 -178 -1141 1250 -745 -204 1278 -349 -1212 10
2555 10 1350 -443 249 3 -1995 1460 1282 -915 -92 -724 -394 1141 1545 -1509 -1606 1417 -318 859
$$ packed form
2430B22N10k184J634J488k177r63K407o18r67J378j332O57O60j917J464Q41j603
2447e00l20J452m24j297K477q10k623K148R29n32o21p92M18J009O55j411l00j6
2465e58k72K751p61k884M77J717R46j290k86o74m33K708k40j362r60k25K622j17
2483A159j186p73k24J677k70L12n81j657J382R97L4j330k93J120q42Q92K64j050
2501c69Q5k25Q89o3l9l23q27J318p91O50J076k624L76J321K58m64n52K48j239
2520a295K046P50k416Q63o87M44J811j283j098J14J510p97J01J061k876J546J654
2537A448k003N80j8k29Q4P30o11j103K543j599r63K391j995N41J482j627q63J222
2555A0J340j793O92k46j998L455j78k197Q23o32L30J535M04l054r7L023j735J177
$$ plain form
2573 859 1045 -2332 -455 1168 748 -30 -278 -870 -1036 2358 379 -1551 755 -1178 -76 1813 -25
2590 -25 -1058 -630 689 -334 991 743 -2369 540 547 -390 1403 -534 -1300 -222 1370 339 -723
2607 -723 696 -1714 -30 2185 -678 -224 -551 -602 785 962 98 -1673 338 318 -197 1705 -1155
2624 -1155 -1249 752 402 445 -289 -102 -948 285 1391 -932 262 -333 -775 1177 50 -80 -462 -18
2642 -18 166 -386 1263 -720 -631 695 -637 758 15 -287 -49 -603 859 -210 307 -21 -1165 999
2660 999 -110 139 270 -866 290 -346 895 204 -1153 543 -435 474 510 -542 58 -777 788 385
2678 385 -391 289 -1044 527 583 -255 157 -637 165 -48 695 170 -1331 777 -101 -38 735 -723 -117
2697 -117 -187 705 37 -593 641 -1127 674 804 -1281 709 -267 -328 516 106 -8 -938 936 -65
$$ packed form
2573H59J86l377J877J623m20p78k48n92j66L394j979j930K306j933J102J889j838
2590b5j033M28J319j023J325k48l112K909Pr37J793j937p66J078J592j031j062
2607g23J419k410J684K215k863M54l27n1J387J77q64j771K011k0n15J902k860
2624a155r4K001l50M3p34J87q46J233J106k323J194n95m42J952j127j30l82M44
2642a8J84n52J649j983Q9J326j332J395p43l02K38n54J462j069N17l28j144K164
2660I99j109K49J31j136J156o36J241o91j357J696r78R09L6j052O00q35J565m03
2678C85p76O80j333J571N6q38M12p94Q02k13P43n25j501K108q78O3P73j458O06
2697a17p0Q92o68o30J234j768J801J30k085J990r76o1Q44m10j14r30J874j001
$$ plain form
2715 -65 -753 1300 -962 -225 756 -544 284 100 -141 -585 594 436 -1103 1069 -393 -1038 1323 40
2733 40 -477 -247 314 -210 9 1209 -1453 -128 916 -808 1187 -268 -1261 439 720 222 -798
2750 -798 582 -709 -607 2201 -810 -974 496 -343 605 326 -259 -926 339 775 -780 1059 -636
2767 -636 -1348 1642 73 -621 103 129 -376 -163 1242 -835 -348 716 -924 773 254 -762 392
2784 392 4 -421 36 1167 -721 -1065 1330 -453 -139 753 -558 -365 -109 852 -71 -329 7 -858
2802 -858 1342 -57 -1028 1127 -818 -237 836 60 -340 -757 1090 -165 -764 915 -474 138 26
2819 26 -555 665 -70 -149 79 -61 -482 44 1347 -556 -1146 182 663 484 -442 -15 -765 -223 1468
2838 1468 138 -376 -1354 -215 1996 -32 -500 -731 -453 888 319 910 -1047 -1817 1283 1229 110
$$ packed form
2715f5o88K053k262P37R81j300Q28j84k41m44J179j58j539K172j462o45K361j283
2733D0n17K30N61n24K19J200k662J325J044j724J995j455r93J700K81m98j020
2750g98J380j291J02K808l011j64J470q39R48k79n85o67J265M36j555J839j695
2767f36p12K990j569o94P24K6n05K13J405k077M87J064j640J697n19j016J154
2784C92l88m25M57J131j888l44K395j783L14Q92j311J93K56R61r23k58L36q65
2802h58K200j399r71K155j945N81J073p76m00m17J847j255n99J679j389O12j12
2819B6n81J220p35p9K28j40m21N26J303j903n90J328M81j79r26M27p50N42J691
2838A468j330n14r78J139K211k028m68k31K78J341n69N91j957p70L100n4j119
$$ plain form
2855 110 -1023 -645 428 51 1060 78 -1228 -523 351 1478 -96 -1129 -246 250 506 -112 717 -512
2873 -512 -1702 1228 1014 -386 -451 -443 177 -68 807 334 -1041 -460 -122 1383 609 -1639 -235 606 -58
2892 -58 307 830 -1003 -1515 1438 1058 -551 -603 -570 572 477 154 -231 -510 -109 -132 1578 -145 -2275
2911 -2275 1186 942 -831 180 142 -299 -385 813 265 -923 139 8 561 136 -1327 652 942 -991
2929 -991 -307 1024 -482 -822 1384 -52 -1299 442 579 97 -435 -351 254 315 8 -532 639 -176
2947 -176 -1158 1559 376 -1700 370 934 -381 -525 582 53 -607 339 107 178 -139 -635 701 318
2965 318 -909 112 1118 -719 -1090 1447 224 -1094 452 189 -231 -107 373 297 -719 -229 382
2982 382 756 -348 -1236 988 402 -936 598 351 -902 -292 1143 271 -1120 -67 508 258 -202
$$ packed form
2855A10j133L78J073l77J009r82j306P05Q74J127j574j033Q83M96K56o18Q29j229
2873e12j190K930k14j400o5QO20k45Q75m73j375N81L38J505p74k248J404Q41o64
2892e8L65N23j833n12K953l80j609n2L3J142r5l23l85k79M01k3J710j723k130
2911b275L461k44j773J011l8m41q6J198n48j188J062j31N53m25j463J979K90j933
2929i91O84J331j506l40K206j436j247J741J37m82n32Q4O05O1l07n40J171q15
2947a76r82K717j183k076K070N64j315j44J107n29o60R46k32P1l17m96J336l83
2965C18j227J021J006j837l71K537j223j318J546k63m20J24M80p6j016M90O11
2982C82L74j104q88K224n86j338J534k47j253O10J435q72j391J053N75k50m60
$$ plain form
2999 -202 -311 312 -172 -307 537 475 -840 -678 1271 202 -1033 280 371 -244 -300 524 349 -927 -6
3018 -6 643 83 -406 -308 686 -179 -635 633 413 -639 -580 802 454 -837 134 435 -450 -298 740 420
3038 420 -1043 -299 730 358 -209 -550 228 66 -246 616 248 -843 -750 1125 891 -1229 -230 432 -251
3057 -251 250 434 -116 -872 -111 930 390 -425 -900 377 774 -573 230 426 -978 -365 1281 367
3075 367 -1196 -15 476 -168 249 57 -110 -252 -282 485 600 -441 -924 728 520 -973 600 495
3093 495 -1117 -60 854 144 -618 -30 138 -93 343 -220 93 156 -879 481 947 -770 -592 753
3111 753 80 -766 733 316 -938 140 319 90 53 -329 -41 239 -12 -316 613 95 -1250 658 834
3130 834 -801 -11 393 -306 -310 612 266 -574 -58 -116 395 458 -739 29 318 -428 145 743 -311 -1076
$$ packed form
2999b02j09O23m84j35Q44o2j315J62J949j069j235J313R1o15n6Q24j75j276R21
3018fO49n60m89R8R94q65m56J268k20j052N9J382l48j291R71L01q85J52J038l20
3038D20j463P44J029l72n67l41P78j62l12Q62l68j091R3J875k34k120R99O62o83
3057b51N01J84n50p56P61J041n40q15m75J277L97j347Q03J96j404O13J646r14
3075C67j563J181M91o44M17j92j67j42l0P67J15j041m83J652k08j493J573j05
3093D95j612J057R14p10p62N88J68k31M36n63L13O3j035J360M66j717J78J345
3111G53o73q46J499m17j254J078J79k29l7l82K88K80k51l04R29n18j345J908J76
3130H34j635P90M04o99mR22l46q40N16n8N11O3j197P68K89p46N73N98j054p65
$$ plain form
3150 -1076 648 637 -557 194 -106 -340 188 258 217 -286 -376 -110 619 344 -850 130 297 -493 398 445
3170 445 -451 -592 420 470 -303 37 -237 -34 275 -172 279 -90 -432 93 416 148 -697 259 370 -568
3190 -568 311 167 -194 -112 -53 380 -258 -79 206 -105 92 -288 227 303 -421 -16 146 52 -160 158 214 -562
3212 -562 65 391 -24 -152 -212 181 -49 148 122 -331 108 -210 229 434 -535 -133 147 186 -77 -54 285
3233 285 -571 132 520 -307 69 -173 -34 252 0 21 -212 172 -209 -22 686 -562 -246 424 -145 34
3253 34 133 15 -403 120 443 -307 201 -202 -344 606 -8 -234 42 -34 -197 228 511 -713 -125 498 -270
3274 -270 282 14 -409 18 261 134 -302 234 -309 -234 906 -449 -342 375 -248 96 218 25 -409 49
3294 49 403 -344 350 -55 -567 541 39 -203 181 8 -347 47 655 -438 -142 323 -477 324 306 -288
$$ packed form
3150a076J724j1j194P51l00k34N28P0m1n03r0K66P29k75j194R80J67p90Q91M7
3170D45q96j41J012N0p73L40k74K03L09m47M51l69l42N25L23k68q45R56J11r38
3190e68Q79j44l61Q2N9M33o38J79K85l11J97l80N15P6p24M05J62r4k12L18N6p76
3212e62O27L26m15j28o0L93k30J97k6m53M39l18M39K05r69M02K80L9k63K3L39
3233B85q56P03L88q27L76k42J39K86k52K1k33L84l81J87P08j248L16O70n69J79
3253C4R9j18m18N23L23p50N08m03j42R50o14k26K76p6j63M25K83j224N88O23p68
3274b70N52k68m23M27K43j27m36N36n43P5J140j355J07P17o23L44J22j93m34M58
3294D9L54p47O94m05n12J108n02k42L84j73l55L94O08j093K96M65q00Q01j8n94
$$ plain form
3314 -288 -140 -57 186 -13 404 -339 -659 755 -31 -84 306 -604 -87 388 347 -235 -407 119 -169 590 195
3335 195 -782 107 63 137 370 -161 -523 -156 746 31 -281 25 -483 313 447 -96 -207 -323 214 163 328
3356 328 -186 -650 458 58 30 272 -464 -122 121 413 -14 -436 163 -218 273 290 -422 48 -167 163
3376 163 269 -105 -110 -384 420 177 -274 192 -343 37 283 46 -58 -445 248 145 28 139 -543 125 228
3397 228 26 134 -348 -104 35 450 107 -639 115 51 123 327 -311 -288 -105 484 187 -308 -63 -382 433
3418 433 467 -392 -79 -256 104 415 164 -257 -655 484 303 -114 222 -611 -109 480 232 -55 -430 -43
3438 -43 -26 476 255 -743 84 55 22 497 -208 -414 -181 523 197 -294 173 -512 83 640 -266 -28 -210
3459 -210 -164 322 285 -86 -569 248 157 -164 514 -337 -463 320 269 -18 -175 3 -253 244 377 -405 79
$$ packed form
3314b88J48Q3K43j99M17p43l20J414p86n3L90r10N17M75m1n82j72N26k88P59l95
3335A95r77Q89m4P4K33n31l62L67R02p15l12L06n08P96J34n43j11j16N37n1J65
3356C28n14m64J108m00k8K42p36L42K43K92m27m22N99l81M91J7p12M70k15L30
3376A63J06l74nk74Q04k43m51M66n35L80K46k37j04l87O93j03j17J11o82O68J03
3397B28k02J08m82K44J39M15l43p46P54o4P2K04o38K3J83N89k97m95K45l19Q15
3418D33L4q59L13j77L60L11k51m21l98J139j81m17L36q33N02N89k48k87l75L87
3438d3J7N02k21r98Q27k9l3M75p05k06K33P04l26m91M67o85N95N57r06K38j82
3459b10M6M86l7l71m83Q17r1l21O78q51j26P83n1k87j57J78k56M97J33p82M84
$$ plain form
3480 79 -118 -150 494 0 -302 -176 349 8 -230 440 -447 -184 564 -153 1 -119 -111 178 72 57 -311 179
3502 179 5 -242 513 -224 -383 296 143 -97 -147 240 -201 -71 369 -271 84 -43 -166 389 -130 -144 26
3523 26 128 -39 -240 463 -208 -379 458 -17 -145 -17 65 38 -98 127 -45 36 -107 -74 376 -191 -213 160
3545 160 106 -101 -167 417 -230 -324 487 -106 -52 -56 -54 261 -257 81 129 -158 24 -121 355 -57 -444 368 88
3568 88 -236 39 201 -108 -266 292 102 -164 -118 57 223 -213 18 106 -57 -41 -164 472 -141 -548 547
3589 547 45 -263 65 73 62 -342 248 247 -377 24 52 153 -16 -303 237 134 -304 33 416 -255 -380 481
3611 481 55 -320 17 179 31 -321 218 127 -225 79 -141 304 -50 -518 586 53 -495 195 254 -99
3631 -99 -328 288 182 -435 155 222 -79 -123 -84 239 119 -308 -56 422 -239 -339 629 -77 -532 220 327
$$ packed form
3480G9j97l2O44m94l02J26N25l41k38O70q87K63P48p17J54j20QK89j06j5l68M90
3502A79j74k47P55p37j59O79j53k40n0L87m41J30M40o40L55j27j23N55n19j4J70
3523B6J02j67k01P03o71j71Q37m75j28J28Q2k7j36K25j72Q1j43L3M50n67k2L73
3545A60n4k07o6N84o47r4Q11n93N4mKL15n18L38M8k87J82j45M76m12l87Q12k80
3568H8l24K75J62l09j58N58j90k66M6J75J66m36K31Q8j63J6j23O36o13m07J095
3589E47n02l08L28Qj1m04N90jo24M01K8J01j69k87N40j03m38L37L83o71j25Q61
3611D81m26l75L37J62j48l52N39r1l52L04k20M45l54m68J104n33n48O90N9l53
3631i9k29O16j06o17N90O7l01m4L9L23j20m27K52M78o61j00R68p06m55P52J07
$$ plain form
3652 327 -36 -395 204 168 -320 218 37 -40 -106 -306 593 92 -651 191 338 -220 -160 354 -54 -492 246
3673 246 418 -193 -317 102 183 -17 -42 -57 187 -237 -227 696 -146 -617 298 293 -88 -271 221 104 -464 294
3695 294 266 -241 -155 -91 412 26 -491 187 251 -316 -80 448 -131 -506 264 392 -247 -346 269 161 -274 103
3717 103 88 -48 -154 -75 543 -202 -554 407 257 -210 -211 212 80 -409 325 322 -480 -170 266 263 -133 -303 122
3740 122 179 -121 15 280 -268 -389 442 384 -349 -412 317 231 -289 211 53 -348 -6 231 338 -305 -476
3761 -476 352 278 -138 -143 133 -51 -349 440 348 -584 -240 398 199 -233 -49 87 -129 -31 148 237 -269 -429
3783 -429 379 320 -261 -208 210 16 -343 387 245 -541 -94 281 186 -115 -233 119 14 -61 119 168 -182 -415
3805 -415 369 429 -398 -233 268 3 -171 251 77 -390 -53 241 221 -188 -318 193 167 -108 -60 168 -102
$$ packed form
3652C27l63l59N99l6m88N38j81p7o6k00Q99n01p43Q42J47n58O0N14m08m38P38
3673B46J72o11j24M19Q1k00k5j5K44m24J0R23q42m71R15nl81j83M92j17n68P58
3695B94k8n07Q6O4N03l86n17O78O4n67K36N28n79l75P70J28o39r9O15j08m35L77
3717A03j5j36j06P9O18p45l52R61j50m67jM23j32m89P34lq02L10M36ll96j70M25
3740A22N7l00J36K65n48j21Q31n8p33o3P29q6n20N00j58m01L42K37J07o43j71
3761d76Q28p4m16nK76j84k98P89r2r32L44O38j99m32J84J36k16R8J79Q9n06j60
3783d29Q08n9n81N3M18j94l59P30j42p86M47L75r5l01j18L52j05p5J80M9l50k33
3805d15P84O0q27J65N01k65j74M22j74m67L37K94k0m09j30N11k6k75M8K28k70
$$ plain form
3826 -102 -386 447 282 -523 -42 213 41 -125 8 139 -225 -51 186 108 -61 -356 207 277 -307 39 214
3847 214 -201 -232 297 268 -351 -112 159 48 4 -17 8 -109 -106 163 262 -155 -436 241 309 -212 -5 61 -158
3870 -158 -105 309 210 -404 -136 186 148 62 -263 -2 78 -101 190 128 -253 -284 291 325 -342 -87 125 -84 35
3893 35 93 20 -216 -54 206 74 -49 -239 99 213 -232 29 139 -144 -85 174 133 -280 -8 231 -64 -40
3915 -40 -39 48 21 -52 32 24 -42 -153 212 188 -331 -14 181 -32 16 23 23 -228 72 289 -104 -60 -184 20 337 -112
3941 -112 -64 -33 -168 117 255 77 -418 -171 339 108 31 -107 -284 -16 290 191 -136 -277 -214 295 435 -213
3963 -213 -260 -97 63 285 155 -92 -480 6 473 44 5 -306 -211 354 136 76 -175 -291 48 232 315 -271
3985 -271 -318 159 24 190 91 -236 -158 30 256 74 -105 -190 -107 260 78 -35 -20 -186 -18 182 179 -176 -150
$$ packed form
3826a02k84Q33j65q05M81K55j72j66J33J31l64J74K37p8j69k95N63P0n84L46J75
3847B14m15l1N29k9o19K39K71j11m4k1K5j17LK69R9m17k81O77O8n21K07O6k19
3870a58N3M14r9o14K68L22l8q6l25K61Q0j79K91o2l81l1N75L4o67K55K12k09J19
3893C5N8p3k36J62K60j32j23j90L38J14m45K61J10k83N9K59m1m13K72K39k95K4
3915d0JQ7k7p3Q4qo6j11L65k4n19L17J95k13M8P%k51L00K17l93M4j24K04L17m49
3941a12M8L1j35K85J38j78m95K47N10k31p7j38j77K68L06r9l27j41O3N09J40o48
3963b13m7J63J60K22j30k47l88M86M67m29l9l11R5N65k18o0k51j16L39J84Q3n86
3985b71m7M77j35J66r9l27P8J88K26j82j79q5Q3L67j82j13J5j66J68K00ll55K6
$$ plain form
4008 -150 79 -25 159 45 -158 -53 -27 143 69 -3 -125 -106 251 -34 -28 103 -171 35 59 100 -18 -144 139
4031 139 -88 67 108 -158 143 -97 -58 212 -48 -7 -76 33 47 -78 211 -102 -166 107 1 79 3 -89 -42
4054 -42 48 96 4 33 -130 -90 178 80 -85 -125 63 -23 31 196 -203 -57 88 -16 179 -96 -113 16 37 119
4078 119 -128 83 -88 -171 308 -45 -121 31 -61 102 -21 64 -66 -105 152 -71 119 -2 -225 171 35 -41
4100 -41 34 5 -40 -105 204 -23 -161 109 -64 41 88 -73 -11 -16 13 -7 120 -60 -165 146 12 -34 36 -26 -67
4125 -67 -29 189 -68 -81 67 -135 202 46 -147 80 -88 64 56 35 -40 -242 244 66 -104 152 -198 16
4147 16 130 8 46 -169 -13 48 103 68 -195 33 0 -24 163 -26 -135 -53 139 36 -40 61 -127 5 91
4170 91 -1 46 -97 -21 10 40 68 -106 71 -77 -69 186 -15 -42 -67 -17 50 12 123 -109 -98 49 34 182 -85
$$ packed form
4008a50K29j04J84j14k03J05K6J70p4p2j22J9L57k85OJ31k74K06K4M1j18j26K83
4031A39k27J55M1k66L01k40L9K70k60M1o9J09J4j25K89l13o4K73j06P8p6r2M7
4054d2R0M8r2K9j63M0K68r8j65m0J88q6N4J65l99J46J45j04J95k75j7J29K1Q2
4078A19k47K11j71q3M79l53p6J52r2J63j23Q5j30l9K57k23J90j21k23L96j36p6
4100d1P5k9m5o5L09k27j38K70j73J05M7j61O2nK9k0J27j80j05L11j34m6P0o2m1
4125f7L8K18k57j3J48k02L37j56j93K27j68J52qk1p5k02M86j78j70K56l50K14
4147A6J14j22L8k15J56O1N5l5k63K28l3k4J87j89j09Q2J92j03p6J01j88J32Q6
4170I1r2M7j43P6L1L0K8j74J77j48QK55k01k7k5N0O7l8J11k32J1J47j5J48k67
$$ plain form
4195 -85 -113 -14 -12 184 -22 -14 -103 -168 308 49 -98 -38 -161 120 87 111 -9 -293 42 150 120 38 -221 -97 66
4220 66 127 159 -26 -303 -118 283 185 -26 -195 -178 63 174 278 -193 -407 64 136 336 -6 -477 -22 46
4242 46 243 258 -291 -311 -85 398 325 -313 -173 -135 77 409 35 -278 -240 15 322 233 -221 -319 79 134 135 89
4266 89 -199 -227 37 368 56 -274 -4 -91 93 212 -121 -10 -141 -67 301 60 -169 -96 88 27 -47 162
4288 162 -41 -233 75 182 -22 -57 -10 -77 72 20 -27 165 -201 -96 245 -42 -86 -16 77 -20 -178 223 11
4311 11 -173 122 -81 23 51 -73 178 -88 -227 174 159 -83 -124 12 38 -46 147 115 -279 -146 261 122
4333 122 -16 -189 -138 217 1 52 120 -331 -96 269 182 -109 -320 117 132 -52 146 -107 -204 17 158 206
4355 206 -177 -271 161 148 -52 13 13 -120 -52 174 169 -174 -211 181 66 -79 44 -15 -47 -120 108 256 -218 -143
$$ packed form
4195h5k8R9KJ96k06Qq9o5M76k59j47O0j23K81l3K4j20k84L35J08l0q2k59J24J63
4220F6O1L2j85k77J85M01r8k11j69J7K41J11J04m71k14M71P2K00l42m71M55O8
4242D6J97J5n49k0K26M83p3o38J40L8K12L32l74l13L8K55L07q9m54r8L98N5Jm6
4266H9k88k8K64L31l12l30K70q7J84J19l33J11j31P4L68k41k29P3J84o1p4K09
4288A62k03j92L08J07k04l5M7o7J49n2m7J92l66J05L41k87m4P0R3r7j58M01k12
4311A1j84K95k03J04K8j24K51k66j39M01j5k42m1J36K6q4J93l2l94J33M07j39
4333A22j38j73N1L55k16N1O8m51K35L65q7k91k11M37J5j84J98k53r7K21J41M8
4355B06l83r4M32j3k00O5%j33O8K26nl43l7L92j15j45J23n9l2p3K28J48m74P5
$$ plain form
4379 -143 146 33 31 -23 47 -31 -204 207 230 -221 -173 98 148 -17 -50 64 -117 -112 254 134 -241 -156 80 226
4403 226 -5 -197 88 -36 -112 279 77 -260 -169 169 269 -166 -101 59 -88 105 118 29 -97 -262 202 293
4425 293 -198 -142 88 -4 -65 147 128 -256 -182 227 170 -80 -103 -56 40 37 45 168 -187 -341 279 301 -151 -174 2
4450 2 14 -19 203 87 -338 -132 191 236 -6 -321 -48 170 -41 107 120 -287 -213 270 251 -191 -183 52 38 39
4474 39 104 4 -143 -94 89 281 -83 -283 152 97 -127 115 126 -136 -181 126 197 -110 -44 22 -33 17 -20 194
4498 194 5 -343 65 260 -35 -104 54 -31 -162 135 241 -107 -241 3 187 75 -61 -50 -15 -111 45 315
4520 315 -68 -357 25 197 54 -41 -26 -64 -151 134 244 -51 -260 -116 219 146 -96 -16 -83 -158 120 296 -40
4543 -40 -313 -60 182 151 -27 -78 -57 -145 89 288 -15 -288 -136 243 135 -103 23 -116 -127 132 192 51
$$ packed form
4379a43K89j13kn4P0p8j73M11K3m51M8K71N0j65l3J14j81NL66j20l75Q5K36J46
4403B26k31j92K85j24p6L91k02l37R1L38J00m35O5J60j47J93J3q9j26j65M64R1
4425B93m91N6K30r2o1K12j9l84P4M09n7k50k3M7R6lQJ23l55j54O20K2m52k3J76
4450BJ2l3K22j16m25K06L23M5k42l15K73K18k11J48J3m07P4M83j9m42QK35j4J
4474C9O5j00j47M9J83J92l64k00M35n5k24K42J1k62m5L07P1l07O6O6n5N0l7K14
4498A94j89l48M08J95k95o9J58q5j31K97J06l48j34K44J84j12j36J1L5r6J56K70
4520C15l83k89L82J72j43r5J5l8q7K85J10k95k09J44L35p3k42Q0o7p5K78J76l36
4543d0k73K53K42l1j78n1K1q8K34J99l03k73J52L79j08k38J26j39j1K59O0j41
$$ plain form
4565 51 -283 -145 238 98 -49 -12 -36 -125 42 260 6 -264 -81 134 85 -4 -6 -76 -43 -22 161 150 -265 -95
4589 -95 178 11 31 33 -21 -123 -31 233 30 -101 -84 -32 181 -5 -22 84 -158 -97 230 123 -184 -118 61 25
4613 25 61 66 -77 -144 -41 163 124 -70 -223 4 197 -62 36 39 -235 -15 209 84 -139 -150 65 52 81 -15
4637 -15 -127 19 -70 88 169 -186 -134 111 94 -45 0 23 -131 37 123 -13 -17 -98 6 111 3 -68 10 14 -109
4662 -109 105 137 -158 -77 65 45 12 10 -39 -94 65 42 53 -2 -229 56 181 -29 -40 -49 -34 -3 132 84 -217 -32
4688 -32 69 93 100 -167 -86 71 35 95 4 -103 -108 115 171 -86 -71 -48 4 126 45 -22 -85 -33 52 114 46 -164 -15
4715 -15 58 0 105 -3 -95 -81 43 131 19 -53 -130 13 119 21 47 -111 -144 87 157 45 -168 -78 18 63 180
4740 180 -104 -130 -17 12 229 -8 -178 -53 55 150 -18 -39 -73 -103 170 50 -55 -16 -85 85 70 -66 -39
$$ packed form
4565E1l34J38L83j40j47L7k4q9J67K18k54k70J83K15m9q9kp0L3K1J83j1m15J70
4589i5K73j67K0Kn4j02R2K64k03j31J7N2K13j86j7J06k42O1L27j07l07O6J79l6
4613B5L6Nj43o7J03K04l9j94j53K27J93k59R8Lk74K20K24j25k23j1K15j3K9r6
4637a5j12J46q9J58Q1l55N2K45j7j39M5K3j54J68Q6j36mq1J04J05j08p1P8Mj23
4662a09K14L2k95Q1J42k0l3km9n5J59k3J1n5k27K85J25k10j1rJ5L1J35m8l01J85
4688c2J01K4Pk67Q1J57l6O0r1j07nK23N6k57J5K3N2J22q1o7o3N2Q5O2o8k10J49
4715a5P3n8J05j08r2J4J24Q8j12p2p7J43J06r8K6j58l3K31P0j12k13R0R6M5J17
4740A80k84k6J13K9K17k37j70J25J08R5j68k1l4l0K73j20j05L9o9J70j5j36K7
$$ plain form
4763 -39 40 -5 -50 64 16 -43 55 -22 -72 11 106 31 -37 -72 -87 182 108 -137 -23 -94 20 206 44 -150 -184 99
4789 99 160 52 -1 -239 -6 177 60 60 -152 -178 70 218 79 -159 -61 -73 46 256 -27 -145 -106 -33 202
4812 202 145 -82 -208 -42 126 118 156 -162 -287 80 220 120 -56 -217 -141 182 276 -1 -171 -237 9 357
4834 357 150 -201 -250 -1 176 190 83 -330 -188 217 154 97 -181 -234 91 166 120 -98 -151 -62 63 250 -47
4857 -47 -198 18 -11 79 99 -76 -77 -18 39 53 45 -61 -74 48 -1 -10 73 -25 -106 19 100 6 30 -32 -90 78 45 35
4885 35 11 -111 -16 90 80 -57 -66 34 -31 66 94 -119 -15 34 10 55 -36 -20 4 12 -12 -7 47 -64 -12 73 -59 28
4913 28 75 -51 -55 18 30 14 34 -68 -51 95 16 0 -2 -102 5 131 25 -105 -22 11 27 91 -32 -107 5 53
4939 53 54 28 -75 -90 104 66 -82 8 -15 -63 111 41 -73 -30 25 39 2 -2 -46 -9 77 -46 24 42 -117 55 73
$$ packed form
4763c9P9m5m5J14m8n9R8p7n0Q3R5p5o8l5j5K69p4k45J14p1J14J86j62j94l4K83
4789I9O1j08n3k38K33J83j17%k12k6K48J48j39k38R8j2J19K10k83j18L9P3K35
4812B02n7k27j26J66J68qL8l18j25L67J40j00j76j61P6L23R4k77j70o6K46L48
4834C57k07l51m9K49J77J4j07m13J42M05o3n7k78n3L25P5m6k18n3Q9J25J87k97
4857d7j51K16k9R0K0j75jN9N7J4qj06j3J22m9rQ3r8q1J25Q1r4K4o2n8J68l3j0
4885C5k4j22R5J06j0j37rJ00o5R7K8k13J04M9k4M5r1J6K4Qk4NN4j11N2Q5j32Q7
4913B8M7j26mP3J2j6K0j02J7J46p9j6kj00J07J26j06j30Q3L3J6O4j23p5J12M8
4939E3Jk6j03j5J94l8j48R0k3m8J74p0j14M3N5J4l7mm4L7Q6j23P0J8j59J72J8
$$ plain form
4966 73 -85 22 27 -54 -14 47 41 -19 5 -27 -22 88 -3 -37 24 -60 23 161 -70 -126 47 34 38 61 -48 -88 31 108
4994 108 47 -36 -92 -55 153 87 -106 -13 -36 -42 164 72 -141 -86 38 89 54 -11 -106 -36 58 54 73 -54 -163 49 150
5021 150 -15 -49 4 -71 -9 171 22 -88 -61 -33 113 99 -69 -35 -29 -12 97 121 -60 -172 61 96 -6 45 -55
5046 -55 -123 41 79 76 1 -146 -34 139 47 -33 -5 -81 -65 119 146 -87 -131 23 34 94 52 -106 -23 -45 17 199
5072 199 -27 -188 -19 110 37 -12 39 -111 -103 155 114 -7 -92 -103 91 108 -12 8 -29 -129 58 237 -18 -159
5096 -159 -11 41 60 85 12 -122 -76 62 144 96 -188 -153 126 65 39 51 -116 -140 106 239 -46 -157 -46 15
5120 15 156 45 -85 -39 -85 35 199 17 -216 -48 168 18 -30 39 -103 -48 88 69 -6 -69 -53 71 67 -98
5144 -98 29 88 -126 -10 124 4 -69 17 37 -68 48 97 -34 -37 -70 69 158 -117 -57 69 -18 3 94 16 -161
$$ packed form
4966G3j58J07Nq1M0O1oo0K4l2NJ10r1l4O1q4Q3J38k31n6J73j3MK3j09m0J19P7
4994A08o1q3n6L7K08o6j93R3k3oK06r2k13N5J24N1l5o5r5P0R4mJ9j27j09K12J01
5021A50j65l4N3p5O2J80j49j10K7K8J46j4j68L4OJ7J09K4j81j12K33L5j02N1j00
5046e5o8J64L8lp5j47J12J73r2q0K8p6J6J84K7k33m4J54J1O0m2j58Q3k2O2J82
5072A99k26j61J69J29p3m9N1j50QK58m1j21q5j1J94J7j20K0l7j00J87J79k55j41
5096a59J48N2J9K5p3j34M6J38Q2m8k84L5K79o1k6J2j67k4K46J33k85j11J11O1
5120A5J41j11j30M6m6J20J64j82k33J68K16j50m8O9j42N5J36j9p5o3J6J24mj65
5144i8J27N9k14J16J34j20p3Q6K0j05J16M9j31ll3J39Q9k75O0J26q7K1R1p8j77
$$ plain form
5169 -161 3 143 0 -46 -38 5 60 -24 -3 56 -57 -84 102 69 -132 26 83 -71 -51 80 57 -54 -40 9 33
5194 33 37 -34 32 -7 -119 112 128 -122 -125 80 93 -33 32 -40 -71 71 64 50 -79 -139 100 155 -49 -127 24 46 -41
5221 -41 125 16 -160 28 98 50 -34 -98 49 87 -23 -40 55 -35 -81 109 49 -132 -14 97 -33 -55 59 9
5245 9 4 -30 -57 128 -17 -80 69 -29 -54 51 102 -82 -158 144 80 -50 3 -98 34 89 4 16 -93 -100 131 192
5271 192 -81 -185 54 87 20 55 -60 -145 36 164 44 -58 -138 -20 210 12 -97 22 -73 4 122 64 -127
5294 -127 -124 116 30 20 28 -97 28 10 -4 128 -49 -133 48 108 -12 -6 58 -107 -43 147 72 -69 -92 -28 84 121
5320 121 -38 -94 -11 -38 102 161 -172 -155 79 116 55 -67 -66 -65 77 112 -45 -49 -93 35 185 -38 -132 20 50 -21
5346 -21 43 32 -105 26 65 -8 -17 -53 47 59 -39 -68 21 103 -60 -9 54 -117 65 108 -65 -59 -26 65 71 -33 -80 -33
$$ packed form
5169a61J64J40j43m6QM3N5q4K1N9j13k7J86l3k01J58N7j54K0J31k3j11J4M9K4
5194C3Mp1O6l9j12K31J6k50lK05J3j26O5p2l1J42pj4j29o0K39N5k04p8J51K2q7
5221d1J66j09j76J88P0m8q4o4J47L8j10j7R5r0m6J90o0j81J18J11j30k2J14n0
5245Inl4k7J85j45o3J49r8k5J05N1j84p6L02o4j30N3j01J32N5q5J2j09pK31O1
5271A92k73j04K39L3o7L5j15q5J81J28j20j02q0J18K30j98j09J19r5P7J18n8j91
5294a27LK40q6j0Qj25J25j8j4J32j77q4J81O0j20OO4j65O4J90p5j41k3O4J12L7
5320A21j59n6Q3k7J40N9l33J7K34L7o1j22JJJ42L5j57mm4J28J50k23r4J52L0p1
5346b1O4j1j37J31L9p3rl6J00J2r8k9Q9Q2j63N1O3j71J82M3j73OL3R1Oj04m7M7
$$ plain form
5374 -33 58 31 38 13 -112 -10 133 30 -92 -5 -2 -14 114 -7 -43 -2 -73 100 70 -57 -50 -22 49 -11 64 23 -161
5401 -161 23 72 9 74 -105 -79 55 42 44 -2 -87 -87 133 144 -84 -80 -15 0 109 76 -89 -114 37 45 85 0 -190
5428 -190 21 114 -6 42 -35 -93 13 119 12 -94 -2 -20 23 98 -68 -35 33 -19 16 71 -16 -90 78 8 -52 74
5454 74 -35 -39 25 -4 43 9 0 -57 26 75 -68 56 29 -118 86 70 -60 3 -13 -17 40 39 -30 -29 15 -14 38 38 -78 -13
5484 -13 93 -27 -23 68 -69 -17 82 -42 -4 16 -46 28 22 -1 -29 24 7 -57 82 -6 -87 65 -8 -24 32 -26 -10 26
5512 26 -5 -15 35 -1 -53 55 2 -57 29 4 -59 16 32 -34 -12 7 -27 29 30 -58 10 12 -27 37 31 -69 -16 64 -17 -1 19
5543 19 -63 -14 42 -8 -8 -7 -46 12 79 -24 -38 41 -33 8 81 -43 -42 13 10 22 19 -41 -45 41 0 -22 46 -42 -46 85 18 -49
5575 -49 23 -8 -35 43 14 -27 -28 -20 -15 51 4 -70 22 19 -38 60 27 -102 8 66 -7 29 -3 -64 8 66 -15 -24 -17 -67 36 95
$$ packed form
5374c3R1k7Pk5j25J02J43j03j22Q7Lj2J28j21l6M1p1J73l0j27PK8P1o0P5m1j84
5401a61J84M9o3O5j79K6J34j3Km6q5%K20J1k28MO5J5J09l3j65k5J51QM0q5j90
5428a90K11R3j20M8p7n8J06J06j07j06R2j8M3P5j66L3O8n2L5N5q7p4J68p0o0J26
5454G4j09mO4k9M7l4rn7Q3M9j43J24k7j47K04j6j30O3j6mN7jo9JM4k9N2%j16O5
5484a3J06j20MR1j37N2R9j24L8K0o2P4ok3k8N3j7o4J39q8q1J52p3j6N6n8J6L6
5512B6l1j0N0l6n2J08n3n9Q6k5o3P5J6o6K2J9l4N6Jq8O8Kl9O4oj00N3Q0q1J6K0
5543A9q2M9N6n0%Jl9N8O7j03j4P9p4M1P3j24JN5lJ2lo0mQ6m1k2O8q8mJ31o7o7
5575d9P2l1k7P8k9m1jQNO6m7p4R2ln7R8l3j29J10N8p3L6l2o1P2N8q1rPn0J03N9
$$ plain form
5607 95 -73 -63 36 -3 18 58 -73 -44 71 -1 -15 10 -48 -16 88 -27 -69 50 -6 -41 74 -26 -74 66 24 -44
5633 -44 -2 -7 -17 51 5 -93 16 38 -13 56 -19 -103 26 86 -30 -37 8 -56 44 86 -59 -49 7 -5 67 37 -68 -37
5661 -37 57 11 6 45 -67 -39 82 31 -16 -1 -44 -20 85 33 -38 15 -50 1 111 -10 -64 -18 -2 21 60 3 -101 -7
5689 -7 95 19 40 -63 -94 71 57 -2 -10 -82 -40 88 87 -76 -73 16 11 60 18 -105 -59 57 43 13 -29 -105 33 96 -49
5718 -49 -13 -20 -47 57 40 -26 -57 5 37 -6 32 -48 -18 64 -23 22 30 -52 -10 61 4 -42 34 -15 -38 37 -8 -10 16 -21 -7
5749 -7 33 6 -37 30 11 -65 85 15 -71 43 34 -18 -4 0 -24 19 44 -32 7 1 -49 78 38 -75 5 55 -20 -15 57 -64
5779 -64 -28 79 -14 -12 -2 -47 29 47 -38 -22 29 -18 -21 80 -30 -64 67 12 -29 26 -10 -33 27 7 -44 48 -51 -56 85
5808 85 -8 -51 40 11 -58 15 70 -49 -44 49 -44 33 23 -65 31 1 -18 55 13 -85 -2 98 -22 -43 44 -29 -20 64 -10 -39
$$ packed form
5607I5j68J0R9l9K1M0j31K9J15p2j4K5n8L2J04j15m2J19n6l5J15j00m8J40m2o8
5633d4M2nj0O8m6r8J09K2n1O9p5q4J29O0j16pM5o4J00M2j45J0N6j2P2l0j05L1
5661c7R4m6nL9j12K8J21n1m7J5m3K4J05n2p1N3o5N1J10j21n4M6J6K3L9n7j04R4
5689gJ02p6K1j03l1J65j4n9qp2M2J28jj63LQ9nM9m2j23M6J16j4l0m2p6J38O3j45
5718d9L6pk7J04j7o6l1O2L2m3L8q0L0Q2q7M5Qq2M2P1n7m6P6m9k3P5m5kK6l7J4
5749gM0k7m3O7j9p6J50p0q6J14rn2J4Mk4M3K5p6L9on0J27m0j13Q0N0p5NP2j21
5779f4L6J07r3KJ0m5P6J8q5J6N1m7lJ01j10l4J31n5m1N5l6k3O0k0n1R2r9nJ41
5808H5r3m3R1k9o9P3N5j19NR3r3P7j0q8R6l0j9P3m2r8Q3J00j20k1Q7p3RQ4p4k9
$$ plain form
5838 -39 0 -6 34 66 -72 -37 82 -12 -13 34 -50 -48 46 76 -50 -44 24 -12 59 -9 -42 22 -30 10 77 -14 -91 15 82 -31
5868 -31 -5 13 -54 28 29 6 -15 -49 5 59 34 -64 -5 48 -46 42 59 -68 -41 44 39 -5 -11 -19 10 51 -28 11 -4 -63 51
5899 51 82 -27 -59 26 42 -23 57 -13 -65 48 3 41 7 -91 23 56 -4 -38 13 9 -58 79 35 -81 12 26 2 16
5927 16 -34 -22 43 1 -25 73 -34 -76 71 31 -53 -6 34 -2 -17 66 -23 -26 39 -26 75 17 -90 66 47 -37 18 36
5955 36 -32 -48 83 5 -49 24 2 5 29 -33 -12 40 -22 -21 93 -48 -84 108 -5 -48 19 4 -14 -7 36 -26 -3 30 -49
5984 -49 70 -3 -83 80 20 -89 30 43 -47 -9 64 -38 -17 39 -23 21 -10 -38 23 28 -33 -27 55 -58 -52 96 -68 -54
6012 -54 60 -23 7 -6 -17 -1 -12 15 -22 20 -14 -56 83 6 -72 48 17 -50 28 41 -47 24 5 -6 39 -49 -8 41 -1
6041 -1 -13 -8 39 -52 -14 93 -70 -8 57 -45 43 -4 -18 31 -28 4 27 20 -44 -13 54 -33 -22 40 -25 -23 26 14 -7 10 -25
$$ packed form
5838c9L9oM0L2j38L5J19r4jM7q4KR4L0j26OO8l6P1o8l3O4n2M0O7r1p7J06O7j13
5868c1K6J8o7Q2Jk3k1l4N4N4k5r8N9N3r4Q8J7j27K7Q5nm4oqK9M1p9L9j5n9J14
5899E1L1j09l2Q5J6o5Q0p0n2J13m5L8l4r8J14L3o0l4N1mo7J37m4j16R3J4k4J4
5927A6n0J2O5m2k6R8j07m2J47m0q4M7M0l6j5Q3q9lO5o5J01n8j07J56j9q4N5J8
5955C6o8j6J31p8n4P3k2LK4o2K1N2o2JJ14j41l6J92j13m3O7j5j8PM3o2K3L3p9
5984d9J19p3q0J63o0j09J19J3r0L8P3j02K1N6o2M4l1k8O1No1OQ2j13OJ48j64J4
6012e4J14q3L0j3j1J6j1K7l7M2l4m2J39p7p8J20l1o7P8J3q8P1j9j1M5q8M1M9m2
6041aj2NM7r1L8J07j63O2O5j02Q8m7j4M9n9L2K3po4L1O7q7J1O2o5KM9j2k1J7l5
$$ plain form
6072 -25 -9 67 -38 3 51 -56 20 45 -18 -39 -10 47 -9 18 -3 -39 34 7 -1 42 -56 -23 81 7 -63 21 4 -21 53
6101 53 -3 -43 3 -2 23 8 -12 -36 10 69 -65 27 48 -90 49 46 -52 19 -12 -13 20 22 1 -13 23 -25 6 62 -47 -32
6131 -32 56 -32 -12 67 -53 -52 56 -3 -1 17 -57 -6 55 5 -41 -1 14 -29 73 19 -112 50 49 -29 26 -30 -34 49 37 -29
6161 -29 -29 -7 -25 61 36 -108 -32 66 6 -2 -3 -75 -4 98 1 -49 -11 -35 62 74 -82 -64 38 27 25 31 -75 -63 73 52
6191 52 -35 -16 -48 -20 82 15 -65 -4 -13 -8 91 8 -85 -16 16 1 28 3 -54 -21 38 27 35 -28 -90 27 60 -9 -13 -30 -58
6222 -58 70 104 -16 -77 -43 18 79 52 -77 -76 27 59 66 -16 -126 -20 97 54 -24 -65 -35 34 104 4 -75 -21 14
6249 14 81 52 -86 -60 41 52 23 -16 -47 -26 69 22 -53 -31 -34 28 40 -42 -51 29 15 -24 12 -18 -48 57 10 -58 -8 7
6279 7 -2 6 -13 -31 35 34 -55 7 11 -45 37 23 -62 7 43 -17 -32 7 -33 -2 45 -72 -33 52 -18 9 18 -46 -13 69 7 -74 14
$$ packed form
6072b5J6P6j05M1M8j07P6K5o3k1K9N7n6K7k1l6P3k7qM3r8L3J04p4p0Q4j7k5P4
6101E3n6m0M6nK5j5k0k4M6N9j34R2K1j38J39lr8P1l1jL3Kk1j4L6m8L1N6j09J5
6131c2Q8q8K0P9j20JJ08n9KJ8p4N1O1n0m6M0J5m3J02n4j31J62jp8N5n6mQ3j2o6
6161b9%K2j8Q6k5j44P6R8o0qjp2P1J02r7n0L8k4R7J2j56J8J02j1kOj06J2J36k1
6191E2q7J9l2K8J02o7q0O1rNR9q3r3O9L2j5K7k5n7L3N9j1Qo3o2J17L3o9mj7k8
6222e8J28L4j20o1L4O1O1k7j29JJ03L2Pq2j10J06J17m3p8m1L0O9P0j00p9N4L5
6249A4O7k9j38K6J01J1k9l9l1K1R5m7p5K2lO2J2q2rQ0j4l9L6l0l0J05m7o8N0J5
6279GrQj9j8O6jq9O2Mn6Q2j4q5O9L6o0j5L9m0L1M7j17L9Q5p0K7Ro4L3Q2o2q1Q8
$$ plain form
6312 14 -5 2 66 -58 -73 28 30 0 13 -49 -53 98 40 -89 -4 -1 -18 66 3 -79 -19 56 -19 -2 -2 -81 47 58 -50 -2
6342 -2 9 -19 28 47 -42 -53 63 -2 -29 28 -50 -3 51 -40 -19 26 -13 -17 21 -16 -36 51 -6 -60 12 1 4 21 -24 -42 23
6373 23 46 -39 0 -33 -38 70 3 -74 -38 23 24 11 -2 -73 3 88 -13 -15 -46 -48 59 35 -29 -71 -24 8 28 42 -70 -43
6403 -43 53 28 31 -17 -52 -5 37 18 -28 -27 -38 -16 50 -17 -24 1 -18 10 27 13 -33 -20 0 1 44 -19 -32 12 -13 26 36 -19
6435 -19 -43 10 41 3 26 -28 -50 30 27 -3 -1 -44 -14 41 29 -37 -14 -3 -24 51 30 -62 -15 8 -4 17 10 -45 -3 30 -18 19
6467 19 15 -72 5 35 -27 3 19 -45 -31 50 -6 -22 36 -43 -13 45 -8 -18 -3 -50 -32 71 22 -68 4 -11 -7 78 -5 -70 -12
6498 -12 22 31 35 -26 -87 30 66 -24 24 -44 -70 55 84 -46 -63 11 -19 32 60 -71 -42 20 6 32 0 -57 -24 72 6
6527 6 -46 39 -45 -21 66 -9 -40 21 12 -8 23 -20 -21 57 -9 -64 45 4 -19 19 -15 -60 23 68 -38 -17 8 -14 57 9 -49
$$ packed form
6312A4j9PO4j24j5J01Kl0J3o2mJ51n8j29Q5Lj7Q4o3q2O0P5p5J7%p9J28J1j08M8
6342bJ1k8M7J9q9j1J16o5k7N7p8M7N4r1K1M5l9mL8l7k0Q7n7n4P2j1LJ7m5j8O5
6373B3K3q5L9l3nJ08o7p7L6O1Jj3j3p1P6Q5j01kl1kJ07k4o4m2M7L2K0J4j12K7
6403d3R6k5Lm8l5M7M2j9m6Jj1K2O6o7pK5j9K8J7j4m6J3K0JM3o3j3M4k5L9J0n5
6435a9k4N3L1l8K3n4k2Q0ll0Km3L0N5j2o6K3J1k1P5k1r2M7K3j2K1pn5M2L3m8L7
6467A9mq7P7L0o2L0J6o4J4Q1n6j6N8p9L0N8n3j0J5m7J8J03m9r0P2j5MQ5q3o5N8
6498a2L4RMo1o1J17L6r0M8o8k6J25K9j30j7P4l0N1K8j31K9O2j4K6l2n7L3R6o6
6527Fn2Q5q4K4Q7p5l1O1rk0L1m3jP8o6n5J09m1k3L8l4m5Q3M5j06K1K5k2P1m8n8
$$ plain form
6558 -49 -2 11 9 36 7 -42 -15 75 -5 -28 16 -19 4 22 -2 -18 9 7 -1 22 -29 14 43 -43 -11 25 25 0 -27 -6 -15 42 47
6591 47 -38 -16 -23 36 83 -70 -73 3 38 48 -15 -48 -44 47 75 -7 -52 -60 36 89 -2 -77 -29 28 25 48 -30 -90 45 59 8 -24
6623 -24 -60 24 42 15 -19 -35 32 1 49 3 -80 49 64 -35 -9 1 18 17 9 -53 -5 62 -15 -11 -17 -38 78 48 -46 -80 54
6654 54 66 -3 8 -88 -44 115 18 -46 -64 -63 81 98 -44 -142 1 91 22 43 -70 -118 80 116 -3 -74 -52 6 104
6681 104 49 -115 -41 31 18 81 -14 -80 -7 96 16 -55 29 -25 -12 73 -44 -4 26 -31 7 18 -4 11 43 -39 -71 87
6709 87 48 -43 -18 -22 17 88 40 -86 -49 44 42 78 -63 -123 67 87 17 -44 -53 -1 59 103 -44 -102 25 49 65 -24 -110
6738 -110 16 90 20 -40 -44 -24 53 88 -45 -107 5 82 45 -50 -74 -19 87 78 -55 -65 -35 55 124 -47 -111 -33 73
6765 73 92 -26 -78 -45 33 92 25 -63 -73 -14 100 26 -63 -42 -6 34 39 2 -37 -16 13 36 16 -28 -7 3 -25 8 65 13
$$ packed form
6558d9M7J3kK7k9m9K7R0q0k3M4l5K3J8k4j6K7kqK3n1M3K9q6L2L6%k5k7K1rN7N
6591D7q5K2pN9M7j53lP6L5J0o3l3MR1K8q2m5qR6N3r1p5M8N7lK3p8o0J35J4n1l2
6623b4l6Q4J8k7l4j6O7l1M8m6q3J29J5r9K6J0J7jqo2M8O7p7Mok1J16l0r4l4J34
6654E4J2o9J1r6M4J59r7o4j8JJ44J7j42r8J43R0o9K1j13m8J98L6j19p1K2N8R8
6681A04n5j64P4P2j3O3r5o6P3J03q0p1Q4n4J3Q5j17M0L0n7L8J1k2J5L2q2l2J58
6709H7l9r1K5mL9P1m8j26L7R3kL6j41o0J90K0p0o1rN2O0M4j47n8J27K4J6q9q6
6738a10J26P4p0o0mK0P7L5j33o2J12P7l7r5k4N5J06rj33j0L0R0O9j71o4P8J06
6765G3J9j18n2L3P8N9o7q8j0N9J14p4q9K1L6M0Nl7l9K1K9K3k0m4K1J0k8L3N7n2
$$ plain form
6795 13 -66 -38 38 25 45 -19 -106 3 74 67 8 -113 -55 91 97 -35 -83 -59 7 104 67 -89 -98 28 85 58 -33 -98 -4
6824 -4 118 26 -25 -32 -53 47 99 -37 -90 -4 43 15 17 -49 -53 50 29 -32 4 -20 -6 73 -3 -77 29 49 -30 -5 9 -27
6854 -27 42 45 -65 -13 32 16 12 0 -65 18 84 -18 -34 14 -20 18 55 -40 -64 27 19 -6 14 -42 -31 67 2 -48 12 8 -1 46
6886 46 4 -69 20 35 -12 2 4 -30 52 17 -53 4 14 -5 21 20 -42 -1 54 -17 -25 27 -4 24 36 -15 -15 26 11 7 10 -33 -4
6919 -4 59 9 -27 8 3 23 31 7 -37 9 23 11 9 -11 -22 41 8 -11 2 -9 -4 26 21 -20 -18 -1 7 20 -4 -25 5 -5 13 15 -6
6954 -6 -23 1 22 4 2 -1 -23 12 13 23 22 -21 -3 15 5 11 2 2 -38 15 32 -9 -18 -13 -16 32 35 -12 -11 -11 -9 46 28 -52 -19 30 22 16 -17
6993 -17 -35 -25 56 27 -7 -1 -55 34 74 -44 -44 1 -7 16 21 -17 -56 43 34 -36 16 -7 -7 59 -8 -34 31 43 -13 22 -12 -39 85
7026 85 53 -65 -49 23 30 45 -6 -87 -20 95 38 -14 -43 -86 47 114 -9 -94 -38 14 51 83 -57 -104 35 66 34 12
$$ packed form
6795A3p9K8P6j3K0o4q7J09P1pn9j21N8J46Oj32m8K4O6R7l7j56rJ26N7k7r1o5R4
6824dJ22r2n1pk1J00N2j36n3Q6M7k8Ko6mJ03k1o1L6k4J4P9p6p4J06K0p9K5J4l6
6854b7O9Lj10N2M5j6mj2o5Q3O6j02j6M8l4L8L7r5k4R1qk5K0n6J1R8o5n0O0mrM7
6886D6m2p3Q9J5m7J4Kl4Q2l5p0N7J0j9K6jo2M1N5p1qN2l1K8J2n1%M1j5mLm3K9
6919dO3n0l6L5nK0Qk4m4M6J4j2kk0j1O3l3j9J3j1NL0nm1KJ7QJ3k4k1L0j0J8Kk1
6954fj7K4K1j8klk2L5JJ0jm3J8J8j0Or%m0N3J7m1rNlM8Lm7J%KN5j8q0L3M9qol3
6993a7j8J0Q1k9l4On4Q9M0j18%M5qK3Nl8l9R9rp0N2k3%O6o7k6O5J2n6L5l4k7J24
7026H5l2j18J6P2PJ5n1q1O7J15n7n2k9m3J33O7j23q5N6N2L7L2j40m7J39L1l2k2
$$ plain form
7054 12 -75 -49 65 53 -42 -19 -20 -30 64 36 -65 -8 6 -7 15 28 -14 -4 3 -17 45 66 -50 -33 2 17 58 48 -76
7083 -76 -71 63 77 9 -47 -88 0 118 44 -60 -75 -9 71 93 -30 -127 8 92 43 -5 -77 -48 74 90 -21 -82 -24
7110 -24 48 88 4 -89 -12 63 49 11 -59 -39 42 70 -11 -81 -19 56 57 -8 -59 -19 35 53 -2 -50 -26 48 64 -14 -56 -18 30
7141 30 55 -12 -49 -24 27 48 -13 -46 -24 50 48 -31 -38 1 30 35 -26 -54 7 53 12 -45 -35 -21 63 56 -74 -44 40 60 25 -27
7173 -27 -52 -6 98 31 -63 -36 -7 89 80 -67 -90 20 56 32 -10 -61 -38 115 60 -44 -53 -3 53 69 -20 -99 11 76
7201 76 14 -8 -36 -57 56 73 -44 -44 19 12 16 32 -68 -7 81 -7 -31 9 -22 17 38 -55 -63 68 39 -47 -13 -39 10 84
7231 84 -1 -92 -38 63 52 28 -59 -110 70 102 -23 -52 -71 13 122 64 -107 -110 59 94 45 -30 -131 -4 121 47
7257 47 -50 -73 -40 51 120 -26 -108 -7 27 44 37 -71 -53 27 70 9 -25 -16 -29 42 15 -47 20 -4 -25 13 8 17 -9 0 -19
$$ packed form
7054A2q7K6J14j2r5K3jj0R4k8j01N7J4j3K2J3m2J0Pk0O2K1j16J7L5J5M1j0j24
7083g6NJ34J4o8n6m1Q8J18p4j04j5O6Q0K2j23r7J35Q4m9m8p2K9J22J6j11o1N8
7110b4P2M0q4r3P7P5j4l8p0K0Q1K8q1p0O2P5Jo5n1M0N4J8n5m8K4P4J6p8m2L8M8
7141C0K5o7l7K5N1K1o1l3K2P4kp9pL9K9No1k8O1M6m1n7J0J4Q4pj30L0Q4K0l5n2
7173b7k5M6J04o7r4K7K9R6rj47k3J10L6k4m2n1K3J53n5j04rN0N6J6q9p9J10O5
7201G6o2k2k8k1J13J7j17%O3pMJ6j00O1Q8q8k4M0l1L9K1r3qJ31k9q6L4k6M9P4
7231H4q5r1N4J01j1k4q7n1J80L2j25k9j9Q4J09n8j71lJ69L5m9p5j01J27J25p4
7257D7r7k3L3R1O9j46q2J01L4J7pj08J8Q0M3o1l4Rj3P1k7o2O7k4k1L8nRk6Rj9
$$ plain form
7288 -19 2 39 7 -21 -42 -2 68 36 -19 -72 -2 40 36 24 -62 -29 55 67 16 -70 -21 57 45 39 -52 -46 27 54 27 -65 -39 29
7320 29 49 14 -48 -26 27 39 4 -36 -18 6 65 2 -66 -16 34 47 13 -52 -24 15 69 13 -51 -15 -13 73 62 -76 -42 18
7350 18 48 44 5 -48 -35 69 46 -24 -14 -43 15 72 1 -32 -2 12 -5 56 9 -70 16 17 -18 41 14 -28 -16 23 6 18 36
7381 36 -56 -4 63 -21 13 15 -64 9 77 12 -30 17 -22 2 63 -12 -50 11 -10 16 40 -9 -64 53 47 -31 25 -14 -52 42 34
7412 34 -15 -7 -11 4 17 29 -22 11 39 -35 29 36 -42 6 44 -9 -6 32 -10 -20 30 -14 -6 28 2 -7 21 -11 -14 34 -2 -59 32 29
7446 29 -23 9 -6 -31 12 29 5 -19 -11 -7 38 34 -49 -10 26 7 20 2 -27 -12 49 31 -24 -13 -5 34 28 -5 -23 -5 15 29 16
7479 16 -8 -19 38 42 2 -2 -2 19 11 13 -4 -18 11 26 -1 -6 3 19 14 2 13 8 19 -3 -13 6 20 4 23 -23 -27 30 47 -5 -39
7514 -39 -21 9 52 22 -50 -24 16 45 46 -22 -94 2 98 29 -49 -43 -33 47 79 -8 -72 -15 53 55 38 -58 -61 73 62 -2 0 -38
$$ packed form
7288a9K1L7l2k8k1M0P0l2n5n3P0M2mj2q6L3Q4J2n1q6M9P8j2or1OP3K7k7r2K6O8
7320B9K0l5o2K2N3J2l5m0J8K4N9o3o8N0N0J3l4o5K8L9N4n6o4L6KQ6j1j38L4O0
7350A8L0ml9n3J3J04k3p0J0k9N8N7p1l3L0J4j7O1m7p9Q6Jl5N9k7m2J2L9j7J2J8
7381C6r2N2O7q4L4Kp9P3O8o5m2M7l9K4O1p5l8O1k1K6K4m9n5J17op8N6l9l8R4q
7412C4m9QmJ5J3J2n1L3K8p4O4Pp8M8L8n3LL8m2j0N0m4QL4k6rK8l2lM8l6n7R1l
7446B9n2L2j5k5M3J7k4k4QMM5mq3L9L6j9J3j8k9J5O1j8n5J1QL9ol3j8J8K0J4j3
7479A6k4j1N7Mm0m%K1qKj7j4K9J5k7nRJ6nj2J1nJ1k2j0J9J4j6J9m6mN7J7n2l4
7514c9J8L0M3l0p2K6M0K9Jo8p2R6R6o9p8OJ0Q0L2q7o4N7O8Kj7r6lJ34j1o4Kl8
$$ plain form
7546 -38 -18 79 45 -57 -34 36 2 33 5 -55 20 50 -16 9 14 -28 6 37 -24 -8 64 -22 -34 35 14 7 22 -28 -16 50 34
7577 34 -14 8 -18 6 91 21 -67 17 64 13 34 -7 -51 42 76 -21 -29 -8 13 74 29 -70 -36 79 42 -3 -5 -73 15 124
7607 124 9 -70 -48 15 76 53 -60 -104 36 106 34 -7 -77 -50 125 105 -50 -82 -21 49 73 16 -92 -42 57 60 30
7634 30 -48 -75 18 88 16 -43 -18 -14 22 62 -3 -32 -8 12 32 15 3 -22 -8 17 7 37 8 -54 -18 25 44 12 -39 -47 -7
7665 -7 73 36 -34 -61 -15 70 55 -20 -75 -25 59 63 13 -68 -62 48 91 10 -94 -38 33 61 35 -38 -72 23 83 34 -34 -60 2
7696 2 72 48 -42 -40 6 29 23 -4 -54 -4 63 31 -33 2 0 15 48 -26 -46 19 29 1 6 -19 -16 45 20 -51 6 28 -15 15 -5
7729 -5 -48 24 45 -27 -21 18 -7 41 20 -63 -14 52 9 -21 2 -17 3 62 -1 -63 12 18 25 26 -40 -44 48 46 -14 -2 -17 -18 56 36
7763 36 -66 -15 45 6 18 13 -47 14 57 -14 -13 2 -31 35 49 -37 -39 38 6 -7 30 -21 -18 40 12 -10 24 -2 -15 36 6 -32
$$ packed form
7546c8K0R7l4j02K3P0l4L1k8o0P5L0o6K5Nm2L4L1o1J6P2q6j2O9k1pJ5n0J2O6j6
7577C4m8K2k6K4Q5p0q8Q4M7n1K1m1m4R3L4r7qK1K1O1m5r9L4J15l7m5ko8Q8J09
7607A24j15p9K2O3O1k3j13m4J40P0p2m1p0K7J75k0j55l2O1P0K4n7j08N0R9Ll0
7634C0p8k7R3P0p2n9K5ML6M0o5k9K4K0K0j7j2k5J4K5j0L0k9o2L6M3J9l2n1qM0
7665gQ0l7p0k7M6Q5j5p5n5N0Q4Mn0q1OJ10M3q1j04N6P1K8k6p3l4R5O0m9o8k6O2
7696BP0k4r0KM6K3ok7n0N0O7l2o4L5kJ5L3p4k0O5J0k8Nk5LO1k5p1N7K2m3L0k0
7729em3P2K1p2OL9k5M8k1q3M9O6m3l0K3j9K0N9o3o2P5OPJo6mR2ko0J2j5jP4k0
7763C6j02N1O0l9J2no0O1M3p1JJ5l3O6J4q6kP7l2j3L7n1LN8k8k2L4k6j3N1l0l8
$$ plain form
7795 -32 27 12 -32 17 37 -14 8 12 -27 7 46 -14 -17 6 -5 28 23 -35 -9 36 19 9 1 -30 -17 64 23 -42 -19 4 21 29 -6
7828 -6 -59 -14 36 19 7 -38 -42 36 40 3 -30 -27 -8 17 48 -12 -40 -6 27 33 -10 -23 -21 14 41 -7 -8 -20 -22 27 20 -18 -13 19 15 1
7864 1 26 10 -24 18 11 4 -5 2 -6 12 23 3 4 23 -14 12 25 0 -3 21 -3 -13 35 2 -20 27 -8 -12 37 -5 -20 3 2 -7 22 11
7900 11 -34 14 22 -10 25 17 -32 9 28 1 -17 29 -11 3 31 -22 -15 30 -8 8 54 0 -37 33 11 -12 33 -12 -37 24 13 -5
7932 -5 11 1 -28 27 39 -38 0 8 -37 38 34 -45 2 24 -2 -1 23 -39 -17 39 2 2 8 -24 -3 41 -2 -43 19 -2 -14 34 -12
7965 -12 -42 37 22 -10 -3 -24 -9 50 40 -37 -6 22 -18 36 12 -44 2 55 12 -15 15 -12 5 53 -16 -15 1 0 18 12 -10 -29
7997 -29 21 27 -27 22 -16 -19 21 8 -24 -15 4 -7 -10 6 -20 -1 23 -23 19 20 -4 0 -1 8 -8 29 1 -31 -1 18 18 2 -18 -9 7
8032 7 18 2 -26 -6 -12 35 28 -26 -17 15 35 5 -5 -13 -22 34 26 -16 -25 -6 18 29 5 -23 -11 27 15 11 7 -31 2 38 13 -15 3
$$ packed form
7795c2N9j5m4M9K0n1K2Ml9L4L9o0lK3j1L3nn8K6M5j7j0ql1J3Q1m1o5K3K3J7Ql5
7828fn3M5N0j7j2m5mP8Ml7l3LJ9K5L1o0k8L4L3Om3j3KL5K7m8jj2kM9pl8NL2mj4
7864AK5j6l4M2pprPqJ8J1k0JJ9l7K6J3k5lK4k4j0M8l3k2M7l5mM9m2j5K3jrK9j1
7900A1m5M8Ql2L5qm9M1J9k7j8M6m0J4K8n3PM5l8J6M6n4l7P0k2k3M5m5k5O1j1j8
7932eJ6j0k9N5J2p7L8Qm5P5mp9M7K2k6JK4o2K2N6l7%Ol2K1M4m3m1O2k1j2M8m6
7965a2l0P9j5l2Pk1J5N9j0p7L1K8m0N4k4n6M6N3m3k7L0k7J7M8o9JJ6jJ8ok2j9
7997b9N0On4M9l8lM0j3l2RJ9j1lJ6k6J9K4m6M2Jk4MjRj6L7k8l2L0J9%j6k0RJ6
8032GJ1j6k8K0oM7pn4RL2K0l0j0qrN6qm2rJ9K4J1k4k8J2L8j2mml8L3L6k5k8J8
$$ plain form
8067 3 1 -19 35 11 -30 3 -1 -7 30 1 -30 -7 24 4 21 23 -52 11 51 8 -2 -9 -30 9 73 16 -48 11 7 48 62 -31 -55 30
8101 30 53 19 31 -33 -53 75 63 -37 -29 -6 2 63 24 -49 -26 27 35 36 12 -74 -17 78 7 -22 -15 -44 14 79 1 -52 -5 -1
8133 -1 29 49 -33 -45 20 42 12 20 -22 -50 48 67 -28 -16 -8 -6 56 38 -40 -24 19 19 27 26 -53 -23 67 25 0 13 -38 2 73 28
8167 28 -31 -24 -3 23 71 -11 -52 -9 32 29 23 -31 -57 36 76 -3 -22 -30 -22 55 52 -11 -45 -8
$$ packed form
8067Ckk0N4k4m1L3moL7k9l1K3L1k0J7Kp5O3M0m3j0pk1L9O4n7o4N9mM1J4r3k4Q5
8101C0K3l4J2o4k0J28j2j00QK3QO1l9p3K3N3QJk4q6N7R5p1k9Pk9N8O5p8n3M7M
8133aL0K0q2j2O5K2l0Qm2k8R8J9r5J2QKO2j8p8J6M3%Qjp9L0R0m2k5J3n1M0P1m5
8167B8n9PK1K6M8q2m1M3M1lon4k6R3M0p9j9qQP7lo3l4L7
8191h
$$ Imaginary data points
##PAGE= N=2
##DATA TABLE= (X++(I..I)), XYDATA
$$ plain form
0 0 0 0 0 0 0 0 0 -8 8 -8 8 -16 16 -24 25 -32 40 -49 59 -70 81 -97 113 -132 153 -175 202 -231 264 -298
30 -298 338 -382 429 -483 542 -605 673 -750 833 -926 1026 -1137 1256 -1391 1539 -1704 1887
47 1887 -2093 2325 -2590 2890 -3244 3659 -4156 4765 -5526 6511 -7826 9660 -12277 22743
61 22743 -231116 35595 24725 -59515 129642 -88016 36625 -57349 -2785 126361 -70080
72 -70080 5590 -75089 -26048 161549 -77181 -30913 72795 -50697 -41203 84594 -1308
83 -1308 -96048 44153 17612 9499 17991 -43935 40473 -40279 -9335 12589 -1790 71902 -109944
96 -109944 46356 78890 -138958 83791 8343 -69423 21416 964 79087 -51684 -21283
107 -21283 19730 -38557 61841 -52932 15701 32708 -73816 73494 17241 -32469 -52137
$$ packed form
0@%%%%%%%qJ6j6J6k4L2m0M9n7P2q9J08j29J51j78K10k45K85l28L77m33M95n62
30b98O36p20Q11r12J025j147J278j423J583j759J952k163K393k647K930l243L591
47A887l980M418m915N480o134O903p815Q921j0291J2037j4337J7486k1937L5020
61B2743k53859K66711j0870q4240J89157k17658J24641r3974N4564J29146j96441
72g0080P5670q0679M9041J87597k38730M6268J03708j23492R494J25797q5902
83a308r4740J40201k6541q113Q492o1926Q4408q0752L0944K1924j4379P3692j81846
96a09944J56300L2534k17848K22749p5448p7766R0839k0452P8123j30771L0401
107b1283M1013n8287J00398j14773O8633J7007j06524J47310n6253m9710j9668
$$ plain form
118 -52137 11444 79108 -87132 42639 26918 -59088 61374 -46013 22243 -5727 -62429
129 -62429 86755 -16515 -10640 -4427 -4972 58852 -77633 -465 42999 -37960 27806 17340
141 17340 -5881 -32387 -1571 36582 -5562 -31299 -23673 60857 1303 -19515 26196 -53178
153 -53178 17683 -3060 9246 44122 -91407 43237 41602 -32223 19389 -66096 46055 -558
165 -558 -40048 93623 -62578 -14603 42438 -28208 28621 -47207 4233 37883 -22191 17643
177 17643 -12090 16417 -15461 -32458 48170 -17039 -24625 33523 18883 -34151 -6942 38652
189 38652 -34946 142 7030 -18507 45152 -17125 -8090 15163 -23374 -1071 1116 35531 -39158
202 -39158 -24148 81575 -36784 -16780 26037 -39566 10080 15644 7191 -8389 -4959 6096
$$ packed form
118e2137O3581O7664j66240J29771j5721q6006J20462j07387O8256k7970n6702
129f2429J49184j03270N875O213n45O3824j36485P7168M3464q0959O5766j0466
141A7340k3221k6506L0816L8153m2144k5737P626Q4530n9554k0818M5711p9374
153e3178P0861k0743J2306L4876j35529J34644j635p3825N1612q5485J12151m6613
165e58l9490J33671j56201M7975N7041p0646N6829p5828N1440L3650o0074L9834
177A7643k9733K8507l1878j6997Q0628o5209p586N8148j4640n3034K7209M5594
189C8652p3598L5088O888k5537O3659o2277R035K3253l8537K2303K187L4415p4689
202c9158J5010J05723j18359K0004M2817o5603M9646N564q453j5580L430J1055
$$ plain form
214 6096 -8838 36917 -37263 -36755 58513 -12884 -10313 28674 -8253 -32600 8569 39863 -42964
227 -42964 -1822 27363 -28771 38318 -2147 -34157 22154 -12201 -12429 18321 21129 -29677 -8889
240 -8889 50232 -36456 -14092 37777 -33453 -6244 26875 511 -2918 7226 -14830 -17166 31783
253 31783 -13653 -15702 36709 -24594 -11216 40002 -4732 -35530 2202 19341 -19590 20677
265 20677 19417 -39591 13385 7488 -14664 20139 -14113 -21526 19597 24063 -14781 -6640 15948
278 15948 -33409 892 37581 -20312 -8266 12878 -3919 3097 8554 -11047 -16158 12229 -1982
291 -1982 1647 25605 -19067 -15223 17789 -4617 -9337 9160 3147 -15013 9605 16650 -11808
304 -11808 130 -6286 -12364 12349 5348 877 4188 -5374 -8962 5213 12073 -12345 -8676 6575
$$ packed form
214F096j4934M5755p4180N08R5268p1397K571L8987l6927k4347M1169L1294q2827
227d2964M1142K9185n6134O7089m0465l2010N6311l4355k28L0750K808n0806K0788
240h889N9121q6688K2364N1869p1230K7209L3119k6364l429J0144k2056k336M8949
253C1783m5436k049N2411o1303J3378N1218m4734l0798L7732J7139l8931M0267
265B0677j260n9008N2976n897k2152L4803l4252p413M1123M466l8844Q141K2588
278A5948m9357L4301L6689n7893J2046K1144j6797P016N457j9601n111K8387j4211
291a982L629K3958m4672L844L3012k2406m720J8497o013j8160K4618P045k8458
304a1808J1938o416o078K4713p001m471L311r562l588J4175O860k4418L669J5251
$$ plain form
318 6575 -765 10486 9552 -8664 -13903 -6577 9863 10469 -654 -8232 -4760 7253 7978 2403 -10132
333 -10132 -15023 832 13149 14922 -1515 -17777 -4263 8963 3745 -39 -3509 -11896 1905
346 1905 22263 2941 -13764 -5251 -7223 2420 16395 -1830 -10437 5074 1126 -2308 9632
359 9632 -6761 -17476 10374 8941 -6692 11355 2269 -19255 4116 7442 -11035 7473 7735
372 7735 -15071 5203 14982 -11942 -2120 6343 -18881 2805 24780 -9245 -7218 11002 -12853
385 -12853 -3159 19371 -12182 -14471 18553 9 -6349 17780 -11428 -19894 18932 1171 -15089
398 -15089 16516 2541 -16251 15419 3569 -23330 11259 9608 -20239 10528 12675 -16328
410 -16328 10259 9587 -27037 254 20718 -10796 1111 13014 -20636 1583 26663 -16754
$$ packed form
318F575p340J1251r34j8216n239P326J6440O06j1123p578L472J2013P25n575j2535
333a0132m891J5855J2317J773j6437j6262J3514J3226n218l784l470q387J3801
346A905K0358j9322j6705Q513j972R643J3975j8225q607J5511l948l434J1940
359I632j6393j0715K7850j433j5633J8047r086k1524K3371L326j8477J8508K62
372G735k2806K0274R779k6924R822Q463k5224K1686K1975l4025K027J8220k3855
385a2853R694K2530l1553k289L3024j8544o358K4129k9208q466L8826j7761j6260
398a5089L1605j3975j8792L1670j1850k6899L4589j651k9847L0767K147k9003
410a6328K6587o72l6624K7291K0464l1514J1907J1903l3650K2219K5080m3417
$$ plain form
422 -16754 -15316 11715 -7752 5249 25361 -16076 -22421 18102 3205 -9161 13529 -12972
434 -12972 -16271 28945 8860 -19038 1735 -4322 -10557 20014 8244 -23696 5501 13202 -11613
447 -11613 9095 1633 -23455 7715 16614 -9248 252 9788 -13064 -2141 14961 -14542 -4069
460 -4069 16694 -9054 -1744 11938 -6245 -5395 6646 -6792 -9366 17297 3240 -11212 8629
473 8629 -6445 -5557 14218 -3911 -13191 2249 10773 1261 3072 -2443 -18403 7972 12163 -6433
487 -6433 2 -5843 51 11781 5547 -10574 -14616 7755 5073 4214 5059 -14437 163 7722
501 7722 3327 -1109 -13433 1020 5455 7766 3611 -10975 473 -2593 2859 5133 -7885 2455
515 2455 -1937 5765 5627 -10376 2895 -2163 -3443 1393 4054 6465 -8782 4580 -1957 -8202
$$ packed form
422a6754J438K7031j9467J3001K0112m1437o345M0523j4897j2366K2690k6501
434a2972l299M5216k0085k7898K0773o057o235L0571j1770l1940K9197P701k4815
447a1613K0708p462k5088L1170Q899k5862R500R536k2852J0923J7102k9503J0473
460d069K0763k5748P310J3682j8183Q50J2041j3438k574K6663j4057j4452J9841
473H629j5074Q88J9775j8129r280J5440Q524r512J811n515j5960K6375M191j8596
487f433O435n845N894J1730o234j6121m042K2371k682q59Q45j9496J4600P559
501G722m395m436j2324J4453M435K311m155j4586J1448l066N452K274j3018J0340
515B455m392P702j38j6003J3271n058j280M836K661K411j5247J3362o537o245
$$ plain form
529 -8202 12857 -5156 -3710 506 -1976 10757 2582 -2869 -16746 2387 15757 -10311 10197
542 10197 -4388 -16786 17727 7664 -5906 -12973 -1564 5844 4697 15636 -19796 -7068 15306
555 15306 -10267 11174 -379 -18811 3906 16932 5728 -20034 7061 -679 -13341 24697
567 24697 -9995 -10961 13608 -4806 5435 -268 -6783 -7795 9997 11624 -23721 13652 9415
580 9415 -20444 15679 -130 -16081 2906 13346 -1966 -8446 10686 -12907 6338 13380 -24749
593 -24749 8451 5607 -7564 7888 6053 -4581 -21416 23021 2700 -25109 27451 -13168
605 -13168 -6013 19889 -15458 7871 -3550 -6510 1331 2556 14368 -21073 12184 7854 -31133
618 -31133 24721 6651 -19492 3172 3085 3630 882 7804 -14436 -7319 12514 -6582 15391 -2972
$$ packed form
529h202K1059j8013J446M216k482J2733q175n451j3877J9133J3370k6068K0508
542A0197j4585j2398L4513j0063j3570p067J1409P408j147J0939l5432J2728K2374
555A5306k5573K1441j1553j8432K2717J3026j1204k5762K7095p740j2662L8038
567B4697l4692r66K4569j8414J0241n703o515j012J7792J627l5345L7373m237
580I415k9859L6123j5809j5951J8987J0440j5312o480J9132k3593J9245P042l8129
593b4749L3200k844j3171J5452j835j0634j6835M4437k0321k7809N2560m0619
605a3168P155K5902l5347K3329j1421k960P841J225J1812l5441L3257m330l8987
618c1133N5854j8070k6143K2664q7N45k748O922k2240P117J9833j9096K1973j8363
$$ plain form
632 -2972 -21546 9278 14180 1460 -19075 7635 -2637 -12746 35031 -9660 -17162 5486 -6909
645 -6909 20013 -5688 -10040 -294 -1132 17139 -11531 8922 -4860 -25960 28874 2047 -9507
658 -9507 -616 -2022 10895 -11669 10815 -3194 -13414 12954 -10402 17283 -2309 -18451 19326
671 19326 -10105 237 170 586 10052 -21809 15903 6890 -15341 9000 -8150 4881 -2557 -2782
685 -2782 15540 -9585 -5242 2175 7085 -3051 -8871 8536 -3525 3465 -2114 4250 5121 -23565
699 -23565 16035 4556 -10420 7085 -9627 18230 -12794 -6506 24032 -27672 10489 4107
711 4107 -9142 19978 -23939 11824 9428 -21025 11086 -4161 8826 -7844 -6594 24493 -20425
724 -20425 -856 13815 -11289 -419 50 6862 -711 -1940 -3190 817 10186 -17743 6583 11283
$$ packed form
632b972j8574L0824M902j2720k0535K6710j0272j0109M7777m4691p502K2648j2395
645f909K6922k5701m352R746q38J8271k8670K0453j3782k1100N4834k6827j1554
658i507Q891j406J2917k2564K2484j4009j0220K6368k3356K7685j9592j6142L7777
671A9326k9431J0342o7M16R466l1861L7712r013k2231K4341j7150J3031p438k25
685b782J8322k5125M343P417M910j0136n820J7407j2061O990n579O364Q71k8686
699b3565L9600j1479j4976J7505j6712K7857l1024O288L0538n1704L8161o382
711D107j3249K9120m3917L5763k396l0453L2111j5247J2987j6670J250L1087m4918
724b0425J9569J4671k5104J0870M69O812p573j229j250M007R369k7929K4326M700
$$ plain form
738 11283 -16006 4952 7241 3859 -17238 2188 18782 -23198 11118 5106 -12702 15602 -13184
751 -13184 4995 6902 -14643 3358 4552 9192 -17461 4156 19705 -27206 8202 11066 -12469
764 -12469 1411 955 9323 -8777 1811 1361 -8609 16504 -18662 4566 20232 -26717 8905
777 8905 11411 -8701 -6601 1828 14133 -18618 6042 13716 -17458 9403 -4145 -2975 10924
790 10924 -11680 -576 10062 342 -12930 9699 9749 -23786 8151 11731 -9435 -767 2777
803 2777 5277 -10153 5046 3248 -9480 10851 -13883 8269 15921 -25421 8717 7150 -9112
816 -9112 327 2618 8421 -17274 6289 14872 -15920 4963 -3939 -902 9151 -9004 4214
829 4214 3046 -4038 -4392 7361 5990 -19492 7547 10868 -9526 1766 911 3133 -7061 -137
$$ packed form
738A1283k7289K0958K289l382k1097J9426J6594m1980L4316o012j7808K8304k8786
751a3184J8179J907k1545J8001J194M640k6653K1617J5549m6911L5408K864k3535
764a2469J3880m56Q368j8100J0588m50r970K5113l5166K3228J5666m6949L5622
777H905K506k0112K100Q429J2305l2751K4660P674l1174K6861j3548J170J3899
790A0924k2604J1104J0638r720j3272K2629N0l3535L1937L580k1166Q668L544
803B777K500j5430J5199j798j2728K0331k4734K2152P652m1342L4138j567j6262
816i112R439K291N803k5695K3563Q583l0792K0883q902L037J0053j8155J3218
829D214j168p084l54J1753j371k5482K7039L321k0394J1292q55K222j0194O924
$$ plain form
843 -137 8145 -7701 3166 -2587 4352 5666 -16419 9086 5221 -9446 1354 1861 5988 -8324
857 -8324 1998 8531 -11995 656 3644 3759 -1957 -8362 9643 195 -3954 1055 -722 776
871 776 -6570 8014 5521 -8809 -1118 867 6798 -5422 -4390 9409 -6891 -1155 6784 1981
885 1981 -4834 -7720 8772 -429 -2539 4340 -4602 3571 -3845 8 9862 -8616 -6079 4299
899 4299 7520 -2968 -4755 8938 -9894 -3784 13740 -3237 -4433 -2576 1046 7101 749 -4734
913 -4734 -4818 4025 -1747 1021 11601 -11031 -9843 13029 5011 -8297 -1480 2603 -6020 6429
927 6429 7618 -8952 -49 -2224 -827 11143 -4571 -9758 4897 7318 -5506 -441 7906 -12627
941 -12627 -2006 14968 -6027 -4259 4272 -2788 1617 3536 -5037 -2295 6196 -4566 -1307 11118
$$ packed form
843a37Q282j5846J0867n753O939J314k2085K5505l865j4667J0800N07M127j4312
857h324J0322O533k0526J2651K988J15n716o405J8005r448m149N009j777J498
871G76p346J4584k493j4330P691J985N931j2220J032J3799j6300N736P939m803
885A981o815k886J6492r201k110O879q942Q173p416L853R854j8478K537J0378
899D299L221j0488j787J3693j8832O110J7524j6977j196J857L622O055o352n483
913d734q4Q843n772K768J0580k2632J188K2872q018j3308O817M083q623J2449
927F429J189j6570Q903k175J397J1970j5714n187J4655K421j2824N065Q347k0533
941a2627J0621J6974k0995J768Q531p060M405J919q573K742Q491j0762L259J2425
$$ plain form
955 11118 -7751 -7116 11280 -1313 -8758 6147 3728 -8365 4265 5038 -7671 3575 -91
968 -91 -5993 8090 -689 -6762 6686 1843 -8187 3529 6864 -10153 -1496 10926 -4973 -2777
982 -2777 6062 -4998 -1489 5911 -3742 -1556 4219 -4769 1633 8102 -7626 -5219 7706 -428
996 -428 -4348 4787 229 -6832 5192 4744 -6786 316 136 -2322 6928 -624 -6213 3559 979
1011 979 -3358 3367 1183 -6573 943 7258 -2234 -3344 2303 -2132 -579 3797 -2098 -1036 2012
1026 2012 -2051 1884 2413 -4587 -957 3231 -605 -1294 2267 777 -3136 513 1992 -1777 -75
1041 -75 497 -512 1003 72 430 503 -2455 -923 2025 1009 -201 -1128 -350 1422 -225 -49 304 -2852
1059 -2852 -162 3917 956 -2517 -1219 871 -312 1329 1025 -3909 469 3117 -831 1575 -1205
$$ packed form
955A1118j8869O35J8396j2593p445J4905k419j2093J2630P73j2709J1246l666
968i1n902J4083q779o073J3448m843j0030J1716L335j7017Q657J2422j5899K196
982b777Q839j1060L509P400r653K186N775q988O402O469j5728K407J2925q134
996d28l920R135m558p061J2024m48j1530P102j80k458R250p552n589R772k580
1011I79m337O725k184p756P516O315r492j110N647m435J553M376n895J062L048
1026B012m063L935N29p000L630M188l836o89L561j490l913L649J479l769J702
1041g5N72j009J515r31L58P3k958J532K948j016j210r27P78J772j647J76L53l156
1059b852K690M079k961l473J298K090j183J641l04m934M378K648l948K406k780
$$ plain form
1074 -1205 -4745 2553 3846 -2420 -929 1800 -2566 668 4908 -3903 -3596 3539 -561 331 3696
1089 3696 -3478 -3396 4631 -148 -2931 3967 -2597 -3876 6971 595 -4972 2300 -422 -3786 4702
1104 4702 2893 -6555 1683 3394 -5001 4195 2129 -8213 2150 5022 -3261 907 3024 -6210
1118 -6210 -684 7938 -4382 -2690 4893 -4927 945 7222 -4787 -4575 4456 -594 -2571 6675 -2755
1133 -2755 -7139 7968 576 -4962 4182 -2351 -4262 5895 3053 -6250 1341 2825 -6045 5141
1147 5141 2962 -8738 3157 4065 -3610 1476 2376 -5437 -886 7414 -4390 -1973 5737 -5794
1161 -5794 1233 5669 -5230 -2006 3473 -325 -2473 5036 -1286 -6395 7253 -894 -4590 5013
1175 5013 -2824 -1698 4050 751 -3446 159 2756 -4729 3401 2710 -6984 4024 1834 -3184 1934
$$ packed form
1074a205l540P298J293o266J491K729m366L234M240q811L07P135m100Q92L365
1089C696p174Q2Q027m779k783O898o564j279J0847o376n567P272k722l364Q488
1104D702j809r448Q238J711q395R196k066j0342J0363K872q283M168K117r234
1118f210N526Q622j2320J692P583r820N872O277j2009K12R031n050j977R246r430
1133b755m384J5107p392n538R144o533j911J0157k842r303P591J484q870J1186
1147E141k179j1700J1895R08p675N086R00p813M551Q300j1804K417P710j1531
1161e794P027M436j0899L224N479l798k148P509o322n109J3648q147l696R603
1175E013p837J126N748l299m197L605K597p485Q130o91r694J1008k190n018N118
$$ plain form
1190 1934 75 -2408 -816 4680 -1983 -2134 4267 -4206 1224 2888 -3677 573 127 1092 -692 1355
1206 1355 380 -4705 4669 -913 -2378 3784 -3399 1496 718 -229 661 -3406 3157 -1692 334 2617
1222 2617 -4199 3301 -1129 -672 2126 -3460 2413 -1395 865 1986 -3505 2517 -1329 209 394
1237 394 -1499 2697 -3322 2567 1190 -3675 2835 -1951 759 165 -657 1541 -2550 3727 -2556 -682
1253 -682 3845 -6252 3967 1448 -3548 2338 -784 1574 -3267 2385 1325 -6200 6874 -2307
1267 -2307 -1944 4991 -5370 1995 895 -953 -540 -142 3793 -6344 4502 2831 -8736 6176
1281 6176 -445 -2931 2902 -564 68 -2084 3946 -2859 -1392 5608 -7655 3714 4226 -6586 2612
1296 2612 1692 -1652 -2939 4953 -176 -6799 8227 -2935 -2436 5575 -5689 1766 1077 -626 -698
$$ packed form
1190A934j859k483J592N496o663j51O401q473N430J664o565M250m46R65j784K047
1206A355r75n085R374n582j465O162p183M895p78r47Q90m067O563m849K026K283
1222B617o816P500m430M57K798n586N873l808K260J121n491O022l846J538J85
1237C94j893M196o019N889j377m865O510m786K710n94q22K198m091O277o283J874
1253f82M527j0097J0219k519m996N886l122K358m841N652j060p525J3074r181
1267b307L63O935j0361P365j100j848M13L98L935j0137J0846j671j1567J4912
1281F176o621k486N833l466O32k152O030o805J467P000j3263J1369N12j0812R198
1296B612r20l344j287P892n129o623J5026j1162M99Q011j1264P455o89j703p2
$$ plain form
1311 -698 707 3452 -8633 7187 2715 -11522 9553 -1525 -4180 4961 -1844 1019 -3398 3485
1325 3485 -626 -3335 6877 -7841 3131 5697 -9466 5020 1946 -4730 165 3892 -226 -5705
1339 -5705 6435 -1267 -3927 5073 -3572 868 877 -1214 459 973 1616 -6885 6423 1188 -9266
1354 -9266 9590 -2303 -3908 3974 -1284 2427 -5124 2981 1026 -3908 6407 -6374 2936 2823
1368 2823 -7899 7703 -1370 -4066 1443 2068 2266 -6641 4866 21 -4798 5899 -3037 1022
1382 1022 -1256 -1580 5725 -3120 -334 -2470 2402 2999 -6430 6102 -1945 -4435 5389 -502 944
1397 944 -5207 865 5098 -3510 2037 -2157 285 260 -1635 5835 -4477 -2329 1823 1925 2810 -6518
1413 -6518 2759 393 -3046 4490 -1548 1840 -5484 368 8915 -7466 1201 270 -2390 4131 -3266
$$ packed form
1311f98J405K745j2085J5820m472j4237K1075j1078k655R141o805K863m417O883
1325C485m111k709J0212j4718J0972K566j5163J4486l074o676M895L727m118n479
1339e705J2140p702k660R000q645M440Rk091J673N14O43q501J3308n235j0454
1354i266J8856j1893j605P882n258L711p551Q105j955m934J0315j2781R310j13
1368B823j0722J5602r073k696N509O25J98q907J1507m845m819J0697q936M059
1382A022k278l24P305q845K786k136M872N97r429J2532q047k490R824n891J446
1397I44o151O072M233q608N547m194K442k5j895P470j0312K148M152J02Q85r328
1413f518R277k366l439P536o038L388p324N852Q547j6381Q667r31k660O521p397
$$ plain form
1428 -3266 4817 -2582 -4971 4845 -475 3677 -5545 -1817 7107 -5825 2707 3389 -4591 -2863 1941
1443 1941 6571 -4743 -1444 1128 -2177 5211 -2578 -81 563 -4914 3671 3674 535 -7929 648 8641
1459 8641 -7279 2508 2638 -6986 2952 2070 2089 -2690 -3465 1914 1189 4155 -6158 -688 6339 -6660
1475 -6660 2642 4727 -5299 -3558 4528 4890 -7333 1621 2409 -4398 5368 -3143 -636 3235 -5104
1490 -5104 3021 2772 -1568 -4945 2491 6994 -9629 2297 6111 -7876 2756 2537 -1499 -1039 -1189
1505 -1189 2043 -10 1332 -3593 758 5073 -7083 1966 5680 -6005 -2265 5244 1813 -5869
1519 -5869 2441 2108 -4892 3733 -238 -667 1359 -4477 2702 3937 -2357 -4575 2779 3710 -6265 4249
1535 4249 3121 -7927 1754 3944 637 -3079 -1857 2323 -140 2506 -2406 -670 2325 -5641 5271
$$ packed form
1428c266Q083p399k389R816n320M152r222L728Q924j2932Q532O82p980J728M804
1443A941M630j1314L299K572l305P388p789K497O44n477Q585Ll139q464Q577P993
1459H641j5920R787J30r624R938q82J9m779p75N379p25K966j0313N470P027j2999
1475f660R302K085j0026J741Q086L62j2223Q954P88o807R766q511K507L871q339
1490e104Q125k49m340l377P436M503j6623J1926L814j3987J0632k19m036M60j50
1505a189L232k053J342m925M351M315j2156R049L714j1685L740P509l431p682
1519e869Q310l33p000Q625l971m29K026n836P179J235o294k218P354R31r975J0514
1535D249j128j1048R681K190l307l716J222M180k463K646m912J736K995p966J0912
$$ plain form
1550 5271 3813 -7563 -258 3551 2133 -3454 -216 2854 -4673 2107 2935 -1915 -371 -2703 2945
1565 2945 2708 -4004 -797 2547 3 -2736 2648 1868 -4213 -181 2850 594 -3096 377 2981
1580 2981 -2461 -347 1040 1178 -664 -3820 3862 1081 -3177 1717 -54 139 -1831 700 4061
1595 4061 -4347 -1873 3688 1035 -1710 -1555 2341 -1210 -1497 3452 -236 -2549 -824 2400 1873 -2174
1611 -2174 -1817 715 2420 -1873 -321 3651 -4415 -1546 5400 -484 -3208 -330 2306 -285 -772
1626 -772 1658 -1689 -241 291 -574 3304 -1943 -3745 4196 1432 -4337 1654 2899 -4329 -296 4180
1642 4180 -1244 -1689 684 -15 -86 893 -709 -462 1940 -3185 191 5972 -4787 -3062 5440 -1592
1658 -1592 -2142 3166 19 -3321 882 2724 -1526 30 -392 -2025 3648 168 -3776 3274 366
$$ packed form
1550E271j458j1376P305L809j418n587L238L070p527O780Q28m850J544k332N648
1565B945k37o712L207L344k544k739N384p80o081M032L031k256l690L473K604
1580B981n442K114J387J38j842l156P682k781m258M894j771J93j970K531L361
1595D061q408K474N561k653k745J55L896l551k87M949l688k313J725L224n27m047
1611b174L57K532J705m293J552L972q066K869O946n884k724K878K636k591m87
1626g72K430l347J448N32q65L878n247j802P941k764n769N991J245p228M033M476
1642D180n424m45K373o99p1R79j602K47K402n125L376N781j0759J725Q502p032
1658a592n50N308l147l340M203J842m250J556m22j633N673l480l944P050k908
$$ plain form
1673 366 -4809 3686 3097 -5559 499 3722 -2633 -341 2050 -1336 -824 1242 -755 -13 2350 -2854
1689 -2854 -753 4309 -3682 -1288 5473 -2922 -3185 3847 397 -2211 1437 193 -2367 1343 1409 -1112
1705 -1112 987 -1180 -2263 3792 1246 -4413 1460 1761 -3548 2583 2871 -4147 -1055 2104 420
1720 420 208 23 -1518 -661 2266 -249 -434 1349 -3507 -130 4713 -1573 -2266 1440 -501 -773 2053
1737 2053 412 -2347 -148 913 508 884 -1108 -1384 1025 725 -969 960 541 -2648 989 2022
1753 2022 -1475 -116 119 -187 -32 50 1231 -675 -764 43 43 1175 -614 -307 374 -962 536 935
1771 935 202 -1276 -1065 1474 603 -323 -84 -310 -846 249 2077 -966 -1323 572 -469 1269 501
1788 501 -1225 -315 -79 391 65 1276 -900 -2269 2466 -46 -1104 1850 -1350 -1392 1293 1129 -574
$$ packed form
1673C66n175Q495n89q656O058L223o355K292K391l386N12K066j997P42K363n204
1689b854K101N062p991K394O761q395k63P032l450k608L648j244k560L710O6k521
1705a112K099k167j083O055k546n659N873L01n309O131K88p018L092L159j684
1720D20k12j85j541Q57K927k515j85J783m856L377M843o286o93L706j941k72K826
1737B053j641k759K199J061m05L76j992k76K409l00j694J929m19l189L637J033
1753B022l497J359K35l06J55Q2J181j906q9Q07%J132j789L07O81j336J498L99
1771I35p33j478K11K539q71r26K39k26n36J095J828l043l57J895j041J738p68
1788E01j726R10K36M70l26J211k176j369M735k512j058K954l200m2K685j64j703
$$ plain form
1805 -574 -62 -178 -2218 2230 1756 -2500 662 -370 -1342 2294 1733 -2633 -1991 2561 -510 580 2244
1822 2244 -4351 -256 3173 -598 291 -461 -1931 -291 3779 235 -4003 1946 -609 -982 4242 -2014
1838 -2014 -2945 1825 1096 -635 721 10 -3422 2460 2383 -3523 1508 361 -2310 1906 1294 -2144
1854 -2144 -726 2677 -1983 -470 3331 -3383 377 2339 -2942 842 1770 -1015 -1576 1715 202
1869 202 -2344 3742 -1516 -3356 3969 -696 -599 1303 -1748 -913 1807 2049 -3212 89 1437 -2529
1885 -2529 3733 230 -4191 1201 1323 315 -175 241 -2286 -181 4378 -2369 -994 994 -2261 2439
1901 2439 1358 -1657 -1693 972 1518 -1765 2167 -1476 -2319 3696 -1127 -250 423 -1154 727 -329
1917 -329 1329 -1559 172 1792 -3036 2057 320 -1592 1793 -1417 77 1 1059 582 -2494 1352
$$ packed form
1805e74N12j16k040M448m74m256L162j032r72L636n61m366O42M552l071J090J664
1822B244o595M095L429l771Q89p52j470J640M070l544m238N949k555l73N224o256
1838b014r31M770p29j731J356p11l432N882p7n906N031j147k671M216o12l438
1854b144J418L403m660J513L801o714L760J962n281L784R28k785n61L291j513
1869B02k546O086n258j840P325m665R7J902l051Q35K720K42n261L301J348l966
1885b529O262l503m421N392J22j008m90M16k527K105M559o747J375J988l255M700
1901B439j081l015l6K665N46l283L932l643q43O015m823Q77O73j577J881j056
1917c29J658k888J731J620m828N093j737j912L385l210J494p6J058m77l076L846
$$ plain form
1933 1352 -724 679 1767 -2538 347 -303 1007 1156 -1645 78 -1394 1888 1166 -1924 502 -1371
1949 -1371 1487 701 -1048 497 -2202 2235 716 -1705 819 -1517 1826 8 -917 417 -1934
1964 -1934 3146 -554 -1631 1188 -2434 2815 921 -2127 -511 -804 3167 -703 -325 -370 -3429 4262
1980 4262 1171 -1929 -310 -2164 1930 1794 552 -2566 -2005 2989 -589 1971 8 -4631 1568
1995 1568 2163 687 -1285 -577 -525 -1355 4590 -1177 -2447 1734 -2802 2279 1935 -1743 -674 -897 1603
2012 1603 -1324 2531 836 -5836 3207 799 -1042 2957 -2716 -1606 354 2488 763 -1859 329
2027 329 -3623 2940 4228 -4288 -48 -489 -833 2668 1899 -2064 -4336 3304 1427 -709 1990 -4526
2043 -4526 33 3244 -347 321 -1406 -745 -844 3402 1171 -5400 2695 605 -1916 2871 -1219 -1093
$$ packed form
1933A352k076J403J088m305K885o50J310J49k801J723j472L282p22l090K426j873
1949a371K858p86j749J545k699M437j519k421K524k336L343j818r25J334k351
1964a934N080l700j077K819l622N249j894l048J616k93L971l870L78m5l059P691
1980D262l091l100J619j854M094j36j242l118N61M994l578K560j963m639O199
1995A568N95j476j972P08N2q30N945n767j270M181m536N081l44l678J069k23K500
2012A603k927L855j695o672R043k408j841L999n673J110J960K134j725k622K188
2027C29l952O563J288q516M240m41l44L501p69l963k272P640j877k136K699o516
2043d526M559L211l591O68j727O61r9M246k231o571Q095k090k521M787m090J26
$$ plain form
2059 -1093 -99 1300 87 -1224 1710 -2332 1476 1384 -3820 2795 658 -1924 249 590 395 -1888
2075 -1888 2860 -781 -3155 3274 -968 647 466 -2792 1767 372 233 -740 -4 602 -2529 3508
2091 3508 319 -3619 1869 84 214 -274 2 523 -1536 1386 -468 396 441 -2402 2438 -284 -1452
2108 -1452 1392 97 -43 -2162 1924 1272 -2558 1514 -709 -92 571 -482 1776 -2312 -523 1754
2124 1754 266 195 -2292 1185 714 -1141 1436 -641 -540 -1043 1538 2011 -3164 100 843 262 162
2141 162 -956 1460 -1916 150 2117 -1335 548 -1959 1016 2360 -2960 885 661 -690 -321 255
2157 255 2191 -3073 -152 2866 -1949 341 112 -218 531 -1042 694 696 -385 -1601 1012 2064 -2781
2174 -2781 248 2073 -1723 -952 1965 948 -2805 620 1240 -1181 1500 -1451 -134 1485 -2153
$$ packed form
2059a093R94J399j213j311K934m042L808r2n204O615k137k582K173L41j95k283
2075a888M748l641k374O429m242J615j81l258M559j395j39r73P36O06l131O037
2091C508l189l938N488j785J30m88K76N21k059K922j854Q64M5k843M840k722j168
2108a452K844j295j40k119M086o52l830M072k223O17O63j053K258m088J789K277
2124A754j488p1k487L477m71j855K577k077J01n03K581M73n175L264P43n81j00
2141A62j118K416l376K066J967l452J883k507K975J344n320L845k24j351L69N76
2157B55J936n264K921L018m815K290k29l30P49j573J736Kj081j216K613J052m845
2174b781L029J825l796P71K917j017l753L425O20k421K681k951J317J619l638
$$ plain form
2189 -2153 1339 1420 -1522 -1865 1464 2770 -3529 520 2242 -3350 1400 1582 -943 -447 -1093 1022
2205 1022 1071 96 -1817 20 2119 -2547 1060 2753 -3566 -1033 2991 543 -2146 544 685 -1702
2221 -1702 1505 319 -599 632 -2105 839 2451 -1568 -1698 1765 776 -2905 1920 2209 -3540 112
2237 112 1741 -541 -125 168 -24 -534 62 -235 1442 681 -3671 1020 2677 -1879 -13 1176 -1199
2254 -1199 -1826 2384 2143 -2917 -605 283 513 1943 -1606 -498 347 -1358 1418 2130 -1152 -3360
2270 -3360 1125 3139 -1549 -397 643 -1608 -78 1787 998 -1383 -1693 310 1912 468 -1717
2285 -1717 433 133 -1491 1279 1917 -992 -2674 778 2143 -974 215 186 -1304 -298 720 2245
2301 2245 -831 -2860 610 1572 746 -725 -641 -98 -1156 1444 2220 -1491 -2639 450 2700 -45
$$ packed form
2189b153L492Q1k942l43L329J306o299M049J722n592M750J82k525M96o46K115
2205A022M9r75j913J837K099m666L607J693o319K533M024k448k689K690J41k387
2221a702L207j186r18J231k737K944J612m019j30L463r89l681M825K89n749L652
2237A12J629k282M16K93j92n10N96k97J677p61m352M691J657m556J866J189k375
2254a199o27M210k41n060K312Q88K30J430l549J108Q45j705K776P12l282k208
2270c360M485K014m688J152J040k251J530J865p89k381l10K003J602j444k185
2285a717K150l00j624K770O38k909j682L452J365l117J189k9j490J006J018J525
2301B245l076k029L470R62q26j471Q4N43j058K600P76l711j148L089K250k745
$$ plain form
2317 -45 -1369 -1 -411 -180 1271 1158 -1588 -1691 1142 1478 192 -1751 -364 1706 -803 -319 1333
2334 1333 -668 -1364 898 1666 -1726 -960 2100 -250 -974 2 113 881 -282 -803 407 104 -765
2351 -765 1062 1295 -2695 -937 3033 130 -1764 276 225 -758 1095 881 -1470 -345 -104 626 1808
2368 1808 -1779 -1577 1930 313 -1332 963 883 -2338 189 2416 -1286 -655 890 -659 98 380
2384 380 -281 631 43 -1868 615 2341 -1633 -887 1594 -1298 -586 2496 47 -2659 133 1517
2400 1517 20 671 -1183 -1492 1726 342 -227 721 -1667 -1354 2485 1789 -2756 -945 1648 -640
2416 -640 746 955 -1948 -555 1138 608 189 -628 -1518 785 2075 -1468 -756 1263 -1010 -189 1627
2433 1627 -363 -1655 704 1036 -952 377 34 -558 889 -757 -202 1272 -520 -918 499 645
$$ packed form
2317d5j324J368m10K31J451j13k746j03K833L36j286j943J387K070k509M84J652
2334A333k001o96K262P68l392P66L060k350p24R76J11P68j163n21J210l03q69
2351g65J827K33l990J758L970k903j894K040n1r83J853k14k351J125K41P30J182
2368A808l587K02L507j617j645K295q0l221K527K227l702O31J545j549P57K82
2384C80o61R12n88j911K483J726l974P46K481k892P12L082k449k706K792J384
2400A517j497O51j854l09L218j384n69R48k388L13L839o96m545J811K593k288
2416f40J386K09k903J393J693n30m19q17q90K303J290l543P12K019k273Q21J816
2433A627j990j292K359L32j988J329l43n92J447j646N55J474j792l98J417J46
$$ plain form
2449 645 -895 537 983 -1976 -120 1641 83 -478 -839 -159 754 899 -363 -1081 -34 -207 1303
2466 1303 1115 -2080 -1146 1068 1429 -97 -989 -405 -723 1291 1357 -1051 -1058 -770 1290 1416 -816 -908 -708
2485 -708 807 827 -84 6 -1344 -72 1286 496 -508 -1046 492 152 -16 771 -600 -427 -122 327
2503 327 579 -193 -58 -771 270 447 -285 1091 -938 -1204 1028 686 75 -671 -150 -474 262 1706
2521 1706 -1078 -801 179 -334 1396 150 -1225 -528 745 563 -564 757 -1000 -872 1926 -378
2537 -378 -641 321 -278 48 266 242 -996 709 670 -1644 972 193 -863 1248 -278 -1180 130 1393
2555 1393 -147 -807 461 -1348 809 1902 -1531 -552 15 -139 1067 904 -1263 -1887 1694 709 -466
2572 -466 982 -1948 -725 1939 505 -487 -753 -311 -490 1671 987 -2399 379 138 -558 1858 -209
$$ packed form
2449F45j540J432M46k959J856J761j558n61l61O80R13J45j262p18J047j73J510
2466A303j88l195R34K214L61j526q92N84l18K014O6k408pK88K060J26k232r2K00
2485g08J515K0r11R0j350J272J358p90j004n38J538l40j68P87j371J73L05M49
2503C27K52p72J35p13J041J77p32J376k029k66K232l42o11p46N21l24P36J444
2521A706k784K77R80n13J730j246j375O97J273j82j127J321j757J28K798k304
2537c78k63R62n99L26K18k4j238J705l9k314K616p79j056K111j526r02J310J263
2555A393j540o60J268j809K157J093l433R79N67j54J206j63k167o24L581r85j175
2572d66J448k930J223K664j434r92k66M42j79K161o84l386K778k41o96K416k067
$$ plain form
2589 -209 -1419 -416 926 312 -60 818 -2007 -150 1781 -769 703 -213 -1486 303 1259 550 -1314
2606 -1314 255 -452 -599 2411 -587 -1262 180 -408 941 671 -270 -1431 -27 1328 -531 903
2622 903 -526 -1752 1250 667 -8 -393 -412 -198 -4 1470 -757 -671 486 -835 1038 340 -723 -131
2640 -131 -209 566 -352 616 -72 -1275 1033 -201 83 487 -825 227 -360 573 284 -522 375 -1033
2658 -1033 680 634 -652 473 -811 173 306 144 568 -1357 329 372 -160 758 -819 -61 -164 287
2676 287 838 -898 146 -438 47 1052 -651 -27 -335 9 430 74 341 -1263 356 752 -650 684
2694 684 -566 -381 345 248 363 -936 476 -279 -189 1344 -1326 84 586 -746 691 4 -119 -579
2712 -579 377 723 -1170 930 -140 -978 1186 -394 -112 313 -285 -219 181 771 -1037 334 549 -1370
$$ packed form
2589b09j210J003J342o14l72Q78k825J857J931k550J472r16j273J789R56p09j864
2606a314J569p07j47L010k998o75J442n88J349k70r41j161J404J355j859J434
2622I03j429j226L002n83o75l85j9K14J94J474k227Q6J157j321J873o98j063N92
2640a31p8P75r18R68o88j203K308j234K84M04j312J052n87R33k89q06Q97j408
2658a033J713m6j286J125j284R84J33j62M24j925J686M3n32R18j577P58j03M51
2676B87N51j736J044n84M85J005j703O24l08L44M21l56K67j604J619L96j402J334
2694F84j250J85P26r7J15j299J412p55R0J533k670J410N02j332J437o87j23m60
2712e79R56L46j893K100j070q38K164j580K82M25n98O6M00N90j808J371K15j919
$$ plain form
2730 -1370 1146 446 -988 -61 239 230 -346 847 -772 -919 1571 -621 212 371 -1548 589 849 -21
2748 -21 -815 29 277 -905 1716 -128 -1859 953 106 197 375 -558 -552 112 1140 -709 102 282 -1560
2767 -1560 1419 703 -1247 162 180 -75 -243 898 -276 -1061 1067 -464 61 791 -1035 219 304
2784 304 -361 39 722 -232 -1381 1207 326 -877 835 -464 -472 243 550 153 -846 240 -421 654
2802 654 657 -1555 821 41 -820 1086 -106 -437 -508 649 494 -1194 763 51 -505 457 -569 458
2820 458 247 -476 140 -62 -138 -20 979 -301 -1397 530 827 248 -602 -358 -39 -225 1349 99 -1042
2839 -1042 -607 -105 1950 26 -1401 -230 -195 1075 354 -125 -578 -1644 1390 1552 -677 -1057 -612
2856 -612 900 343 334 73 -1416 -157 770 1053 -142 -1506 1 598 501 -134 -52 -82 -1416 1006 1482
$$ packed form
2730a370K516p00j434R27L00rn76J193j619j47K490k192Q33J59j919K137K60q70
2748b1p94Q44K48j182K621j844j731K812q47R1J78r33OO64J028j849Q11J80j842
2767a560K979p16j950J409J8k55j68J141j174p85K128j531N25P30j826J254Q5
2784C04o65M00O83r54j149K588q81j203J712j299qP15L07l97r99J086o61J075
2802F54Lk212K376p80q61J906j192l31p1J157j55j688J957p12n56R62j026J027
2820D58k11p23O16k02p6J18R99j280j096J927K97n79q50K44L19j86J574j250j141
2839a042M35N02K055j924j427J171L5J270p21m79m53j066L034J62k229l80M45
2856f12J512n57rk61j489J259R27K83j195j364J507N97r7o35Q2l0j334K422M76
$$ plain form
2875 1482 -971 -624 -184 377 270 255 298 -1151 -302 519 857 532 -1710 -445 1210 85 -77 362
2893 362 -638 -1283 1328 1415 -1159 -742 -132 618 639 -286 -291 -504 172 209 753 200 -2196 718 1743 -1209
2913 -1209 -214 365 -265 -195 485 447 -1037 3 498 61 251 -1076 240 1238 -911 -627 1012 -35
2931 -35 -1005 981 428 -1508 406 922 -221 -449 -311 416 289 -58 -437 199 357 -1042 919 899 -1828
2950 -1828 105 1318 -393 -690 439 336 -697 226 372 -172 0 -505 436 532 -846 -95 983 -364
2968 -364 -1211 1139 726 -1455 237 574 -389 -39 199 257 -614 -236 608 400 -255 -1122 662 951 -1092
2987 -1092 174 614 -804 -253 1009 323 -1212 -153 843 123 -257 -367 257 107 -332 396 353 -662
3005 -662 -628 1087 525 -1271 113 674 -292 -266 306 398 -780 -168 864 -43 -451 -256 509 121 -744
$$ packed form
2875A482k453L47M40N61j07j5M3j449Q49Q21L38l25k242J265J655j125j62M39
2893C62j000o45K611Q7k574M17O10P50K1r25nk13O76L7N44n53k396K914J025k952
2913a209R95N79o30P0O80l8j484J040M95m37J90j327J316R98k149K84J639j047
2931c5r70J986n53j936J914N16j143k28J38P27j27l47l79O36J58j399J961k0k727
2950a828J933J213j711k97J129j03j033R23J46n44J72n05R41R6j378P51J078j347
2968c64q47K350m13k181J692L37r63L50K38N8q71L78Q44k08o55q67J784K89k043
2987a092J266M40j418N51J262o86j535J059R96p20l80j10O24j50m39P28m3j015
3005f62L4J715n62j796J384N61r66K6N72R2j178O12J032r07m08J95P65l88q65
$$ plain form
3024 -744 468 482 -656 -482 675 599 -900 -183 657 -345 -300 558 363 -939 -373 995 275 -425 -517
3043 -517 164 396 -289 339 209 -764 -455 946 944 -1271 -624 911 -87 10 324 -250 -636 -30 986 207
3063 207 -687 -670 328 972 -507 -317 542 -679 -358 1154 385 -1307 -223 909 -142 -50 92 -265
3081 -265 -102 -115 409 428 -471 -799 522 860 -935 17 809 -1001 -211 1021 72 -739 -137 433 -90
3100 -90 180 -27 -246 304 -561 160 1024 -715 -769 752 393 -781 322 609 -958 -31 668 -85 -60
3119 -60 -275 -55 288 48 -268 237 306 -1027 260 1174 -858 -391 591 -192 -306 446 330 -693 -136
3138 -136 250 139 413 -661 -273 588 -284 -43 557 -240 -973 472 968 -719 -192 231 -376 260 266 8
3158 8 -295 -337 138 452 318 -796 -173 686 -375 122 477 -476 -496 418 616 -416 -206 60 -113 373
$$ packed form
3024g44J212J4j138J74J157p6j499P17Q40j002M5Q58j95j302N66J368p20p00r2
3043e17O81K32o85O28j30r73L09J401kk215O47J535r98R7L14n74l86O06J016p79
3063B07q94J7R98O44j479J90Q59j221L21J512p69j692J084J132j051R2J42l57
3081b65J63j3N24J9q99l28J321L38j795R52P92j810P90J232r49q11O02N70n23
3100i0K70k07k19N50q65P21Q64j739n4J521l59j174J103K87j567R27O99p53K5
3119f0k15K20L43k40l16N05O9j333J287R14k032M67R82p83j14P52j16j023N57
3138a36L86j11K74j074L88Q61q72K41O00p97p33J445M96j687N27M23o07O36Ok58
3158Hl03m2M75L14j34j114O23Q59j061M97L55r53k0R14J98j032K10K66j73M86
$$ plain form
3178 373 -116 -13 76 -421 175 370 50 -554 -19 646 -502 3 404 -370 -47 2 262 -73 -301 291
3198 291 -122 -28 -85 4 382 -407 -140 285 -6 -103 -11 247 -409 -100 555 -125 -224 -137 176 120 -77 182 -326
3221 -326 23 115 -33 433 -462 -288 385 107 -34 -216 223 -252 -144 684 -322 -200 85 -122 313 -40
3241 -40 -82 -148 40 93 -225 532 -290 -554 614 -28 -150 123 -56 -237 -23 511 -284 -156 126 -398 505
3262 505 160 -481 69 43 -55 72 393 -472 -405 733 -145 -90 191 -440 77 307 104 -321 0 95 -341
3283 -341 728 -108 -734 531 -42 -91 268 -92 -253 -69 508 -244 -53 249 -600 389 315 -428 134 36
3303 36 -224 -29 536 -233 -514 492 -250 27 449 -421 -169 51 206 30 44 -75 -674 630 352 -548
3323 -548 286 -366 -171 569 171 -247 -485 244 133 209 285 -836 20 479 -32 251 -224 -434 -3 672
$$ packed form
3178C73m89J03Q9m97N96J95l20o04N35O65j148N05M01p74L23M9K60l35k28N92
3198B91m13R4n7Q9L78p89K67M25k91r7R2K58o56L09O55o80r9Q7L13n6j97K59n08
3221c26L49R2j48M66q95J74O73k78j41j82M39m75J08Q28j006J22K85k07M35l53
3241d0m2o6J88N3l18P57q22k64J168o42j22K73j79j81K14N34p95J28K82n24R03
3262E05l45o41N50k6r8J27L21q65O7J138q78N5K81o31N17K30k03m25L21R5m36
3283c41J069q36o26J265n73m9L59l60j61J84N77p52J91L02q49R89p4p43N62r8
3303C6k60J95N65p69k81J006p42K77M22q70K52K20J55j76J4j19n99J304k78r00
3323e48Q34o52J95P40l98m18k38P29j11P6P6j121Q56M59n11K83m75k10M31O75
$$ plain form
3343 672 163 -615 80 -148 152 559 -302 -288 -185 241 296 -18 -89 -608 366 415 -317 209 -357 -206 345
3364 345 215 10 -555 139 120 2 376 -480 -89 127 17 305 -239 -131 -160 246 391 -466 72 -69 -110
3385 -110 426 -82 -92 -300 130 386 -191 92 -356 -27 481 -134 22 -227 -122 233 223 132 -642 30 416
3406 416 -72 229 -302 -311 134 360 220 -503 -91 -51 220 552 -547 -253 62 55 424 -59 -302 -469 361
3427 361 585 -419 11 -301 -216 665 100 -223 -379 15 267 207 240 -727 -84 485 -116 327 -183 -455 48
3448 48 437 286 -503 26 -100 -104 744 -276 -328 56 -130 373 184 -174 -464 135 470 -297 250 -106 -563
3469 -563 413 331 -132 -254 -23 -23 77 402 -411 -159 198 -216 404 26 -428 -72 293 170 -375 250 -112
3490 -112 -430 640 -53 -278 72 -148 230 50 -22 -197 13 250 -304 317 20 -536 351 212 -158 -157 157
$$ packed form
3343F72n09p78O95k28L00M07q61J4J03M26N5l14p1n19R74M9p32N26n66J51N51
3364C45j30k05n65O94j9j18L74q56L91K16j10K88n44J08k9M06J45q57N38j41m1
3385a10N36n08j0k08M30K56n77K83m48L29N08o15J56k49J05L55j0r1p74O72L86
3406D16m88L01n31rM45K26j40p23M12M0K71L32j099K94L15pL69m83k43j67Q30
3427C61K24j004M30l12Q5Q81n65l23j56L94K52o0L3r67O43N69o01M43n10k72N03
3448D8L89j51p89N29j26mQ48j020n2L84j86N03j89l58k90N99L35p67N47l56m57
3469e63R76q2m63j22K31%J00L25q13K52L57m14O20l78m54L56L65j23n45O25l62
3490a12l18J070o93k25L50k20L78j80p2j75K10K37n54O21k97n56Q87j39l70JL14
$$ plain form
3511 157 24 -226 376 -151 -168 195 -222 299 2 -297 128 80 37 -243 239 69 -514 415 128 -328 49
3532 49 34 57 -121 64 24 -91 33 -108 289 -60 -347 235 97 -88 -167 240 16 -462 447 97 -302 120
3554 120 -78 224 -109 -129 267 -206 12 6 152 108 -474 257 282 -319 23 193 -36 -261 229 194 -263 -65
3576 -65 63 212 -138 -138 203 -98 -19 -76 222 100 -620 411 304 -481 84 101 32 -199 39 354 -393 -69
3598 -69 230 3 20 -268 129 229 -293 -38 359 -117 -443 409 236 -432 34 216 40 -247 73 277 -293
3619 -293 36 26 57 161 -501 360 320 -609 144 338 -116 -267 156 305 -417 1 345 -166 -137 -28 188
3640 188 107 -295 -102 363 -34 -450 462 131 -645 205 390 -127 -355 73 346 -309 56 194 -213 17
3660 17 -182 348 251 -708 88 500 -210 -217 264 72 -442 180 487 -237 -352 141 275 -68 -81 -33 98 -24
$$ packed form
3511A57j33k50O02n27j7L63m17N21k97k99M25m8m3k80M82j70n83R29k87m56L77
3532D9j5K3j78J85m0j15J24j41L97l49k87N82j38j85p9M07k24m78R09l50l99M22
3554A20j98L02l33k0L96m73K18oJ46m4n82P31K5o01L42J70k29k25M90l5m57J98
3576f5J28J49l50%L41l01P9n7K98j22p20J031j07p85N65J7o9k31K38L15p47L24
3598f9K99k27J7k88L97J00n22K55L97m76l26Q52j73o68M66J82j76k87L20K04n70
3619b93L29j0L1J04o62Q61m0r29P53J94m54j51M23J49p22M18L44n11K9J09K16
3640A88q1m02J93M65l97m16R12l31p76Q50J85n17k28M28K73o55L65J38m07K30
3660A7j99N30r7r59P96M12p10pM81j92n14O22L07p24j15M93J34l43j3M8J31j22
$$ plain form
3682 -24 -270 491 57 -734 295 428 -189 -254 96 244 -383 94 397 -337 -184 36 264 121 -520 81
3702 81 380 -273 -164 369 -25 -508 209 463 -269 -370 240 277 -299 -24 175 -136 -56 -71 345 -14 -618
3723 -618 361 396 -332 -188 162 201 -327 109 395 -471 -223 390 209 -190 -332 135 243 -111 -88 192 -132
3744 -132 -346 394 376 -413 -400 306 363 -333 -14 188 -356 28 280 153 -237 -483 371 389 -249 -208 83 89
3766 89 -249 235 381 -576 -305 505 224 -300 -138 141 -62 -16 156 116 -186 -371 348 402 -329 -246 211 158
3788 158 -264 181 336 -531 -151 436 120 -148 -253 122 127 -100 75 80 -141 -296 268 467 -426 -349 338 113
3810 113 -224 116 141 -376 -57 327 102 -210 -318 197 250 -166 -91 99 1 -297 274 378 -558 -157 390
3831 390 16 -128 -58 146 -138 -94 246 46 -91 -241 115 381 -273 -115 263 -132 -206 250 265 -337 -201
$$ packed form
3682b4k46P61m34p91J029J33o17o5L50J48o27M77L03p34J53K20K28j43o41O01
3702H1K99o53J09N33l94m83P17K54p32j01O10L7n76K75J99l11Q0j5M16l59o04
3723f18R79L5p28J44L50L9n28M36K86q66K48O13j81l99j42M67J08l54K3K80l24
3744a32k14P40j8p89J3P06N7o96L19K02n44L84K52j27l90k46Q54J8o38M1K91O
3766H9l38M84J46r57K71Q10k81n24J62K79k03M6J72m0l02j85P19N4p31Q3M57n3
3788A58m22M45J55q67L80N87l16k68j05L75Nk27J75Nk21j55N64J99q93P7O87k25
3810A13l37L40K5n17L19L84k25l12j08N15N3m16P5J90r8k98N71J04r36M01N47
3831C90l74j44P0K04k84M4L40k00j37j50L56K66o54J58L78l95p4M56J5o02J36
$$ plain form
3852 -201 291 69 -56 -27 -7 -43 -60 156 170 -138 -376 172 426 -243 -154 123 -120 -54 227 174 -395 -192 334
3875 334 102 -45 -215 -82 199 -68 80 109 -247 -177 239 345 -336 -222 254 -24 -6 96 -26 -150 -43
3896 -43 244 33 -118 -148 43 274 -180 -94 190 -106 -94 139 132 -233 -86 282 -64 -119 19 7 55 -58 -9
3919 -9 23 -53 -84 89 206 -302 -116 284 -41 -61 -3 -4 -130 -4 304 -141 -197 -9 15 311 -91 -227 67 -87
3943 -87 108 214 -31 -340 -160 432 142 -165 -100 -181 86 326 115 -228 -241 -22 285 367 -271 -370 63 150
3965 150 247 39 -196 -330 14 553 -18 -257 -167 -169 410 182 -171 -132 -262 135 263 124 -266 -397 247 159
3987 159 10 53 -276 -120 132 230 29 -209 -123 -35 256 107 -169 -28 -110 15 219 100 -189 -189 172 66
4009 66 47 57 -191 -26 63 99 59 -96 -62 -82 217 58 -169 111 -120 -25 133 -9 2 -169 77 37 -77 146
$$ packed form
3852b01M92k22j25K9K0l6j7K16J4l08k38N48K54o69Q9K77k43O6K81n3n69K03N26
3875C34k32j47j70J33K81k67J48K9l56P0M16J06o81J14M76k78J8J02j22j24J07
3896d3K87k11j51l0J91K31m54Q6K84k96J2K33pl65J47L68l46n5J38j2M8j13M9
3919iL2p6l1J73J17n08J86M00l25k0N8jj26J26L08m45n6J88K4K96m02j36K94j54
3943h7J95J06k45l09J80N92k90l07O5q1K67K40k11l43j3K19L07Q2o38r9M33Q7
3965A50R7k08k35j34L44N39n71k39R0kN79k28l53L9j30L97J28j39l90j31O44q8
3987A59j49M3l29J56K52R8k01k38Q6Q8K91j49k76J41q2J25K04j19k89%L61j06
4009F6j9J0k48J65Q9L6m0j55L4k0K99j59k27K80k31R5J58j42J1j71K46m0j14K23
$$ plain form
4033 146 -181 26 48 -156 199 -33 -112 -6 -26 99 -96 105 8 -242 151 63 -12 12 -113 7 65 85 -30
4056 -30 -36 -59 -72 187 79 -121 -99 47 81 -20 133 -111 -164 191 -15 78 -25 -180 112 47 88 -89 -52 69
4080 69 -171 221 77 -260 79 -5 64 34 -47 5 -126 139 5 -36 74 -225 105 130 -129 27 -19 -27 -62 108
4104 108 63 -223 83 25 -61 104 -77 -46 20 18 13 33 4 -161 119 108 -112 33 -8 -29 -7 145 -14 -179 104
4129 104 -55 63 131 -225 64 18 -15 120 -66 -8 -170 131 190 -238 84 -75 -94 202 -45 -17 -121 -56 136
4152 136 17 21 -179 -31 129 -65 99 -13 -155 -18 133 59 -124 30 -44 -43 134 -27 5 -63 -35 94 13
4175 13 55 -85 0 30 -99 168 22 -111 -9 -22 100 3 48 -64 -152 118 52 80 -46 -193 80 34 125 -18
4199 -18 -160 -1 -120 241 134 -257 -33 -86 96 142 -47 -29 -253 33 245 17 -32 -210 -76 170 111 38
$$ packed form
4033A46l27K07K2k04L55k32p9J06k0J25j95K01r7k50L93q8p5K4j25J20N8K0j15
4056c0ok3j3K59j08k00K2J46L4j01J53k44n3L55k06R3j03j55K92o5M1j77L7J21
4080F9k40L92j44l37L39q4O9l0q1N2j31K65j34m1J10k99L30K5k59J56m6ql5J70
4104A08m5k86L06n8q6J65j81L1O6knK0k9j65K80j1k20J45m1k1K2J52j59j65K83
4129A04j59J18O8l56K89m6l3J35j86N8j62L01N9m28L22j59j9K96k47K8j04O5J92
4152A36j19Mk00J48J60j94J64j12j42J37J51p4j83J54p4JJ77j61L2o8K8J29q1
4175A3M2j40Q5L0j29K67j46j33J02j3J22r7M5j12q8K70o6K8j26j47K73m6R1j43
4199a8j42J59j19L61j07l91K24n3J82M6j89J8k24K86K12k28m9j78J34K46n9p3
$$ plain form
4221 38 -108 -235 -48 327 153 -184 -188 -110 168 199 120 -170 -416 179 291 117 -18 -470 -11 308 120 163
4243 163 -321 -298 135 347 268 -401 -258 106 116 334 -30 -387 -143 146 302 107 -295 -312 148 252 17
4264 17 -25 -208 -183 121 308 34 -374 -22 99 20 199 -150 -128 5 -55 240 64 -239 -69 108 90 -65
4286 -65 75 12 -229 74 232 -40 -124 10 -14 27 77 -87 78 -81 -168 257 16 -166 45 44 44 -150 122 115
4310 115 -257 87 28 -81 100 -102 62 -11 -245 160 191 -134 -154 27 73 -23 41 72 -225 -132 306 121 -155
4333 -155 -144 -96 235 88 -113 73 -221 -93 347 121 -171 -290 115 281 -100 47 -23 -199 110 171 113 -167
4355 -167 -275 180 215 -108 -70 22 -75 -26 159 106 -166 -201 176 158 -155 12 10 -63 -33 53 204 -169 -252 201 67
4380 67 -46 -18 -28 25 -128 127 241 -246 -201 158 168 -39 -124 30 -15 -84 212 145 -263 -128 167 202 -9 -242
$$ packed form
4221C8j46j27J87L75j74l37mP8K78L1p9k90k46N95J12j74j35m52M59L19j88M3
4243A63m84K3M33K12p9o69J43L64J0K18l64l57K44K89J56j95m02j7M60J04k35
4264A7m2j83K5L04J87k74m08L52J21p9J79l49K2J33o0K95j76l03J70J77j8j55
4286f5J40o3k41L03J58k72q4J34k4M1N0j64J65j59q7M25k41j82K11j%j94K72p
4310A15l72L44n9j09J81k02J64p3k34M05L1l25k0J81M6r6O4L1k97R3M38j85k76
4333a55J1M8L31j47k01J86k94J28M40k26k92j19M05J66l81J47p0j76L09O1n8k80
4355a67j08M55L5l23L8R2r7M9J85n3k72l5L77j8l13J67kp3L0Q6J51l73q3M53j34
4380F7j13K8j0N3j53K55J14m87M5L59J0k07q5J54m5o9K96o7m08J35K95L5k11k33
$$ plain form
4404 -242 42 110 -115 196 87 -283 -95 212 242 -156 -213 142 -14 38 121 -78 -91 -147 131 302 -213 -218 145
4427 145 57 -61 75 80 -226 -165 248 170 -174 -156 -6 68 68 -12 58 -120 -276 243 352 -242 -228 80 103 17 98
4452 98 50 -295 -100 304 188 -76 -298 -29 280 1 -14 91 -207 -165 311 262 -247 -248 121 133 -1 37 -37
4475 -37 -145 -54 116 190 -67 -308 91 205 -167 15 119 -155 -157 119 209 -134 -129 74 -19 7 5 70 12 -287 32
4500 32 322 -50 -180 31 37 -101 98 207 -156 -246 68 239 54 -123 -82 21 -1 32 219 -56 -361 69
4522 69 296 17 -99 -70 -17 -59 110 219 -127 -270 -37 245 149 -177 -82 -13 -80 120 211 -97 -345 -20 247
4545 247 116 -109 -147 -20 -31 67 229 -92 -308 -65 252 170 -173 -64 -17 -86 182 153 -45 -245 -123 290
4567 290 138 -135 -59 5 -37 55 213 -20 -270 -34 212 96 -78 -36 -43 -24 44 92 100 -235 -153 249 48 -72
$$ packed form
4404b42K84O8k25L11j09l70J88L07L0l98n7L55j56N2Q3j99j3n6K78J71n15nL63
4427A45q8j18J36Nl06O1M13p8l44J8J50P4%q0P0j78j56N19J09n94J4L08K3q6Q1
4452I8m8l45J95M04j16k64k22K69L09k79j5J05k98M2M76m9n09jL69J2j34L8p4
4475c7j08R1J70P4k57k41L99J14l72J82J04k74kK76R0l43NK03r3K6kO5n8k99L19
4500C2K90l72j30K11Oj38J99J09l63r0L14J71j85j77M1J03k2L3J87k75l05M30
4522F9K27k79j16K9N3m2J69J09l46j43K33K82r6l26R5O9o7K00R1l08k48L25K67
4545B47j31k25l8J27j1R8J62l21k16K43L17q2l43J09M7o9K68k9j98k00J22M13
4567B90j52k73P6O4m2R2J58k33k50K36K46j16j74M2pJ9O8M8Ql35Q2M02k01j20
$$ plain form
4591 -72 -7 -53 -61 -21 192 23 -195 -46 14 142 11 -132 44 -88 -98 203 106 -225 -152 121 74 0 22 -81
4615 -81 -92 16 159 87 -126 -175 26 245 -27 -95 72 -161 3 252 44 -159 -126 105 120 14 -13 -115 20
4638 20 31 34 138 -167 -160 149 103 -66 -72 50 -77 9 146 -52 -74 -58 -15 114 11 -95 -10 33 -56 37 131 -151
4664 -151 -114 118 47 -4 -29 -31 -58 50 84 -10 -6 -152 34 220 -64 -95 -15 -1 54 76 67 -185 -63 184 59 39
4690 39 -136 -115 138 53 29 -24 -115 -49 106 162 -122 -141 17 16 100 16 -97 -74 -16 86 83 -11 -161 -39 141 -15
4716 -15 29 -3 -122 -21 66 117 -29 -97 -71 17 147 -6 -44 -63 -130 128 161 -20 -164 -86 128 77 101 -89 -188
4741 -188 65 75 147 8 -240 -2 110 125 -27 -103 -8 -48 136 84 -140 -18 -32 49 91 -74 -53 23 20 -62 22
4766 22 43 -69 18 -16 -74 15 72 8 -102 -49 -20 119 112 -188 -60 30 36 166 -6 -178 -120 134 199 -37 -73 -161
$$ packed form
4591g2O5m6qM0K13j69k18J49O0J28j31j43J76j32j0L01r7l31P3K73m7p4K2j03
4615h1j1J08J43p2k13m9K01K19k72o8J67k33J64K49k08k03L3K31J5j06k7j02J35
4638B0J1LJ04l05PL09m6j69oJ22j27Q6J37j98k2J6M3J29j03j06Q5M3q9R3R4k82
4664a51L7K32p1n1k5kk7J08L4r4Mj46J86J86k84l1Q0J4N5K2rk52J22K47j25k0
4690C9j75K1K53q5k4n3r1O6J55N6k84j9J58jQ4q4j13K3N8J02lr4j50J22J80j56
4716a5M4l2j19J01Q7N1j46o8K6Q8J30j53l8j9o7K58L3j81j44P8K14n1K4j90r9
4741a88K53J0P2j39k48K38J12J5j52p6R5m0J84n2k24J22j4Q1M2j65K1P6lq2Q4
4766B2K1j12Q7l4n8Q9N7o4j10N3K9J39pl00J28R0OJ30j72j72N8K54O5k36l6q8
$$ plain form
4792 -161 -28 246 31 -47 -105 -147 135 197 20 -194 -84 75 57 209 -46 -227 -9 69 171 91 -151 -184 8
4815 8 195 78 17 -161 -253 145 274 17 -163 -207 -47 205 230 -108 -239 -106 72 322 76 -298 -202 93
4837 93 245 92 -44 -275 -151 318 177 -48 -159 -205 157 220 29 -126 -165 26 115 177 -33 -249 54 97
4859 97 40 96 -97 -80 40 61 46 1 -47 -74 57 57 -43 43 -14 -103 11 109 -5 -45 -14 -89 62 83 -41 -5 -93
4886 -93 -18 121 36 -75 -87 57 17 -7 73 -132 -53 110 10 34 -20 -40 51 31 -1 -4 56 -24 -34 102 -25 -7 80
4913 80 -34 -49 31 60 21 -3 -36 -35 104 41 -51 -5 -55 3 126 6 -123 -21 53 21 31 -42 -116 26 80 7 -20
4940 -20 -68 -60 95 80 -108 -32 36 -57 79 48 -94 -29 39 40 -20 -27 -24 -19 78 8 -19 74 -77 25 121 -79 -4 69 -41
4969 -41 -21 52 27 -45 -16 25 -2 56 5 -66 29 -9 -19 114 -42 -156 71 66 -16 6 -66 -71 49 100 -5 -85 -63 -6
$$ packed form
4792a61J33K74k15p8n8m2K82O2j77k14J10J59j8J52k55j81K18P8J02q0k42l3J92
4815HJ87j17o1j78r2L98J29k57j80m4J60K52K5l38j31J33J78K50k46l74R6K95
4837I3J52j53j36k31J24M69j41k25j11m6L62O3j91j55l9J91Q9O2k10k16L03M3
4859I7n7N6j93J7J20K1j5m5m8k7J31%j00Q6n7q9J14R8j14m0L1p5J51K1j24L6q8
4886i3P5J39q5j11j2J44m0k4Q0k05P9J63j00K4n4k0R1k0l2lO0q0j0J36j27J8Q7
4913H0j14j5Q0K9l9k4l3JJ39o3r2M6n0N8J23j20j29J02P4l2J0p3p4J42N4p3k7
4940b0m8QJ55j5j88P6O8r3J36l1j42O5O8Jo0pLNR7p0k7R3j51J02R6k00P5P3j10
4969d1K0P3k5p2K9M1k7N8n1p1R5l8j0J33j56j14K27nq2K2p2nJ20N1j05q0K2N7
$$ plain form
4997 -6 122 95 -151 -66 43 -29 110 59 -162 -73 98 94 16 -63 -78 -7 103 53 13 -48 -124 69 182 -14 -104 6
5023 6 -11 -10 153 23 -143 -24 31 84 65 -104 -65 32 10 68 74 -83 -153 61 148 -37 -43 -34 -96 51 98 -1 -42 -124
5051 -124 -31 155 44 -106 -30 -28 -33 103 123 -102 -164 54 96 39 20 -116 -46 56 20 140 -26 -209 32 153
5075 153 55 -51 -6 -50 -70 147 113 -87 -88 -54 104 117 -41 -58 -31 -70 53 204 -31 -207 2 99 38 36 -21 -124
5101 -124 -58 125 109 20 -187 -156 173 118 -56 -13 -104 -99 120 201 -78 -217 -4 83 125 32 -139 -29 6 43 154
5126 154 -18 -202 -27 201 37 -93 20 -29 -52 113 73 -43 -75 -18 75 53 -84 -10 101 -100 -44 140 5
$$ packed form
4997fJ28k7k46Q5J09p2J39n1k21Q9J71mp8p9j5P1J10n0m0o1p6J93J13j96r0J10
5023Fj7JJ63j30j66J19N5N3j9j69L9R7k2N8Oj57p0K14Q7j85oRo2J47M7r9m1q2
5051a24R3J86j11j50P6KnJ36K0k25o2K18M2n7j9j36P0J02l6J20j66j83K41J21
5075A53r8j06M5m4k0K17l4k00jL4J58J3j58j7K7l9J23J51k35j76K09R7o1kn7j03
5101a24O6J83j6q9k07L1L29n5j74M3r1NK19Q1k79j39K13Q7M2r3j71J10L5L7J11
5126A54j72j84J75K28j64j30J13m9k3J65m0j16l2N7R3k2j37P4J11k01N6J84j35
$$ [...]
8191D7
##END NTUPLES=NMR FID
##END=
