##TITLE=1H_AM_NVBuAPIO
 200.13MHz, ,
 8 sc
 
 28.4.2025
##JCAMPDX= 6.0         $$ Bruker NMR JCAMP-DX V2.0
##DATA TYPE= NMR FID
##DATA CLASS= NTUPLES
##ORIGIN= UXNMR, Bruker Analytische Messtechnik GmbH
##OWNER= pz
$$ XWIN-NMR		Version 3.5
$$ Mon Apr 28 15:56:14 2025 Russian Standard Time (UT+4h)  she@DPX200
##.OBSERVE FREQUENCY= 200.1313
##.OBSERVE NUCLEUS= ^1H
##.DELAY= (6, 6)
##.ACQUISITION MODE= SIMULTANEOUS
##.ACQUISITION SCHEME= undefined
##.AVERAGES= 8
##.DIGITISER RES= 18
##SPECTROMETER/DATA SYSTEM= spect
##.PULSE SEQUENCE= zg30
##.SOLVENT NAME= CDCl3
##.SHIFT REFERENCE= (INTERNAL, CDCl3, 0, 14.3821)
##AUDIT TRAIL= $$ (NUMBER, WHEN, WHO, WHERE, WHAT)
$$ ##TITLE= Audit trail, XWIN-NMR		Version 3.5
$$ ##JCAMPDX= 5.01
$$ ##ORIGIN= Bruker BioSpin GmbH
$$ ##OWNER= she
$$ F:/spectra/data/she/nmr/H-C/1/audita.txt
$$ ##AUDIT TRAIL=  $$ (NUMBER, WHEN, WHO, WHERE, WHAT)
(   1,<2025-04-28 15:54:46.45 +0400>,<she>,<DPX200>,
      <created by zg, POWCHK disabled, PULCHK disabled
       configuration hash MD5:
       00 E9 B6 7A A2 85 ED C7 34 08 36 98 17 FE 4E 26
       data hash MD5: 16K
       33 5B 18 5C 2A FA 9B 81 ED F6 7D EA 24 0E E6 45>)
$$ ##END=
$$ 
$$ hash MD5
$$ C7 0B 44 1B FE 42 00 F4 FA 3F 2F 80 18 97 D4 B7
##$RELAX= 
##$RELAX= 
##$RELAX= 
##$RELAX= 
##$RELAX= 
##$RELAX= 
$$ Bruker specific parameters
$$ --------------------------
##$DU= <F:/spectra>
##$EXPNO= 1
##$NAME= <H-C>
##$PROCNO= 1
##$TYPE= <nmr>
##$USER= <she>
##$AMP= (0..31)
100 100 100 100 100 100 100 100 100 100 100 100 100 100 100 100 100 100 
100 100 100 100 100 100 100 100 100 100 100 100 100 100 
##$AQSEQ= 0
##$AQ_mod= 1
##$AUNM= <au_zg>
##$AUTOPOS= <>
##$BF1= 200.13
##$BF2= 200.13
##$BF3= 200.13
##$BF4= 200.13
##$BF5= 200.13
##$BF6= 200.13
##$BF7= 200.13
##$BF8= 200.13
##$BYTORDA= 1
##$CFDGTYP= 0
##$CFRGTYP= 5
##$CHEMSTR= <none>
##$CNST= (0..31)
1 1 145 1 1 1 1 1 1 1 1 1 1 1 1 1 1 1 1 1 1 1 1 1 1 1 1 1 1 1 1 1 
##$CPDPRG= <>
##$CPDPRG1= <>
##$CPDPRG2= <>
##$CPDPRG3= <>
##$CPDPRG4= <mlev>
##$CPDPRG5= <mlev>
##$CPDPRG6= <mlev>
##$CPDPRG7= <mlev>
##$CPDPRG8= <mlev>
##$CPDPRGB= <>
##$CPDPRGT= <>
##$D= (0..31)
0 0.7 0 0 0 0 0 0 0 0 0 0.03 0 0 0 0 0 0 0 0 0 0 0 0 0 0 0 0 0 0 0 0 
##$DATE= 1745841285
##$DBL= (0..7)
120 120 120 120 120 120 120 120 
##$DBP= (0..7)
150 150 150 150 150 150 150 150 
##$DBP07= 0
##$DBPNAM0= <>
##$DBPNAM1= <>
##$DBPNAM2= <>
##$DBPNAM3= <>
##$DBPNAM4= <>
##$DBPNAM5= <>
##$DBPNAM6= <>
##$DBPNAM7= <>
##$DBPOAL= (0..7)
0.5 0.5 0.5 0.5 0.5 0.5 0.5 0.5 
##$DBPOFFS= (0..7)
0 0 0 0 0 0 0 0 
##$DE= 6
##$DECBNUC= <off>
##$DECIM= 32
##$DECNUC= <off>
##$DECSTAT= 4
##$DIGMOD= 1
##$DIGTYP= 9
##$DL= (0..7)
0 120 120 120 120 120 120 120 
##$DP= (0..7)
150 150 150 150 150 150 150 150 
##$DP07= 0
##$DPNAME0= <>
##$DPNAME1= <>
##$DPNAME2= <>
##$DPNAME3= <>
##$DPNAME4= <>
##$DPNAME5= <>
##$DPNAME6= <>
##$DPNAME7= <>
##$DPOAL= (0..7)
0.5 0.5 0.5 0.5 0.5 0.5 0.5 0.5 
##$DPOFFS= (0..7)
0 0 0 0 0 0 0 0 
##$DQDMODE= 0
##$DR= 18
##$DS= 0
##$DSLIST= <SSSSSSSSSSSSSSS>
$$ [...]
##$SUBNAM0= <"">
##$SUBNAM1= <"">
##$SUBNAM2= <"">
##$SUBNAM3= <"">
##$SUBNAM4= <"">
##$SUBNAM5= <"">
##$SUBNAM6= <"">
##$SUBNAM7= <"">
##$SUBNAM8= <"">
##$SUBNAM9= <"">
##$SW= 18.0517328524113
##$SWIBOX= (0..15)
0 0 2 0 0 0 0 0 0 0 0 0 0 0 0 0 
##$SW_h= 3612.71676300578
##$TD= 16384
##$TD0= 1
##$TE= 0
##$TE2= 300
##$TE3= 300
##$TEG= 300
##$TL= (0..7)
0 120 120 120 120 120 120 120 
##$TP= (0..7)
150 150 150 150 150 150 150 150 
##$TP07= 0
##$TPNAME0= <>
##$TPNAME1= <>
##$TPNAME2= <>
##$TPNAME3= <>
##$TPNAME4= <>
##$TPNAME5= <>
##$TPNAME6= <>
##$TPNAME7= <>
##$TPOAL= (0..7)
0.5 0.5 0.5 0.5 0.5 0.5 0.5 0.5 
##$TPOFFS= (0..7)
0 0 0 0 0 0 0 0 
##$TUNHIN= 0
##$TUNHOUT= 0
##$TUNXOUT= 0
##$USERA1= <user>
##$USERA2= <user>
##$USERA3= <user>
##$USERA4= <user>
##$USERA5= <user>
##$V9= 5
##$VALIST= <valist>
##$VCLIST= <CCCCCCCCCCCCCCC>
##$VD= 0
##$VDLIST= <DDDDDDDDDDDDDDD>
##$VPLIST= <PPPPPPPPPPPPPPP>
##$VTLIST= <TTTTTTTTTTTTTTT>
##$WBST= 1024
##$WBSW= 4
##$XGAIN= (0..3)
0 0 0 0 
##$XL= 0
##$YL= 0
##$YMAX_a= 221050
##$YMIN_a= -223007
##$ZGOPTNS= <>
##$ZL1= 120
##$ZL2= 120
##$ZL3= 120
##$ZL4= 120
##$ABSF1= 10
##$ABSF2= 0
##$ABSG= 5
##$ABSL= 3
##$ALPHA= 0
##$AQORDER= 0
##$ASSFAC= 0
##$ASSFACI= 0
##$ASSFACX= 0
##$ASSWID= 0
##$AUNMP= <proc_1d>
##$AZFE= 0.1
##$AZFW= 0.1
##$BCFW= 1
##$BC_mod= 2
##$BYTORDP= 1
##$COROFFS= 0
##$CY= -3
##$DATMOD= 1
##$DC= 2
##$DFILT= <>
##$DTYPP= 0
##$F1P= 0
##$F2P= 0
##$FCOR= 0.5
##$FTSIZE= 0
##$FT_mod= 4
##$GAMMA= 1
##$GB= 0.15
##$INTBC= 1
##$INTSCL= 1
##$ISEN= 128
##$LB= 0.25
##$LEV0= 0
##$LPBIN= 0
##$MAXI= 10000
##$MC2= 0
##$MEAN= 0
##$ME_mod= 0
##$MI= 1.114404
##$NCOEF= 0
##$NC_proc= 0
##$NLEV= 6
##$NOISF1= 3.799351
##$NOISF2= 2.8
##$NSP= 1
##$NTH_PI= 0
##$NZP= 0
##$OFFSET= 14.38212
##$PC= 1
##$PHC0= -1265.59
##$PHC1= 8.592211
##$PH_mod= 1
##$PKNL= yes
##$PPARMOD= 0
##$PSCAL= 0
##$PSIGN= 0
##$REVERSE= no
##$SF= 200.129724274929
##$SI= 16384
##$SIGF1= 3
##$SIGF2= 2
##$SINO= 400
##$SIOLD= 16384
##$SREGLST= <1H.CDCl3>
##$SSB= 0
##$STSI= 0
##$STSR= 0
##$SW_p= 3205.1282051282
##$SYMM= 0
##$S_DEV= 0
##$TDeff= 0
##$TDoff= 0
##$TI= <>
##$TILT= no
##$TM1= 0
##$TM2= 0
##$TOPLEV= 0
##$USERP1= <user>
##$USERP2= <user>
##$USERP3= <user>
##$USERP4= <user>
##$USERP5= <user>
##$WDW= 1
##$XDIM= 8192
##$YMAX_p= 0
##$YMIN_p= 0
$$ End of Bruker specific parameters
$$ ---------------------------------
##NTUPLES= NMR FID
##VAR_NAME=  TIME,          FID/REAL,        FID/IMAG
##SYMBOL=    X,             R,               I
##VAR_TYPE=  INDEPENDENT,   DEPENDENT,       DEPENDENT
##VAR_FORM=  AFFN,          ASDF,            ASDF
##VAR_DIM=   8192,          8192,            8192
##UNITS=     SECONDS,       ARBITRARY UNITS, ARBITRARY UNITS
##FACTOR=    0.0002768,     1,               1
##FIRST=     0,             0,               0
##LAST=      2.2672688,     0,               0
##MIN=       0,             -223007,         0
##MAX=       2.2672688,     221050,          0
$$ Real data points
##PAGE= N=1
##DATA TABLE= (X++(R..R)), XYDATA
0@%%%%%%%%%qJ6j6J6j6K4l2M0n6O5p4R3j16J37j61J92k25K59k99L46m00M61n25
32b79N97o77P65q64R71j088J219j363J519j690J876k077K300k543K807l094L408
49A787l755M135m555N018n530O103o748P474q299R251j0362J1675j3255J5204
63H143j7676K0923k5403L2036m3002O5530j85723J63627N5331j18861K07598k80073
75a17550K56485j46208j72833K08367n7429R9785l0268p8390Q2719m4152k5397
86b4871k0918N7700l5246Q8147p4859n8115J62398j17763O1120q3560m5767K21908
98A30174k05138O7510L8648j1154P9682k41103J25218N3653m5201K9102q2643
109f1252J65244j08941m6737M0206k6108J43963j61174N4671K5454q8504J36780
$$ plain form
0 0 0 0 0 0 0 0 0 0 0 -8 8 -8 8 -8 16 -16 24 -32 33 -41 52 -64 73 -88 104 -121 138 -161 185 -215 246 -279
32 -279 318 -359 406 -458 513 -575 644 -719 800 -890 986 -1091 1209 -1334 1473 -1621 1787
49 1787 -1968 2167 -2388 2630 -2900 3203 -3545 3929 -4370 4881 -5481 6194 -7061 8143
63 8143 -9533 11390 -14013 18023 -24979 40551 -145172 18455 73786 -45075 162523 -117550
75 -117550 138935 -7273 -180106 28261 -29168 70617 40349 -38041 44678 526 -24871
86 -24871 -45789 11911 -23335 64812 -10047 -68162 94236 -23527 37593 -45967 -91734 130174
98 130174 -74964 -7454 31194 20040 99722 -141381 -16163 37490 -7711 21391 -61252
109 -61252 103992 -4949 -51686 -11480 -37588 106375 -54799 -128 25326 -63178 73602
120G3602j40922Q7277L7514r0177P9277j43662P9393P6282o0343J9872l0531N4236
132D1818m8403n7900J2936J03776J8309j23907Q2409l6402J8330k1504r4903K07402
144A01961r6726k4925N4111j04117J49274j14889l229R5877j12794J03882o5215
155a6790j1802P3477n6619M3051o7303L231N4483j0538j3956j5919P1961m6153
167G123l9874q905L4522P6268j05411L7765L3140m0769J0341p7443R6537J5403
179C8697n8687M2226l9077L8481l4908j6018M6584k9745L8463k8980j50M595j3274
192a1793M2515o0487J8788K1553n994J2742n3986O5844j663n7625J2594j269N3772
205C4991l7480j6612N2057j9944j7826l5188L2557K5921k5140J6298j492J2112
$$ plain form
120 73602 -67320 19957 57471 -32706 46571 -97091 -17698 58584 -1759 18113 -12418 41818
132 41818 -6585 -64485 -51549 52227 70536 -53371 29038 -7364 10966 -10538 -105441 101961
144 101961 5235 -19690 34421 -69696 79578 -35311 -38540 57337 -55457 48425 -16790
155 -16790 -28592 44885 -11734 31317 -35986 -32755 21728 11190 -2766 -18685 53276 7123
167 7123 -32751 -41656 -7134 69134 -36277 1488 34628 -6141 4200 -73243 23294 38697
179 38697 -19990 22236 -16841 21640 -13268 -29286 17298 -12447 26016 -2964 -3114 1481 -11793
192 -11793 30722 -29765 -10977 10576 4582 17324 -36662 29182 27519 -30106 -17512 -18781 34991
205 34991 -2489 -19101 32956 13012 -4814 -40002 -7445 18476 -6664 9634 8142 20254
217B0254k9564j1504K1953j8513K7201k762P80J03k0616L1145k9078j1171K4540
230B768K958P101l1945K5033K2070l4295q801L724K5624j8951j6818L4181P503
243B0152j0202k3209J0919Q851k5827Q152J3890J2894o377p524J0452k1591p777
256a7197Q526P356M902k728K0074o038k6849j058Q970L321j3041J2451K5506j1964
270A2231j9188P94J1755j0274j5500J7563J7012p553r600R496M249j9629p589
283a6233J2697N977n141N332J4191p715j8025P98O922n008l184J5763J0839j5295
297A918r741R951J259j1619n13J5467Q02j6029L745J4845k103j1661J002P655
311D978j2135r660J5883J4620l781p587L900n267j9567N90J9828J0803n386k67
$$ plain form
217 20254 -9310 -20814 1139 -17374 9827 7065 7845 7948 -12668 18477 -10601 -21772 2768
230 2768 5726 12827 -19118 5915 27985 -6310 -15111 -11387 14237 -4714 -21532 12649 20152
243 20152 9950 -13259 -2340 6511 -19316 -11164 2726 15620 9243 1719 12171 -9420 -17197
256 -17197 -8671 -1315 3587 859 20933 14895 -11954 -13012 -4042 -721 -13762 -1311 24195 12231
270 12231 -6957 -6163 5592 -4682 -20182 -2619 14393 6840 -2760 6736 10985 -8644 -16233
283 -16233 -3536 2441 -2700 2632 16823 9108 -8917 -8119 -1197 -6205 -9389 6374 17213 1918
297 1918 -7823 2128 3387 -8232 -8745 6722 7524 -8505 -4760 10085 7982 -3679 -2677 4978
311 4978 -7157 -16817 -934 13686 9905 2318 6218 951 -18616 -18026 1802 12605 7219 6952
325F952N253j5423j7284P606J6796K241n244Q617K544j6876q063R215P356p677
339c987j008J3879r12j0426Q73O987n346j4142P474J2921k678j451N394K421j7202
354g203j0621J3931P058m73J825Q239n253k2275K177J1890L401j007L263R024
368A3976j6353j1771R331P293J393o914J0284J69j6577K757O914P221r522k581
382d380J1439j0442j458M275Q585j877j6148J0017j084l719M593O077Q828k1284
396f578j738P579m765M762j37J8110r818k0061Q735j373O860o415R502J3299k2842
411d880j337r83Q527J099q293J7843j0463n131j577J863J1672j4207J2477l016
425C594j0616M885m335J8217j4317J0J3624j6593L339r348J8286M313k2615J6048
$$ plain form
325 6952 12205 -3218 -20502 -12896 3900 6141 897 9514 12058 -4818 -12881 -3666 3690 -3987
339 -3987 -4995 8884 7972 -2454 -1581 5406 60 -14082 -6608 6313 3635 2184 7578 9999 -7203
354 -7203 -17824 -3893 3165 2692 4517 12756 7503 -14772 -12595 -705 2696 1689 4952 13976
368 13976 -2377 -14148 -4817 2476 3869 -3045 7239 7408 -9169 -6412 502 7723 -1799 -4380
382 -4380 7059 -3383 -4841 -566 8019 6142 -10006 11 -1073 -4792 -199 5878 14706 -6578
396 -6578 -8316 -737 -5502 -740 -877 17233 7415 -12646 -3911 -5284 1576 -4839 4663 17962 -4880
411 -4880 -6217 -7200 1327 2426 -5867 11976 1513 -3618 -5195 -3332 8340 -5867 6610 3594
425 3594 -7022 -2137 -6472 11745 -2572 -2562 11062 -5531 -2192 -11540 6746 11059 -11556 4492
439D492m019M449j0683k665K4169k0542R25k094P037J0805k0174J8889r602p672
453f685K823j0660K4311r156R247M728k4345N824j0460J3098J95L05K3019j5205
467G039p700j7329J2722R320j7472K2712k707J0539j9181j9373L3582k3178J0551
480d75Nl316K8178l7341J5586J470j6005K0459k3351J8440P80n708J6788k2294
494f784N020j960K410k320m824K2480p283j841j8161J0009J5791k9269J9654j863
508A059R796l282l2670L7089j1652j975M968j4188K9152k8313L985R998q780K0996
522A6183k4491J1634o678n485K0242k5112K1685m398M92M344l2900L2490n148
535B858p121O039q930K8422k4611j0219J4904K011J934j8794J6448M145j496j0311
$$ plain form
439 4492 473 4922 -5761 -8426 15743 -4799 -3874 -5968 1069 11874 -8300 10589 987 -6685
453 -6685 -3862 -14522 9789 633 9880 14608 -9737 -3913 -14373 -1275 -1080 -775 22244 7039
467 7039 -661 -17990 -5268 4052 -13420 9292 6585 17124 -2057 -21430 12152 -11026 -475
480 -475 -470 -3786 24392 -12949 2637 4107 -11898 8561 -14790 3650 4430 -1278 15510 -6784
494 -6784 -1764 -3724 -1314 -3634 -8458 14022 6739 4898 -13263 -3254 12537 -16732 2922 1059
508 1059 10855 7573 -25097 11992 340 -1635 3333 -10855 18297 -10016 -6031 3967 -4813 16183
522 16183 -8308 3326 -3352 -8837 11405 -13707 7978 3580 4072 8416 -24484 8006 2858
535 2858 -4263 1776 -7154 21268 -3343 -13562 1342 3353 5287 -13507 2941 7086 5590 -4721
549d721n126K5128k5319J0663k347o445L0378l5427J9357m703j6705L5887l9220
562a8600J8678R467j4289K3136l8960J9773J3815k2399R131p498K1909p766j8831
575a2434Q972Q866K834k2345J4683M547p89k222j8668L0474j4622m606J0720j8123
589a2713K7620j8021j084R776j6214K4865k0101o40R593k968J2468k7476J4720
602a75Q144q040r23j5575L3554j1808j5302J1409n854K0694k7161J38K3560j3855
616a194P165j5482R927Q496j6090P509n363J0480k173m707J022n739J6183j3547
630c513l1J860O23J6388k8901J1082J1687r440M194k2573K5841L819k1633J2428
644A831l271J4593j5727j2625J9489l723L582q970P364O447j2612K418q942J2011
$$ plain form
549 -4721 -9847 15281 -10038 625 -1722 -8167 22211 -13216 6141 1438 -15267 20620 -18600
562 -18600 78 9545 -4744 18392 -20568 -795 13020 -9379 -248 -7746 14163 6397 -12434
575 -12434 -3462 5404 8238 -14107 576 5123 4334 2112 -16556 13918 -704 -5310 5410 -12713
589 -12713 14907 -3114 -4198 5578 -10636 14229 -5872 -6512 3081 113 12581 -14895 -175
602 -175 7969 -71 -994 -16569 16985 5177 -10125 1284 -4570 16124 -11037 -10899 12661 -1194
616 -1194 5971 -9511 416 8912 -7178 331 -5032 5448 3275 -1432 -410 -6149 10034 -3513
630 -3513 -3544 -1684 -1061 15327 -13574 -2492 9195 -245 3949 -18624 7217 11036 -10597 1831
644 1831 -1440 13153 -2574 -15199 4290 567 4149 -4821 2543 8990 -3622 -1204 -10146 1865
658A865J668l839O427j2323J3791o667j0371P474j351J6300j5275n427J5794n262
672B804k163j3862J3190J1202j5115Q81K132J1785j0426j1657J1920J04L080q248
686d373M289P868r872K541o883N305M813l911M842j0117P513J306q879L866k12
701a904J3069r829j1864J1646M02R13q906O473J3305j4192o775J829Q974Q5p912
716d686P860L289l987q727O36O145j299M109k208J316k66m616K708p318N066P919
732E941n109m33j884O791k702j2511O240P279k91n960J958R010n758r801L01R221
748B292J18m692N227K015k298p341j415O562j619L139K546l438p16k557O00j043
764b620m71P639P98p137j431M699Qn048KP680J402r453K50P095j370m520r06O203
$$ plain form
658 1865 3533 -306 6121 -6202 7589 922 -9449 -1975 -3326 12974 -2301 -7728 8066 2804
672 2804 641 -13221 -31 11171 -3944 -3063 -931 10854 428 -11229 691 795 3875 -4373
686 -4373 -84 7784 -2088 453 -6430 -1125 3688 -223 4619 -5498 2015 3321 -5558 -1692 -1904
701 -1904 11165 1336 -10528 1118 1520 2433 -6473 0 13305 -887 -7662 -5833 3141 3226 -4686
716 -4686 3174 6463 2476 -6251 -5615 530 -769 3340 1132 2448 2182 -2434 274 -7044 -1978 5941
732 5941 832 399 -1485 5306 2604 -9907 -3667 3612 3321 -2639 -681 8329 2571 -7230 -6929 2292
748 2292 2410 -2282 2945 4960 2662 -4679 -6094 468 -1151 1988 4534 1096 380 -2177 -1577 -2620
764 -2620 -3091 4548 5346 -1791 -3222 1477 1485 -3563 -3561 4119 5521 -3932 -3682 3413 2043 -2477 -3383 2820
782B820M58p149K891M182k497k136j86K399p89j727M145m9m409J418J348k103
798a384r04K777M540m069n211M695J408m303n35M931L471o071l536N430M68m563
814b856P56M870L34m620n96L988j437l599L293K130k362j158J880K047m455j140
830b925N068j512k669J590L690q33o112K051L722k822j640L343L882m452m068
845c687L121J223k253l32N468L97n517l31J407Q2k651K922N614m208k703O95R39
862A86k056k571P252J364m182n94P80J125n827J639O268j647j272r27L262l160
878c60m872N126J190p5j597K468J922p287J122K137Q00j228n49O730m911l538
894b922J796R38J253n089O328K138n755L05j077M648m699q52P607l935l51k839
$$ plain form
782 2820 3278 -3871 -980 3202 705 -1431 -1617 782 -7 -1734 2411 2362 -2047 -629 719 -1384
798 -1384 -2288 489 5029 960 -4251 444 1852 -2451 -2986 1945 5416 -655 -4191 1239 1707 -2856
814 -2856 -2100 2770 3104 -1516 -2112 1876 439 -3160 133 2263 -99 -1257 623 2670 -1785 -2925
830 -2925 2143 631 -2038 -448 3242 2409 -3703 -1652 2070 -752 -2392 951 4833 381 -3687
845 -3687 -566 657 -1596 -1928 3540 3937 -1580 -1911 -504 -422 -3073 -151 5463 1255 -1448 -753 186
862 186 -1870 -4441 2811 4175 -7 -601 179 1304 -4523 -2884 3384 1737 465 -462 2800 -360
878 -360 -5232 -106 1084 1009 -588 1880 3802 -3485 -2363 -226 574 -654 -1203 5527 616 -2922
894 -2922 -1126 -188 1065 -4024 2304 4442 -1313 -1008 -2085 2563 -2136 -2988 4619 684 333 -2506
910b506L107J374o827O581J34r69j703j273N832o699J424L414p75j5m832O863
926C130k892l540M014m83L427p378L693L727o956L292k179O117l483n263R440
941D666n764R45k044J702N948j0337N884N32k070Q16m352Q776n375j277L794k613
957g69K665o087O254j80m722M742l260M524o622J821O843q553M666l239M540q68
973A755r104J2145m779O4p07j799R371j2056L806L261k607L448p886R157l240
988H29m042N086m507O032o161L283K771p324O605m342L458l088j531R128r002
1003b805K813j125K821J058j0480J1412k443o86j337l206J2147j2607K132L949
1017A643l054P110j2268R247M33p832Q160q020P441k307k982P295r193N735r28
$$ plain form
910 -2506 601 1975 -4852 1729 1863 894 -809 -2082 3750 -2949 -1525 1889 1114 1099 -3733 3130
926 3130 238 -3302 712 229 3656 -3722 -29 3698 -3258 34 -2145 3972 489 -4774 4666
941 4666 -1098 -153 -2197 -495 5453 -4884 1000 1532 -538 278 -4074 4702 -673 -1950 1844 -769
957 -769 1896 -4191 2063 1883 -2839 1903 -1357 3167 -3455 -1634 5209 -3344 1322 -1917 2623 1755
973 1755 -7349 4796 17 81 -626 -2425 6946 -5110 -1304 1957 -650 2798 -5088 4069 829
988 829 -3213 1873 -2634 3398 -2763 520 3291 -4033 2572 -1770 1688 -1400 -2931 6197 -2805
1003 -2805 8 -1117 1704 2762 -7718 3694 1251 565 -772 -3978 8169 -4438 -2306 1643
1017 1643 -1411 5699 -6569 2678 3111 -4721 3439 -4581 2860 553 -2429 4866 -4327 1408 480
1032D80j309O43k796Q279o103o55J27L239J612j1426J0395n84q24r02o592J5139
1048H723j0947k100O471m779R919j2250M201N600r554P475o902N574J453m836
1062a952N987q612N023k69j046K000m422J0423p326l675K317Q2P447j1498N716
1077A95N942o282m77p195J1194p40o242N621j348M798r399rN294l459N806o424
1093b725N587k27n268N822j0400P451J823k924N105q752J0195l774r098N839o17
1108a963Q311p565j381Q743n283k919n933Q969L869o100K668j532M849p814l037
1123f118P566k369N833n228j38K795n991N108n175K976N230l401K15o615O862
1138A550J026n893K280Q89P278r240l562Q221j708J272p792O241O340r939K139
$$ plain form
1032 480 -829 -186 -2982 5297 -806 -1461 -1334 1905 3517 -7909 2486 1902 1078 176 -6416 8723
1048 8723 -2224 -4324 2147 -2632 7287 -4963 -762 4838 -4716 2759 -4143 1431 2884 -1952
1062 -1952 4035 -4577 446 177 -869 1131 -3291 7132 -194 -3869 -1552 -1470 5977 -5521 195
1077 195 6137 -145 -622 -7817 3377 2637 -3605 2016 668 5466 -3933 -3942 1352 -2107 3699 -2725
1093 -2725 2862 2635 -2633 3189 -7211 240 2063 -861 4244 -4508 5687 1913 -7185 -1346 -1963
1108 -1963 6348 -1217 -2598 6145 862 -2057 -7990 979 4848 -1252 1416 -116 4733 -3081 -6118
1123 -6118 1448 -921 4912 -316 -454 2341 -3650 1458 -3717 -741 4489 1088 1303 -5312 1550
1138 1550 2576 -3317 -1037 -148 7130 -2110 -5672 2549 841 2113 -5679 562 6902 -3037 -898
1153h98j581M807m26p026P213j056R99j715l512L659j799K747k150RM096j679
1169A688j646o133N507M231m492M44L29N992o290p026O834K485J237n915K487
1184b68N830o890j591p45N781J077n800M178j753J297j019l636M899j989K417
1199A788r47m304N382k01j363l094M48O063l072l808K458N123k740o029J724M342
1215A770J365o234J938N764m152j968k277M134K997n375L076k34p75Q06l657K301
1231e21P04R99P95l821J097K432p03l672O75M623o98l476j135N688J97o785J276
1248b325L291J341l280j890O177p82m430k26J458K044j612l87K007k93j301l66
1264e74n70k30K725k1j847j62Q15K147l711j626N252k79k913j628K876L495m816
$$ plain form
1153 -898 -2479 2328 1902 -5124 2089 1033 2032 317 -3195 464 -1335 1412 -738 -729 3367 1688
1169 1688 42 -6091 -584 3647 -845 -401 -72 5920 -370 -7396 -562 1923 3160 -2755 -268
1184 -268 5562 -1328 -2919 -3664 2117 3194 -2606 1572 -181 1116 97 -3539 1360 -629 1788
1199 1788 841 -3463 1919 1718 355 -2739 -2291 3772 700 -3108 -650 4473 1733 -4296 -2572 1770
1215 1770 3135 -3099 -1161 4603 451 -1517 -3794 340 3337 -2038 1038 804 29 835 -2822 -521
1231 -521 183 1182 1977 -1844 -747 1685 982 -2690 -2015 2608 1910 -1566 -2701 2987 3184 -3601 -2325
1248 -2325 966 2307 -973 -2863 3314 2532 -1898 -2124 -666 1378 -234 -621 1386 1093 -208 -574
1264 -574 -1144 -1374 1351 1330 -517 -679 136 2283 -1428 -3054 2198 1919 -994 -2622 254 3749 -1067
1281a067j504M199K58l121j704L024K527k424j357K436l29k327J97L04J327L40
1297G79j35R83k526J63J593k407j03J873K166q47l466J945K063l282j955K947
1313b09K737j588k477J791K417l570j933K758Q15l19j262J529J519l192L16P07
1329C9j122N74M35J464r82j004J929q63k360L24K665j68k057Q94K198m63l734
1346b231J150K698k142r92P62K902n46l067K346k18k036n70J047K641j390M73
1362H27J243k149j871l34K440k52k9K507k08k105l017K021J397k041J883J486
1378A798O40l119j681L308j454n80Q50J547L08l301K037O04j480m03J26K357k600
1395a043N70K395j326o61k018K671m16k249L419J42j28k910k8K950k911J168J459
$$ plain form
1281 -1067 -2571 1628 1886 -1235 -2939 85 2612 188 -1169 1267 938 -1389 -1192 -888 439 779
1297 779 644 1627 -899 -736 857 -1550 -1653 220 2386 1539 -1927 18 2081 -1201 -3156 -209
1313 -209 2528 940 -1537 254 2671 -899 -2832 -74 741 422 -840 689 2208 -984 -668 39
1329 39 -1083 -509 -74 1390 408 -596 1333 470 -1890 -1566 1099 931 -1126 -232 1966 1503 -2231
1346 -2231 -1081 1617 -525 -1517 -755 2147 1601 -1466 880 662 -1374 -1944 -897 1744 354 827
1362 827 2070 -79 -1950 -2284 156 -96 -125 2382 2174 69 -2948 -927 470 -1571 312 1798
1378 1798 2438 -681 -2362 946 -508 -1088 -238 1309 1617 -1684 353 957 -523 -926 -800 1557 -1043
1395 -1043 -473 1922 596 -65 -2083 588 172 -2077 1342 1484 1356 -1554 -1582 1368 -1543 -375 1084
1412A084P69j446l025L077o46m14Q96P52Q34m166J688J080r90R29p83K823l419
1429i57j323L421j256J093k079J982O43m593L014O00J022j451j628L479l523J24
1445a432J562J158P28l943K555r16j263J424L10K801m122L46J323k128J866j025
1461g56L645k090l441L219j950J871j024J623K521o080J421j02Q87Q93j673M919
1477C883l300k197N08k82K526k978L210R63k696L95j665K997k749k07L115k040
1493e17J862j962K442m81m605L220j831J972J84O54M071o337L4o34m13K419j695
1510a617O443j732l808k8k480L076k540L057L926l233j05l208J993p63j309M227
1526A899j241Q69k343O79J236l374L313j407N60o28j068M758m436J227R50j805
$$ plain form
1412 1084 1853 407 -2618 459 -187 -601 295 1047 1881 -2285 -597 483 -507 422 -361 2462 -957
1429 -957 -2280 1141 -115 978 -1101 881 1524 -3069 -55 545 1567 116 -1512 1967 -1556 -1432
1445 -1432 130 1288 2016 -1927 628 -288 -1551 -127 183 2984 -1138 -792 531 -1597 269 -756
1461 -756 2889 799 -2642 577 -1373 498 -526 1097 3618 -2462 -1041 -1143 -256 637 -1036 3883
1477 3883 583 -1614 -1106 -1388 1138 -1840 1370 2333 -363 32 -1633 1364 -1385 -1592 1523 -517
1493 -517 1345 -617 1825 1344 -3261 -41 -1872 100 284 938 5009 -1328 -1294 -1928 -2341 78 -1617
1510 -1617 4826 3094 -714 -742 -3222 -146 -2686 371 4297 1064 959 -2249 -256 -1019 -2328 1899
1526 1899 658 1527 -816 -137 1099 -2275 1038 -369 191 -437 -1505 3253 -1183 44 994 -811
1542h11J397m275N299N30l491K408j975K702l321o48M746k665L99j937J976J082
1558A416k874K923j343M47j952n84L125k373L496o62j414l36l223M176k351P70
1574g59L919j661K91n040K084J987l109K526M99K783l342k958L458j361Q38j872
1590a717K229K152m008K128j421J082j26k511L444k593J921J218k299J495k516
1605a522K276j390k001M127q8K99l315Q41K627l552L74P32L400j496l855L152
1621F09m62K53j935O32L593l282N55n27N15J147k429K090j521P10J241j953J139
1638C75j255K424j226k982L176J55R76l033J58M266l810q28K76K630J193m830
1654b335K356J345j150j257j039L530n48j175K05K12N48j463N10p00J067J133
$$ plain form
1542 -811 586 -3689 1610 2140 -1351 1057 -918 1784 -1537 -2185 2561 -104 295 -1642 334 1416
1558 1416 -1458 1465 122 569 -1383 -1967 1158 -1215 2281 1619 205 -131 -3354 822 -1529 -759
1574 -759 3160 1499 1790 -3250 -1166 821 -2288 238 737 3520 178 -2780 678 -683 155 -1717
1590 -1717 512 2664 -1344 784 -637 445 319 -2192 1252 -1341 580 1798 -501 994 -1522
1605 -1522 754 -636 -2637 1490 1402 1701 -1614 -773 1854 -1698 -1324 -592 2808 1312 -2543 609
1621 609 147 400 -1535 -903 2690 -592 -37 -564 -49 1098 -1331 759 -762 -52 1189 -764 375
1638 375 -880 1544 318 -2664 512 667 1643 -1390 -1232 3034 -776 -1604 -1328 1302 2495 -2335
1654 -2335 21 1366 216 -1041 -2080 1450 902 -273 -68 144 692 -771 -261 -961 106 1239
1670A239j316L35j428K581m96l590K533N28J277k395j374N259k305k327k00J479
1686b00K446m048Q83L080n35j670k264J987N33q95N37R17J150j549o59j301M6
1703a542K170m69L57o02J312N32m037N01K059J157j589j940L789L78k799j119
1719a842J838K053l231q19K312J546q51k310J824Lj350j67j79K346k04l23k96
1736C50j616J578j67j056O5J118J722k310j306K235J479k178k568K140J695j213
1752c2j349K218K713l326k590M65J448Q34j132K400J167k186j556j687J007J384
1768b22R97J098j023m2l94j805j098J581K777p79j710N84J837j264l116J675K118
1785A214q33j768O60L428j279k679K89O78J34j264J332K155o75j126j267k77K13
$$ plain form
1670 1239 -77 258 -1170 1411 915 -2675 -142 386 1663 -732 -2106 3153 848 -1479 -1679 -200
1686 -200 2246 -1802 -919 2161 1626 -44 -2308 -321 212 -683 -146 771 1921 372 -287 -1588 -1542
1703 -1542 628 159 516 -86 1226 1758 -2279 -1778 281 1438 -151 -2091 1698 2076 -723 -1842
1719 -1842 -4 2049 -1182 -2001 311 1857 1006 -1304 520 523 -827 -994 -1173 1173 969 646 350
1736 350 -1266 312 145 -911 -846 272 1994 -316 -1622 613 2092 -86 -2654 -514 1181 -32
1752 -32 -1381 837 3550 224 -2366 -1901 -453 381 -751 1649 2816 630 -926 -2613 -1606 -222
1768 -222 775 1873 850 808 414 -1391 -2489 -908 1869 1090 -620 -36 1801 537 -2579 -904 1214
1785 1214 381 -1387 -727 2701 1422 -1257 -968 -290 -156 -1420 -88 2067 1392 266 -1001 -1278 -1065
1802a065J037J053m72J31n5q28j722M61L182j82j922n65J389K64k623J237K794
1819B114m82k558j192K446L36j332Q38J209l75k375p4J338M43M15k07k3j248r5
1837h22R86o57P07O81J17j599j543K580P87j240m56Q89P04k747j27K775Q54j545
1855C44j629J455j12j268P03J653P65k281n26L75m87R84N25J076j143j251R10
1872I3j278J59J198J357k46k538J068O85j036n59J002J955k122r37J491Q49o32
1889E09j950J571L2j424R38J033J553j880j022M48j862P77J266J978P4j894N08
1906F55j876j295P87K351J886j934K49j40j594j233K67L379o67p84Q09k82k44
1923C34k269J615R93j571Q89J24J327j262o84J579k058k09K91J514O43j721J886
$$ plain form
1802 -1065 -28 1025 553 684 629 -199 -1921 -1460 1722 1540 -382 -947 442 706 -1917 -680 2114
1819 2114 1632 -926 -2118 328 664 -668 170 1379 1004 -1371 -1445 -107 336 751 544 521 -727 -822
1837 -822 164 -493 214 895 1012 -587 -2130 450 1237 -3 -459 430 1134 -1613 -1740 1035 1889 344
1855 344 -1285 170 58 -1210 -507 1146 1911 -370 -896 -521 -1008 -24 501 1577 434 -817 93
1872 93 -1185 -1026 172 1529 1283 -1255 -187 498 -538 -1097 -95 1860 -262 -1199 292 1141 509
1889 509 -1441 130 162 -1262 -324 709 2262 382 -640 -192 -2054 -1277 -11 1967 2041 147 655
1906 655 -1221 -2516 -1729 622 2508 574 823 683 -911 -2144 -1877 1502 835 51 860 578 334
1923 334 -1935 -320 673 -898 -9 115 1442 180 -504 1075 -983 -1192 -901 613 1256 -465 1421
1940A421p49j635n72O28K369j881M63J239r53o75j274K492l31j565J111j59O88
1957F17j470J183J432k268N9n99R26m58j42L116j366r12r77R5N61k077K934J235
1975A889p60q43j205J747k434q2K260J91N63j995J662l14k386J289k36J354j099
1992c99K98K192k415J70l70L33j54j392L083l75p95r4m5O89k857J395J563m28
2010C99m9q38K299k078j360J656k60R88j828J746R76k663J082o21R96r27o56K827
2028A689j887J86O6J91L00k386K375j25q96N21K2J634k730K18J485j130K33o91
2046i25K589p23k157J418m61M08j524J354K043k328L62n55P98p15j151L101j190
2063C44j37k37l11J082k485K049O32j370O94o89J614j750m51K110j254k71o49
$$ plain form
1940 1421 672 -963 -1535 -907 1462 -419 44 1283 330 -345 -1619 873 542 -1023 88 -71 617
1957 617 -853 330 1762 -506 -447 -1046 -120 -578 -720 2396 1030 118 -859 -764 -203 -2280 654 1889
1975 1889 1129 286 -919 828 -1606 -1688 572 763 1326 -669 993 679 -1707 -418 -654 700 -399
1992 -399 -101 2091 -324 -154 -524 -191 -345 -1737 1346 971 176 82 37 726 -2131 -736 827 399
2010 399 350 -488 1811 -267 -1627 29 -231 757 -1071 675 1651 -1012 70 -551 445 -482 -1138 1689
2028 1689 -198 -12 54 245 545 -1841 534 409 -487 34 56 1690 -1040 -822 663 -467 -234 -925
2046 -925 1664 941 -1216 202 -259 149 -1375 -21 2022 -306 56 -499 299 -416 -1567 1534 344
2063 344 207 -30 -341 741 -1744 305 937 -433 261 -428 1186 -564 -1015 1095 -159 -430 -1079
2080a079K108J69k127J257j65k6j998Q91K995j735L36o87L28o05k417L254K86
2097G85k8L10j236Q40k474P32J640p57J027m35O87j635r26K069n25k67p29J807
2115H85L57k589J412O11J52j973o50L148j193l56M02O68N2k938J372Q49m0L40
2133E09n90J199j890J59R60q41J137p99Q01j208j231L083m11m08p34J66P62l105
2151b441R84K946P36j353j712J164r29j583O35K849J404k264j38p25n59k08l87
2168a581K841m63L3N43k340O02m76N94K20j397K773K64j531n81L92R45k583l62
2186b107K713J635j229j780J594o31j950l43J938K760j807o71K43j119l7o77J697
2203B29R63n12K38j620m04O54J035j71j060J291O7j247j218J681K505k427j174
$$ plain form
2080 -1079 1029 1198 -929 328 163 137 -1861 -970 2025 290 626 -61 267 -338 -2755 499 785
2097 785 757 1067 -169 671 -1803 -1071 569 -188 839 404 1091 -544 -1470 599 74 -193 -922 885
2115 885 1242 -1347 65 676 828 -1145 -1795 1353 160 -196 206 874 926 -2012 -640 209 169 509
2133 509 -81 1118 -772 -613 347 -494 643 -156 645 -563 -1794 1289 878 470 -264 -98 664 -2441
2151 -2441 -1457 1489 2225 872 -840 324 -605 -2188 -1553 1296 2700 436 298 -427 -986 -1194 -1581
2168 -1581 1260 797 830 1373 -967 -365 -841 -247 -27 -1424 1349 1613 82 -499 -107 838 -1745 -2107
2186 -2107 606 2241 1012 -768 826 195 -1755 -2098 -160 2600 793 122 365 -754 -791 -1468 229
2203 229 1192 680 918 -702 -1106 -452 583 412 -648 643 710 -537 -1755 -74 2431 4 -1170
2220a170R22R28n79k187K701J559k095j083nJ860p13j117J423K51m20q44K07M79
2238A17J21K69q59k62K18J129j31j521J401M92j319j377O78L122j138j941R46
2255e5R14p76k283J467K637p57j700k01J362p32r47Q55R23L43j284j04N9j60J081
2274F42o43l07K50N09J90j810Q04J660q38j670m1K502j34k031M15J602l47k591
2292a838M62K449K53j324n93J307o64j419N53R84J024n91l85k78q32O88n5j44
2310d03M78Q97L47k110l35J488K19j365m65K456L17k055m64J441O89k321k61K068
2328F21M86r16q87J323j2j504J20M56P96j53p6J59q26L70R6n34j36Q33J001j409
2348a92o93J178P38j230j379J887P93j457o26J182J552j897j093J360K25n58p67
$$ plain form
2220 -1170 -248 680 101 -2086 615 2174 79 -1004 -1009 851 138 -979 444 695 275 -569 -362 117
2238 117 238 507 -352 -614 -396 733 602 -919 482 974 -345 -1722 -1044 2078 940 -1001 -55
2255 -55 859 83 -2200 -733 1904 1147 -553 -754 608 -124 -1071 -216 707 1050 -234 -338 -279 -439 642
2274 642 -1 -308 -58 451 641 -1169 -365 1295 457 -1213 -1254 1248 1114 -917 -502 1100 753 -1838
2292 -1838 -1376 1073 1326 2 -591 716 52 -1367 -814 170 1194 603 218 -60 -892 -204 -259 -403
2310 -403 75 972 1319 -791 -1126 362 581 -784 -1249 1207 1524 -531 -995 446 1135 -1186 -1447 621
2328 621 1107 191 -696 627 615 -889 -769 -313 483 330 254 413 -413 -43 53 -481 -617 216 1217 -192
2348 -192 -885 293 1031 -199 -1578 309 1102 -355 -981 201 1753 -144 -1237 123 348 -210 -977
2365i77J356Q75j174j55j37k6l35K47P25m04N16K13n80j047JJ579p61n76R96Q60
2385A196n13k184J018J352j103n53N92J640j062j475J148M56m66q93P87P63r06
2402b03J55K52J74n88q4O56r79K79P57K03n61p28J444n31j309M74J063N47j750
2421g29L94J404q85q88j87J622l99j296J209L80r5j042J78Q06j255M03O97K74
2439E91k92m42P77j114o04R00P91o0r41J119q3j482k03Q53J322j336j32J281p58
2458A87p01n59J470L31j419R26J54k06p02J53J179j229OO35P6l14n28J408o52
2477B15j098N28N74M02j266R10Q35j460m90J62J436n86o36J426m63p79q22R53
2495a59P94j133Q93K76l64q97k10J450j022OQ99K1m10j141J408O2j269M75N78
$$ plain form
2365 -977 379 1254 80 -75 -212 -238 -573 -326 399 -5 511 724 144 -903 -902 677 -84 -660 336 1196
2385 1196 683 -1501 -483 869 -234 -787 -195 1445 383 -1092 56 512 46 -847 -60 703 -203
2402 -203 -48 204 378 -210 -294 362 -617 -338 419 622 61 -667 777 246 -1063 -589 474 1021 -729
2421 -729 -335 1069 184 -704 -891 731 332 -964 245 625 530 -512 -334 472 -783 -380 317 591
2439 591 299 -143 634 -480 -1084 -184 607 547 -394 725 642 -840 -1043 -190 1132 -204 -336 945 187
2458 187 -514 -1073 397 728 -691 235 389 183 -519 -366 813 -416 -410 225 301 -13 -541 867 215
2477 215 -883 -355 219 621 -645 265 1100 -360 -850 -688 748 162 -474 952 489 -290 -1112 -159
2495 -159 635 -498 395 671 307 -590 -800 650 -372 -366 533 554 144 -997 411 473 -796 -321 257
2514B57N86j385K22J285r99n86j51J382k35j003J322k32n12q73M62J252j258P75
2532C09M64o04o24o90J694m32m60J124j29o15j462J088J012q80L36M75L51j794
2550h37n28J603j07L7j67J040m03j989R22K59J86j09K99J260j724k94M81k85j
2569c57l41J789k29j146N11j93k16j261J064J579r47L1M1L19j389j057J994L00
2587D92j05j45M92pk189M84R74K83m1j1J063j515q16O20L09L41n96J356k48j488
2607g47M01J31N45r09M93J409j426l89J55Q10m38j103J726R1q39n36N70Q79j666
2626h43L70J058m8n48p23J379o26r06R19K51K82r30M77M02j300L49N31M29o74
2645a51J7J042j080o11K86J161l01j263J543J01r00p20M55J632j643j78J276j73
$$ plain form
2514 257 843 -542 -320 965 -34 -620 -771 611 376 -627 695 463 -49 -922 -460 792 -466 309
2532 309 773 169 -455 -1145 549 117 -343 781 652 37 -1425 -337 675 -205 131 606 957 -837
2550 -837 -1365 238 131 168 1 1041 638 -1351 -429 -170 16 -93 206 1466 -258 -552 -71 -356 -357
2569 -357 -698 1091 862 -284 227 34 -182 -1443 -379 1200 253 284 325 644 -745 -1802 192 492
2587 492 387 242 734 727 -1462 -978 -4 279 238 227 1290 -225 -1041 -421 -112 229 -367 989 741 -747
2607 -747 -346 -215 330 -579 -86 1323 -103 -492 -337 473 35 -1068 658 749 -90 -626 -56 823 -843
2626 -843 -473 585 537 -11 -734 645 19 -887 32 283 565 -365 112 514 -786 -437 94 523 -151
2645 -151 -134 908 -172 -783 -497 664 363 -900 643 744 -156 -876 -421 1211 -432 -610 666 493
2663D93m53j050J260L39j187M93L79J73p78J68N56p15J14K07M62p45j36J344j018
2682i4m88K79P76Q9j707J263R61j168o77L42J451r84j038J201O73p41j112J061
2700H7M86p43j27K18Q14r86o8P60r00M92P9Q2j53o64J357m92j160P05Q54j03j422
2721h84N02J326n94j398M91J794j006j079N95Q71lj742R29J133j047k6j63N99
2739B98q8p33Q51l08k04N08j84n10o1R30m9q90j33J291M9j973O89J330j91j076
2759d54n71K108m05j913Q16R27L01j229k77J429n22p90K70N55M4k08K6k38l0j2
2779a73M30l68m48J464k82j178j21O87R30j603k04K028k01j456o60J344O44j515
2797f82m5J584K77j536m14P41K09l21k32J057m8o90K15p71J19O08K34J41p98P44
$$ plain form
2663 493 40 -1010 250 589 -598 -105 274 447 -331 -163 393 -322 -208 -1 461 -284 -420 924 -94
2682 -94 -582 -303 473 562 -1145 118 1079 -89 -766 -424 1027 43 -995 206 879 138 -974 87
2700 87 573 -170 -297 -79 735 -251 -319 441 -459 33 112 194 41 -623 734 242 -918 -213 641 538 -884
2721 -884 -382 944 350 -1048 -557 1237 231 -848 -253 618 615 -1127 -198 935 -112 -138 -301 298
2739 298 210 -523 328 20 -184 324 140 -370 -431 499 450 -440 -573 718 767 -1206 -517 813 622 -454
2759 -454 -1025 1083 678 -1235 -419 508 809 -420 -697 732 210 -580 -310 245 289 81 107 -131 -161 -173
2779 -173 257 -111 -559 905 623 -555 -676 11 941 -662 -866 1162 961 -495 -1155 189 833 -682
2797 -682 -727 857 1134 -402 -816 -75 134 -187 -419 638 590 -100 115 -656 -537 71 305 446 -352 392
2817C92L63j558l30J202J019j010q38J232N54j530r83J683Q90j106n45P18Q25
2834I78j349o90J223J90j70l25K08L00o49J94l9k61N41M47l79p92M82O38p16q06
2854i75R14J413j133j165Q33P82o62j270J282J382j190q70L34Q22n71p71J088
2871B43M70m35m84mJ62k99M36J62l04Q0K87r3r78L73J097m24q86J88J287m53j374
2892i49O09J079l87j305N40J401n51r52J45Q55m74p69P74N16j17m75j8M1n88N61
2912f4L97k39M5J51J47j135k19J332J02o45j84R82rj592J15J221J36r50N5J161
2932H07k81j082l6Q22j73o08O36M60j11n00o6J29q12N20P72j58j8r4L02j003q16
2953a310J288O62l38l76N63K03j475l65J165P07o61k26P77k99r12j69R40L03p36
$$ plain form
2817 392 755 -803 -1133 69 1088 78 -760 472 1026 -504 -1487 196 1086 -20 -565 153 978
2834 978 -371 -1061 162 352 182 -143 65 365 -284 -90 -129 -390 151 598 219 -573 -91 547 -169 -975
2854 -975 -61 1352 219 -946 -113 669 7 -1263 19 1401 211 -659 -325 497 -74 -845 243
2871 243 713 278 -206 -210 -48 -347 89 251 -53 27 314 221 -757 -384 713 289 -597 -409 878 425 -949
2892 -949 -340 739 352 -953 -413 988 437 -515 -370 485 11 -758 16 532 415 -60 -78 -37 -625 -64
2912 -64 333 94 139 290 437 -698 -917 415 517 -128 -312 670 661 -931 -816 405 541 -409 -354 807
2932 807 526 -556 -592 230 57 -551 85 545 434 -66 -132 -3 -815 -295 477 319 301 207 509 -494 -1310
2953 -1310 -22 640 302 -74 489 692 -783 -1148 17 724 63 -163 614 315 -597 -766 174 477 -259
2972b59M25J64m42k55J69O58o36o3P10m07m37J6Q21j46r22O47N11m53p57M53Q72
2993F69q23l31O93N03o09p68P33P1n65J53P46K78q71m3J84m60k26N75R86n75l72
3014e2L59m16n32l16J279N15r64L82J41l57q32k6J408l45m30M95J42l62q18N50
3034a79N23n70J6N65J45p11J0M72k69m94J89R26m95m86O56O2m22p29P56O36r66
3055c65K15M71J45o86m76J113l04m89L13L29J06q74M84M58o81k7K44M21n76j67
3075c46Q75k64n81j6O60j40p52N59O04l42p93M32N94p48j79M94N59n49o10Q88
3095C45k39m77P8M21M22r16L30M73p01m6J20O49l99m84Q69k02n67j14O38K47q91
3116d44L02O27k24o89J40Q44n85m74M29N50k73o48P02R2o69j84M64N10o32K01
$$ plain form
2972 -259 166 330 -112 -367 -198 460 -176 -239 471 64 -373 -357 464 318 -604 43 554 101 -656 -203 669
2993 669 -154 -485 208 711 102 -666 67 138 -427 -274 472 750 -121 -164 20 -440 -666 -91 895 320 -52
3014 -52 307 -109 -641 -957 322 837 -127 255 396 39 -793 -819 589 244 -186 309 451 89 -729 -179
3034 -179 344 -226 -210 355 500 -211 -201 271 2 -492 -303 623 128 -358 298 360 -62 -791 -35 601 -365
3055 -365 -150 321 466 -220 -696 417 113 -376 -63 266 372 -502 -18 440 -241 -268 -24 397 -179 -346
3075 -346 529 265 -316 -332 328 188 -564 -5 599 257 -536 -104 490 -258 -437 57 616 67 -543 345
3095 345 106 -371 -293 128 550 -366 -36 437 -264 -310 -190 459 60 -424 445 243 -324 -438 200 447 -444
3116 -444 -142 485 261 -428 -288 556 -29 -503 -74 476 203 -445 257 349 -320 -504 -40 470 -162 39
3136C9M94n06m84j08Q45k35l15Q35j64m60o07M77O27q83M09N99k76n59l15R93
3156D06j51p42N01L90l29n99M91O14m36m98L36L30p77J05O92O5k34m93O07k67
3176A1p51Q05J75q6k98J42O20r25j49O54j25m62q3J022R3p11k0L29m10r62P35
3197c96J077k3l01j98J69r87o52J111O64J84j04k2l83j072N0P67L40j5M41Q1j002
3218b71l92K83N15k86k67J192k58q64J30K96K93j029mJ288l76l89K40L16k16r76
3238g75K62Q33j58j49M20j67n44j28J95M79k95J82M97j058j86N90L10K6n93N97
3258C38R2j304J27J052M92n64m82N08j90r85K09J261J90n90j78qp8n60L76Q34
3278E40l75kM6l69p7k0N51j40o50O00L87n86k21N49L06p78p31R42Q17q01j58N95
$$ plain form
3136 39 533 27 -457 -565 280 45 -270 565 401 -59 -666 -189 438 -445 -36 563 287 -272 -587 406
3156 406 255 -487 14 404 75 -524 -33 581 145 -353 -17 313 -464 -359 333 398 164 -329 278 11
3176 11 -740 65 240 154 -144 -2 618 -307 -456 198 73 -389 -472 550 643 -68 -88 241 -169 -1131 -396
3197 -396 681 658 357 159 328 -659 -1311 -200 464 648 544 522 139 -933 -883 -116 224 209 650 731 -271
3218 -271 -663 -380 135 -151 -418 774 516 -348 -218 78 371 -658 -662 626 250 -139 101 417 201 -775
3238 -775 -513 320 162 13 433 266 -278 -406 -211 268 -27 155 652 -406 -592 -2 308 334 -259 338
3258 338 430 -874 -747 305 797 233 -249 259 69 -916 -707 554 744 154 -24 -32 -110 -670 -294 540
3278 540 165 163 209 -160 -237 -257 294 154 -496 104 491 -95 -316 233 539 -239 -970 -28 789 -12 -170 425
3300D25q7p50o52J080P60p12R0P5k88l57k56Q14K30k13K85m35n00J84L57Q9k98
3321a59K46N23o12p36P11O04n60n89M10Q45n84o67Q50L46p70o44M39Q54l13k19
3341b5M51j44o40k94L30L88K18K37m8o59l62M21p0j83N75N76k83j053P2Q80m29
3362d2n50N14P34k70r87L91Q17m98o27K45N62j86l89L99L80l94l44R8n2J1L02
3383A14J87j63k54K98j9o97J84O63K8o46p4R27r9r28J13O78j43p99K22R75L7p37
3405a33j8L68m00m30L06N92J91k82R3k47n43J87J71Q0J18L57K90p93m77N51J00
3426H1m52k8Q44L07q34l54O38M1p79L7P23K45n04j77N96k27n52J22J74J48j28
3447g9K38K48m49J2J09l29j90L08N98k39l86L51K24o54n20O87M99l56k92M87L06
$$ plain form
3300 425 338 -412 -1064 16 776 64 154 229 -59 -416 -672 142 372 159 444 9 -491 -307 50 139 -159
3321 -159 87 610 -2 -738 -27 577 17 -572 -162 683 99 -568 282 628 -142 -786 -347 507 194 -25
3341 -25 426 282 -358 -652 -322 66 284 521 473 -186 -548 -127 -197 -380 195 771 488 -565 -493 387 -42
3362 -42 -592 -78 656 386 -601 -210 607 109 -518 -273 289 103 -286 113 493 99 -245 -147 -199 -188 114
3383 114 301 138 -116 182 163 -534 -350 313 341 -305 -379 548 449 -479 -366 312 169 -630 -408 567 604 -133
3405 -133 -151 217 -183 -613 -307 285 476 194 287 40 -503 -316 -145 -65 53 410 700 -93 -570 -19 81
3426 81 -371 -399 445 752 -82 -436 202 243 -536 -499 224 469 -35 -212 384 157 -395 -273 -99 49 -79
3447 -79 159 407 -42 -30 79 -250 -440 -132 466 227 -159 192 416 -238 -758 -71 428 72 -220 267 573
3468E73q01l51N50K01k60j52N47Q9n04RJ17j05k36K23L41k17P2K09j63n43p5O45
3490A69o2k59L28L61l72p85K71N94j75k52L47L88n84m80L64L61j54k32M04om62
3511b36P0K09J24k91N4L16m34m1L61J76l06l50M39Pm20J86N60K0p22q4M11o6k31
3534b48L00N53l63n98R4K24l1p2M58J36n33j74J46J38k14K04M38m12l09J13L42
3555A92r9l70M81M3n11j08L72M68m37j82L46k04l66O1N56J22m09L7J26k36k39
3576c57L80K88l10j52J50J95l17M0N00l11m52p2M37K21k76M22J42o17n49O1O40
3597F3M4J16M34j92o76n46L26L34L1M50K48k90o45j51L15j46Q5M59K30l59l28
3618a98L12j8m21p6M60J74l15K26L23k16o04j51M66p6M2M78J43l17o43Q9K01j73
$$ plain form
3468 573 -228 -579 -29 172 -88 -240 307 396 -108 -99 18 -87 -323 -100 241 24 96 305 142 -401 -476 169
3490 169 107 -152 176 537 165 -620 -349 245 70 -182 165 553 -31 -511 -147 214 60 -172 232 226 -236
3511 -236 -166 43 167 -124 -70 246 -188 -229 132 308 2 -348 91 98 -322 -136 424 444 -278 -362 49 -17 -248
3534 -248 52 605 242 -356 -262 -38 -69 -141 317 453 -80 -254 -108 30 -184 20 458 46 -263 -150 192
3555 192 93 -277 204 247 -264 -372 0 468 31 -151 195 -9 -375 -314 242 364 -45 -8 118 -118 -357
3576 -357 23 311 1 -151 -1 194 -123 -83 417 106 -346 -418 19 240 -36 386 528 -89 -638 -577 63
3597 63 107 223 657 465 -211 -757 -431 -97 -66 384 632 342 -303 -454 -139 -285 -200 259 489 130 -198
3618 -198 114 96 -325 -401 59 233 -82 144 467 251 -353 -504 -38 -114 -72 406 549 232 -411 -322 -121 -294
3640b94L87L55m8m94k51L35j17n9L52K16l29m80K85L23j58o1K95lo36j23N09L00
3662C04j56o1K71l61n00J60M06J89k00J92P8m89j56K20K25j73o2M03j23l03Q2
3683e4K39j28m62K23L68j25r1K51J81n27m18L47K72o5N7L66r8o21j66L23J69j14
3705g3K61K53l37l69J5L09j11p8M17n8l21r6K29J60l98J03L44k40k13J66L44j62
3727A45m41K24K23l03o3L83K02l59l10K44R9k89J63M29p7l42j28J94o7j88L84
3748A23K19k63j80R6P1k87J9M33k1l26N6K93j46l78J90L20k05k85K89L61l31k74
3770b26K39J08k74j62M07K27l35l2J81j33k43K7L23qj71K44R2l59j17K08M1k02
3792a65RM68Nm86J01K60k09l38J11N79j20l90L09J58l17l62J51L92j73n6L47K5
$$ plain form
3640 -294 93 448 400 -94 -345 -10 -127 -186 166 382 53 -427 -142 181 23 -38 257 254 -382 -505 4 304
3662 304 148 87 358 -3 -503 -343 63 252 52 244 322 -167 -323 -103 122 -51 -113 290 167 -136 -54
3683 -54 185 57 -405 -182 186 61 -30 221 402 -125 -543 -196 76 11 68 434 336 -285 -451 -128 41 -73
3705 -73 188 441 104 -265 -250 59 -52 -130 287 229 -92 -188 41 201 -197 -94 250 10 -203 -37 307 145
3727 145 -296 -72 151 -152 -215 168 370 11 -299 -55 44 -245 -82 347 270 -72 -200 -6 -73 -261 123
3748 123 342 79 -101 -5 66 -221 -202 231 210 -116 -60 233 87 -291 -101 219 14 -271 18 379 48 -226
3770 -226 13 121 -153 -315 92 319 -16 -48 133 0 -243 -216 107 99 -72 172 264 -95 -212 -4 37 -165
3792 -165 -156 312 317 -169 -68 192 -17 -355 -244 335 215 -175 134 292 -25 -387 -236 156 -17 -73 274 299
3814B99l22k01R6j0r6K70L15j74k47J32n3l41oM73K24m22m2L80j43m45J2N21J
3837B21m82J51L91o6l61N9L23k78k89J91K64K1p0J69j25l69j5J67L4j6L54J64
3859D38m44l12J99J94l30k9N92Q9m05k49L95P2n78J6M46J61k45k9L84k19m54l4
3881c42K12J48L2K92K7l66k03Ll4m4M25L99l17m18K9K26l05j56O12K70m12m59
3903c81L33K76m00o3L52J94m14k35M66N7j83m7N5Qk52K21K26j80J9M0j29k53J18
3926a72M84p5l77R8K56l33k88L84M70j97n81K28K99l66m9K63L80l19m74L28P3
3947C2j07P5J13P3l39JK00j23O0K21j4l85q1L54R5k81L0M30k40n26J87M51P8m90
3971a86Q5L94l67k16J97M23r7m71J59P5j13N3K51J20l60j08K5j06N5L67L36m00
$$ plain form
3814 299 -23 -224 -128 -138 -234 36 351 177 -70 62 9 -332 -338 135 359 -63 -105 275 132 -313 -301 220 221
3837 221 -261 -110 281 215 -146 -87 236 -42 -331 -140 124 145 75 244 119 -250 -265 -98 -64 -80 274 438
3859 438 -6 -318 -119 75 -255 -284 308 397 -8 -257 138 210 -368 -352 94 255 10 -19 365 146 -308 -342
3881 -342 -130 18 50 342 369 3 -200 -197 -231 -275 150 549 232 -186 -157 69 -236 -392 220 490 78 -381
3903 -381 -48 228 -172 -235 117 311 -103 -338 128 185 2 -45 10 18 -234 -13 213 33 52 92 -37 -290 -172
3926 -172 312 237 -140 -42 214 -119 -407 -23 447 250 -331 -103 196 -170 -219 44 424 105 -369 -41 32
3947 32 -75 0 113 186 -153 -152 48 -75 -15 206 192 -193 -274 80 175 -106 -76 354 114 -412 -225 226 304 -186
3971 -186 -101 293 -74 -290 -93 330 233 -238 -79 -4 -117 -64 187 307 -53 -161 -136 -242 -187 180 516 116
3993A16l18J14m4j91N8O67J73n98j61J71kl60J27O14k4l48o6K28j42l57K14J85
4015E6J7o9J82J59m49o8O9j26K1K08N06j94m54J09n7k47p3N31M50l79l25J21L4
4038B2l92P1N13J44k72k61K68p7l10L13J45o1j85k9K77k83M8L38j40k49j04K76
4060E2K4k73K36K94k15m21J71K62j83j70K19L46l18k38L09j0j97j36K39J86k68
4081i1J43K05j82k80K4K10j33J5L15J33l39l03L01m1k28J90L15J32m97o1L13k55
4103a14j27J77L00k9l78J80J36k58r3K36R9j92k6K07K3l23P7K77k47r9J63K08
4125A97r6l37L22J06l71KK05K25k84j27L52r4k70K4K49K7k66J50J68j63j92J56
4147a7J56k21k8K28K3k57l4K85o6k67J26K72j13l07J92K29k05k20J91K51k74j15
$$ plain form
3993 116 -202 -88 -132 -323 -265 402 575 -23 -184 -13 -15 -375 -248 366 342 -6 -72 156 14 -343 -129 56
4015 56 73 4 186 345 -104 -172 -103 -229 -208 0 506 312 -142 -33 -90 -337 -410 121 571 192 -133 -12 22
4038 22 -370 -299 214 358 86 -175 93 16 -294 19 164 103 -82 -111 166 -117 -69 269 129 -120 -224 52
4060 52 76 -197 39 333 118 -303 -132 130 -53 -223 -4 342 24 -214 95 85 -112 -248 -9 177 -91
4081 -91 52 257 75 -205 -181 29 -104 -89 226 359 20 -283 18 -23 -251 -61 254 386 -111 -172 141 -114
4103 -114 -241 -64 236 207 -171 9 145 -113 -206 30 129 -63 -89 118 141 -182 -105 172 -75 -174 -11 197
4125 197 101 -236 86 192 -179 -177 28 253 -31 -158 194 100 -170 -146 103 130 -136 14 182 19 -173 -17
4147 -17 139 -82 -110 118 141 -116 -150 135 69 -198 -72 200 87 -220 -28 201 -4 -224 -33 218 -56 -171
4169a71K89M3j95j45K31N4k67J48K12r8j81jJ83j87j24L26J10k32r6J78Ol02O
4192b13L93pk85P6K19j35l02J13L10j49j78K39J41k07j82J43R2k32L2L07J1j94
4214hk9J27j54k24K66K71j49j44J34M5l26r1L70J46k44o0K11o2l23Q9L35k6k74
4237a20M4K01j80j35K18J84j69j86J54K3k09O8K72J3k50K5J47j50j87J85K80j71
4259E7j55K24N9k69j93K82J31k54R4K84k8l21j45K52p7j57K83K50j06l09j1N7
4281e2j98K0L73J85k56j07O4j54j73J37M12m0k72J40J5k26j66K61L36k83j01K29
4303A44Pk92o8L09N0k53K9K47m6k80J00J65j41r5J09K30k19j32K15o7j57K0K70
4326A45L6l20R7J60j69j87K30K98k31k15J49J43k55j45M12J07k74r8J52Q3k88
$$ plain form
4169 -171 118 161 -34 -179 52 106 -161 -13 199 101 -80 -81 102 -85 -209 117 227 -5 -101 77 83 -219 -213
4192 -213 180 173 -112 -36 183 48 -254 -141 169 20 -158 81 222 15 -167 -24 68 -164 -132 175 186 -8
4214 -8 -37 90 -64 -288 -22 249 100 -44 90 135 -191 -282 88 234 -10 -70 141 79 -244 -155 180 154 -120
4237 -120 -76 125 -55 -190 28 212 43 -143 11 34 -175 -107 165 178 -72 -47 100 -50 -237 -52 228 57
4259 57 -98 126 185 -84 -277 5 136 -118 -24 260 232 -89 -234 18 -59 -216 67 317 211 -98 -109 -52
4281 -52 -250 -230 143 328 72 -35 29 -125 -298 -161 251 211 -61 79 94 -132 -298 -37 299 16 -85 144
4303 144 151 -141 -209 100 150 -103 -74 173 127 -153 -53 112 -29 -124 -15 215 -4 -136 79 12 -145 -125 145
4326 145 181 -139 -42 118 -51 -238 -8 290 59 -156 -7 136 -119 -264 148 255 -19 -117 35 118 -170
4347a70M1L17n7j88mJ71j24j39J99Q0j52j02K24K4k88J07J73n7k62P5M00k22k10
4370a64J44J85j75l05L11K90k54j66J73R4k70p2K89J26j89o9J77j50j52J39J22
4391H4Qj57J99M5l64K8K18N5k25mM02j62l54O4K83n5l25K40L20j75l17Q1K28k12
4415i5j12K70J67j59j62J38o7j79J32J93Pj73J34M3l18m2K36K31k81p4L74j47
4437A16l32n0L82J32m30J36K81j47k91nL61p2k27J57J56j80j74J88L3q0J2J29
4459I5J7l09J76J75k56kJ34K48k87k94M20N7k86q0L37J69m40q4L20M5l02pL49
4482A95o7k05k5J79k2k51K51O1j64K9L8P8k75Q3L05k04j77J43K43k13k83L01K23
4505B43k39k79L28K26l85p9K17K03k50k24L97n2k27O8R8J04k56P0J70k10m8J96
$$ plain form
4347 -170 -129 188 131 -57 -61 110 -14 -153 46 126 -26 -128 96 120 -168 -61 112 55 -207 -132 268 46 -164
4370 -164 -20 165 -10 -315 -4 286 32 -134 39 133 -137 -209 80 206 17 -52 125 -25 -177 -38 84
4391 84 92 -65 134 179 -185 -157 61 116 -109 -113 289 127 -227 -163 120 65 -260 -20 300 125 -192 -111 117 -95
4415 -95 -207 63 230 71 -91 47 -20 -199 -67 126 133 -40 94 137 -181 -223 13 244 -37 -111 263 116
4437 116 -216 -266 116 248 -182 -46 235 88 -203 -208 153 81 -146 11 167 -13 -187 1 34 -46 -34 95
4459 95 112 -197 -21 154 -102 -104 30 278 -9 -303 117 174 -112 -192 145 314 -126 -210 110 155 -147 -154 195
4482 195 128 -77 -102 77 55 -196 55 116 -48 -19 19 97 -178 -95 210 6 -171 -28 215 2 -281 20 243
4505 243 4 -275 53 279 -106 -185 32 235 -15 -239 158 106 -121 -53 45 149 -107 -37 133 -77 -125 71
4527G1O8k48M0J97m7k63j2M54j82l34K75J30n5l83J54M62l86j26K27J26j29l06
4549b67K99J45k70J1J85j3k01P3J32p3j50J43K37l47m5K91o1j70j31L86N7m72
4571b41J54K65o7l03J7L76j30k67J36K78k01k41K33P7j13q5J65J62l75P7K19j95
4593e9k9N1K81j62l23L12Q2k72n5K94J49l26j48K99O2l78R4L50q5k08o2K52r1
4616B8l17L14J50j54n7N2J24l00o9L48m4j62R8K10j55l53J50K69j25j63L23J95
4638C62l84k38J55J82j72k6M28J1l82j19J33j6j25K16L18j63k81N8N9k52K2L65
4660A51J42k73j44K48j18l30J81L48l4k80O5K68k67k42K36K18j29j55K17J14l41
4681a25n9K47K1j54O5K39j46l00J09J96j22q7K85J23l69k04K48J00j99O8L76p2
$$ plain form
4527 71 139 -109 -69 128 81 -182 -194 260 78 -256 19 149 94 -289 -135 327 -59 -185 42 168 39 -267
4549 -267 32 177 -93 -82 103 90 -111 -38 94 21 -129 14 251 -96 -141 150 89 -81 -212 174 231 -241
4571 -241 -87 178 111 -192 -175 201 71 -196 -60 218 17 -224 9 86 -27 -112 53 215 -160 -83 136 -59
4593 -59 -88 -37 244 82 -241 71 153 -119 -174 120 269 -57 -205 94 156 -222 -128 222 137 -71 -133 119 28
4616 28 -289 25 175 21 -36 16 140 -160 -229 119 75 -87 11 221 66 -287 -137 132 7 -156 167 362
4638 362 -22 -260 -105 77 -95 -121 307 318 -64 -183 -50 -66 -191 25 343 180 -101 -43 16 -236 -214 151
4660 151 293 20 -124 124 6 -324 -143 205 171 -109 -44 224 -43 -285 -49 169 40 -115 102 216 -125
4681 -125 -184 63 84 -70 -5 234 88 -212 -103 93 -29 -116 169 292 -77 -281 -33 67 -132 -64 312 240
4703B40m22p0K50mj60K48K61k16l30N3J52j59L7L21O4k66j50J99p3k30K29K46
4725B20p2k72J24K12l19j57K69J83k00j26L25K7l58r3K54P6k45J19K92j31k88
4746a60QK05j35q9K95J24k32j88K05Ok44J38K69k2l34L8L01k36j45K02K34j90
4768E0k93K93J44k55q1K01J21k91l9L06j8k24qK12j43j85K09J82j16k06J86N6
4790A01l09M6K53J11k83l9L06j93k30J40K86n7l35K17J69k34j35J89K30k80j20
4811a67K59K2j72n8K83l9l13J19J57n3j95J89J91k75j13J75J09k36n7L36k9k36
4833a03j7K56l9l62J80K37j03j86J43K57l02k14K29J09j12j00L01O0l21k8J35
4854B0j5j85J38L10j57j92P7J15k49j24L43R2j97n2K20ml89P7K80k3k44Q9L31
$$ plain form
4703 240 -182 -252 -2 -6 -166 82 343 127 -203 -150 2 -157 -120 201 265 -1 -151 48 -25 -255 -26 220
4725 220 148 -124 0 212 -107 -264 5 188 -12 -138 187 214 -144 -237 17 93 -152 -33 259 128 -160
4746 -160 -152 53 -82 -171 124 248 16 -172 33 39 -205 -67 202 180 -154 -116 185 -51 -196 6 240 50
4768 50 -243 50 194 -61 -142 59 180 -111 -150 156 138 -86 -94 118 -25 -210 -1 181 65 -141 45 101
4790 101 -208 -162 91 202 -81 -120 186 -7 -237 -97 189 132 -203 14 183 -51 -186 3 233 -47 -167
4811 -167 92 114 -58 -116 167 128 -185 -66 91 38 -157 32 223 -52 -165 10 119 -117 -174 162 133 -103
4833 -103 -120 136 97 -265 -85 152 49 -137 6 263 -39 -253 -24 85 -27 -127 174 234 -87 -115 20
4854 20 5 -180 -42 268 111 -81 -4 111 -138 -262 81 173 -24 -76 144 140 -249 -172 108 85 -159 -70 261
4877B61k06k56J68J67j68k10K66J61k17k3J66N3l25j6K23l6q4J39K30k10k64J56
4899b5L7j59l3L65J54l82o6J64l1k99Q0M35o7k61N6J92j52l19K24K05r9j06J41
4922E4J84l17r1J74m6o3M5L08r4k63J19L5j80j21L29K37k89j22J67M6l25oM28
4945B09lk63j06K54Ml44K21K17j25j88j7K48j67m3K42k1j96j03K09lj67J79J72
4968B09j33l37K12K19k18n7J51K08l46k31M46N5j91j28K08R6l91R3L08j2k05p4
4990a18J88j50q3K27J31j39k02J99r3j89K02K12L1m00M6K83k74n9K02K99k11l71
5012b69K56J35k04j17K87J54l22n2J86J04k06r6K68k00o0J80J22J4l04J17Jl40
5034c46K01L28J60k67j61J62k55k62K79N13k2l37K6Pk15k51L48M35k32o0K3m0
$$ plain form
4877 261 55 -201 -33 134 -34 -244 22 183 -34 -57 109 162 -163 -179 44 8 -76 63 293 83 -181 -25
4899 -25 12 -147 -180 185 339 -43 -109 55 24 -275 -195 240 173 -88 -32 160 8 -311 -87 118 19 -87 54
4922 54 238 -79 -170 4 -42 -105 -60 248 154 -109 10 45 -135 -256 73 310 21 -101 66 112 -213 -219 209
4945 209 206 -57 -163 91 95 -249 -28 189 64 -124 -141 107 -60 -103 139 118 -78 -181 28 25 -142 37 209
4968 209 76 -261 -49 170 -48 -105 46 254 -92 -323 123 178 -13 -141 67 163 -228 -135 173 161 -44 -118
4990 -118 70 -80 -163 64 195 56 -146 53 -40 -229 -27 185 216 -184 -138 145 -129 -188 14 313 102 -269
5012 -269 -13 122 -82 -199 88 242 -80 -132 54 158 -48 -144 124 -76 -136 44 166 180 -124 -7 -6 -346
5034 -346 -145 183 343 76 -85 77 -178 -440 -161 352 330 -7 19 26 -189 -440 -92 343 111 51 74 34
5056C4j63j77L81K2j79J66O4o1k09R8J27k66n9L01J94k71n2K20j49k92l5M52J18
5079B64l50J31R4j72k35O9M52j54k00J38j1j25o2K86R4k45q1R7p0j33K85K67j94
5102A45k51k5J50k36l0N08R9k57k36J10N9l42J25M05J6k34p2J86j45k34J55J95
5124I1p0j13K39N3k59p9Q3J0k02J63L93j15k45QQ7j94k07L80L12k05j93J11L7
5147H5k93o5L71J41k30o2J78r4k11J04K11q4j94J54J32j99n5K02M1k71o3K98J
5170I7k16R4K14j19l39J22K99j30j47J76J55k23k32K34J36j80j1J88J3k56RK30
5192A14o4j73J24J79j77j57J99J13k29j14K68O9k72J6K39j3k75j1L06j04j93J30
5214b5K05j02k57J34J27j77l7K04J24k34n3J87j13j66O4K95n3k24J86O9k20j75
$$ plain form
5056 34 -129 -306 75 97 -82 84 148 87 -122 -24 103 -163 -222 79 273 2 -50 170 21 -271 -306 146 264
5079 264 -86 45 139 -33 -268 -199 253 99 -101 37 26 -99 -161 125 219 -26 -107 -10 -80 -213 72 339 145
5102 145 -106 -131 19 -217 -247 261 360 103 -133 -23 36 -306 -181 224 240 6 -66 120 -25 -259 -104 91
5124 91 21 -92 147 200 -59 -138 -55 -45 -247 -84 309 194 -51 -43 44 -150 -357 23 335 130 -63 48 85
5147 85 -208 -273 98 239 9 -53 125 31 -180 -76 135 51 -143 11 143 -56 -111 91 132 -139 -202 96 97
5170 97 -119 -25 189 70 -269 -147 152 22 -125 51 206 -17 -249 -15 121 -59 -70 118 131 -125 -116 114
5192 114 50 -123 1 180 3 -154 45 158 -71 -185 83 152 -120 -104 135 122 -153 -164 142 38 -155 -25
5214 -25 180 78 -179 -45 82 -95 -132 72 196 -38 -91 96 -17 -183 -119 176 123 -101 85 154 -66 -241
5236b41J90K37k15p5K64K5k87j05K68lk16P8K47l0k59J13R3j73j12J33K36j64
5258Dn2K46j45k23m2K25P5k08J83K02k15k49Q7K37j59j14K22J27k26j44K69N4
5280A54k27n1J31M1k14J64K71j32j76o5Q6j72o4L97J32j53j61N5o8l03J61L59
5302A65N5k03qJ65k51k27J87K28n3j52K48O5k35j30Q5P0k00Q3L31nj66n2M9k24
5326a75j62K91K61k2j38O1n7l74K8L30J55j49l9J61j96k52J41K80j9k14J00Q2
5348I3j87o8K11J66k30j11J31Jj00O9K64j05k53L0J09m2j05K26J46k81j21J38
5370a9J12j65k6K59n9k64K8K57J3k38N8J16j31j57J90K63j60j21M3l0j62ML54
5393A65N5k13j4K0q9j57K14K79j38j70M8P1k00l8L06N6k14j16K00nj99J17J56
$$ plain form
5236 -241 -51 186 -29 -104 160 185 -102 -207 61 58 -158 -80 167 137 -122 -9 84 -89 -201 -68 168 4
5258 4 -48 198 53 -170 -212 13 88 -120 63 265 50 -199 -112 125 -34 -148 74 201 -25 -169 100 154
5280 154 -73 -124 7 48 -166 -2 269 137 -39 -104 -18 -190 -254 143 275 122 -39 16 -52 -355 -194 165
5302 165 220 17 9 174 -77 -304 -117 111 58 -94 154 219 -16 -146 -61 9 -191 -108 223 218 52 0 49 -175
5326 -175 -337 -46 215 193 55 116 59 -315 -287 43 198 49 10 171 -25 -277 -136 144 125 -89 11 93
5348 93 -94 -162 49 215 -15 -126 5 6 -94 -25 239 134 -119 -89 20 -22 -127 99 245 -36 -157 -19
5370 -19 93 -72 -98 161 102 -162 -134 123 136 -102 -44 72 -59 -216 -26 237 77 -44 -1 -31 -193 -189 165
5393 165 220 7 -7 13 -76 -233 -19 260 122 -48 0 71 -129 -167 139 195 -19 -135 65 60 -139 -22 134
5416A34n0k57N3K64j07q5J01L0j85j49K76J38j10j9N2j00k78J29K72L4q0J2Q3
5439A58l08j72K89J65k2j09J47j5l37PK16Q3j43QK17j11j74L8J42j10j70K08J03
5462A10n6m1O3K4l38L6K22K3JJ2J63k11l05J97J30%o1J53R6l17q6J62J39j55l6
5487g5K12q9j43RK01K8k59J18L2j34jJ24K08j84j08J02r9j30M6K89mj83O9N7j13
5512b7k29J79K16j53j9P9J42j81k25K47l0j05N1J67J08k37KO2j38p7J13K15p9
5535H1o4R1n2j82j21K85N7j50J06Q2l0k76RK69j33q3J23J41q1k24J45P6j47n0
5559a28J41J01j54J9J12m0j36j5J86j06q5K01M2q7j64J25Q0k47O1K09M0j77o6
5582h8J95q6k00Q1K10j5j82R9P4j18j03R3J51j59mJ26m2p7n0J72m6j72J58Q2p6
$$ plain form
5416 134 84 -173 -120 144 37 -48 53 83 -102 -251 25 163 53 34 86 -14 -292 -163 109 143 63 75 158
5439 158 -150 -322 -33 132 110 1 148 133 -204 -197 19 102 -41 -33 184 73 -101 -63 79 -31 -201 7 110
5462 110 54 13 76 100 -238 -202 20 43 44 56 219 8 -297 -100 30 30 -31 122 218 -99 -185 -23 116 -39 -75
5487 -75 137 48 -95 -86 115 143 -116 2 34 -100 -101 23 231 47 -61 41 -58 -188 -142 147 143 -40 29 86 -27
5512 -27 -256 -77 139 -14 -33 46 188 7 -218 29 -1 -106 -55 112 220 -17 -15 47 -91 -168 -55 160 81
5535 81 17 108 56 -126 -247 38 95 -55 51 133 103 -173 -164 105 -28 -111 12 153 72 -152 -7 69 -78 -128
5559 -128 13 114 -40 -21 91 51 -85 -100 86 -20 -105 96 138 51 -113 12 92 -155 -94 115 155 -22 -88
5582 -88 107 21 -179 -98 112 97 -85 14 88 -30 -133 -40 111 -48 -52 74 32 -45 -95 77 31 -141 17 99 23
5607B3j05R8J10j90q2J72J13j42o4J84l1k07pJ85N4j56N4J12j23j36M2J75o5o0
5631d6J46k8j58m5J45L2j41Q5J28q5j49O3J77j23j38J17J35j15r7J77P9k10q8
5654a39J30P9j13M3J66q8j67k4J16qo3J65O0j85r2Q5R0j23OJ84n8j99J3K02J0
5679I0j52O2J01j57j53J42K14o8q5O3j3j89n9K44Q2p6J0M4p6j95O3J72n2n2J19
5704G9P8j64j16J53%j63pK34P4j72J8P1j27k00N0K83J5n2Q7o2j94j66J55J94l9
5729B9P9Q2j25k32j4J81K7n2J12R9j91j70J42J08p8o4J27P4k30%J84J0j24p4J46
5754D6m1j27J28J05o4j34L8R0j11oJ37M3j83k4J73k2j06K2J30q0k08J63J70o7
5778G2q8N2N0j94r3K22J16p3n4Q8q7j87O3J73N2j07M6N5j88p6J20J28r6o7J62
$$ plain form
5607 23 -82 16 126 -64 -146 26 139 -3 -67 117 86 -121 -128 57 111 -45 9 121 -2 -138 -96 79 14 -46
5631 -46 100 72 -86 -131 14 46 -95 -10 118 33 -116 -53 124 1 -137 -20 115 0 -97 80 159 -51 -139
5654 -139 -9 70 -43 0 166 78 -89 -113 3 -5 -68 97 157 -28 -120 -35 55 -68 -62 122 64 -135 -122 80 90
5679 90 -62 0 101 -56 -209 -67 147 79 -6 57 44 -145 -204 40 122 46 56 100 24 -171 -108 64 12 -40 79
5704 79 157 -7 -123 30 30 -133 -140 94 168 -4 14 85 -42 -242 -192 91 106 54 141 79 -115 -281 -126 68 29
5729 29 108 190 65 -167 -181 0 27 -25 87 186 -5 -175 -33 75 -3 -67 60 134 -96 -96 88 98 -26 -100 46
5754 46 5 -122 6 111 47 -87 -49 41 -70 -76 61 104 -79 -103 70 48 -58 -36 94 14 -194 -31 139 72
5778 72 -16 36 86 -108 -201 21 137 64 10 98 11 -176 -113 60 112 5 51 106 -82 -158 -38 90 -6 -73 89
5803H9k6j63J3J48J8j87M6J53m9j28P9J34j31j35J02J19n9n4J30pj86k9J30N5
5827F2q5O6J14j61j36P7J20m7o3J55K6j79r6J55N7j53M0J50j5j76JJ77r1j16P9
5852c9J19o3j07J30M3j36o9J17P2j07N0J37o9j76KJ50o5o2J47Q7j36j43J11P4
5876F7j35j0J52M4j72k8J53m3j17L7J37o7j36J12R6p7r5Q1O8j54nJ47K0r7j6J40
5902A02q2j55Q2J26k6j22J20J02j69q8R1R5j31k5J99qj27o1J18pj86J18J23k7
5926F2j05L9R6j59n2J26M7p1n3J77l6j54J0J04jj31R3J56j22q1L1J20j29j03J94
5951E8L1q6o2J29L2j81L7R9k4j04M6J58j11p2O6K5p4j30J85N7r9K0O1j2j99K6
5977a24J93m1m6L1J17j33j65J38R0m8n9J12O5k00kQ6L0q7j0J73q0r6O2N6n1j20
$$ plain form
5803 89 63 -100 -87 61 79 -108 -62 91 42 -86 -7 127 -4 -139 -37 82 23 -31 99 92 -94 -123 7 62
5827 62 -23 43 157 -4 -140 -63 57 10 -53 102 128 -51 -147 8 65 -88 -48 102 87 -89 -88 89 -2 -118 -39
5852 -39 80 17 -90 40 83 -53 -122 -5 67 -40 10 147 78 -98 -96 54 -11 -73 74 161 25 -118 -7 67
5876 67 -68 -78 74 118 -54 -82 71 28 -89 -52 85 18 -118 -6 90 13 -82 -1 67 -87 -92 55 75 -22 -38 102
5902 102 20 -135 -53 73 47 -75 45 147 -22 -110 -19 76 -55 -80 119 111 -16 -77 41 34 -152 -34 89 62
5926 62 -43 -4 92 -67 -119 7 54 -17 -70 107 71 -83 -73 31 30 -101 -8 148 26 -55 -24 96 -33 -136 58
5951 58 89 3 -59 70 102 -79 -42 57 33 -71 -25 133 22 -50 16 41 -33 -163 22 79 -20 0 61 49 -150 -124
5977 -124 69 28 -18 13 130 -3 -168 -30 60 12 -47 65 130 -70 -72 14 44 -43 -53 120 40 -56 6 62 11 -109
6003a09J17P7j09j0Q9L6j61m2J71l6o4MJ45n6k04J19P4k8q6R4J22j90n1J01M4
6028D7o4m1J49k3j34L5P6J0j22R3Q3j26m2P0J02j41o4J55j6r6j7J50J5j97N2Q5
6054C9k2q4N3J47j23j02N6O1m3n5J53J7j45pN6K9r5P3J17r5q5J8R0n5o5J47L4
6081A14j34o4J10N5j35K8J20j2j32k3J34n7q0O6Q7l0j16Q4M9j31mP3N5p1nJ25
6107A06q4j33L1J10Kp1J10O2j39j18P1J06o8J0J25Rj64p9J16K0q2R2Q4k9j31n
6133d9P0p4j1J02N8r2p1R8j1j06K4J43j4j19M2Q7p5q9N3J25p4o6R7K5r6o0R4O4
6161G5r5NR4m5r1NJ03j0p1P0M0q6q4Q9M8p1RQ5Oj50LJ09k2o2K5J09m6j25M9P3
6191C9n0m0O6O9r5l0N5K2q1J1J05k4p3L4M1k5r6P4Q5j00oM8K9p9n9J22J3j09J9
$$ plain form
6003 -109 8 85 -24 -34 55 91 -70 -112 59 23 -41 -37 108 52 -152 -33 41 13 -73 21 143 -47 -98 3 47
6028 47 -17 -58 91 68 -66 -31 45 55 -67 26 109 -17 -59 11 113 -28 -92 63 47 -49 -66 84 99 -98 -46 39
6054 39 17 -67 -14 133 10 -92 -36 25 -18 -73 80 97 -48 -55 1 30 -65 8 125 30 -55 -37 53 -2 -67 80 114
6081 114 -20 -84 26 81 -54 -26 94 82 -50 -73 61 4 -76 -10 77 47 -69 15 64 -67 -71 2 57 -14 -19 106
6107 106 22 -111 -80 30 32 -39 71 133 -6 -124 -53 53 -15 -5 120 129 -35 -114 2 22 -60 32 116 87 -44 -49
6133 -49 21 -53 -64 38 96 4 -67 31 20 -86 -62 81 67 -52 -10 77 2 -87 -34 91 17 -49 48 73 -23 -83 11 75
6161 75 -20 -15 79 34 -57 -52 51 41 -30 40 80 -6 -90 -1 47 -24 -15 70 76 -74 -71 38 16 -46 -21 88 42 -83 -34 39
6191 39 -11 -51 15 84 -11 -41 14 36 -45 -34 71 47 -26 8 49 24 -72 2 87 -13 -19 29 58 -21 -80 42 55 -54 -35
6220c5Q7or9J1R2k4q8N0Q4p1m6O1J2m1m5R1K3j08M3N3mq1J8J07n9q3P3M9n4o9
6250e9Q4M4q8k5P8M5j26J0P8j6o1JQ3k6q1N9L3m3m1O6M4r2j5O5K0p2%R1k2q7L4
6281a9Q7m0p9N0P9n7o9N6O1q6j1N7L2o4l1P4rp0K6O5k8p8M8O0q7k7O9N0q1m3R0
6312B5Jp5OQ8Pj01J9Q2l4o0K9R5n8o1N7J6n4m3R4L0o7JM3j5q5L9R1m2m7L1N1p8
6344a5o7Q6L9n8j9P6J1j04k4Q1K7o4J4Q9n0q9K3O4k7n4R4M0p3l1L7L4p6J3J07
6373H4l2o6JO9m1q5Q8O4n6n7L1N6r1j3O8M0o6k8Q1m2o1J7P5oo8M1L6o5l4M2Q0
6404F2p0j9O2Jp3k1J06mp8M0N4l8p9L3R8p6l0M7N2n6o9P7K1q2kO7L4r8K9M6m5
6435a1m6K1J04o5l9O8on2n8J01M2r1K4N2kj01J6J03l3n6K6O3l0r3P6L4n1k5N4
$$ plain form
6220 -35 52 46 -53 -42 50 26 -62 -12 72 1 -45 16 28 -13 -58 33 56 -52 -9 44 40 -41 -23 84 25 -58 15 64 10 -59
6250 -59 25 69 -19 -44 34 79 -47 -37 41 25 -36 -35 48 22 -59 0 33 -10 -51 15 59 -33 -48 17 37 -35 -35 56 34 -53 -19
6281 -19 68 28 -51 -1 78 21 -48 8 69 -17 -28 29 61 -3 -34 40 31 -39 -13 52 24 -54 -6 54 -33 -60 9 59 -22 -65 25
6312 25 26 -49 -43 45 52 -49 -30 52 18 -42 -13 82 24 -37 20 36 -18 -61 33 63 -4 -3 40 25 -60 -21 70 28 -19 12 63 -15
6344 -15 -82 4 43 -15 -34 42 53 -51 -75 6 33 -31 -17 72 22 -67 -44 20 -7 -61 33 73 0 -31 6 40 -36 -23 84
6373 84 52 -14 -13 56 15 -70 18 82 26 -31 0 56 -35 -48 20 60 -6 -34 47 5 -56 -39 36 30 -38 3 39 -26 -60 -18 62
6404 62 -8 -27 35 36 -37 -58 48 44 -34 6 60 22 -57 -24 74 -2 -32 15 67 11 -58 19 40 -42 -44 23 57 -41 -12 34 -11
6435 -11 -57 -36 68 3 -36 32 26 -26 -84 17 59 -32 -8 44 42 -59 -43 60 27 -29 -3 60 30 -63 13 47 -4 -29 25
6464B5M7r3NO2k6n6j0R6j5o9N1K1n2q4O6Q1p2NP1jj10m1J23Mm6J8O3j7j20M3O2
6495C1l3nK7P5r7n4P9j1k7k1R7rq6L2M3j7q1M0R8q8k7M8M0o6p8J11K0p2MN2J9
6526D4j15J2R5k5l0K7O2p9p1Q4L8j6m3P1jj21K5O6L9n6MQ8j05o4L2P3lo7Q4L0
6556G8j05n1N1O0p5%J03k5o7j9O6k9o1O6N7k9n2M2L9j12kQ3K6m3j1P7l8q8RQ6
6586C6Pq0P0N1p4n8L3P3p6l8P8J2m5l5O1J8q6K8N6k2n5L1Q4p5m4N2K7o8k7J11
6616D5J1q2KO1Mj13L6J02l0o8L2O8n7p8Q2L8n3l6N9L7q5rO7j2n8J0R9o9o6N8M5
6647D0n5p1R2M6p7k2P9J8p9k9J08pp7QQ3j8r4N1N4m6k7M9L3o8l6O8J1n9nJ02l2
6678D0r3M6M7k1p7N5Q0r1m6N2N1o6m9J00Op3nO3K2j00K5O8k9n4M7P6n4n4N3K4
$$ plain form
6464 25 72 -21 -16 46 20 -36 -46 50 35 -34 17 38 -14 -98 -32 49 -23 -18 53 52 -58 -99 24 28 -18 0 63 46 -74 -31 31
6495 31 -2 -7 20 95 -2 -56 23 12 -15 -36 61 52 -34 -2 41 24 -57 -17 81 -7 -34 14 54 -12 -90 21 41 -31 -27 25 44
6526 44 -71 -59 36 11 -19 8 70 -9 -80 4 42 26 -17 54 53 -68 -43 23 62 6 10 98 -7 -71 -39 34 31 -36 48 78
6556 78 -27 -78 -27 33 -42 -42 61 36 -31 -50 16 -13 -74 -8 49 20 -32 10 49 -63 -65 18 44 1 -10 67 29 -59 -50 36
6586 36 43 -37 33 84 10 -48 -15 58 -18 -56 22 34 -11 -46 15 33 -53 -25 31 9 -46 -15 69 -6 -50 2 29 -39 -66 45
6616 45 56 -26 -24 37 41 -72 -36 66 36 -32 0 68 11 -67 15 53 0 -36 23 60 -25 -34 33 21 -37 -27 72 3 -63 -5 40
6647 40 -15 -86 6 52 -25 -47 32 50 -29 -58 50 43 -34 -26 57 39 -55 -4 50 4 -23 26 59 -9 -45 23 34 -25 -30 72 40
6678 40 -53 -7 40 19 -58 -3 77 -14 -60 -8 43 -23 -72 28 34 -39 -44 19 41 -59 -34 34 5 -49 -2 74 20 -34 19 43
6708D3p6k1J04Rq7RP1j4q1L3Q0o7n8M4O8l1p0P4K2j05l3P3N7n5RP7n8r7nQ1rj2
6740b5O5M5q8r0O0M0o5L5Q3J4j00j3O8k8o6M2Q5%q6N0M6r9o5N7O0l2kP7j7r1m8
6771h8P6Ll6P2N3m9j10L6N5n0kP6L3r1m8P9K5n1QQ5l1j15K5R2j5k6J5M9q0o4P8
6802DM9k6j6M8j0j10RP2Ln9L9N8o1o1N7O1q1o1R7L0m9j1N3J1j18nR2K4l1J9O2
6833H9p6j07N8N1j0rP8J2j12l2N4L8n2L2Q2p8o6QP4k2p2O5M7n1p4P7O3j08j6O4
6863GNn0%R6j9q7PN6k7l8Q9O4r8n2L7L7n7J3J12k1q6l4P6k0o6O0P9m1q9K9P6q3
6895b5k9P1J9n1m0R4Pp8OL8lq2O9P6n4m9NN0n5n7J28M1p4m1P5Mj05M5Q1pq4MP9
6928E8n2m0N7L6n2q9Q3L7m6J0M4jj11oQ7k3j1L0P1o0j10O5K5l8lQ8N4j24l2O9
$$ plain form
6708 43 -33 -54 50 59 -28 -19 52 38 -43 -10 70 3 -55 -11 57 26 -44 30 52 -53 -86 -13 44 -11 -2 75 17 -80 -85 -4 -13 -25
6740 -25 40 85 -3 -93 -33 7 -58 -23 60 74 -26 -39 29 1 -65 -23 62 62 -24 26 72 -27 -92 -35 25 -7 -9 68 51 -40 -88
6771 -88 -12 -9 -45 27 80 31 -79 -43 12 -38 -40 36 69 -22 -70 9 34 -17 -9 76 45 -70 -45 47 32 6 21 70 -10 -74 4
6802 4 53 27 11 59 49 -61 -52 20 23 -36 3 61 0 -61 -4 57 -24 -85 12 42 -7 -18 35 46 -72 -77 15 39 8 27 89
6833 89 13 -94 -36 15 5 -4 74 86 -26 -58 -4 34 -18 14 96 18 -48 -40 34 12 -60 5 52 1 -73 4 67 -41 -57 7
6863 7 12 -38 -38 58 39 -48 -41 15 -12 -50 39 103 5 -47 -10 27 -30 -17 95 74 -12 -46 30 10 -56 4 83 42 -47 -18 58 -25
6895 -25 -54 17 36 -15 -55 39 46 -32 -26 12 9 -73 -4 72 18 -31 -26 24 -31 -88 40 81 7 -34 41 45 -60 -15 66 59 -25 -21 58
6928 58 6 -34 23 59 7 -82 1 38 -8 2 46 45 -66 -72 15 -8 -19 11 82 22 -88 -23 2 -36 -39 49 103 -21 -53 16
6958A6po3lJ21rp5L9M0m4r7O3O1n1J8M1L9j06n0R1l5m3L6R4j6j02K6L3n2n9P4
6988b0J00q3k9O1J8p7n7J10Kn0J5N5J9j17L5O2p2j3M6O8o0m5Q6j6q8j4P9L7q8
7017c6M6P1n1r5lJ02m7m0Q9L9o7j01P0L6q1L1P6J9r5oQ8o5l9M5P1n0o5R0K2n4
7047@m4O4L3j17L3Q9j4o3k8J12o5p6Q0P2l8r0M3N3r5qP2N5r4l1P7l3m5K3R0k7
7077B8j18P6L5l1k5L7P6j10l6R7J3m6j5R1k7j14L2R6Qr3M7O1j01m2M3Q4m9o0Q2
7106C9k5p6J9O6L9j11J1O8n5m3O1R4q9p1N6K8m0k5J31J5j30m5N0L2m5O1J29p9
7134F5j09JL2Jn5J12O6r9m2L8J2r7K0J08j2o6J8R2q5r5N5M4l7k7J06P8j30p5M4
7163c7km3L4J61j1j12k5J6m0m9J25R9n7p9J9J9r0J5J27lq4k7Q1jq9N3P4o2r1M2
$$ plain form
6958 16 9 -54 -57 64 55 -20 19 59 15 -82 -19 42 -9 9 50 89 -17 -67 24 -11 -54 -18 76 60 -42 -16 17 -35 -94 -20
6988 -20 80 -3 -32 29 47 -30 -87 23 25 -25 -10 45 64 -53 -18 44 -28 -41 5 73 13 -32 54 38 -50 -64 15 52 -36
7017 -36 10 81 30 -65 -68 34 -13 -53 36 75 8 -93 -23 13 -68 -37 39 58 -37 -43 45 -20 -59 -14 57 7 -58 32 54 0
7047 0 -44 20 53 -64 -31 58 44 -19 -47 65 0 -76 4 76 38 -52 -9 44 -51 -59 13 68 -26 -57 20 -13 -58 -35 55 28
7077 28 -90 -14 21 -10 -35 2 78 -32 -68 29 42 -4 -19 72 45 -69 -37 59 67 -26 21 82 -19 -61 -18 66 17 -43 39
7106 39 14 -62 -43 23 62 -49 -38 30 -25 -68 -7 87 -2 -73 -17 11 -29 -54 77 92 -38 -83 -33 -1 -46 15 144 65
7134 65 -44 -43 -11 -10 -65 47 113 14 -28 10 22 -75 -55 53 41 -25 -7 85 0 -95 -40 4 -33 -60 46 124 -6 -81 -37
7163 -37 -39 -82 -48 113 102 -10 -35 -19 -59 -108 17 116 59 -20 -1 18 -72 -57 70 67 -17 -44 37 36 -53 0 74 12 -79 -37
7193c7Q5n3l6P6K7r6o2Q4M0n4LP2oj21M7Q6n8m5K8Q1o0m4J03Qj08l6O5M1o4N4
7223B0J06m7j47pQ7m5KP8O9p9j27M7K8m8L9Q0L7j23k2P1l5n7O2P2l7o7M9N5q0
7252a9m9Q5L4j07J4J03J6r0k0Q3n0o6O6Q2j9r4K1M4p6k3Q5N0p4l6N9k0o0J7R6
7281E2j3j07O3K8l3n7N6Q0r3l5P5K9o7k9Q6Qr3PR9op4K8M8n9m7N4P6o6l1Q1j6
7312D4p6k5R0J8q6K1P0m2q5M1Q3o9m7N9O0o0n4Q7K0q7k1P7K2p5K1Q9m2q0J6O4
7342C3m0l5O7N1m7o5N4Kq6K4R6J1q2RP4p8o5M1Q6l7o6O6M0p6m6N8M1q0J5P1rm4
7374a7j5O7m1p3P0N2j7n3O1L3j04k6O9K8n5mJ10k9q7j0P1kr8O0P3l9m7L1N2r0
7404c0m4O7J9l8j2J10k7r3j0M5j6l8O5J15q6o5K0J8o2k0J36M4p1m4M0Pj09N2R7
$$ plain form
7193 -37 48 -5 -41 35 62 -34 -96 -12 28 -26 -23 49 43 -78 -31 55 -3 -48 -20 61 1 -43 60 68 -40 -76 -11 30 -34 20
7223 20 126 79 -68 -75 12 -33 -31 47 116 37 -90 -43 -15 -63 -24 56 93 -30 -52 19 -16 -73 -11 61 24 -43 6 61 -19
7252 -19 -68 17 51 -56 -42 61 77 -13 -33 50 0 -66 0 82 63 -31 -10 34 -42 -65 20 70 -4 -40 19 -1 -61 -44 52
7281 52 39 -68 -5 23 -10 -67 -11 69 -24 -59 16 45 -22 -51 35 43 -50 -43 56 50 -24 4 52 -7 -54 0 76 10 -21 60 44
7312 44 -32 -57 33 51 -35 -14 56 14 -71 -30 53 -16 -63 -4 56 -4 -58 29 49 -38 -59 18 40 -35 -14 75 33 -47 -31 33
7342 33 -7 -42 25 76 29 -36 18 20 -66 -42 54 65 -17 -8 66 -12 -77 -36 50 13 -53 13 53 -23 -69 -11 30 -50 -35 36 27 -17
7374 -17 -32 35 -6 -79 -9 43 26 -27 34 67 -37 -63 6 34 -21 -25 85 56 -31 -41 30 28 -70 -10 63 24 -23 8 60 -30
7404 -30 -74 -7 12 -26 -38 72 45 -48 -58 -13 -29 -67 -2 113 27 -38 -18 0 -62 -82 54 98 27 -17 23 30 -79 -27 70
7433G0k6m8JO6n4n8P0J2l7l0P9J2q1LM4j0p7K6J04n0m2K9L2o0p0J09N5o4m1N6
7463B0L7j17J9R9Mo8l0Q1l1o7Q3M3m0o1K6M4o7J0P6Pr5j7P0k2m8L2P7l2j18N6
7493b9N8l9k5L4P2r8m3Q1L5n1l0O9j3q5N2P1j7n9J1M9p1k4Q5M8n9m8N3j1p3L0
7523b7R4K3j23J0N5m8m1L9R7m6p7M8K0n3l6P2M1r2L0M4kn9j3Q1n2m2P4N0k2p4
7553b9N5jr3J0J03O6q6k7M8o0p2L8J18j0o2M2j5n3o3P3P6n1j7L6lp2j6Q4qo3L5
7584a7M4j1p0N3N2o9l5M5O1o6j3Q7j6o0k8Q5J0r2L9N3k9n4K3P6n7n6M9J9m6j9
7614d2R9mq3j8M6po4O0R4n2n0qM5n8m0J22L7o0m3M5Mr3K8P5K0o1LP0n7n9N1L6
7646C6k7m7P0M2r6JL4J7q2NJ07k9o0OO0m3p3O1N5m6m5O1M7r7j3P8lm1oP0j6p4
$$ plain form
7433 70 44 -4 -3 63 9 -49 21 33 -4 -34 45 57 -24 -21 23 13 -64 -38 66 16 -26 3 35 -25 -95 14 69 5 -36 20
7463 20 57 -60 -41 58 62 -6 -36 45 14 -53 30 73 33 -28 -2 42 -25 -15 61 68 -27 -44 26 4 -44 -12 65 33 -85 -29
7493 -29 29 -10 -35 -1 71 -27 -70 11 46 -5 -35 34 21 -64 -12 59 42 -17 -6 43 -28 -52 33 81 22 -26 27 16 -57 -27
7523 -27 67 90 -33 -23 32 -16 -57 -18 79 33 -44 4 24 -29 -65 7 48 -44 -14 30 28 -31 -44 37 -15 -57 17 67 45 -29
7553 -29 26 25 -68 -58 45 111 25 -2 46 -14 -86 -48 70 60 -2 40 25 -28 -91 -18 58 7 -10 26 23 -49 -65 19 11 -52 -17
7584 -17 27 16 -54 -1 51 -18 -53 -8 53 -13 -26 61 45 -15 -43 42 52 -40 -1 52 23 -31 -8 68 11 -45 4 23 -23 -42
7614 -42 57 53 -30 -48 -2 -9 -73 -13 81 29 -21 -29 16 -42 -82 40 77 17 -26 19 23 -70 -42 33 53 -8 -5 65 8 -51 0 36
7646 36 9 -38 32 74 -22 -21 13 30 -52 -47 60 31 -29 -23 37 -6 -79 -18 37 -9 -54 7 54 -43 -56 22 19 -22 -28 42 26 -48
7678d8L3M4k0m6M2O5q1k5O4L0q3j5P4%o4PP8k1r1L7N9l8m9L0P2p3l5O2Kl0l4Q0
7710B6J3q6J5O2k5n2L9N9l8m2M2L6o8l1Q6J5n9j7O4K1j07K7P6m5m7J8P4m0m8L4
7740BK5n6k8O4L5p0%N4Jr0J3R1k6l9K4M4m7q4P8N1n0j6N1K9q6mP1Mn7kP2l3n7
7773c6L8M6k3p4O0M2q9nO1L5q4j1P5j8p5M2O2l4o8N0N5m2o5N1M5p6%O9L2n5m7
7804c9O6k2n6L4P0Ln6LL0o6k7O6O6m5l0M8k9p9rJ01Ln9L1N3n2q2L5Q3m7l4N7K8
7836D5n4m7O3J7p0J0P5Oo7J4M8n2m7N2O8l9n2O7Kp2k3P8M3p8J1M2k2n8J2P8k5
7867B5n6L3L4o0l9O9L3n0k5M2J9r2L1P9k7l1KN1l6n4O4K8l9k7M7M3r0QM9J1o6
7898b4nQ7j3o8J6M2k5n9M7O1n2k4K5K6o6k0P8pl2j4M9qr2O2M8j9n4M6M8p3k1N2
$$ plain form
7678 -48 -15 29 9 -37 5 70 -11 -36 28 58 -25 -40 34 34 -30 -23 55 34 -57 -20 39 1 -48 -18 54 -19 -54 8 10 -20 -54 26
7710 26 39 -47 -32 30 5 -47 -8 51 13 -29 13 49 -19 -50 36 51 -8 -25 39 60 -47 -20 56 11 -36 -18 56 16 -32 2
7740 2 27 -29 -57 7 42 -28 -28 26 27 -63 -50 41 15 -24 0 44 -3 -87 -9 42 -8 -24 27 56 -30 -34 37 41 -16 -18 54 21 -36
7773 -36 2 48 25 -49 11 53 -36 -41 20 55 -29 -40 35 17 -58 -16 46 12 -56 -6 49 7 -58 -7 38 -38 -38 31 63 8 -39
7804 -39 27 5 -51 -17 53 56 0 3 33 -33 -60 6 72 27 -3 45 16 -63 -72 29 32 -27 4 57 5 -77 -42 41 -6 -40 17 45
7836 45 -9 -56 7 24 -46 -36 39 45 -22 -8 40 -12 -59 -7 61 22 -30 37 39 -33 -56 22 65 -13 -2 40 18 -40 -28 50 25
7867 25 -31 2 36 -24 -63 6 39 -11 -36 6 25 -67 -36 43 16 -15 -13 38 2 -52 12 40 1 -26 21 64 -26 -18 31 42 -24
7898 -24 -29 58 45 -23 -7 35 10 -49 -2 59 7 -17 8 34 -32 -52 26 19 -13 -27 22 14 -78 -16 32 13 -41 5 53 -20 -41 11
7930A1M0n1l4P9No6KO0j7p2M2N4k8l7K4K5n2l2P2kl1pM8pr4L2O6j3m3K2N2o4o3
7963g9O6L6k4m0O6K8q4j3N2K2o2K1P5l4n5J4N6k6n0N3K4l1m1L7K4p4K2N5j0n9
7993c1J2O3m2o8M8N6k4n9M6L5o7j0N4K6o5mN6j4m6jP0j3n0M2K4l6l8L1N6o2j9
8024c0P2j3l7j4O2k6m1L5K7j2o2K1N7m8m1M6L5l8m3O7j0l7kN3Jo1K1L9j4l8J9
8055a2N7n1k1M6J3l0k2M0K1o5LN0J4o7J8N8m7k7J9L7k2n8O4J5m9j7M4J8o8K1M4
8086B6j9k5rO1k0m6K4L4l1l4N5K3o6QN2Qm9j3P3k7m7K4M4j3n9M5K2m7j7K8L7o1
8118a9j0N4j1k3j8M5jn4K6L6j4m7K5M7n2j5L5K3l5k2M6Jl6J0M0Mn1J8M1l3l1J6
8150eM4l5k1M0J6m0l0M6Pm2J6M1pn4pO6m3l0M8L1l6n0M2Ql8JM9J9n8jL3qm0L0
$$ plain form
7930 11 51 0 -34 45 50 -16 -14 46 29 -43 -1 53 25 -12 12 37 -15 -47 25 23 -8 -15 33 26 -68 -36 30 17 -26 -4 48 -16 -79
7963 -79 -13 23 -1 -41 25 53 -31 -44 8 30 -32 -11 64 30 -25 -11 45 19 -31 22 46 15 -26 11 35 -39 -17 38 28 -31
7993 -31 -19 44 2 -66 -18 38 14 -45 1 36 -31 -41 13 39 -26 -30 26 12 -34 -35 35 22 -28 14 38 2 -36 -5 51 -11 -30
8024 -30 42 29 -8 -22 40 14 -27 8 35 23 -39 -18 39 -9 -50 -4 31 -7 -50 17 7 -30 -32 21 22 -39 -18 21 7 -31 -12
8055 -12 45 -6 -27 19 32 2 -20 20 41 -24 -21 29 43 -24 -6 52 5 -22 -3 34 12 -46 18 33 -16 -33 11 29 -39 -18 26
8086 26 7 -18 -27 34 14 -32 -8 26 -5 -39 16 39 -27 -19 33 41 -8 -21 52 25 -22 2 46 33 -26 19 41 -6 -23 5 42 -19
8118 -19 -29 25 14 -9 -27 18 17 -37 -11 25 11 -36 -11 36 -16 -31 4 27 -8 -30 16 17 -19 -9 31 35 -16 2 43 10 -21 -5
8150 -5 39 4 -17 23 39 -1 -31 15 22 -20 -4 37 30 -24 -31 35 -8 -38 10 41 5 -45 -3 5 -33 -32 17 36 -22 -23 10 2 -38 -8
8184hN7l5l4L2J5l8k0
$$ plain form
8184 -8 49 14 -20 12 27 -11 -31
8191c1
$$ Imaginary data points
##PAGE= N=2
##DATA TABLE= (X++(I..I)), XYDATA
0@%%%%%%%%%%%%%%%%%%jNrJ3j6J6j6J6j6J6j6J6j7J9k2K4k3K1k0J8j6J6j5J3j0
43dPm%NrJ3j7J7j6J7j5RKj8M5q7J48k41L79n90R19j452K363m044P557j6912P3410
70F1482J59568k93976J84922j68033J8836J15232l01038K74301J8765m2517M0206
81F7748j40857Q6896j2479m0840R228N0659j127P93J2271j20554J58849n3354
93A7233o7565O5099j18291K17055j04035q9389J72053j13625P6702j51710K0471
104g6002J90687j36655M7189o1899P8242k015j48175J31494l9063Q9206p3101
115i2p5940J45629j32326J04545l8792m6315J35814j49895O2287m1788q404J49017
127A03740j07061k08o957J3687k854o5845N3560O5996K7169j39146L6815M8182
$$ plain form
0 0 0 0 0 0 0 0 0 0 0 0 0 0 0 0 0 0 0 0 -1 4 -5 8 -8 8 -8 8 -8 8 -8 8 -9 10 -12 12 -11 10 -10 8 -8 8 -7 6 -4
43 -4 3 -1 -1 4 -5 8 -9 8 -8 9 -6 3 5 -13 32 -55 93 -148 231 -359 560 -892 1471 -2573 4984 -11928 61482
70 61482 221050 -72926 111996 -56037 -37201 78031 -223007 51294 70059 27542 67748
81 67748 -73109 13787 1308 -39532 -30304 20355 19228 20021 32292 -88262 70587 17233
93 17233 -50332 14767 -103524 113531 9496 -79893 92160 -21465 55237 -96473 -76002
104 -76002 114685 -21970 25219 -36680 41562 39547 -108628 22866 -16197 73009 -92
115 -92 -76032 69597 -62729 41816 3024 -43291 92523 -57372 4915 -36873 -45277 103740
127 103740 -3321 -3529 -10486 3201 347 -65498 -11938 54058 81227 -57919 -21104 27078
139B7078o2982N5049r5095J41338Q131j58477J28784r2318P1932O990j16919J60751
151G4262r9454K3866L4727r0787J08927n6316j817l456l4110Q4726k4154j7822
163a408j4629M3358j4470o9184M0399J9003O4122p6781l0364Q7903p0996J3486
175i561k7676M1261O9568j05847L5909p114m312J6083m6679O4759k1359K186L508
188A0726l3990L3851k4950L2214k7145j7302N7235l0789J2617l4113K3290L6421
200C8065q0422K5168J9609K4760r292m9465N6614j5530l2272m894K0414M4321
212C7076l6986K300O379p295r812k1383L7321p763P083J2205k2834R775k1699
225a5633J8926k565k6764L8101m12k723j8207L591L2945l8796j0572J7358J6913
$$ plain form
139 27078 -35904 19145 -75950 65388 73519 -84958 43826 -48492 23440 30430 -86489 74262
151 74262 -25192 -1326 33401 -57386 51541 -4775 -6592 -10048 -44158 40568 16414 -1408
163 -1408 -16037 27321 12851 -56333 -15934 3069 67191 -9590 -39954 47949 -23047 -9561
175 -9561 -37237 4024 73592 -32255 3654 -3460 -7772 8311 -38368 26391 5032 7218 10726
188 10726 -23264 10587 -14363 17851 -9294 -26596 30639 -150 12467 -21646 1644 38065
200 38065 -42357 -17189 2420 27180 17888 -31577 25037 9507 -22765 -27659 -7245 37076
212 37076 90 2390 8769 1474 -8338 -29721 7600 -163 6920 19125 -3709 6066 -15633
225 -15633 3293 728 -26036 12065 11653 8930 -9277 -5686 27259 -11537 -22109 -4751 12162
238A2162n009k5647L2533P876k3450j5582N156K1161k0855M519K2236M65p495
251H070j7012Q712r498r668K0449O972L373o566N412k730k8851M315J7543N082
265E603p404M158K0998j5694k4299M927J4039l185j2805J6588J7486j3142j3957
278f687N794N757j5687n367J8294Q399o917n53Q334q574j8382M028J3231r40k930
293b200J1041O818j7143j2134J2130N200r899K10J3827J480j6140J518J5583m005
307F286j3576J50R385n631p641J6554J2752j0415j3061P79J99j1704N650K2877
321A2604O578j2477q547K555r603j1441J4274J9394m26j1060J292K135j5009n295
335a5026J3921Q953o537m161J1191p41j3498N07P290k643j0079P441J5751n341
$$ plain form
238 12162 7153 -18494 14039 21915 -1535 -17117 -11961 9200 -11655 -7136 15100 15565 8070
251 8070 -8942 -230 -9728 -19396 1053 8025 11398 4832 10244 7514 -21337 -17022 521 5603
265 5603 -1801 2357 23355 7661 -16638 -11711 2328 -857 -13662 2926 20412 7270 -6687
278 -6687 -893 4864 -10823 -16190 2104 10503 3586 3033 11367 2793 -15589 -11561 1670 730 -2200
293 -2200 8841 15659 -1484 -13618 -1488 3712 -6187 -5977 7850 9330 -6810 -5292 10291 6286
307 6286 -7290 -7140 2245 -3386 -11027 5527 18279 7864 -5197 -4418 -4219 -15923 -10273 12604
321 12604 19182 6705 -1842 713 -8890 -20331 -6057 13337 12911 1851 3143 5278 -9731 -15026
335 -15026 -1105 7848 1311 -2850 8341 7600 -5898 -5391 1899 -744 -10823 -3382 12369 7028
349G028o961K164k66j1610p184J8452J0472o191k275J131m371j7318M518J9836
363G425J099l965k203L792j0964j2262J5723R167j724p075K382M575j6376L365
377g041J1798K037o200p915J2636n445o150R341K181n90j5350O677R083q426O957
392C593J556L015j5076p947J8475m018L149J621M701l268k4917J3124Q001O96
406B705J231k993J3467k1295o932J2643K364O990j2497J0733k235j4602Q870j032
420b583J1633j0079p66Q521j7304R896k58Q427k638j4888J9702j4495k039N066
434a805L821J3730k7350R971P849q763K576j0387K3497j2222j2313J4100l258
447e54J3915j9228M591O977k0018J4682o663J5858K251j3514J2248k6109M800
$$ plain form
349 7028 67 2231 1965 -9645 -16829 1623 12095 5904 3629 4760 389 -16929 -12411 7425
363 7425 8524 4559 2356 6148 -4816 -17078 -1355 7812 6088 -987 1395 5970 -10406 -7041
377 -7041 4757 6794 594 -7321 5315 -130 -6280 3061 5242 4652 -10698 -4021 5062 -3364 3593
392 3593 5149 8164 -6912 -14859 3616 -402 2747 4368 9069 5801 -19116 -5992 2009 2705
406 2705 3936 943 14410 -6885 -13817 -1174 1190 8180 -4317 6416 4181 -10421 -1551 -2583
420 -2583 9050 -1029 -1795 6726 -10578 -682 -940 7487 4849 -10039 9663 -4832 -6871 -1805
434 -1805 2016 15746 -11604 -1633 6216 -2547 29 -10358 13139 917 -11396 2704 -554
447 -554 13361 -5867 -1276 5701 -14317 365 -6298 9560 11811 -1703 10545 -15564 -10764
460a0764O933L276J3146j2365J6331j4015j7097Q32N746K2730j9812J2146O212
473A3299j2339j934k5771L4868l651j3436K1738j8565K3415k2688j0056K7767
485A2647k7285K0174p599j522J9247k1558J5320j4594n750J3010n562P215q377
498d634J6948m186j4336k286j118K5750k5216N312J6747j3492R025l1252K5242
511B504J2673k6923J9563j7069J8311p471j8178K9591j6791J3449j1696p978J6297
524F282j8408K4146j5410J671J5167k1171J4377k5380J7687J7980k7255J5998
536E684r768J4863p756k4794K7134l81q24j2543P172J4038j4300j225r028K3111
550A1383j1527j0443K0674j9609K6255j9332r748K5751l2189L2677j5624j2084
$$ plain form
460 -10764 -3831 -555 12591 226 16557 2542 -14555 -13723 -7977 14753 -5059 7087 13299
473 13299 960 -974 -26745 8123 4472 -8964 12774 -5791 17624 -5064 -15120 12647
485 12647 -14638 5536 -2063 -3585 15662 -5896 9424 -5170 -10920 2090 -3472 3743 -4634
498 -4634 12314 8128 -6208 -8494 -9612 16138 -9078 -3766 12981 -511 8514 -22738 2504
511 2504 15177 -11746 7817 -9252 9059 1588 -16590 13001 -3790 9659 -2037 -10015 6282
524 6282 -12126 12020 -3390 -1719 13448 -7723 6654 -18726 -1039 16941 -10314 5684
536 5684 -4084 10779 3023 -21771 5363 4982 4158 -8385 -1213 12825 -1475 -2700 -11728 11383
550 11383 -144 -10587 10087 -9522 16733 -2599 -12347 13404 -18785 13892 -1732 -13816
562a3816L5783l0775J7302j7217n243L5776l1318O607L758N315L783k6696J3924
575b817R370L66j6628M984J7374j4267L715j5110J8564N132k5196K2767j5249
588f995J2483K121k2047K3932j6781J2694j474j8022K3397r776P695j4903j099
601h775K3732j9376L487q892J8461N606l2305K0318k648P745q273j6680L4216
614A6616j4438m502m71l392J8537j9245M112M172K44N021j2564O283m766R910
628E517l378j1413J3751o222J2521j6683n518K6670j8532K922r387R233J9635
641A9116l1442J0957N385j92k329j9762K4016J272o415q72k365J1694j5119R56
655e100J363M063R813j2757O670p864L027N475j6822J3061J319N928n206j5566
$$ plain form
562 -13816 21967 -8808 8494 -8723 -13966 21810 -9508 -2901 857 6172 9955 -16741 -2817
575 -2817 6553 6919 -9709 -4725 12649 -1618 2097 -13013 5551 10683 -14513 8254 -6995
588 -6995 5488 7609 -14438 9494 -7287 5407 3933 -14089 9308 -468 7227 -7676 -8775
601 -8775 14957 -4419 -932 -9824 8637 14243 -18062 2256 -392 7353 -920 -17600 16616
614 16616 2178 -2324 -2795 -6187 12350 -6895 -2783 1389 1633 6654 -5910 373 -4393 5517
628 5517 2139 -9274 4477 -1745 10776 -5907 -11425 15245 -3287 -365 -9752 -519 19116
641 19116 -12326 -1369 4016 3824 1495 -18267 5749 7021 606 -266 -2631 9063 -6056 -5100
655 -5100 -3737 326 10139 -2618 4052 -3812 -785 4690 -12132 929 2248 8176 2970 -12596
669a2596K0040m470p084l453N343J7062j7931k494P474L802l888j5442J4783M239
683E385l594k489k519J1115j0574j303J932k57R622p939K357m369j91Q572j1529
698e781M850K887M074l006j6218J4037M400m570k773m1J3477j3077r764R018O904
713D417J868r875M636M642p229n322J233R657j364n6l80l321K087n263K774r16
729b412O86J0170p058l267R60K024J013j1278O052J0401l395n529l27P592m928
744G04r625L631R763J415p455K961K318m881m229m40Q677L30j676K741n104j572
760b442l7M57K112o31M959M54q164j314N644Q88m485M01O232Q67q962r71Q738
777C746j303n348L60M951J353p196J301N943l334k782J008K192K80k291K539Q71
$$ plain form
669 -12596 7444 2974 -4110 -7563 -2220 14842 -3089 -5583 1891 5693 1805 -13637 1146 5385
683 5385 1791 -698 -3217 7898 -2676 -3979 -2047 -2304 7318 -621 1736 -2633 -2824 5748 -5781
698 -5781 -931 1956 6030 3024 -13194 843 5243 673 -2100 -2141 11336 -1741 -11505 -2487 4417
713 4417 6285 -3590 1046 5688 -1541 -6863 -5630 4027 2663 2607 2227 -1094 993 -4270 -1496 -2412
729 -2412 -1726 8444 1386 -1881 -921 1103 2116 -9162 -3110 7291 3896 -1633 -1960 5632 704
744 704 -8921 -5290 4473 5888 -1567 1394 3712 -1169 -5398 -5838 2839 3169 1493 4234 -870 -2442
760 -2442 -2479 -2022 90 -541 4418 4872 -3292 -4606 1038 1926 -2559 -2158 4074 4941 -4021 -4992 3746
777 3746 2443 -2905 -2545 2406 3759 -3437 -2136 3807 473 -2309 -1301 891 1171 -1120 1419 2290
793B290m891Q28K978j802m64K358K582l389n646M557L461m522k29M400J938n626
809a177m143N994K072m861N61M646l04m885p55M252k13l849K637L021l120j372
825a496J725J552k975k033N370k90l847J958K537j008n268J295N471k628k102
840a739K944K533m017m587M124K647k186m45L629M20o385k82L356L86j115J135
856D18M671m299m708K600J128k52j817N117K369o860n44J420J123k805kP409k463
873B505l438q0J374l58m968N383L064k637p00j40K463n906k14N512q18j42j764
890h64M353k454o268M638J016J148l087K068M742q046L28J446K206m19m307Q062
906D562k982l922J148O3M223o443L586L793n229Q37k191N105k940k812O790l110
$$ plain form
793 2290 -2601 -1773 1205 -597 -1061 1297 3879 490 -5156 -599 2862 -1660 -1889 2511 4449 -1177
809 -1177 -5320 674 2746 -2115 -1554 3092 2788 -2097 -2852 1400 1187 -2662 -25 2996 -124 -1496
825 -1496 229 1781 -1194 -3227 2143 1853 -1994 -36 2501 1493 -3775 -2480 2991 363 -1739
840 -1739 1205 3738 -279 -4866 -742 1905 -281 -726 2903 3323 -3062 -3344 12 398 -717 418
856 418 5089 790 -3918 -1318 -190 -442 -2259 2858 5227 -1633 -2177 -757 366 -2439 -2441 4968 2505
873 2505 -933 -1013 361 3 -4965 418 3482 845 145 5 2468 -3438 -3652 1860 1042 900 -864
890 -864 3489 1035 -5233 -595 421 1569 -1518 550 5292 -2754 -2426 -980 1226 807 -3500 4562
906 4562 1580 -2342 -1194 -1131 3092 -3351 235 4028 -1201 -364 -2555 2550 -390 -3202 3588 478
922D78n3l231L387K079o987N723j86N41l193j539P858p741J596K096L42J663q643
939e810Q801j432m810M047k457O836p827M1O874o624L053l314M968J47p018P143
955B618l241J143k118R03N096q189M924r14Rk51l911R915p812J17L217k521M628
972C613j0174Q762K062p982N382m743P807o150l872J0614o767L354m563K741M177
987D261r800P607k776J641o6l738P643q549M050R67k787L394n769R124n548l244
1003c590N663l106M635r485O640M743q667M229n149R283n197o885J2200o891N124
1018C547o089l02R743j3071P826j967p82N640r139Q394n543m49N610o112L907
1033A213l221N366k012n585N165q75L644r392N119O818q742L768o589R809j495
$$ plain form
922 478 425 -2806 581 2660 -4327 1396 1210 1751 -1442 -2981 4877 -2864 -1268 828 1170 2833 -5810
939 -5810 2991 1559 -3251 796 -1661 5175 -2652 -2611 4263 -2361 692 -2622 2346 2493 -4525 2618
955 2618 -623 520 -1598 -695 4401 -3788 1136 222 231 -20 -3931 5984 -1828 -1711 1506 -1015 3613
972 3613 -6561 2201 4263 -3719 1663 -3080 4727 -1423 -5295 5319 -1448 1906 -2657 84 4261
987 4261 -5539 2068 -708 933 867 -2871 4772 -3777 273 1240 -1547 1847 -3922 5202 -346 -3590
1003 -3590 2073 -1033 3602 -5883 757 5500 -3167 1062 -4087 5196 -1 -6886 5314 -1577 3547
1018 3547 -2542 -2844 6899 -6172 1654 -313 -1095 4545 -4594 3800 -1743 -2192 3418 -2694 1213
1033 1213 -2008 3358 1346 -4239 926 51 3695 -5697 -578 6240 -2502 1266 -5323 4486 2991
1048B991j1726J3446n598M315l716n773J3172j1277L962R33k586P592r186N098
1062A647l548q05O384n815M488m233N081j143r457Q141j039N081o093k393J1318
1077G614r791o19j676N684N771j1578O107K9j72l306m706J0697m211K474j785
1092E32j849N655r327N887l753M25R267q793N083n304J896M439j3108Q630K500
1107B180K043k125p713J0519m748m704R8N153P582r879J157O41M69j814o093J0836
1123C602j201m8q24n647O408n439K682J019k364P684n851j128k375K614N762q428
1139c534K951J986K561m215p658J1314j071k305k445N77R628j0734q13M301j08
1154D35L098q147N426K630m203J167m265M282L17l01Q44k736M340k454k384k166
$$ plain form
1048 2991 -8735 4711 -887 3428 -288 -6061 7111 -4166 -204 729 -1857 5735 -3451 1647
1062 1647 -1901 -2706 3678 -2137 2351 -1882 3199 2056 -7401 740 -299 4782 -1311 -3704 7614
1077 7614 -2177 -2796 -4472 1212 6983 -4595 1512 1541 1369 -1937 -6643 4054 -157 2317 532
1092 532 -1317 4338 -4989 898 -2855 -2430 6837 -1956 3127 -2177 -281 4158 -8950 -320 2180
1107 2180 4223 2098 -5615 4904 156 -4548 -4450 703 8285 -1594 -437 204 673 -1141 -7234 3602
1123 3602 2401 2353 1529 -4118 2290 -3149 -467 552 -1812 5872 21 -1107 -3482 -868 4894 -3534
1139 -3534 -583 1403 3964 -251 -7909 3405 2334 29 -2416 -1839 7789 -2945 -3758 543 435
1154 435 3533 -4614 812 3442 -761 406 -3859 423 740 439 1283 -1453 2887 433 -1951 -4117
1170d117L113O945o329o38J519K044k446q156Q511M147k392l468j121P172o302
1185a518l061L617K873K759p422K360J744k529J956m065M343O55j912J883m981
1200c298M183J673l897m91o4N497k007m962L031L929k353o158K798N022J70m924
1216a851n46O808m214l576J388K280M172n743L18K816l222J667k240J205K780
1231B042j368P74l149K19L188j184k631M59M598r73l909k26M154J172o933R55
1247b812N212k62k474k323M966M69n929Q43K612J531j235j454J949l22j769j23
1263a121N39J40J845K84k712K40R21J156j932k389N102L93m201k21K351L024l990
1280e71k807M827M64l478q23L081K364k759k134K277M23k613O05J446O44M28j212
$$ plain form
1170 -4117 -1004 5941 -388 -1026 493 2537 91 -8065 446 4593 2201 -1267 -2388 4784 -1518
1185 -1518 -4579 -962 1911 4670 -2752 -392 1352 -1177 779 -3286 1057 1712 -200 1683 -3298
1200 -3298 885 2558 -1339 -1830 -1894 3603 1596 -3366 -335 3594 1241 -4917 -2119 2903 3073 -1851
1216 -1851 -2397 4411 197 -3379 -1991 289 4461 -1282 -964 1852 -1370 297 -1943 -738 2042
1231 2042 674 1448 -1701 -1482 1706 522 -2109 -1650 2948 1975 -1934 -2160 1994 3166 -3767 -2812
1247 -2812 2400 2138 -336 -2659 2307 2776 -3153 -2310 302 1833 598 -856 1093 771 -998 -1121
1263 -1121 -582 -442 1403 1687 -1025 -785 136 1292 -640 -3029 2073 2466 -1735 -1956 395 3419 -571
1280 -571 -3378 1449 1913 -1565 -2388 693 3057 298 -1836 441 864 -1749 -1144 302 946 1374 162
1297A62L75j415q55K567j495m75K483Q21j137l263J174K852k761j703L331K445
1313C106k243k695J385K374k729k349L666J303j353q17M22J654k803p23K291j033
1329e44N08P45M01n01j750J540j35k144Q11K587lk466O43J844p41l033N55L664
1347A981j885j495J642J623k37l659J502J368k534N43J352K112j159j583J408
1362I79k057j357R94K476O35j460J595p76k531j483J866L055k196P56J610j153
1378I53k066j963L782R4j898J781M21K40k945P90K237k352K34L16J763j171j370
1395a154L153j849j142n31J404J688l131K703P72k144j119q40L872j744o69K590
1411A859j063q38k708K648J459k074J620l18M23k861K07L408k107Q90n28Q92r39
$$ plain form
1297 162 537 -878 -1733 834 -661 -1136 1347 2168 1031 -2232 -1058 1794 -967 -2670 661 3106
1313 3106 863 -1832 -447 1927 -802 -3151 515 1818 465 -352 70 1724 -1079 -1802 489 -544
1329 -544 -36 709 1110 609 -1141 399 264 -1880 -1069 1518 1515 -951 -308 1536 795 -2238 -1683 1981
1347 1981 96 -1399 243 1866 1629 -2030 -528 840 -1694 -1151 201 2313 1154 -429 979
1362 979 -1078 -2435 -1441 1035 1670 210 1805 1029 -1502 -2985 -1119 1936 -260 496 2106 953
1378 953 -1113 -3076 706 800 -1098 683 1104 1344 -1601 -811 1426 -926 -692 -376 1387 216 -1154
1395 -1154 1999 150 -992 -1523 -119 1569 -1562 1141 1913 -231 -1350 -2190 1682 -62 -731 1859
1411 1859 796 -42 -2750 -102 1357 -717 903 585 1008 -1853 -1646 1762 -345 545 17 909 -30
1428c0l005M609p44p60j73n34K434m341J937K744j634p0k610L222j195j875L571
1445A546n24M84l388Q47K033k705K475n8J126k308k098L823k297J385L20M17K91
1462A369n056L892K07n10J407j510K908n123l31L657j107K152k418K425j000m667
1478c705L134j00K211j391k1K768m435O44k77J449J87k534M389j958o8N0q09J868
1496A402n048L008J402q34K516k293K885m689k552L972j326L652j267K156J91
1511C175p101J991n57K587Q36o22M586m847j667n09N37K582k560L877o13j821
1527a26j79j360L058l085J710J183k174J799k234L794k075k489L897l213J693
1542A99j747J809L662o097K310k71P8K36k960N571k040j861P12j40K801l589J638
$$ plain form
1428 -30 -3035 1574 830 70 -103 -637 1797 -2544 -607 2137 503 433 -2177 1045 -150 -2025 1546
1445 1546 1022 1506 -1882 -1035 998 -1707 768 710 1836 -472 -2570 1253 -1044 341 661 1078 1369
1462 1369 -3687 205 412 -98 1309 -201 2707 -2416 -2747 910 -197 1955 -463 1962 962 -3705
1478 -3705 -571 -671 1540 149 128 2896 -1539 -895 -1172 277 464 -2070 2319 361 293 343 -466 1402
1496 1402 -3646 -638 764 -70 2446 153 3038 -1651 -4203 -231 -1557 2095 828 2984 3175
1511 3175 -3926 -1935 -2492 95 931 309 4895 48 -1619 -2128 -1591 991 -1569 2308 1695 -126
1527 -126 -305 -1665 1393 -1692 18 1201 -973 826 -1408 2386 311 -2178 1719 -1494 199
1542 199 -1548 261 3923 -2174 136 -135 -57 179 -2781 2790 750 -1111 -399 -539 2262 -1327 311
1559C11M44j799O43j598L954j434K44J278m029J322j994L000J209k515M553k828
1575G61j491j924J21N039l514J496J472m21j346m297M493K05r52M29k33L206m333
1592a289M11J347j391J939l004K778o6j319L009l550R71o27J04J594l091L968
1608A784L35k020j322p62L952k915m80K380R66l43m807L004J378j620J46p68L761
1625B669k614j564J862r54J895k268Q28P09j379K363k270N28J93J89Q35l663L135
1642D94J189j218r71j511M566k646k446K718R04J439m481O46L365k535m49m59
1658a395K766M26k784Q14P6M89j053O5O85o6J541j820p7j73O67J186l912K272
1676b93J966r49o44k344M486q05m242J848J128K146k881r90M054j553k042j209
$$ plain form
1559 311 755 -1044 -401 -1999 1955 521 765 2043 -1986 -664 -2658 342 1551 -964 3589 761
1575 761 -730 -2654 -2533 2506 -1008 488 1960 1539 193 -4104 389 594 -358 71 -162 3044 -1289
1592 -1289 -878 469 -922 1017 -1987 791 725 -594 2415 -1135 -164 -791 -687 907 -2184 1784
1608 1784 2119 99 -1223 -1985 1967 -948 -1428 952 1918 1575 -3232 -228 1150 -470 -324 -1092 2669
1625 2669 55 -1509 353 -601 1294 -974 -146 563 -816 1547 -723 -195 -2 187 1022 -2641 494
1642 494 1683 465 -506 -2017 2549 -97 -2543 175 1079 2518 -1963 -1317 2048 -487 -936 -1395
1658 -1395 1371 1797 -987 -173 -97 392 -661 -596 89 23 1564 -256 -333 -506 161 1347 -2565 -293
1676 -293 1673 724 80 -2264 2222 1417 -2825 -977 151 2297 -584 -1574 2480 927 -1115 -2324
1692b324J869J853j581N38N40L19j549j220M24Q8K444l54q18O0k42R18l170J94
1710b011L432M1j217j988K803J152l727l52J892J929k546j473L190Q07j265k345
1726a678J222J287j952N39M01J530J34j870K39j159J078R17j501O08Q40R78j774
1743a61j723K418J091k084k156K309K338j649j196J370K002l146k948K265J986
1758G16Q71j184O18J113l129j325J32J539K264j3J00j431j017J72j093K1J901
1775B55K287j158k404N84J402q28k658J625K875j339j572N28K639j093l501R83
1791a375J491K41o71N87J927j445j798n02L73J113Q01P06q98o52j3o82n77O53
1809g21K794l50k764j47J307O87j974N57K911j253k603n50K588J078j968M54R67
$$ plain form
1692 -2324 -455 1398 -183 355 895 1214 -335 -1555 -1131 -1043 1401 1047 229 289 47 965 -2205 -2011
1710 -2011 1421 1462 245 -1743 1060 2212 -1515 -1867 25 1954 -592 -2065 1125 1932 667 -1678
1726 -1678 -456 831 -1121 -582 -181 1349 1483 -387 -148 -1307 -229 688 -813 -205 635 1613 -161
1743 -161 -1884 534 1625 -459 -2615 -306 2032 383 -813 557 2559 -587 -3535 -1270 716
1758 716 1587 403 1021 2134 -995 -2320 -2188 -649 1615 1602 1702 271 -746 -574 -1667 -1646 255
1775 255 2542 1384 -1020 -436 966 138 -2520 -895 1980 641 -931 -403 2236 1143 -2358 -1375
1791 -1375 116 357 -314 273 2200 755 -1043 -1545 -1172 -59 742 1448 550 -102 -115 -797 -1374 -721
1809 -721 2073 1723 -1041 -1188 119 806 -1168 -611 2300 1047 -1556 -2106 482 1560 -408 46 1013
1826A013p16j865Q8K200K45k48n34m04m93k58J497l17l1P04o66r32j063K313J331
1845A864k103m12O78O84j793m23L116K64k073j525J403R57j419Q11J279L2k141
1862h01r59J636j24P53N28j47p62j714J280p8j98J655K74n07k374N81J759j248
1880d46j67Q26J419j585j668K084N20q12j615J029J339j763J031J006K24j501
1896g9j943J539o13O59K019L50l47k747P3j18r01K123J808J004k507j265P92j456
1914a609J7R24K786k22k517R97m58l63j025P80K262k018M99O73Om15j718J830
1932D29j017p48J654N52P93k166O13L88k257P16P89K028j208j248J898j447n57
1949g88l83J574R25k538J276L21n6m38k52J946k390m56Q72K63Q56j002K263j031
$$ plain form
1826 1013 297 -1568 -1480 720 965 717 183 -221 -714 -972 525 208 177 881 215 -717 -1780 533 1864
1845 1864 -239 -651 27 711 -1082 -1505 1611 1875 -198 -1723 -320 637 -782 29 1308 1340 -801
1862 -801 -1760 -124 -248 505 1033 886 124 -1590 -310 -388 -586 1069 1343 836 -1538 -957 802 -446
1880 -446 -613 213 1632 47 -1621 463 983 171 -1444 -415 924 -839 192 1198 1422 -79
1896 -79 -2022 -483 -1096 -437 1582 1932 1585 -1162 -1089 -1207 -2108 15 1823 2827 320 -945 -153 -1609
1914 -1609 -1592 -668 2118 1896 -621 376 -82 -445 -1470 -690 1572 -446 53 726 732 317 -1401 429
1932 429 -588 -1336 318 870 1663 -503 110 498 -1759 -1043 -254 1774 566 -682 1216 -231 -788
1949 -788 -1171 403 1328 -1210 66 387 331 -107 -359 1587 -803 -1259 -387 -124 732 -270 1993 962
1967I62k435M76j42J589j202J484J997k614o50j015J484l86j133L255m07m40j389
1984e66N5J291k747J502R30J00J20j235K218j989j054J248m15R19j264K025N77
2001A715k454N55l75Q03j512L55K832j464k05p41J103m51k426K664O4J02o35j49
2019b19K035l069N08R17l33O17j542K553r35j509J402p72Q05j737J208J478k175
2036g68J027j82Q12j409j165K795j284j7J01R78M07l145J612M60l83r2j5K466
2054B198k517o79Q97k25O86j542K490j56k023J008r01J296j320M39K120k434O83
2071B0j46M66k03j626K586q86r20M38Q59R53k787Q73P21p43m00J7L274j793j392
2090f89O07p42P91j837K477J670k186N59j539M99n98k77K896j212J43j22n10l18
$$ plain form
1967 962 -1473 -997 -1139 450 -752 732 2729 115 -535 -1550 -66 -452 -1585 1670 1263 823 -566
1984 -566 -511 780 -1967 -465 465 565 685 -550 1668 -321 -1375 -127 -542 377 -887 1138 1715
2001 1715 -739 -184 -559 244 -1268 -913 1919 455 250 -491 612 161 -2265 399 463 565 -70 -219
2019 -219 1816 -1253 -745 172 -161 456 -1086 1467 532 -977 425 -347 458 -1279 -71 1407 -768
2036 -768 259 77 889 -520 -1685 1110 -174 -191 -90 888 1295 -1850 -238 222 -161 -253 -268 2198
2054 2198 -319 -998 -101 -326 360 -1182 1308 1152 -871 137 -764 532 -788 -349 1771 -663 20
2071 20 -126 340 137 -1489 1097 211 -709 -271 588 1541 -1246 -373 348 -395 -795 -778 2496 703 -689
2090 -689 -82 -824 -33 -1870 607 2277 91 650 -889 -390 -988 -1265 1631 419 562 440 -70 -388
2108c88j346K424k9j008J22O26J023k728P67J534r45p71r22L134l66j904J173
2125C96j98K10k163P83K331j067L05q14N31o42q95K046r93N10j13m78L36j581
2143a496K732K50k002J24m38J234j695L10L520n63k001j811J140M71j294J413
2159a06K167O57l030j119P03n88R55oJ973J37k014Q39j930J75J164k85J127j346
2177e27J534Q38k678j78M52R95j382n45L118Q02j836k202J226N37j908P84J902
2194I32J911k017k206J128p48K62L93R49J216j574k98q30l95J425O28r3j282P64
2212A65M70j432l14J261K174k260k022J895O75k96j648J650K114k913j071Q35
2228g17J510n3j725J364M69r65m99J70Q81k04J3n90k84P03N48R1j578P68J015
$$ plain form
2108 -388 -1734 690 661 -347 -225 401 1424 -1304 -537 997 52 -719 -1641 1493 1127 -777 396
2125 396 198 408 -1755 -972 1359 292 597 -217 314 -328 -1223 823 -170 340 227 -251 85 -1496
2143 -1496 1236 1486 -516 -392 -830 404 -1291 -981 2539 1976 -25 -1836 -696 -225 -1519 -106
2159 -106 2061 2718 -312 -1431 -728 -1316 -361 -367 1606 1743 -271 568 -1362 -1187 -23 -308 819 -527
2177 -527 1007 1845 -833 -1011 -559 436 -946 -1491 1627 2429 593 -1609 -383 154 -1754 -970 932
2194 932 2843 826 -1380 -252 -1000 -738 -345 604 1820 246 -52 -882 -1277 148 776 683 -599 165
2212 165 635 -797 -1111 150 2324 64 -1958 -63 612 316 -1332 318 2432 -481 -1552 -717
2228 -717 793 740 -985 379 848 -117 -616 -446 435 231 244 -346 -630 73 621 712 -866 -98 917
2247I17j632n54Q74K488q77k842J180J083p03j465J142K752j366k154P8J461j17
2264B65j193J089Q14k15j216m14Q74k07P62k54q11O46J03J75j244K53J913j062
2282B78j490L39K127R5k464L58J621l69k040M51K769k30j822o53J177L2j449R60
2300c10J210L12q03j034K12m40O48N88m03M91K88o9j683m45J958J83j156l46J936
2319A137M13k490l12J547O85j836n04K469K34j377q42R66N30j633L14J021L90
2336G12j68o55K32n88P9N72n21J17O15O43j177r55J373N25j044j136J600J216
2354A440j814m88J154J107j536j581J862N26p84m01Q51J004j561n05M33KJ42P2
2372g7P77m01j68K69q17m67J41J544k58j155J080M03o80j670O92K025j225o82
$$ plain form
2247 917 -715 -1269 -395 2093 1216 -1626 -446 637 -66 -1531 -389 2363 997 -1157 -1079 382 265
2264 265 -928 161 975 760 -456 -870 4 -203 559 305 -506 140 243 418 -826 -573 1340 278
2282 278 -1212 -873 1254 1349 -1115 -757 864 495 -1545 -1094 1675 1445 -377 -1030 147 179 -1270 -310
2300 -310 900 1212 409 -625 -413 -853 -205 383 -20 471 759 690 -993 -1438 520 703 -453 -799 1137
2319 1137 1550 -940 -1252 295 980 -856 -1360 1109 1343 -34 -876 90 620 -1013 -699 322 712
2336 712 544 -111 121 -467 -388 184 -337 -220 395 1038 -139 -1094 279 804 -240 -1376 224 1440
2354 1440 -374 -862 292 1399 -137 -1718 144 670 -114 -515 336 1340 -221 -726 -293 -291 -149 -77
2372 -77 700 299 131 400 -417 -884 -743 801 543 -612 468 871 191 -1479 -787 1238 13 -669
2390f69P80J030p20j840J269Q45p55n49N07J040j010k20N36j18k91l23P88m87
2408a87j58J041k44m93o97J002J84j559Q20J042J58j388k84J777r54r69L21J195
2426F07J88j712J053O82p44n89j73J208q26r9J176k67l32o61N48l41p58J331N81
2445H72k74j021M51M73j562K45J098R06r73j022J509o47q71J68R66P93j716M71
2463a34P00p38j85j01J192p70o36J139k19k34m85Q62K4j490R14O41J33r05K3J251
2483I82j540m42Q20R48p9j343J216j90j161j7O86J206j217J39O81r51l32j97J434
2502F43l49q17J225l53m74p42Q62Q26j601N33P57J07q91m52J579q90p90M79Q86
2521E38K91j504R66K10j067p5K28J473r90k77J008j119k66k44J325L49j324J046
$$ plain form
2390 -669 111 1141 421 -1419 -150 695 -60 -609 -102 938 -72 -292 244 126 -165 -488 300 -187
2408 -187 -345 696 452 -41 -738 264 448 -1111 -291 751 909 -479 -763 1014 60 -909 -588 607
2426 607 795 -917 136 818 74 -515 -688 520 -306 -405 771 504 172 -489 59 -282 -1040 291 872
2445 872 598 -423 28 501 -1061 -816 282 1188 215 -807 702 55 -816 -648 318 1111 -605 -134
2463 -134 566 -172 -357 -458 734 -36 -672 467 248 14 -471 391 415 -1075 -161 480 613 -292 -269 982
2483 982 -558 -1000 -180 768 689 -654 562 372 -789 -806 -120 1086 -131 8 689 -262 -594 -791 643
2502 643 294 -523 702 349 -125 -867 -5 821 -780 -247 510 617 -274 -726 853 -37 -827 -348 538
2521 538 829 -675 291 501 -566 -641 -413 1060 70 -207 801 -318 -584 -828 497 846 -478 568
2539E68k22q22o47P58J623j167j44M84j71j045o73K113J38o46QJ46P8j875Q54
2558f42J246m13K16l01Q42j232r87J370k69J81o7R13K11j914N53K03k90l25N54
2577a51J847j274p30L25j46m81r01K116P39j100p9j81J95j576L45J895j80j68
2595D95m70N27q68j169J427L94J91m89L55L23j830N73O79J69k69l09J453j286
2613a04q74Q77L87O7j198J283N69j495j06M15R65j203k76J597n07n60n73R65J98
2632D27j378J133L80k28n76j58Q97j124J66R70k7m07m85R97p18q13Q42P32J8j445
2652g97J016O40j458j17M11J429j045j057J733l56o57n28P53R63j478L14O96k10
2670B52n05j88Q67o31p4M76R0k93n57J239n61r69Q52L85J75j380N69J501j503
$$ plain form
2539 568 346 -476 -1123 -365 1258 91 -53 431 260 -785 -1458 655 793 147 155 301 379 -1496 -642
2558 -642 604 191 407 106 948 -284 -1271 99 -170 11 -56 857 1068 -846 -293 -90 -380 -705 -151
2577 -151 1696 422 -308 17 -129 -610 -1511 605 1344 244 165 -16 179 -1397 -1052 843 663 495
2595 495 25 552 -316 -1485 -58 336 527 38 393 716 -1114 -541 138 307 38 -271 1182 -104
2613 -104 -978 -101 286 353 -845 438 1007 -488 -594 -179 786 -417 -693 904 397 -163 -736 229 427
2632 427 -951 182 562 334 -242 -400 497 -627 -461 509 482 75 -410 587 -131 -944 -102 630 648 -797
2652 -797 219 859 -599 -716 -305 1124 79 -978 755 399 -258 -786 -33 930 -548 -234 462 252
2670 252 -253 -441 426 -205 -279 197 287 -6 -563 676 115 -854 -2 383 558 -822 -253 1248 -255
2689b55o06O35J114n57j402J274O88r06r32Q60R31j068q6L36N05n43o77J143o16
2708a62n1O12m47J69o17Q06J89j459Q33Q54l27j134K05J488o74j236M65J651p29
2727D36j560R76P61j45j327L62J693j262m16M10J76K82q85O07K04o31N48j26m45
2746c42M5P39K5r50K3R59K15j732L45J794o48j001l54J584K47k263Q67J327k91
2765E89r36n28J481j95j132N20O11l3m54kq3pJ70J69on96J009N0j521K97P72O65
2787H40j054p22K016k14j762k09J305Q57j454k88J542P4j609m35J213K84l50k10
2805a76O43J54j135K17r7m9R51p0q7o21J49O53j318j97J462P08j031j053J090
2824A93N94j367p38J682J047j481o60P87O47r85q73J497M02o89j87nM03n37l4
$$ plain form
2689 -255 -861 -226 888 331 -1071 203 891 -15 -947 -87 844 -224 -310 26 531 -12 -689 454 -162
2708 -162 -213 399 -48 121 -496 310 499 -960 -127 727 400 -734 -529 959 285 -951 -486 1165 436
2727 436 -1124 -148 613 468 -859 -497 1196 -66 -482 -72 104 386 -499 108 312 -319 229 103 -342
2746 -342 -297 442 467 -483 -460 499 714 -1018 -673 1121 473 -528 -882 702 949 -1314 -447 880 589
2765 589 -347 -875 606 411 -721 -201 410 377 -77 -79 -162 -169 1 170 164 -432 577 627 -894 -597 175 840
2787 840 -214 -936 1080 866 -896 -1105 200 1057 -397 -685 857 931 -678 -1113 100 384 34 -176
2805 -176 467 621 -514 -297 -394 -443 508 438 351 -270 -121 532 -786 -983 479 1187 156 -897 193
2824 193 787 -580 -1318 364 1411 -70 -730 57 704 -281 -1154 343 745 56 -131 -136 267 -270 -304
2843c04M22k88M07K79m77o49L80P58o41n86Q06J137j069j410J059Q70o41r69R37
2862B1J469j429j125P26Q11k93q55R36O13q67m67Q5M22j29J73L13m62nJ93q6o09
2883e65J99J161m75r28K76J050k82j436O11J198m85j120M04J439o30j182L33Q45
2901D13k18q50P49O29n03m98j06L65l06L18O41n12j11K8Ln88k47J432J31r49j43
2922c22O45J30j392J41J486J9j007j14J069k59j169J38R50M8p24N00N10m81m74
$$ plain form
2843 -304 118 -170 237 516 39 -610 -230 528 -113 -699 107 1244 175 -1235 -176 694 53 -916 21
2862 21 1490 61 -1064 -338 473 180 -675 261 874 7 -460 -375 47 -82 91 404 -58 -63 130 44 -565
2883 -565 -366 795 320 -608 -332 718 436 -1000 -389 809 324 -796 -392 1047 417 -765 -432 413
2901 413 195 -655 94 723 220 -278 -384 -19 -325 -7 634 122 11 39 42 -546 -793 639 770 -179 -322
2922 -322 323 453 -939 -798 688 707 -300 -414 655 396 -773 -635 315 363 -361 139 649 168 -306
$$ [...]
8191A3
##END NTUPLES=NMR FID
##END=
