##TITLE=1H_AM_NVBuA
 CDCl3
 8 sc, 
 10.9.2024
##JCAMPDX= 6.0         $$ Bruker NMR JCAMP-DX V2.0
##DATA TYPE= NMR FID
##DATA CLASS= NTUPLES
##ORIGIN= UXNMR, Bruker Analytische Messtechnik GmbH
##OWNER= root
$$ XWIN-NMR		Version 3.5
$$ Tue Sep 10 13:58:15 2024 Russian Standard Time (UT+4h)  she@DPX200
##.OBSERVE FREQUENCY= 200.1318
##.OBSERVE NUCLEUS= ^1H
##.DELAY= (6, 6)
##.ACQUISITION MODE= SIMULTANEOUS
##.ACQUISITION SCHEME= undefined
##.AVERAGES= 8
##.DIGITISER RES= 18
##SPECTROMETER/DATA SYSTEM= spect
##.PULSE SEQUENCE= zg30
##.SOLVENT NAME= CDCl3
##.SHIFT REFERENCE= (INTERNAL, CDCl3, 0, 15.7039)
##AUDIT TRAIL= $$ (NUMBER, WHEN, WHO, WHERE, WHAT)
$$ ##TITLE= Audit trail, XWIN-NMR		Version 3.5
$$ ##JCAMPDX= 5.01
$$ ##ORIGIN= Bruker BioSpin GmbH
$$ ##OWNER= she
$$ F:/spectra/data/she/nmr/H-F/1/audita.txt
$$ ##AUDIT TRAIL=  $$ (NUMBER, WHEN, WHO, WHERE, WHAT)
(   1,<2024-09-10 13:57:09.60 +0400>,<she>,<DPX200>,
      <created by zg, POWCHK disabled, PULCHK disabled
       configuration hash MD5:
       00 E9 B6 7A A2 85 ED C7 34 08 36 98 17 FE 4E 26
       data hash MD5: 16K
       FA 3D C7 C9 BF 5C A2 9B BE 2A C2 C4 8F C2 6D D3>)
$$ ##END=
$$ 
$$ hash MD5
$$ 58 65 95 16 2D 98 86 D2 03 3D 40 0A 1C 7A 41 2F
##$RELAX= 
##$RELAX= 
##$RELAX= 
##$RELAX= 
##$RELAX= 
##$RELAX= 
$$ Bruker specific parameters
$$ --------------------------
##$DU= <F:/spectra>
##$EXPNO= 1
##$NAME= <H-F>
##$PROCNO= 1
##$TYPE= <nmr>
##$USER= <she>
##$AMP= (0..31)
100 100 100 100 100 100 100 100 100 100 100 100 100 100 100 100 100 100 
100 100 100 100 100 100 100 100 100 100 100 100 100 100 
##$AQSEQ= 0
##$AQ_mod= 1
##$AUNM= <au_zg>
##$AUTOPOS= <>
##$BF1= 200.13
##$BF2= 200.13
##$BF3= 200.13
##$BF4= 200.13
##$BF5= 200.13
##$BF6= 200.13
##$BF7= 200.13
##$BF8= 200.13
##$BYTORDA= 1
##$CFDGTYP= 0
##$CFRGTYP= 5
##$CHEMSTR= <none>
##$CNST= (0..31)
1 1 145 1 1 1 1 1 1 1 1 1 1 1 1 1 1 1 1 1 1 1 1 1 1 1 1 1 1 1 1 1 
##$CPDPRG= <>
##$CPDPRG1= <>
##$CPDPRG2= <>
##$CPDPRG3= <>
##$CPDPRG4= <mlev>
##$CPDPRG5= <mlev>
##$CPDPRG6= <mlev>
##$CPDPRG7= <mlev>
##$CPDPRG8= <mlev>
##$CPDPRGB= <>
##$CPDPRGT= <>
##$D= (0..31)
0 1.2 0 0 0 0 0 0 0 0.06 0 0.03 0 0 0 0 0.0002 0 0 0 0 0 0 0 0 0 0 0 0 
0 0 0 
##$DATE= 1725962229
##$DBL= (0..7)
120 120 120 120 120 120 120 120 
##$DBP= (0..7)
150 150 150 150 150 150 150 150 
##$DBP07= 0
##$DBPNAM0= <>
##$DBPNAM1= <>
##$DBPNAM2= <>
##$DBPNAM3= <>
##$DBPNAM4= <>
##$DBPNAM5= <>
##$DBPNAM6= <>
##$DBPNAM7= <>
##$DBPOAL= (0..7)
0.5 0.5 0.5 0.5 0.5 0.5 0.5 0.5 
##$DBPOFFS= (0..7)
0 0 0 0 0 0 0 0 
##$DE= 6
##$DECBNUC= <off>
##$DECIM= 24
##$DECNUC= <off>
##$DECSTAT= 4
##$DIGMOD= 1
##$DIGTYP= 9
##$DL= (0..7)
0 120 120 120 120 120 120 120 
##$DP= (0..7)
150 150 150 150 150 150 150 150 
##$DP07= 0
##$DPNAME0= <>
##$DPNAME1= <>
##$DPNAME2= <>
##$DPNAME3= <>
##$DPNAME4= <>
##$DPNAME5= <>
##$DPNAME6= <>
##$DPNAME7= <>
##$DPOAL= (0..7)
0.5 0.5 0.5 0.5 0.5 0.5 0.5 0.5 
##$DPOFFS= (0..7)
0 0 0 0 0 0 0 0 
##$DQDMODE= 0
##$DR= 18
##$DS= 0
##$DSLIST= <SSSSSSSSSSSSSSS>
$$ [...]
##$SUBNAM2= <"">
##$SUBNAM3= <"">
##$SUBNAM4= <"">
##$SUBNAM5= <"">
##$SUBNAM6= <"">
##$SUBNAM7= <"">
##$SUBNAM8= <"">
##$SUBNAM9= <"">
##$SW= 24.0689170037331
##$SWIBOX= (0..15)
0 0 2 0 0 0 0 0 0 0 0 0 0 0 0 0 
##$SW_h= 4816.95568400771
##$TD= 16384
##$TD0= 1
##$TE= 0
##$TE2= 300
##$TE3= 300
##$TEG= 300
##$TL= (0..7)
0 120 120 120 120 120 120 120 
##$TP= (0..7)
150 150 150 150 150 150 150 150 
##$TP07= 0
##$TPNAME0= <>
##$TPNAME1= <>
##$TPNAME2= <>
##$TPNAME3= <>
##$TPNAME4= <>
##$TPNAME5= <>
##$TPNAME6= <>
##$TPNAME7= <>
##$TPOAL= (0..7)
0.5 0.5 0.5 0.5 0.5 0.5 0.5 0.5 
##$TPOFFS= (0..7)
0 0 0 0 0 0 0 0 
##$TUNHIN= 0
##$TUNHOUT= 0
##$TUNXOUT= 0
##$USERA1= <user>
##$USERA2= <user>
##$USERA3= <user>
##$USERA4= <user>
##$USERA5= <user>
##$V9= 5
##$VALIST= <valist>
##$VCLIST= <CCCCCCCCCCCCCCC>
##$VD= 0
##$VDLIST= <DDDDDDDDDDDDDDD>
##$VPLIST= <PPPPPPPPPPPPPPP>
##$VTLIST= <TTTTTTTTTTTTTTT>
##$WBST= 1024
##$WBSW= 4
##$XGAIN= (0..3)
0 0 0 0 
##$XL= 0
##$YL= 0
##$YMAX_a= 418676
##$YMIN_a= -367575
##$ZGOPTNS= <>
##$ZL1= 120
##$ZL2= 120
##$ZL3= 120
##$ZL4= 120
##$ABSF1= 10
##$ABSF2= 0
##$ABSG= 5
##$ABSL= 3
##$ALPHA= 0
##$AQORDER= 0
##$ASSFAC= 0
##$ASSFACI= 0
##$ASSFACX= 0
##$ASSWID= 0
##$AUNMP= <proc_1d>
##$AZFE= 0.1
##$AZFW= 0.1
##$BCFW= 1
##$BC_mod= 2
##$BYTORDP= 1
##$COROFFS= 0
##$CY= 11.3945322036743
##$DATMOD= 1
##$DC= 2
##$DFILT= <>
##$DTYPP= 0
##$F1P= 15.6554695791079
##$F2P= 12.8336369535428
##$FCOR= 0.5
##$FTSIZE= 0
##$FT_mod= 4
##$GAMMA= 1
##$GB= 0.15
##$INTBC= 1
##$INTSCL= 1
##$ISEN= 128
##$LB= 0.24
##$LEV0= 0
##$LPBIN= 0
##$MAXI= 10000
##$MC2= 0
##$MEAN= 0
##$ME_mod= 0
##$MI= 1.114404
##$NCOEF= 0
##$NC_proc= 0
##$NLEV= 6
##$NOISF1= 3.799351
##$NOISF2= 2.8
##$NSP= 1
##$NTH_PI= 0
##$NZP= 0
##$OFFSET= 15.70392
##$PC= 1
##$PHC0= -25996.3
##$PHC1= 15.38748
##$PH_mod= 1
##$PKNL= yes
##$PPARMOD= 0
##$PSCAL= 0
##$PSIGN= 0
##$REVERSE= no
##$SF= 200.130013532006
##$SI= 16384
##$SIGF1= 3
##$SIGF2= 2
##$SINO= 400
##$SIOLD= 16384
##$SREGLST= <1H.CDCl3>
##$SSB= 0
##$STSI= 0
##$STSR= 0
##$SW_p= 3612.71676300578
##$SYMM= 0
##$S_DEV= 0
##$TDeff= 0
##$TDoff= 0
##$TI= <>
##$TILT= no
##$TM1= 0
##$TM2= 0
##$TOPLEV= 0
##$USERP1= <user>
##$USERP2= <user>
##$USERP3= <user>
##$USERP4= <user>
##$USERP5= <user>
##$WDW= 1
##$XDIM= 8192
##$YMAX_p= 0
##$YMIN_p= 0
$$ End of Bruker specific parameters
$$ ---------------------------------
##NTUPLES= NMR FID
##VAR_NAME=  TIME,          FID/REAL,        FID/IMAG
##SYMBOL=    X,             R,               I
##VAR_TYPE=  INDEPENDENT,   DEPENDENT,       DEPENDENT
##VAR_FORM=  AFFN,          ASDF,            ASDF
##VAR_DIM=   8192,          8192,            8192
##UNITS=     SECONDS,       ARBITRARY UNITS, ARBITRARY UNITS
##FACTOR=    0.0002076,     1,               1
##FIRST=     0,             0,               0
##LAST=      1.7004516,     0,               0
##MIN=       0,             -367575,         0
##MAX=       1.7004516,     418676,          0
$$ Real data points
##PAGE= N=1
##DATA TABLE= (X++(R..R)), XYDATA
0@%%%%%Qj6J6j6J6k4L3m1M9n8P4r2J14j36J60j90K22k62L07l53M08m67N33o09
29c24O88p78Q82r92J111j245J392j552J728j920K129k361K618k899L207l548L929
46B065m354M832n375N992o701P530q512R695j1157J3012j5444J8780k3622L1156
60A7897n5916M56695k83647k78482M61596m03810k18123M96117k30923l27883
70c66479N51272Q8636l03052R8548j08527k15502K69227J14118j61046r399O5092
81B2888P2970j4328j69889J8509N3479l1203J69018m9642l00052K20633K18416
92B10799k55062M6999P5064k82131J88187K35949l55730J4219K95198j73540P970
103G922J08868l16974N3219L31308j55749o0985J09825j71651R1773J63161k79953
$$ y = [0, 0, 0, 0, 0, 0, 8, -8, 8, -8, 8, -16, 17, -24, 25, -33, 41, -51, 63, -73, 87, -103, 119, -143, 164, -189, 219, -248, 285, -324, 364, -414, 468, -524, 587, -658, 734, -818, 910, -1010, 1119, -1242, 1376, -1523, 1684, -1864, 2065, -2289, 2543, -2832, 3160, -3541, 3989, -4523, 5172, -5985, 7027, -8417, 10363, -13259, 17897, -38019, 418676, 135029, -143453, 318143, -85667, -303790, 192327, -38596, -366479, 184793, 273429, -29623, 68925, -39602, -255104, 14123, 128241, -32805, -42204, 22888, 95858, 81530, -88359, -69850, -16371, -47574, 121444, 71802, -228250, -7617, 210799, -44263, 2736, 77800, -204331, -16144, 219805, -135925, -121706, 173492, -48, 7922, 116790, -200184, -146965, 184343, 28594, -32391, 77434, -94217, -2444, 160717, -119236]
114a19236j237K21566j24728O1731P9170l13118J07994L14367k31303n4565J56925
125I7566k34607N5743K74605k68146p9548L24128r1561j24975J08959j86368o0435
136a84639K96908Q757j36491M9054j8915k8728J1294q4131K184Q3843O7629R6755
148A63520j24443j94935J41756N1965j33733J44959J3884j81103K20563O6153
158A68586l51061Q7301J97460j85635J10058J39246l04573N0903K74810k06897
168a9802p9752J74317j27289j943J86099j60119r5546J87459l005n7275K6500
179B9644j00724p07J27203k2353k9894N241m1076O7802J1774j40130L5291R2052
191C4123k8185P3780j0864j75902O5745J09012j11780K1065O8821q3638P0323
$$ y = [-119236, -120473, 101093, -23635, 38096, 117266, -195852, -87858, 226509, -4794, -59359, 97566, -137041, -81298, 193307, -74839, -154387, 169741, 78180, -46795, 62164, -124204, -184639, 112269, 121026, -15465, 33589, 14674, -14054, -2760, -86891, -84707, -864, 66765, 163520, 39077, -155858, -14102, 37863, -95870, 49089, 62973, -118130, 102433, 168586, -182475, -95174, 102286, -83349, 26709, 165955, -138618, -87715, 187095, -19802, -99554, 74763, -52526, -54469, 131630, -28489, -124035, 63424, 60419, 3144, 29644, -71080, -71787, 55416, 33063, 3169, 8410, -32666, 35136, 46910, -93220, -57929, 34123, 5938, 79718, 68854, -107048, -41303, 67709, -44071, -23006, 45815, -37823, 32500]
202C2500O4873j71052j3420J15505l1144L3017L3257j16360K7574Q5920q0019
213a9349j2539L1814m1240P5857M0083j22540J2040O4281m5907M6643R673j18026
225g9210O0271R0680q9266L500M3132p2418M9688N8794j18738m646R6507k4430
237A3864Q815K2760q8392M769P0773m3096j9281L2770o954L7923J6264p7286j1178
250c8249L3720m287L1939m873n4489M5353L4802n7373J137N088l3312N7940K6958
263D4354p4846J6334M6597l1814J4199K403o7900K5066N3858l6695J252K7691
275B0499k1754K0551J1827o4355q880L8298K321K2541R785l6274R282J4072m0650
288b2737r902J1679M368M6804K0626m3596r213L033k5259P703N167j5556L8392
$$ y = [32500, 97373, -73679, -87099, 28406, -2738, 30279, 63536, -52824, -25250, 60670, -19349, -31888, -74, -41314, 34543, 74626, -47914, -35874, 28407, -17500, 29143, 38816, -79210, -18939, 71741, -17525, -14025, 29107, -43311, 6377, 65171, -53567, -58213, 38294, 13864, 22679, 45439, -42953, -38184, 32589, -10507, -29788, 2982, -3972, 33951, 50215, -27071, -38249, -4529, -8816, 23123, 18250, -36239, 9114, 43916, -13457, -12320, -7232, -40544, 17396, 44354, -30492, -14158, 32439, 625, 14824, 17227, -50673, -25607, 28251, -8444, -7192, 20499, -1255, 19296, 31123, -33232, -42112, -3814, -1493, 21048, 30833, -5441, 3841, 17913, -22737, -32639, -20960, -16592, 30212, 50838, 7242, -1971, 1062, -24197, -16494, -11327, -26883, 11509]
301A1509L4687k7786j6509r463k2785J9382J7783j9865J3074K6493r975n613j1689
314g57k8821J1342K3013q831J597J0081j379J1586R16k6885p238P027l803N990
328f162N906j454J7633J1875j7818j7599j2061p753J6236J7929L623J0850N357
341B6562j6372j8439j7905j2355J8551K9877J3366N375m727j9333j4182j0495
353b0077r627J0515K3824J5368M553p563j7037j0298k763l188L116J1239J2279
366A0341R188j48j1009j2530q251n241l63O522J3343J5437Q356n484j5609j7568
380a3016j0044J272J0795J6571J4254M058q500j7683j6940n404Q393J6278J6567
393A6601N939o667j3035j3566p423M525J0467Q956O127l414j0024n782N25N417
$$ y = [11509, 46196, 18410, 1901, -7562, -30347, -10965, 6818, -13047, 27, 26520, 16545, 10932, -757, -29578, -18236, 4777, -4054, -2457, 7624, 6245, 17831, 18747, -8138, -15376, -8349, -12152, -6162, -256, -1710, 15923, 27798, 9980, -7619, -19680, -27433, -11197, 6732, 10355, 21205, 26562, 10190, -8249, -26154, -38509, -19958, 9919, 23285, 28660, 23933, 4600, -9582, -20077, -29704, -19189, 4635, 20003, 24556, 16993, -44, -10342, -13105, -16293, -13177, -1938, 10341, 19529, 19381, 8372, -4158, -12409, -17650, -18013, -11491, 1852, 17289, 25645, 20161, 4552, -13016, -23060, -21788, -10993, 5578, 19832, 23890, 15390, -2293, -19233, -24637, -16244, 34, 16601, 22540, 15873, 2838, -10728, -18151, -13626, -3159, 5797, 11924, 8510, -1514, -7296, -6771, -1354]
407a354R361L487p393q412o712k949P743J3216P087J610p757j7647j0055K568
421a7207J0083J7990J3468m336j2323j4724j7079j150J5174J4356J4428O550j3622
434A1608j5862p468p058O770J6724M487J332L28j3528p220N247j922M736R948
448H122o165l918O155m339J319Q421r867p982L579p319L006J8282J675Q82L472
463A5323k0910j4990Q310J914J1893K2280p280j2133k413k2266p874K1627R554
476C035J3244J6983k1761k3215P17j1445M370K8208J632O03J0016k6309j9405
489b3327J3221j681J0417K6786j4343j3592J1284j7982q658K1369q197R0K3519
502A8906j8107j3704K0662p692k163K0161k2784j5406K3241p985p28K6696j4935
$$ y = [-1354, 8007, 11494, 4101, -4311, -11023, -13972, -6229, 6987, 14074, 15684, 7927, -9720, -19775, -17207, -7124, 10866, 24334, 19998, 7675, -7049, -24128, -25278, -10104, 4252, 18680, 25230, 11608, -4254, -11722, -18780, -12010, 4714, 9201, 10533, 10861, -2667, -9887, -4640, -6562, -1826, 8122, 1957, -1961, 4194, -145, 1174, 9595, -272, -8254, -4675, -11994, -8988, 9294, 10969, 11851, 15323, -5587, -20577, -12267, -10353, 1540, 23820, 16540, 4407, 1994, -20272, -28146, -6519, 3035, 16279, 33262, 11501, -11714, -10997, -22442, -18072, 10136, 11768, 12371, 22387, -3922, -23327, -10106, -11787, -1370, 25416, 11073, -2519, 8765, -9217, -17875, 3494, -4703, -4613, 18906, 799, -12905, 7757, 65, -2098, 18063, -4721, -20127, 3114, -4871, -5599, 21097, 6162]
515F162r448J6295k8410j5497L1002J761J0830K8031l3779k7454J5552j9765n73
528b5293L9664m946L360K6599l9996l3147K1190o637J3636M2308k3350j8645K1371
541A6114k8874j5252K8372j1218J2172L9559l5560k5142K2051j9444R372M0049
553C2199l5467j0714L7129l4786j4518L8112k3706P580N4523m4059l7130L5251
565D414k1572m711N3507k6309k1047M7227k3870l5792K5148j4554J332N0674j7812
578A6635k6949K0631j4328k284J8170l5562J500M1207j7273M655J8025m3257J5996
591b834L6727o2018o739M8807k7790K6498N0103p6432j8821N6542n2947j2667
603d1571O5198k9785J1382P2105o7401n9131M1876k3778K214O8046k9227j5728
$$ y = [6162, -3286, 13009, -15401, -30898, 104, 1865, 12695, 40726, 6947, -20507, -4955, -24720, -25293, 14371, 9425, 12785, 39384, -612, -33759, -12569, -19206, -5570, 36738, 13388, -5257, 16114, -12760, -28012, 360, -10858, 1314, 40873, 5313, -19829, 2222, -17222, -7850, 32199, -3268, -13982, 23147, -11639, -26157, 11955, -11751, -4171, 50352, 6293, -30837, 4414, -17158, -21869, 31638, 5329, -15718, 31509, 7639, -28153, -3005, -17559, -16227, 34447, 16635, -10314, 10317, -4011, -6295, 11875, -23687, -22187, 19020, 1747, 6402, 24427, -18830, -2834, 33893, -28125, -34864, 13943, -13847, 12651, 62754, -13678, -32499, 24043, -28904, -41571, 23627, -6158, 5224, 77329, 9928, -49203, -7327, -31105, -28891, 39155, 9928, -5800]
615e800N3461l9266m2680K1785k4800K2413P0028l6667k8418K8439l5793j721
627a9019L7233m7973M736P0059l0816k3253K4312m2761R473O0980m5005k6664
639b8698L9457j9034O782K9872m8801K870M9871l1126o977Q931m4018M2423N1392
652E2944o5451J172L3790n5274L2715M0969r2916K5388R0684o9318p883N4271
664D1091q4036J1503J00460q3286m2229R1984l2835k1877O9770n9684m4249Q5880
676C2492j2370n2924L3033k949j762M4257k5658m0185Q711M144K3866K082l8172
689b5435L3408K8279m0842J3670j2141o2594P0920N3345q3715J8665M3726p0179
701c2893L3141M3665j02388K3354R9611o0789j5257M4054p1152J2792Q1194o8169
$$ y = [-5800, 47661, 8395, -34285, -12500, -37300, -14887, 55141, 18474, -9944, 18495, -17298, -19019, 18214, -29759, -25023, 45036, 14220, -9033, 15279, -27482, -18009, 42971, -2034, -28698, 10759, -8275, -1493, 28379, -20422, -17552, 32319, 1193, -5784, 3147, -40871, 1552, 52944, -12507, -11335, 22455, -32819, -104, 40865, -52051, -26663, 64021, -5297, -13180, 41091, -42945, -31442, 69018, -14268, -56497, 35487, 2652, -19225, 50545, -9139, -53388, 32492, 20122, -32802, 231, -2718, -4480, 39777, 14119, -26066, -17355, -13211, 10655, 12737, -25435, 7973, 36252, -4590, 9080, -3061, -65655, 5265, 58610, -25105, -6440, 37286, -32893, 248, 43913, -58475, -35121, 64490, 3701, -11556, 32498, -38654, -25862, 55332, -12837]
713a2837k9833O5544k2104J745L4588o7039l508O9938l0554j5256J8760m3576
725c4132L1874N5904o7807j5859M7274l0758J7210L3015p3266P315P7164l8450
737I484k3413K3933m1109J7641N7122m8050k3655L7729o891J0881L715n1617J6854
750a7376M1163k0347R692j2033m3272N7877K4171p3963K2672K9061m4274N4477
762B7848J7039j03413L7809P3008p0325P022M0571p2493L3347P7354q5879k7415
774d5527P0619k7273k506M1005n9088j3003O9925j5838l2531R333j4481J9920
786E55K9739l5387j2496J6787R68K7028j3523n6017L1376L4625l0126J7269k516
799H282m5561N1681K9697p6072O007M0116k6941L2651J9571p4189J2273N4252
$$ y = [-12837, -42670, 22874, 770, 2515, 37103, -29936, -33444, 36494, 5940, -9316, 9444, -34132, -2258, 53646, -14161, -30020, 17254, -13504, 3706, 36721, -36545, -29230, 47934, 9484, -13929, 10004, -31105, -13464, 43658, -4392, -28047, 9682, 2791, 13672, 17387, -34230, -17376, 23787, 3440, 13132, 1099, -42173, 15704, 39875, -34088, -11416, 17645, -26629, 27848, 44887, -58526, -20717, 52291, -18034, -11012, 29559, -42934, -9587, 67767, -18112, -45527, 25092, -2181, -4687, 36318, -22770, -35773, 34152, 18314, -14217, -4884, -19365, 555, 30294, -5093, -17589, -802, 166, 27194, 13671, -42346, -10970, 23655, -6471, 10798, 8282, -37279, 14402, 44099, -31973, -25966, 14150, -12791, 19860, 39431, -34758, -22485, 31767]
811C1767l9136p391J9725k8071L2803L7741n5788j7007K5243j0517K2353P333
823A9055m7893K1875L7772l0328j985k323l1717M4303L0683n5562J660K7474k0595
836g581K2501O141n9101J8725M7804k7817m374R410k6438K8879K7330m9007j1696
849b5224K6026k879J8354J510m2418J4728L0756k0638l898k309j6418L6558J7736
862C1884m4332j812J7090q047K1294k614m3780J8885L1526k1133R69K960j7712
875a4822K8880J3799m4871o541J9046j13K3810K082l6770J1222J8744k4616k421
888a2571L089n812L8313J7253m2379j2509N399r702J9589P169k2700K2364K4603
901C2106k4626j4718r431j2127L1541K2371k4010k071R217r160N359q569k4558
$$ y = [31767, -7369, -14760, 4965, -23106, 9697, 47438, -8350, -25357, -114, -10631, 11722, 19055, -28838, -6963, 30809, 481, -1504, -3827, -35544, 8759, 39442, -16120, -14460, 13014, -7581, 14920, 21061, -38040, -19315, 28489, 672, -3702, 5708, -20730, 8149, 35479, -13528, -25224, 802, -2077, 16277, 17787, -24631, -9903, 20853, 215, -3683, -5992, -22410, 14148, 31884, -12448, -14260, 2830, -5217, 16077, 13463, -30317, -11432, 20094, -1039, -70, 2890, -14822, 14058, 27857, -17014, -23555, -4509, -4622, 19188, 21270, -15500, -4278, 14466, -10150, -12571, -9482, -15294, 23019, 40272, -2107, -14616, -9217, -18919, 670, 7839, -14861, 7503, 32106, 7480, -7238, -16669, -28796, 2745, 25116, 1106, -965, 8252, -908, 4451, -4118, -28676]
914b8676K0887K7367r133l605p101j3759J9358Q064k7175r8J5399J540J0652m623
928I097k4283Q703J6961j0095n068j015j026J9345N683k2384p413L994L872J2504
942H875n578j3705J3460Q715j0789k772p640l088K4580O047k3817k483M813l698
956g080J2101J950j5680J1143J4439j5354j1621q52j93J7108J3736j3534j1706
969e543J599l7n98j777q5J2860J0447l841j2908j5524q58J6303N220m463M734
984E529j7l430J999j0743j0792J5063J3737m170k298m796p853P269M910j0504
998f096j589R658L272L7k744o692J088O908K3p681l923N119Q002Q55m047m159
1014a969l127K970L806m852j104R961L697m966n050q183k453J0961O346m118Q14
$$ y = [-28676, -7789, 19578, 10445, 6840, -261, -14020, 5338, 13402, -13773, -13871, 1528, 3068, 13720, 9097, -15186, -6483, 10478, 383, -4685, -5700, -6726, 12619, 18302, -4082, -11495, -7501, -3629, 8875, 3297, -10408, 3052, 11767, 978, -1794, -9434, -12522, 12058, 18105, -5712, -8195, -3382, -7080, 5021, 6971, -8709, 2434, 16873, 1519, -10102, -10954, -11147, 5961, 19697, 6163, -5543, -3944, -3981, -4579, -6356, -6441, 6419, 16866, 13025, 117, -15407, -16265, 38, 5258, 795, 5529, 5512, 2082, 4081, -6662, -17454, -2391, 11346, 7176, 4878, 82, -7771, -502, 4408, -6096, -7685, 1973, 5245, 5282, 2538, -4154, -3066, 3842, 3865, -3816, -7739, -2620, 5382, 6237, 2190, -1969, -5096, -2126, 1680, -3172, -4276, 5685, 9382, 4416, -634, -8817, -11270, -309, 6037, 1919, 2733]
1029B733J901l492k883l079l123O271R917Q26p089n676j268J177K073J464P03
1044D55K391L454j963p935k230L762K269K239J72m573l18M926j713l172J341P34
1060a61J19K677k002k726L358J973k538k634k494m2M373L281O01r68j672r48j806
1077a609l509J413N086K272J644j983p397j552L753m94K856M850j432j542l19
1092B037o798k239O170J959J726K274m722m073K161j528J237N499K99o94j62o533
1108c387l024L595P76L741M928l947k666L85n753K14O198m07K450M922o876m642
1124c493J784m767J085Q557j293K30N369n950m715K795m891k48Q555j277p00N111
1140F152n561l931L348n319MQ785j097O98M840p851m208L202o082P75J0017k376
$$ y = [2733, 4634, 1142, -1741, -4820, -7943, -1672, 8245, 9071, 1982, -3694, -4962, -3785, -1712, -248, 455, 2846, 6300, 4337, -3598, -5828, -2066, 203, 2442, 2614, -1959, -2277, 2649, 936, -2236, -895, -161, -42, 2635, 633, -2093, 1265, 3238, 700, -1934, -4428, -4470, -97, 3184, 3785, 2817, 1145, 197, -1609, -5118, -3705, 1381, 3653, 5297, 3314, -4083, -5635, -1882, -2376, 480, 5330, 3898, 2356, 2037, -4761, -7000, -830, 1129, 2855, 5129, 407, -3666, -1505, -3033, -1796, 3703, 4002, 3308, 3146, -3387, -6411, -2816, -2040, 1701, 6629, 2682, 16, 401, -5352, -5138, 1060, 653, 3103, 8025, 1149, -3493, -1709, -6476, -5391, 3166, 1873, 2103, 7472, 1522, -3193, -398, -5289, -5537, 3018, 1741, 1041, 6152, 591, -3340, 8, -5311, -5307, 3478, 2381, 3079, 7919, 68, -4140, -938, -7020, -6245, 3772, 1396]
1156A396J835N800r845m136N040o363J700J1216m907q11O838j0756m292Q306n926
1171d905J562J2166o772l377P851r131l714R921o443r84J1108p768l942Q858o834
1186b404j444J0708p730k648R480q182k866R714p457R1J0794r689l394R423q540
1201d144J51J1481r040M6J0900j1891k950R312j0651K024J4242j1219q94J2329
1215I696j3041j950J1982j3049M98J6914j2105k935J2833j3894k149J5328j3028
1228d900k126J7425j0303l319J2705j3976l477J6167j0728m118J3795r545j316
1241c716J3000j2645l191J3713r147n22J0417j3587J497J3663j3181m37J0558
1254F422j3491M860J3331j8563J994J6524j5410K466J3484k1638L069K0610j9613
$$ y = [1396, 3231, 9031, -814, -4950, 90, -6273, -4573, 6643, 1736, 925, 7763, -2993, -7285, 1021, -4905, -3343, 8823, 2051, -1326, 6525, -2606, -6320, 3601, -2842, -3826, 7282, -486, -4428, 4430, -2404, -3848, 6860, -870, -3518, 5962, -2220, -5086, 4628, -2829, -2738, 8056, -1633, -5027, 4396, -4144, -3993, 7488, -1552, -1506, 9394, -2497, -5447, 3865, -6786, -4762, 9480, -1739, -2633, 9696, -3345, -5295, 6687, -6362, -5864, 11050, -1055, -3990, 8843, -5051, -7200, 8128, -4900, -7026, 10399, 96, -3223, 9482, -4494, -7971, 8196, -2532, -6650, 7145, -2400, -3716, 9284, -3361, -6552, 7161, -1986, -2508, 7909, -5678, -4181, 9482, -3699, -4136, 6422, -7069, -2209, 11122, -7441, -5447, 11077, -4333, -1867, 11617, -10021, -6952, 13658, -5955]
1267e955k121J9138j6710J040K0504k2009n160K3056j3679m562J7348j5985k865
1280g960K1238j4563q384J4989r256P19J4792j4821k602J4419j0598j29P557j5948
1294a0547P107J6171j6808J388J0098j6968R204J3301k4222N413J9927j8297L474
1307g59J2039k5768O909K3405k1992o03J8586j8272N065J7541k6595r98K3944
1320A2502j5130L89J3571k2479M375K2846k1339l724J7215j4571O472J6753k5836
1333h956j700K2703j4801j518J2856j9574N372K2922j8932o621J3939j1589N033
1346h66J3132k0368O23J7952j0702P69L030j8403J2388J6071j8289M209P476j6632
1360i610J5097P058l1245J1695K0944j9921J0431Q707l2780J4257K5549l0960
$$ y = [-5955, -8076, 11062, -5648, -4608, 15896, -6113, -11273, 11783, -1896, -6458, 10890, -5095, -7960, 13278, -1285, -9669, 5320, -3936, -3217, 11575, -3246, -5848, 8571, -2027, -2156, 5401, -10547, -3440, 12731, -4077, -2689, 7409, -9559, -355, 12946, -11276, -5863, 14064, -4233, -759, 11280, -14488, -7579, 15826, -6166, -6769, 11817, -6455, -1390, 16151, -10444, -11442, 12502, -2628, -2239, 11332, -11147, -6772, 16074, -5265, -8989, 8226, -6345, 127, 16880, -8956, -10656, 12047, -2754, -4272, 8584, -10990, -5618, 17304, -1628, -8249, 5690, -5899, -866, 12266, -8102, -7479, 10473, -229, 540, 3570, -14833, -2445, 13626, -4663, -454, 7022, -9610, 5487, 12545, -18700, -7005, 13939, -5982, 4449, 13156, -19624, -5367, 20182, -10778]
1372a0778J553K2839k0293Q324J9169l4730l569K9737j3474k381J4673j8956L194
1385d692K1551j9787r199J3263m695R788P703k2508J003J3484j0285N014K085
1398B725j6683J8651J5016k4999P5O934j5121J7550J1413k8685Q148K0192j8134
1411b918J270N249k2030J5821K3409k1557l044R169j3799R921P549k5196Q712
1424g444K0969j0805L561j725k4155J6671J7937k2293M276J1920j5042J3761N966
1437A3597l4488O984K5543j2160M955P076k3629R532J8641k3754n522J5663l834
1450a396J0597O169k6116j192J5852n449K918J057j1074J5716R654k1662l684
1463h610K918m178J9577L999k4647R052J2301j4517L997q36j6212K1679J7036
$$ y = [-10778, -9225, 13614, -6679, 1645, 20814, -13916, -17485, 12252, -1222, -3603, 11070, -7886, -4692, 16859, -2928, -12127, 1136, -3559, 6229, 13932, -8576, -7573, 5911, -4374, 640, 2725, -13958, 4693, 19709, -5290, -5215, 1719, -13402, 4148, 15561, -13124, -4976, 15216, -2918, -1648, 3601, -18429, -2608, 20801, -756, -3800, 5369, -8430, 1491, 9040, -16156, -7444, 13525, 2720, 6281, 4556, -19599, -2928, 15009, -7284, -3008, 8912, -6130, 7631, 13597, -20891, -13907, 11636, -524, 4431, 11507, -12122, -2590, 16051, -7703, -13225, 2438, -1396, 9201, 15370, -10746, -11938, 3914, -1535, 1383, 2440, -8634, 7082, 16736, -4926, -8610, -5692, -9870, 9707, 13706, -10941, -1889, 10412, -4105, -108, -944, -17156, 4523, 21559]
1476B1559k2572l617M415j0688J3408N849k1326R234J7843r450q68n627j6837
1489a8677J7641J5189j6480J171M784r003J2403k75k5621J0158K0460q123L252
1502F879j915j9851J2926J5012j9612k566J2117l252Q959J890k2706P50J6678
1515E309j642p26k486q228J1772P159j4773m306K289K448J4636l138j8440P344
1529b782Q404n948L691o063j0451J8995Q913j8417j187K553m520J3563J499j8992
1543a0742P050J3235o543j135m849j0492J4767J1074j3402k818L103k321J0281
1556G208k325j7273P590J3313m019k54n375j1226J2738J0450j3911l173O978m14
1570C07O699r50j5769J688J3566J10l895m649l596Q517N121p892m660K73O176
$$ y = [21559, -1013, -4630, -215, -10903, 2505, 8354, -12972, -3738, 14105, 4655, 3787, -1840, -18677, -1036, 14153, -2327, -1156, 3628, -5375, 7028, 6753, -18868, -8710, 11750, 3627, 6879, 4964, -14887, -1961, 13051, -6561, -9127, 2990, -262, 8697, 10587, -12119, -11369, 5309, 3667, 2941, 455, -7773, 3999, 11158, -3615, -7921, -5632, -3184, 11452, 8314, -10126, -2782, 5622, -326, 3365, -2698, -13149, 5846, 14759, -3658, -4845, -2292, -6812, 6751, 8250, -10742, -3692, 9543, 3000, 1865, -2984, -13476, 1291, 12365, -1037, -3855, -752, -3073, 7208, 4883, -12390, -4800, 8513, 4494, 4240, -1135, -12361, 377, 10827, -3084, -6257, 721, 307, 7006, 6056, -9713, -8025, 5541, 5651, 1756, -2893, -6489, 2028, 7149, -743, -5403, -5130, 1046]
1585A046R206p546j1038O423M919j188K866r413o046J6520L961j3863J342K017
1599g94k789J0807j350j6243N748J2654m984k225k408o973Q021R283q260n743
1613e256M291L685K913m148q630J581P724L603j815q125k150R653J207p381l3
1628b881P30K871Q758n678j2804M465P698k526J11k049l918Q342N298r593n353
1643f529L609M092L525j828o411K35N272K002l820o397J645Q558J161m093k206
1658a185k331L323O204n953p323N913M600j391R26m669m370Q257M208p783k046
1673c620L446J295K532j098p101n0O585J674l812l397J301M674J497k299l800
1688b173j715N165L388o236l417M277K282J224M31o084j881P459N47n639P99J833
$$ y = [1046, 10252, 2706, -8332, -1909, 3010, 1822, 4688, -4725, -10771, 5749, 9710, -4153, -2811, -794, -3583, 7224, 5874, -10369, -4621, 8033, 3049, 824, -1584, -8557, -536, 8747, 487, -5256, -965, 2720, 5633, 1485, -7145, -5564, 2160, 5763, 3948, -4177, -6327, 3326, 4533, -2848, -2881, -2151, 720, 9478, 3800, -9004, -4539, 3159, 633, 744, -1305, -5223, 3119, 8417, -1176, -6529, -2920, 1172, 4697, 2869, -3542, -3307, 1965, 3967, 147, -6250, -4605, 3953, 5114, 1021, -1185, -3516, -193, 6011, 58, -7265, -1352, 3248, 1857, 2783, -1886, -6256, 2001, 6209, -1574, -3620, -174, 1121, 3653, 2555, -4546, -4596, 1989, 3663, -149, -3546, -2245, 2429, 3926, 1627, -2173, -3888, 1277, 4665, -1571, -4988, -711, 1571, 2795, 3226, -2858, -4739, 2720, 3267, -2372, -1573, 260]
1704B60O90L404k716p334J521N403L67j413m18J17K462P81l476m029M85N299K300
1721C703l095j218O38m73J318l35m817J781O965j056l252o5k679M20M930k921
1737a56l656M220K134j777L57k453j502M343J701l345j600Q5J372J771j439j313
1753a258J589Q31L04j552l955J913N000r23k93j04m021M80K757l978j00O066L13
1770C069n45P04n640k313M123r4o03L628m52q36J578m081k746K419J296J630K574
1787C711k787p80J766l041j672J527j417K490M420l003j313K356l677j06K344
1802H18l601J014N690k010j675J486m353o35L857j837L91M759k036j058J229n569
1818c530o17M837j482J315L583m511o70K900n012M61N769k627M47L473o136j910
$$ y = [260, 950, 4354, 1638, -5696, -4175, 1228, 1595, 182, -236, -119, 2343, 3124, -352, -4381, -3896, 1403, 3703, 608, -610, 28, -445, 873, 538, -4279, -2498, 4467, 3411, 159, 94, -2585, -2165, 2765, -156, -3812, 408, 2542, 765, 1122, -1331, -2833, 1510, 3211, -134, -1734, -1649, -277, 1494, 55, -1258, 331, 1162, 1466, -86, -4041, -2128, 2872, 1949, 1656, 1552, -2469, -1989, 768, -3210, -3310, 2756, 3069, 2524, 3228, -2412, -4725, -602, -696, -1299, 2329, 1877, 1041, 2619, -1462, -4208, -1789, -493, 1137, 3711, 924, 144, 1910, -1131, -2803, -1276, -2693, -203, 4217, 1214, -99, 2257, -1420, -1526, 818, -2783, -1769, 3921, 1911, 236, 1722, -2631, -3266, 591, -1246, -855, 3904, 1868, 810, 2039, -3530, -4147, 690, -792, 523, 4106, -405, -1075, 1825, -3187, -2726, 3043, 416, 863, 4336, -1800, -3710]
1834c710M670l225O71N922m096j340L811m990r76N375k192M61L904m985k127L194
1850C67k899R82M987l454K4L323n196l11M174l867J804M294o017l40M316n102
1866b915J453N716n874O66N002o256j73O108n187J54N997o785j292N821m871P37
1882a699P117n550j405M903o020j020O547l791Q17N492o752j935M219m794K102
1897a769O737m520M92L761q009n02M965m675L468O600o941l91L585q170J890P219
1913C740o052L106O656q814j123N111p812J860Q082o641O60P525p931k11N715
1928C871p560L41P392o327K79P430n919o4M758q564n04O900m542K712O970o495
1944F78j84K683r487L14O956l245N028O047r269n15K701r094K904Q248m641M619
$$ y = [-3710, 960, -2265, -1594, 4328, 232, -1108, 2703, -2287, -3263, 2112, -80, 381, 4285, -700, -2827, 367, -2532, -1550, 3437, -17, 7, 3330, -1866, -2177, 1997, -1870, -66, 4228, -1789, -2129, 2187, -2915, -1462, 4254, -1620, -954, 4048, -2208, -2381, 3727, -1460, -1306, 4691, -2094, -3386, 2435, -2436, -1699, 5418, -132, -1537, 3366, -2654, -3674, 2873, -918, -101, 5391, -1361, -3296, 923, -3871, -1769, 4968, 448, 940, 4701, -3308, -3810, 1155, -3520, -52, 6548, -393, -784, 2801, -5369, -3479, 3740, -2312, 794, 7450, -1364, -2487, 2624, -5188, -3328, 4754, -1887, -1227, 6298, -1633, -1844, 3871, -3689, -3348, 4044, -2283, -2004, 5426, -493, -557, 4201, -4363, -4867, 2033, -2509, 203, 7173, 678, 494, 3177, -6310, -5996, 960, -2285, 2743, 8790, -479, -994, 1707, -7387, -4483, 3765, -876, 3743]
1960C743N414j1987j288M117p675N677R223q050K563N565j1727l6O783p712N046
1975c44R169j0533r70O365q652J987Q666p877J261P826q810j918N692n812L201
1990g49P692p894j268M556o119K016M715o103M060N703p614P87J654p768N496
2005h36N063q800M460N717q258M426K796j2210M865P960r223L773P324r747L815
2020A125N672j4152L11R253n463M863P785j0087J4N372j0528q05O790l371O832
2035C611O855j0740k427L009p039M277N666o224O330O509j0868j706J384p293
2049h656P835P877r028K272N412p971J873K565r391N751Q618p931J45K403o651
2064d877N927M601r955J810N848n429L915J317q901O386O154r288R83J679o780
$$ y = [3743, 9157, -2830, -4118, -1, -7676, -1999, 7224, -826, 1737, 7302, -4425, -4461, 2322, -5390, -344, 8825, -1708, -2678, 3687, -4965, -2978, 5688, -2189, -928, 6898, -1912, -3830, 1862, -3950, -749, 6943, -951, -2219, 2337, -3782, -1766, 2949, -3154, 906, 6609, -1005, -218, 1436, -6332, -836, 4227, -4573, -113, 5604, -2654, 1772, 4568, -7642, -2777, 5183, -4040, -267, 7057, -2690, 1125, 6797, -7355, -7044, 2209, -3254, 1609, 9394, -693, -679, 4693, -5835, -6640, 150, -3221, 3611, 10466, -274, -2701, 308, -6731, -2454, 3212, -3012, 3318, 9827, -1041, -2747, -1363, -8656, -821, 7056, -1972, 300, 5712, -2259, -386, 2179, -7212, -1461, 7157, -774, -629, 1774, -4877, 1050, 5651, -4304, -2494, 3354, -2075, 1840, 3157, -5744, 642, 6796, -2492, -1509, 170, -6610]
2079f610Q317N268j1001K798N999p162L185J954j0105N996Q498q288k35L119o374
2094d641N618N103j0380Q09O830m231K980J001q867N162O202p459o12J951m146
2109d680Q266L740j0791J281M878m889L098O96q212P105P486q125j526Q36m692
2124e529P104M068q930J759N468l646J622k134p274O464O528n575L86n37l877
2139d103P409J129r793L423M399l012M616k365r707P744O642q738J537J587n149
2154d381P978L411j2084J116P349l763J775K96p951N005Q055o147l368J544j223
2169b388M725K316p386n50M917M23J72l918m830O304M660l501n06j913j150P116
2185D491j475r027L186M138o64M355m220p840P195M549o815Q70Q40k371P870J047
$$ y = [-6610, 1707, 6975, -4026, -1228, 4771, -2391, 794, 2748, -7357, -1361, 7137, -1151, -1386, 1733, -4641, 977, 6080, -4300, -3491, 3339, -892, 2088, 3089, -5778, -616, 5586, -1873, -2485, -534, -4680, 3586, 7326, -3465, -2184, 2694, -2195, 903, 1599, -6613, 492, 7978, -147, -1673, -837, -5529, 1575, 5643, -3287, -1528, 3940, 294, 1916, -218, -7492, -1028, 5500, -75, 311, -226, -4103, 3306, 4435, -5358, -1935, 2464, -548, 4068, 1703, -8004, -260, 6382, -2356, -819, 768, -4381, 3597, 7008, -5076, -3960, 3389, -374, 1401, 1697, -6254, -1249, 6806, 659, -2709, -1165, -2388, 2337, 4653, -2733, -3283, 1634, 2057, 2229, -1689, -6519, -215, 4445, 944, 438, -1475, -2625, 4491, 3016, -6011, -2825, 1313, 649, 5004, 784, -7056, 139, 4688, -2127, -1257, -417, -2788, 5082, 6129]
2201F129j1219R01N565j640K228j216o384N648O283n686k467L03q62N223P32p676
2217d138O84N578Q28N74m048n865M892M863l505o10N19P95N016j993r609n1M793
2234a277K534L062k439m349M300J911n855k409L68K864P903m87q043p27J562J5
2250a067J776k727k473P524L697n482k452k029n31O985l82p111J894M723p8J043
2266C310l587n260M843M696m187j995J043J365M286r31p424j050M206K340N72
2281B227k501k013M163K057l466l140j377L047N608j910n887R42K503J657J414
2296C324m277l308N289K005m210q22M38J975N469j986q602n60L302J960K381m02
2312A976j720L054O14o124m034j40N098O988L80m711k011r33n50K21j886J574
$$ y = [6129, -5090, -4189, 1376, -264, 1964, 748, -5636, 12, 6295, 609, -1858, -1555, -2417, 2806, 3538, -4138, -3454, 2124, 2952, 3526, -522, -6387, -1495, 3368, -137, -747, -228, 567, 5583, 3590, -6019, -6070, -1277, 1257, 4319, 1880, -2469, 1831, 3742, -2113, -4522, -4154, -1290, 6613, 6126, -1917, -2644, -1082, -1067, 709, -2018, -4491, 3033, 6730, 1248, -1204, -3233, -3764, 3221, 2839, -4272, -2378, 2345, 2267, 3310, -277, -5537, -694, 4002, -185, -2180, -1137, 228, 4514, 3583, -3841, -4891, -685, 1655, 2227, -274, -2287, 1876, 3933, 467, -2673, -4050, -1003, 4605, 2695, -3192, -2250, 253, 1910, 3324, -953, -4261, 1028, 3033, -1177, -1999, -1561, 414, 5883, 3897, -4705, -5265, -1963, -3, 2378, 1976, 256, 3310, 3924, -2200, -6234, -6374, -1276, 5712, 6092, 1381, -630, -1563, -2113, -1892, -3778, -2204]
2328b204O998K386m305m279m016P76N798K87k833K489J932m67j076m324k352N012
2344a78L409k234j839o19J582L091j588m498l90K736K203K30k456m29L306K58
2360B584l277k870q75L552N416j312l726K07n0j43P60k507J44N195J033l690k592
2377b151j613J824M743j43l015J84O19k57n39j817M64M000J296k780l022k066
2393d273K234M327M3j368K70q27l93q31k983R25N719J154j907k580l176P03M074
2410A111m23j141K114N42j212r48l218l96M392K092j483j477j579O38K360p93
2426E79j346R88L20L46l74l191Q84L425M08j132j310k409J385L306r37r23J543
2443A562j220n43m59k493O30M899J017j330j450l022l75K740q4J26K334j33p43
$$ y = [-2204, 4794, 7180, 2875, -1404, -5420, -4644, 1154, 1441, -1392, 1097, 3029, 2562, 1486, -2838, -5190, -178, 3231, 997, -842, -1461, 121, 3212, 1624, -2874, -3264, -528, 1675, 1905, -551, -980, 2326, 2584, -693, -3563, -4438, -886, 4530, 3218, -508, -301, -351, -494, 266, -2241, -2097, 3098, 4131, 441, -2151, -3764, -1940, 2803, 2660, -355, -171, 448, 191, -348, -2165, -1701, 2299, 3595, 815, -2207, -4273, -2039, 2288, 2331, 963, 1233, 406, 13, -818, -3801, -2876, 2843, 3997, 2090, -490, -3666, -2963, 1111, 688, -453, 1661, 2203, 991, 43, -3175, -3571, 821, 2913, 1430, -47, -1626, -988, 1372, 579, -767, 221, 541, 887, 513, -2678, -1794, 1631, 2039, 907, -403, -2812, -1427, 1879, 942, 19, 1562, 342, -201, -660, -3153, -2523, 2376, 3393, 2063, 613, -2409, -2784, -44, -128, -2, 2332, 2199, 1456]
2460A456j672l751l6M170J423J103Q4l140l65R67k374k64K955K41J024Q40l931
2477a270j113K791p04n17J680j713R52K539j895j653J485j470l94J128j726Q77
2493a003L467j19j052m39l670kK382l03J295K631j708o20p55l834N6L933N61J438
2511B258J357l494j080O87k645Q22L074n57R88R46l627m98K124r10J073J628k935
2528g89j00J595k418Q48K657j550N25Q04m040j22L042q62J890K263l254q75N99
2545B13l707P77L163l63J966K087l982j465Q81k396J068L015j086J338J658l060
2561A07j046O66k708J342K740j476J324K443l094j42O88l893N92K684j307K047
2577I67K399k716m6N48l942J40K785j134K360K547l497m92O20m014P77L030j341
$$ y = [1456, -216, -3967, -4003, 167, 1590, 2693, 2777, -363, -728, 239, -2135, -2399, 556, 797, 1821, 2661, -1270, -2383, 408, -296, -813, 867, -846, 106, 2645, 750, -903, 582, -888, -1282, -154, -1880, -1003, 2464, 2345, 1293, 854, -2816, -2818, -436, -739, 556, 3187, 1479, 859, 104, -3730, -3674, 259, 820, 2258, 3615, 121, -959, -272, -2917, -2095, 979, 422, 1410, 2356, -1271, -1769, 355, -555, 518, 2146, -789, -889, 706, -1712, -864, 1793, 243, 768, 1572, -2468, -2590, 452, -410, 1480, 3743, 489, -386, 213, -3494, -2717, 446, 83, 2049, 4136, 154, -1311, -430, -2826, -1758, 1257, 171, 1509, 3167, 107, -939, -273, -2981, -1639, 1101, -375, 949, 3392, 298, 156, 844, -3049, -2457, 227, -1080, 967, 3366, 650, 604, 1152, -2790, -2650, 135, -999, 1361, 3908, 411, -81, 539, -3475, -2698, 332, -1009]
2594a009K526K515l947k08O20l319J070K620k395J830K534l191R8J581l193Q90
2610i78K296k878J490K105k427P72J819l639O8K017k784J401K441j906J436J865
2626C098l729m62J175k982J814K754j987J363J967l791k76J089k866J873L027
2641B067k187J352J237l806M70P69l003K218K946k071J354R75m112J393J178l228
2657b448K020K374k799J779J230m216J272K211l249J478K440l511J635K368m033
2672a449Q11K269l236R38J880l016J593K538k641O87J051l099J016J379k527J882
2688G6K011k616Q43N13l346J861J986k176J803J174l509J594Q48l903J930L044
2704B133k969J568Q48l908J894K286l160J148J817k876J252J269l742J559K837
$$ y = [-1009, 1517, 4032, 85, -123, 497, -2822, -1752, 868, -1527, 303, 2837, -354, -256, 1325, -1868, -978, 1318, -1560, -70, 2035, -392, 380, 2199, -1440, -1372, 645, -2139, -738, 1703, -203, 1233, 3098, -631, -1093, 82, -2900, -1086, 1668, -319, 1044, 3011, -780, -1056, 33, -2833, -960, 2067, -120, 1232, 2469, -1337, -867, -98, -3101, -883, 2063, -8, 1346, 2321, -1791, -398, 780, -2448, -428, 1946, -853, 926, 2156, -2060, -788, 1423, -1826, -348, 2092, -1419, 216, 2584, -1449, -638, 1631, -1605, -667, 1213, -1803, -210, 2328, -313, 374, 1425, -1674, -658, 721, -1806, 76, 2087, -529, 314, 827, -2519, -658, 1328, -848, 955, 2129, -1380, 214, 1062, -2841, -911, 2133, -836, 732, 1580, -2328, -434, 1852, -1308, -160, 1657, -1219, 33, 1302, -2440, -881, 1956]
2719A956k223O66L47l038K124K068k815J308J509k944R97L33l288K520K890k106
2735C04R50p0l898J695J982k343J702K088k296P32o77l691K030K728j246J755
2751A745L6l324J891N20l298J731J551j596K452J93m608K157K754l182J091L13
2767D26k979K775K526l198N11J680k687L12j08k575K384M050o62k41j718l213
2783b717Q43R03j060K736K034n22P30l289m678K374K665k50L440j87l695K049
2799A376r97n167K333L210n44L014l74n314R54K648k345R93J198j942J597J424
2815B064l633k22K297j4J207j052l549J497K441m36Q29q86j554K096n67l443J208
2832a717J823M95K438j414m059J567K045j851N11j01j144K852R21l528L03J340
$$ y = [1956, -267, 399, 746, -2292, -168, 1900, -915, 393, 1902, -1042, -45, 288, -3000, -480, 2410, 304, 1254, 1184, -2714, -1019, 963, -1380, 322, 2410, 114, 846, 169, -3522, -1492, 1236, -10, 1745, 1781, -1543, 348, 868, -2430, -699, 852, -744, 1708, 1901, -2707, -550, 2204, -978, 113, 426, -2553, 222, 2748, -450, 61, 1741, -946, -634, -742, -3317, -933, 3117, 2455, 2214, 496, -2717, -1874, -971, -2031, 705, 2739, 2217, 2947, -342, -5020, -2646, 19, -231, 3209, 3022, -673, 1376, 379, -4788, -2455, 755, 211, 3225, 2851, -2463, -1509, 1139, -1206, -213, 985, -957, 640, 2064, -1569, -1791, 506, 492, 1699, 647, -2902, -1405, 1036, 600, 1429, 543, -1011, 1085, 518, -2925, -1717, 106, 601, 3039, 1625, -2434, -867, 1178, -673, -162, -263, -1407, 1445, 2366, -1162, -859, 481]
2848D81m18J118j597k818K708K852k00J74k224k615K273o99k477K704L177N57
2864B996J644l487o119J241K838l6K410J815j780R65j403n658o47L817K743K885
2880D224m02l829q79N69j351n69M36K103L193m88l651j314J31J224K568j894k288
2897b217K847J325j810K82j357r88L580k83l819N78K248R63J467j612l904J448
2913a252J992j192j63Q1M40K580p19l672m09J238J974J664k103k337J861J004
2929I87j109J13j285L14L408r45l816L82J905J294J997k319l666J538J506r44
2945f40j1M25R08K276q36m113j387J547K761J650j478j768J153m0j258r40n12
2962b263K083L943q85l655p95QJ213K041j550j861K492J144j799q63r01O56L341
$$ y = [481, 63, 1181, -416, -3234, -526, 2326, 2126, 2300, 76, -2539, -266, -965, -3442, -738, 2439, 2996, 4640, 1153, -4966, -3725, -887, -923, 1487, 3302, 1522, 2487, 1084, -4574, -5221, -1404, 1339, 4224, 3822, -7, -886, -317, -1668, -2237, -1801, 302, 3495, 3007, -644, -1958, -1827, -603, 1965, 71, -2217, 630, 1955, 145, 427, -930, -1918, 1662, 1379, -2440, -1862, 386, 1349, 2816, 1204, -2700, -1252, 740, -452, -615, -534, -94, 2486, 1767, -1905, -2314, -1076, 898, 2562, 459, -1878, -17, 987, -122, -9, -1294, -980, 2428, 1483, -2333, -1951, -46, 1248, 3245, 926, -2740, -1202, 304, -640, -651, -226, 682, 2958, 2122, -1991, -3378, -1831, 930, 2580, 1102, -666, 487, 447, -811, -1751, -2263, -180, 3763, 2878, -777, -1572, -1564, -351, 1690, 140, -1721, 771, 1915, 116, -747, -1648, -992, 2349]
2979B349k18l320l13J200J159O71j803j687J252J718o17j100n86J347K596j064
2995A584l076o28P74J906J567j904j449J722L27j426o61n86J300L558k75l635
3011i02q82L91J004J228j328n66K279J003j551j936j406J634K762m9j823l68L25
3028a85Q30K53k374n43K247J221n20q14j367R62K188r87k354p0P69J586R63j889
3046h4j075J560N07p71j252o28J482K780o05k321p86K09R94N51j643l18K674P78
3064B052j029j346j502P73K283o59j501M31N24J109L29k279r72K012L95m19m19
3081b18p59J292J899r25k482l84M83J214Q42j308j95K066K35j187j584j401R52
3098a460K461k15o14K81k42L45m27k189k19K514J279L59n97j811j4J330j263j207
$$ y = [2349, 2131, -1189, -1502, -302, 857, 1528, -275, -1962, -710, 1008, 391, -709, -1295, 52, 2648, 1584, -1492, -2120, -1346, 560, 2127, 223, -1226, 496, 823, -603, -1264, -1850, -550, 3008, 2733, -902, -1784, -1393, -389, 839, -489, -1055, 1224, 2227, 676, -1260, -2666, -1032, 1730, 1681, -142, -510, -185, 645, 898, -1476, -2019, 228, 1449, 929, 115, -1252, -290, 1898, 911, -1443, -1513, -744, 842, 1805, -84, -1159, 401, 908, 137, -1115, -1743, -261, 2519, 1914, -407, -1193, -984, 10, 561, -1082, -1400, 1274, 2052, 1023, -323, -1825, -1052, 1231, 572, -929, -498, 26, 1135, 1464, -815, -1787, 225, 620, 201, -218, -977, 315, 2214, 1289, -1193, -1577, -1094, 120, 962, -346, -541, 1525, 1760, 573, -1011, -2412, -1460, 1001, 786, 172, 453, 211, 556, 129, -2060, -2279, 235, 1514, 1873, 1276, -535, -549, 781, -482, -1689]
3116a689Q21J165J154P10k145j308J225J65l63j87m83J010J685j003j076k83J36
3133d66P18M21j478j30J660L21J89q43j610L80J060q42m53J170N39J070J18k591
3151g67j135J245L14L12M97k40O27Q28j679j600O1N04J589R27q32r1K40q08m69
3170d77n04p33J529J686p97m00R7p35L56M53j816L30J518r1M88j47j449K17Q01
3189C26j264qP60N96J029L13k034r55P15n96O92Q07m13R69R74k013j018N29l00
3208h91J301J090j316l04M18q06j79N94n17J045M57r29m45K95l23J065P78j299
3226C4o2k88q99Q25O24n85J195O51j513l10j27q91J545J268j353K62J67j350K5
3245g82P30p27J248J033j034l60m0j237O62J157q58K19M68r10K34M79r71R62P96
$$ y = [-1689, -868, 297, 1451, 2161, 16, -1292, -67, 98, -265, -452, -935, 75, 1760, 757, -319, -602, -466, 252, 673, -805, -935, 725, 1046, 1235, 392, -1218, -838, 222, -620, -1073, 97, 636, 1706, 1824, -767, -1902, -657, -343, -31, 466, 226, 853, 1681, 2, -1598, -1537, -1033, 556, 1483, 651, 560, 800, -8, -477, -981, -1714, -185, 1501, 704, 304, 401, -334, 22, 475, -1341, -1011, 507, 416, 904, 757, -692, -475, 326, -938, -946, -186, 410, 1439, 1752, -282, -1237, -522, -1118, -426, 381, -32, 937, 1911, -102, -1120, -591, -891, 410, 1500, 184, -120, 298, -508, -687, -93, -610, 435, 892, -37, -482, -187, -510, 555, 1333, 34, -28, -316, -1215, -390, 234, -351, 844, 1495, -18, -328, -455, -1346, 199, 1467, 114, 376, 543, -807, -782, -52, -779, 469, 1502, 468, 108, 68, -1169, -507, 650, -208, 11, 479, -431, -197, 282, -689, 273, 1069]
3264A069j041l72K94q72Q38J003j014M22l8j296M47Q14n15J117N46j500k28j1
3282c37r76Q04J548n20J86R8j435m12N44l53J116J422q21l44n18j608L38J240
3300b8l93J183O26j393O3r4j268Q25J028l77L62l2j050L86M54j112O05N44j096
3319g67R02N98p28N28N16j280k35k09r22J472J198l18J87k80j800O9M63m49J752
3338F97J172q43l08p22j932K88J424N6J360O91j396m63m07j442J042J303j12O48
3356A056j16j607o8L94o90J564M94q62J16k07j349J087P51p24Q87l23j506N83
3374e20L10p66J278J100r34J87k40k074P03R11k82Q91M59j177K57J75j218M80
3392d60O47o23J256qr50M51J66j124J51P3o67J199J013n14M45k82j484q3k0o57
$$ y = [1069, 28, -344, -50, -922, -84, 919, -95, 327, 289, -1007, -560, 254, -261, 856, 1402, -98, -326, -337, -1313, -509, 1039, 519, 705, 803, -632, -1044, -500, -853, 263, 1685, 864, 520, 2, -1606, -1268, -28, -421, 762, 1388, -5, 58, -36, -1304, -479, 549, 172, 534, 502, -548, -162, 292, -820, -215, 329, -767, 135, 733, 5, 533, 1049, -231, -466, -675, -1597, -125, 1073, 755, 942, 662, -1138, -1069, -606, -1055, 697, 1869, 1026, 718, -4, -1936, -1648, -224, -168, 1192, 1883, 487, 24, -383, -1825, -783, 520, 408, 1056, 940, -667, -735, -341, -1031, 533, 1027, 165, 281, 74, -1275, -188, 563, -161, 726, 403, -1103, -520, -210, -976, 302, 1402, 468, 655, 415, -1659, -956, -45, -327, 564, 1023, -154, 103, 278, -940, -460, 187, -436, 820, 812, -138, 313, 479, -645, -494, -421, -1088, 111, 1124, 610, 1055, 773, -711, -794, -814, -1471]
3412a471J451J644o05J30q04j982L46M86J21J493J170q74k20j328j773P16J072
3429d28K30J570M20j341n5p81j162N95J365j94R89m76j425M42K51p36N65Q56q46
3448a61O91K4j427Q80O54q09M69k01r58O46O49p99P79P6o91O94k07j559R96O47
3468C93m12N50j62j029N54L30r71O21L91n03P81L7r83J83M34m65K53k25p70J395
3488D02K42n80L81l48n57Q76o91q50J244P05l68K35r58j010J051O04q04P38M51
3507G63o67P22n98j549M29J101k18O77l56p54P20K25j028j59O55Q4R24n38j099
3526f66M15L51j65L14o43l83J491N4j053K11j77Q4P91k96j480J072O86o03M44
3545D47n80m92J030L81j068jK97L37M94p92j212P29O20P1R6n43j10J198l35j122
$$ y = [-1471, -20, 1624, 1019, 1149, 345, -1637, -1291, -805, -684, 809, 1979, 1105, 885, -443, -2216, -1500, -428, -198, 1372, 1792, 451, 396, -385, -1547, -952, 413, 219, 1208, 732, -693, -251, 0, -736, -171, 685, -161, 530, 554, -873, 7, 661, -148, 321, 120, -838, -192, 457, -342, 437, 513, -178, 516, 309, -1250, -254, 393, -19, 531, 369, -660, -106, 224, -747, -126, 265, -238, 543, 580, -403, -220, 214, -251, 2, -223, -993, 402, 644, 64, 445, 97, -460, 416, -275, -1125, 119, 824, 456, 691, -267, -1277, -226, 378, -426, 312, 763, 96, 818, 220, -1329, -900, 201, -17, 660, 304, -450, 270, 495, -533, -692, -37, 47, 971, 433, -666, -251, 100, -65, 249, -394, -777, 714, 768, -285, -74, -251, -167, 624, 328, -1152, -80, 606, 3, 447, -133, -625, 405, 786, -282, -283, 14, 351, 845, 53, -1159, -430, 190, 261, 357, -186, -296, 902, 567, -555]
3565e55J55J18J80J201o50j639J089O51p37L24m97l46J348N87j651n2J91O0P85
3584E62o37o67N80O89j33j90j048Q0J517k57p80j7m9K68J108j002j296J201L73
3603C02j85K55p72k24J660J79j805m50M02M58R37m03n30L56N66m00p59o88M13
3622f88J354K99n49m53n59L71P25j098m54J477O16k75p9j405m77J733k37q86M48
3641a37K72J38O19p63j378Q34J156m06m63k34J32J024j35r71p23K13J106P22j178
3660a72n02J092J27Q3n04j299M92J578l08q63q9L2M50Q74q75j316J191Q53o18
3679B26m41m64J20J160L78j156o88J31O24P04r79J11Q75L53m54q80j331O02J765
3698F56K58m16j00n23O6K13j319l06J690J129p6o60j433n05R23M91n42K19R12
$$ y = [-555, -400, -282, -102, 1099, 449, -1190, -101, 550, -187, 137, -360, -706, 642, 1229, -422, -474, -283, -223, 562, -75, -742, -162, 527, 394, 204, -844, -764, 753, 496, -284, -301, -350, -82, 1026, 24, -1272, -71, 302, 117, 372, -400, -624, 1036, 1215, -590, -1040, -638, -180, 757, 354, -176, 180, 746, 346, -413, -1101, -688, 666, 965, 416, -37, -596, -225, 500, -598, -1052, 425, 1041, 766, 687, -718, -1195, 538, 301, -585, -137, 135, 273, 892, 129, -1249, -415, 741, 335, -128, -362, -230, 794, 659, -312, -1035, -822, 284, 1006, -172, -674, 418, 545, 628, 124, -1175, -683, 895, 587, -276, -365, -333, 117, 991, 116, -1200, -9, 844, 226, -215, -679, -559, 601, 979, -177, -865, -734, -110, 594, -385, -274, 601, 954, 500, -380, -1711, -1109, 656, 914, 498, 398, -125, -59, 154, -1165, -1471, 219, 1348, 1272, 612, -821, -1326, -403, 88, -454, -235, 677]
3717F77O31l86j217j143O97Q92O11l51p27M26O06m44q52k27K79J200O27j196o70
3736e67O76L13m46j93p07N11J280L9j020p2m5M07K11q43l98R67P40j15q20q57
3756i39K96Q10L86l44n95K15P95K5j329k06R71M83L81q55j170M28J042j54l66
3775a26J64J79L25Oj300m96J010Q75J53k86j074P7O31p3n56O4M04J002l6j481
3795e38k79M00M63K01K57r37L97Q64n36p59q9K47O22L77r26n38O77L76j30l23
3815a74k32K43O62n5n57j58K84M16r3p70m27Q93L97L72o47n20K72L95m60m5K3
3836a81K37N73j86r05n77P04K31L91J22l30K70J83o69m18J92L11L64M40o63o11
3856e22M50JJ80j93j78N00L65j30p34k21L0O13P8o81L13K01M07q1l94m99K08M18
$$ y = [677, 1308, 922, -295, -1438, -741, 151, 762, 411, -316, 110, 716, 272, -580, -807, -528, 672, 1299, 103, -567, 109, 422, -24, -217, -924, -413, 867, 906, -114, -186, -231, 176, 387, -456, -854, 113, 853, 738, -82, -939, -643, 167, 553, 209, -386, -171, 624, 649, -680, -886, 85, 568, 949, 94, -1076, -648, 394, 240, -126, 38, 217, 542, 548, -752, -1248, -238, 637, 790, 504, -570, -493, 138, 65, -491, -427, -23, 979, 943, -538, -817, -417, 46, 247, 504, -433, -36, 828, 292, -467, -556, -309, 313, 690, -236, -774, -97, 279, 149, -174, -406, -163, 499, 444, -113, -271, 13, 429, 336, -434, -861, 32, 429, 801, 154, -366, -94, 301, -159, -204, -181, 56, 629, 443, -462, -1039, -335, -104, 287, 409, 79, 349, 532, -137, -555, -363, -52, 312, 752, 89, -522, -72, -71, 109, -84, -262, 238, 603, 473, -261, -482, -452, 161, 239, -442, -129, 72, 479, 398, 4, -495, -287, 131]
3878A31j41k9J28q7N47q6r66j85N31K54L09K9m81j93N16l26m17J51J31O39J66
3899F21p19m61L16K53K43J64k89N1L10m90m11n8J23O03N27q12j95K79j01p4J61
3920D1k37L44N26p21k21j68n1N58M65n74J97J52l61o3l6m87O49N66m05J74k99
3941D9l30k7L50l94M15N72l49O4k54l76k90N84P7P8J17k63K81j92m03j32J35M36
3963A48K34k8l42P1n8l56J72l9n3O71O1o77M15l30m22M38J52j57K17M04p28J63
3985d4k3m19L14L21j32n6L61m73P2R6l62J51M90j74j12j34j11J75L29j56j18J36
4007A31j63j29M9j22J62L02k04J45m0k15P5K5q7k3K00j26K25k63l32J44M19j83
4029a0L59K3o03N22p7n90J39M66n60M36K38n93K98L1j76J25K27l93K41K28m11
$$ y = [131, -10, -39, 89, 2, 549, 463, -503, -688, -157, 97, 406, 435, -46, -239, 277, -49, -466, -315, -184, 455, 621, -98, -559, -243, 10, 253, 417, 128, 179, 489, -1, -412, -470, -347, 256, 783, -29, -224, 55, -46, -120, 41, -196, 148, 674, -47, -268, -436, -487, 71, 536, -38, 159, 311, -50, -113, -149, -636, 13, 579, 174, 348, 49, -281, -308, 42, -352, 63, 635, 286, 350, 96, -280, -570, 14, 91, 169, 286, 23, 304, 112, -291, -423, -288, 148, 382, 354, 12, 83, 25, -331, -159, -198, -251, 420, 481, -196, 219, -111, -533, -95, 57, -100, 117, 521, -207, -44, -67, -486, -172, 149, 17, -39, 322, -151, -79, 17, -345, -194, 296, 122, 10, -124, -235, -60, 269, 113, -5, 131, -32, -161, -112, -234, -72, 230, 26, 171, 131, -84, -9, 16, -71, -94, 106, -20, 205, -58, -390, -246, 173, -10, 349, 372, -231, 291, 214, -376, -237, 229, -331, 105, 343, -250, 48, 79, -97, 28, 255, -138, 103, 331, -80]
4050h0k13M12l60J94K01m05P1L50k05P5P2k00j85M60j95K3j18p6K45n4k46R1J86
4073D3k04L21j93j50L04n1j19M5r9p8L42J34l49N5J58l03L92l7m67L28P8l29K54
4096G5j57k57L87K10m43J70J90k77L04o2l67J59K84l44m3L81l81K81L34m93j30
4117a79M88m19L44k24Rj1L03m68j4J24j13K63j03k08J38n6J15K62n46j71Q44j46
4139B32o17O86l35l10M85k10k17J65K97m01N92j07n64K32J91n06K41N59l19J06
4159B00J61n84J98Q5l05K29J00j97L85m9l36j72K03n1M05m8j12J09j24m66J41
4180b28J65k75P16nk11k65M5k29K87K9j03N10k02k12j18l46r0N32J56k00K70J00
4202C26m64L32m88l16N33L65j40K71k87n82L87ml02M12L92p0o5k18n18J08L61
$$ y = [-80, -293, 119, -241, -47, 154, -251, -180, 170, -35, 40, 112, -88, -273, 187, -8, 15, -103, -179, 66, 12, -234, -143, 43, -161, 160, -33, -183, 121, 70, -49, -4, -103, -181, 161, 295, -54, 1, 159, -144, 248, 211, -256, 72, 150, -179, 75, -82, -339, 48, 258, -185, -15, 175, -102, 202, 140, -227, -68, 216, -128, -171, 210, -171, 110, 444, -49, -179, 309, -110, 234, 10, 19, 8, 311, -157, -171, -47, -160, 103, 0, -208, -70, -126, -11, 251, -295, -466, 378, 232, -385, 301, -34, -344, 141, -69, -286, -121, 176, -225, 367, 260, -304, -72, 119, -387, -146, 413, 94, 200, 361, -223, -25, 60, -245, -16, 84, -113, 272, 223, -113, -285, -82, -133, 272, 224, 112, 221, 97, -369, -228, -63, -338, 378, 373, 162, -103, -58, -287, 0, 29, -74, 436, 234, 22, -96, -442, -532, 0, 156, -44, 226, 326, -138, 194, -294, -610, -77, 288, 148, 419, 132, -450, -63, -67, -369, 43, 435, 365, 300, 82, -436, -328, 33]
4223C3R0m6M9J45Jk80m55J74N9M69J85k22k31L15o78l1L62j47J09P78m04n86K31
4246h0J6k31M93K35o12L87K35m94k97M6m7M52M25k77j67M5r5q8l22L44K48Q5R
4269C10k31l97j07N68l43O9J54K28p1J32l88p34M87O06k69L23l6l86K29j77m41
4290d74r1Q33M01l07l41k46J08J04j72K73j63L99L71n73m72K05k90M11M44m81
4310f1k9O03m60l33j44J63J32M75O7o03O7J84m7k71K50j50J59N60j67p15O2L54
4332I6J76k24k66J41N5J81L7p74J27P13k7j99J39j26k6N42m27p40K69M68R7R2
4354C24m76l03M78K59l76j31O7M14K17l32l42k28L27M77j93n93M06M46k84k08
4374e1l07K7K81O58m07p14M93J44j69K05l39j13L87M47p15k78K68N6M32k16j69
$$ y = [33, 123, 77, 126, 271, 272, -8, -463, -289, -230, 239, 424, 202, -29, 286, -392, -423, -61, -208, -99, 679, 275, -311, -80, -64, -295, 198, 433, -179, 208, 443, -51, -348, -302, -349, 103, 528, 251, 84, 129, 34, -54, -376, -32, 216, 301, 310, 79, -318, -425, 143, -200, -131, 23, 251, 180, 312, -76, -810, -323, 283, 14, 337, 301, -85, 144, -33, -474, -565, 268, 669, 362, 21, -225, -117, -13, -185, 88, -75, 324, 695, 122, -350, -145, -435, -24, 420, -61, -90, 513, 53, -280, -424, -261, -129, 346, 413, -190, -123, 61, 14, -257, -7, -157, 2, 562, 395, -320, -258, 96, 272, 48, -218, -77, -22, 159, 196, -578, -451, 262, 235, 36, 175, 49, 23, 565, 138, -602, -333, 135, 232, 324, -152, -455, 23, 282, -94, -225, -158, 256, 473, 141, -201, -429, -102, 375, 182, -411, -5, 441, 157, -51, -358, -331, -50, 608, 201, -513, -20, 124, -45, 160, -179, -292, 95, 542, -173, -451, -183, -127, 305, 89, -80]
4395h0j84L01L14k30k39N6L0K23J22m84j50N43L33m54l07K02k1K07N6l57p0M95
4417C06rm89p4o0K69L80k1p43q8O10J58k74J55j40K51L35n00n07J05K93L27l7
4439B47n20m3L08K10n5m08J65M58l2j42k68l12J05O19l08m05K93L73j7p0m85k26
4461e13M58L93l94j64R5K49J14q8n35O2L51M15j92n80J01K14J76k21j80K5L12
4482I8K85l04j75j25L12N8j51k80J8L61K81l92q7L6m9M14l54j95J08K35nJ26k92
4505g7l8K38J28k05l26L6M22K20k11l57K6J90P5k2l48J64K59K97m12k75m5JL61
4528A01P1j57R3K61j79j84k15j39L98J67k43k5J09J57Ml80m3OK19M16m44l58J34
4551b31K70p1Kkj06J28K96m05n4J69j05K51j87Nk84K11K65p5O4o1J16nl42n9k5
$$ y = [-80, -264, 37, 351, 121, -118, -62, -32, 191, 313, -171, -321, 222, 555, 101, -206, -4, -25, 182, 238, -119, -189, 306, 297, -192, -266, -326, -57, 323, 302, -441, -529, 81, 239, -35, 120, -20, 231, 566, 66, -441, -336, -43, 284, 247, -273, -316, -8, 202, 147, -261, -96, 362, 330, 188, -80, -392, -287, 332, 24, -381, -88, 285, 268, 198, -287, -513, -55, 338, -56, -220, -125, 124, 238, 150, -385, -323, 28, 443, 251, -329, -228, -14, 162, -59, -239, -214, 98, 383, 79, -96, -221, 91, 149, -2, -282, -264, 97, 378, -14, -101, -65, -114, 300, -54, -249, -141, 94, 89, 215, -77, -115, 123, 251, 46, -280, -244, 178, 398, 187, -170, -144, 46, 121, 99, -249, -85, 174, 471, 59, -216, -261, -260, 101, 172, 15, 108, 369, 190, 6, -209, -348, 50, 217, -26, -51, 58, 215, 219, -161, -204, -198, 21, 437, -7, -365, -231, 39, -32, -30, -32, -138, -10, 286, -119, -173, -4, -109, 142, -45, -40, -324, -113, 152, 77, 141, 80, 196, 191, -151, -210, -235]
4576b35J33M16k18j92j17K81r0j57O7%L07K40k62m11K6M1q4K99k5j27M14j13j72
4599B1j95j32O1M74j24j85M8J01j9o6r9o3J78O1m4r8P1M5K5l4k31l1L59J30j78
4624G5L7j53l3r0K59L9p6L3J46k43k93J0K46L8jK0N8nQ6l07L7p0L23J98m17j5
4650i8J51k44J61O2p7J30J54K12l30j87n0L04p9nj82K6j2O5K98m10K43lq9l3n8
4675e1l8K17J57n21O8P1k11J55K88j72P9N8j7j07Pk52P6L90j19Rp1k18R5K26N7
4700A76n7J20k06m31L20j42J87K09j22j22L9p2o6J26r3J25R7P6Ql32j35N7K93
4723E5k0P1n9Jj96k4m8O5L69j75K22k46j29N9N0k13N1K62L2jJ84l10rk34K54k52
4749b41L86p5j23M73l05j09j60l02L43M75j48J83Pl94m68K82k61L63L73p6J31
$$ y = [-235, -102, 314, 96, -96, -213, 68, -22, -179, -112, -112, 195, 435, 173, -238, -212, -171, -255, 44, 19, -108, 306, 193, 21, -174, -306, -245, 229, 105, -80, -32, 69, 50, -16, -115, -178, 0, 61, 17, -81, -10, 35, 60, 26, -205, -236, 123, 253, 75, 112, -41, -74, -164, 95, 134, 58, 91, 237, -6, -299, -289, -43, -5, -6, 14, 72, 67, 153, -154, -117, -187, 136, 334, -83, -98, 53, -191, -30, 32, -45, 85, 239, 451, 121, -66, -116, 188, 109, 104, -78, -52, -64, 1, 299, -111, 132, 129, 40, 7, -51, -89, 128, 285, -236, -168, -97, -308, -153, 135, -37, 42, 100, 83, -24, -17, -269, -193, 197, 78, 87, 16, -202, -107, 119, 176, 119, 239, 33, -398, -78, -220, -33, 176, 54, -68, -29, -101, -167, -41, -134, -9, 88, 164, 172, -160, -295, -238, 55, 35, 106, 47, 48, -148, -172, -220, -155, 214, 39, 261, 15, -114, -55, -5, -218, -167, 95, 127, 126, 310, 0, -9, -243, 11, -241, 145, 70, -53, 420, 115, 6, -154, -456, -113, 362, 214, 397, 404, 10, -458, -176, -437, -74, 299, 223, 354]
4770C54m43q9r8%K06J16J07K0P8k59k76J54O8J57K12j83qn0Ok93J36J72j5J17
4794A89l7l83Q9O2q7L73M7k57q9J51k83P2J49J34L1j7k44l1K2j37J69K12R8k35
4818bJ96k12k89L06p4j85J96K65j64J18k6l3k97q7J96K3J75J64%j37k70j49j9
4841c05J07K15n4L25n3k20k42lj53K64L5K42J45l8n65Q5K00j98L39L0J7j29J87
4864B31k84l68K18R2K93q0l4k22J71J72l32J71m9J24Q4l47J30j58R4L17l52M4
4886h5j10K56l91M58q5KM5o2k19k3K02N9K77l79r7J84R6k02N6%P9r1J44oj55K14
4912A67k11J18j53L0n8K55q3r8j26J21j3J06n2j59R9J7J20Kq1k08L19k56J31r0
4936a03J66K5k03J19kj42K54o0%J9O3m8j86J10j77R4J42J35k39N9O7M5r7r8qJ78
$$ y = [354, -89, -178, -276, -276, -70, 46, 153, 173, 251, -8, -284, -130, -62, 95, 307, 124, 116, 66, 72, -221, -85, 87, 72, 189, 152, -231, -142, -80, -167, 206, 253, -4, -93, 58, -225, -153, -4, 130, 161, 144, -100, -131, -109, -246, -77, 135, 233, -2, 194, -18, -307, -1, -75, -260, -64, 201, 37, 155, 129, 96, -201, -288, -92, -69, 106, 270, 270, 133, -137, -286, -305, -198, 17, -37, 288, 235, 15, -227, -230, -383, -119, -84, 158, 303, 265, -300, -215, -15, -213, 126, 156, 173, 44, 231, -53, -421, -203, -111, 182, 102, 68, -154, 17, 189, -143, 28, -21, 103, 187, -160, -30, -188, -94, 223, -129, -85, -195, 61, -330, 128, 43, 45, 90, 28, -191, -214, -12, 47, 324, -55, -152, 32, 128, -74, -18, -18, 61, -30, 114, 108, -47, 167, -44, 74, -79, -49, -107, 148, 65, -33, -159, -38, -51, 55, 3, -156, -57, -40, 80, 82, 1, -207, 112, -144, -13, -103, 63, 88, -115, 4, 2, -140, 114, 54, 54, 73, 136, 88, -98, 12, -165, -71, 71, 206, -33, 26, 93, 138, 41, -57, -65, 113]
4962A13M8k76J14J06j86J68k7l7Qj5R9K38l55M9j43M1n4l9J50O2L6P6k16J95p1
4987H4j50n8K49p3J00j44Kk72K39M5K30j31M9r4j18N3m5j77p5L07P5J78k8k45
5011Ak4K58k85j38J34J8J27O1r3r5J26j05Kj71P5K83Rk16Q7lJ20j69k22mK61K51
5037B88P6j49k46j6m3j13Q7K35o4Q8nr2m26j55L01K68%J26J25j73n7j69k16L4
5061b96L44J60j4k5j09j23J63l77J46j20K59J00J06k91M5J67m3l23m8L2J32M01
5083B86j66kp6O4p7l6k62J47K61Q2k02j69r7J25K35mk80J42J63L1k39k18K20J30
5107E8K3k00r8J03K12J53ml18K56j24L9k50j45J90M80J46n07jj80k0K59k4q2K59
5131B25J1j6k85k27k36L04N35O9j42r6j19j88l1L5K99R2K29k52m00N8n5J59N7
$$ y = [113, 161, -115, -1, 105, -81, 87, 60, 23, 31, 16, 115, 353, -2, 47, -96, -55, -109, -148, 2, 64, 100, 176, -40, 155, 84, -66, -124, 125, 52, 152, 8, 10, -262, -23, 22, 252, 121, 170, 76, -42, 11, -34, -211, -286, 21, 96, 274, 246, 1, -23, 235, -50, -188, -54, -36, 91, 152, 59, -36, 90, -15, -13, -184, -109, 174, 183, -33, 54, 51, 171, 2, -220, -224, 37, 288, 364, 215, -31, -47, -90, -203, -116, 119, 55, 143, 138, 46, -380, -535, -234, 34, 34, 160, 285, 112, 55, -114, -330, -296, 48, 208, 194, 169, 60, -63, 100, -277, -131, -251, 8, 108, 214, -77, -32, 135, 92, -231, -279, -247, -115, 286, 120, 118, 42, 106, 29, -7, -269, -122, 139, 221, 19, -150, -247, -122, 113, 109, -171, -29, 134, 165, -74, -292, -72, 58, 81, -119, -217, -114, 98, 251, 247, -71, 185, 61, 100, -150, -295, -105, 375, 521, 14, 13, -167, -187, 72, 48, -34, 225, 236, 220, -65, -292, -528, -224, 311, 380, 238, 142, 23, -165, -196, -161, 138, 230, 459, 207, -193, -135, -190, -31, 26]
5154B6Q0q9J53J01l18j07O5N3J85mm73K75J28J29k8j37k95K39j4j40K00R5J14
5177B38j71j38l30J18K13K47p9k7l3n5J51k5j75J11K15J60l28k95k5K18N7n3J29
5200A23l27L13lm22J36k7L13K03J26o09J25j55J33J93j15J8j9K07m80k13L30K23
5222G3K18j72l67M2J44K90k87p3L25O2l43P6k00L7L51J12m3m62m7M59j27p2k2
5245b6k07L95j52r6j61K82J88n4r4m07mL13j07L09ol6j27R3l18rK01L07J35j16
5269C03m06m0p1j6K32j43K63J57Km55k03l6K78L07j41j01J60K4n9k20j09K75J03
5292A04J73k52J34l32K97r2q0k51K80J0J23M0j12P6K9k04l51L69j4K39K34j56
5314B64m13j1O9o8J14Q6j23L85M9l74l05j7K55RK94k22K3M0j06L3j05L70j98R2
$$ y = [26, 106, 17, 170, 271, -47, -154, -89, -36, 149, 145, -328, -53, 75, 204, 176, 39, -256, -17, -31, -171, 29, 124, 238, 67, -71, -401, -283, -70, 177, 98, 71, 38, -17, 134, 109, -66, 45, 260, 420, 92, -203, -228, -10, 47, -6, 123, -204, 109, 106, -316, -180, -207, 106, 309, 435, -174, -49, -204, -71, 122, 7, 25, 6, 213, -267, -480, -150, 73, 291, 119, -248, -206, -62, 228, -59, -132, 193, 255, -88, -12, -212, -175, 176, 288, 245, -217, -264, 195, 68, -4, -26, -233, 162, 10, -86, -247, 35, 223, 169, 75, -332, -336, -23, -130, 179, 173, 137, 10, 103, -215, -224, -23, 284, 419, 303, -103, -143, -214, -230, 2, -141, 122, 279, 281, -174, -377, -413, -135, 172, 31, -70, 90, 114, 55, -165, -274, 1, 104, 277, 25, 159, -173, 124, 32, -48, -299, -19, -9, 114, 154, 42, 118, 147, -57, -408, -39, -53, 186, 420, 264, -149, -160, -91, -159, -45, 41, -82, 303, 352, -22, -327, -344, -89, -80, 214, -8, 15, 55, -51, -18, -123, 247, 49, 141]
5338A41j54k50QJ25M13j45j67j09j36P3Q7P5P5L45l0k46P1k65j93K28K27N6L8
5361B67j08j38j08k81J15K72J52K5M9j89j80l9j88K23r8K04L16J2l81r9K53k40
5383a61k22L74m3J08K26l00p9K23l90Q0J47K0q4K55K66l41M2l46j43J98L7K91
5405A58Pn6pQ3l64j41K17L26m8J24k47j01J20k1l36J56OK09l6J36j92O6n3m2l9
5430g5K1j14K86J31k05j00O8k35L15l46K05J66N7R5p3m21N4K11l75J78J42N3K68
5453C06q7l46Rl6k5P1K09j5j09K76K8l79j03J89RJ28K3r0O9j49K5K09m00J80P9
5478G1j3K07j33j24m1M3L7r8R3J9N5J74k67K41k14p5j1J9N3q6Q1o0k7j64O8oJ03
5505e5N1l3P0J47l69L8J8J65J37j52L4l8j00j0P9J37J9k01J14k4j12k9r6K03K22
$$ y = [141, -13, -263, -255, -130, 283, 138, -29, -138, -274, -201, -114, -39, 36, 381, 351, 105, 176, -89, -282, -54, 173, 229, 267, 159, 21, -87, -368, -253, 19, 171, 196, 245, 56, -124, -163, -351, -128, -226, -22, 294, 306, -75, -174, 79, -161, -383, -9, -52, 56, 282, -18, -97, 126, -264, -184, -37, -17, -101, 154, 420, 79, 121, -225, -368, -170, -133, 158, 165, 109, 102, 185, -179, -320, -103, 223, 175, 299, 52, -49, 71, 50, -286, -130, -124, 85, 49, 185, -7, 59, 6, -36, -75, -54, -168, 118, 249, 44, -56, 12, -223, 92, -254, -49, 117, 174, 269, 196, -225, -171, 40, -335, -157, -15, 38, 306, 219, -127, -118, -154, -179, -108, 101, 86, -23, 253, 281, -98, -201, -12, -3, 125, 148, 58, 127, -22, 3, 212, -188, -8, 71, 58, 265, 132, 8, -33, 10, 47, -51, 42, 61, 116, 290, 23, 264, 50, -25, -36, -17, 36, -50, 31, -29, -56, -220, -152, -158, -55, -4, -37, 33, 180, -189, -151, -133, 32, 169, 17, 51, 13, -87, -97, -18, 119, 138, -63, 51, 27, -85, -114, -210, -7, 215]
5530B15p7km2j15R8j15Q4n1rl2O0j50K77p7n8L2r2m8pj08l6L62l9J7J39k08l65
5557c47K74ql4J77O4k9j39k9j04k5J37J06J65j68Q8N9m13K38m8m8M9J46j95J31
5581D7J40N0j94n7j65j93M32n3J88K17n79Q5k27l7J33J36M36K18l44l30q9j03
5603b89k58L37K73L15J7k02l22q8L9r2M07mK03o0k50j86qK3J64J81o4j08O2o2
5627B8j59K76qP2l92O7j11L25J7L3K1j24o6j98J19J00J7J77j58J5N0m24J61Q2
5651h0J04No6R0K0Nj96J80k71L7J57Q3m8J29l6j8r7k39j93K06J78J39K60N8l17
5676I0k66k14M3J11K78M11J77k26n48j92k67K60L83J93J66j60P4m74j23j20M23
5697A9K59j07J07j11k92o0J45l74N42J8J9k50K4K5N5q9J87j90M2r7J68j34J66
$$ y = [215, 138, 136, 94, -21, 77, -38, 46, -5, -14, -46, 14, -136, 141, 64, 6, 38, -54, -102, -109, -217, -253, 109, 70, 87, 226, 18, -347, -73, -81, -115, 62, 126, 97, -42, -71, -175, -200, -63, 43, 208, 40, 128, 187, -226, 12, -36, -84, -35, 111, -84, 47, 187, 237, 43, -14, -179, -372, 60, 7, 195, 412, -167, -82, -309, -346, -213, -77, 359, 577, 233, -97, -186, -289, -547, -210, 63, 378, 395, 193, -129, -217, -178, -270, 137, 133, 336, 276, 26, -160, -168, -145, 19, 200, 136, 28, 90, 28, -131, 145, 137, 209, -183, -116, -227, 98, 115, 148, 169, 45, -21, -219, -100, 0, 17, 194, 36, 51, 101, -323, -162, -80, 24, 29, -37, 53, 73, 78, -118, 62, -209, -172, -15, 68, 20, 149, 113, 95, -2, -241, -434, -228, -50, 89, 349, 407, 90, -176, -390, -347, -236, 42, 453, 630, 404, -144, -336, -603, -343, 40, 233, 399, 239, 313, -161, -284, -404, 19, 278, 171, 278, 167, -125, -185, -40, -414, 128, 146, 165, -85, -61, -36, 19, -70, 117, -73, -31, -128, 40, -94, 72]
5720G2n5j50J13q6j67K12K18qK47k80j79r9R5L3k44N04J67l16l22J62k41L85K00
5743B61j20k39k1k4r4J12J86N0K35l76j6j53J06J30J53l3r4j54Q5j17Q7Q1K75
5766C20%k60L9m10N3K39L04j19q0J4k53K91k48j74J12L54R0l17l3o8Q3N3j09J44
5790B5J1M0j0j70J52n0J16p6j74J84j37J58Jm7j61Q5P6r0j36J9M09l8o0j11k19
5815b03l69O33J39j89K04J9j18k9k97r2M30J55J08M9m87j75M3J88l62J74L79J08
5837C08K4j91l14o5K00R0j6J28j90K02j61J50l08p2J61L02m14J97R0j08K49j95
5859F7l25l6L34P9k5p1J84mj33k11l12L28J30L00j87l12K58K93m70k9RoM57q7
5883B31k37o1J44r0P1J2l90J94L86o3k47J34p6j49L50m79K9J84M43k49j20k14
$$ y = [72, 17, -133, -20, -106, -273, -61, 157, 149, 396, 116, -63, -162, -67, -34, -278, 226, 393, 77, -245, -83, -324, 61, 261, 141, -98, -119, -143, -237, -125, 61, 111, 346, -30, -46, -199, -93, 37, 190, 157, 63, -91, -6, -123, -36, 45, 320, 320, 60, 99, -311, -258, -19, 285, 166, 86, 100, -153, 138, -110, -284, -172, 182, 272, -45, -78, -146, -63, -10, -119, 25, 36, 76, 66, -104, 48, -2, 114, 38, -136, 48, -89, 69, 70, 23, -138, -53, 23, -67, -203, -184, 225, 187, 127, 16, -203, -572, 61, 200, 11, 215, 234, 116, 87, -210, -302, 128, 283, 391, 440, -47, -222, -179, 9, -353, -179, 200, 308, 332, 141, -173, -238, -38, 52, 36, 164, -26, 176, 15, 165, -143, -215, -54, 248, -166, 31, 121, 13, 262, 67, -258, -294, 40, 119, 94, 23, 207, 203, 70, -141, -453, -125, 5, 305, 118, -194, 64, 357, -113, -142, -133, -139, 318, 231, -6, -67, 77, -13, 58, 70, -320, -126, 260, 197, -50, 84, 8, -141, 209, -270, -241, -57, 386, 137, 17, -197]
5905a97M9O2j66K95j73J09L82P8n45p5p7J24J7J95j44K36L48n28k19p5J3K55M69
5928D33l84k55N59k25k53k9j21N5L26J09j05j64K56j21l3j40k26K09m3N57l10
5949I5k52M5J60k01P8j41o7N50L3k34N0k22jq3n4j26J87N99k31l3k9l91O2l2j12
5974c50L07J77M03k90m4m67J54K06j39No9K8L58r0l63J16k7l1L68k72j94M42M9
5997B77p9k10o8l73L68K84k24j00M51j97o2l19Q4K65R5j77K36l03o6J38o7l84
6019d31K83M9L09K48n42l10K51J88j21K91l69R5p5K64k92L8%P0K95q4k37k4P3
6042c1K41l5m3j28l4k85l0M71j88L03J05o82j25O44k27K8K17j66j80J83j92j77
6064c31L27J09j2K10j80k70k9L52j92J15J07k37pJ63k65j35K48L84k29j90j71
$$ y = [-197, -148, -86, -252, 43, -130, -21, 361, 439, -106, -181, -258, -134, -117, 78, -66, 170, 518, -10, -229, -304, -291, -36, 433, 49, -206, 353, 128, -125, -154, -275, -220, 106, 215, 110, -54, 202, 81, 48, -92, -318, -109, -152, 405, 95, -157, -112, 48, -153, -75, -216, -283, 267, 300, 66, 116, -106, -107, -190, -244, -370, -183, 416, 185, 152, 123, -268, -206, -238, -350, -43, 134, 537, 247, 203, -264, -110, 96, -43, -38, -107, -79, 279, 189, -174, -58, -85, -116, 252, -20, -214, 228, 277, 198, -12, -80, -453, -85, 199, -25, -125, 326, 129, 67, -252, -168, 97, 192, 15, 251, -52, -118, 20, -47, -431, -148, -99, 210, 458, -84, -394, -143, 45, -76, 215, -154, -59, -134, 130, -162, -124, -124, -54, 241, 157, -80, -104, -31, 210, 175, 132, 4, -30, -315, -345, 126, -62, 241, 346, -336, -461, 183, -44, -16, 201, 35, -145, 38, -154, -331, -4, 105, 93, 303, 123, -147, -176, 176, -16, 99, 206, -31, -38, 125, -140, -275, -27, 357, 128, -62, -233]
6085b33J19k3K30K98l16j27J16k1m01K76K89L9J36l65j17q4N7J00J78P6m6J9l00
6108a00k47q0J80L64K62j20l18Q9l20Q0R2nL0L90Q1k18K0j71k79K91j84J01Q7
6131B5J22k28J35J37o44M25n9l8L0K96J22k26Kl69l92J42M83J79J53J42l63l52
6153b78l4m3r1P50J9Q7j52k79k74j29J41L49K8R7q3q0j34j7j47M25J63m04o0O4
6177h2kn4K24M3J85k16k67p2jK14J32P4r9K5k02k10L49l7m0K57Q2j66k99J62k29
6202b29ML46%l2k7J76k27m8j52l2j52L95n9k1K22Mj79p1j16n3K51Q8L31j16J55
6227D58k59n34j77k0L72M10J79L3l03l31k0j8J84J13K84L0k96j79k29J43n0K72
6249F2R7m3R0k00j27P5j60J89NJ31l6M4j62J06Mj27k18L20l1k06K64j02j07J95
$$ y = [-233, -114, -137, 93, 391, 75, -52, 64, 43, -358, -82, 207, 246, 382, 17, -100, -184, -127, -27, 151, 227, 181, 200, -100, -347, -427, -247, 117, 379, 259, -59, 30, -290, -210, -118, -123, -93, 297, 378, 160, 180, 9, -270, 21, -163, -62, 25, 147, -81, 54, 191, -453, -28, -87, -125, -95, 201, 323, 97, 99, -270, -662, -520, -37, 142, 295, 437, 74, -278, -312, -355, -446, 304, 323, 410, 258, -21, -295, -424, -283, 66, 94, 191, 108, 28, -106, -123, -270, 155, 318, -86, -146, -82, -84, -138, 86, 129, 314, 98, -169, -241, -242, -28, 104, 178, 79, 104, -98, -308, 41, 4, -36, 221, 303, 137, -162, 0, -229, -225, 121, 121, 89, 62, 238, 11, -37, -189, -221, -373, 22, -37, -58, 164, 168, -11, -82, -198, -251, 0, 88, 419, 303, 458, 199, -335, -512, -532, -160, 250, 429, 462, 159, -172, -192, -210, -26, 87, 371, 401, 105, -74, -303, -160, -210, 62, 159, 116, 206, 6, -121, -46, -206, -17, -12, 119, 83, 127, -35, 71, 75, -52, -270, 50, 19, -187, 77, -25, -132, 63]
6273F3K20l16k50L9K18M9j3J3K15m7l24K9O1q5L00n1j8j3j15J6J23j89j7K35k56
6298a13PK75j75lJ22j57k29J68n5l5M95j50j92J07j69l1J91j84p6M12j5k67J62
6321H8j49j4l0R0O9J97q9l61O5O9Q5K52k75LO3p4K3m8n5n6M42j98n0N8l13p7N05
6348B20m46K36K6j33K18l8Mj53J02j56o9N5m1K19J63k75Q5r6O3pr1PlM15l76j3
6374h4j94J13O1J92j30P6O7k58J05N0j49l2M41k51PJ5j72N7J83j81O2j6K16j54
6398B4J59l74K66J28l67p5K83j99P7L12k25PO9Kk85J58j33Q0L72r0j96L0k83J63
6422i7J32o8n6K28J6j73n0j97J49J28p6j1L23l3q9mm09J56K4n0M22k61N1m6L7
6447D6l15J08J25Q4JJ12q1q2J3r1K09j74k9J86P3j35N2k5j04J2K6k03P8N9J20
$$ y = [63, 283, -33, -283, -244, -26, 23, 10, 23, 238, 191, -133, -104, -43, -128, 172, 121, 103, 90, -25, -9, 114, -75, -92, 143, -113, -106, 169, -6, -9, 113, -44, -273, -105, -160, -195, 300, 150, -42, 65, -104, -135, 56, -128, -204, 208, 193, -74, 88, -61, -75, -105, -15, 54, 251, 162, -199, -134, -65, 20, 272, -3, 0, 63, -11, 12, -36, -91, -147, 295, 97, 47, 105, -208, -285, 220, -226, 10, 36, -97, 121, 83, 87, -66, 36, -120, -189, -134, -175, 44, 207, -68, 17, -79, -16, -23, -114, -107, -110, 305, -71, -84, -278, -165, -104, 88, -42, 34, 101, -157, -52, -2, -151, -183, 258, 7, 14, 29, -143, -86, 97, -84, -22, -38, 178, 24, 183, -191, 75, 203, -164, -239, 44, -155, -78, 234, 9, 16, 85, 87, -198, -40, -173, -93, 279, 189, -7, 23, -260, -97, 35, -33, -89, 139, 155, -18, -68, -265, -116, 12, -64, -75, 248, 215, 126, 122, -287, -131, -107, -157, 265, 4, 55, 9, 46, -269, -161, -36, 48, 49, 161, 80, -2, 11, -80, 129, -45, -74, 112, 185, 50, 102, 77, -27, -15, 11, -192, -114, -55, 65]
6472F5M2p0q9k4Q7RK21j17l9q2K6n0q5J25N3j50m1J15q0K02j7m8K9j40K27j58
6498A1j63j19L60J61l9k16k3j12k3j42J54L67K42n2j76m36r7K6J08M32p1q1K47
6521C58k97k86m8N5J30N25j96m1o1k29j99L81j39r6O34k18m7j57k75R1J28n0k9
6544f6N0J59o5N0k41J12J37p2j41J93l26M01M7m57J59P2k10K62P6k30K4K01j06
6567B9l9O5k30J51J41p5p2l81K76K04K44m87K84K26j43l87o7J41K39M8k89K64
6589A42k09j10K61n4l70L22L83k41j38j79j76R0L89K3p6R7j48J54l6j42K9M6J18
6612A75p4j60j65K24J74k70L5J13j00K08j47j48J54J62l18J04r7j34K53L96m10
6633b5j4O0j54L7K24j80o5K56j4J8m58O5K46MK42ok93M4J10k97k36M37K56j62
$$ y = [65, 107, 37, -52, -76, 11, 20, 241, 124, 85, 3, 29, -21, -106, 19, 72, -78, -119, -4, -84, 118, 101, 53, 82, -58, 169, 11, -152, -271, 89, 250, 211, -5, -28, -140, -163, -305, -151, 216, 458, 406, 230, -206, -303, -277, -169, 263, 192, 111, 358, 61, -225, -273, -218, -88, 437, 241, 200, 139, -90, -289, 92, -47, -143, 491, 273, 226, 69, -206, -115, 13, -37, -66, -16, 143, 78, 128, -113, -1, 136, 64, -77, 116, -210, 191, 238, -219, -60, 12, -198, 64, 140, -90, -66, 135, 29, -10, 55, -175, -24, 117, 42, -30, -411, -135, 69, 313, -174, 110, 336, 193, -194, -261, -120, 119, 167, -122, 142, -67, -177, 84, 30, -340, -18, 365, 124, -14, -193, -369, -279, 110, 133, 57, 154, 6, 160, 124, -18, 11, 57, 175, 101, -59, -224, 0, 174, -96, -61, 52, -48, 160, 13, -135, 19, 181, -137, -33, -130, -264, -11, 385, -25, -39, 21, -133, -96, 128, -52, -117, 139, 125, 143, -315, -250, -4, 0, 242, 236, -57, -13, 97, -200, -436, 1, 257, 95]
6657I5K14k22l86L21l9j06J21J81o8O2p4m43Q6L99j87J80j09qo7J75j23k44L00
6680E8L7M0rk58J20n6n3j0l30M7O71o9j43k0j01k34M94k08k08K54L36l00j03l1
6704g6l00M82K1o3jo1M3Q3l33N0O3L18P0Lk90k50R5J91j71Q7O9j53L71m04m61
6729f17N47J18j93M78k81j77K06j92o7J14k8K24Q0jl92k66L30M7O4N3P6J76j72
6752A27j97r2j83L07M90l28j71J90q6l09M17n06l3N36j8pJ22k73j63J33N2m72
6774d64M81K64l8k02Lk73N0O4J15J41L5K6O8l75j40P3O9J81o6k1k04M02l06L3
6798h4J31m2J5J93J24m30J22l20K68R7q9j54L67j30q3j39O8oL25q6l12J16J99
6821A50k26Q4L8P2Ko3j03O5q9J08J6J67l21j14K21n0Q4n4l8J41k1j26P9j23J59
$$ y = [95, 309, 87, -299, 22, -17, -123, -2, 179, 111, 173, 99, -344, -258, 141, -46, 134, 25, 17, -50, 125, 2, -242, 58, 95, 135, 126, -132, -12, -68, -121, -131, -461, -414, 257, 188, 45, 25, -76, -310, 184, -24, -232, 22, 358, 58, -45, -76, -376, 106, 127, 64, 63, 2, 45, 128, -205, -155, -92, 226, 296, 299, 9, -241, -146, 45, -126, -39, 30, -123, 248, -156, -617, -70, 48, -145, 333, 52, -125, 81, -111, -178, -64, -92, 132, 212, 211, -181, -447, -117, -70, -6, 47, 123, 299, 127, -70, -162, -345, -38, 452, 124, -47, 143, 57, -252, 165, -341, -374, 162, 144, 137, 259, -14, -177, -44, 8, -464, 17, 281, 243, 41, 44, -229, -179, -115, 0, 141, 176, 202, 270, -105, -245, -172, -103, 78, 12, -9, -213, 189, -117, -84, 47, 5, 20, 213, 337, -93, 29, -291, -23, 74, -15, -169, 198, 68, -15, -154, -86, -92, 233, 147, -165, -49, 150, -76, 8, 46, 118, 120, 57, -46, 19, -70, 38, 54, 221, -100, -214, 7, -43, 41, -13, -51, 90, 69, -57, 22, -101, 58]
6846E8l7M1Q6l42L75m7k58J60o1k20L76rk31K43k53J95J26k58N8Q4N1o1N5k12
6870h1l7J13O1k44K05J0R5p9Qo1j7J38j91J36l52K21J93l0l2RJ3j26J65J0k82
6895a55L82j37P2nl9k25L11q9j58kO9J53m2j91J1l8P0l7q8q2K0K02K41l09J33
6920F7j09j14K05R9k33J57j19J64L04l34j29J3K96k09L9p3oR2k8k30p4K71J78
6943B27l43J44j37J06J09k52Q8q3M5L22j71j24J25k21M7K73l52L10K92l93P3k13
6965a28K5%M72k48k67K45k20k9J84k9k30M22k3k08J7n3J6J05J7k69J40J65J40
6988B44N0m31J44J19j33P1k0O1j17Q0l09M5K28K74j78J19j80k01K47l16J2K10
7010A9n7K59R0l60j63J70o7P8K55j47m8N7j21k80K84q3J11M97l89r0M9j82k6K07
$$ y = [58, 21, 62, 148, -194, 181, 134, -124, 36, -25, -245, 131, 122, -109, 134, -119, 76, 202, -56, 2, 86, 137, 76, 131, -81, -118, -5, 56, -188, 17, 27, 122, 43, 51, -10, -27, 111, -80, 56, -296, -75, 118, 88, 56, 65, 78, -48, 117, 127, -155, 227, 90, 162, 157, 118, -107, 204, 115, -43, -45, 24, 177, 135, -56, -45, -83, -13, -50, -138, -220, -200, 2, 243, -66, 67, -42, -156, 49, 148, -85, 72, -47, 117, 421, 87, -42, -29, 267, 58, 97, 24, 18, 110, 82, -148, -222, 49, 227, -116, 28, -109, -3, 106, -146, -58, -141, -96, 226, 55, -69, 56, -165, -118, 155, -197, 113, 405, 12, 85, -128, -103, -103, 369, 121, -146, 99, -121, -150, 34, 5, -225, 197, 174, -34, -17, -70, -54, 51, 68, -201, -61, 104, 244, 294, -137, 7, 126, -7, 64, 44, 105, -12, 68, -241, -196, 32, 306, 128, 247, 67, -134, 113, -203, -191, 19, -38, 221, 311, -49, -212, -42, -109, -31, 224, 77, 29, 86, -35, -315, -31, -114, -3, 494, 105, 15, 64, -118, -144, 63]
7034F3r3J30M3J00j74m6m45J03N65k70K42k9k13M5J14m25J43K00Q9J15k55L1l0
7057CJ7k89J62M13k85J88p1k43mm3K27qJ02j21o1J25k71J9K39p5J14J14j6k83
7081d7l9n0oj2J85K59j11k88l7J5P6k2J51k4M8J56k52j06K1j93J55L36j62N6l6
7106G3j30j45P0l7L02J1j74K37l01k13P7R7J65k8J47O8k36Nj78j7J26Q3J39j85
7130d4P9K2J64l17J35j8p3K85j53k90L47k61j10J94R3k1J16k25JJ31r7l3m9J67
7154D3k57M07j24n9J72l21O6K02j23j5N2L37l89O6j83m3J01RJ91p0m3J07j26j24
7178a24J00l1K80k48p7n8J96qj92K90k1j31J89o0K8k79R1j81K70j6j48k7L19j02
7202F0j08J25J07j69J64r9m2K13j71l8l1k5P2J96j22j71N1J7k8N0n6l6J13j33
$$ y = [63, -30, 100, 143, 243, 69, 23, -422, -319, 246, -24, 218, 189, -24, 21, 135, -290, -147, 53, 142, 257, 2, 33, 3, 20, -269, -107, 306, 21, 209, 138, -105, -109, -152, 75, 67, 169, 48, -13, 112, -159, -140, 99, 24, 138, 252, 236, -47, -86, -136, -142, -154, 31, 290, 179, -109, -146, -131, -55, -77, 74, 50, 98, 254, 2, -104, -83, -276, -121, 215, 53, 109, 73, -57, -202, -132, -169, 133, 144, -30, 207, -94, -307, -230, -133, 32, 4, 151, 219, -17, -12, -190, -207, -81, 2, 141, -44, 35, 57, 221, -96, 39, 21, -52, 233, 80, -210, 137, -124, -234, -40, 53, 32, 148, -77, -76, 55, -42, -75, -124, 43, -214, 193, 69, 10, 182, -139, -73, 129, 6, -9, 43, 380, -9, 57, -126, -169, -68, -59, 132, 62, 19, 126, 0, -124, -24, -55, 225, -23, -100, -158, 38, 30, -162, 128, 107, -24, 165, 105, 133, -146, -55, -236, 34, 18, -130, -157, 162, 60, -48, 77, 184, 15, 179, 80, 38, 251, 80, 42, 11, -14, 58, 254, 132, -39, 12, 29, 1, 51, -5, -41, 72, -61]
7226f1K75q8l83K26M0lJ53O0j52l5m1j56J08Q1j09J89r5l2k47L37l1j06J62m7
7250D5J91r7k83J55k3o0J33p5P9J9p1j40P3j5k9K96P2l54K60j74j51K34M7k15
7274h3j47N57n1l18P9j0j0k8j46L0%L0K01j84p6K19jj73K81l65K20m2R2l18J51
7299i2n9j6M82l30j95L01Qj89K41k57L9J01R8j00r1K09O8k84J39k31N4L14j76
7322C4K22l02J2K16k77k55L43k5m8L45k40j58K21k58M5j28K83l99N90L3l32O1
7344a7J38l09pK52j51J38Q3nk53N3R8P8ok68K17Q0O7j45l17O7K37j16oK64l69
7369a97J58K82j28k07J35J02k47K25j21l62L74M6q3J3l8J12p9k0J60J49q4n0J70
7392C10m15j63L12j46L37n2j73M8L8j61n4K27j55P0K38j43m26M61L1m82M16k6
$$ y = [-61, 214, 126, -257, -31, 9, 6, 159, 219, 67, 32, -9, -165, -57, 24, -85, 104, 9, -23, -270, 67, 36, -70, 92, 45, 236, 139, -144, 11, -12, -72, 61, -14, 65, 84, 13, -127, -54, -69, -98, 198, 270, -84, 176, 2, -149, 85, 132, -83, -230, 327, 276, -42, 37, 27, 17, -11, -157, -127, -127, -97, 104, -80, -156, 63, 62, -111, 170, -195, 25, -17, 75, -243, -92, -151, -167, 315, -15, -210, 91, 99, -90, 151, -106, -67, 34, 132, 32, -59, 150, 218, -66, 73, -158, -104, 210, 34, 256, -46, -34, 182, -95, -350, -7, -32, -80, 265, 25, -133, 88, -170, -125, -253, 30, -369, 221, 254, -78, -17, 121, -188, -195, 57, -94, 44, 127, 122, -131, -78, 20, 98, 92, -176, 41, 121, 188, 43, -274, -207, 30, -86, -92, 172, -197, -39, 243, 115, -92, 43, 145, -102, 123, 2, -360, 14, 60, -23, -10, -48, 64, -15, -35, 125, 274, 190, 140, 310, -105, -268, 44, -102, 235, 183, 10, 58, 96, -65, -119, 108, -47, 23, 261, 118, -308, 153, 184, -298, 118, 92]
7414I2j41K35M1k07p5j45J34J23j53j07K38R8j19K48l83k5L03n6j18N8l8J36r3
7437D6k24l5J72m2J59j5kM4j12rj42K23J3rR6k15k46J00N8J86o2K26J4p9p7j81
7463a13o2r3M20r0j71n1J13O1r7K04j56L2J02n2j25K48j08L1Q7o9k57J59J21j3
7487A21K4K6j81J34j84j19J96L3L33k55j20j74M4P4Q2JJ34j24j5q6j76M0K73j00
7511a9J26j41r3j7K31j28k5K27K4J19l99rj58K65K9M7R1n4l64K91k35J90J65Q5
7535B48j07N1l20m7J29o3L04j89K08p3P0l04Q0o7j15K02N8M5j83K90j14j86j72
7558b55K5K65O8K55j67j66M4k83J31l08N0O01r8J02r9j16n65K94J3O8L03J80k
7581C40j33m26k32P5L14K53L4J36k49o9k75J32m0P9J79J84k30k53o6j5L47J48
$$ y = [92, -49, 186, 227, 20, -55, -200, -66, 57, -96, -203, 35, 133, 14, 262, -121, -146, 157, 101, -17, 41, 3, 139, 46, -178, -213, -41, -83, 76, 61, 59, 103, -9, -18, -160, 63, 76, 67, 163, -52, -298, -198, -140, 46, -16, 210, 224, 145, 68, -113, -175, -268, 152, 62, -109, -160, -47, 14, -83, 121, -35, -3, 99, 47, -78, 170, 62, 93, 180, 111, -146, 13, 134, 121, 145, 171, -10, 124, -60, -179, 17, 50, 383, 128, 8, -166, -122, -48, 34, 35, 169, 45, 30, -56, -232, -192, 81, -19, 107, -34, -127, -144, 87, -41, -66, 161, 185, 304, -95, -104, -262, 3, 32, 79, 170, 116, -248, 43, -192, -2, 163, 248, 141, 192, -128, -175, -46, -109, 195, 6, 214, 141, 211, -93, -13, -80, -195, 7, 65, 110, -73, 217, 103, -83, -255, -230, 35, 103, 358, 191, 25, 69, -214, -83, -391, -341, 260, 162, 264, 165, 49, -516, -222, -209, -141, 162, 342, 340, 207, -219, -451, -376, -62, 191, 225, 361, 112, 43, -232, -100, -140, -61, 118, 302, 72, -181, -247, -262, 85, 233]
7603B33k03L1L02n18K5J13NP2J10l3k81P3Mj04L61l0j57K40k72J2j56Q9K06K92
7627D14m83P7P1k25J7K62j96j17J16J71P5l90J85R4J75l16J6P8R9j16J45j63j2
7650b3n4j10k2J73J22J70P7l39l76J66J80mK89l3l5N1m14l23L29n0J91N02m07
7673F0NJ2j81j76L04j55J59K25k80n5k5j34J71K7O9L3l18L37J0m4K0j87J85k69
7697b07N5J57pk0K99k43j10P0k08K20M6j09K5J75j73o7%j9L3K02l0k67J82j17
7721a13L7J17j17R7J92k79J5N7p1Q0q8J16l4R4k26J08l9o1P9n0K93k12N9k08L11
7746A57M6j35O2l34J18J03Q8o0M1j67J14k26J57k01J07J58n4J06m1L9j15P9p5
7769c3j10J32p8O5N3nj12J50k49J65N2j81R8K72j82N7p6K3k15J21J57j88K45k15
$$ y = [233, 30, 61, 363, -155, -130, -17, -12, 60, 170, 137, -144, -71, -67, -171, 190, 160, 3, 243, -29, -17, -173, -84, 122, 414, -69, 8, 79, -146, -129, 133, -63, -180, -64, 107, 182, -208, -23, 71, 246, -70, -54, 24, 123, 7, 152, -11, -23, -77, -187, -209, -36, 86, 256, 333, -6, -382, -216, -36, -40, 249, 216, 181, 232, -182, -505, -176, -226, -35, 467, 60, 65, 77, -104, -280, 24, -131, 28, 253, -27, -82, -107, -241, -70, -43, 26, 59, -259, 78, 88, 44, 64, -123, 62, -207, -152, 5, -2, -22, 277, 34, -76, -6, -214, 6, 52, -57, -32, 143, -30, -97, -97, -116, -83, 119, 89, -178, 4, -113, -76, 41, -76, 21, 213, -66, -51, 6, -65, 15, -73, 43, 9, 103, -123, -15, -54, -115, -36, -86, 207, -5, 54, -154, 157, 203, 68, 130, -204, -86, 17, 105, 45, 86, -81, 33, -193, -36, -237, -130, 28, -26, 80, 39, 78, -37, 42, -33, -143, -11, -89, -24, 29, 24, -88, 62, -187, -22, 30, -151, -53, 219, 37, 94, 18, 41, -174, -53, 104, -84, 161, -54]
7793e4R8l0k61K98O8k27P8N6L7o5L7j07k45J20J85K4K22j79j7r0j52J88j32J59
7817A1R6o5j42L8J97j83L8k16L35O9j79K8J99j49R5j97l0O9Q8j79R6J68l25J07
7841c1j2K4O6J37j69M3K17q2l96J87j66n1LK22K12R3k55J12k38j9M7QK61j16L40
7866D37m24n1L8k45L5K73p3J65O7N3j32k70m1j4K52K14j23Jj02j16J77l61J76
7889f4J12l9K81r1j91J36j9l74K61j79j08J76J32Q1M9N4k24p1m2k22L63J13p3
7912F1J47j25m51K34J49j51L4J74l04J39J37l3M1J38l25q2P1QK49K3J9p8p3l96
7936c94N6KM6M73K10l32N0l03j40K61j02K71K04K14k98k15p5j95K73P9oK16P9
7959C74l46rj17j75J98K46n8J10k52j35K88q1j37M5j9J2l8N1p8K47J51k45j06
$$ y = [-54, 44, 14, -247, 51, 119, -108, -30, 26, 63, -2, 35, -72, -317, -197, -12, 12, 234, 55, 38, -52, -204, -16, -148, 11, 107, 42, -100, -62, 135, -48, -10, -226, 109, 178, -1, 27, 226, 77, 172, -25, -55, 14, 102, -77, 19, 187, -138, -31, -43, -19, 47, 184, 15, 58, 275, 193, -203, -16, -182, -233, -230, -8, 204, 297, 42, 154, -84, -103, -56, -48, 213, 97, 437, 13, -38, 0, -245, -210, 63, -10, 155, 222, 275, 143, -127, -168, -182, 70, 284, 161, 162, 60, -56, 121, -240, -64, 48, 9, 290, 199, 8, 144, 125, -249, 12, -167, -275, -99, 33, 114, 163, 217, -7, -78, -120, -342, 21, 134, 61, 208, 83, -368, -134, 15, -136, -102, 72, -232, -93, 44, 11, 52, 190, -135, -217, -146, -138, 111, 134, 153, 75, 2, -394, -338, -336, -290, 183, 393, 61, 111, -192, -332, -71, -173, 98, 302, 516, 218, 3, -72, -267, 6, 85, 79, 295, 374, 28, 19, -98, -273, -75, 171, 113, 223, -29, -164, 124, 43, -94, -49, -68, -56, -94, -43, -121, 126, 277, 32, -74]
7982g4J6k25L61J52M9k11l11j2J94N1l28M92R8j93q7j20j55K83J05kL4N2m71K37
8006f5n3p1L19P9j68kr9k92J99L46j63J84j97M5kj33r2q7M18k79N5j23J58r8K66
8031A45k04J28N9k70M1j2q9K60J40j88J56l15p8L61j87J29J27ml62K28n5l13K18
8054h5K54l7r7N6j94n5J94j54J55J10k45K65n54J43M65n9j24K79l87j95K72O2
8076F9NN0J8o0p6k69l39N05L95k43J59j3m02J85k08j02L00J34M6M0j62k06P1m8
8100a51K9K73n4Q8O2l10O0k38lK9K91j39K48P2j10j65J36l63p0L00j9l0K33Kk20
8125d9j50L6j55N9L28K13J21k43k00k02J54k69oN93k07L09j72j94j00P9K01n7
8147H9J12p0N0k17l8Q6LJ77P3j77o4j30J16j73M22k95k9P4p8m1P4J05N5J26j14
$$ y = [-74, -58, -283, 78, 230, 279, 68, -243, -255, -61, -10, -338, 154, 252, 59, -28, -148, -303, -20, 85, 83, 117, 169, -302, -65, -118, -189, 130, 209, 41, 39, -60, -352, -153, 193, 30, 214, 17, 62, 60, -73, -165, -252, 166, -113, -58, -181, -23, -121, 145, -59, 69, 128, -142, -101, -113, -202, 58, 198, 10, 166, -149, -227, 134, -53, 76, 203, 199, -163, 65, 10, -303, -85, 169, 132, 35, 91, -103, -158, 36, -118, 37, 147, -98, 167, -387, -244, 221, 162, 38, 317, -70, -265, 7, 69, 74, 124, 142, 82, 6, -263, -602, -97, 298, 55, 214, 201, -201, -16, -224, -326, -26, 108, 154, 194, 32, -174, -103, -151, -122, 151, 97, 185, 247, -63, -3, -241, -244, -215, 76, -63, 185, 257, 147, -18, 118, -245, -315, -15, -34, -64, 169, 171, -49, -199, -163, -318, -259, 69, 282, 403, 160, -40, -242, -88, -357, -363, 230, 23, 332, 160, -34, -134, -55, 146, 89, 201, 131, 181, -36, -74, 12, 15, 192, 265, 88, 24, -106, 10, -163, 259, -36, -65, 9, -69, -110, -36, 69, 124, 250, 136]
8172A36k39r0m0J38J15K36k01J38j40K4l20R6J74m2Q3J66j89k1J21
$$ y = [136, -103, -193, -233, -95, 20, 256, 55, 193, 53, 77, -243, -147, 27, -15, 68, 234, 45, 24, 145]
8191A45
$$ Imaginary data points
##PAGE= N=2
##DATA TABLE= (X++(I..I)), XYDATA
0@%%%qJ6j6J6k4L3m3N9p4R0j13J44j76K09k50K93l42M05m71N44o31P28q34R48
27E03j078J224j383J561j753J964k199K457k739L046l384L756m162M609n104N652
43B970o257O929p682Q533r501J0606j1884J3388j5186J7376k0112K3644k8404
56a5580L5192m5707O4266j06291L54901K9352o49355M68258j54557l48054M85079
67A17504L3239m47989M67398J89885m73374l868R4606j89201K42760J78006k22012
78a3046n1553J10415J5011k9764j42493J3927J35808k6385N5775J1329k58654
89a79630J38780K86057k64676j01748J88009j89252N9050K97491k92341j18943
99a77203L60130j21230j64589J64681j83391k8835L71264j19281k14120J54557
$$ y = [0, 0, 0, 0, -8, 8, -8, 8, -16, 17, -26, 33, -41, 49, -64, 80, -96, 113, -137, 156, -186, 219, -252, 292, -339, 389, -445, 503, -575, 649, -734, 827, -926, 1038, -1161, 1296, -1443, 1603, -1781, 1975, -2187, 2422, -2682, 2970, -3287, 3642, -4040, 4493, -5008, 5598, -6286, 7102, -8084, 9292, -10820, 12824, -15580, 19612, -26095, 38171, -68120, 286781, 316133, -333222, 135036, -19521, -367575, 117504, 150743, -297246, 170152, 360037, -113337, -117205, -22599, -211800, 30960, 208966, -13046, -64599, 45816, 60827, 31063, -111430, -97503, 38305, 11920, 67695, 79024, -179630, -40850, 245207, -19469, -121217, 66792, -122460, -63410, 234081, -58260, -177203, 182927, 61697, -102892, 61789, -121602, -150437, 220827, 101546, -112574, 41983]
109D1983q0279k2852J97570k04706q9727K88530p7054r4141J27066k08891P259
120a15242L51706j90747k07519K18460j07360n9560K94091j71443j91834L25652
130A46204k4004k54505J16302l6021q6146K81573L5885k37366K2448L9336n5164
141e1458K9684k6291O971J11256K7053m014j03102j74652J35079J48275j44892
152d6091N7491R3706j87589R8676J35576l16237J2461L08870j49299m4866J84631
163A47329k33430n4088L16632j46880j89816K15447l4202r6265J80420q9526j51459
174a35838J95133L8973j37017K4076l0605j6261J35170j3663q5835K0920j7853
185b2800K5294L6361j11852J6765J36293l8193j4720J0717j44873L6438J60758
$$ y = [41983, -38296, -61148, 136422, -68284, -158011, 130519, 53465, -40676, 86390, -122501, -115242, 236464, 45717, -161802, 56658, -50702, -110262, 183829, 12386, -179448, 146204, 122200, -132305, -16003, -52024, -138170, 143403, 179288, -58078, -35630, 3706, -51458, -21774, -48065, -41094, 70162, 97215, 93201, -9901, -184553, -49474, 98801, -46091, 11400, 105106, -82483, 16193, 151769, -164468, -152007, 156863, 7564, -37302, 147329, -86101, -140189, 176443, 29563, -160253, 55194, 20992, -75273, 105147, 15621, -135838, 59295, 98268, -38749, -14673, -45278, -61539, 73631, 59968, -25867, -4947, -22800, 2494, 38855, -72997, -56232, 80061, 41868, 27148, 37865, -107008, -70570, 90188]
196I0188r4497m1552J05873o4362n676Q1688j35965m0186J63760j2017m2430M0338
208D5162q9946q936J11999o2547m9634O9802j9410K2531M9096j12404j7063J04647
220D3297l6467r256L5865r2775K5875J17185q3735m6347P4944m6720J658P4973
232E8497r2091l1868J21773j4856m8991K6730n9493j2273Q9818k5438m3534M7725
244A5999K325j65J2655o7547j6002O3707K897J886N000m9822K3666M7903n8854
257a6352j7829L7692k0019L0335L6690p3099o031O5222l1171j8965K0048m6614
269d0093J3802P0541l2205k6072L5997j7572p674J7306m8170r071O0512P531o137
282A8695N448l7860n315K5439k8635q784L5367J0378K0652Q588n4711k1897K1991
$$ y = [90188, -4309, -45861, 60012, -4350, -10026, 71662, -64303, -104489, 59271, 47254, 4824, 45162, -44784, -53720, 58279, -4268, -53902, 15900, -3510, 19021, 68117, -44287, -61350, 43297, 6830, -2426, 33439, -59336, -33461, 83724, -11, -46358, 28586, -18134, -16476, 58497, -33594, -65462, 56311, 41455, -7536, 19194, -40299, -52572, 37246, 11808, -31726, 15999, 18324, 18159, 30814, -36733, -52735, 10972, 13869, 15755, 20755, -29067, -5401, 42502, -16352, -34181, 3511, -16508, 13827, 50517, -22582, -28613, 36609, 5438, -13527, 6521, -40093, -26291, 44250, 12045, -14027, 21970, 4398, -3276, 14030, -34140, -43211, 17301, 24832, 18695, 24143, -13717, -19032, 6407, -22228, -31012, 4355, 14733, 35385, 43973, -10738, -32635, -10644]
295a0644j0697N929K3689q499J9446K7088m1034l1707P948n592J8000K7521j8188
308C260j097K4171j7052k0476k492j3753J4170L1590q228r020J1375m293k217
321E938p07k3699n370J9693L756K801R027l579N214M225k3522j8235L097P467
335a3894J9539J8660n646n622l468k0813j6030r6P207K6135K8026j261j5607j5331
349A799k0077q794N297O614J7204K2486M114j2436j6395j6456m260Q130O399P601
363A226J1358N918k181r556j5467r810P18N478Q061J1449J0123N258n147j5921
377A507j7616r113L878J4107J6188J1630K319r375j7028j5458n953Q915J8102
390B103J5673O172p085j6267j4386n996L672J2572J2720M630k472q181j0420k263
$$ y = [-10644, -21341, -15412, 8277, -222, 19224, 46312, 5278, -26429, -18481, -24073, -6073, 21448, 3260, 2163, 26334, 9282, -11194, -13686, -27439, -13269, 18321, 10093, 1073, 12448, 8155, 5938, 5231, -18468, -23838, -4145, -389, 2412, 11439, 7860, 13074, 17299, -6223, -24458, -21361, -13894, 5645, 24305, 18659, 13037, 9569, -11244, -27274, -27370, -20163, 5972, 33998, 32737, 17130, 1799, -18278, -27072, -21775, -15161, 2043, 24529, 28643, 16207, -188, -16644, -20904, -12774, -6375, 1226, 12584, 18502, 16321, 6765, -8702, -18512, -17794, -12316, -4255, 7194, 17317, 22575, 17428, 1507, -16109, -25222, -21344, -7237, 8951, 20581, 22900, 13525, -3503, -18961, -24914, -15999, 2103, 17776, 23948, 16863, 596, -13790, -19786, -16114, -3542, 9178, 13808, 11336, 3155, -7265, -9528]
404i528O171O917N127j442j0461p841O98M495J0009J0814r05q561j1007j2190
418a7704r16J4182J4164J0467J658j5634j8737q393k407J0908K2208J1926R2o330
432A5484j9413j5856K075O162J0594J6021p7r160m354j0158n350J1118M521P02
446B309P473n839q430O334q48l580O754o571r929Q393K149J316J5860r26j2097
461B368j353j4071j0641J8451J1994L968J2001j2788k2881N09n367j031K8602
474I761J2766m788K069k3494k5941J2083Q066M920K6315m72j7398K010j7583j7646
488b9332K4076J2346K19J7153j4910k5383J2374l541j0879K4374K109j1911J8254
501A4949j0421k1792K1473L129j3895J5762j1841k0253K7201N212j2976K0069
$$ y = [-9528, -3357, 3560, 8687, 7245, -3216, -11057, -10359, -5864, 4145, 14959, 14054, 5493, -5514, -17704, -18620, -4438, 9726, 20193, 21851, 6217, -12520, -20913, -23320, -12412, 9796, 21722, 21814, 15484, -3929, -19785, -17710, -11548, -954, 15067, 14990, 5830, 1476, -8682, -14032, -2914, 1607, 2309, 9782, 3943, -4487, 1847, 999, -2581, 4173, -2398, -12327, -3934, -1785, -469, 15391, 14465, 2368, 1015, -13056, -23697, -5246, 6748, 10716, 22717, 9929, -12952, -12443, -17810, -18841, 9761, 22527, 17739, 19808, -3686, -29627, -17544, -9478, -4558, 21757, 21285, 3887, 5897, -11686, -29332, -5256, 7090, 7309, 24462, 9552, -15831, -3457, -6998, -17877, 6497, 8606, -3305, 14949, 4528, -17264, 4209, 7338, -6557, 9205, -2636, -22889, 4312, 9524, -3452, 16617]
513A6617q983k3222J6399j0088j6177L6879J1501j2302J2797k8493l4654K7509
525a2217O654n700L8286r36k3512J4471k8084l5403L6666J7768k339L0433k1587
538A4500l8113K2274p566j9620L6344M837r676K8966k8732l8734L2469L438p399
551g012L5807k4382l1067L9565j3639k8414M4258l545j8553M2770l0681n3226
563d8119M4298R490k0653M5330j1724m3461L8834m559m7022L0674J3396j2213
575e729L8872j1743m5722K0987L725j5049K1374j6670q626M5737j0651k2000K0660
588A5165k9172n471M4811m1721k2872O5943j0756j4126M3307o0765m2678P3387
600A5052j7252l4513P2126p827l2758N3235m9391p6651O2299K1533j7718N8292
$$ y = [16617, 7634, -15588, 811, -9277, -25454, 11425, 22926, 10624, 23421, -5072, -39726, -12217, -5563, -11263, 27023, 26087, 2575, 17046, -11038, -46441, -9775, 7993, 5654, 36087, 14500, -23613, -1339, -8905, -28525, 7819, 12656, 2980, 31946, 3214, -35520, -3051, 387, -7012, 28795, 4413, -26654, 12911, -728, -29142, 15116, 11571, -6982, 35788, 5107, -48119, -3821, 5669, -14984, 30346, 18622, -24839, 13995, 9436, -37586, -6912, 6484, -5729, 33143, 21400, -24322, -3335, 390, -14659, 6715, -9955, -18581, 27156, 16505, -5495, 15165, -14007, -19478, 25333, -16388, -39260, 26683, 15927, 1801, 45108, -15657, -58335, 15052, -2200, -36713, 35413, 27586, -5172, 48063, -1328, -77979, -15680, 5853, -11865, 46427]
612D6427j6813n0263M2373j9202n6070L9083J3016K117N6693l3675n8776L3787
624a303p975j8545M6355k2418j7441O6748k1743n3933L1380j2755r914N9819k9999
637H276m8245M8599K239j9143L0610l1026j6833N5437k1618l2373K6827k1010
649a8260J6560N6054o0463l0623N6018l3697k739N8280o7102r521J02309n3664
661A3152n6649O9293m3593k5801J03759n1020p7417R8568L177o4062N8545k2634
673E318o4132Q1364J5535p5097L0309K5358k1363K7791j6801m8416K2099K2575
685D540Q798N797l3926J4009L6716m4998j1570J9864m1550M5459O8127q4317k0982
698c4033O9730n2784q107O6193p2317j0525J12895m8567o4668N9212l4263j9102
$$ y = [46427, 29614, -20649, 21724, 2522, -53548, -14465, -1449, 668, 57361, 23686, -35090, -1303, -9278, -27823, 18532, -3886, -21327, 45421, 23678, -30255, 1125, -11630, -21544, 38275, 8276, -39969, 8630, 10869, -8274, 22336, -8690, -25523, 29914, 8296, -24077, 2750, -18260, -1700, 54354, -6109, -36732, 19286, -14411, -17150, 41130, -25972, -35493, 66816, 13152, -43497, 25796, -17797, -43598, 60161, 9141, -68276, 30292, 33469, -30593, 27952, 5318, -58814, 22550, 38085, -37012, -6703, 18655, -2708, 25083, 8282, -40134, -18035, 4540, 13338, 19135, -14791, -782, 35934, -9064, -20634, -770, -42320, 3139, 71266, -13051, -34033, 35697, -17087, -25194, 40999, -31318, -41843, 71052, 22485, -42183, 17029, -17234, -36336]
710c6336Q7151m4112o0031P6970O32l6678L4570m0056k2794P7663j7058m6883
722b6962L1560j7406M335N7374n5305m0045O5233j0998j7676L9448m9697j5780
734c5919Q3268k7223n5757L6307j1608l956N7134l6614m3618M8912M885j6059
746b48R292l5942O753N3387k2578j7744Q456l1977L5592M0170p2563o28N9441
759C1411l9186J1930L6394q7873R536R8063o0429l5126O3898m5705n185Q3433
771F1161o6553n6411Q7081k691m0002M0630l2848l0291P2052m736n5603J7530
783a0681P142M797K7692l1315k3122L0835L660L779m877m6633K3702N1840l4469
796B350r150J7855l6833K7206M2151p0122j1706O5918j9795m322K6936o0937n667
$$ y = [-36336, 50815, 6703, -53328, 23642, 24274, -12404, 22166, -17890, -40684, 36979, 19921, -26962, 4598, -12808, -8473, 48901, -6404, -46449, 18784, 7786, -9890, 29558, -20139, -35919, 47349, 20126, -35631, 676, -10932, -14888, 42246, 5632, -37986, 10926, 15811, -248, 9044, -26898, -20145, 33242, 10664, -7080, 1376, -30601, 4991, 45161, -27402, -28030, 31411, -7775, 4155, 40549, -47324, -37788, 60275, -154, -35280, 28618, -17087, -22272, 61161, -5392, -61803, 25278, 22587, -17415, 23215, -9633, -39924, 32128, 27392, -28211, -10681, -3539, 1258, 28950, -2365, -25487, 5348, 9008, 12787, 7910, -38723, -15021, 36819, 2350, -6800, 11055, -25778, 1428, 43579, -26543, -38249, 27669, 7874, 3552, 30488, -30449, -36116]
809c6116P0648k9465l1020L6394j2954N896L7038n1240l0694M5935J103n34J3921
822A8912l9301O462M7233l1213k1968J8129j7492K5371L6526n4844j5960M5509
834A7364j5062l705J6964m5476O916N9889k6212k7286K2220j4532R128K9902m3388
847a3278k0650M3183K688l918M890l4814O121M0006k0587j7851J2910q124K0572
860A1148J9679m5234j0927L3946n500K397M966l5978J1626M2036k2417j5175J4235
873D802j2316J2339J7157m1443r655L7013K866L950K322l5850K987K9488k0393
886f733q772J8956j628J8776J1676m7379j8392K5838J346J0855J3533k2172P640
899C544K3342k9354k2531R169K052K4932K1362l0377j4022J6039p278k435K281
$$ y = [-36116, 34532, 5067, -25953, 10441, -2513, 3383, 40421, -10819, -41513, 4422, 5525, 4991, 18912, -20389, -13927, 33306, 2093, -19875, -1746, -19238, 6133, 42659, -12185, -28145, 17364, 2302, -1403, 15561, -29915, -22999, 36890, 10678, -16608, 5612, -8920, 208, 30110, -13278, -33928, 9255, 11943, 8025, 12915, -21899, -15778, 24228, 3641, -14210, -1300, -9424, 11148, 30827, -14407, -25334, 8612, 3112, 5509, 10475, -25503, -13877, 28159, 5742, -9433, 4802, -7514, 4825, 21982, -19461, -29116, 7897, 10763, 14713, 17035, -18815, -15828, 13660, -6733, -15505, 3451, 1823, 20599, 32275, -15104, -33496, -7658, -6312, 4543, 18076, -4096, 3544, 26886, -2468, -24999, -15830, -13778, 11154, 32516, 2139, -11883, 4156, -3122, -5557, -3276]
912c276j5234J8117K9812j7576j7387L61p906J3627J2784k4953k919K4596P2k604
926G514l045k0429O327K2502j0288j0505O281J550J0637L009k3699p229J4583
939b792O047N736l092j4716R490J1456j4664o107L253m11J7389N616k7228m995
953a5018J5579r95N493M389j5244M301J4756j5560j3964R113O973J0640Q071j7644
967H90j5020O705N524L57J442J891Q075M470j1273j4630o604O886J9078N530j0265
982C056p57Q28o276K61l358o001J5291J4451j0761r482j447m394O163P822q514
997c118k518J1190K302n365l622l892J051P440q41p268j455O907P030k109p349
1012a617l308K84L670M588l183k453Q056J467q970n632j729K054J1650N831p759
$$ y = [-3276, -18510, -393, 29419, 11843, -5544, -5183, -13089, 538, 13322, -11631, -14550, 10046, 10118, 7514, 4469, -15960, -9633, 12869, 2581, -7924, -1643, -93, 10544, 13553, -10146, -17375, -2792, 3255, 8991, 5899, -8817, 673, 12129, -2535, -8642, -5389, -5800, 11589, 17205, -10023, -15018, 561, -434, 5059, 9448, -5796, -1495, 13261, -2299, -16263, -7150, -177, 10463, 18534, 890, -14130, -7425, -1901, -1544, -102, 1789, 9864, 14334, 3061, -11569, -18173, -11287, 7791, 13321, 3056, 2299, 3127, -3149, -2888, -6246, -12247, 3044, 17495, 6734, -2748, -4195, -8589, -2426, 5396, -3118, -5636, 5554, 7856, 2491, -1131, -5023, -3972, 3468, 2627, -4641, -6096, 811, 7841, 5732, -1617, -4925, -4641, -971, 3617, 434, -2019, 6037, 7504, -1466, -7098, -8827, -6773, 4877, 10708, 2949]
1027B949l388K139l622k990O78R09O010P373l806r774m275K535M200K936J031
1042B905j21K02M16l259o553j02O724L090o60o98l922n57M809p66m065J777K058
1059A278q64J483j211l448L054K141l433k456M3K302M437K007k197k607k587n03
1075b561J34j146K501N285P64k439k955n614K56O564J439K20L095l161m548Ml061
1092e223m88P945K780k356K64m342m047M100J642o8M477p13m514r23l376j356
1108f198O244L103L58K260m527n460J969j459L57P465N8k309K566o106o115M836
1124b958O68L66Q675r96n293L332m626o568N261J55j089Q450l09n567L533l767
1140g33n798N421m82j235Q971m52m955K462n660n944O538o38m02J0224j363n257
$$ y = [2949, -439, 1700, -1922, -4912, -4234, -3325, 2685, 10058, 6252, -3522, -7797, -5262, -1062, 1874, 2905, 2784, 2986, 3402, 143, -6410, -6512, 212, 3302, 2642, 1944, -1978, -2535, 2274, 1508, -2557, -780, 1278, 414, 1897, 686, -2762, 292, 2433, -1000, -3456, -3413, -1111, 3326, 5333, 3136, 529, -2058, -2561, -2427, -3573, -1072, 4213, 4977, 2538, -417, -6031, -5775, 789, 2228, 2448, 5543, 2382, -2166, -2162, -5223, -5711, 2234, 5014, 2658, 2922, -1420, -5467, -1367, 275, 207, 4684, 3971, -543, -1466, -4842, -6198, 46, 3149, 3507, 5767, 1240, -4220, -2251, -3710, -3353, 4112, 4170, 1861, 4427, -1679, -7794, -2958, -2290, -1924, 6751, 5755, 462, 3794, -832, -7400, -2139, -1984, -3073, 5377, 5068, -499, 3034, -733, -6531, -1110, -1592, -2827, 6144, 5692, 737, 3199, -2461, -8405, -1867, -2505, -2907, 7317, 5954, 697]
1156F97M056p425o655Q905p71j381J0757l627p475O110o401o341J1190j5l473
1171a849J0964n034r484P926m057o884J1521j177o213J0355m088q777R808j840
1185A171n880J0213l793p834R756l258o945J0584k604n657J0575n889q080J1011
1199C370k825n078J1809n176p161J1130p433q351J2595l772m046J4953p379r026
1213f390J3208p439q465J4424n948o330J7258p499j1424J4052o454q764J7221
1226G450n877r364J7280n116j1978J2874o669r222J7423m303j0787J4445l532
1239B624r051J3451o772r577J5363l230q439J1455p557n398J5615q369q152J4041
1253F004p639l648J5960j3165o611K0091j0387q380J6459j3523o263K4065j2497
$$ y = [697, 4753, -2672, -9327, -422, -1193, -2574, 8183, 4556, -2919, 3191, -3210, -9551, 1639, 1624, -1849, 9115, 4081, -5403, 2523, -1534, -8418, 3103, 1926, -4287, 6068, 1980, -6797, 3011, 1171, -4709, 5504, 1711, -6123, 3633, 375, -6570, 4014, 1410, -4247, 6328, 439, -7641, 3370, 545, -4533, 7276, 2100, -5061, 6069, -1364, -9715, 2880, -892, -4938, 10015, 2636, -6390, 6818, -621, -9086, 5338, -610, -6940, 10318, 2819, -8605, 5447, -1007, -9771, 7450, 1573, -7791, 9489, 4373, -7605, 5269, -1400, -10622, 6801, 2498, -8289, 6156, 2624, -6427, 7024, 252, -9325, 6038, 2808, -5631, 5824, -1733, -7131, 8484, 115, -8037, 6004, -1635, -5283, 10677, -2488, -9099, 10992, 605, -7775, 8684, -4839, -11102, 12963, 466]
1266D66j2459K2158q558j0614K1183j2850j4621K5458n044j5565J7935o705j1613
1279a0829K0705o597j6545J7427p76q146J4293r397j0218J7009n406q908J1456
1292D068q464p54J8683j3470q623J5517j0853j196J7892j8449m767K5202j4111
1305F75r708J7590j6639k997K8179j6055j3250K3224j0894p903K0440j7989j0413
1318a5740K8782q178j3474J7057j3325n715K5581j4331j4638K2465o572o814J8096
1331A3194j7923j1171K7180p931j3238J6984j0350m785K4446j4142j6776J9121
1343D609l844n209J5036j4483p002K1637p588r583Q735j0992M843K0442j7130
1356e29o928J5020j3134L353J4454k5971K566K9919j7883o218J6750k4864K474
$$ y = [466, -11993, 10165, 1607, -9007, 12176, -674, -15295, 10163, 5119, -10446, 7489, 784, -10829, 9876, 3279, -13266, 4161, 3385, -4761, 9532, 135, -10083, 6926, 1520, -7388, 4068, -4396, -5150, 13533, 63, -8560, 6957, -3896, -5092, 12800, -5649, -10416, 14786, 675, -9033, 8557, -8082, -11079, 17100, 1045, -12205, 11019, 125, -7778, 12662, -5327, -15740, 13042, 4864, -8610, 8447, -4878, -10593, 14988, 657, -13981, 8484, 1912, -4902, 13194, -4729, -15900, 11280, 3349, -9889, 7095, -3255, -8040, 16406, 2264, -14512, 4609, 765, -4444, 10592, -3891, -10893, 10744, 3156, -6427, 2308, -8684, -3841, 16601, -529, -7457, 7563, -5571, -2218, 12236, -13735, -11169, 18750, 867, -5351, 11399, -13465, -10991]
1369a0991L2778k4615j2538L0110j3370q463K2086k4435j2471L6465n886j7047
1381h377J6781j0422p241K2533j3043j6668J9581J466j933P879j8725m827K0356
1394G360o679m269R153j2162Q121J7754k5068q688J7981q692N894J6056k5678
1407h917k096K6834j5798j0340J4312j3293O233K5989k1384j4679J6747p749K15
1420c926J3404j9169J312K6172j2379r801N705j6268R766K4543k1178p198J9511
1433A0494j2425l55J1968k6274J045L4240j0489j1232J1373j7459q6K3426j8224
1446c998j2019K3208j78l120O023k1374m728K3688k453o111N239q433O724J1299
1460A3767k1946p120J4900p30R785O007k4762J656J9644j3849m186R125j0729
$$ y = [-10991, 21787, -2828, -15366, 14744, 1374, -7089, 14997, -9438, -21909, 14556, 8670, -8377, 8404, -2018, -9259, 13274, 231, -16437, 3144, 4610, 2677, 10556, -8169, -12996, 7360, 681, -3588, 5565, -6597, 1524, 19278, -5790, -14478, 3503, -5189, 705, 16761, -8917, -11013, 15821, 23, -10317, 3995, -9298, -3065, 22924, 1540, -13139, 3608, -4141, -3926, 9478, -9691, -8379, 17793, 5414, -4387, 1318, -14950, -5184, 19359, -1819, -9017, 10494, -1931, -2286, 9682, -16592, -15547, 18693, 8204, -3028, 8345, -9114, -9200, 14226, -3998, -16017, 7191, 7013, 3893, 9916, -11458, -16186, 7502, 5049, -1062, 4177, -4256, 2468, 13767, -8179, -15299, -399, -1129, 8656, 14663, -10099, -8443, 11201, -2648, -6834, 2291, -8438]
1473h438J2172J8557k5156j2057J4673m875N502J0978j8452J990K1391j2236j0753
1486f704K871r489J3084J8847j8536p766J1826p128L419N688k0473O402K6115
1499A8156j0833r535L449j3988P465J9822j7405q634J8245j404k303K874j8030
1512a2121o03K2377j604q760M18n304O885Q475j4929n666J0168L228P323k602
1526G285j8688N260J4362q008j930J064q149J3577J0775k0935n732J1748k266
1539a637O264M399j8110L203J7549q878p596J364n591J1239J2315j5489p403R279
1553I08j138L738R80j4764N381J6836p184p442l33o663R811J2355j4350o680J1473
1568B928O14k78Oj2653J681J6140j376r013k358m72P024N034q942m934M899N277
$$ y = [-8438, 3734, 22291, -2865, -14922, -249, -5124, 378, 11356, -7096, -5106, 16285, 4049, -6704, -3833, -13322, -238, 18609, 73, -7693, 4133, -2995, 424, 6112, -14361, -7959, 18156, 7323, -2212, 1237, -12751, -5286, 14536, -2869, -11503, 6742, 5338, 3035, 5909, -12121, -12724, 9653, 8049, -711, -293, -5597, 1288, 9763, -5166, -10832, -664, 2564, 9887, 7285, -11403, -6143, 8219, 211, -1719, -655, -8804, 4773, 15548, -5387, -11119, 629, -1637, 4627, 9026, -9084, -5881, 11668, 2790, -4806, -3442, -9033, 2206, 14521, -968, -8371, 908, -230, 3508, 4488, -10276, -4895, 11941, 4757, -2685, -3018, -9681, 130, 12485, -1865, -8545, 2928, 3542, 3264, 3270, -9383, -7702, 8438, 7062, -1951, -4309, -4781, 2243, 7277, -1665, -6599, -1700, 3577]
1584C577M694p025j1211P381Q461m512p89l690n476J4097N686j6596q24Q122k692
1599g97N150J093j4873L876J5373o217p886J644k752N758R311q706p902O634M469
1614D175r41m251o315L650R057O23m717o304p59R370J977r078J62M732Q86L990
1630F257m598j2287N479J1329l715l204N60k667N332M742r816n708P230N153J43
1645D230k902n686P84O357J96m556l480K706Q132r2p304j511O46K156N059m793
1661e8p335O596O771m153k108j603k950O692M845q670k815N895J398o13j218n524
1677d850P13P632P24n454k291K551M300L46m285k802L72M398K657n592l677O019
1693G61L032j986p50l928j643P373J557o842M0L974k66N58k030n717K378P201
$$ y = [3577, 8271, 1246, -9965, -2584, 5877, 1365, 576, -3114, -8590, 5507, 11193, -5403, -6227, 1895, -797, 4353, 5446, -9427, -5551, 9822, 3605, -4281, -2637, -5389, 369, 9680, 974, -6928, -294, 4175, 3234, -1017, -7332, -3682, 5375, 5998, 1281, -5023, -5782, 3588, 5565, -3513, -3351, 1381, 2267, 6257, 1659, -10628, -5149, 6180, 2465, -739, -179, -2846, 2486, 7228, -2588, -8296, -1066, 4087, 4230, 1328, -4358, -3574, 2783, 2979, -1577, -5057, -2351, 5781, 5689, -1615, -3126, -2480, -324, 4735, -58, -7393, -797, 5974, 1821, -287, -1890, -4840, 1852, 6697, -1973, -4788, 1107, 2505, 1892, 674, -4850, -4137, 3495, 4219, -1235, -3526, -975, 3325, 3671, -614, -3416, -3044, 1354, 4011, -1581, -5258, 761, 3793, 1807, 1057, -2871, -4514, 2859, 4416, -2426, -2386, 1588, 1322, 1880, -150, -5867, -3489, 3712]
1709C712l12l287l76L42J351j91l506k225K532N020J427m408k338K003R8K16M99
1726E57l051J430O358k080n702N14j8p2M659j291m344L883K764l347q19o90j002
1743b251L893J618m428j635J705J910J104j398j663J737M62p67r79k441K044N105
1759D016j445l280J90k259M7M053j944q83N659k30l906q1l269j797N443K002k262
1776E4K309l59k809R00k017k366M193K571l93R00k777k366K077j541j657L331
1792E0L23P42L395l338l487K898j971j555L845j254r22N270j988m330J959j790
1808b153j152N224k52j917M103k136l885J574k370q67O129j07j968K980l536k908
1824c241L650j621j084O265j912l204L257m156k884O271n03j881N229k830m445
$$ y = [3712, 3400, 113, -263, 79, 1430, 1239, -2267, -4492, -1960, 3060, 4487, 79, -2259, -256, -158, 58, 557, -2494, -1064, 5294, 3214, -2488, -1974, -1992, -2064, 2595, 1304, -3040, 843, 3607, 260, -559, -1249, -2251, 1642, 3260, -1168, -2803, -1098, 812, 1916, 518, -1145, 592, 1054, 287, -692, -3133, -1089, 4016, 2571, -709, -519, -2778, -2731, 1322, -622, -1505, 4154, 3924, 18, -63, -3332, -5129, 314, 2316, 54, 2363, 2004, -805, 95, -1922, -4288, -95, 2476, 2083, 2983, 206, -2160, -83, -1624, -3281, 50, 373, 1115, 4510, 1172, -2315, 583, -1388, -2943, 902, -352, -1274, 3996, 2008, -2322, -363, -2153, -3305, 1919, 1667, -250, 3853, 1717, -2168, -594, -2964, -3831, 2298, 2191, 223, 3203, -333, -3241, 409, -1212, -2296, 3969, 2057, -1147, 2110, -2046, -4930, 1341, 838, -1043, 4186, 1356, -3089]
1839c089M301j944k652N990m48l154L391l308l639N040m16j257M990k559l077
$$ y = [-3089, 1212, -732, -3384, 2606, 2158, -996, 2395, -913, -4552, 488, 72, -1185, 3805, 1246, -1831]
$$ [...]
8191f1
##END NTUPLES=NMR FID
##END=
