##TITLE=1H_AM_NVBENZ_TOL
 CDCL3
 8 sc, 
 11.04.2022
##JCAMPDX= 6.0         $$ Bruker NMR JCAMP-DX V2.0
##DATA TYPE= NMR FID
##DATA CLASS= NTUPLES
##ORIGIN= UXNMR, Bruker Analytische Messtechnik GmbH
##OWNER= root
$$ XWIN-NMR		Version 3.5
$$ Mon Apr 11 13:49:50 2022 Russian Standard Time (UT+4h)  she@DPX200
##.OBSERVE FREQUENCY= 200.13135
##.OBSERVE NUCLEUS= ^1H
##.DELAY= (6, 6)
##.ACQUISITION MODE= SIMULTANEOUS
##.ACQUISITION SCHEME= undefined
##.AVERAGES= 8
##.DIGITISER RES= 18
##SPECTROMETER/DATA SYSTEM= spect
##.PULSE SEQUENCE= zg30
##.SOLVENT NAME= CDCl3
##.SHIFT REFERENCE= (INTERNAL, CDCl3, 0, 15.7039)
##AUDIT TRAIL= $$ (NUMBER, WHEN, WHO, WHERE, WHAT)
$$ ##TITLE= Audit trail, XWIN-NMR		Version 3.5
$$ ##JCAMPDX= 5.01
$$ ##ORIGIN= Bruker BioSpin GmbH
$$ ##OWNER= she
$$ F:/spectra/data/she/nmr/H-F/1/audita.txt
$$ ##AUDIT TRAIL=  $$ (NUMBER, WHEN, WHO, WHERE, WHAT)
(   1,<2022-04-11 13:48:47.57 +0400>,<she>,<DPX200>,
      <created by zg, POWCHK disabled, PULCHK disabled
       configuration hash MD5:
       00 E9 B6 7A A2 85 ED C7 34 08 36 98 17 FE 4E 26
       data hash MD5: 16K
       4F A1 2C F6 6E 60 99 FA 3F 2D 83 10 8B 0D 01 BE>)
$$ ##END=
$$ 
$$ hash MD5
$$ 5D D4 07 8F 19 EE AA E5 E5 9D 9D EF 27 98 C2 E2
##$RELAX= 
##$RELAX= 
##$RELAX= 
##$RELAX= 
##$RELAX= 
##$RELAX= 
$$ Bruker specific parameters
$$ --------------------------
##$DU= <F:/spectra>
##$EXPNO= 1
##$NAME= <H-F>
##$PROCNO= 1
##$TYPE= <nmr>
##$USER= <she>
##$AMP= (0..31)
100 100 100 100 100 100 100 100 100 100 100 100 100 100 100 100 100 100 
100 100 100 100 100 100 100 100 100 100 100 100 100 100 
##$AQSEQ= 0
##$AQ_mod= 1
##$AUNM= <au_zg>
##$AUTOPOS= <>
##$BF1= 200.13
##$BF2= 200.13
##$BF3= 200.13
##$BF4= 200.13
##$BF5= 200.13
##$BF6= 200.13
##$BF7= 200.13
##$BF8= 200.13
##$BYTORDA= 1
##$CFDGTYP= 0
##$CFRGTYP= 5
##$CHEMSTR= <none>
##$CNST= (0..31)
1 1 145 1 1 1 1 1 1 1 1 1 1 1 1 1 1 1 1 1 1 1 1 1 1 1 1 1 1 1 1 1 
##$CPDPRG= <>
##$CPDPRG1= <>
##$CPDPRG2= <>
##$CPDPRG3= <>
##$CPDPRG4= <mlev>
##$CPDPRG5= <mlev>
##$CPDPRG6= <mlev>
##$CPDPRG7= <mlev>
##$CPDPRG8= <mlev>
##$CPDPRGB= <>
##$CPDPRGT= <>
##$D= (0..31)
0 1.2 0 0 0 0 0 0 0 0.06 0 0.03 0 0 0 0 0.0002 0 0 0 0 0 0 0 0 0 0 0 0 
0 0 0 
##$DATE= 1649670527
##$DBL= (0..7)
120 120 120 120 120 120 120 120 
##$DBP= (0..7)
150 150 150 150 150 150 150 150 
##$DBP07= 0
##$DBPNAM0= <>
##$DBPNAM1= <>
##$DBPNAM2= <>
##$DBPNAM3= <>
##$DBPNAM4= <>
##$DBPNAM5= <>
##$DBPNAM6= <>
##$DBPNAM7= <>
##$DBPOAL= (0..7)
0.5 0.5 0.5 0.5 0.5 0.5 0.5 0.5 
##$DBPOFFS= (0..7)
0 0 0 0 0 0 0 0 
##$DE= 6
##$DECBNUC= <off>
##$DECIM= 32
##$DECNUC= <off>
##$DECSTAT= 4
##$DIGMOD= 1
##$DIGTYP= 9
##$DL= (0..7)
0 120 120 120 120 120 120 120 
##$DP= (0..7)
150 150 150 150 150 150 150 150 
##$DP07= 0
##$DPNAME0= <>
##$DPNAME1= <>
##$DPNAME2= <>
##$DPNAME3= <>
##$DPNAME4= <>
##$DPNAME5= <>
##$DPNAME6= <>
##$DPNAME7= <>
##$DPOAL= (0..7)
0.5 0.5 0.5 0.5 0.5 0.5 0.5 0.5 
##$DPOFFS= (0..7)
0 0 0 0 0 0 0 0 
##$DQDMODE= 0
##$DR= 18
##$DS= 0
##$DSLIST= <SSSSSSSSSSSSSSS>
$$ [...]
##$SUBNAM2= <"">
##$SUBNAM3= <"">
##$SUBNAM4= <"">
##$SUBNAM5= <"">
##$SUBNAM6= <"">
##$SUBNAM7= <"">
##$SUBNAM8= <"">
##$SUBNAM9= <"">
##$SW= 18.05172834244
##$SWIBOX= (0..15)
0 0 2 0 0 0 0 0 0 0 0 0 0 0 0 0 
##$SW_h= 3612.71676300578
##$TD= 16384
##$TD0= 1
##$TE= 0
##$TE2= 300
##$TE3= 300
##$TEG= 300
##$TL= (0..7)
0 120 120 120 120 120 120 120 
##$TP= (0..7)
150 150 150 150 150 150 150 150 
##$TP07= 0
##$TPNAME0= <>
##$TPNAME1= <>
##$TPNAME2= <>
##$TPNAME3= <>
##$TPNAME4= <>
##$TPNAME5= <>
##$TPNAME6= <>
##$TPNAME7= <>
##$TPOAL= (0..7)
0.5 0.5 0.5 0.5 0.5 0.5 0.5 0.5 
##$TPOFFS= (0..7)
0 0 0 0 0 0 0 0 
##$TUNHIN= 0
##$TUNHOUT= 0
##$TUNXOUT= 0
##$USERA1= <user>
##$USERA2= <user>
##$USERA3= <user>
##$USERA4= <user>
##$USERA5= <user>
##$V9= 5
##$VALIST= <valist>
##$VCLIST= <CCCCCCCCCCCCCCC>
##$VD= 0
##$VDLIST= <DDDDDDDDDDDDDDD>
##$VPLIST= <PPPPPPPPPPPPPPP>
##$VTLIST= <TTTTTTTTTTTTTTT>
##$WBST= 1024
##$WBSW= 4
##$XGAIN= (0..3)
0 0 0 0 
##$XL= 0
##$YL= 0
##$YMAX_a= 42444
##$YMIN_a= -39229
##$ZGOPTNS= <>
##$ZL1= 120
##$ZL2= 120
##$ZL3= 120
##$ZL4= 120
##$ABSF1= 10
##$ABSF2= 0
##$ABSG= 5
##$ABSL= 3
##$ALPHA= 0
##$AQORDER= 0
##$ASSFAC= 0
##$ASSFACI= 0
##$ASSFACX= 0
##$ASSWID= 0
##$AUNMP= <proc_1d>
##$AZFE= 0.1
##$AZFW= 0.1
##$BCFW= 1
##$BC_mod= 2
##$BYTORDP= 1
##$COROFFS= 0
##$CY= 11.3945322036743
##$DATMOD= 1
##$DC= 2
##$DFILT= <>
##$DTYPP= 0
##$F1P= 2.36226072786647
##$F2P= -0.459571619588291
##$FCOR= 0.5
##$FTSIZE= 0
##$FT_mod= 4
##$GAMMA= 1
##$GB= 0.15
##$INTBC= 1
##$INTSCL= 1
##$ISEN= 128
##$LB= 0.24
##$LEV0= 0
##$LPBIN= 0
##$MAXI= 10000
##$MC2= 0
##$MEAN= 0
##$ME_mod= 0
##$MI= 1.114404
##$NCOEF= 0
##$NC_proc= 0
##$NLEV= 6
##$NOISF1= 3.799351
##$NOISF2= 2.8
##$NSP= 1
##$NTH_PI= 0
##$NZP= 0
##$OFFSET= 15.70392
##$PC= 1
##$PHC0= -18296.34
##$PHC1= 10.00078
##$PH_mod= 1
##$PKNL= yes
##$PPARMOD= 0
##$PSCAL= 0
##$PSIGN= 0
##$REVERSE= no
##$SF= 200.130013532006
##$SI= 16384
##$SIGF1= 3
##$SIGF2= 2
##$SINO= 400
##$SIOLD= 16384
##$SREGLST= <1H.CDCl3>
##$SSB= 0
##$STSI= 0
##$STSR= 0
##$SW_p= 3612.71676300578
##$SYMM= 0
##$S_DEV= 0
##$TDeff= 0
##$TDoff= 0
##$TI= <>
##$TILT= no
##$TM1= 0
##$TM2= 0
##$TOPLEV= 0
##$USERP1= <user>
##$USERP2= <user>
##$USERP3= <user>
##$USERP4= <user>
##$USERP5= <user>
##$WDW= 1
##$XDIM= 8192
##$YMAX_p= 0
##$YMIN_p= 0
$$ End of Bruker specific parameters
$$ ---------------------------------
##NTUPLES= NMR FID
##VAR_NAME=  TIME,          FID/REAL,        FID/IMAG
##SYMBOL=    X,             R,               I
##VAR_TYPE=  INDEPENDENT,   DEPENDENT,       DEPENDENT
##VAR_FORM=  AFFN,          ASDF,            ASDF
##VAR_DIM=   8192,          8192,            8192
##UNITS=     SECONDS,       ARBITRARY UNITS, ARBITRARY UNITS
##FACTOR=    0.0002768,     1,               1
##FIRST=     0,             0,               0
##LAST=      2.2672688,     0,               0
##MIN=       0,             -39229,          0
##MAX=       2.2672688,     42444,           0
$$ Real data points
##PAGE= N=1
##DATA TABLE= (X++(R..R)), XYDATA
$$ [...]
1392A509k72j553p22P55J321J010O6j234j722o60J176J782K37j603j497J10R82
1409c15N39k82o28p93k01J129J713L77j513j737PJ644J510J79p18q24m92L80J181
1428A156N63j132j678j64J567J360l95j703j436j34R75J345Q06o47j669o18J321
1445d83J655l7j397r36M97J337J037q0j082j483n81J175J881M15j444j552K0R99
1463e9N97j96p14p94r7R59J367L64j339j693j12J625J452J13q41q87m79L41J067
1482F74N41q02j380k84J375J422j75j612j331q8R17J258P09o48j584p29J090J596
1500I49K52j099j073M06J338R97j45j028j412o62R95J700M19j378j605k26J021
1517e51Q66p1p64o28K1Q10J295L89j180j598q5J532J454J56q16r69m04M22Q84
$$ plain form
1392 1509 1237 -316 -1038 -283 1038 2048 2114 880 -842 -1502 -326 1456 1693 90 -1407 -1297 -315
1409 -315 224 -58 -686 -1479 -1680 -551 1162 1539 26 -1711 -1704 -60 1450 1629 911 87 -405 -25 1156
1428 1156 1719 587 -1091 -1255 312 1672 1277 -426 -1862 -1996 -1021 324 1130 483 -1186 -1804 -483
1445 -483 1172 1135 -262 -1198 -701 636 1673 1593 511 -972 -1553 -378 1503 1918 474 -1078 -1058 -59
1463 -59 538 342 -372 -1166 -1263 -304 1063 1427 88 -1605 -1717 -92 1360 1473 632 -255 -734 -393 674
1482 674 1215 413 -967 -1251 124 1546 1371 -241 -1572 -1660 -743 515 1224 576 -1008 -1737 -647 949
1500 949 1201 102 -971 -565 773 1770 1625 597 -815 -1477 -482 1218 1637 259 -1346 -1572 -551
1517 -551 315 244 -520 -1148 -1127 -317 978 1367 187 -1411 -1496 36 1490 1646 830 -139 -543 -121 763
1536G63M61o19j322m56J105J277j37j511j199q9R06J295O53n56j381p43P57J486
1554F90N27j088j129J90J213R55N1q81j258n27J021J664N49j183j657m80R50R13
1572E20j37q34o98p5P03J189L93j032j422j27J381J546K53r60j049k96M53P82
1590E90M78m53j205m93R52J222m3j279j199j52R30J166N05n12j190p83N95J526
1608F55O07q24j053M6J021R24L5r51j208m78P90J446N98j042j654n16R63J063
1626D22J01p47p15j28O80J053K99r24j290k91J286J588L18r31j017k31M88Q01
1644G62M58m62j100n37P07J009N5j173j233j03R56J118M88m35j122p77N16J360
1662D87O63o64j084j80R23R95R4q51j013m06P06J401O99r57j591o58P94J091K32
$$ plain form
1536 763 1224 605 -717 -1173 -68 1209 1072 -439 -1638 -1727 -821 474 1127 571 -810 -1553 -796 690
1554 690 1217 129 -1000 -810 403 1358 1409 528 -730 -1257 -236 1428 1977 794 -863 -1343 -393 520
1572 520 383 -451 -1149 -1224 -521 668 1061 29 -1393 -1520 -139 1407 1660 700 -349 -645 -192 590
1590 590 1068 615 -590 -1083 -131 1091 1048 -231 -1430 -1582 -652 514 1019 507 -683 -1466 -871 655
1608 655 1262 438 -615 -569 452 1376 1411 460 -748 -1226 -436 1010 1608 566 -1088 -1604 -641 422
1626 422 523 -224 -939 -1067 -387 666 965 41 -1249 -1540 -254 1334 1652 721 -296 -527 -39 762
1644 762 1220 758 -342 -879 -172 837 892 -281 -1514 -1617 -661 457 945 510 -612 -1389 -873 487
1662 487 1150 486 -598 -778 145 1140 1234 383 -630 -1036 -330 1071 1770 813 -778 -1436 -642 449 681
1681F81p39q54j50O29R22L88p33j244l16J177J496L35r49j091l71N39R00M19l83
1700F56r15m77N76J029J70j062j209j67Q49R88L73n30j107o88M92J275P92m04
1718F41r79k55Q50R65R5p54j046m71N91J233O27q36j490p20P15J205L75o36q57
1737g47k06N34Q56L56o60j186l13J049J460M34q63j170l27N93Q88M19m35q84n99
1756h01M09R87K50r81j073j74Q97J056L97n30j026o06L54J123P32m22j066l38
1774h12O95R02K17o23q62l41O54J128N99o48j447q11N08J208M18o40q88l41M89
1793e95Q91M16n65j025l71Q77J374M78q49j299l49O54R53M73l08q77m93M56R29
1812G70K47p68j125l26P96R63K53o70r81n47L94J113Q37l45r18l63N65R08K52
$$ plain form
1681 681 -58 -912 -1062 -433 489 877 144 -1100 -1416 -239 1257 1592 643 -448 -819 -280 620 1039 656
1700 656 -259 -736 -160 869 1039 -23 -1232 -1399 -550 438 811 281 -826 -1514 -1022 253 1045 641
1718 641 -338 -593 257 1222 1317 563 -483 -954 -363 870 1497 661 -829 -1549 -834 371 746 110 -747
1737 -747 -953 -419 437 793 133 -1053 -1366 -317 1143 1577 714 -456 -783 -190 698 1117 682 -202 -801
1756 -801 -392 595 845 -136 -1209 -1383 -486 570 967 437 -589 -1195 -841 282 1014 592 -474 -812
1774 -812 -117 785 1002 379 -483 -824 -170 958 1557 909 -538 -1349 -841 367 785 145 -743 -1084 -595
1793 -595 296 712 147 -878 -1249 -372 1002 1480 631 -668 -1017 -363 590 1063 755 -122 -615 -159 770
1812 770 1017 249 -876 -1202 -406 557 810 140 -841 -1388 -994 119 956 611 -307 -670 -105 803 1055
1831A055o65q71l16N37R91N35n36j280p47N61J180N32n40r14m38L98P89L57n01
1850A27r27m08P26J357N48p55j209m16O03R61M69l95r17o01L56Q76L94o50j037
1869h98k04Q21J074L04o48r53n32L51R89O51l63r57n12M54Q88L31n54p66k32N43
1889b13R23N15n19j174p94M93J076N84m13q87m81M08P86M37l94q60m80N78J176
1908G61N17p08j176n29N70J074N46l61q50n03L03Q20L93n63j083l37O56R84K93
1927H07o27r77m23M38J055O97k41q50n57M38Q85K74n36p73k89M45Q64M48m95j031
1947d48o85L67J071O42l71r43n54L11O93M13k43q07m48N39J076N61n25j095n88
1966a034N57R93N58l46q73n93K35Q17N39m67r25l40N91R73L68o44j032n18M02
$$ plain form
1831 1055 390 -481 -797 -260 731 1266 730 -550 -1297 -736 444 976 436 -478 -916 -518 271 628 127
1850 127 -800 -1208 -482 875 1423 668 -541 -957 -354 607 1076 681 -236 -837 -481 395 789 139 -898
1869 -898 -1102 -281 793 1097 449 -504 -1036 -685 304 955 592 -365 -877 -423 465 796 242 -524 -756 -213
1889 -213 710 1225 706 -468 -1262 -769 307 891 478 -409 -890 -482 304 741 347 -513 -993 -415 761
1908 761 1278 570 -606 -1135 -565 509 1055 694 -156 -659 -356 464 857 294 -789 -1126 -470 514 807
1927 807 180 -797 -1220 -782 273 970 729 -121 -678 -240 645 919 383 -390 -679 -234 630 1078 583 -448
1947 -448 -1133 -766 305 947 576 -367 -921 -610 83 496 253 -554 -1002 -463 613 1174 649 -446 -1034
1966 -1034 -477 516 1074 728 -145 -738 -503 314 853 386 -539 -879 -288 685 1053 409 -623 -1141 -739
1985g39Q94O45k49r26n85L74Q80M13l99o70k41M78Q58L90m53r40o71L04R88O38
2005I89l88r09n51K41O91M74k79p43m55M58R40N55m54j066n82N16J019O12k68
2024H00q54o28K10P74M93l67q84n06N01R83L72n58r28m62M12R75O46k20r20n78
2044g39K49P75M35l75p98k99M50P52M16l72r16n44L67R88O36l13q67n78J84O95
2064A46M17k95o74m20K62Q50N48l35r57n62M76J015O45k84q20o30J53P45N19k77
2084E22q61n35M28Q59M10n07r39n23M19R01O15k20q24o02K36Q43N58k88o90l16
2104e14M12P23L77l78q63n95K80Q60N78k48q92o28K03P30M41j78o05m60K46P92
2124B81N08l51q83n65L65R42O79j97p89n72J48P34N83j88p99n67K73P78L81m22
$$ plain form
1985 -739 155 800 551 -375 -960 -586 294 707 308 -362 -603 -125 733 1123 670 -270 -941 -637 351 989
2005 989 601 -308 -859 -618 73 547 268 -475 -930 -472 468 1023 569 -497 -1079 -563 456 1068 800
2024 800 -54 -682 -472 302 795 428 -456 -962 -461 522 894 336 -592 -1054 -642 333 979 759 -161 -739
2044 -739 -490 285 720 345 -453 -752 -302 450 866 494 -422 -966 -599 389 1025 712 -155 -733 -549 146
2064 146 563 268 -406 -826 -564 286 834 499 -458 -1020 -544 471 1116 832 12 -618 -465 280 799 522
2084 522 -339 -874 -446 413 823 316 -623 -1146 -727 174 789 569 -255 -857 -621 222 780 492 -198 -514
2104 -514 -102 621 998 620 -243 -838 -558 302 880 632 -260 -888 -685 45 486 308 -297 -757 -511 281
2124 281 789 438 -445 -1010 -645 297 976 779 -10 -582 -434 300 883 695 -104 -671 -398 380 761 339
2144C39r37n30L55Q83O08j41q04o25J98Q21O00k51p24m37L58P13M14l51p76m83
2164g70K88Q63O44k74q28o31J55O23M50k06o26m85K00P06N00k13q16n43L53Q99
2184B89O31k03p78o03O5O86O07n8o55n17J94P72N08l23q96n82K29P86N56k16q11
2205c19o92J71P57O65j07o55m01L03P31M36l10p47n77J98P91O12k38p95o22J57
2225f42O64N60j59n90m55J86O10M56k07p59n36K58Q79N85j00p35o01N8O35N91
2245F98q5o43n62M9O72M64k35p65n14K52Q15O59j04p49o57O9O87O03p7o86n28
2266f37J63O94M82k25o87m40J90Q11O03j89q04o45j8O82N00j42n93m22J13O39
2286G5N13j36o65n12K38P46O14j63p18o44P8O04N84L6n61n43N1O05M47j88o90
$$ plain form
2144 339 -598 -1128 -773 110 718 577 -227 -852 -654 167 767 516 -208 -645 -287 426 840 489 -287 -770
2164 -770 -482 381 1025 751 -77 -708 -553 70 520 314 -312 -797 -597 109 609 396 -420 -963 -610 289
2184 289 920 717 -61 -664 -599 87 694 636 -19 -536 -342 430 938 615 -281 -863 -634 152 708 492 -319
2205 -319 -1011 -840 -83 582 475 -180 -581 -278 453 889 579 -168 -745 -547 244 856 618 -177 -799 -642
2225 -642 22 582 423 -167 -622 -436 174 630 423 -336 -872 -614 265 850 750 15 -586 -528 107 698
2245 698 613 -30 -592 -543 129 593 358 -407 -921 -669 146 805 701 -48 -705 -636 51 654 577 -109 -637
2266 -637 -474 220 702 477 -210 -650 -460 351 954 765 -39 -684 -702 -20 480 338 -255 -677 -564 75
2286 75 588 452 -213 -725 -487 259 873 710 -8 -652 -574 30 614 650 89 -454 -403 202 649 461 -229
2307b29o03J44O96O05r5p14o22L3O90P07K3o02n20J32O26M77j80o96n47J82P15
2328B22N56o7p35o49L3O74N67q2o23m95Q0N18M43j44o19m68J70P18P03q3o85n41
2350e07K7O00N34K3n86n75l8N68M90j25o21n12J43O90N99o9o80o29m1O31O33L4
2372E89n76n58O2N85N78j43o56m90J13O81N61q9p56o85L9O64N67j1n44m80R7N41
2394H9N00j06n47n14Q0O51N89r2o93n86L6N97N77N3n28n13l0M26N33n9o47n62
2416g46J18O32N08Po22o00j6O30O39J36n44n36m9N87N08p0n84n12K4O52N59o4
2438F57o68o64l9N54O11K4n76n47K1N38M84J0n13m62J25O20N91j6o40n76l5N91
2460I0N24L9n19n39j18M52N02%n69n07L9N68N93j1o06o03m0N60O49J41n14n53
$$ plain form
2307 -229 -832 -688 8 613 518 -196 -818 -785 -95 612 635 33 -487 -355 271 748 568 -128 -675 -493 222
2328 222 778 711 -24 -673 -640 34 601 519 -104 -599 -519 -1 442 298 -321 -789 -619 99 802 719 34 -507
2350 -507 -480 120 654 677 91 -484 -522 46 536 411 -210 -722 -579 111 710 641 -39 -668 -709 -78 555 589
2372 589 13 -545 -483 102 680 537 -119 -609 -496 185 746 657 -99 -784 -745 -81 486 475 -69 -549 -452 89
2394 89 589 483 -64 -578 -498 153 742 650 -43 -629 -593 4 581 634 106 -407 -437 -11 522 463 -184 -746
2416 -746 -628 4 512 519 -103 -703 -719 -89 550 686 142 -394 -443 144 652 582 -2 -514 -490 162 721 657
2438 657 -11 -675 -714 -160 451 475 -101 -648 -627 -89 395 405 -108 -570 -445 175 766 750 110 -466 -501 90
2460 90 614 653 134 -405 -523 -71 431 431 -138 -645 -606 -38 555 544 -62 -665 -705 -145 504 645 131 -422
2482d22r1N25N79l5m86n52M6O34N17j0o12p02p9N76O07M8n80n48n6M69N30jm84
2505a27m67N3O07O07Qn62o25J6N68N73P3m95n85j45L90N08Pn03n09l9N71N76l
2528D97n25n93m1N46O36J58m50n58j01M47N40M2n32n37pM94N38Rn65o59p4N82
2550a53O03J14m82n35j51M92N15L4m73n03PN29N68M7n36n79j6N42N97J25m67n80
2572c02j58L69M56Q1m84n55n5M98N51K2n02n75q1N59O12J83m18n72j38M47N60
2593D98J04m35n48mM75N06O1n40o40j47M91N91J19n02n65j40M36N38Q8l57n11
2614d82k9M80O01P3n55n59r3M99O16J33m44n53j44M05M82J00l97n81m9L84M83
2635C70N1m74n72r9M61O16J86l59n32j57M13N52J28l75n35r6L91N18J08m95n58
$$ plain form
2482 -422 -513 12 591 556 70 -482 -436 198 715 705 93 -609 -688 -112 495 543 -37 -585 -641 -172 358 357 -127
2505 -127 -594 -541 66 673 681 119 -506 -490 78 651 724 229 -356 -501 -111 397 404 -99 -608 -647 -76 500 497
2528 497 -28 -621 -662 -116 520 678 228 -330 -431 16 556 598 66 -471 -478 16 554 563 -2 -661 -735 -153
2550 -153 450 564 82 -453 -604 -112 403 437 -36 -539 -532 -3 565 612 76 -503 -519 23 620 745 278 -302
2572 -302 -460 -91 365 446 -38 -593 -648 -150 401 423 -79 -654 -735 -176 436 619 201 -371 -509 -62 498
2593 498 602 167 -381 -385 90 596 657 117 -523 -670 -179 412 531 29 -536 -676 -240 298 386 29 -482
2614 -482 -511 -31 570 643 88 -471 -564 -65 551 684 240 -313 -457 -52 430 530 133 -448 -497 -113 370
2635 370 421 -53 -625 -724 -263 353 539 180 -352 -509 -96 456 584 209 -326 -422 -31 487 595 100 -458
2656d58j41M61O26J57m01o25j80L75M94J24l55n33j09M66N33J20m67n49j24M73
2676a13O14J26m30n63j82L66N02J28l43n05q2M07N40Q0m74n40j14M54N09J85l70
2697A95n74j80L61N41J80l16n00j08L75N23O6m43n85j77M07N51J98m14n90j51
2717f41L43N70K33l78m42j11L80N14J55m63n72j73M77N79J58l83n50j96L27N16
2737C43J52l78n19j41L27N21J05l93n45p2L84N91K30l36n27j91L58M18K08l33
2757B02n00j44L71M64J09l44n31j51L58N57J98l96n65k51K85N43J52k89m71j29
2777e32L63N37J67l24n50j13L71N77J96l86n70k46L27N09J76l19m67k32L74M47
2797C05J48l88n36j57M03N23K11l47n07j87K84N37K34k70m70j64K85M89J34l83
$$ plain form
2656 -458 -599 -138 488 645 244 -381 -561 -186 308 432 77 -456 -565 -99 434 554 87 -462 -586 -113
2676 -113 501 627 197 -366 -548 -182 320 448 105 -400 -482 -75 465 545 71 -469 -583 -129 380 565 195
2697 195 -379 -559 -198 343 523 207 -293 -401 -26 497 563 120 -465 -642 -235 316 514 100 -490 -641
2717 -641 -298 272 505 127 -315 -426 -46 468 623 160 -412 -585 -108 471 629 246 -304 -500 -173 343
2737 343 495 117 -402 -543 -216 305 410 17 -528 -600 -216 375 605 269 -258 -449 -91 327 535 202
2757 202 -298 -442 -71 393 502 158 -373 -524 -166 391 589 193 -372 -623 -338 205 357 68 -403 -532
2777 -532 -169 368 535 211 -339 -452 -81 496 692 306 -264 -510 -183 326 502 183 -284 -516 -142 305
2797 305 453 65 -471 -628 -225 298 509 162 -345 -532 -248 289 523 253 -217 -381 -96 393 527 144
2817A44n22j79L48N61J68k91n24k40K92N34J96k53n01j92K82M43J99l52m84j91
2837e62L77N43K46l40n64k24L16N02K02k58n22k09K70N05J57l18n12j84L73N37
2857C35K28l28n01k10K43M96K44k52m61k15K74M79J78l01n22k01L13M96K26l15
2877B06n53k22K37N11K72k52m53k01K78M76K23k99m78k14K92N41K29l37n20k35
2897d99K05N03K74k53m92k31K50M66K18k88m88k04K99N34K27k78n10k40K64N26
2917B83K31j94m78k16K12M47J88k82m88k11K60N20K24k66n38k70K34M96K74j73
2937B53m83k33K34M55K32k28m72k27K78N19K50k29n43k70J98N09K77k23n04k63
2957d70K37M18J85k31m70k16K71N05K82k88m66k78K48N09K56j79m81k58K10M42
$$ plain form
2817 144 -378 -557 -209 352 520 229 -295 -535 -243 291 487 234 -267 -459 -177 266 465 113 -371 -562
2837 -562 -185 358 604 264 -300 -524 -208 294 496 238 -284 -493 -223 282 439 121 -391 -575 -202 335
2857 335 563 235 -266 -476 -233 263 507 255 -206 -421 -147 332 510 209 -313 -514 -201 295 521 206
2877 206 -347 -569 -332 179 451 199 -254 -455 -177 299 522 223 -255 -469 -177 364 593 256 -264 -499
2897 -499 -294 209 483 230 -262 -493 -243 223 441 153 -335 -539 -240 294 521 243 -267 -507 -243 283
2917 283 514 320 -158 -374 -162 285 473 191 -297 -508 -248 272 496 230 -308 -578 -344 152 426 253
2937 253 -230 -463 -229 226 458 230 -242 -469 -191 328 578 349 -194 -464 -266 243 520 297 -207 -470
2957 -470 -233 185 370 139 -331 -547 -276 229 511 223 -243 -521 -273 236 492 313 -168 -426 -216 226
2977B26K11k12m46k50K26N06K34k57m69k99J92M81K92j95m27k46J67M45K38j54
2997B63m52k38K39M32K72k12m68l31J90M87K83j66m74k71J75M32K42j96m72k35
3017e00K10M89K67k24m95k51K08N04K75j59m52k71K26M04K31j84m64k66K38M23
3037B09K68k68m36k85J56M92K97j47m16k90J55M38K24j46m52k06J72M30L00k09
3057B86m43l13J61M54L22j69m41l04J49M23K59j64m31k30J43N07K91k07m54l16
3077d77J80M63K98j38m24l02J25M21K85j93l91k75J78M31K54j78m39l11J45M54
3097A06K88j35l94k92J56L89K68j27l71k20J15M29K66j78m20k96J09M12K94r7
3117C02m38k91J16L88K86j16m08k72J37M33K85j21m55k70J35M61K71p3l88l33
$$ plain form
2977 226 437 225 -221 -471 -245 261 495 238 -231 -530 -338 143 435 240 -187 -433 -266 179 417 263
2997 263 -189 -427 -188 244 516 304 -164 -495 -305 182 465 299 -175 -446 -271 161 403 207 -265 -500
3017 -500 -290 199 466 242 -253 -504 -296 208 483 324 -128 -399 -173 231 462 278 -186 -452 -214 209
3037 209 477 209 -227 -512 -356 136 433 286 -130 -420 -265 173 397 251 -201 -407 -235 195 495 286
3057 286 -157 -470 -309 145 467 298 -143 -447 -298 125 384 220 -211 -441 -298 209 500 293 -161 -477
3077 -477 -297 166 464 326 -98 -400 -275 146 431 238 -153 -428 -250 181 435 257 -182 -493 -348 106
3097 106 394 259 -135 -427 -271 118 386 259 -112 -332 -217 212 478 300 -120 -416 -307 105 399 302
3117 302 -136 -427 -311 77 363 247 -161 -433 -296 137 422 301 -154 -424 -289 172 443 370 -18 -351
3137c51R9L66L02j65m06k31Q8M16K52j43m40k82J67L89L25q3l92l06J17L89K67
3158C78r7l67k57J20M05K59j23m01l07J15L91L03j06l93l00N5L82K77p1l85k77
3179c99P9M15K85j15m09l03J08L98L23o8l84l16R3L86L01p1l66k87J16L70K75
3200D31j38m06k97O6M14L23r1l79l14N1L94K71o0l63k91J06L73K91r5l82l14J12
3222b98L86L10r9l59l04O6L62K65p3l31k90N8L88L24j01l85k79O6L91K98k9l97
3244c1l02rL78K68m8l52k92J28L56K71q6l71k75P9L57K94l6l84l10O2L39K85o0
3267B61l33k89N8L70K82n7l79l23J05L46L18m8l40l22L7L26K96k9l41k96O1L52
3289E5K84p3l52k93N7L85L27j4l98k86K3L56K64j2l45k97J6L28K94o7l42l14N1
$$ plain form
3137 -351 -252 114 416 251 -155 -386 -298 118 370 227 -213 -495 -328 61 386 303 -89 -395 -278 111 378
3158 378 281 -86 -343 -223 182 441 318 -83 -390 -275 116 419 313 -80 -380 -325 57 334 263 -122 -399
3179 -399 -320 95 380 265 -144 -447 -339 59 382 314 -70 -386 -293 93 394 323 -43 -330 -214 156 431
3200 431 293 -113 -410 -344 70 393 302 -77 -391 -340 54 325 265 -98 -389 -283 90 381 286 -96 -410 -298
3222 -298 88 398 299 -60 -364 -298 64 329 256 -75 -365 -307 81 405 304 -81 -360 -294 97 395 366 -31
3244 -31 -333 -342 36 304 256 -96 -388 -260 96 367 281 -90 -365 -286 71 365 329 -55 -365 -303 36 321 261
3267 261 -72 -361 -303 67 349 292 -87 -410 -305 41 359 311 -29 -351 -314 12 308 279 -62 -358 -297 55
3289 55 339 266 -86 -379 -322 63 390 376 -22 -308 -285 71 335 323 -22 -319 -303 25 319 252 -90 -404 -353
3312c53L53L10k5l47l10L6L48K99m3l25k48M6L19L18p5l07l24N6L46L16k4l71
3334ek97J4L00L25k7l33k93oL28K91m7l30l18R7K70L47j2l14l12rL48L09K0l17
3358B9l12L7L43K64l0l70k77L0L24L05k3l44k83k3L09L15nl30k92K8L28K67rl35
3382e4k62QL14L55pl39l21RK89L09j0l00k95L0K81K98j2l41k84J0L22L24J0l10
3406B4l53J0K76L39Nk60l23k5L20K95kl31k97K3K95L24j5k78l26kK69L00K7k80
3430A5k72k9K72K88j5k71k90j9L04L10M2l25l03pK71L09jk29k76o0K54K91Rk58
3454A0k90l2L02L20j1k49l33k5K97K82N3k47l23m2K87K87nk77k98qK77L16Ql03
3478dl10l5K50L28O6k41l41kK65K90K4k73k85j5K97K77P3l12k97p8K90L12M9k47
$$ plain form
3312 -353 0 310 285 -62 -372 -336 12 311 268 -57 -305 -259 60 378 303 -4 -328 -272 74 390 366 -5
3334 -5 -302 -288 12 337 310 -23 -316 -322 6 297 250 -80 -398 -301 -31 316 304 -10 -322 -331 17 326 346 29
3358 29 -283 -246 97 361 331 -39 -316 -286 38 343 320 -24 -307 -330 -21 294 289 -41 -333 -305 23 290 281 -54
3382 -54 -316 -308 6 361 354 15 -306 -297 -8 301 291 -9 -304 -274 7 305 293 -48 -332 -322 0 324 334 24
3406 24 -329 -319 -43 296 301 41 -282 -307 13 308 306 -25 -322 -299 -4 320 305 27 -299 -301 -32 268 295 15
3430 15 -257 -286 -14 274 259 -12 -302 -321 -17 293 335 10 -293 -300 -29 280 279 50 -226 -286 -32 259 268 10
3454 10 -280 -312 -10 310 299 50 -283 -308 -11 271 324 77 -246 -288 -1 286 281 4 -294 -302 -25 291 299 -4
3478 -4 -314 -349 -99 229 295 54 -287 -289 -24 266 290 17 -268 -283 14 291 364 52 -245 -323 -33 279 328 81
3502H1l27m3K67K76J2k62l10k4K49L32K9k69l03m7K65K94O3k07l13n4K48L18K0
3525B95k62k84m7K81K80O6k70k85r2K37L00P4k62k86l7K41K95P7k66l19l6K50
3547e0L30N4k86k95q4K42L34L7k01l34k1K13K69P1k50k98l5K53L14L7k50l01l8
3570b89J80L37Q1k22k96q6K23K81Q5k54l07o7K67L01Q3k06l57o1K42K81J02j92
3592A26l19q8K32K47J13k45k95m0K07L32O7k57k86j02K22K96P3k20l15n2J89K92
3614A77R1k35k94p2K51L17P4k29l00q1K35L17M7j68k89o8J70K95O2k08l09o7K09
3637g5L03N9k31l01j03K02K89J27j99l06j01K53K63J06k17k62o5K09K79R0k14
3658A06k92q8J95K96R8j97l19p3K10K71O5j75l15j03K08K98O9j97k73j27J88L47
$$ plain form
3502 81 -246 -289 -22 254 266 4 -306 -330 -81 251 280 11 -292 -339 -74 220 283 76 -237 -291 -43 275 295
3525 295 33 -251 -298 -17 263 329 59 -226 -318 -81 219 293 31 -255 -292 -51 244 321 55 -264 -300 -50
3547 -50 280 334 48 -247 -331 -89 245 282 81 -253 -274 -61 208 279 29 -269 -304 -51 263 300 50 -251 -289
3570 -289 -109 228 309 87 -209 -295 -72 209 294 40 -267 -334 -67 234 317 111 -246 -307 -65 216 318 126
3592 126 -193 -281 -49 198 311 66 -229 -269 -62 270 337 80 -206 -308 -86 210 283 63 -252 -304 -115 177
3614 177 268 33 -261 -333 -82 235 309 80 -220 -301 -66 251 298 130 -159 -227 -57 238 300 92 -217 -284 -75
3637 -75 228 287 56 -245 -348 -146 143 270 71 -235 -336 -83 180 286 69 -193 -258 -49 230 320 106
3658 106 -186 -274 -79 217 315 118 -201 -274 -64 207 272 97 -218 -321 -113 185 254 57 -216 -343 -155 192
3680A92Q4j64k98q2J92K68N9j56k79r1K05K58J18j98k96j19J92K97R1j51k98j24
3702c00J90K64J06j90k75o2J79L16P6j82k92r6J80K92J01j69l08j31J62K73J35
3723B69j63k89j05J56L07R1j67k65j38J76L09J08j77k86j12J56K89R6j73k39q9
3744b46J34L05N8j63k58j36J42K93J35j39k67j36J71K85J29j85k60j28J80K43
3764A57J11j52k72j32J34K92J27j51k61j03J06K43J48j37k91j24J59K89J33j63
3784A13k57j37J52K97J57j59k82j05J41K47J33j71k76j23J33K79J20j56k84j25
3804c03J35K82J25j32k86j35J54K42J57j39k33j19J34K76J48j45k48j47J10K76
3824A52J46j50k77j38J17K37J59j16k72j27J34K64J45j57k57j50J28K98J57j48
$$ plain form
3680 192 276 112 -186 -268 -76 192 251 95 -184 -275 -70 188 306 108 -188 -307 -115 182 273 122 -176 -300
3702 -300 -110 154 260 70 -205 -267 -88 228 304 122 -170 -266 -86 206 307 138 -170 -301 -139 134 269
3723 269 106 -183 -288 -132 175 266 99 -166 -304 -128 181 289 112 -174 -286 -130 159 255 82 -157 -246
3744 -246 -112 193 251 88 -170 -306 -164 129 264 125 -142 -278 -107 178 307 122 -138 -266 -86 157
3764 157 268 116 -156 -288 -154 138 265 114 -147 -250 -144 99 247 110 -181 -305 -146 143 276 113
3784 113 -144 -281 -129 168 325 166 -116 -221 -80 167 300 129 -147 -270 -137 142 262 106 -178 -303
3804 -303 -168 114 239 107 -179 -314 -160 82 239 100 -133 -252 -118 158 306 161 -87 -234 -124 152
3824 152 298 148 -129 -267 -150 87 246 130 -142 -269 -135 129 274 117 -140 -290 -162 136 293 145
3844A45k46j62J19K79J52j25k78j21R2K66J20j08l04j38J28K70J57j17k80j35
3864b86J13K73J43j06k38j63J32K72J28j01k50j57J00K72J33p2k95j57J09K35
3884H5J45p8k95j29Q5K69J33j05k33j26J01K67J62j37k43j50J08K36J42j01k54
3905a18j49J33K28J55r9k62j57J05K55J72j37k31j55P8K53J50q7k22j23P4K49
3926A12J79j22k83j43J17K44J42r0k74j49Q2K38J57q1k34j72P0K59J75q7k68j34
3948b62R0K59J49n3k25j85Q5K15J92r3k39j80J07K06J74j09k56j52R8K30J72o6
3970A57k37j64Q1K31J96q6k48j47Q1K16J37o9k56j29M7K72J43p2k33j87Q6K19
3992C8J85q0k13j56P5K09J84r2k28j48R0K41J67q9k33j78M2K60J75p8k48j56P1
$$ plain form
3844 145 -101 -263 -144 135 287 162 -116 -237 -145 121 241 133 -171 -309 -181 89 246 129 -151 -286
3864 -286 -173 100 243 137 -101 -264 -132 140 268 167 -83 -240 -140 132 265 193 -102 -259 -150 85
3884 85 230 152 -143 -272 -187 82 215 110 -123 -249 -148 119 281 144 -99 -249 -141 95 237 136 -118
3905 -118 -267 -134 94 249 150 -112 -269 -164 91 263 126 -105 -260 -182 71 221 134 -88 -211 -137 112
3926 112 291 169 -114 -257 -140 104 246 156 -118 -267 -185 53 210 129 -105 -277 -207 52 227 140 -128 -262
3948 -262 -172 87 236 183 -42 -227 -142 73 265 172 -67 -247 -140 66 240 131 -125 -277 -179 51 223 157
3970 157 -80 -244 -163 68 264 178 -70 -217 -136 80 217 148 -108 -237 -190 82 225 153 -80 -267 -181 38
3992 38 223 143 -70 -226 -151 58 242 150 -78 -226 -136 105 272 183 -50 -228 -186 74 249 171 -77 -233 -162
4015a62J87J70m1k44k07R2K62J63o5k70j59P4K52J72p5j86j77Q7K26J47o3k29
4037d6j61L7K33J53m5k26k05O3K43J56m6k40j26M3K36J59o4k17k00P9K33J64n3
4060A70k31j48M0J98J87o2k10j36L2K01J22k2k19j94O6J95K20m7k25j52P7J87
4082D9J66m7k19j34L9K17J60n7j77k02N5K14K00q5k36j81O9J70J69j6k37j53L8
4105a98K36J28l6j75j65M1K31J54qk32j90J0K48J36j9j78j91O3J62J68l6k07j51
4128b09L6J88K21o2k31j86P9K12J69m1j96j53OJ96J79m5k09j55J1K25J70n3k11
4151e9j91K8J92J86k0j97j69L6K12J65k1k03j56K2K03K09m3j64j86K1J96J50l1
4174A80k01j80K4J90J45l0j77j75J6K21J64l0j86j81J7K09J84k0k03j52K5J73
$$ plain form
4015 -162 25 195 154 -90 -297 -205 57 220 155 -115 -274 -200 52 224 149 -37 -214 -127 99 246 183 -46
4037 -46 -207 -170 63 216 171 -55 -260 -197 46 202 156 -84 -210 -167 69 228 164 -53 -253 -174 59 223 170
4060 170 -61 -209 -169 29 216 154 -56 -192 -160 41 163 141 -78 -272 -206 -11 209 162 -63 -215 -138 49
4082 49 215 168 -51 -185 -146 71 231 174 -3 -205 -150 64 264 179 -57 -238 -169 1 170 154 -83 -236 -198
4105 -198 38 166 130 -45 -210 -169 62 216 208 -24 -214 -204 44 180 161 -17 -208 -145 17 185 149 -58 -209
4128 -209 -173 15 236 174 -57 -243 -164 48 217 176 -20 -173 -167 29 208 163 -46 -201 -190 35 205 152 -59
4151 -59 -250 -222 -30 156 136 -61 -230 -194 18 183 162 -41 -197 -175 28 237 194 30 -156 -135 61 211 180
4174 180 -21 -201 -177 13 158 128 -49 -224 -208 13 177 147 -39 -220 -203 6 190 170 -33 -185 -160 13
4196A3J90pk30j70O0J83J72n3j54j73j1J98J90o1j64k06K2J96J76k1j92j45PK13
4220C3J41J5k01j60NJ68J70Lj71j88L8J65J53k6j97j42J5J80J82k9j74k23N1J63
4244b9K14J3j66j94KJ74J42K9k10j66LK11J24K3j99j64mJ59J94K8j73j58l1J74
4268dJ79Lj77j92K3J58J84k1j61j75l3J91J60M0j77j82K1J43J84j7j53j65lJ48
4292b6J79Oj47j91j1J99J74J7j85j47qJ14K00J3j86j58k7J70J76j0j92j37k1J73
4316b5J56L8j79j51l5J72J70mj38j67QJ43J91j4j25j81m8J77J68L1j72j73MJ24
4340c0J81L5j56j79j0J40J87mj68j74JJ49J53K5j28j55l8J16J89K9j16k25NJ48
4364b5J79pj40j77OJ39J65J8j19j78k6J19J84J3j48j41oJ40J59J5j35j74k1J54
$$ plain form
4196 13 203 196 -34 -204 -144 39 211 158 4 -169 -180 18 208 147 -17 -223 -201 -5 171 150 -42 -187 -180 33
4220 33 174 189 -12 -172 -167 1 171 174 3 -185 -147 18 171 145 -52 -194 -179 1 183 154 -20 -243 -192 -29
4244 -29 185 198 32 -162 -160 14 156 185 -25 -191 -188 23 147 170 -29 -193 -197 -38 156 184 11 -147 -178 -4
4268 -4 175 178 1 -191 -168 -10 174 153 -8 -183 -216 -25 135 175 -2 -184 -163 -20 164 147 -6 -171 -174 -26
4292 -26 153 159 12 -179 -190 9 183 200 15 -132 -140 -26 174 187 1 -157 -184 -14 162 152 -40 -177 -198 -25
4316 -25 131 169 -10 -161 -196 -24 146 142 4 -163 -155 -12 179 165 40 -141 -189 -12 156 187 15 -158 -154 -30
4340 -30 151 186 30 -149 -159 -19 168 164 -4 -178 -177 -28 125 150 22 -133 -171 -55 134 163 47 -178 -173 -25
4364 -25 154 147 7 -170 -164 -25 140 158 39 -139 -165 -46 138 151 3 -138 -144 -4 155 170 35 -139 -160 -6
4388fJ78L9j62j82m2J37J76J9j51j52k2J26J75K9j43j84LJ43J60J2j35j77k0J58
4412b1J35K8j43j52k5J47J78K2j19j87qJ31J59M1j35j77m9J35J68K7j24j61m1
4435a71J74J42Lj18j90k6J23J68K8r3j96l1J58J48K1j32j36l4J27J64K8j10j94
4458a47lJ33J55J7j11j57k9J25J31O8j49j56l9J12J69L8j39j77j1J31J51O8j22
4481E8j58o7J25J42M2j17j84l7J51J48L9j15j57k9J48J44N1j11k05k4J34J27N1
4504A56j21j51k5J19J40K6q7j77m8J11J30Q3j49j44n9J20J79K0q5j55l9J24J77
4527A45L7j12j72n2R3J89nq8j75l6J10J73O7j19j78l9J35J31K9j04j26r6J40J48
4551I5R0j30j58l7J30J61K7j04j50o6J09J40O5j22j73q3J25J98L1j37j29o6J24
$$ plain form
4388 -6 172 211 49 -133 -175 -38 138 157 6 -146 -168 -42 133 162 19 -165 -162 -19 141 153 18 -159 -179 -21
4412 -21 114 142 -1 -153 -178 -31 147 169 50 -137 -145 -14 145 186 51 -126 -175 -40 128 155 31 -130 -171
4435 -171 3 145 148 30 -160 -186 -63 105 133 40 -156 -187 -29 119 140 8 -128 -162 -35 129 157 47 -147
4458 -147 -150 -17 138 155 44 -113 -142 -17 114 182 33 -123 -162 -50 119 157 18 -159 -170 -39 112 180 58
4481 58 -100 -167 -42 100 142 25 -159 -196 -45 103 142 27 -130 -159 -11 133 184 73 -132 -156 -22 105 156
4504 156 35 -116 -141 -22 118 144 57 -120 -168 -57 73 156 7 -137 -196 -76 103 123 38 -117 -156 -32 145
4527 145 182 70 -102 -154 -61 128 123 35 -140 -176 -66 107 174 55 -123 -162 -27 104 133 29 -97 -193 -53 95
4551 95 185 55 -103 -140 -10 151 178 74 -76 -142 -33 107 172 50 -123 -206 -81 117 148 11 -118 -184 -60
4574f0J37M3j10j32m7Q7J54R8j30j40n7J16J49Q7j09j72p0Q3J60M8q2j68k7J12
4598c0J42M3j15j37l4P8J54M2q9j61p5R0J73N3j11j28l9O1J77P1j09j60m6R4J63
4623A07P0j56j61j2J03J60O6r7j56n9Q9J84N1j21j39r3J21J53O6j19j52m7O1J55
4647G4O5q3j60p6P3J93M3j05j65k8Q3J88N2q2j43n7R2J82Mq7j23o6J05J26P2j11
4673F6j51p7Q7J61P4r1j86m6P4J51P0p5j45o8O4J77O9j06j36n5Q2J68O9r9j26
4698d9q6Q3J05J17j21j49o8J12J07Q8q9j52m7J02J27Q5j19j01q4O1K01L3m8j74
4722f6l3L2J49O6p8j59q8R5J54Q5q7j78o5P6J45O1n4j38o5Q6J40O0o7j56l3O7
4748e1J25P9n9j61n0M8J22O7m6j36r8R5J43N2q7j42m9R1J14Q9n1j84m3O8J48P7
$$ plain form
4574 -60 77 120 10 -122 -169 -82 72 170 40 -100 -157 -41 108 195 86 -86 -156 -73 87 135 53 -115 -142 -30
4598 -30 112 155 40 -97 -131 -53 101 143 54 -107 -182 -92 81 134 23 -105 -144 -83 94 165 56 -104 -150 -56 107
4623 107 177 21 -140 -152 -49 111 177 80 -76 -135 -46 138 189 68 -71 -164 -43 110 176 57 -95 -142 -81 74
4647 74 139 56 -104 -180 -107 86 129 24 -141 -169 -86 102 154 72 -71 -128 -36 146 150 63 -60 -126 -21 105 177 66
4673 66 -85 -162 -75 86 160 69 -117 -163 -89 62 132 57 -88 -156 -92 85 154 48 -88 -143 -61 107 176 77 -49
4698 -49 -135 -52 53 170 49 -100 -168 -56 51 139 50 -102 -149 -47 80 165 46 -55 -139 -78 123 156 108 -66
4722 -66 -99 -67 82 148 70 -89 -177 -82 72 157 70 -108 -173 -97 48 109 55 -83 -148 -62 78 138 71 -85 -118 -51
4748 -51 74 153 94 -67 -117 -69 53 120 74 -62 -160 -65 78 130 43 -99 -148 -57 57 146 95 -89 -132 -64 84 161
4774A61q2j44m3L4J32Q1q4j32q8R3J25O2m5j53o5N7J55O3m4j24r7N3J23J05o6
4799G7j32p2P5J27M4m5j23q0L7J57M7l6j61q7R3J40N8p7j30m7P8J20Q5n4j45q2
4825a33N7J52M5n2j42q0M6J61P1m0j43p1N0J60O1o2j76n8O8J52P6o5j03r7O0J28
4851F5R8p1j48o0N0J14R2p7j28p7L9J18Q8m3j61m8M3J44O2m3j24q1O9J13Q6l5
4877H5j22q2N1J49R9p5j25q1L1J22N1k5j29j01O7J37R8p2j53m6J5J55O3o3r1j15
4903a57P7J10R9n5j21q8O7J31Q1p6j10o2K2J21Q0qj48q3K8J21P4l3j19n8L0J03
4929B6J03m7j28j01N4J29J10m4j55n6J3J15Q3j1j52q1O3J08O0l9j50m8M7J53Q3
4954A35p8q4p8K1J27R9m8j30q8O1J30Q7o9j28o9L0J00R1Jj31j11mJ88O7l2j63
$$ plain form
4774 161 79 -65 -108 -74 58 139 55 -77 -165 -72 53 115 70 -83 -148 -91 64 127 83 -41 -138 -85 38 143 77
4799 77 -55 -127 -52 75 119 74 -49 -129 -92 65 112 76 -85 -172 -79 61 119 42 -88 -135 -57 63 148 94 -51 -133
4825 -133 -76 76 121 69 -73 -153 -107 54 125 85 -58 -129 -79 81 142 80 -96 -154 -86 66 142 77 -26 -123 -63 65
4851 65 163 92 -56 -116 -66 48 140 63 -65 -142 -103 15 103 60 -101 -149 -106 38 100 57 -67 -148 -79 34 120 85
4877 85 -37 -119 -68 81 180 105 -20 -101 -70 52 103 78 -51 -152 -85 52 150 78 -75 -121 -106 49 112 49 -42 -157
4903 -157 -80 30 129 74 -47 -135 -68 63 144 68 -42 -104 -82 39 119 111 -37 -120 -92 29 103 70 -49 -107 -77 26
4929 26 129 82 -46 -147 -93 36 146 102 -53 -109 -96 19 102 91 -61 -142 -79 29 89 50 -100 -148 -101 52 135
4954 135 57 -27 -105 -84 43 142 94 -36 -124 -63 67 154 85 -43 -112 -82 18 109 110 -21 -132 -136 52 119 87 -76
4980g6l7K9J20Q9l5r7j02K4J15J15p3j07r5O6Q6R7k9j30p9L3J10Q5k8j10j15M7
5006i7J41O1k7r8j10L8J41Q2j4j32p2PJ41P2o1r8q7qJ19Q1k2j21q3M1J15Q8j2
5033H5j12j02N8R8N2Or8j15J3J37J04n7j09o0J7J09O0Mj06r6K0J04J19n3j20n1
5059i3j2J17J18l8q6j29K8J10R1k9q5j20K9J14Q4l1p5j22M7O4J12J0j20j08J4
5084a10J12Q9k7r3q7M9J24M9J0q9j10kJ39P9m2j05r4L5Q4R8l2r5p3LQ6P5J1j16
5112c2j16K7J18Q8l1q0j06K6J13J01j6j00r9J8J22P0j9j15n5PQ6J19l1q7j21R
5138a04J16Q6Qj20r7L5M7J12jq4j18J8J04J05l1j04p6M2O4O8Pj04p5mQ9Q0J7r1
5166a1r6j4J54O3l1o8r8K3O5J24l1p6r1%J30Q9k9j12q8MQ2O7J7q9j05QR3J00m
$$ plain form
4980 -76 -113 -84 36 125 90 -7 -109 -85 30 145 72 -35 -130 -64 22 119 90 -40 -119 -86 24 109 81 -29 -144 -97
5006 -97 44 105 78 -20 -130 -92 49 131 117 -15 -87 -80 61 133 72 -26 -113 -121 -2 79 57 -64 -147 -106 9 97 85
5033 85 -27 -129 -71 27 79 85 -13 -128 -115 22 126 69 -40 -100 -83 26 86 90 -16 -112 -92 12 131 78 -42 -93
5059 -93 -105 12 130 92 6 -123 -95 15 106 77 -8 -128 -99 15 99 68 -7 -129 -82 -18 94 104 -16 -124 -110
5084 -110 2 91 64 -29 -116 -67 57 106 116 27 -83 -85 54 133 91 -14 -108 -73 11 109 77 -18 -91 -88 -2 73 84 -32
5112 -32 -148 -121 -3 85 54 -26 -132 -106 7 108 92 -8 -107 -89 33 103 84 -31 -86 -79 7 126 95 8 -113 -104
5138 -104 12 98 106 -14 -111 -76 -29 83 82 -2 -120 -102 2 107 76 -28 -104 -62 2 70 77 -27 -102 -106 -17 63 80 -11
5166 -11 -107 -121 33 96 65 -3 -101 -78 -13 111 80 4 -87 -87 43 132 103 -9 -97 -93 -11 56 73 -16 -121 -113 -20 80 76
5195G6j03q5MJ09P9j0n9j08PQ9J09j7q0j08OJ12P2j7q2r8pJ13P2K4r3j04jJ03
5223CQ0qq5j00M4P5O9Pq3p4l5J09O9Lr5p2k6R2J03j1p6j01%Q7J26l0p1r6J8R1
5253A3N2J2p7q8pO4J21J8r6j18K3J01Q2%j10p8J9N9Q4Nq1r3NJ01R2j0r9j07NQ1
5283b7J02L4j06p5k1P4J00j0r2p8QQ9Q9no3j10k3J01J10J4p9j17MQ9R9j2p5p4
5311e4k4R0P4K1j00j03k1J33O0kp6p4l2Q0R9K1r4j14KJ00R0J9r1q1pO4Q9nk5j22
5341h3QO6Q5L6q3r6j0P3Q1k2m2q9l0P1Q8L3q4r9j0R1O6J9n1r8pO8P5L4r0r8k9
5372a27J33N5J6n4r0j2N6Q2L6j00q5rP5J06J7q6o2n3Q5J25k4p9n5m3Q3R0J6p5
5400B1o8k6M4R2Po5q5m6P4J22J8o3j29k6J19Q1L6j12q1j5Q3P3N3p7r9J6O4P6K
$$ plain form
5195 76 -27 -112 -108 1 80 70 11 -97 -90 -1 108 91 11 -97 -91 21 93 76 -6 -104 -111 2 74 98 5 -99 -100 3
5223 3 83 75 -10 -110 -66 9 78 85 2 -72 -107 2 71 74 -21 -93 -119 -27 76 65 -11 -112 -112 -25 101 71 0 -96 -78 13
5253 13 65 77 0 -88 -95 -31 90 108 12 -106 -83 18 100 100 -10 -88 -69 -10 74 79 -2 -95 -90 11 103 93 -6 -113 -108 -27
5283 -27 75 109 3 -72 -93 -19 81 71 -21 -99 -91 -2 87 82 19 -91 -114 -13 97 111 32 -85 -81 8 107 95 20 -54
5311 -54 -78 12 86 107 7 -96 -117 16 76 74 -2 -76 -108 -28 71 92 -2 -116 -114 -14 76 95 4 -77 -84 -20 69 64 39 -83
5341 -83 -75 -9 76 112 29 -67 -77 -4 77 55 13 -76 -106 -35 53 86 2 -97 -107 -16 50 69 18 -80 -87 -19 56 90 0 -98 -127
5372 -127 6 61 77 23 -67 -79 -23 59 95 -5 -90 -99 -24 82 99 13 -49 -102 -17 108 84 5 -50 -93 -10 80 96 21
5400 21 -47 -73 -29 63 70 5 -80 -126 -52 70 88 25 -104 -130 -11 70 106 -6 -87 -102 -19 54 107 30 -69 -53 11 87 89
5429H9o5r2k2Q4O4Ql1j03j6P2O8K4m6j06j1O7P1J2l0q8n6O2Q5M5r3m1k8O2N6L5
5459G6q3o5nM0R7K3m4j16j6R4N8J4n0j12J4M2Q0L7n2r4nM5P8Kj8j06k1O4M8N2
5489G7m0q8l4K3J25%m5q7k7O8R2J1n8p3n4O7J17K5p7p7mL3Q9K4o9n4o6P6Q1K0
5519G5l3r9k2N2J04Nn6p8k2N8O3K8n9p0n5P3R5J9p7q2j0P2N6J4oj09m8O0J08J9
5549G5p5n9m0R1N2M6m8q5k1M1O2K5j4j04jM0P0M7o7p6k1L2O3L6m1j04j3N8M3O2
5579G4p7p0j8M2P8K1k1o0l1J4J20K0p0o9j1K6Q6M8m7q8n1N3P0M9m5j00j8L5Q2
5608D2L5l8p9n2L5Q1K6j6q6m4M3P9L9m6q5j5K5Q6L6k1p8n6M9P5L5l9o6k3N0O7
5638E9N1m7q8n7M4Q2M4qj25l1J7Q6K8j1r6n2L0J22K2o0o3m4N5Q0L8n7p0m8Q0P9
$$ plain form
5429 89 24 -68 -90 -6 58 66 35 -68 -84 -12 56 80 34 -72 -83 -16 55 67 37 -51 -107 -45 40 85 -8 -49 -77 -15 41 76
5459 76 -7 -72 -77 -37 60 83 39 -77 -93 1 59 73 23 -89 -75 -33 47 84 32 -62 -67 -22 56 58 40 -66 -87 -23 25 77
5489 77 37 -51 -85 -62 63 63 18 -69 -96 -28 64 75 17 -56 -110 -43 74 99 22 -55 -59 -26 63 87 18 -36 -102 -26 55 75
5519 75 42 -57 -79 -27 77 82 26 -52 -74 -16 47 75 16 -54 -109 -36 59 78 1 -81 -91 -19 37 51 45 -64 -112 -52 56 75
5549 75 0 -59 -99 -8 44 90 42 -43 -64 -23 39 64 50 -54 -55 -15 55 102 35 -41 -62 -30 33 69 28 -76 -89 -31 12 74
5579 74 -3 -73 -91 -49 29 50 29 -31 -62 -48 72 92 22 -47 -58 -32 54 102 55 -33 -84 -31 39 88 43 -57 -75 -40 42
5608 42 77 39 -40 -92 -57 24 50 34 -52 -96 -53 26 65 19 -66 -81 -56 30 66 45 -33 -89 -40 35 70 31 -35 -58 -8 59
5638 59 110 63 -25 -82 -38 44 88 80 -45 -76 -59 27 55 44 -52 -104 -74 48 70 10 -53 -97 -42 38 76 19 -51 -99 -19 60
5668F0J5m2q1k8N7Q1Op1n3j1M4P2N5p4o9o1P7O4M2n1j05j6N8P2M1l0p4o2L9R5
5698E0jj1r1m3N6O7K9k2q0l1K0P5N9l4q9l6J5R9N1m9n8k9KQ9L1Nj22jN2L6N7n9
5730C7o8oML2Q3l2q4m9M0O8L6l4r9Kj5J01K6jo2q0K8J06M5o1k7p9N2M1O8k7n5
5761a0p9K2Q6P8m1j06m9N2J03J0l4n2n7K6N9N6Nj24k6M3P6M8n3o8m8MP9N7k8r1
5791f2k3M1L8Q3n7o3m7M2N9N2k3m5n2oJ47qJ1r2l1KQ1J6j5m5p8K4Q4L7m0o9m3
5822h2L2N7O8n3o0k8PN4M6j1l6q6L9P3Jjm6m5M0O4L8qq3m7JP4M3K4j05l2RP8M3
5855F8J4q8n6J5N8M1j9m7p0PO8L5J6p3o0J8P2P1k8p3l0K4M0M8nj00K2j0N3P0k
5886G9q7l0pQ8J0j5m8k9K6M7J9J9q9l5lM3P9k0p1m2RO2J5J1l5o5L4M0M2k3k2q2
$$ plain form
5668 60 75 33 -48 -76 -19 62 68 -3 -56 -67 -23 49 104 30 -39 -100 -23 41 83 32 -73 -89 -31 41 82 52 -22 -84 -45 50
5698 50 49 38 -53 -96 -40 27 56 34 -46 -77 -57 18 77 43 -46 -82 -67 32 83 34 -24 -53 -51 38 69 74 -48 -49 3 39 96 37
5730 37 -31 -37 -33 -1 82 50 -34 -83 -43 25 61 27 -72 -70 -85 16 42 41 -21 -101 -73 33 78 17 -10 -89 -37 4 72 45 -10
5761 -10 -89 -67 19 97 56 -50 -99 -47 56 66 32 -20 -77 -51 8 64 69 -55 -81 -38 38 86 33 -35 -83 -79 0 57 29 -62
5791 -62 -85 -44 -6 77 20 -43 -90 -48 11 63 40 -5 -57 -63 84 76 87 -5 -36 -34 47 63 48 3 -75 -51 33 70 30 -39 -82
5822 -82 -50 7 75 22 -38 -66 -59 -5 41 30 -6 -92 -53 20 21 20 -26 -71 -31 33 71 63 -20 -67 -66 8 51 75 -30 -62 -53 25 68
5855 68 82 -6 -62 -47 11 52 33 -14 -84 -77 -9 26 42 -31 -91 -73 -1 70 42 -31 -61 -37 3 51 46 -54 -32 -42 11 81 79
5886 79 -8 -38 -45 43 53 38 -10 -39 -13 34 53 72 -17 -52 -55 -12 67 47 -24 -66 -57 5 20 31 -4 -69 -35 5 47 24 2 -80
5918h0N0K9O9k9m1k9l6Q8K8l6l2m0LP7L9jp4m1j3P5M8Ol8o7J7P6J7Ln5p7K1N2
5950IN1Qq2l6j5N8P0m0n3l0MN5N2qm6n6jO2N0J8o5q5L0Q1L9mn3m2pN0N4lo3q1
5984g9J3Q1M6K3r8n3J2O6M6j9m5n6j6O0O2k0j9o9KN6M9J4l8q6K7N9K3Nl3n2J1
6015b8J8O6J8n8o6J0M4P4%o8n2PM8M0ql2p0J1K5N5j7k4m1k6N8N3Qp4qj5M7L9K6
6048F0p0l7k2O1O5%n3l8j0N7L5Ro9n8M3L5M7j0m1q0LP8L9Om3l0k9P7J7J7q2j4
6080c7m3Q0K8J6m9m0kL3N2K0m0p4NJ7R6l4J2o8j8M9O5k3m0k2l3O9K7K5n5n7NN3
6112A7J1L2m6o1j6O5O2j4n5o5jO7L6j3k5n8J1L1O8mj8r1K5L1Q0Np2m1l5P1L4L7
6144F8o3j9jPM2J4k4l5l1L7M2J5k4q4rM7O9ln2m0ML0O7l7rn1k0M7K1N7o4l9j4
$$ plain form
5918 -80 -30 -1 68 39 -2 -31 -67 21 49 13 -19 -59 -56 21 60 59 -15 -56 -69 6 54 60 22 -45 -28 48 65 68 13 -64 -43 9
5950 9 60 68 -14 -50 -65 -7 63 23 -30 -60 -56 -1 51 43 -3 -59 -60 2 52 70 5 -80 -50 31 70 66 13 -29 -36 14 68 65 2 -79
5984 -79 -66 15 61 84 -14 -67 -55 11 57 38 -7 -63 -79 -19 43 23 4 -65 -63 -7 42 56 18 -68 -41 18 41 46 13 -39 -28
6015 -28 -10 56 74 16 -50 -40 4 78 78 10 -42 -35 13 53 45 13 -57 -46 -21 34 17 -7 -48 -74 -16 37 45 -29 -37 -52 -5 34 60
6048 60 -10 -47 -69 -8 57 57 4 -34 -44 13 48 57 -12 -70 -27 8 55 45 4 -76 -73 5 44 50 7 -23 -52 25 42 59 -23 -37
6080 -37 -80 0 28 44 -5 -45 -47 -14 38 58 18 -56 -51 -34 62 28 40 -28 -46 3 68 45 5 -17 -50 19 46 71 16 -41 -36 17
6112 17 28 60 14 -47 -63 2 64 50 -5 -70 -71 -4 32 19 -6 -64 -53 -22 46 42 24 -67 -42 -11 69 74 2 -39 -74 -3 31 68
6144 68 5 -14 -15 -8 34 48 24 -11 -42 -5 37 52 28 -56 -65 -18 51 48 -4 -44 -40 -10 57 20 11 -40 -60 -13 8 65 1 -38 -52
6177e2M7M7J8l1n6k4M3L1L3k2o4lM0M0J2l0l4l9L4O6On9n3k5O3M1Rk4p3LL5K1
6209@L5k0m2l0L2O8k0j4o3K4J4M5L4n4k1l7J8O8K7j7r6j4O6K5Qk2k7n4J02M2K
6240G9m8m1m5L1P4ll9m3l0L4N7Ml9m9j2K1M7K8k5n6J2J4P4Orq0k0N0K7M2j5l0
6272A6n9L2L6K6j9k6o5L7J5M3m2n2lK6L7L4Op9j0LK7Q4n4l7m0K5M9K0km0l8L2
6304a8L1J4J8l8p6K5L7N1Np2k7L3O0Pk4l3k7j2O1M1k7l8p3L3O2J7mn2m7L0M3K8
6336B8kp0k5J3M6M4Rm0m2qQ0J8j1o9pMM1M9k2n5k2L5K9J7Ll7m1oO9N2m7p5opO3
6371HL9k8k4m2K9K6K4Qn1j7k1M4L7k7l5pKJ5N8j5k1m3J2L5N4l4m3l4M9K5M2m5
6403B0j0m5NO7pkj4m7lL4K6%o0pJ7M0M0l8n1j9mO0L1oo3j3j0P3J3j1j8j7NK7M0
$$ plain form
6177 -52 -5 42 60 29 -27 -51 -8 23 56 34 -30 -33 7 47 59 29 -5 -44 -10 56 62 3 -50 -75 -12 29 38 14 -59 -56 -21 0
6209 0 35 15 -27 -57 -25 43 23 9 -54 -30 -16 29 63 9 -12 -49 -31 37 64 47 -49 -63 3 28 36 14 -13 -67 35 77 79
6240 79 31 -10 -55 -24 50 47 8 -35 -65 -31 26 30 -9 -58 -70 -49 -2 26 1 -55 -43 -29 45 51 42 -38 -58 -8 19 61 46 16
6272 16 -43 -11 25 51 32 6 -59 -22 -7 36 -6 -58 -61 -35 2 36 42 -37 -47 -44 -17 67 13 -24 -64 -39 10 30 28 -12 -50 -18
6304 -18 13 27 45 7 -69 -44 -7 44 49 -23 -50 -17 43 50 26 -7 -34 -46 15 56 29 -9 -82 -49 13 30 26 -26 -73 -43 0 28
6336 28 26 -44 -69 -56 -10 34 43 3 -39 -47 33 51 40 -29 -36 -32 9 58 36 -19 -41 -6 23 40 43 6 -35 -41 28 80 33 -42 -48 -55 8
6371 8 47 19 -5 -47 -18 8 32 40 -11 -28 -49 -5 32 5 -30 -37 -35 -20 38 23 2 -41 -29 6 60 26 -17 -51 -2 23 65 20
6403 20 10 -35 -30 37 30 28 14 -33 -36 -2 24 24 -36 -43 -26 14 54 16 -35 -54 -58 2 33 27 -36 -49 -59 14 27 16 -2 -19 -14 13 53
6438E3j6m7j5rM0N6k4n8k0NL1K8ln4kQL0K6j2k9k8J3K2L3k5k7k9k3O8M2nk9m3
6471d3L1K7K9Jm9l4LO4K3j8l0m0NK7N7k1l3n7K7M4K9j5l8k4rL4L2K3n1k8JK7K7
6504B1j3J3o0j0L9M0pl2l9qM3M8m0Rl4RM2K5Nm7l8nO3QL7p0k1lM4J3Qn7Ll7L4
6539a7L3J0m5j0j9L4M4j7k3j9Kj3N4J5k0k6k7N0N7j9l8k1qK0M5j5m8j7J2L7J8
6570B9jl2j7J2qM5L3n1n2J8K0M7J5p0k0k0N1RJ7m5j6j9O9Pj3km3KJ5K7Qpm8J7
6604b3OL7K6k1k2j9K4L5j8Jn4QL4j0L1j8l4rK2L2Km1k2j4M5K3Kl6jm9M2K9Oj1
6638Ck8JK1J7j3j7k0K3RJ4L2j5l7k3M0K8Ql3l7j1K8L3K0l0o6oM5J4M7n3j0m1N4
6671cK4Ol2l5j0J7M5J7j0l5m2K8M6QOp0J8L4K1j9J5l3j7%M3L0k0m5nJ2J3K2j7
$$ plain form
6438 53 37 -10 -25 -34 6 62 38 -20 -40 -35 -4 24 21 -33 -35 -27 3 29 17 -12 -40 -27 -5 28 3 -24 -53 -76 -8 34 29 0 -43
6471 -43 -12 15 44 45 -4 -38 -35 29 52 34 4 -36 -31 -4 53 32 -1 -58 -31 13 42 27 -11 -35 -44 -10 22 45 -6 -34 -33 -6 21
6504 21 8 21 -39 -49 -10 30 23 -9 -48 -56 -13 35 -5 4 -30 -21 21 46 51 4 -34 -39 24 32 69 -1 -22 -25 19 32 40 -17 -14 -51 -17
6539 -17 16 26 -19 -29 -48 -14 30 13 -10 -29 -27 -40 14 29 9 -17 -44 6 63 44 6 -15 -23 -3 42 27 -21 -38 -26 11 29
6570 29 28 -4 -21 -9 -17 28 61 10 -42 -24 -4 43 58 -12 -32 -52 -1 8 25 -20 -36 -55 14 21 8 6 -37 -35 -20 7 15 8 -40 -23
6604 -23 -17 20 46 25 3 -16 8 43 25 26 -28 -20 14 4 35 17 -17 -26 -4 28 30 -11 -33 -47 -2 21 23 -13 -14 -63 -21 8 14 3
6638 3 -25 -24 -3 14 1 -16 -36 -13 -4 10 42 27 -10 -33 7 35 43 10 -27 -38 -10 23 43 13 -53 -59 -14 0 47 -6 -16 -57 -3
6671 -3 21 27 -5 -40 -50 -33 12 29 19 -16 -58 -30 16 24 30 -40 -22 12 33 14 29 -4 -21 -21 22 52 32 -13 -18 -6 7 29 12
6704A2l2l6M4L7ojm8j2OM1K0m2J0o4M0K3M9l4l7j2L4J1M9k2l0o5O1L4L4n4k1r
6736b0J7J1M8n5j1k9K5K4K4k7l6mj3N8J1j2j0n4J8M9Rkm0m2M9J0L9j2m1m2J3P5
6768C0J7k9j4k1KM5Qj6l4j2j3O2K3k1n0nmM0L0l4k8j5J2K5K8Qp1K9j8L8QJn4j8
6802e1jN0M3k4k3l6LN8Qlj8j7j1L6L7l0j7Kj5OM6k2l5LmK6L6jm7l3J2qN7qj8n3
6838e2L3L4LOm3l0M7pPj5Qk3J5K5M1ln1n0L3K3J8Nj9m4K8L0J8ql7Ok8M2M1k1o7
6873c5J5k0L8N3j3l2n6M4k1L4K3n1k8LN5J5J0m6j4k0N3J3Jmm8K2OM6J0l1n3NK9
6906CL4j8k0k9L4OPnm4J2rON2k0jm7M4j3M4l4Lm8pM4K8J1m6k8ML9J6Lj7k9lL5
6942GM0k9l0k0PO2%j1k6k7KK7N7l3k9n8K7K4K7j5jo0J5K1L7Nm0mPJM2j3nl9lJ4
$$ plain form
6704 12 -20 -56 -12 25 19 18 -30 -42 -36 5 25 -17 -7 -71 -31 -8 41 7 -30 -42 -8 3 52 30 0 -65 -4 30 64 10 -11 -20
6736 -20 -3 8 56 1 -10 -39 -14 10 34 7 -29 -33 -46 12 23 11 1 -53 -35 14 23 21 -19 -61 -12 -2 37 25 -16 -58 -45 30
6768 30 47 18 4 -17 -15 30 38 22 -12 -24 -37 25 48 27 -23 -28 -32 8 38 4 -24 -39 -27 -2 26 34 -37 -8 -26 12 20 21 -33 -51
6802 -51 -52 -2 41 17 -6 -42 -39 19 27 24 6 -11 -22 14 51 21 4 6 -9 -3 43 21 -14 -11 -15 11 47 46 -1 -34 -22 -30 27 19 1 -52
6838 -52 -19 15 18 24 -19 -49 -2 -9 -2 -17 -9 -32 -17 8 49 46 -5 -55 -22 1 19 24 5 -39 -11 19 37 29 -8 -2 -30 12 53 32 -35
6873 -35 -20 -40 -2 51 38 6 -50 -6 -27 7 30 -21 -49 -46 9 24 34 -12 -26 -46 7 20 21 17 -31 -9 -3 43 53 22 -31 -26 3
6906 3 37 19 -1 -30 4 10 17 12 -32 -20 -29 -23 29 9 8 -39 5 -8 36 2 5 -43 -50 -6 22 33 -13 -41 -37 2 18 21 4 -25 -28 7
6942 7 47 18 -12 -32 -25 37 37 26 0 -27 -25 2 59 26 -3 -61 -34 -10 17 2 1 -59 -44 -23 14 19 -21 -25 -18 -17 25 12 7 -32 -35 -21
6978b1N2j0j6l4mL2K8Pon4lL3K8Om3kl4M5%J3rl2m9N1J4J6j5n2J5K2J6K1n1PK5
7013dmL4jj9k8j8PM6J9k4n2J9L0L7Kl0k6pJN6Qj2n0k0L8JL3l2n1K4JJ2K7mk6k9
7049d2KM7J1j1l5k4K7M4kRo0k2M6L9j1ol7KK7K2J5l1j7j8K1O1j3k5m3nL0K4Ol
7083B8l9j8K6K6J1k2m2KkL3K0l8k7LK9J1K6Jp6L7oM0Kk4j0kOL9J5om5rNM7Lk4
7119B0l1kJ1K8J0l2m6K1K5%K1lk3k7PMM7k4l1qK1J6K6rn8J4K7K0K1m9k2j0J3L5
7153A2PJ7n3J4j6N2K0m0l2jJ6K6K7n1qj9J4N5lm5j9j7QN3J5on4m9M7J9M8l7l6
7186c6L9oN1k3kl4NJ6M4Mm7k7NJ3J4K1nm4K%K3K0k3pl1kL5K2l0j6LpL4J2ln3j8
7223e1J6K5M9l3k2rK7mL5Kl6JKPM4j0n9j7L0L9J2j6l9k6kM7K2j0n3J8j0K4J6m3
$$ plain form
6978 -21 31 21 5 -29 -33 -1 27 34 28 -26 -29 4 32 38 -5 -7 -41 4 4 17 8 -24 -73 -22 -8 8 -7 -59 -44 -22 -6 15 -36 -29 -4
7013 -4 -8 26 25 6 -22 -40 -33 13 32 8 -44 -25 5 42 44 14 -12 -19 -18 38 46 34 -16 -36 2 3 36 4 -47 -23 -22 -10 17 13 -13 -42
7049 -42 -40 7 18 7 -28 -52 -25 19 17 26 -34 -56 -10 29 18 12 -25 -23 4 26 41 10 -7 -25 -4 57 44 19 -24 -29 1 25 31 28
7083 28 -11 -29 -3 23 34 12 -30 -28 -30 3 23 -15 -42 -39 -10 1 27 28 -48 -11 -17 23 25 1 -9 -11 -5 34 49 43 -2 -11 -6 41 44 20
7119 20 -11 -13 -2 26 36 4 -42 -21 4 4 25 22 -1 -28 -21 -17 30 6 -25 -33 -12 4 30 21 -37 -23 4 24 45 -4 -26 -36 -23 12
7153 12 19 36 -17 -3 -19 33 53 13 -19 -20 -4 22 49 -2 -10 -29 -15 40 37 -8 -27 -44 -36 17 32 26 -28 -77 -30 -11 37 0 -36
7186 -36 3 -3 48 25 23 -11 -6 10 54 58 11 -16 -11 2 16 37 32 -12 -10 -10 13 33 10 3 -28 -30 5 27 -3 -19 -16 -23 11 23 20 -33 -51
7223 -51 -35 -10 39 6 -16 -25 2 -2 33 35 -1 0 2 9 53 43 -16 -33 -3 36 48 32 -7 -33 -35 12 34 24 -29 -11 -21 3 19 -24
7257b4Ll4J6L4J4j0om2K2L6K6J3n2m1L7j6O1Pl8k1KK8J8Pn2k8J1K7M3qk5l1ML1
7291A2K7j7m9j4J3L9J1j0m3L1j6M4lk2n9QL1K5J0j6k4Ok4M4K6Pno6K4J6L9k2k8
7324ej2J6J7J4J3j6l2lL0Ok1m0J8k7L2M5l4k9j7L4J3K1np4MKO3K4l6j9j0mJ3M4
7358B5k0Qk7p%Q1l8k1krJ4L8j9k3J1l5M4j1mk4k6KL2J7K6o1k5K0L9Jk6j9koL3
7393a4M5ml0m4LO1L2rn0j5J5MO1l5j7l8J8K9Rk5pk4K0L0J4k4jm1jK4K8k0k8l9
7427g3L5J9N7k3k3m0NK7L9Lk3l6pM3K7Qn3NKK6J6k5nnl6K8L1L2m9n8J2L2M8k8
7461A1j1m5RL4K6k9ql2PK3L2J1l8Ll2N7J1kl6j2nJO3lj8m8j8M4M9m2J5k9j8N3
7495B3lK9o2k6OJ8K7J9n3Mj4J9N4j7o6Nj8N8rJ7j2k8oK8j2L7k5l9J3NM8oql3N1
$$ plain form
7257 -24 -21 -55 -39 -5 9 -1 -7 -49 -27 9 35 48 -4 -45 -8 -24 37 44 6 -15 -13 15 33 40 -12 -40 -29 -2 41 33 8 -23 -19 12
7291 12 39 22 -27 -41 -28 11 22 12 -31 0 -16 28 25 3 -56 -48 -17 8 18 2 -22 -16 -40 4 30 37 32 -34 -10 6 45 23 -5
7324 -5 -17 -1 16 30 43 27 -5 -8 22 28 7 -33 -15 -42 -10 35 1 -28 -45 -11 2 23 18 -56 -52 -50 13 37 1 -18 -28 -32 -19 25
7358 25 5 13 -14 -21 -21 60 22 1 -1 -10 4 42 23 0 11 -24 20 9 5 -19 -45 -43 -11 6 32 -29 -54 -34 5 6 -20 -39 -41 -47 -14
7393 -14 31 27 -3 -47 -44 17 49 40 -10 -25 -10 -6 55 20 3 -35 -17 12 21 -4 -11 -35 -15 15 29 5 4 -37 -38 -14 14 -6 -34 -73
7427 -73 -38 -19 38 15 -8 -48 -43 -16 23 26 3 -33 -40 3 30 38 -15 -10 -8 18 34 9 4 -1 -37 -9 22 54 5 -53 -41 -9 39 11
7461 11 0 -45 -36 -2 24 -5 -13 -45 -38 -15 17 28 -10 -7 -39 18 29 27 -9 -21 -26 -25 38 35 17 -31 -49 -5 44 2 17 -12 -30 23
7495 23 20 49 -13 -39 -33 -15 12 31 -22 -18 -32 -13 41 24 -42 -37 -55 3 -6 11 -1 -29 -35 -7 -19 18 -7 -46 -33 -28 20 14 6 -27 24
7530B4l7N3Pl1m9KJ8L5KMl7m8N3M3j2k4k2k6J6L1lQm6J3k1O2plk3k4L2PL7l1m5
7565d2KN1K2Kk7l9J0QN7rk6j7noM0Pj6k2k4K8K6J4k9Jk3qO3km0l0lL2J0Lj7k6
7601c5J3KK6oJ8n8mL5J6J6k7jn3P3K1Lj6l4%K3N0k4k7k5j5L7K7pj5k0l7M5nN0
7635D6l6m2l2L1M6J0k9k9qJ7L9j9K1m7LQM2oj2l4NK2J5K5j5l3j9L5L6Nl5m3NK5
7669cK7K2m2j9j9J3K2L2k0m1j8K9%L5m5j3j8L7L9%nj0n5L3K8%j6j3j5K7N3pk4
7702A4j2k7JN8mj9k9K7j8L3Ron7J4j4M1Pj4j9npN3Nk4k0m1M1KO4l4l7JJ7K1L6
7737E7n7l4J0OM9K3k0o6QK8L1j0rl7l3K3K7L1k6j9l5K8K7K5nm9j6kM8Mk9j8k5
7770f5L1N0J9j3k9k0%K2L1Lm8k9O1OJ8rj1k0J8ML0l2j3j9k3N7J3j8m2qK1K3J3
$$ plain form
7530 24 -13 40 47 16 -33 -31 -13 22 24 28 -9 -57 -4 39 27 3 -19 -45 -29 2 -1 7 -39 -26 -47 15 8 5 -18 -42 -10 -3 34 3 -42
7565 -42 -40 11 33 35 8 -31 -21 -13 44 35 9 -8 -13 -19 21 28 12 -10 -34 -6 20 34 5 6 -17 -25 38 36 -4 -34 -37 -5 5 8 -9 -35
7601 -35 -22 -20 6 0 18 -40 -44 -9 7 23 -4 -5 -58 15 36 39 23 -11 -11 12 62 38 11 -14 -29 8 35 28 13 -7 -44 1 -4 46
7635 46 10 -32 -64 -33 13 23 -6 -35 -43 -26 13 -6 15 -32 -29 -21 21 15 3 -31 -26 -4 11 36 21 -12 -31 4 40 45 10 -33 -28 -3
7669 -3 24 46 4 -15 -34 -21 1 33 13 -28 -46 -17 -17 18 -27 -40 -58 -21 18 18 13 3 -52 -19 9 9 -7 -20 -35 -8 45 38 14
7702 14 2 -25 -24 34 30 11 -18 9 -9 24 33 27 -30 -16 -30 11 18 4 -15 -20 -27 26 31 7 -13 -54 -13 -11 53 19 -18 -17 0 21 57
7737 57 0 -34 -24 -18 31 54 34 -32 -24 4 35 25 16 -21 -54 -31 -4 27 1 -18 -53 -25 2 27 22 -27 -43 -45 3 7 -22 -40 -65
7770 -65 -34 16 35 22 -7 -27 -27 -5 26 29 -19 -48 13 19 37 28 17 -3 15 19 49 17 4 -15 -38 19 32 14 -28 -36 -15 8 21
7803B1m1j9%%K0L0no7J6K1J4K5j7Pl0JN6L1l3j8m3K6O1m1L4q6OM6K5nk3l0j1R
7837b0M4pnm0k9J9K2N2j8l5j9J5K9JJ5n1m0M7K7J7j2l0k7J2M0L6j4m9lL3PL8k8
7870B7k8j5J8M0J5j7l5k6J0K3N1m5n1j4M6KK5m5kk6RM6K4j9n0KnM3L9j7n0lK9
7903A%M7lk1m4k9Q0j9J9m2kj1L5N2l6l2rqL8QMn6l2K9K9K8k8po6K2O1Rj3k0j4
7938c0rL2J5Rl4k4qQ8j7j1j2k6K4L6nj6k5rjM4L2m6Kn4lN5K7Ol3n2OM5J6J1m1
7973hk1j0L7RRk5j8JK4N0l3m1PoN1lJ8l4k9K1L0Qrk9j6j2O4Lnk2m3ML9K7j2m1
8009a5j1PN2lk6k7k4J8L2J2Ql7l9L5J4L2j0l8j4%J7O4l8j9k2K5M3J8l5%m2MK7
8042HP1l2m7k0k1N2J4Ol7Mn5N9RPl8j6qL0KJ7No0K2K2L6oj6l8J5J3M7k3j0n4K3
$$ plain form
7803 21 -20 -39 -39 -39 -19 11 6 -61 -45 -24 -10 15 -2 5 -25 -24 32 63 30 12 -31 -5 56 15 49 -37 -31 15 40 35 12 -18 -29 -20
7837 -20 24 17 12 -28 -57 -38 -16 36 18 -17 -36 -21 8 9 24 -27 -67 -20 7 24 12 -18 -45 -33 7 43 29 -20 -23 10 17 55 27
7870 27 -1 -16 2 42 57 40 5 -21 -11 12 63 18 -33 -47 -1 1 26 -19 -21 -47 -38 8 32 13 -37 -35 -40 3 42 25 -25 -28 1
7903 1 1 48 45 24 -20 -49 31 12 31 -11 -13 -24 11 63 27 -5 -14 -22 16 24 28 -28 -60 -31 -2 26 -2 -9 -75 -53 8 17 4 -16 -30
7938 -30 -39 -7 8 17 -17 -41 -49 39 22 11 -1 -27 -3 33 28 12 -13 -22 -23 21 53 7 9 -45 -48 7 34 40 7 -45 -39 6 22 33 -8
7973 -8 -29 -39 -2 7 16 -9 -27 -26 -2 48 15 -26 -19 -25 26 23 41 7 -22 -1 29 37 28 -1 -17 -29 35 38 33 11 -32 -28 11 38 26 -15
8009 -15 -26 -19 33 30 4 -23 -47 -29 3 15 23 -14 -53 -18 -4 28 18 -20 -34 -34 -17 47 9 -10 -32 -7 36 54 19 19 -23 -19 8
8042 8 79 47 0 -20 -41 11 25 31 -6 -2 -57 2 11 18 -20 -36 -44 -14 -12 5 10 -50 -28 -6 30 24 8 -30 -15 -2 45 22 12 -42 -19
8077a9N1mJ2l3ql2N2Qjk8oJ1K7qoj4l1mM4jPk0m4%L1L8j5rl7NL1M7k3l1l9oM2
8114a3L7mj4j4m7O8L3On8j0j1L7J1Pk7m3K7K0J2K6n0l7kM7J4KLl1k6J0M0rMn5
8148d7LK5L8J4o8LMJ0N2J4j4n4l8P7K3%k1m1J2K9K5J7o9j8j9N8KJ7m3p0L7K6N0
8181C4J6o3k7J9qM4ml0Rk4
$$ plain form
8077 -19 32 28 40 7 -1 -33 19 27 26 -2 -8 3 30 22 16 2 -29 -33 11 10 17 -3 -47 -47 -16 22 7 -2 -39 -34 -3 44 21 -10 -49 -55 -13
8114 -13 24 20 6 -8 -55 13 46 52 -6 -16 -27 10 21 28 1 -42 -15 5 17 43 -7 -44 -46 1 15 17 20 -11 -37 -27 13 4 8 -47
8148 -47 -44 -19 19 33 -35 -32 -28 -18 34 48 34 -20 -58 19 42 42 21 -20 -8 21 46 63 -6 -24 -43 15 17 34 -9 -79 -42 -16 34
8181 34 50 -13 -40 -21 -29 15 11 -19 -10 -34
8191c4
$$ Imaginary data points
##PAGE= N=2
##DATA TABLE= (X++(I..I)), XYDATA
0@%%%%%%%%%%%%%%%%%%qJ6j6J6j6J6k4L2l2L3m1M8n6O4p2Q2r0J04j20J32j45J62
40H5j82K03k24K48k75L03l34L71m07M48m97N47o01O63p32Q11r01R99j114J252
60F63j415J613j860K177k602L206m137N786r582L5000J3595l8645J2334P628J297
75B5058q039m363j3188j0852p326R726R868j1979k8134Q37K7397J5879j0189r467
89a4772o26o7o93J1454J6498K640j4158o204J4287J7039m955j7569m267R392K415
104A0414j990N935J125j7770j6420O291J8086N657j1340j1473L596Q714j799m026
118e000L229l157j1868K718K0852J0697j3019j7260j45J3922R529j625k790l18
132E765n760o227O583R941p965j9107k573J7529J2933m670r548k447J508J387
$$ plain form
0 0 0 0 0 0 0 0 0 0 0 0 0 0 0 0 0 0 0 0 -8 8 -8 8 -8 8 -16 16 -16 17 -24 24 -32 32 -40 42 -48 56 -64 68 -77 85
40 85 -97 106 -118 130 -145 158 -176 195 -212 236 -261 286 -315 348 -384 427 -474 525 -589 663
60 663 -752 861 -999 1178 -1424 1782 -2355 3431 -6151 28849 42444 3799 16133 23761 25058
75 25058 17019 12656 -532 -11384 -18710 -8984 884 -11095 -39229 -38392 -10995 4884 -5305 -14772
89 -14772 -15398 -15465 -16158 -4704 11794 14434 276 -5928 8359 25398 20443 2874 -1393 7999 10414
104 10414 8424 14359 15484 -2286 -18706 -12415 5671 11328 -12 -11485 -7889 825 -974 -5000
118 -5000 -1771 -4928 -16796 -14078 6774 17471 4452 -12808 -12953 969 10498 8873 6083 5765
132 5765 5 -6222 361 10302 2337 -16770 -19343 -1814 11119 6449 -3099 -5546 -4038 -2651
146b651N561R891K635j1612j0548P767J3521m008j4954l824O649L458K93K323
160D501p07r673j1801R53J4769Q282r934j0596M811Q626K69m58M012n4n288J876
176d12J3179R694q406j7481m805J0690P594l609m147p79m665n346N019R242l811
191A957j4379m439J2165J2456k160j0886m937K757K340L380R024M596r317r128
205f571O705J2197q25j1362o065M219N808L74j231k45n477j0123J42J3907Q603
220A0056p761r758J866O645J075k294J20J72l439j037Q452R856m406j4947m954
235a0354J0080Q482j979l774j247l774m474K530P048l85j0286o337Q953J3567
249H050K92j0342m858K811K119K827P116L219p604q706K720J0333K712r250p870
$$ plain form
146 -2651 2910 12801 15436 3824 -6724 1043 14564 10556 -4398 -8222 -1573 1885 2178 4501
160 4501 3794 -5879 -17680 -16727 -1958 6324 -3610 -14206 -9395 -769 -500 -958 3054 3000 -2288 -412
176 -412 12767 22461 14055 -3426 -8231 2459 10053 6444 2297 1518 -3147 -8493 -3474 5768 1957
191 1957 -12422 -16861 -4696 7760 5600 -5286 -10223 -7466 -5126 -1746 7278 11874 2557 -6571
205 -6571 134 12331 11506 144 -5921 -1702 4106 4480 3249 3004 -2473 -12596 -12454 1453 10056
220 10056 2295 -7463 -5597 1048 2123 -171 -51 121 -3318 -4355 4097 13953 9547 -5400 -10354
235 -10354 -274 8208 6229 2455 1208 -2566 -7040 -4510 2538 2153 -8133 -14470 -5517 8050
249 8050 8342 -2000 -6858 -4047 -1928 899 8015 11234 3630 -5076 -2356 7977 10689 1439 -6431
264f431L600P085L80k408m94m473q758o81J0900P930n122r234n25O772L583k122
280Bq70K038j029j927N804Q868k998j2970n457P519Q097j95m137k452j892k879
296d478N00N812K210q240p631O254J1887P69r104n586J323L046L406N150K829
311H147m908q208J80R735M974p706q157K840O978J188j995j300l733o093n30Q393
327a95P894l048r717k714O589M332k721j858J791n78j868M032O631j794j0120
342c344n678N716Q946J274m937k837m68k278n74N268L240o343p047M082J0081
357E101K306p178o498O91M357L298L183K720l599q519j554Q716N595o125p935
372e441Q91O123K616j797k544k798l958j032O751Q256j902r973l690O123M962
$$ plain form
264 -6431 -2831 4254 4634 2226 1732 -2741 -11499 -12180 -1280 6650 1528 -7706 -8231 -1459 2124 2
280 2 -868 1170 141 -1786 4018 12886 9888 -3082 -8539 -1020 7077 6882 2745 293 -1599 -4478
296 -4478 -3978 1834 4044 -4196 -11827 -5573 6314 7083 -2021 -7607 -6284 -3238 168 5318 8147
311 8147 3239 -4969 -4789 4946 9920 2214 -5943 -3103 3875 5063 3068 1768 -1965 -8058 -8588 -195
327 -195 7699 4651 -5066 -7780 -1191 3141 420 -1438 353 -225 -2093 1939 8570 6776 -3344
342 -3344 -9022 -3306 5640 6914 1977 -860 -1328 -3606 -4180 1088 4328 -2015 -9062 -4980 5101
357 5101 7407 229 -6269 -5578 -1221 2077 5260 7980 4381 -4138 -5692 3024 8619 2494 -5441
372 -5441 -4550 1573 4189 2392 -152 -2950 -6908 -7940 -1189 7067 5165 -4808 -8498 -2375 2587
387B587j586j964J025M87m72K715N027j40q095o500M347Q992J289n802l552m87
403b129j806n39M215L201m201o125J620Q455L805o175p364M13M744K859K437K704
419F114k633p443j668P657O513l253p422j157N566L652k207l405k206l190j623
434f705N621P878j222r124m390M698N555l11l144q62Q24k22R40L863R30o526n975
451h172M341R257K451m591l634n67l75q6K398K590k471n973n17P264M446n241
467A120o930L29M492K895J971J462k491o258k685N391O791j301p381k391N359
482C73M311j669l029j833k726j378M576O553n67q053n547L433O850J468l184q34
498a256J984O87Q84L574J057n820n783K548P438K634m667n440j099R57P7J347
$$ plain form
387 2587 1001 -963 62 549 77 2792 7819 7679 -416 -6916 -2569 6423 7712 1910 -1642 -2129
403 -2129 -3935 -4474 -259 2942 -1259 -7384 -5764 2691 6496 321 -7043 -6630 -1886 973 3410 6114
419 6114 3481 -3962 -5630 2027 8540 5287 -2135 -3292 2274 5926 3719 314 -1892 -5082 -6705
434 -6705 -1084 6794 5572 -3552 -7942 -3244 2311 2000 -1144 -2006 -1182 -1404 -464 3399 4329 -2197 -8172
451 -8172 -3831 5426 7877 3286 -348 -915 -1290 -1376 1022 3612 1141 -4832 -5349 1915 6361 1120
467 1120 -5810 -5481 -989 1906 3877 5339 2848 -3410 -6095 -704 6087 4786 -2595 -4986 373
482 373 4684 3015 -14 -1847 -4573 -5951 -1375 5178 4611 -3442 -8989 -5556 1294 2762 -422 -1256
498 -1256 728 1415 2299 5873 6930 1110 -4673 -2125 5313 7947 3280 -2160 -3259 -2302 -2225 -878
514h78K872j101n437j209N966M107m166o504q15M095L709J623P15j179m380k858
530e440M423P430K08o755l061M272M256p96k723k013j737m41L499N594O61p220
546A57p037J713O261J058m165k280N01K43P28K758J224l545m136K232P943M628
562H283l580n442o72J722L05R78K151r28m580j663M387M050k501n992j616M007
578a091L885N56m30j175l996l439L051O522R18n648l752K668M226J24l051k363
594b995r46k63K255N177J708n766o305J827O922L041k251k279K17J041Q31J302
610C516O13l044m940K91O586M134l704n838j238J849J301J002J344p20l608k167
626d623K817L951j636n764j919M124M242P74l47o16k651k235K762N951J926m247
$$ plain form
514 -878 1994 893 -4544 -5753 213 4320 154 -6350 -7165 -3070 639 2262 2977 1798 -2582 -5440
530 -5440 -1017 6413 6621 -134 -3195 1077 5333 4537 1814 -199 -1936 -2377 1122 6716 7377 157
546 157 -6880 -5167 1094 2152 -2013 -4293 -3792 -3549 -2821 -63 1161 -2384 -6520 -4288 3655 8283
562 8283 4703 -739 -1411 311 616 1594 3745 2817 -1763 -3426 961 5011 2510 -3482 -5098 -1091
578 -1091 2794 3350 2920 1745 -2251 -5690 -2639 3883 4801 -847 -4599 -1931 2295 2419 -632 -2995
594 -2995 -3941 -4204 -1949 3228 4936 -830 -7135 -5308 1614 4655 2404 125 342 1383 2214 3516
610 3516 4129 1085 -3855 -3564 3022 7156 3452 -2386 -3624 -1775 -474 528 1872 1152 -2456 -4623
626 -4623 -1806 2145 509 -5255 -7174 -3050 1192 1966 1619 1003 -1648 -3883 -1121 4830 6756 2509
642B509m216J505M382P54l036k252n63n13J331M013J202n390o580m4N435L541
658B078k064l458l38J466J014J388J610j639l785M18O227M593k520n650k069K026
674g03K245Q28N01m68k844k393K072M009q16n362k347L249L755M87j247j491k182
691b707j738J688M953K703l286m534Q82M326J109k539j954n25j63J331L254J423
707D223l636n621p68N351M470j377l662r05J155P73J035J171j526l589l25M796
723A565M502j557n592k867K068K879Q17K9m57k550k444J652L775k15m380k409
739e184K586M153J181j611j674j129j100J117M442K775k880m379K09L697J468
754C671j944k267p07L04Q88J970J323k794n466j501M621M580q80l492j297J041
$$ plain form
642 2509 -1707 -202 4180 4934 1898 -354 -917 -1430 -99 3914 5116 -274 -6854 -6898 -1463 2078
658 2078 14 -3444 -3782 -2316 -1302 86 1696 57 -3728 -3310 2917 7510 4990 -660 -2729 -703
674 -703 1542 2370 2871 2403 -441 -2834 -762 3247 2431 -2931 -5278 -2029 1726 2213 966 -525 -2707
691 -2707 -4445 -2757 2196 4899 1613 -2921 -2039 2287 3396 857 -1097 -1622 -1785 -454 2800 4223
707 4223 587 -5034 -5802 -451 4019 2642 -1020 -1925 -770 3 1038 2209 683 -2906 -3231 1565
723 1565 6067 4510 -1082 -3949 -1881 998 1815 1844 1387 -1163 -3607 -1955 1820 1605 -2775 -5184
739 -5184 -2598 1555 2736 1125 -549 -1678 -2778 -1661 2781 5556 2676 -1703 -1494 2203 3671
754 3671 1727 -540 -1247 -943 -55 1915 3238 444 -5022 -6523 -1902 2678 1798 -1694 -2991 -1950
770a950J251J323J109q02k628p48L851M597p36n446l274J915L086J002j44q99
786A507k436k078J179L142M40l625l003J890M311J244k003j863q52p36J133L841
802B091K486k136l945m51L300K179j561k501m74P63N99J318J285k144m871j639
818e701L844M393j75l329j939P46J580J088Q23k92k125j202L037M425k28m949
834dl414J427L165J579l24j326k051j818N53K918J115l120l270J414M146J459
850B449j811j974r03j12J372L131K175j532l736j067K952K485j331k591m56Q39
866a10N72R72R01j743l903j725K995M182M07l296k497O68J625Q71P88J23j734
883i04j228K424L997L49l970l507Q19L416J902n98j533j825j779K56K772J429
$$ plain form
770 -1950 -699 624 1733 931 -1697 -2445 1406 6003 5267 -179 -3453 -1538 1548 2550 2406 1507
786 1507 -929 -3007 -1828 1314 1754 -1871 -4874 -2984 1327 2571 568 -1295 -2147 -2883 -1750 2091
802 2091 4577 2441 -1504 -1955 1345 3524 1963 -538 -1012 -249 350 1668 2953 809 -4062 -5701
818 -5701 -1857 2536 2361 -968 -2907 -2161 -581 507 1330 1038 -1087 -2289 748 5173 4945 -4
834 -4 -3418 -1991 1174 2753 2429 1103 -948 -2766 -2213 705 1820 -1300 -4570 -3156 990 2449
850 2449 638 -1336 -2239 -2351 -979 2152 4327 2795 -941 -2008 944 3429 2098 -493 -949 -110
866 -110 462 1434 2335 592 -3311 -5036 -2041 2141 2548 -748 -3245 -2577 -952 -81 707 830 -904
883 -904 -2132 292 4289 4638 668 -2839 -2020 1396 3298 2700 1167 -658 -2437 -2181 591 2020
899B020k632l144Q11L654J841j604k523j057M05J355K456J998j157l599j315K762
915B71K671q94k382p66Q37Q28O46K94j285l004j656K402M211Q33l103k479N78
932a998J550R62P38k4j500j271J518L182Q35l295l672M08L466K086n46j510j810
949h81j701K48K478J544j961l045K6L254K350j253k687r49P14J422K244J837j038
966B602l397j449K333K778k91k317j138Q87J122L70o4r64k499j759J889L697P30
983B530k934k697J13J626J234N59K6r24r99Q80K924J345k651l466J44L180K203
1000C093l37j573j848j347K95K149J743j279l003o89K872K471j049k734j199N72
1016a863J465J966J446j071l100j657J808K938J53k420j534Q31J318L56k0o72
$$ plain form
899 2020 -612 -3756 -2945 709 2550 946 -1577 -2634 -2229 -874 1582 3580 2423 -1176 -2491 271
915 271 2942 2048 -334 -1100 -263 565 1211 1505 220 -2784 -4440 -2038 2173 3006 -97 -2576 -1998
932 -1998 -448 514 1252 1228 -272 -1543 -25 3157 3992 697 -2975 -2567 899 2985 2439 929 -881
949 -881 -2582 -2334 144 1688 -273 -3318 -3292 -38 2312 1059 -1628 -2577 -1863 -441 1803 3640 2602
966 2602 -795 -2244 89 2867 2576 259 -879 8 1130 1500 1436 472 -2027 -3786 -1897 1800 2530
983 2530 -404 -3101 -2988 -1362 -128 431 457 -467 -1466 -586 2338 3683 1032 -2434 -2290 890 3093
1000 3093 2756 1183 -665 -2012 -1717 432 2175 896 -2107 -2796 76 2547 1498 -1236 -2435 -1863
1016 -1863 -398 1568 3014 1943 -1157 -2814 -1006 1932 2085 -335 -1869 -1038 280 636 616 -56
1032e6j913j210J841L479J142k356k736j12J820J341J66k39p60j200L35K333J236
1049C111k223l209k79K744K304j84j815j835j080J47J783J868p59k920r71K472
1065h46K616m64k350j294O87J738J966J229p68k592j792J549L079N62k342j835
1081h57M97J169L34l66j083j781j141J189K867J256k181k919j81K029J579K67
1097F78j15n07r00L67J996J285j499k765n47K474K514p2j848j693q72O4J550J824
1115A934n29k705j365J742K344o8k306j706M79J726J636R31o22k420j860J352
1131a437L134R53j865j862K41J430Q11l73r52j276q68R22K638J313k047k961m44
1148b643J873J628K53m88o81o58J33J446J188j042k531q07K217K442n8j803j629
$$ plain form
1032 -56 -1969 -3179 -1338 2141 3283 927 -1809 -1921 -101 1240 1406 1167 407 -793 -458 1875 3111
1049 3111 888 -2321 -2600 144 2448 2264 449 -1386 -2466 -2319 -536 1332 573 -2347 -3318 -846
1065 -846 1770 1306 -1044 -2338 -1651 87 2053 3282 2514 -78 -1870 -321 2758 3320 978 -857
1081 -857 -360 809 1143 777 -306 -2087 -3228 -2039 828 2084 -97 -3016 -3197 -1168 411 678
1097 678 563 56 -844 -477 1519 2804 1305 -1460 -2007 467 2981 2909 1061 -632 -1504 -1440 110 1934
1115 1934 1405 -1300 -2665 -923 1421 1353 -953 -2659 -2180 -454 1182 2113 1491 -929 -2789 -1437
1131 -1437 1697 2650 785 -1077 -836 594 1405 1032 80 -1196 -2064 -1142 1496 2809 762 -2199 -2643
1148 -2643 -770 858 1111 623 -58 -716 -583 863 2051 1009 -1522 -2329 -112 2330 2272 469 -1160
1165a160p77K21J543J681k02k193j490J188K411M29k032j717M41J658J504Q79
1181B384n91k244j746J042K802J290j532k259l01J409Q59m50r48j144q43P76K370
1198H74J246j705k741o15J763K017M07o65o86l63J83J141J256o65k230q57J895
1215B55K234M5j749j811p58L67J277J301L4j898j724P10K299O75j691j604K17
1232a821J489J518P75n97j864j562P35K642J705j222k327m85J350J044k04r38
1248B38j197p47O48J903J094j396k699r98J668K160M53q31p72k93J37J072J195
1265A635m09j848q22J484K141L76j678j851n20N26J057J172J44j709j754M27K006
1282C77P87j263j659o1J391J495N56n25j530j491M13K500J807r64k260p81J093
$$ plain form
1165 -1160 -1937 -1716 -173 1508 1306 -887 -2377 -1189 1222 1651 -381 -2098 -1657 1 1505 2384
1181 2384 1793 -451 -2197 -1155 1647 2937 1405 -854 -1155 254 1113 663 -285 -1429 -2272 -1496 874
1198 874 2120 415 -2326 -2941 -1178 839 1246 581 -105 -468 -285 856 2112 1447 -783 -1640 255
1215 255 2489 2534 785 -1026 -1784 -1417 -140 1161 1195 -703 -2427 -1717 582 1257 -434 -2038 -1821
1232 -1821 -332 1186 1961 1364 -500 -2062 -1327 1315 3020 1798 -529 -1014 336 1380 1176 238
1248 238 -959 -1706 -1058 845 1939 543 -2156 -3154 -1486 674 1127 296 -476 -769 -632 440 1635
1265 1635 1226 -622 -1444 40 2181 2557 879 -972 -1492 -966 91 1263 1407 -302 -2056 -1629 377
1282 377 1164 -99 -1758 -1819 -428 1067 1623 1098 -432 -1923 -1510 990 2797 1833 -427 -1208 -115
1299a15J227R5q67j127o27N67J585J137j103k603j202J532K140N79q60r49m55
1316a046L69J055R87k21j453q54J144K137M46j646j870m46N57R89J033l2j491
1333c42j594J37J718J048r21j572j54J338J436M00m92j297j379L44K174J726o65
1350A905k122j094Q78J404K54r02j028n30L75J400J153r01k415j184J308K126
1366F27P97q59j200m58L99R66Q74r4j261r63R96K031M93j455j747m69P06J106
1384D89Q16j49j326j459j38J451J126q04j551k83J194J300M81m59j174r95M16
1401a065J888J718l32j962j275O94J388L34q12j018o06K54J226R79p43k148j262
1418b742R85K145J008r02j387n23M78R35R50L0j123q71Q69J859O26j244j771n89
$$ plain form
1299 -115 1112 1207 340 -787 -1414 -847 738 1875 772 -1831 -3033 -1501 639 1218 358 -591 -1046
1316 -1046 -677 378 1365 1144 -309 -1163 -19 2118 2564 918 -952 -1398 -841 148 1181 1149 -342
1333 -342 -1936 -1799 -81 967 46 -1526 -1680 -342 1094 1494 1002 -295 -1674 -1330 844 2570 1905
1350 1905 -217 -1311 -433 971 1225 323 -705 -1235 -860 540 1693 792 -1623 -2807 -1499 627
1366 627 1424 565 -635 -1093 -694 272 1146 1052 -209 -1172 -176 1855 2348 893 -854 -1323 -617 489
1384 489 1305 1156 -170 -1629 -1767 -316 810 6 -1545 -1828 -634 666 1147 688 -486 -1481 -1065
1401 -1065 823 2541 2209 247 -1028 -334 1054 1388 576 -442 -1048 -794 432 1411 668 -1480 -2742
1418 -2742 -1757 388 1396 494 -893 -1416 -938 -3 947 977 -146 -1017 -148 1711 2337 1093 -678 -1267
1436a267Q44J226O17k84j153j402j75J355J151n83j451m20R86J218L81o19j116
1453f92q45K93J594J642j69j824j304O34J414N70n71r69n98K91J061Q07n33j801
1471a000j326P76K139J090q59j467o06L61R55Q95m6j076r09N74J603P93j076j762
1489i41n56J006J264O25k71j182j294j35J242J044m57j299n58Q26J279M16o20
1506C89q98n72L04J441J473j10j722j354L36J244O62n20j049o24K64Q15Q28l45
1524E62j556j262O60J999J094o93j442p86M08J151Q89N7r00q61L71J433Q60r47
1542A037j764o31Q56J254O11l92j205j121p3J121J112j87j264p46O90J202K79
1559G79o31q72o03K99J329J338k3j400j222K31J392Q70m60r68o03J06O29O83k77
$$ plain form
1436 -1267 -423 803 1420 1136 -17 -1419 -1594 -239 912 329 -1122 -1542 -556 662 1043 424 -692
1453 -692 -1537 -1244 350 1992 1823 -1 -1305 -671 743 1313 742 -227 -825 -534 527 1334 801 -1000
1471 -1000 -2326 -1550 589 1679 820 -647 -1253 -892 63 958 912 -164 -1073 -499 1104 1897 821 -941
1489 -941 -1497 -491 773 1398 1127 -55 -1349 -1484 -242 802 345 -954 -1512 -686 593 1009 389
1506 389 -509 -1081 -777 664 2137 2027 305 -1049 -713 531 1193 673 -376 -1000 -736 79 907 562
1524 562 -994 -2256 -1596 403 1497 804 -638 -1424 -1016 135 1024 1081 181 -680 -309 1124 1984 1037
1542 1037 -727 -1358 -502 752 1363 971 -234 -1355 -1428 -307 805 618 -646 -1392 -702 500 779
1559 779 148 -724 -1327 -1028 301 1639 1616 216 -1006 -775 617 1487 1027 59 -544 -438 191 874 597
1578E97j402j197M63J719J200m78j474q80M28J149Q50N2p80j000J73J371Q74p36
1596I29j562p13P51J338P03n07j214j022j42J008J133q0j238p51O37J160M67n08
1614C89q60n01M14J163J070p5j319j314J16J284Q57l93r16o06J07O96O60k22j202
1633f52j010K32J482J195m05j498q77L51J070R67K15p29q63J12J140R35n02j447
1651b84r04N88J346N95m94j124j028j20J030J157l0j096q28M01J058N68n20r96
1669f81m49M49J054R85L8j221j168J34J237R02k38r28o93P5O11N24k14r21r73
1688a477J74J360J168l18j367r23K67J021R42J43p34q51k2R49R52j97j298q47
1706a058N68J293O84m43j166j079j52R35J015Jj019r19K72J122P17m15q76l73
$$ plain form
1578 597 -805 -2002 -1539 180 1380 902 -572 -1452 -1024 125 975 1027 247 -753 -580 791 1665 929
1596 929 -633 -1346 -595 743 1446 939 -275 -1297 -1439 -431 702 622 -616 -1367 -730 430 897 389
1614 389 -471 -972 -558 605 1675 1600 281 -1033 -917 367 1224 831 -85 -691 -584 112 772 550 -652
1633 -652 -1662 -1430 52 1247 842 -656 -1533 -1182 -112 855 1070 341 -522 -410 730 1665 1163 -284
1651 -284 -1188 -600 746 1341 847 -277 -1305 -1425 -395 762 732 -364 -1192 -791 267 835 315 -681
1669 -681 -1130 -681 373 1358 1396 175 -993 -859 378 1280 1042 114 -579 -504 107 631 417 -504 -1477
1688 -1477 -1303 57 1225 907 -460 -1383 -1116 -95 847 990 256 -595 -617 332 1284 1087 -211 -1058
1706 -1058 -490 803 1487 1044 -122 -1201 -1353 -418 597 598 -421 -1340 -1068 54 771 356 -520 -893
1724h93M55J017R28q3j158j169M7J074R60j76r72p18J39O05M78j20p95q80J07
1743a154J181J008k63j222r45J72J089J006J78o37p86j15P74R52j48j178r34L44
1761f78J151P54l62j127r64k0R25J101J73j003r94P6J033O45l60r30m99L99J032
1780C52Q49o7j024r90M9J125J053j07j028p77M0N70M69j13p55p60P9J047R61j46
1800H27j160r77J60J012R12O7o31q18j91P52R58M1q86q15K59J145P89l36j167
1819e9r48j18Q20R73J79r37j059J7R69Q10j47q72n55L77R64P44j23j001j013o1
1839a040J105J056l9r24p56P2O19N59j23p27o86N5Q23Q75j19j134r58J95J072
1858g5R25J40o03q12k22O47P75N4q40q59N4J056P77k29r71q61LR11J008K31q45
$$ plain form
1724 -893 -438 579 1507 1424 266 -903 -856 218 1178 1002 30 -688 -549 56 534 414 -381 -1261 -1154
1743 -1154 27 1035 772 -450 -1395 -1223 -134 872 1050 413 -373 -488 286 1238 1090 -88 -1022 -678
1761 -678 473 1227 865 -262 -1226 -1246 -321 780 953 -50 -1044 -968 65 710 350 -580 -1079 -680 352
1780 352 1201 1134 110 -880 -831 294 1347 1240 212 -565 -525 45 514 401 -354 -1114 -1035 12 973 827
1800 827 -333 -1310 -1150 -138 774 841 210 -608 -799 -47 911 952 66 -749 -490 655 1444 1108 -59
1819 -59 -1007 -1125 -305 668 847 -90 -1149 -1132 -163 647 500 -372 -927 -550 414 1158 1035 34 -979 -1040
1839 -1040 65 1121 1082 158 -598 -526 93 652 529 -198 -884 -829 -6 869 750 -384 -1342 -1147 -75
1858 -75 850 990 387 -425 -647 0 775 829 -11 -870 -816 240 1017 788 -183 -1044 -1041 -130 878 1109 264
1879B64j051j45Q26Q11j34q98o45K94R15P43m8r30r49l4J076J013jr29q89o3P33
1900d1N96j15o24o11O3Q28Q73j13j055r05R9R12Q70J03p08p35j64N97Q11J97o87
1921A91p75O8R03P41k27r86r51q4P88R59J79p55r63k10Q25R24K0p47o55J98Q10
1942B53P62p7q92r34m3R45J058R9q98r27m7O92N94m5o31o61m1P47P47m3r20q69
1964a131O1R91R09Q1p07p45j49N01P67J99o54p85O2P93P29m9q76q16lP84Q91J88
1986A041p16j029l40O65Q55L9p19o87J08P67P82k6q01p63k6Q59J026K13r12r44
2006f08j13O79O63K8o45o77K7O54O94k9q57q70j1R57Q85Q2p21p12j84N65P68J94
2028G69n72o60j08O97P21p7q58q01j1P39Q37K28o33r25l05O66Q74J88o34p46j2
$$ plain form
1879 264 -787 -932 -106 705 571 -327 -972 -678 237 980 932 2 -947 -981 95 1108 1107 178 -711 -774 -41
1900 -41 555 440 -184 -795 -732 96 969 856 -199 -1104 -1005 -93 777 880 172 -563 -727 -130 681 878 191
1921 191 -584 -516 387 1128 901 -85 -1036 -1120 -332 627 806 51 -912 -1122 -297 627 647 -100 -755 -557 253
1942 253 1015 938 46 -888 -931 14 1072 1171 273 -654 -701 -9 585 540 -91 -752 -793 -46 701 658 -262 -1131
1964 -1131 -1070 -79 830 911 204 -541 -690 -189 578 777 123 -662 -600 193 922 873 -3 -819 -822 -38 853 1041
1986 1041 325 -704 -1044 -379 476 515 -204 -891 -783 -16 766 740 -61 -824 -850 9 1035 1248 336 -608
2006 -608 -721 -42 621 649 4 -673 -646 8 702 673 -184 -1054 -1065 -108 777 859 138 -574 -758 -193 575 769
2028 769 197 -463 -571 126 847 770 -88 -889 -900 -161 676 904 271 -654 -959 -293 581 769 135 -611 -623
2049f23P09O66n5p18q47j22Q20J013J68p53r06j83P20P90J11o41o32r0N84O55
2069F66j4q26q78RQ52Q81J03o85p83j14O02P50K37m72o64j54O37O90k5p53p69
2090g10p3P09P73J70o55r33l14N26Q30K86n94p16o0O85O73P8n86p46q7P31R73
2111I60K03p15r65k78O28P83J30n74o88j40N70O93P8p66q23o0P87Q15J44p50q07
2132g75j18N73P46K86m01o57q9N76P25L5o99p47j04O26P15J36o54q36l34M76Q62
2153C42K92m92p08j23N44O38J19o05p43j27O54R10K93o38q63k48O10Q46J94n27
2173C68p05j93M66O44O9o58q11j33P19Q69J54o85p86j83N27P07K99m68o74j52
2193f26N08O82J34n95o37m4O80P52J61n88q51l49L66P50K38m72p07k24M82P08
$$ plain form
2049 -623 86 752 697 -21 -868 -990 -170 843 1011 258 -648 -831 -111 679 790 149 -483 -573 11 666
2069 666 652 -174 -1052 -1043 -191 690 793 108 -675 -789 -187 563 800 328 -336 -490 147 837 812 59 -710
2090 -710 -783 -74 699 869 214 -719 -1033 -507 323 609 15 -701 -761 -76 597 675 89 -657 -744 -13 960
2111 960 1163 448 -517 -795 -167 616 746 172 -516 -656 -86 607 685 -81 -904 -964 -177 638 782 32 -775
2132 -775 -893 -320 426 712 311 -346 -435 141 866 901 202 -545 -649 -23 692 828 174 -662 -996 -520 342
2153 342 634 142 -566 -689 -145 493 612 7 -736 -863 -209 701 994 356 -507 -755 -145 701 895 368
2173 368 -337 -530 -64 580 649 -9 -820 -953 -234 635 789 104 -682 -865 -338 369 668 200 -474 -626
2193 -626 -118 564 698 103 -534 -578 102 854 1015 427 -424 -773 -407 343 581 109 -598 -822 -340 368
2213C68J81m84o37j00N83P94L32n89q97l79N10P96K50m49o80k25N01N93J49n01
2233A16p60j97O50Q03J65o20q20k36N66P80L25l85o53k01M21O68J42o24p33j57
2253g50N87O65K05n35p71k68M78P77L37l89o92k95M21O25J36m92o12j44M83Q10
2273E76L16n12p86l07M50Q28L17m76p21l02L53N86K09n00o78k22O09Q08K25n38
2293B35p92l20N44P49K95l92o57k81M42O90K18m90o33j16N17O73J73n78p88l46
2313h57L70O99L30l25p04k23L72O32K45l78n99k08M89P13K57m66p89l14M03Q07
2333D54L56l35o90k93L34O14K07m59o58l14M72P03K52n34p97k52N28P75L89l27
2353D25o43k91L31O52K13m37o77k52N00O89K22n09p48k63M06P18L74l85o40l26
$$ plain form
2213 368 549 65 -572 -672 -89 705 1037 448 -449 -828 -318 478 728 279 -401 -626 -125 468 617 116
2233 116 -644 -841 -191 612 777 157 -663 -899 -333 447 772 387 -266 -467 -46 622 764 140 -593 -750
2253 -750 -163 502 707 172 -599 -867 -389 388 725 336 -356 -651 -230 395 531 39 -573 -717 -234 576
2273 576 892 380 -406 -713 -263 565 882 406 -315 -617 -264 322 531 31 -647 -869 -260 548 773 235
2293 235 -557 -877 -333 416 711 319 -338 -619 -177 513 731 241 -392 -508 9 682 855 277 -511 -857
2313 -857 -487 212 542 217 -487 -710 -338 294 539 161 -438 -646 -157 556 813 347 -442 -756 -353 454
2333 454 810 475 -215 -508 -174 440 647 188 -470 -784 -312 391 643 109 -688 -940 -412 363 752 425
2353 425 -218 -509 -178 474 687 250 -427 -679 -179 510 732 223 -525 -788 -382 336 710 325 -315 -641
2373f41L46N68K55l76n96j53M70O47K71m00p19l74L79P00L40l38p17l56L13O23
2393B42K34l00o28k23M33P05L15m66p75l08L84P55L65l42o57l32L37O27K84k98
2413C52o59k55M54O41J83n09p03l33L54O85L79l24o32l35L31O01L12l35n42k02
2433e37L97O06L00l47p18l44L72P00L58l05o53m31K33N90K33l14o07k89L13P23
2453B80L16l81o79l08L73P83M24k85o73l38K40N96L35l02o68k77L47O44K47m01
2473B73o99l53L38O90L76k68o87l55K43O13L03k65o05j94L19O51L16l52o50l09
2493f15L32O94L97k60o72l97J89N59L13k86n92l21K71O15K95l05p15l24L42P39
2513B59M79k57o07l83K25O36L49k85n99l21K58O21K82l76p22l49K89O49M34k27
$$ plain form
2373 -641 -295 273 528 152 -444 -597 -127 520 791 391 -328 -702 -323 377 717 379 -338 -694 -381 242
2393 242 476 176 -452 -675 -242 463 778 312 -463 -771 -387 368 733 391 -266 -598 -261 366 650 352
2413 352 -307 -562 -108 533 716 207 -496 -829 -475 210 589 265 -367 -702 -371 230 542 207 -335 -537
2433 -537 -140 466 766 419 -299 -643 -271 429 787 482 -171 -602 -369 221 454 140 -467 -756 -443 280
2453 280 596 215 -464 -772 -399 384 808 523 -150 -488 -248 348 683 381 -287 -564 -217 427 674 273
2473 273 -426 -779 -441 249 625 357 -330 -685 -442 171 474 209 -396 -590 -271 380 696 344 -306 -615
2493 -615 -283 411 808 548 -124 -521 -332 227 540 254 -338 -659 -388 227 522 217 -498 -822 -480 259
2513 259 738 481 -126 -509 -284 352 701 416 -183 -504 -246 375 657 281 -441 -790 -501 148 582 355
2533C55o60l94K53O29L50k27n09k78L09N99K91l40o24l73K58O67L92k58o44l85
2553e89J86N72L27j92n51k89J94N52L25k99o48l56K89O52M57j55n92m16K07O08
2573B82L87j46n67l80J99N89K81l01o91m01K42O59M31k43o64m01J96N65M16j86
2593B67n30k93L05N85L18k68n87l18K41O43M25k64o06m62J66M81L67j90n28l48
2613e96J77N39L46k23o02l39K41O43M16j51n94m14J18O02M06r8m79l77J49N99
2633C63L32k65o00m52K07N97L86k10o56m11J45N86M42j36n10l33K24N33L53k49
2653C46n50l82K24N99L79j48o06m11J56N66L77j59n04l51J32N00L26j78n78l70
2673f32J78O16M35j41n78m05J36M90M16j06n11m04J36N11L81j63n79l75K04N96
$$ plain form
2533 355 -305 -699 -446 183 533 306 -203 -481 -172 427 718 378 -246 -619 -361 306 698 440 -204 -589
2553 -589 -403 169 496 304 -247 -536 -342 210 535 236 -412 -768 -479 173 630 475 -117 -533 -326 282
2573 282 669 523 -44 -424 -225 364 645 344 -347 -748 -506 153 584 341 -323 -724 -528 37 453 267
2593 267 -263 -556 -251 334 652 384 -203 -521 -280 363 788 524 -82 -544 -378 103 470 280 -248 -596
2613 -596 -419 120 466 243 -359 -698 -457 186 602 451 -143 -557 -439 163 569 471 -8 -385 -236 363
2633 363 695 430 -170 -622 -415 182 568 358 -298 -709 -564 22 464 328 -182 -515 -291 242 595 346
2653 346 -204 -586 -362 237 616 468 -138 -549 -393 173 550 391 -113 -464 -332 168 494 316 -262 -632
2673 -632 -454 162 597 456 -122 -527 -391 99 515 409 -102 -506 -370 141 522 359 -220 -595 -391 205
2693B05M27j59o03m68Q0N61M09j21n04l54J64N53L61j86n10l24J99N41M00j56
2713E15o16m83J07N13L80j29m80l63J42N02L67j61m85l75J84N54M17j30n46m31
2733e18J26M99M17l1m43m05P7M47L57j62n54m42J62N33L98j13n23m63J25N26M57
2754D70l2m72m22J27N03L33j66m78l66J41N67M29j17n23m41P7M70M17q8n06l87
2775d64N0M49L28j12n13l56J58N32M18n5m88m43Q0N14M09m4m30m00O9M25L83q7
2797D23n23l84J10M97M10r4n78m48N2M69M69k7m62l74P1M82M19j10m79l82J11
2818c48N02M11j06n34m47J6N45M59o9m63l79N5M31L76r3m74l80R4N14L66p5n22
2840a21m09O8N05M31m2l85l74lM20L43l5m87l82N3M91M27r6n03m36K9M78M54J5
$$ plain form
2693 205 632 473 -130 -598 -518 43 452 331 -173 -527 -363 190 551 365 -145 -469 -270 271 671 515
2713 515 -101 -584 -477 36 416 287 -193 -556 -414 88 455 294 -191 -566 -382 172 589 459 -87 -518
2733 -518 -392 107 524 493 50 -355 -278 169 526 364 -190 -632 -470 63 461 348 -175 -638 -513 13 470
2754 470 438 -34 -456 -329 174 507 341 -137 -503 -362 205 634 517 -6 -447 -370 100 517 429 -77 -464
2775 -464 -414 35 363 251 -262 -618 -460 72 490 435 -53 -496 -416 98 507 463 33 -367 -298 127 510 423
2797 423 -100 -484 -374 123 533 439 -139 -587 -535 -66 403 376 -86 -460 -389 93 512 402 -77 -459 -348
2818 -348 154 565 459 -75 -522 -506 39 498 429 -34 -413 -358 73 449 356 -118 -498 -404 110 476 401 -121
2840 -121 -530 -462 43 474 432 47 -327 -330 90 433 398 -89 -471 -418 73 500 404 -99 -535 -506 -28 426 441
2863D41m44m12J2M56M01p2m28l71Q0M89M01m9m95m60L0M20M27l0m37m42M3L86
2885e4M12q0m18l26P7M61M17l3m73m35M1M23M62K0m18m52J6M17L15L1m33m22N6
2908c96M21M19p2m43m35k1M65M28P9m20m12ML87M20om26l61L7M51M22o0m46m80
2931d45jM51M38J6m18m58k0M09L76l9m17l60K7M52M05j5m44m02MM41M54L5m06
2954H3l76m1L75L85j5m00l80l5L88M30k3m26m48l0M29M06J12l99m08l8L52M33
2976C74L0l83l96JM31M26k9m04m35l4L84M55N4m27m49oL22M12J7l87l80J3M07
2999dM06Pl81m30k9M16M43P1l96m09o4L36M24J2l53l80k4L67M22nm28m18p7L65
3023a29M52R2l62m01q3L57M03P0l08l85j3L38M17J8m18m31m9L53M60N8l75m51
$$ plain form
2863 441 -3 -415 -403 53 454 382 -46 -417 -337 152 553 504 9 -451 -421 -1 426 396 -41 -483 -440 -54
2885 -54 358 278 -140 -466 -389 72 489 456 -17 -452 -411 12 474 494 76 -376 -360 57 372 403 -30 -452 -396
2908 -396 25 444 372 -71 -506 -527 -62 366 445 25 -387 -383 4 424 418 -8 -369 -332 119 541 481 35 -445
2931 -445 -446 5 443 459 41 -417 -437 -28 348 309 -108 -468 -441 11 416 401 -43 -445 -441 0 454 489 83
2954 83 -293 -334 41 426 411 11 -369 -404 -16 414 391 -35 -483 -513 -84 322 434 35 -373 -411 -59 374
2976 374 404 21 -375 -374 57 483 454 50 -385 -419 -35 420 474 47 -402 -408 -86 326 343 -44 -424 -411 -4
2999 -4 402 409 28 -402 -431 -15 428 499 103 -306 -370 -34 390 402 49 -331 -355 12 434 429 1 -417 -494 -129
3023 -129 323 415 53 -348 -431 -74 329 399 91 -294 -307 31 448 466 48 -383 -432 -79 381 439 64 -387
3045c87m6L50M01O1l55l97rL50M30K2l79m28n7M05M36Q5l76m19o2L24L73P2l61
3068C3l94m5L42M21M6l93m04o4L29M68J03l14m34r0K98L85R4l12l84n3L58M02
3090C92M3l27m53o3L09M65P9l65m18j31L11M12J04l18l55p0L34M11Q9l58m33o6
3112d08L78M18P7l31m27j06K92M18O5l01m02r6L43M09L6l46m10r5L57L91J35k92
3134A05m21p1K75M18R8k66l62r6L25L57J04l63m21j23L17M25J18l05m47j23K87
3155a69M00P1k41l58r1K81M19N3k92l94r7L11M46J37l06m12j17K50L87J22k75
3176A25l55j14K72L62J00k88m12r9K93L94J23k92l92j55K74L80J17k56l46j08
3196c77K95L83J32l33l56q5K63L86J51k91m19j68K65L73J51k47l73j12K53L58
$$ plain form
3045 -387 -433 -83 318 379 24 -373 -382 -32 398 420 41 -387 -444 -39 397 482 106 -313 -375 -51 322 394 33
3068 33 -361 -406 -64 357 403 10 -394 -458 -129 339 442 128 -306 -396 -98 287 381 69 -315 -368 -10 392
3090 392 435 108 -345 -408 -99 366 445 80 -338 -469 -158 254 358 40 -315 -385 -51 360 449 91 -342 -408
3112 -408 -30 388 465 134 -293 -399 -107 311 376 75 -327 -423 -80 329 365 19 -391 -486 -129 262 397 105
3134 105 -316 -387 -112 306 404 138 -224 -320 5 362 466 103 -318 -441 -124 301 419 114 -333 -456 -169
3155 -169 231 302 61 -297 -388 -107 312 365 73 -321 -418 -107 339 476 170 -242 -359 -109 278 400 125
3176 125 -230 -344 -72 290 390 102 -310 -409 -116 278 401 109 -283 -438 -164 216 333 77 -269 -377
3196 -377 -82 301 433 100 -256 -341 -78 308 459 168 -251 -419 -154 219 370 123 -250 -362 -109 249
3216B49J22k56m36j02K86M09J43k43m18j37K72L42J63k60l89r4K52L22J33k50
3236A08m34r3K97M00J52k56m12j09J93L85J44k57l16j55K55L57Q8k70l63j15K49
3257a52M08J64k51m24j16J93M01J86k65l59j26K12L58J70k66l83j38K52L98J45
3277D07k31l89j49K09L88J56k15l90j28K27L50J04k36l91j33K31M34J45k60m10
3297b81j26K17L80J83k00l52j08J86L57J41k19l88j31K24L67J29k23l75j71J70
3317b20L71K13k51l30j30J44L70J57k23l51j42K54L50J84j92l84j77J97L93J61
3337C94j82l62j70K14L53J23j94l73j72K18M03J05k09l67j89K02L48J84j92l47
3357b13j35K04L37J37j88l19j61K04L55J62j87l56j79J73L74J67j52l74j88J78
$$ plain form
3216 249 371 115 -321 -423 -137 272 415 172 -246 -383 -111 231 394 134 -255 -349 -97 225 358 108
3236 108 -326 -419 -122 278 430 174 -238 -347 -154 231 375 118 -198 -353 -98 259 347 77 -286 -401 -152
3257 -152 256 420 169 -255 -371 -178 223 409 144 -215 -341 -129 229 399 133 -250 -388 -136 262 407
3277 407 176 -213 -362 -153 235 391 176 -214 -342 -115 235 339 103 -288 -421 -190 244 389 129 -281
3297 -281 -407 -190 190 373 173 -179 -287 -101 256 397 178 -210 -341 -117 250 379 156 -219 -390 -220
3317 -220 151 364 113 -217 -347 -203 167 324 101 -250 -392 -138 212 396 204 -180 -357 -160 233 394
3337 394 212 -150 -320 -106 247 370 176 -197 -369 -151 252 357 148 -219 -408 -206 142 326 134 -213
3357 -213 -348 -144 193 330 142 -177 -338 -134 221 383 196 -160 -339 -166 208 375 223 -151 -339 -161
3377a61L31J64k22l23j77J73L77K10k28l51j85J86L69K03j56l41j76J53L51J56
3397C53k10l21j76J96L78J49k04l74j58J75L28K06j64l02k19J80L40J26j48l33
3417a78j67J81L63J81j79l90j68J46L55J86r5l80j86J61L30J63j62l27j59J48
3437a77L47K13j69l79k15J83L65J97j70l20j88J50L18J67j48l31k22J85L27J91
3457C24j38l51k22J73L38K04j31l15j76R3L69J64j47l26j72J71L30J74j43l61
3477a42j80J03L52J94j41l41j79J12L26J82j25l27j77J67L19K04j50l35k02J16
3497b24L64K04j40l08k01J23L42J91j47l45j68J31L35K00j60l49j97J41L01K23
3517C16j22l00j94J05K99J73j23l10j84J55L25J93j37l27j78J12L33J85r0k99
$$ plain form
3377 -161 170 334 112 -211 -388 -215 162 372 144 -207 -392 -206 163 366 210 -131 -307 -154 197 353
3397 353 143 -178 -354 -158 220 369 165 -209 -367 -192 136 342 178 -124 -343 -163 177 303 155 -178
3417 -178 -345 -164 199 380 201 -189 -357 -211 144 330 235 -145 -331 -170 160 323 161 -166 -325 -177
3437 -177 170 383 214 -165 -380 -197 168 365 195 -125 -313 -163 155 322 174 -157 -379 -194 133 324
3457 324 186 -165 -387 -214 124 328 197 -118 -294 -201 168 332 185 -141 -313 -142 188 362 219 -142
3477 -142 -322 -219 133 327 186 -155 -334 -222 104 286 161 -166 -343 -176 143 347 197 -138 -340 -224
3497 -224 140 344 204 -104 -305 -182 160 351 204 -141 -309 -178 157 357 197 -152 -349 -208 93 316
3517 316 194 -106 -300 -195 104 277 154 -156 -340 -185 140 333 196 -131 -309 -197 136 321 231 -68
3537f8k25P6L30K00j35l05j87J27L04J87p8l53k19J28L29J77q0k92k28R4L01J93
3559B76j02k76k25J26L26K22j44k94k15P9L17K59j39k80k29P4L43J71j11k61k23
3580c06J35L03J80j10l37j83P7L08K21q3l06k23J06L02J96q1k95j94J02K84K27
3601C23p1l28k24R0L26K28p2l41k05P3K73K33r8k92j98N5K79K17q3l16k49J04
3623b76L27K37p5k50k40P6K53K07k3k82j99R2K82K07p8l09k08O9K87K13j05k66
3645f1k48M4K92J97n5k78k01O2K94K36p7k83k21O2L00K49q6k39k85Q2K86K26o5
3668B31k65k31Q1K89K02o4l12k15L3L06J95n5k67k41N4K80K27k9k79k11P3K83
3690H5J95n2k66k22K4K99K30k5k98k14RK78K24l8k72k21M9K72K14q6k29k53O7
$$ plain form
3537 -68 -293 -217 113 313 178 -127 -314 -187 117 304 226 -127 -346 -218 111 288 208 -84 -312 -218 83 276
3559 276 174 -102 -327 -201 125 347 203 -91 -306 -227 90 349 210 -70 -299 -225 118 289 178 -83 -306
3580 -306 -171 132 312 202 -135 -318 -241 67 288 205 -101 -324 -218 84 280 199 -96 -290 -188 96 323
3601 323 252 -76 -300 -210 116 344 272 -69 -274 -201 72 305 207 -85 -283 -228 51 268 185 -131 -380 -276
3623 -276 51 288 213 -37 -277 -201 52 259 236 -46 -245 -153 129 336 258 -51 -259 -190 97 310 205 -61
3645 -61 -309 -265 27 224 169 -109 -310 -248 46 282 205 -78 -299 -237 63 312 226 -13 -298 -216 70 296 231
3668 231 -34 -265 -184 105 307 243 -69 -284 -251 55 250 195 -72 -313 -259 21 248 219 -60 -271 -198 85
3690 85 280 228 -38 -260 -236 63 293 268 -30 -244 -235 43 267 229 -43 -264 -215 57 271 185 -44 -297 -230
3713b30K58K68k6k72k49K3K75K16l6k61k46O1K61J99ll01k27N5K72K37nk47k79
3736b57K9K71J93j1k58k13K9K65K24l5k80k10J7K52K31Pk94k32MK51K11%k23k18
3760b47M7K36K62l9k39k69L3K52K54mk95k13J1K37K24j6k33k35OK61J93m0k49
3783f3k13J6K31K23J0k31k26KK60K26Qk30k22JK29K51k8k35k45K7K17K46J3k69
3807bk27k8K21K32J5k20k54J8K04K16L5k06k30K2K53K29Qk30k31l0K32K00Oj93
3831D0k50j8K08K25J8k26k64N2J92K29Kk26k26kJ87K62J1j84k36MJ87K61K6k45
3855B7k43K4J97K37J9k28k51n4K50J94L3k11k19QJ90K06J9k10k10l5K42K27M5
3878B57k04k54nK00K32L2k25k55J9J97K16Kj96k58l9K32K45L8k09k43l4K16K56
$$ plain form
3713 -230 28 296 270 -2 -251 -228 47 263 227 -34 -280 -219 42 241 238 -63 -290 -235 37 274 269 22 -257
3736 -257 -228 43 236 225 -33 -246 -217 48 272 237 -43 -253 -236 16 247 254 -40 -272 -268 -17 194 194 -29 -247
3760 -247 -200 36 298 259 20 -249 -216 36 290 286 -9 -222 -211 26 250 234 1 -234 -228 33 226 186 -63
3783 -63 -276 -260 -29 194 204 -27 -253 -251 9 235 243 13 -209 -208 21 272 244 9 -236 -209 8 254 267 -2
3807 -2 -229 -257 -36 196 211 -9 -263 -245 -41 175 210 4 -226 -204 49 278 286 56 -175 -205 27 227 233 40
3831 40 -210 -228 -20 205 223 -3 -267 -215 -23 206 208 -18 -244 -246 -59 203 214 30 -206 -202 -15 246 272 27
3855 27 -216 -192 5 242 261 33 -218 -272 -22 172 205 -6 -225 -217 -27 179 198 -12 -222 -257 -15 212 257
3878 257 53 -201 -206 -6 226 258 33 -222 -203 -6 210 212 16 -242 -281 -49 196 234 25 -218 -252 -36 220
3901B20L2k12k14j7J97K12J1k01k65KK20K07P2k31k77j3K04K26M7k20k30jJ99
3924c2K37pj75k27l6K15K40J8j75k55m7K19K47M5k07k20l7J58K23N9k46j97l8
3947b38J87K36K1j95k17o2K01K57L3j86k18k7J89K35K9j82k37l4J64K32L2j97
3969B3k35n2J74K29Q6k05k01l7J56K59M1j85k36m3J80K50N0k14k34l6J48K68L1
3992B17j41k28m3J20K53Nj66k41l9J83K35N9j81k11n7J71K26J02j87j98j04K03
4014b2K13N8j78k16o7J71K33P8j94k72m4J55K41N5j96j97o9J54K33O9j67k12n5
4037b29J83K70L9j83k02r7J62J96P4j66j92q8J58K14P6j80k38k7J79K45L8j85
4059D7k56n3J86K20P9j41k23o6J73K10Q0j92k06p0J74K09K4j27k49n5J12K41O6
$$ plain form
3901 220 252 40 -174 -191 6 218 229 28 -237 -235 -15 192 264 33 -244 -257 -53 173 220 0 -230 -231 -32
3924 -32 205 198 23 -204 -240 -25 215 233 58 -197 -244 -25 222 267 60 -160 -197 -39 184 243 -3 -200 -238
3947 -238 -51 185 206 11 -206 -268 -67 190 223 37 -181 -208 -19 216 245 63 -174 -208 -44 188 220 23
3969 23 -212 -264 -90 139 225 20 -181 -218 -62 197 238 53 -183 -226 -46 204 254 40 -194 -230 -82 186 217
3992 217 76 -152 -195 -75 178 183 17 -224 -263 -80 155 214 33 -178 -235 -64 162 264 77 -121 -225 -22
4014 -22 191 249 71 -145 -212 -41 192 270 76 -196 -240 -85 156 211 15 -182 -251 -97 136 205 38 -174 -229
4037 -229 -46 224 263 80 -122 -219 -57 139 213 47 -145 -233 -75 139 215 35 -203 -230 -51 194 232 47
4059 47 -209 -262 -76 144 223 82 -141 -207 -34 176 256 64 -142 -212 -38 171 195 68 -181 -236 -124 117 183
4082A83j23k14o7J43K08J05j46k50m7J50K43N3j51k08q2J45K16P9j41k15r4J39
4104g4K19O4j85k01o0J27K44P6j27k10p2J58J95J01j36k58p6J44K30N0j39k11
4126a41o7J41K21O1j33k39j13J73K25P4j50j85j04J39K20R5j38j88j01J80K03
4147A73O1j10k42r1J15K34Q8j15k53n6R5K34N6j30j89j16J50K13Q9j59j92r1J54
4170h2K11J05j11k23o0J14K27O2j55j98r7J19K17Q7j29k40q8J22K23Q8j08k22
4192a38m1P4K09J02j35k07o9J21K25P0j26k09o1J09K11J03j10k22j04J11K10R1
4214B14j63j82o9R9J95J00j12k28p1J03J93J57j44j82j21J21K15N7o0k22q9J04
4236h5K36Q1j33k26p5J04K25O8j09k00j21J17K09J12j14j87j07J28J91Q8r6k16
$$ plain form
4082 183 60 -154 -221 -78 130 235 89 -161 -208 -58 185 238 87 -121 -203 -58 158 237 96 -119 -213 -74
4104 -74 145 209 24 -177 -237 -110 134 210 83 -127 -199 -41 154 255 119 -139 -215 -71 159 209 70 -141
4126 -141 -208 -67 154 215 82 -157 -270 -97 128 202 52 -133 -237 -98 122 217 79 -109 -210 -30 173
4147 173 234 124 -118 -209 -94 140 228 113 -140 -196 -101 133 189 59 -130 -246 -96 117 206 47 -145 -236 -82
4170 -82 129 234 123 -100 -160 -46 181 243 88 -110 -207 -88 129 216 87 -153 -241 -119 104 192 84 -138
4192 -138 -179 -105 104 206 71 -136 -205 -84 141 211 85 -124 -185 -76 135 238 128 -94 -198 -87 123 214
4214 214 51 -131 -200 -101 94 194 82 -146 -217 -114 79 236 92 -90 -211 -90 125 182 122 -100 -189 -85
4236 -85 151 232 99 -127 -202 -98 127 195 86 -114 -235 -118 91 203 89 -98 -205 -77 114 202 106 -110
4258a10j06J28J67J11j10j77j26J29J92P7p5k04q6R1K20P3o9k24q5P3J91J21o2
4281A39k13j25P9K13J28j28j87j24J00K14R1r0j94j43J23J88J23j03j90j02N7
4302a44K48Q5r7j85r9R0K16J23j38j97r8R0K17Q4p7k10j10P6J91J01r2j89q9Q8
4326a16K13P3q8j68j05Q9J94J06q1j82j48J03J80J10r1j88n8L8K07Q1p3j83j31
4349b18R4K06J10j01j43j42Q6J69J08q1j67j00O1K07J05p2k11r1O3J94J00q5j65
4372g3j10N3K16R4p6j65j17Q2J73J16j05j80j19O8J74J37m8j87r3N1J82J23r0
4395A06j61j11R0J35J07m3j75j31Q0J79J20q4j58j30N8J70J10n0j99j38P9J98
4417E2J16p7j73r4N3J73J10n9j53r0J9J70J39o1j65j19P2J66J00p8j58r6M8J62
$$ plain form
4258 -110 -216 -88 79 190 80 -97 -223 -94 98 175 100 -104 -190 -99 121 194 125 -99 -184 -111 80 201 139
4281 139 -74 -199 -120 93 221 93 -94 -218 -118 96 187 97 -97 -240 -117 71 194 91 -99 -201 -144
4302 -144 104 189 92 -93 -192 -102 114 237 99 -98 -196 -106 111 195 118 -92 -202 -126 65 166 74 -115 -204 -116
4326 -116 97 170 82 -86 -191 -102 92 198 117 -65 -213 -110 70 180 89 -99 -157 -119 88 169 96 -87 -218
4349 -218 -124 82 192 91 -52 -194 -108 61 169 88 -79 -179 -118 89 194 122 -89 -180 -117 77 177 92 -73
4372 -73 -183 -130 86 180 104 -61 -178 -96 77 193 88 -92 -211 -143 31 168 120 -67 -160 -109 73 196 106
4395 106 -55 -166 -76 59 166 123 -52 -183 -103 76 196 112 -46 -176 -118 52 162 112 -87 -225 -146 52
4417 52 168 91 -82 -176 -123 50 160 101 -52 -142 -123 47 186 125 -40 -159 -87 79 179 101 -57 -153 -105 57
4441E7J21n4j83j04RK09R9m9j71q5N7J35J22m2j95j24P5J80R4n4j80r4M3J59J34
4466A59n1j39j21N5J66J25o1j94j10N9J57J21o2j71j15P2J36J36n8j40j26N0J69
4489E7Q4m3j73j08N1J86R6l5j58j49P4J64J13l1j94p7K1J88J03l6j77j15O0J70
4513G1J25o3j55j55M3J66J08m3j37j60Q3J25J51o5j52j03N7J95Q0n2j64r4K1J44
4537B6J47l4j67j26O1J39J20m9j44j20L7J32J39n2j54j52L6K05J05n8j47j00L4
4560a22J69R4pj55j16L5J47J59l6k30o9K0J61R3j3j45j20KJ53J14l5j80j04O7
4584a18J43J45o5j27j26K5J62J02mj61j17K2J65Q5n1j15j21K8J61J07Jj60j20
4607a39J8J76J23m5j67q7QJ29J10j6j30j25K1J63J58q0j41j26J8J45J03nj40j42
$$ plain form
4441 57 178 124 -59 -163 -154 55 154 105 -66 -151 -94 41 163 121 -74 -198 -123 57 151 97 -83 -177 -134 25 159
4466 159 108 -31 -152 -97 69 194 133 -61 -171 -112 45 166 104 -67 -182 -110 26 162 104 -36 -162 -112 57
4489 57 141 98 -75 -183 -132 54 150 115 -43 -192 -118 46 159 128 -66 -143 -122 66 169 133 -44 -159 -99 71
4513 71 196 133 -22 -177 -134 32 140 97 -40 -200 -117 8 159 94 -58 -161 -104 91 171 119 -45 -139 -118 26
4537 26 173 139 -28 -154 -93 46 166 117 -27 -147 -110 22 161 109 -45 -197 -161 44 149 91 -56 -156 -122
4560 -122 47 141 134 -21 -137 -102 45 204 168 -62 -131 -111 50 143 130 -15 -135 -133 20 134 99 -81 -185 -118
4584 -118 25 170 105 -22 -148 -123 39 141 137 -24 -141 -119 46 131 80 -35 -156 -128 33 140 141 -19 -139
4607 -139 -121 55 178 133 -34 -121 -113 16 126 110 -20 -145 -124 39 197 117 -24 -150 -132 13 116 111 -29 -171
4631a71L2J54J18j0j45j34N2J42J19l8j23j26L5J23J24Pj47j44PJ47J09k8j47
4654d4j10J9J32J23%j55j25J5J56J38k6j51r5L0J14R4K6j54j14J0J45J24Lj72
4678a7j32K4J22J10j1q7j28k1J17J58j2j47j18J1J54J22qj52q1l8J54J15J8j41
4702A2j42L1J24R0Jj53q8JJ15J19oj34j15k9J77J20j3j32j32LJ72J05j4j02j47
4727a37J8J25J31J3j77j19J6J52J01k5j14j29PJ20J32jj08j37J3J36J29oj38j28
4751a26RJ08J39mj22j51J8J29J17Qj55p6J2Q1J26mj11j33l2J72J35k6j15r2lJ03
4777GJ30j0j27j26PJ39J00L0j32j63L3J04J11J3j26j29j0J31J03K5j04j39K1J15
4801CJ10Pj19r1l3J29J34k5p3j57NQ2J42k1r5j27j5J53P4L7j20j24K0Q7J58k4
$$ plain form
4631 -171 -139 15 133 123 -22 -156 -104 38 157 119 -4 -130 -95 28 152 159 12 -132 -125 22 131 103 -44
4654 -44 -154 -135 -3 120 120 -35 -160 -145 11 149 123 -28 -123 -93 21 115 141 -13 -127 -117 28 152 155 -17
4678 -17 -149 -125 -3 107 96 9 -119 -140 -23 135 123 -24 -142 -131 23 145 137 -15 -96 -134 20 135 153 12
4702 12 -130 -99 25 115 116 -37 -125 -124 -9 110 104 -30 -145 -174 3 123 110 -22 -154 -151 21 126 112 10 -137
4727 -137 -119 6 137 150 -27 -146 -130 22 123 98 -16 -145 -138 -18 114 113 5 -132 -119 17 146 140 2 -126
4751 -126 -117 -9 130 126 4 -147 -129 0 117 125 -30 -106 -94 -13 113 109 -2 -135 -167 5 140 114 -1 -93 -96 7
4777 7 137 127 0 -126 -119 20 120 150 18 -145 -112 -8 103 116 -10 -139 -149 -18 85 110 6 -133 -112 3
4801 3 113 120 1 -90 -123 6 140 115 42 -115 -110 -28 114 93 -2 -129 -144 9 83 120 0 -124 -104 -17 141 117
4827A17j05j00k0J03J19Op8j59OJ12J21%j41j08NJ08J05J9j14j08l3J30R8K9j22
4852a0j06j7J23J31%p7j54nJ04J24M2r8j58l1J41J09Pr8j52K5O2J15K6r9j48k
4878a46R5J55Or2j03j7J04J16K1j10j33lJ22Q6K3r6j64K2P1J49pp5r5n6J06J05
4904H4M1j33j02j1J15J02J5j34q2j7R3J49J7p8j54k6Q2J24K1r8j38mQ4J24J5n1
4930C8j28n3J32Q8N6j03j22mO2J35J3q2j15nP5J12rn2j44l3Q3J19L7q9j07l1R8
4957b9Q9O1p4j13l7J13J12J1j30q6l3R1J17J8r8j19qP8J26J1p1j21j1P6J11K3
4983A07q6j21p3J36R7P4r5j24j6Q2R8L8j00r3k5P5R8O0q3j27m1Q9J18K5o6j34
5009h7n2P5R8N5o9r3n0R9J18L8q8j19KP1Q6M6q3j27j9P4Q7L2j04q5j0L6J40J3
$$ plain form
4827 117 12 -88 -108 -5 114 120 42 -117 -111 1 122 122 -19 -127 -122 -14 91 110 -4 -112 -145 -15 83 112 -10
4852 -10 -116 -133 -10 121 121 44 -110 -115 -11 113 155 57 -101 -132 9 118 125 27 -125 -100 -38 77 103 4 -144 -146
4878 -146 -51 104 110 18 -85 -102 2 118 139 29 -104 -107 15 101 124 28 -136 -114 -43 106 99 24 -71 -127 -21 84
4904 84 125 -8 -110 -121 -6 96 111 -23 -105 -122 -29 120 137 59 -95 -121 -39 85 106 8 -130 -134 -50 74 89 38
4930 38 -90 -143 -11 77 133 30 -92 -96 -34 101 114 32 -83 -88 -13 99 90 38 -106 -139 -56 63 100 11 -96 -127 -29
4957 -29 60 121 47 -66 -103 10 122 133 3 -83 -116 -25 92 110 12 -107 -115 -37 89 100 29 -92 -103 -27 84 107
4983 107 21 -100 -173 -37 60 134 39 -85 -101 -19 79 117 17 -76 -101 -26 72 132 49 -78 -119 -30 88 113 47 -87
5009 -87 -139 -64 34 89 20 -73 -123 -24 94 132 44 -75 -73 -2 84 130 47 -80 -99 -25 62 94 -10 -95 -105 -69 71 84
5037H4n8j27j2M5J48L8n7j62l7Q7J45J2q1j16j2N2J28L6q7j18j6O8J17L9q3p4
5063d1p0P6Q5P6p0j20l4P5R5N2r9j10k0R9O0O2m9j05o9P4J09J8q1j34JO8R9K9
5091G6o1r8m9R6J07N4p9j21k2Q4R0K0m5j22k0O1J03O8j04j09j5N8J04J9m3j28
5117g6l5M4J27L3n8q4q4R7R5N2j01p4l5O5R4N3m4j43n8N6J41O2q2j11l4M0J27
5144F7M0p2q9n7M5J06Q1q0j01l2O7O4P0o6j03k6N0Q6L0l8j05l4M3J17L4n1j08
5171f2m7P7R7L1k6j36m0P6Q1O6p2r9l7P2R6L5m7j08p0P8P4P5o6j17k8N9J01L4
5199I7o3r4m9M3J23N9l7j37m7M6J17M1n7p5o1N6P1P9l5j03r5J09N0P1o2j00n3
5226a06P3J06M6q9r0l6M9O4O5k3j16l6M9J24K6l6j00j05R8R5P7n8j29k5N5O5O8
$$ plain form
5037 84 26 -101 -113 -68 80 118 61 -101 -138 -51 94 106 25 -91 -103 -51 77 113 26 -92 -108 -40 77 116 33 -41
5063 -41 -111 -35 50 126 56 -64 -98 -23 72 124 25 -85 -105 -6 54 116 67 -38 -107 -33 76 94 13 -121 -120 -52 47 76
5091 76 15 -83 -132 -36 71 125 46 -75 -97 -13 77 97 52 -70 -90 -29 74 142 38 -71 -86 -28 76 95 52 -76
5117 -76 -111 -67 60 93 35 -49 -133 -36 59 111 10 -64 -99 -34 60 113 69 -74 -132 -76 65 127 45 -66 -100 -60 67
5144 67 107 35 -54 -111 -66 40 121 41 -60 -92 -25 39 109 43 -60 -86 -36 50 80 42 -63 -97 -54 63 97 46 -62
5171 -62 -109 -32 65 96 70 -66 -106 -30 51 117 45 -54 -91 -19 77 112 65 -43 -113 -35 39 114 48 -69 -97 -38 63 97
5199 97 34 -60 -109 -66 57 116 79 -58 -105 -59 58 99 42 -33 -94 -38 33 112 77 -26 -121 -12 38 109 47 -53 -106
5226 -106 -33 73 119 30 -60 -96 -47 17 82 59 -57 -93 -44 80 106 70 -30 -135 -37 58 135 77 -52 -77 -22 43 111
5253A11p2p9m5J6J10M0l9j26j4M6P8N6j3j17k9K0P0R5o5r7m3N0J20M5o2r1n1L6
5281e0R8M6j0r1p2M2R9P1p4j14l2M3J01N1q2o9l3J4Q4O9l8j03o6M4J00M8j5j09
5309d8n0M3R6P5l7j16o6M5R3P1l4j02m9L2O9Q2m1j01p2M0J09N8m9r9n8L6J01P4
5337A02o9p8n2L1R1P8k3j30k8M4J00L9n3q2p5M8P0J02k7j06p6N0Q5M5l7q6n7J2
5365h2R5O4j3j16o2L9J44L6n3p7p8O8O7N4l2q1p7N4Q3P8o0q5n6K0J09N3k6q6o7
5394h7K9O7P9l8p2n9J0J17M2j2q9o7L9O9P4l7r1p5O9P6O5m6r9n8M3N1O6Nj28l8
5424i5M3P8P9l5j26j4K2P7O6l2r4k7JP9R4l4j13n9L8M5R0k1p3r0K4J40K8j2j05
5453b6p4N3R0N2l3q9o7M0P7P1Kj01r2L1P8O7j4q6n5J1Q0J5J4q6q0K8J22O3Kj09
$$ plain form
5253 111 39 -40 -85 -69 41 81 42 -84 -98 -52 26 82 69 -48 -77 -57 13 108 43 -54 -97 -47 73 118 56 -35 -86 -50
5281 -50 48 94 84 -7 -79 -37 62 133 59 -55 -87 -44 57 108 26 -43 -76 -62 22 91 53 -50 -116 -72 28 76 61 -48
5309 -48 -98 -55 41 116 79 -37 -103 -58 35 106 72 -30 -79 -47 22 104 63 -38 -110 -70 39 97 48 -51 -109 -73 28 102
5337 102 33 -45 -97 -66 25 103 80 -50 -78 -34 66 105 52 -30 -105 -57 13 115 88 -18 -94 -44 41 86 49 -37 -94 -82
5365 -82 13 77 64 -52 -114 -75 69 105 52 -25 -103 -35 32 86 54 -27 -104 -50 33 111 51 -34 -90 -70 39 92 66 -20 -87
5394 -87 -58 9 88 50 -22 -81 -71 46 88 76 -13 -80 -41 28 102 65 -26 -101 -32 44 109 63 -36 -94 -51 0 66 71 -57 -95
5424 -95 -52 26 105 70 -56 -70 -48 29 95 63 -31 -58 -57 22 116 82 -31 -90 -52 -7 83 62 -11 -101 -77 63 91 79 -26
5453 -26 -100 -47 43 95 62 -27 -94 -54 23 94 96 -5 -97 -66 12 79 65 -21 -76 -65 15 30 44 -42 -122 -94 28 91 93 -16
5483a6o4L8P3P2l7p5o6J0Q8N8j1j12l8M1N0R5m1r5j8j0P7N1L4j42m8M5Q5L9k1
5512F2j02k0OO1R4k4r4o1K9P2N3j6p8o5L1Q6N5l2o0p5K6P6N7L2j17n0PR0L4j3
5542F4o7p1J4Q7P0k2j11l7LN9Q7Ko7j09LJ05O1mq7q4J9J01N1j6q4m1KP7Q0J3r8
5573@n6J5M8R8l1j07n4J9Q3K9Lm9q9%R8P1Nq9o9JJ04K3K1q1p5K5O1J02l0n7p9
5604f0J3O1N4rp3m5kL8J05l9k9j07L7P5L9Mo5p8K3R6M1Lq4n2m1J21N4j9p6p2R
5635g8R9M1j0n4p3J3N2Q9qo6o2pO2P9k0o1n6lO4N5J0n9r9K5P3N8rm6n5k9O0P8
5667F3Ko3q3J2Q6O0J1p0r5J2P6O8k8m6p4rP8Q2l5l7r5K6N2N7K6j09l4J7L0Q2K
5698F4q6n0RQ5N4K1r3m6J1K4P8K1r1n9jO0O7on6p2j7Q3O5Op7o1PQ7M5j2l1j07
$$ plain form
5483 -16 -80 -42 31 103 66 -9 -75 -65 23 81 70 -42 -80 -39 11 106 65 -30 -48 -58 19 70 104 -38 -86 -41 44 83 62
5512 62 -40 -60 -54 7 101 77 -17 -78 -49 23 76 60 -18 -83 -52 34 89 57 -3 -78 -52 24 81 113 -4 -54 -47 43 77 64
5542 64 -3 -74 -60 27 97 75 -36 -73 -70 -11 76 78 11 -98 -95 10 71 67 -20 -104 -85 16 67 51 -33 -74 -72 5 85 98 0
5573 0 -56 -41 7 105 74 -33 -87 -68 15 44 47 -2 -91 -91 7 78 83 -6 -75 -74 30 53 74 -7 -82 -57 4 106 76 19 -60
5604 -60 -47 14 68 59 -14 -59 -61 -23 82 43 14 -93 -56 19 58 62 -3 -81 -58 38 79 82 -2 -54 -95 26 80 61 -15 -87 -78
5635 -78 21 62 52 -2 -75 -62 -10 79 71 5 -57 -64 -2 77 57 -4 -60 -63 1 56 66 7 -92 -67 6 64 55 9 -46 -75 -15 63
5667 63 65 2 -81 -69 17 77 88 18 -77 -65 11 79 51 5 -69 -78 0 82 47 10 -85 -59 -7 50 76 -33 -67 -50 -20 62 64
5698 64 -22 -72 -63 22 76 97 4 -42 -31 -7 71 92 1 -58 -59 1 68 62 6 -66 -83 0 65 71 -6 -67 -60 27 72 60 29 -78
$$ [...]
8191A
##END NTUPLES=NMR FID
##END=
