##TITLE=1H_AM_NVBENZ_SPIRT
 CDCL3
 8 sc, 
 11.04.2022
##JCAMPDX= 6.0         $$ Bruker NMR JCAMP-DX V2.0
##DATA TYPE= NMR FID
##DATA CLASS= NTUPLES
##ORIGIN= UXNMR, Bruker Analytische Messtechnik GmbH
##OWNER= root
$$ XWIN-NMR		Version 3.5
$$ Mon Apr 11 14:47:22 2022 Russian Standard Time (UT+4h)  she@DPX200
##.OBSERVE FREQUENCY= 200.13135
##.OBSERVE NUCLEUS= ^1H
##.DELAY= (6, 6)
##.ACQUISITION MODE= SIMULTANEOUS
##.ACQUISITION SCHEME= undefined
##.AVERAGES= 8
##.DIGITISER RES= 18
##SPECTROMETER/DATA SYSTEM= spect
##.PULSE SEQUENCE= zg30
##.SOLVENT NAME= CDCl3
##.SHIFT REFERENCE= (INTERNAL, CDCl3, 0, 15.7039)
##AUDIT TRAIL= $$ (NUMBER, WHEN, WHO, WHERE, WHAT)
$$ ##TITLE= Audit trail, XWIN-NMR		Version 3.5
$$ ##JCAMPDX= 5.01
$$ ##ORIGIN= Bruker BioSpin GmbH
$$ ##OWNER= she
$$ F:/spectra/data/she/nmr/H-F/1/audita.txt
$$ ##AUDIT TRAIL=  $$ (NUMBER, WHEN, WHO, WHERE, WHAT)
(   1,<2022-04-11 14:46:07.65 +0400>,<she>,<DPX200>,
      <created by zg, POWCHK disabled, PULCHK disabled
       configuration hash MD5:
       00 E9 B6 7A A2 85 ED C7 34 08 36 98 17 FE 4E 26
       data hash MD5: 16K
       8C 67 F6 BB 28 B5 1D 55 44 27 42 51 28 91 E2 89>)
$$ ##END=
$$ 
$$ hash MD5
$$ 2C B9 D5 53 C2 D7 E1 01 71 44 BB CC 25 BA E7 B6
##$RELAX= 
##$RELAX= 
##$RELAX= 
##$RELAX= 
##$RELAX= 
##$RELAX= 
$$ Bruker specific parameters
$$ --------------------------
##$DU= <F:/spectra>
##$EXPNO= 1
##$NAME= <H-F>
##$PROCNO= 1
##$TYPE= <nmr>
##$USER= <she>
##$AMP= (0..31)
100 100 100 100 100 100 100 100 100 100 100 100 100 100 100 100 100 100 
100 100 100 100 100 100 100 100 100 100 100 100 100 100 
##$AQSEQ= 0
##$AQ_mod= 1
##$AUNM= <au_zg>
##$AUTOPOS= <>
##$BF1= 200.13
##$BF2= 200.13
##$BF3= 200.13
##$BF4= 200.13
##$BF5= 200.13
##$BF6= 200.13
##$BF7= 200.13
##$BF8= 200.13
##$BYTORDA= 1
##$CFDGTYP= 0
##$CFRGTYP= 5
##$CHEMSTR= <none>
##$CNST= (0..31)
1 1 145 1 1 1 1 1 1 1 1 1 1 1 1 1 1 1 1 1 1 1 1 1 1 1 1 1 1 1 1 1 
##$CPDPRG= <>
##$CPDPRG1= <>
##$CPDPRG2= <>
##$CPDPRG3= <>
##$CPDPRG4= <mlev>
##$CPDPRG5= <mlev>
##$CPDPRG6= <mlev>
##$CPDPRG7= <mlev>
##$CPDPRG8= <mlev>
##$CPDPRGB= <>
##$CPDPRGT= <>
##$D= (0..31)
0 1.2 0 0 0 0 0 0 0 0.06 0 0.03 0 0 0 0 0.0002 0 0 0 0 0 0 0 0 0 0 0 0 
0 0 0 
##$DATE= 1649673967
##$DBL= (0..7)
120 120 120 120 120 120 120 120 
##$DBP= (0..7)
150 150 150 150 150 150 150 150 
##$DBP07= 0
##$DBPNAM0= <>
##$DBPNAM1= <>
##$DBPNAM2= <>
##$DBPNAM3= <>
##$DBPNAM4= <>
##$DBPNAM5= <>
##$DBPNAM6= <>
##$DBPNAM7= <>
##$DBPOAL= (0..7)
0.5 0.5 0.5 0.5 0.5 0.5 0.5 0.5 
##$DBPOFFS= (0..7)
0 0 0 0 0 0 0 0 
##$DE= 6
##$DECBNUC= <off>
##$DECIM= 32
##$DECNUC= <off>
##$DECSTAT= 4
##$DIGMOD= 1
##$DIGTYP= 9
##$DL= (0..7)
0 120 120 120 120 120 120 120 
##$DP= (0..7)
150 150 150 150 150 150 150 150 
##$DP07= 0
##$DPNAME0= <>
##$DPNAME1= <>
##$DPNAME2= <>
##$DPNAME3= <>
##$DPNAME4= <>
##$DPNAME5= <>
##$DPNAME6= <>
##$DPNAME7= <>
##$DPOAL= (0..7)
0.5 0.5 0.5 0.5 0.5 0.5 0.5 0.5 
##$DPOFFS= (0..7)
0 0 0 0 0 0 0 0 
##$DQDMODE= 0
##$DR= 18
##$DS= 0
##$DSLIST= <SSSSSSSSSSSSSSS>
$$ [...]
##$SUBNAM2= <"">
##$SUBNAM3= <"">
##$SUBNAM4= <"">
##$SUBNAM5= <"">
##$SUBNAM6= <"">
##$SUBNAM7= <"">
##$SUBNAM8= <"">
##$SUBNAM9= <"">
##$SW= 18.05172834244
##$SWIBOX= (0..15)
0 0 2 0 0 0 0 0 0 0 0 0 0 0 0 0 
##$SW_h= 3612.71676300578
##$TD= 16384
##$TD0= 1
##$TE= 0
##$TE2= 300
##$TE3= 300
##$TEG= 300
##$TL= (0..7)
0 120 120 120 120 120 120 120 
##$TP= (0..7)
150 150 150 150 150 150 150 150 
##$TP07= 0
##$TPNAME0= <>
##$TPNAME1= <>
##$TPNAME2= <>
##$TPNAME3= <>
##$TPNAME4= <>
##$TPNAME5= <>
##$TPNAME6= <>
##$TPNAME7= <>
##$TPOAL= (0..7)
0.5 0.5 0.5 0.5 0.5 0.5 0.5 0.5 
##$TPOFFS= (0..7)
0 0 0 0 0 0 0 0 
##$TUNHIN= 0
##$TUNHOUT= 0
##$TUNXOUT= 0
##$USERA1= <user>
##$USERA2= <user>
##$USERA3= <user>
##$USERA4= <user>
##$USERA5= <user>
##$V9= 5
##$VALIST= <valist>
##$VCLIST= <CCCCCCCCCCCCCCC>
##$VD= 0
##$VDLIST= <DDDDDDDDDDDDDDD>
##$VPLIST= <PPPPPPPPPPPPPPP>
##$VTLIST= <TTTTTTTTTTTTTTT>
##$WBST= 1024
##$WBSW= 4
##$XGAIN= (0..3)
0 0 0 0 
##$XL= 0
##$YL= 0
##$YMAX_a= 55235
##$YMIN_a= -42648
##$ZGOPTNS= <>
##$ZL1= 120
##$ZL2= 120
##$ZL3= 120
##$ZL4= 120
##$ABSF1= 10
##$ABSF2= 0
##$ABSG= 5
##$ABSL= 3
##$ALPHA= 0
##$AQORDER= 0
##$ASSFAC= 0
##$ASSFACI= 0
##$ASSFACX= 0
##$ASSWID= 0
##$AUNMP= <proc_1d>
##$AZFE= 0.1
##$AZFW= 0.1
##$BCFW= 1
##$BC_mod= 2
##$BYTORDP= 1
##$COROFFS= 0
##$CY= 11.3945322036743
##$DATMOD= 1
##$DC= 2
##$DFILT= <>
##$DTYPP= 0
##$F1P= 2.36226072786647
##$F2P= -0.459571619588291
##$FCOR= 0.5
##$FTSIZE= 0
##$FT_mod= 4
##$GAMMA= 1
##$GB= 0.15
##$INTBC= 1
##$INTSCL= 1
##$ISEN= 128
##$LB= 0.24
##$LEV0= 0
##$LPBIN= 0
##$MAXI= 10000
##$MC2= 0
##$MEAN= 0
##$ME_mod= 0
##$MI= 1.114404
##$NCOEF= 0
##$NC_proc= 0
##$NLEV= 6
##$NOISF1= 3.799351
##$NOISF2= 2.8
##$NSP= 1
##$NTH_PI= 0
##$NZP= 0
##$OFFSET= 15.70392
##$PC= 1
##$PHC0= -18301.58
##$PHC1= 13.40078
##$PH_mod= 1
##$PKNL= yes
##$PPARMOD= 0
##$PSCAL= 0
##$PSIGN= 0
##$REVERSE= no
##$SF= 200.130013532006
##$SI= 16384
##$SIGF1= 3
##$SIGF2= 2
##$SINO= 400
##$SIOLD= 16384
##$SREGLST= <1H.CDCl3>
##$SSB= 0
##$STSI= 0
##$STSR= 0
##$SW_p= 3612.71676300578
##$SYMM= 0
##$S_DEV= 0
##$TDeff= 0
##$TDoff= 0
##$TI= <>
##$TILT= no
##$TM1= 0
##$TM2= 0
##$TOPLEV= 0
##$USERP1= <user>
##$USERP2= <user>
##$USERP3= <user>
##$USERP4= <user>
##$USERP5= <user>
##$WDW= 1
##$XDIM= 8192
##$YMAX_p= 0
##$YMIN_p= 0
$$ End of Bruker specific parameters
$$ ---------------------------------
##NTUPLES= NMR FID
##VAR_NAME=  TIME,          FID/REAL,        FID/IMAG
##SYMBOL=    X,             R,               I
##VAR_TYPE=  INDEPENDENT,   DEPENDENT,       DEPENDENT
##VAR_FORM=  AFFN,          ASDF,            ASDF
##VAR_DIM=   8192,          8192,            8192
##UNITS=     SECONDS,       ARBITRARY UNITS, ARBITRARY UNITS
##FACTOR=    0.0002768,     1,               1
##FIRST=     0,             0,               0
##LAST=      2.2672688,     0,               0
##MIN=       0,             -42648,          0
##MAX=       2.2672688,     55235,           0
$$ Real data points
##PAGE= N=1
##DATA TABLE= (X++(R..R)), XYDATA
$$ [...]
$$ plain form
1480 1828 2361 845 -1552 -3133 -2786 -1142 207 133 -1033 -1951 -1655 -394 436 -111 -1160 -1077 622
1497 622 2698 3330 1970 -135 -1107 -176 1538 2551 2126 649 -618 -731 -118 -12 -904 -2220 -2621
1514 -2621 -1407 356 712 -769 -2680 -3071 -1474 941 2303 1844 615 67 618 1587 1947 1159 10
1531 10 -104 1101 2347 2103 69 -2280 -2897 -1357 620 1088 -203 -1837 -2379 -1583 -442 -268 -965
1548 -965 -1386 -773 826 2182 2031 372 -1190 -957 948 2869 3183 1688 -108 -602 126 740 358
1565 358 -707 -1485 -1115 -10 535 -290 -1938 -3086 -2695 -743 1167 1447 136 -1195 -1197 61 1358
1582 1358 1471 701 316 1067 2252 2590 1561 -299 -1493 -1015 512 1648 1188 -701 -2444 -2632 -1363
1599 -1363 -242 -361 -1290 -1615 -706 745 1225 149 -1302 -1641 -339 1746 2995 2454 740 -461 -226
$$ packed form
1480A828N33j516k397j581L47J644J349p4j166r18K96J261Q30n47j049Q3J699
1497F22K076O32j360k105r72R31J714J013m25j477j267j13O13J06q92j316m01
1514b621J214J763L56j481j911l91J597K415J362m59j229n48N51R69L60p88j149
1531A0j14J205J246k44k034k349o17J540J977M68j291j634n42P96J141J74o97
1548i65m21O13J599J356j51j659j562K33J905J921L14j495j796m94P28O14l82
1565C58j065p78L70J105N45q25j648j148L91J952J910K80j311j331kJ258J297
1582A358J13p70l85P51J185L38j029j860j194M78J527J136m60j889j743j88J269
1599a363J121j19r29l25R09J451M80j076j451l39J302K085J249n41j714j201K35
$$ plain form
1616 -226 1010 1820 1324 -6 -706 -128 761 503 -1092 -2735 -2951 -1456 391 1073 86 -1409 -2121 -1365
1634 -1365 201 1215 988 289 169 984 1953 1921 594 -793 -763 687 2139 2182 690 -1232 -2055 -1416
1652 -1416 -291 257 -261 -1183 -1504 -833 68 47 -990 -1910 -1450 383 2214 2413 987 -647 -930 210
1670 210 1603 1984 1154 46 -220 377 884 459 -870 -1917 -1510 119 1333 879 -996 -2601 -2579 -1055
1688 -1055 514 784 14 -630 -273 759 1435 1055 82 -348 391 1867 2636 1828 -165 -1714 -1562 -210
1706 -210 882 708 -471 -1406 -1239 -447 -132 -704 -1589 -1709 -704 846 1612 942 -524 -1390 -716 1004
1724 1004 2264 2135 885 -32 110 845 996 195 -918 -1234 -377 787 958 -185 -1901 -2666 -1833 -94
1742 -94 1102 762 -482 -1168 -631 522 1032 331 -487 -287 934 2097 2096 698 -903 -1331 -266 1198
$$ packed form
1616b26J236Q10m96j330p00N78Q89k58j595j643k16J495J847O82r87j495p12P56
1634a365J566J014k27o99j20Q15R69l2j327j387L0J450J452M3j492j922q23O39
1652a416J125N48n18r22l21O71R01k1j037r20M60J833J831J99j426j634k83J140
1670B10J393L81q30j108k66N97N07m25j329j047M07J629J214m54j875j605K2J524
1688a055J569K70p70o44L57J032O76l80r73m30P39J476P69q08j993j549J52J352
1706b10J092j74j179r35J67P92L15n72q85j20J005J550P66o70j466q66O74J720
1724A004J260j29j250r17J42P35J51q01j113l16Q57J164J71j143j716p65Q33J739
1742i4J196l40j244o86N37J153N10p01q18K00J221J163jj398j601m28J065J464
$$ plain form
1760 1198 1731 812 -695 -1505 -1073 -267 -141 -941 -1714 -1366 -43 1094 907 -396 -1516 -1328 141 1684
1778 1684 2056 1121 -109 -534 24 853 963 227 -435 -223 786 1428 795 -789 -2036 -1877 -464 761
1796 761 777 -336 -1504 -1679 -797 279 532 55 -381 37 1083 1806 1262 -224 -1200 -701 851 2028
1814 2028 1771 312 -1002 -1040 -212 487 270 -581 -1210 -855 81 500 -272 -1575 -2131 -1211 654 1789
1832 1789 1375 -6 -873 -456 718 1456 1163 309 -68 383 1074 1069 35 -1313 -1730 -804 642 1233 445
1851 445 -1031 -1872 -1374 -123 547 198 -526 -641 -28 814 883 58 -848 -824 337 1701 2158 1212 -296
1870 -296 -1099 -588 493 960 348 -648 -985 -370 332 217 -734 -1588 -1440 -178 1133 1253 144 -1193
1888 -1193 -1601 -671 718 1300 755 -69 -85 705 1406 1172 42 -866 -545 599 1447 1078 -380 -1764
$$ packed form
1760A198N33r19j507q10M32Q06J26q00p73L48J323J137j87j303j120J88J469J543
1778A684L72r35j230m25N58Q29J10p36o62K12J009O42o33j584j247J59J413J225
1796G61J6j113j168j75Q82J076K53m77m36M18J046P23n44j486r76M99J552J177
1814B028k57j459j314l8Q28O99k17q51o29L55R36M19p72j303n56R20J865J135
1832A789m14j381q67M17J174P38k93q54l77M51O91nj034j348m17R26J446N91p88
1851D45j476q41M98J251O70l49p24j15O13Q42O9q25r06K4J161J364M57r46j508
1870b96q03N11J081M67o12r96l37O15P02j15r51q54J48J262J311J20j109j337
1888a193m08R30J389N82n45q24j6P90P01k34j130r08L21J144Q48l69j458j384
$$ plain form
1906 -1764 -1930 -927 263 481 -169 -930 -910 -38 599 358 -567 -1005 -346 1067 1922 1480 124 -878
1924 -878 -708 356 1302 1258 366 -534 -618 -61 290 -131 -1069 -1544 -915 345 1016 416 -861 -1629 -1126 240
1944 240 1272 1209 378 -332 -186 528 975 536 -339 -690 18 1113 1549 641 -826 -1603 -943 362 1051
1963 1051 611 -496 -1220 -948 -154 190 -324 -1012 -1056 -87 1105 1429 514 -746 -1094 -150 1219 1791 1152
1982 1152 -24 -576 -150 500 602 -36 -816 -806 -2 766 614 -529 -1687 -1859 -809 526 980 364
2000 364 -650 -880 -221 706 929 373 -147 17 851 1463 1184 -32 -1103 -1106 -115 951 1119 210 -999
2019 -999 -1303 -641 142 233 -416 -953 -686 270 915 541 -552 -1279 -887 401 1510 1481 468 -521 -574 215
2039 215 1002 922 130 -477 -191 602 882 168 -1067 -1727 -1201 38 864 526 -543 -1345 -1123 -128 651
$$ packed form
1906a764j66J003J190K18o50p61K0Q72O37k41r25m38O59J413Q55m42j356j002
1924h78J70J064R46m4q92r00q4N57L51m21r38m75O29J260O71o00j277p68N03J366
1944B40J032o3q31p10J46P14M47m39q75l51P08J095M36r08j467p77O60J305O89
1963A051m40j107p24K72P94L44n14o88m4R69J192L24r15j260l48R44J369N72o39
1982A152j176n52M26O50J02o38p80J0Q04P68j52j143j158j72J050J335M54o16
2000C64j014k30O59R27K23n56n20J64Q34O12k79j216j071lR91J066J68r09j209
2019i99l04O62P83R1o49n37K67R56O45l74j093p27L92J288J109k9j013r89n3P89
2039B15P87q0p92o07K86P93K80p14j235o60N26J239Q26l38j069q02K22R95P79
$$ plain form
2058 651 595 -20 -375 143 964 1265 582 -476 -815 -66 1083 1602 977 -254 -1098 -912 -127 374 36
2077 36 -653 -1068 -635 142 361 -260 -1140 -1215 -260 993 1526 838 -273 -793 -308 655 1194 834 46 -262
2097 -262 149 753 725 -103 -1072 -1193 -338 708 862 -100 -1318 -1672 -916 176 645 191 -439 -434 208 940
2117 940 946 173 -511 -346 667 1572 1467 313 -893 -1125 -377 513 615 -36 -820 -855 -242 254 82 -647
2137 -647 -1168 -820 215 1041 847 -162 -1031 -902 79 1088 1233 554 -56 -50 488 901 567 -314 -844 -469
2157 -469 431 926 491 -668 -1521 -1283 -272 589 531 -232 -877 -750 29 512 174 -473 -659 -3 1076
2176 1076 1584 1035 -85 -701 -314 680 1282 912 -124 -893 -759 -123 113 -353 -1088 -1212 -497 472 739
2195 739 88 -903 -1210 -502 688 1241 881 70 -383 -32 648 919 431 -225 -322 288 989 943 29 -1048
$$ packed form
2058F51n6o15l55N18Q21L01o83j058l39P49J149N19o25j231q44J86P85N01l38
2077C6o89m15M33P77K19o21q80p5R55J253N33o88j111n20M85R63N39l60p88l08
2097b62M11O04k8q28r69j21Q55J046J54r62j218l54P56J092M69m54o30NO42P32
2117I40Op73o84J65J013R05j05j154j206k32P48Q90J02o51p84l5O13M96j72p29
2137f47n21L48J035Q26j94j009q69J29R81J009J45o79o10ON38M13l34q81n30L75
2157d69R00M95m35j159q53K38J011Q61n8p63o45J27P79M83l38o47j86O56J079
2176A076N08n49j120o16L87R94O02l70j036p69J34O36K36m66p35j24P15R69K67
2195G39o51r91l07P08J190N53l60q11m53L51O80K71m88o56r7O10P01m6r14j077
$$ plain form
2215 -1048 -1344 -654 298 592 7 -841 -1196 -715 50 316 -38 -510 -431 345 1087 1110 229 -655 -678 128 1142
2236 1142 1336 605 -325 -614 -84 511 539 -77 -723 -725 -104 404 165 -792 -1551 -1339 -237 753 896 143
2256 143 -564 -558 180 922 889 283 -173 -14 651 1061 617 -351 -974 -655 288 982 723 -268 -1101 -1065 -387
2277 -387 188 41 -539 -877 -527 256 652 279 -472 -735 -162 837 1460 1130 159 -511 -398 306 746 507
2297 507 -195 -598 -300 277 435 -106 -967 -1254 -667 299 731 263 -675 -1140 -734 206 792 586 40 -178
2317 -178 290 932 1076 391 -414 -612 31 813 956 199 -839 -1243 -774 8 385 25 -612 -726 -188 420
2337 420 474 -173 -768 -695 146 1018 1063 307 -526 -656 -20 759 959 464 -224 -377 35 444 290 -399 -997
2358 -997 -852 -40 610 527 -249 -990 -989 -237 542 705 171 -345 -390 158 647 561 -65 -471 -211 618 1172 920
$$ packed form
2215a048k96O90R52K94n85q48l55M81P65K66l54m72P9P76P42K3q81q84k3Q06J014
2236A142J94p31r30k89N30N95K8o16o46kO21N08k39r57p59K12J102R90J43p53
2256A43p07OP38P42l3o06m56J59O65M10m44r68o23L19R43O94k59r91q33L6O78
2277c87N75j47n80l38L50P83L96l73p51k63N73R99O23l30r71o70J13P04M40k39
2297E07p02m03K98N77J58n41q61k87N87R66M32m68r38m65M06R40N86k06n46k18
2317a78M68O42J44o85q05j98O43P82J43p57j038m04M69P82L77l60o37j14N38O08
2337D20N4o47n95P3Q41Q72M5p56q33j30O36P79K00m95o88j53M12M09j54o89n98
2358i97J45Q12O50q3p76p41JP52P79J63n34n16m5N48M89q6o26m06K60Q29N54k52
$$ plain form
2380 920 -1 -800 -783 -60 551 452 -256 -900 -831 -261 150 -1 -595 -846 -431 484 1023 655 -194 -735 -406
2401 -406 480 1116 910 195 -354 -195 349 594 274 -438 -747 -327 336 598 46 -860 -1305 -839 86 625
2421 625 351 -306 -654 -305 361 651 334 -202 -264 251 908 1006 409 -437 -747 -250 530 845 400 -427 -810
2442 -810 -494 43 192 -203 -725 -810 -211 429 469 -128 -779 -832 -112 795 1128 627 -73 -357 98 679 768
2463 768 261 -357 -398 149 624 449 -353 -1099 -1087 -325 403 489 -131 -822 -866 -288 370 426 34 -337 -148 512
2485 512 996 755 -4 -541 -354 383 960 845 54 -634 -650 -158 317 256 -290 -738 -529 55 360 84 -597
2506 -597 -975 -625 222 842 683 -26 -528 -419 247 775 646 124 -210 -7 514 758 319 -437 -828 -463
2526 -463 284 644 313 -514 -1032 -798 -97 328 151 -327 -523 -163 466 701 273 -331 -493 28 819 1087
$$ packed form
2380I20r21p99J7P23O11r9p08o44O9N70M11j51n94k51M15R15N39l68q49n41L29
2401d06Q86O36k06p15n49J59N44K45l20p12l09M20O63K62n52r06m45M66R25N39
2421F25k74o57l48L49O66K90l17n36o2N15O57R8n97q46l10M97P80L15m45q27l83
2442h10L16N37J49l95n22q5N99O40M0n97o51n3P20R07L33n01p00k84M55N81Q9
2463G68n07o18m1N47M75j75q02p46J2P62P28Q6o20o91m4N78O58N6l92l71J89O60
2485E12M84k41p59n37J87P37N77j15p91o88j6M92M75o1n46m48K09N84L05k76o81
2506e97l78L50Q47O20j59p09n02J09O66N28j29n22l34K03N21K44m39p56l91L65
2526d63P47L60l31q27n18K34P01M25j77m78j96L60O29K35m28o04j62N21P91K68
$$ plain form
2546 1087 607 -252 -646 -350 313 593 224 -380 -591 -251 263 289 -227 -804 -893 -242 473 637 92 -591
2566 -591 -773 -279 461 754 406 -65 -186 250 705 652 114 -458 -442 95 645 633 -37 -790 -932 -417 204
2587 204 385 -31 -562 -591 -122 334 324 -158 -548 -359 322 917 843 162 -454 -444 140 730 685 114 -436 -496
2609 -496 -41 296 173 -423 -821 -569 149 616 410 -309 -818 -626 92 612 548 11 -405 -253 236 607
2629 607 412 -86 -359 -52 557 873 476 -301 -783 -555 63 452 238 -403 -806 -609 -90 220 15 -415
2649 -415 -522 -109 549 832 448 -244 -527 -130 538 929 609 -60 -394 -199 277 443 98 -493 -666 -279
2669 -279 244 312 -160 -809 -984 -472 301 662 341 -225 -413 -37 474 670 274 -207 -267 199 655 652 66
2690 66 -556 -678 -136 498 637 121 -528 -730 -378 103 204 -199 -601 -529 -2 455 462 -84 -499 -386 210
$$ packed form
2546A087m80q59l94K96O63K80l69o04k11L40N14K6n16n77q9O51P15J64n45o83
2566e91j82M94P40K93l48m71j21M36M55n3n38n72J6N37N50j2o70p53j42N15O21
2587B04J81m16n31k9M69M56j0m82l90J89O81N95p4o81o16J0N84N90m5n71n50o0
2609d96M55L37j23n96l98K52P18M67k06p19n09J92P18N20o4n37m16J52M89L71
2629F07j95m98k73L07O09L16l97p77m82K28O18L89k14o41m03J97N19L10k05m30
2649d15j07M13O58K83l84o92k83L97O68L91l20o69l34J95M76J66l45n91j73L87
2669b79N23O8m72o49j75N12P73L61l21n66j88L76N11J96l96m81o0M66M56ln86
2690F6o22j22N42O34J39n16o49k02L52M81J01m03m02P2N27M57Pn46m15J13N96
$$ plain form
2711 210 856 877 341 -256 -355 90 478 460 -18 -447 -393 54 392 179 -392 -849 -694 -82 464 381 -202 -660
2733 -660 -582 -24 466 452 72 -209 -48 502 820 555 -82 -488 -278 328 705 431 -273 -776 -649 -122 272
2754 272 140 -308 -609 -355 169 411 128 -425 -644 -276 422 796 486 -109 -398 -171 389 692 454 -44
2774 -44 -306 -120 291 367 -44 -614 -791 -356 254 468 43 -523 -748 -392 210 488 267 -207 -291 38 482
2795 482 603 201 -270 -320 129 666 740 236 -407 -661 -301 216 320 -72 -574 -670 -284 159 187 -220 -610
2816 -610 -491 123 678 694 185 -320 -396 106 601 671 258 -230 -265 66 434 314 -190 -596 -474 32 417
2837 417 282 -332 -820 -716 -177 292 340 -60 -427 -282 178 536 443 -21 -279 -60 460 771 511 -115 -553
2858 -553 -407 88 478 338 -168 -588 -504 -39 201 11 -431 -632 -335 190 488 271 -283 -544 -240 387
$$ packed form
2711B10O46K1n36n97r9M45L88j8m78m29N4M47L38k13n71m57J55O12N46q3n83m58
2733f60P8N58M90j4l80k81J61N50L18k65o37m06K10O06L77k74p04n03J27N27L94
2754B72j32m48l01K54N24K42k83n53k19L68O98L74l10n95k89K27N60L03k38m98
2774d4k62J86M11P6m11n70j77M35O10K14m25n66k25L56O02K78k21m74q4L29M44
2795D82J21m02m71n0M49N37P4n04o43k54L60N17J04l92n02r6L86M43K8m07l90
2816f10J19O14N55J6n09n05p6N02M95P0m13m88l5L31L68j20n04m06J22N06L85
2837D17j35o14m88J04N39M69M8m00l67J45M60L58r3m64k58K19N20L11k60o26m38
2858e53J46M95L90j40n06m20Q4M65K40j90m42k01K97N25K98k17n54k61L04O27
$$ plain form
2878 387 763 587 72 -228 -66 352 549 262 -215 -480 -183 298 432 21 -616 -841 -462 99 369 102
2898 102 -374 -584 -288 213 388 151 -223 -273 133 641 713 284 -281 -388 28 536 630 224 -303 -534 -268
2919 -268 121 199 -139 -517 -533 -108 302 279 -109 -546 -526 -9 492 613 237 -199 -281 74 465 503 136 -223
2941 -223 -196 189 480 368 -157 -620 -570 -77 365 346 -161 -599 -576 -158 272 236 -89 -332 -230 234 540 425
2963 425 -65 -382 -206 305 658 531 0 -431 -367 69 342 246 -206 -499 -358 87 283 77 -406 -655 -387
2984 -387 189 535 356 -123 -425 -238 254 531 392 -9 -222 -42 353 507 191 -305 -501 -225 254 473
3004 473 159 -370 -639 -420 40 289 116 -279 -406 -157 296 409 97 -274 -378 12 516 665 292 -216
3024 -216 -390 -113 337 441 150 -284 -449 -170 194 242 -168 -537 -514 -85 372 449 47 -401 -472 -61 414
$$ packed form
2878C87L76j76n15l00J62M18J97k87m77k65K97M81J34m11o37k25L79N61K70k67
2898A02m76k10K96N01J75k37l74n0M06N08P2m29n65j07M16N08R4m06n27k31K66
2919b68L89P8l38l78j6M25M10k3l88m37K0N17N01J21l76m36q2L55L91L8l67l59
2941b23K7L85K91j12n25m63N0M93M42j9n07m38K3M18M30l6l25k43J02M64L06j15
2963D25m90l17J76N11L53j27n31m31O4M36K73r6m52k93J41M45J96k06m83k49K68
2984c87N76L46j79m79l02J87M92K77j39m01k13J80L95J54l16m96j96K76M79K19
3004D73l14n29k69K19M60K49j73l95j27K49M53J13l12l71j04L90N04J49l73n08
3024b16j74K77M50J04k91m34j65K79L64M8m10l69K3M29M57P7m02m48p1M11M75
$$ plain form
3045 414 484 181 -182 -215 118 462 430 29 -331 -277 114 446 388 -73 -555 -581 -166 228 253 -105 -418 -380 -34
3068 -34 283 251 -79 -383 -226 256 582 486 -15 -356 -274 135 480 415 9 -324 -261 63 289 150 -271 -499
3090 -499 -317 96 374 182 -272 -553 -380 104 450 379 -20 -301 -174 202 417 269 -139 -329 -114 303
3110 303 514 240 -251 -516 -295 185 436 268 -207 -463 -284 99 267 54 -339 -417 -129 309 451 170
3130 170 -270 -424 -72 383 547 287 -106 -336 -134 229 326 70 -272 -355 -73 308 327 -34 -448 -495 -178
3151 -178 271 397 107 -291 -392 -88 287 377 79 -193 -226 77 402 376 1 -377 -416 -31 373 410 49 -344
3173 -344 -396 -81 259 277 -27 -327 -308 77 374 273 -117 -440 -350 70 441 393 13 -340 -339 27 318 312 -5
3196 -5 -297 -199 141 370 209 -179 -475 -336 90 395 281 -135 -377 -322 55 319 252 -71 -295 -144 213 406
$$ packed form
3045D14P0l03l63l3L33L44l2m01l60N4L91L32n8m61m82k6M15L94K5l58l13L8L46
3068c4L17l2l30l04J57M82L26r6n01l41Q2M09L45o5m06l33O3L24K26j39m21k28
3090d99J82M13K78j92m54k81J73M84L46p1l99k81J27L76K15j48m08j90K15M17
3110C03K11k74m91k65K21M80K51j68m75k56J79L83J68k13l93p8K88M38J42k81
3130A70m40j54L52M55J64k60l93k30K02L63R7k56l42q3K82L81J9l61m14m7L17
3151a78M49J26k90l98j01L04L75R0k98k72l3L03L25k6l75l78l9L85M04L7l61l93
3173c44n2L15L40J8l04l00J9L85K97j01l90l23R0M20L71m8l80l53JL66K91ol17
3196ek92R8L40K29j61l88k96J39M26L05j14m16k42N5L77K64o7l23k24J51L57J93
$$ plain form
3218 406 195 -210 -389 -214 215 463 258 -161 -417 -295 57 276 138 -199 -361 -147 149 308 106 -224
3238 -224 -379 -108 285 476 228 -173 -387 -198 189 338 190 -159 -297 -92 219 323 69 -315 -419 -92
3258 -92 284 379 108 -272 -430 -195 205 370 125 -212 -295 -65 284 299 28 -292 -320 28 345 390 97 -312
3280 -312 -373 -75 264 323 40 -267 -297 -67 265 203 -82 -361 -310 20 353 350 -15 -327 -336 8 343 362 55
3303 55 -241 -198 89 328 242 -74 -340 -251 129 369 269 -127 -407 -358 -25 251 245 -72 -317 -265 65 277 169
3326 169 -124 -303 -137 205 423 284 -119 -330 -229 152 394 275 -71 -303 -206 110 260 125 -188 -372
3346 -372 -155 164 331 109 -232 -446 -260 135 354 199 -104 -282 -157 174 300 155 -150 -265 -21 278
3366 278 392 113 -250 -379 -163 204 332 119 -206 -380 -179 136 226 25 -268 -305 -22 261 339 60 -248
$$ packed form
3218D06k11m05j79J75M29K48k05m19k56J22L52K19j38l37j62K14K96J59k02l30
3238b24j55K71L93J91k48m01k14J89L87J49j48l49j38K05L11J04k54l84j04L27
3258i2L76R5k71l80j58K35M00J65k45l37q3K30L49J5k71l20k8L48L17M5k93m09
3280c12o1K98L39N9k83l07l0K30L32o2k85k79N1L30L33ll65l12rL44L35J9l07
3303E5k96M3K87K39q6l16k66Q9L80K40j00l96k80M9L33K76ol17k45N2L30K12j08
3326A69k93j79J66L42K18j39m03k11J01L81K42j19l46k32R7L16J50j35l13j84
3346c72K17L19J67k22l41k14J86L95K19j55l03j78J25L31J26j45l05j15K44K99
3366B78J14k79l63j29K16L67J28k13l25j74K01L15R0k01k93l7K83K83P8k79l08
$$ plain form
3387 -248 -301 -40 345 414 192 -165 -284 -58 215 250 10 -240 -248 -12 243 221 -64 -358 -375 -63 259 311 49
3410 49 -266 -290 -22 288 273 31 -207 -162 119 318 233 -52 -287 -259 24 352 275 -21 -296 -304 -38 214 172
3433 172 -75 -303 -205 68 253 200 -123 -322 -216 134 369 281 -24 -263 -189 71 284 228 -69 -253 -150 127
3455 127 269 105 -187 -352 -185 123 324 164 -152 -347 -210 105 281 164 -90 -229 -79 202 321 146
3475 146 -144 -284 -93 227 357 178 -195 -360 -219 87 235 72 -219 -293 -107 142 226 51 -206 -276 -44
3496 -44 280 357 145 -172 -270 -65 233 334 127 -153 -213 -17 203 221 6 -277 -295 -55 219 267 28 -264
3518 -264 -311 -74 223 264 54 -197 -200 40 261 239 23 -210 -173 118 327 307 22 -276 -291 -30 219 197 -26
3541 -26 -269 -256 -14 170 134 -81 -264 -199 90 301 230 -32 -262 -215 76 349 246 9 -213 -139 96 255
$$ packed form
3387b48n3K61L85O9k22l57j19K26K73L5k40k50qK36K55k2k85k94j7L12L22N2k62
3410D9l15k4K68L10j5k42k38M5K81J99q5k85k35K8K83L28p7k96k75qK66K52m2
3433A72k47k28R8K73J85n3l23j99J06L50K35q8l05k39P4K60K13n6k97j84J03K77
3455A27J42j64k92j65J67L08K01j60l16j95J37L15J76j17k54j39J50K81J19j75
3475A46k90j40J91L20J30j79l73j65J41L06J48j63k91p4J86K49Q4j75k57p0K32
3496d4L24P7k12l17r8K05K98J01k07k80o0J96K20J8k15k83j8K40K74M8k39k92
3518b64m7K37K97M1k10k51lK40K21k2k16k33L7K91K09k0k85k98j5K61K49k2k23
3541b6k43J3K42J84l6k15j83O5K89K11p1k62k30M7K91K73j03k37k22P4K35J59
$$ plain form
3563 255 183 -127 -275 -164 122 241 132 -189 -368 -267 30 244 182 -86 -249 -143 119 245 144 -95 -214
3584 -214 -50 230 304 178 -119 -251 -95 168 297 184 -96 -252 -153 87 174 38 -186 -290 -111 153 212
3605 212 57 -216 -307 -90 200 316 140 -87 -191 -31 227 295 64 -157 -188 -12 221 234 12 -259 -321 -83
3627 -83 192 226 26 -234 -274 -93 134 188 26 -159 -161 55 273 264 26 -193 -198 26 256 282 42 -208 -242 -48
3651 -48 168 125 -60 -238 -219 5 192 124 -103 -290 -241 36 224 231 -26 -186 -164 53 269 222 15 -150 -116
3674 -116 112 236 148 -108 -317 -201 72 261 169 -91 -275 -210 49 200 138 -57 -220 -106 133 244 126
3695 126 -135 -224 -88 189 320 198 -76 -238 -141 100 215 121 -116 -229 -143 110 164 27 -172 -274 -95 169
3717 169 301 138 -95 -234 -77 151 257 135 -106 -181 -21 165 240 9 -183 -244 -55 159 216 3 -249
$$ packed form
3563B55p2l10j48J11K86J19j09l21j79J01K97K14o2k68j63J06K62J26j01k39j19
3584b14J64K80P4j26k97j32J56K63J29j13k80j56R9K40Q7j36k24j04J79K64N9
3605B12j55k73r1K17K90J16j76k27j04J60K58O8k31k21l1J76K33J3k22k71o2K38
3627h3K75L4k00k60m0J81K27N4j62j85kK16K18rk38k19nK24K30K6k40k50l4J94
3651d8K16m3j85j78J9K24J87o8k27j87M9K77J88Pk57j60K2K17K16m7k07j65L4
3674a16K28J24q8k56k09J16K73J89r2k60j84O5K59J51o2j95j63J14K39J11j18
3695A26k61q9J36K77J31j22k74j62R7K41J15r4k37j13Q6K53N4j37j99j02J79K64
3717A69J32j63k33j39J57K28J06j22k41p5J60J86P5k31j92o1J89K14N7k13k52
$$ plain form
3738 -249 -292 -130 100 177 43 -199 -218 -33 170 217 26 -176 -162 35 274 258 39 -162 -207 -39 197 224 40
3761 40 -156 -190 -2 135 104 -83 -264 -229 4 184 172 -43 -234 -199 30 241 220 58 -124 -96 65 222 199
3784 199 -49 -194 -133 81 211 146 -102 -258 -226 13 187 129 -74 -250 -142 12 139 90 -78 -199 -88 134
3806 134 290 203 -36 -193 -94 136 262 179 -62 -225 -128 41 155 45 -132 -234 -130 61 191 34 -180
3827 -180 -262 -130 110 201 136 -78 -141 -65 140 209 125 -69 -118 6 192 228 64 -145 -244 -109 144 191 38 -152
3851 -152 -246 -114 70 167 10 -157 -159 -35 172 199 46 -160 -172 -15 231 274 85 -122 -181 -29 145 163 7
3874 7 -140 -178 -11 144 119 -29 -237 -225 -23 195 207 29 -156 -165 -8 212 203 43 -105 -91 76 212 168 -17
3898 -17 -187 -153 43 167 154 -23 -201 -183 -11 108 77 -90 -206 -150 53 179 116 -52 -159 -101 110 258 188
$$ packed form
3738b49m3J62K30P7j34k42j9J85K03M7j91k02J4J97K39j6k19k01m5J68K36K7j84
3761D0j96l4J88J37l1j87j81L5K33J80j2k15j91L5K29K11k1j62j82K8J61J57k3
3784A99k48j45O1K14J30o5k48j56L2K39J74n8k03j76J08J54J27m9j68j21J11K22
3806A34J56q7k39j57R9K30J26q3k41j63R7J69J14j10j77j02J04J91J30j57k14
3827a80q2J32K40R1o5k14o3P6K05O9q4j94m9J24J86L6j64k09r9J35K53M7j53j90
3851a52r4J32J84R7j57j67kJ24K07K7j53k06j2J57K46M3j89k07n9J52J74J8j56
3874Gj47l8J67J55k5j48k08J2K02K18J2j78j85rJ57K20rj60j48J4J67J36m4j85
3898a7j70L4J96J24j3j77j78J8J72J19l1j67j16N6K03J26o3j68j07N8K11J48p0
$$ plain form
3921 188 17 -170 -104 94 198 138 -41 -148 -110 65 157 72 -127 -221 -106 69 196 79 -84 -223 -144 52
3943 52 207 142 -46 -141 -26 136 207 106 -55 -175 -37 138 232 79 -156 -233 -133 74 128 41 -129 -175 -66
3966 -66 96 135 35 -172 -172 -29 162 248 90 -113 -148 -42 181 232 96 -65 -144 -12 133 104 -19 -180 -193
3989 -193 -52 132 155 -12 -166 -211 -53 136 164 23 -125 -147 -7 173 131 16 -101 -114 47 185 199 43
4011 43 -150 -138 31 172 161 -5 -130 -141 -35 118 71 -79 -167 -142 36 190 136 -37 -169 -126 37 168 162 4
4035 4 -119 -109 70 161 126 -65 -135 -58 74 173 85 -115 -241 -151 43 151 99 -68 -157 -112 32 153 97 -61 -115
4060 -115 -39 124 183 97 -86 -168 -82 86 166 69 -78 -166 -87 83 118 22 -133 -167 -49 97 161 36 -130 -177 -67
4085 -67 113 181 104 -85 -137 -17 114 154 62 -72 -135 -8 128 150 -1 -142 -164 -63 131 165 34 -111 -154 -19
$$ packed form
3921A88j71j87O6J98J04o0j79j07L8J75R2q5j99r4J15J75J27j17j63j39P9J96
3943E2J55o5j88r5J15J62P1j01j61j20J38J75R4j53k35p7J00K07N4q7j70m6J09
3966f6J62L9j00k07%J43J91Q6j58k03l5J06K23N1j36j61p9J32J45k9j23j61j3
3989a93J41J84K3j67j54m5J58J89K8j41j48k2J40J80m2j15j17j3J61J38J4j56
4011D3j93J2J69J41j1j66j25j1J06J53m7j50q8K5J78J54n4j73j32M3J63J31oj58
4035Dj23J0J79R1l5j91p0P7J32R9q8k00j26R0J94J08n2j67q9M5J44J21n6j58n4
4060a15P6J63N9q6j83q2Q6J68Q0r7j47q8P9J70L5r6j55l4J18J46O4j25j66m7J10
4085f7J80O8p7j89n2J20J31M0r2j34o3J27J36K2j51j41k2J01J94L4j31j45m3J35
$$ plain form
4109 -19 99 140 41 -95 -110 17 158 157 12 -153 -141 9 154 186 1 -146 -162 -28 111 115 -21 -111 -127 2
4133 2 142 135 -31 -160 -92 48 183 138 0 -141 -95 40 134 121 -16 -130 -88 66 171 84 -63 -160 -113 32
4157 32 147 87 -77 -170 -177 12 140 92 -26 -139 -54 81 166 79 -39 -142 -84 129 203 108 -52 -144 -64 73 125
4182 125 62 -65 -159 -87 49 89 19 -134 -185 -91 85 165 84 -108 -145 -66 99 181 84 -32 -104 -31 124 130 15 -113
4208 -113 -158 -47 83 141 14 -116 -179 -61 75 136 28 -77 -137 -58 92 121 11 -98 -99 23 151 155 25 -94
4232 -94 -132 15 145 138 27 -119 -119 -3 116 71 -44 -128 -130 7 113 103 -48 -150 -167 -4 150 145 -2 -104 -87
4257 -87 10 132 107 8 -111 -88 65 147 121 -46 -134 -117 -6 124 94 -33 -133 -118 -9 108 82 -64 -105 -81 52
4282 52 153 95 -70 -152 -94 91 166 118 -31 -116 -68 42 110 75 -58 -124 -81 87 113 28 -88 -169 -80 43 144
$$ packed form
4109a9J18M1r9j36j5J27J41jj45j65J2J50J45L2j85j47j6J34J39Mj36r0j6J29
4133BJ40pj66j29O8J40J35m5j38j41M6J35R4j3j37j14M2J54J05q7j47r7M7J45
4157C2J15o0j64r3pJ89J28m8j18j13Q5J35Q5q7j18j03N8K13P4r5j60r2Q0J37N2
4182A25o3j27r4P2J36M0p0j53n1R4J76Q0q1j92l7P9J65Q2r7j16p2P3J55Oj15j28
4208a13m5J11J30N8j27j30o3J18J36O1j08j05o0P9J50K9j10j09jJ22J28Mj30j19
4232i4l8J47J30pj11j46%J16J19m5j15q4kJ37J06j0j51j02j7J63J54nj47j02J7
4257h7R7J22k5r9j19K3J53Q2k6j67q8J7J11J30l0j27j00J5J09J17k6j46m1K4J33
4282E2J01n8j65q2N8J85P5m8j49q5M8J10O8l5j33o6M3J68K6q5j16q1Q9J23J01
$$ plain form
4307 144 89 -28 -113 -55 74 128 81 -21 -113 14 71 152 64 -71 -142 -64 79 145 50 -79 -155 -85 34 105 14 -108
4333 -108 -137 -34 78 123 45 -91 -97 -4 125 169 62 -62 -111 -27 86 119 28 -86 -104 -10 87 110 -20 -153 -165
4358 -165 -16 110 128 10 -142 -130 -34 97 126 -5 -84 -62 63 144 130 3 -105 -101 -10 113 117 -31 -161 -138 -36
4383 -36 91 48 -26 -144 -91 23 120 91 -49 -95 -70 66 147 109 20 -100 -91 35 140 111 -19 -86 -56 52 109 22
4409 22 -87 -143 -102 49 96 62 -63 -125 -103 30 141 93 -19 -93 -68 85 139 79 -62 -81 -20 103 161 83 -52
4434 -52 -112 -54 44 131 75 -52 -145 -79 47 68 42 -90 -132 -36 84 155 41 -81 -108 -36 89 140 64 -23 -86 -24 95
4461 95 145 16 -61 -101 -36 83 107 -7 -104 -139 -54 61 114 23 -71 -87 9 111 133 10 -69 -64 39 123 114 14 -115
4488 -115 -99 -5 89 130 -6 -102 -108 -21 77 76 -29 -127 -105 27 86 90 -30 -139 -102 30 129 143 31 -65 -29 35 124 83
$$ packed form
4307A44n5j17q5N8J29N4m7j02r2J27N7Q1q8j35p1P8J43O6r5j29p6P0J19P1r1j22
4333a08k9J03J12M5p8j36oR3J29M4j07j24m9Q4J13L3r1j14j8R4R7K3j30j33j2
4358a65J49J26J8j18j52J2R6J31K9j31p9K2J25Q1j4j27j08MR1J23Mj48j30K3J02
4383c6J27m3p4j18N3J14R7k9j40m6K5J36Q1l8q9j20RJ26J05k9j30o7L0J08N7q7
4409B2j09n6M1J51M7l4j25o2K2J33J11m8j12p4K5J53N4o0j41j9O1J23N8p8j35
4434e2o0N8R8Q7n6j27r3O6J26K1k6j32m2R6J20P1j14j22k7P2J25N1p6q7o3O2J19
4461I5N0j29p7m0O5J19K4j14r7l5Q5J15N3r1r4j6R6J02K2j23p9NJ03Q4rj00j29
4488a15J6R4R4M1j36r6oQ7R8jj05r8K2J32N9Mj20j09L7J32R9J4j12r6L6O4Q9m1
$$ plain form
4516 83 -12 -107 -73 6 89 50 -29 -153 -85 30 105 75 -16 -105 -61 13 91 89 -40 -92 -36 69 124 79 -44 -116 -66 36
4544 36 90 42 -39 -119 -80 21 62 47 -56 -114 -67 47 113 77 -51 -105 -31 69 116 66 -66 -93 -11 48 130 75 -43
4571 -43 -88 -16 65 92 38 -80 -146 -56 55 109 -14 -71 -138 -52 62 93 25 -69 -84 -21 93 105 55 -61 -112 -8 122
4598 122 116 25 -86 -99 -15 84 103 40 -60 -108 -22 74 89 -28 -112 -102 0 87 93 11 -84 -91 23 80 113 16 -68 -80 16
4627 16 88 94 -3 -85 -72 7 92 70 -32 -93 -110 -35 86 55 -7 -85 -72 35 111 97 1 -57 -38 57 146 103 -3 -78 -84
4656 -84 50 101 74 -23 -93 -61 34 72 47 -69 -119 -48 52 107 63 -41 -111 -61 21 109 108 -8 -96 -35 74 110 48 -43
4684 -43 -68 -40 73 116 61 -72 -119 -66 41 76 45 -50 -113 -56 41 80 0 -43 -120 -10 76 80 34 -64 -89 -52 72 110
4712 110 48 -69 -96 -29 28 105 1 -91 -100 -14 54 75 -2 -85 -89 -54 73 103 25 -40 -24 -10 89 103 18 -71 -51 16 76
$$ packed form
4516H3r5r5L4P9Q3l9p9j24O8J15P5l0r1q9M4P4P8kj29n2N6J05N5m5j23p2N0J02
4544C6N4m8q1q0L9J01M1j5j03n8M7J14O6l6j28n4P4J00M7n0j32k7Q2N9Q2n5j18
4571d3m5P2Q1K7n4j18o6R0J11N4j23n7o7Q6J14L1o8r4j5O3J14J2n0j16n1J04J30
4598A22or1j11j3Q4R9J9o3j00m8Q6R6J5j17q4J0J02Q7Oq2r5pJ14N7L3r7q4j2R6
4627A6P2Or7q2J3P9Q5k2j02o1j7P5J21l1o2p8J3J07P6j4r6n8J9R5Q9m3j06p5o
4656h4J34N1k7r7p0L2R5L8k5j16n0P1J00N5m4j04p0N0Q2Q8jj16q8O1J09L6o2r1
4684d3k5K8J13M3n5j33m7N3J07L5l1r5o3N7R7L9q0m3p7J10Q6Mm6r8k5L7J24L8
4712A10o2j17k7O7N7P7j04r2rQ6O8K1p7q3mL5J27L0p8o5J6J4R9J4q5q9K0O7O0
$$ plain form
4741 76 73 -21 -94 -104 -11 72 76 -23 -98 -92 0 93 67 -10 -71 -79 3 83 69 -28 -83 -69 29 114 94 -17 -87 -54 -18 76 73 4
4773 4 -96 -61 13 72 68 -35 -121 -45 26 92 72 -30 -84 -61 21 87 64 -26 -88 -35 58 91 60 -42 -90 -57 40 106 37
4802 37 -40 -99 -75 46 79 28 -56 -66 -46 46 72 51 -43 -98 -38 61 77 57 -21 -107 -32 37 113 41 -45 -61 -41 51 61 8
4832 8 -87 -113 -8 63 67 23 -51 -103 -42 29 102 15 -44 -90 -15 75 60 -1 -62 -65 -5 100 90 30 -77 -72 -10 57 67 -10 -114
4863 -114 -99 4 100 55 9 -67 -81 12 84 55 -26 -69 -86 -25 112 53 2 -52 -46 5 72 75 -28 -82 -73 20 99 76 -33
4892 -33 -97 -78 6 81 60 -2 -83 -63 13 70 74 -16 -60 -67 31 86 60 -15 -82 -71 32 72 45 -29 -82 -58 28 46 23 -59 -108
4923 -108 -45 37 80 28 -41 -87 -57 51 136 72 -11 -61 -36 40 83 30 -35 -65 -33 65 95 29 -44 -93 -26 36 93 35 -66
4952 -66 -120 -58 40 75 19 -78 -101 -19 53 63 -7 -43 -53 -10 104 87 35 -54 -73 -7 62 90 33 -44 -78 -12 75 70 -6 -92
$$ packed form
4741G6lr4p3j0R3Q3Mr9p5OR2R3k6p7o1qQ2Q0j4r7n5J4R8Q5k0j11p0L3L6R4lo9
4773Dj00L5P4N9mj03q6P6P1O6k0j02n4K3Q2O6k3r0o2N3R3L3l1j02m8L3R7O6o9
4802C7p7n9K4J21L3n1q4j0K0R2K6k1r4n5O0R9J6k0p8q6P5O9P6p2q6j6K0R2J0n3
4832Hr5k6J05P1Mm4p4n2O1P1P3q7n9m6P5R0j5o1o1lO0J05j0o0j07NO2O7J0p7j04
4863a14J5J03R6m5m6p6j4R3P2k9q1m3j7O1J37n9n1n4ON1O7Lj03n4RR3P9k3j09
4892c3o4J9Q4P5k1o2q1K0P6N7Mr0m4pR8N5k6p5o7J1J03M0k7p4n3K4Q6J8k3q2m9
4923a08O3Q2M3n2o9m6L0J08Q5o4q3n0K5P6M3n3o5l0L2R8L0o6p3m9O7O2N7n8j01
4952f6n4O2R8L5n6r7k3Q2P2J0p0l6j0M3J14j7n2q9j9O6O9K8n7p7l4O6Q7np6q6
$$ plain form
4982 -92 -116 -23 51 42 -1 -66 -93 26 104 95 38 -65 -45 27 96 80 -9 -92 -64 -24 64 68 -5 -95 -107 3 62 46 -12 -79
5012 -79 -68 22 62 93 -12 -82 -71 29 104 71 2 -39 -56 30 90 40 -18 -84 -72 18 75 43 -31 -92 -55 30 98 62 -31
5041 -31 -81 -93 39 81 45 -52 -67 -33 19 104 19 -21 -88 -43 42 52 60 -51 -91 -54 38 63 31 -50 -75 -31 33 86 39 -37
5071 -37 -82 -18 55 100 31 -57 -84 -26 43 90 39 -9 -64 -31 46 55 -2 -73 -94 -47 49 29 5 -45 -93 -40 62 73 23 -33
5101 -33 -73 8 69 56 19 -68 -61 29 53 80 -3 -55 -73 -1 74 73 -2 -72 -65 -12 78 57 -23 -64 -55 24 72 63 -8 -57 -46 13 96
5134 96 62 -7 -67 -37 -14 56 52 -43 -81 -59 4 72 46 -16 -90 -62 0 67 35 -38 -65 -40 46 83 47 -21 -51 -55 44 84 50
5165 50 -35 -78 -47 25 55 37 -51 -95 -75 21 81 15 -33 -66 -40 20 64 19 -32 -79 -24 67 100 61 -33 -54 -20 44 74 10
5195 10 -48 -83 -52 38 71 7 -67 -104 -49 42 57 1 -46 -86 -46 43 77 5 -55 -80 4 62 81 12 -65 -61 -12 78 83 25 -91
$$ packed form
4982i2k4R3P4rm3o5k7J19P8rn7j03K0P2O9j6q9q3K8M0Q8Mp3r0j2J10N9j6n8o7
5012g9J1R0M0L1j05p0J1J00P5l3o9m1j7Q6O0n0n8o6J2R0N7l2p4o1L7Q5O8l6r3
5041c1n0j2J32M2l6r7j5L4N2Q5q5m0o7M5Q5J0Qj11m0L7R2K5l2q1k5M4O4N3m7p6
5071c7m5O4P3M5o9q8k7N8O9M7n1m8n5L3P7Rn7p1k1M7R6k0k4n0m8N3J02J1n0n6
5101c3m0Q1O1j3l7q7PR0K4K7q3n2j8P2P5jp5p0PN3R0k1q0m1RP9M8rp1m9J1N9Q3
5134I6l4o9o0L0K3P0mr5l8K2O3O8k6o2p4K8O2O7l2p3k7K5Q6L7l6o8l0mR9M0l4
5165E0q5m3L1P2L0j8q8m4K0R6O0o6m8l3K6O0M4m5n1m7N5R1L3l9r4k1L4O4L0o4
5195A0n8l5L1R0L3o4p4l7N5R1J5n6m7m0M0Q9L4p2o0k5Q4N8J9o9p7MM9R0Nn8j16
$$ plain form
5226 -91 -78 -20 53 56 -10 -58 -42 3 78 70 13 -46 -59 17 83 84 26 -38 -87 -23 46 89 -4 -84 -87 8 42 24 -18 -103 -58 -10
5258 -10 35 51 11 -96 -67 -9 78 55 -9 -63 -45 52 123 56 0 -67 -28 27 83 62 -11 -72 -57 12 66 79 -42 -82 -61
5287 -61 11 44 33 -10 -55 -40 61 83 70 -24 -72 -27 33 78 54 -5 -67 -57 42 68 15 -66 -92 -18 41 50 7 -62 -106 -39
5317 -39 29 67 18 -36 -73 -14 71 92 28 -50 -77 -1 64 92 24 -49 -45 -28 31 101 8 -65 -78 -61 17 58 15 -78 -51 -12 52
5348 52 36 -13 -46 -50 -5 86 94 35 -52 -70 -6 70 75 6 -68 -60 -12 52 62 -8 -78 -80 -29 42 76 -27 -69 -61 -2 66 40 -18 -80
5381 -80 -42 23 79 71 -17 -76 -72 18 65 33 -15 -90 -67 -23 82 35 -31 -61 -67 15 80 56 -47 -80 -24 26 84 53 -26 -56 -48
5412 -48 34 94 36 -31 -81 -35 38 84 46 -41 -89 -56 25 57 25 -53 -94 -47 39 77 65 -24 -68 -10 55 91 50 -18 -50 -46 72
5443 72 81 51 -64 -87 -23 33 67 24 -43 -86 -13 43 69 20 -55 -68 -14 48 82 20 -48 -74 -26 49 77 36 -49 -54 -15 65 56
$$ packed form
5226i1J3N8P3Lo6m8J6M5P5qn7n9j3P6O6Jn8o4m9O4O9M3r3q0lR5L4j8m2q5M5M8
5258a0M5J6m0j07K9N8Q7k3o4n4J8R7P1o7n6o7L9N5N6k1p3o1J5O9N4J3j21m0K1
5287f1P2L3j1m3m5J5J01K2j3r4m8M5O0M5k4n9o2J0R9K6n3q1k6P4N9Rm3o9m4O7
5317c9O8L8m9n4l7N9Q5K1o4p8k7P6O5K8o8p3MJ7N9P0r3p3j3J7P8M1m3r3K7L9O4
5348E2j6m9l3mM5R1Qn9q7j8O4P6No9p4QM8O4J0p0p0kN1P1L4j03m2QN9O8k6n8o2
5381h0L8O5N6qq8n9MR0M7l2m8p5K3M4J05m7o6l0oQ2O5k4j03l3N6N0N8l1p9l0Q
5412d8Q2O0n8o7n0M6P3M6l8q7m8L3Q1L2l2p8m1M7Q6L8j2q9m4N8O5L6m1o8l2MJ18
5443G2Rl0j15k3O4N6L4m3o7m3P3N6K6m9p5j3N4O2L4o2o8k6M8P5K8m1q5nL9Q0r
$$ plain form
5474 56 3 -59 -58 -7 42 46 1 -61 -87 5 53 75 5 -55 -19 -2 67 83 23 -52 -46 38 62 102 -2 -76 -41 7 90 67 5
5505 5 -72 -86 -17 32 56 -18 -57 -63 -3 69 40 -21 -82 -56 22 94 46 -9 -94 -73 10 65 46 -38 -50 -36 28 88 14 -36 -84
5536 -84 -65 18 67 51 -33 -41 -25 18 45 40 -59 -43 -23 36 81 51 -31 -83 -35 39 52 16 -60 -71 -55 9 88 9 -55 -69 -17
5567 -17 19 67 27 -48 -71 -13 55 71 48 -32 -48 -14 52 94 27 -48 -78 -1 51 59 2 -80 -74 -32 45 58 16 -53 -72 7 66
5598 66 84 20 -43 -81 -13 74 63 14 -49 -49 25 76 65 17 -66 -77 -4 54 56 -18 -89 -69 2 33 76 -6 -70 -66 5 78 79 26
5630 26 -68 -29 0 70 66 -19 -69 -52 11 58 43 -41 -61 -14 -3 60 39 -40 -74 -59 4 45 30 -32 -61 -37 52 93 67 -1 -74
5661 -74 -36 37 86 76 -18 -81 -56 20 56 14 -46 -104 -48 17 66 26 -19 -67 -51 44 74 34 -38 -75 -18 66 81 48 3 -62
5691 -62 -18 61 80 22 -67 -81 -36 36 74 -8 -52 -77 -33 40 55 23 -52 -65 -24 27 48 -12 -52 -46 -5 68 76 25 -48 -82 10
$$ packed form
5474E6n3o2JN1M9Mm5o2k6R2M8K2p0o0L6J7O9J6o0p5OQ4K4M0j04p4L5M8Q3k3o2
5505Ep7j4O9M9K4p4l9oO0P2k9o1o1K6P8P2m8n5q5K1Q3N5j9q4j2J4O4O0p4n0m8
5536h4J9Q3M9j6q4qJ6M3K7nr9J6K0N9M5l0q2n2M8P4J3l6p6j1J6O4P9p9o4j4N2
5567a7L6M8m0p5k3N8O8J6k3q0j6L4O6M2o7p5l0P7N2Qn7q2OM2P7J3m2o9j9P9N9
5598F6J8o4o3l8O8Q7j1m9o3%P4N1j1m8q3j1P3N8Kp4p1K0P1L1M3q2o4MP1P3Jn3
5630B6r4L9K9P0mq5n0J7O3M7j5q4k0M7J1O3k1p9l4J5O3M1j5o2k9K4Q9M1k6o8p3
5661g4L8P3M9j0r4o3K5P6L6m2o0n8N6O5M9m0m5m8J6R5L0m0p2l7N7Q4J5l3m5o5
5691f2M4P9J9n8q9j4M5P2L8q2m4k5M4P3J5l2p5j3M1N1K1o0m0OM1P3Qn1p3l4R2
$$ plain form
5722 10 76 68 1 -63 -63 -27 52 70 12 -82 -60 -14 38 31 -26 -70 -65 -1 76 85 2 -43 -44 10 69 71 -5 -45 -52 20 55 54 -17 -71 -88
5757 -88 18 34 49 -27 -102 -54 23 54 30 -56 -73 -38 6 46 48 -19 -72 -44 2 59 32 -1 -89 -59 16 63 27 -36 -54 -41
5787 -41 26 89 31 -28 -92 -37 55 78 23 -24 -73 -22 42 66 69 -46 -73 -49 32 82 49 -37 -91 -37 49 46 20 -30 -74 -16 41
5818 41 47 26 -59 -78 -29 47 70 2 -57 -86 -13 77 40 27 -50 -91 -4 72 87 3 -46 -75 -20 49 58 20 -69 -73 10 49 66 2
5850 2 -64 -73 -14 81 57 17 -49 -55 16 57 71 18 -72 -76 18 74 69 -11 -89 -55 -1 76 73 -8 -36 -56 7 87 36 -25 -73 -82 19
5883 19 69 43 -9 -82 -48 20 66 47 7 -79 -43 19 83 38 -28 -89 -43 9 103 67 -36 -93 -35 6 91 46 -40 -59 -43 18
5913 18 63 52 -20 -59 -21 29 71 31 -52 -92 -47 44 64 26 -64 -78 -21 -2 65 37 -48 -63 -32 54 56 28 -37 -72 -79 43 65
5944 65 21 -25 -68 -26 69 98 24 -45 -83 -5 62 65 15 -62 -75 -10 36 42 -1 -74 -87 -16 41 71 4 -82 -81 -27 49 41 11 -52
$$ packed form
5722A0O6qo7o4%L6P9J8n8r4K2M6N2pn7m4NO4P7Rq3m5jN4N9Kp6m0pP2L5jp1n4j7
5757h8J06J6J5p6p5M8P7L1k4q6j7L5M4M0Ko7n3K8M6N7k7l3q8L0P5M7l6o3j8J3
5787d1O7O3n8n9o4N5R2K3n5m7m9N1O4K4Lj15k7K4Q1N0l3q6n4N4Q6lk6n0m4N8N7
5818D1Ok1q5j9M9P6K3o8n9k9P3R0l7j3p7m1Q7P6J5q4m9k9N5O9Rl8q9mQ3L9J7o4
5850Bo6rN9R5k4m0o6oP1M1J4n3r0mR4N6nq0p8L4N4P7lq1k8k0O3Q0n1o1m8rJ01
5883A9N0k6n2p3L4O8M6j9m0q6L6O2O4m5o6o1M6N2R4l6j03n7N8M1Q5m5q6j9J6O1
5913A8M5j1p2l9L8N0M2m0q3m0M5R1K0l8r0j4N7J9O7k8q5j5L1Q6Kk8o5l5pJ22K2
5944F5m4m6m3M2R5K9p4o9l8P8O7Ln0p7j3O5M6Om3p3j3P1N7L0o7q6JN4P6ql0o3
$$ plain form
5976 -52 -57 0 88 105 16 -25 -76 24 69 73 -19 -91 -38 17 59 68 -19 -95 -65 11 91 29 -22 -50 -57 -3 88 63 -8 -87 -39 33
6008 33 69 38 -20 -59 -69 37 84 26 -52 -88 -62 15 58 42 -40 -85 -30 21 73 21 -47 -73 -10 39 80 54 -40 -71 -34 32
6038 32 86 29 -64 -84 -25 48 79 34 -32 -73 -36 48 56 28 -45 -81 -25 30 66 12 -64 -67 -47 59 50 24 -31 -65 -19 26 56
6069 56 -12 -62 -91 -12 63 65 50 -66 -90 -18 66 85 24 -70 -71 0 69 56 6 -64 -61 6 62 48 26 -65 -94 20 68 51 0
6100 0 -99 -65 -10 54 44 -11 -61 -60 17 70 87 -9 -94 -65 17 64 38 11 -39 -68 13 70 42 -28 -80 -59 9 52 37 -36 -75
6131 -75 -67 6 71 32 -31 -111 -53 25 59 62 -23 -69 -36 30 69 50 -15 -79 -51 46 81 22 -34 -82 -23 49 73 7 -67 -90 -31
6162 -31 49 71 24 -24 -63 -8 48 79 64 -34 -55 -35 27 69 31 -57 -89 -18 52 71 -8 -52 -85 -29 35 78 -10 -63 -63 -22 55
6193 55 74 25 -36 -76 -16 64 68 32 -56 -64 -3 63 64 6 -56 -69 1 67 73 14 -56 -71 -10 55 43 9 -76 -67 -2 79 46 -12 -63
$$ packed form
5976e2nN7Q8J7q9m1n1J00M5Mr2p2N3N5M2Rq7p6L0P6Q0o2n1k8pN4R1k5p1p9M8P2
6008C3L6l1n8l9j0J06M7n8p8l6K6P7M3j6q2m5N5N1N2n2o8k6O3M9M1k6r4l1L7O6
6038C2N4n7r3k0N9P3L1m5o6m1L7Q4Qk8p3l6N6N5L6n4p6lK0J06rk6n5l4M6M5L0
6069E6o8n0k9P9P5Kj5j16k4P2Q4J9o1r4jP1O9j3n0p0LO7N6j4k2r1k9J14M8j7n1
6100@r9L4N5O4j0n5n0JP7N3J7r6q5K9Q2M7k6k7n0k9Q1N7k8p0n2K1O8M3j5p3l9
6131g5QP3O5l9o3q0N8P8L4Lq5m6L3O6L9j9o5o4K8R7L5n9n6m8N9P2K4o6p4k3N9
6162c1Q0K2m7m8l9N5N6L1j5r8k1K0O2M2l8q8l2P1P0J9p9m4l3N6O4M3q8n3%M1P7
6193E5J9m9o1m0O0Q0Ml6q8qO1O6Jn8o2j3P0O6On9p0j5O1O5j2l4q5RO5Q1l3n8n1
$$ plain form
6226 -63 -48 2 70 56 12 -34 -58 14 94 73 -9 -93 -62 3 61 33 -32 -82 -75 9 45 38 -5 -61 -56 -2 85 60 -38 -82 -41 51
6258 51 73 63 -21 -64 -47 29 77 25 -31 -91 -67 37 60 20 -47 -93 -41 48 45 21 -47 -59 -19 22 80 33 -19 -64 -28 60
6288 60 99 11 -49 -72 -9 55 67 -12 -69 -88 -15 58 80 32 -57 -70 4 44 52 34 -71 -58 -5 61 78 29 -48 -77 -4 43
6318 43 65 11 -52 -81 2 57 85 5 -72 -75 -24 40 48 -2 -71 -70 -7 54 88 26 -45 -42 34 77 49 16 -67 -74 -13 68 57 -21 -67
6351 -67 -63 1 53 57 -23 -93 -79 -31 54 39 -27 -91 -52 21 80 49 -21 -55 -34 53 106 69 1 -85 -27 -3 50 41 -38 -87 -33 6
6383 6 61 27 -47 -91 -39 39 60 49 -23 -68 -31 47 66 34 -34 -98 -19 21 88 31 -35 -56 -30 52 52 35 -44 -56 -15 45 56
6414 56 -17 -61 -65 -32 47 79 6 -35 -77 2 62 80 28 -23 -64 -3 29 81 -2 -63 -79 -23 62 50 26 -96 -101 -20 33 60 -8
6445 -8 -70 -92 10 86 70 -16 -78 -51 13 65 77 -6 -68 -60 11 90 66 -10 -71 -70 40 60 53 -17 -55 -64 28 69 50 -30 -93 -70
$$ packed form
6226f3J5N0O8j4m4m6k4P2Q0k1q2q4L1O5N8k8o5n0PQ4L6pm3n6NN4Q7k5r8m4M1R2
6258E1K2j0q4m3J7P6M8n2n6o0K4J04K3m0o7m6N2Q9lk4o8j2M0M1N8m7n2m5L6Q8
6288F0L9q8o0k3O3O4J2p9n7j9P3P3K2m8q9j3P4M0Qj8j05J3N3O6J7m9p7k9P3M7
6318D3K2n4o3k9Q3N5K8q0p7lN1O4Qn0o9JO3O1L4o2p1LP6M3k8l3q3pO1Q1j1p8m6
6351f7MO4N2Mq0p0J4M8Q5j5o6o4L9P3N9l1p0l4K1Q7N3l7o8q6N8K4N3rp9m9N4L9
6383FN5l4p4m4N2P8K1j1p2m5L7P8J9l2o8o4P9M0O7n7o6k1K6Q2%j7p9j2M1O0J1
6414E6p3m4mL3P9L2p3m1m2P9O0J8n2n1m1O1L2N2q3o1j6N6Q5j2k4j22nQ1N3K7o8
6445ho2k2J02P6j6q6o2K7O4N2J2q3o2QP1P9k4p6o1JJ10K0pp0l8rR2M1j9q0o3K3
$$ plain form
6477 -70 2 59 55 -8 -55 -34 10 85 41 -22 -79 -39 27 36 33 -52 -82 -60 31 64 33 -29 -69 -31 41 71 49 -4 -70 -10 18 78
6509 78 67 -39 -70 -30 46 87 0 -50 -77 -38 26 68 15 -50 -62 -54 78 61 34 -33 -43 -22 66 84 25 -44 -80 8 47 102
6539 102 0 -51 -49 9 74 66 3 -60 -86 -17 67 62 13 -63 -94 -11 63 88 4 -51 -49 8 73 81 16 -39 -60 32 66 53 -25 -79
6571 -79 -70 5 55 45 -24 -73 -80 10 43 44 0 -74 -43 2 81 41 2 -54 -55 31 85 53 -2 -73 -51 1 67 49 -12 -62 -63 28 86
6604 86 32 3 -102 -63 19 74 14 -20 -69 -39 3 73 10 -44 -64 -34 42 90 46 -17 -70 -41 48 67 0 -48 -77 -17 49 78
6634 78 16 -58 -85 -33 36 44 14 -44 -72 -39 38 42 38 -35 -47 -26 43 84 32 -26 -47 11 65 90 33 -54 -88 -12 73 80 8 -66
6666 -66 -61 -44 50 64 27 -78 -63 14 68 70 14 -58 -53 50 78 55 -2 -62 -39 38 32 62 -4 -56 -48 6 37 37 -30 -88 -63 7
6698 7 77 54 6 -55 -38 37 68 92 2 -87 -92 38 78 43 -24 -54 -31 14 87 47 -22 -109 -46 16 55 34 -47 -63 -49 2 89
$$ packed form
6477g0P2N7mo3m7K1M4P5m4o3n7M0O6Rlq5l0K2R1L3l1o2m0L8P2L0k2n3o6O0K8O0
6509G8j1j06l1M0P6M1q7n0k7L9O4M2n3o5j2QJ32j7k7o7j0K1Q8J8n9o9l6Q8L9N5
6539A02j02n1KN8O5qo3o3k6O9Q4nm9p6l1Q3P4K5q4n5KN7O5Qo5n5k1R2L4j3p8n4
6571g9RP5N0j0o9m9pR0L3Jm4p4L1M5P9m0l9n6jQ6N4l2n5p1K2N2O6j8o1n0jR1N8
6604H6n4k9j05L9Q2N5o0l4m9L0M2P0o3n4k0L0P6M8m4o3n3K9Q9J9o7m8k9O0O6K9
6634G8o2p4k7N2O9Ql0n8k8L3P7Mmp3j2K1O9M1n2n8k1N8N4K5n7q7l4P6Q5Pp2p4
6666f6NJ7R4J4l7j05J5P7N4Kn6p2NJ03K8k3n7o0K3P7oL0o6n2QN4L1%o7n8K5P0
6698GP0k3m8o1J7P5L1K4r0q9nJ30M0l5o7l0K3M5P3m0o9q7O3O2L9k1q1j6J4N1Q7
$$ plain form
6729 89 25 -42 -75 -20 36 78 31 -27 -63 -29 26 88 45 -7 -60 -30 34 72 23 -76 -94 -66 30 101 22 -16 -67 -22 48 55 35
6760 35 -26 -65 -8 49 91 2 -95 -69 -30 69 58 11 -67 -106 -40 51 65 20 -33 -56 -36 47 69 -9 -65 -65 -3 45 84 16 -71
6791 -71 -45 17 59 73 8 -56 -69 -17 33 56 -1 -80 -67 22 60 35 -24 -79 -69 -3 66 47 12 -69 -81 2 65 65 -15 -73 -13
6822 -13 35 81 81 -17 -67 -67 43 54 54 -22 -54 -67 20 87 43 -16 -70 -23 35 63 31 -19 -99 -30 52 94 50 -3 -69 -27 30
6853 30 81 50 -25 -84 -45 16 75 23 -47 -84 -29 48 69 10 -47 -54 -24 21 73 37 -58 -59 -7 66 97 11 -47 -31 -17 67 73 29
6885 29 -40 -70 -45 53 52 14 -72 -72 -10 39 57 -15 -61 -93 -23 48 48 -15 -66 -96 -12 23 56 -1 -48 -65 4 48 40 -8 -71 -75 -21
6918 -21 63 53 9 -78 -54 17 64 58 20 -57 -49 10 59 42 -33 -76 -57 -1 88 39 -19 -89 -79 8 57 73 -36 -70 -37 35 93
6949 93 19 -17 -73 -53 33 79 54 -26 -85 -50 15 73 61 -12 -85 -39 39 78 38 -16 -55 -15 41 71 55 -52 -76 -60 11 113
$$ packed form
6729H9o4o7l3N5N6M2m7n8l6L4N5O2m3n2n3L0O4L8m9r9j8K8R6P1p9l8n1M5P0Pk0
6760C5o1l9N7N7M2q9r7K6L9R9j1m7p8l9O6R1J4m5n3k3K0Q3K2p8n6%O2M8L9o8q7
6791g1K6O2M2J4o5o4j3N2N0K3n7p9J3Q9L8k5n9n5J0O6O9j9l5q1j2Q3O3%q0n8O0
6822a3M8M6%r8n0%J10J1%p6l2j3Q7O7m4n9n4M7N8K8l2n0q0O9Q2M2m4n3o6M2N7
6853C0N1l1p5n9L9O1N9n2p0l7N5P7K1n9n7pL0M5N2l6r5jN2P3L1q6n8J6J4Q4Om4
6885B9o9l0K5R8jl8q6%O2M9J8p2m6l2P0P1%o3n1l0Q4L5L3n7m7j7O9M4qm8o3mN4
6918b1Q4j0m4q7K4P1M7ol8p7QN9M9j7p5m3J9N6Q9m9n8p0J0Q7M9J6j09l4L3P2N8
6949I3p4l6n6K0Q6M6k5q0n9L5O5N8j2p3p3M6P8L9m0n4l9M0N6L0j6j07k4J6P1J02
$$ plain form
6979 113 52 -22 -69 -59 65 80 37 -48 -51 -15 59 76 31 -49 -97 -17 47 68 30 -72 -71 -8 45 63 -5 -46 -75 -13 65 80
7009 80 -4 -51 -74 8 42 84 53 -37 -52 13 58 73 25 -48 -44 10 99 85 12 -68 -54 10 68 50 2 -71 -79 -21 58 48 -12
7040 -12 -51 -41 27 90 41 10 -76 -46 4 43 61 -17 -89 -50 17 64 24 -16 -52 -44 23 80 39 -21 -78 -54 24 80 52 -37 -73
7071 -73 -66 22 71 34 -17 -68 -41 33 76 32 -18 -106 -43 31 87 44 -45 -39 -55 34 65 -13 -39 -56 -32 46 64 35 -51 -81 -29
7102 -29 56 85 41 -25 -56 -14 56 72 27 -63 -81 -13 60 57 36 -62 -80 -17 63 80 1 -68 -68 -23 33 54 21 -57 -52 8 47 60
7134 60 14 -53 -59 13 56 69 28 -72 -73 -17 77 74 -8 -75 -65 6 56 64 -14 -68 -62 15 88 69 18 -80 -75 2 88 42 -21 -62 -37
7167 -37 12 57 54 -47 -65 -68 37 75 66 -40 -74 -55 28 102 60 -23 -41 -47 24 60 18 -10 -93 -59 76 57 21 -23 -82 -41
7197 -41 24 64 25 -54 -93 -42 30 78 15 -65 -61 -21 54 99 51 -27 -72 -52 26 87 41 -53 -75 0 42 55 36 -68 -71 -10 56
$$ packed form
6979A13o1p4m7J0J24J5m3q5lL6P4J7m5q0m8Q0O4K1l8j02JO3N3J8o8m1k9O2P8J5
7009H0q4m7k3Q2L4M2l1r0j5O5M5J5m8p3MN4Q9j4p3q0J4O4N8j8m8p3qN8P9j0o0
7040a2l9J0O8O3m9l1q6L0N0L9J8p8p2L9O7M7m0m0l6QO7N7m1o0n7K4P8N6k8q9l6
7071g3PQ8M9l7n1n1K7P4M3m4n0q8O3P4N6m3q9Oj6Q9L1p8k6j7K4P8J8k9q6l0N2
7102b9Q5K9m4o6l1M2P0J6m5r0j8O8P3lk1r8j8O3Q0J7p9o9%M5N6K1l3p8NO0L9J3
7134F0m6o7oP2M3J3m1j00jN6R4lq2o7J0P1N0Qp8n4OP7P3j9n1r8NP7Q6m6o3m1K5
7167c7M9M5lj01j8lJ05L8rj06l4J9Q3P4m2q3j8oP1L6m2k8q3L4J35j9l6m4n9M1
7197d1O5M0l9p9l9N1P2M8o3q0MM0P5M5m8p8m5K0P8O1m6r4k2P5M2J3j9j04lO1O6
$$ plain form
7228 56 72 -2 -55 -107 -30 30 74 23 -50 -53 -11 93 54 5 -49 -50 -3 62 67 -3 -66 -96 -12 66 54 4 -79 -66 -15 80 42
7259 42 -28 -76 -51 -4 76 82 -11 -63 -70 -9 99 87 -9 -79 -46 26 68 61 11 -53 -25 19 67 53 -47 -94 -91 1 58 52 -27 -63
7291 -63 -96 4 28 54 -46 -83 -36 21 61 35 -4 -77 -17 39 68 50 -30 -73 -42 6 50 43 -47 -104 -33 20 74 30 -44 -91
7321 -91 -33 32 47 43 -47 -50 -35 38 67 22 -40 -54 -11 70 62 20 -44 -55 -38 47 53 31 -56 -69 -44 33 66 18 -55 -62 17 55 67
7354 67 6 -54 -52 1 54 60 -17 -50 -56 -9 59 69 28 -48 -78 -14 53 42 -22 -48 -79 -8 75 63 1 -68 -53 -1 94 71 -29
7385 -29 -54 -54 -6 65 51 7 -73 -42 23 50 45 -22 -69 -52 21 56 37 32 -80 -56 26 47 31 -27 -71 -63 15 47 43 -42 -92 -54
7417 -54 12 69 49 -18 -80 -65 58 85 23 -61 -62 -11 78 54 51 -28 -69 -62 34 58 22 -39 -83 -39 43 54 23 -19 -65 -1 42
7448 42 65 26 -70 -70 -50 46 72 34 -43 -85 -41 35 48 16 -54 -50 -44 55 96 32 -39 -75 -45 57 92 20 -62 -64 -11 49 63 15
$$ packed form
7228E6J6p4n3n2P7O0M4n1p3lM2J04l9m9n4jM7O5Np0o3l0Q4P8j2n0q3J3N1R5l8
7259D2p0m8K5M7Q0Or3n2pO1J08j2r6p0L3P2M2pn0o4K8M4M8j4j00m7LR2N7op9l6
7291f3l3J00K4K6j00l7M7N7M0k6l9p3O0N6K9j8q0m3L1M8M4pr0n7P1N3N4m4p4m7
7321i1N8O5J5mr0lJ5P3K9m5o2j4M3Q1qm2o4j1J7Q5Ok2q7j3K5P7L3m8p3pP9L8J2
7354F7o1o0KN3N3Op7l3oM7O8J0m1p6l0O4O7j1o4k6l1P1Q3j2o2o9J5N2R5k3j00
7385b9k5%M8P1j4m4q0L1O5K7no7m7J7P3L5j9nj12K4Q2K1j6n8m4QP8L2mq5n0L8
7417e4O6N7k0o7o2J5J23K7o2q4jN1Q9k4lp9m1PR6K4l6o1m4M4Q2J1l1m2m6O4M3
7448D2K3l9r6%K0R6K6l8p7m2M4P6J3l2p0MOR9M1o4p1l6L0J02L5p2q2kN3O0J4m8
$$ plain form
7480 15 -43 -59 3 53 37 -30 -69 -71 -12 58 83 0 -51 -89 -5 62 33 6 -72 -26 -7 70 44 19 -62 -59 11 88 68 -12 -44
7511 -44 -69 -16 65 37 -15 -71 -46 5 61 32 -25 -88 -47 43 71 53 -8 -82 -46 34 76 25 -17 -54 -41 33 78 40 -51 -76
7541 -76 -49 24 56 39 -60 -70 -57 21 65 30 -20 -53 -7 56 81 36 -44 -72 -37 77 86 43 -55 -90 -16 41 91 24 -37 -85
7571 -85 -33 32 53 -3 -54 -66 -38 44 79 36 -58 -77 -5 85 67 4 -39 -52 -27 56 66 33 -49 -64 -1 49 77 -10 -65 -97
7601 -97 -17 59 55 14 -41 -61 -18 40 48 6 -88 -68 47 91 87 -3 -78 -72 0 69 83 -1 -55 -60 -3 41 33 -14 -72 -82 24 62
7633 62 64 -32 -68 -60 60 88 61 5 -50 -43 37 69 53 6 -60 -48 37 62 20 -44 -86 -42 16 49 35 -47 -68 -28 25 76 27
7664 27 -21 -87 -5 61 86 8 -45 -83 -41 34 57 15 -62 -65 -39 18 27 10 -41 -91 -24 59 63 20 -68 -65 -12 48 89 21 -54 -61 -15
7697 -15 53 62 39 -34 -47 -21 61 67 14 -65 -53 -21 83 49 3 -64 -87 12 32 72 -9 -47 -55 30 45 54 3 -58 -78 7 89 69
$$ packed form
7480A5n8j6O2N0j6o7l9kN9P0K5q3n1l8Q4O7k9k7p8M6J9P7k6k5q1LP0P7k0q0l2
7511d4k5N3Q1k8n2n6K5N1N6k9n7o3M1R0K8j8o1p4L6Q0M2n1m2l7J3P4M5l8r1k5
7541g6K7P3L2j7r9j0J3P8M4l5n0l3M6O3K5m5q0k8L5J14Rm3r8l5P4N7N0o7o1m8
7571h5N2O5K1n6n1j2K8Q2L5m3r4j9P2R0j8o3m3j3K5Q3J0l3q2j5O3N0K8q7n5l2
7601i7Q0P6mm1n5k0M3N8Qm2r4K0J15M4mr0p5OP2O9J4q4n4nN7M4qm7n8j0J06L8
7633F2Kr6l6QJ20K8k7n6n5PQ0L2j6m7o6J2Q5K5m2o4m2M4N8L3j4q2k1M0N3N1m9
7664B7m8o6Q2O6K5p8n3l8M2P5K3m2p7lK6N7Rj7n1n0O7Q3Mm3q8LN3O0M1o8p5pM6
7697a5O8Rk3p3j3K6Q2On3p9J2L2J04l4m6o7k3R9K0M0q1l8qQ5J5Rn1o1k0Q5Q2k0
$$ plain form
7729 69 24 -72 -45 -8 42 57 -4 -86 -83 -16 38 32 -19 -98 -72 -5 78 41 -37 -69 -31 36 55 51 -6 -41 -47 29 70 60 -30 -70
7761 -70 -22 18 68 58 -46 -84 -56 27 59 39 -35 -90 -28 31 72 31 -14 -80 -32 48 108 57 -28 -96 -63 46 89 31 -23
7790 -23 -84 -18 53 58 11 -48 -59 -28 78 52 -3 -53 -68 -29 20 110 40 -26 -60 -20 66 66 45 -41 -40 8 76 81 17 -64 -77 -23
7822 -23 48 70 17 -50 -61 11 53 58 -2 -71 -55 24 59 74 13 -62 -68 17 80 64 18 -69 -53 1 35 56 -28 -59 -56 22 54 33
7854 33 4 -100 -47 14 58 75 21 -62 -39 8 84 53 -33 -73 -32 32 57 37 -30 -69 -71 -5 52 46 -52 -81 -42 24 61 39 -47
7885 -47 -74 -23 48 69 30 -11 -75 -42 37 93 66 -28 -84 -64 23 58 29 -34 -94 -20 49 73 16 -73 -75 -43 37 77 20 -47 -108
7916 -108 -19 54 58 33 -27 -48 -18 58 46 -16 -81 -81 -40 35 77 0 -53 -53 -32 21 48 -18 -83 -44 2 50 27 -31 -46 -69 17
7947 17 85 60 15 -73 -51 -9 52 56 -22 -43 -63 -10 51 59 -45 -106 -98 28 57 41 -19 -53 -55 -3 55 52 19 -46 -45 3 77 42
$$ packed form
7729F9m5r6K7L7N0J5o1q2LO7N4on1p9K6O7Q3l7p8l2L8O7J9mn7l5oP6M1j0r0m0
7761g0M8M0N0j0j04l8K8Q3L2k0p4n5O2N9M1m1m5o6M8Q0O0n1q5o8L3J09M3n8n4
7790b3o1O6P1Nm7n9j1L1J06k6n5n0j5L9M9R0p0o6l4M0Q6%k1q6JM8O8No4q1j3N4
7822b3P1K2n3o7j1P2M2No0o9J6P9L5J5o1p5oQ5O3j6m6q7J6N4L4K1q4l1LP8L2k1
7854C3k9j04N3O1M4J7n4q3K3M7P6l1q6m0M1O4K5k0o7l9kO6N7or8k9L9O6L7k2q6
7885d7k7N1P1K1l9m1o4L3P9N6k7r4n6K0Q7L5k9o3o0P4O9K4n7q9kL2Q0M0n7o7o1
7916a08Q9P3Mk5o0k1L0P6j2o2o5%M1P5M2p7n3%K1N3K7o6o5L9M6M8k3n8j5k3Q6
7947A7O8k5m5q8K2M2O1Mp8k1k0N3O1Qj04o1QJ26K9j6o0l4kN2N8ll3o5JM8P4l5
$$ plain form
7979 42 -20 -76 -41 3 77 57 -18 -80 -51 2 63 47 -17 -72 -41 6 59 22 -58 -74 -13 17 54 47 -29 -87 -25 24 65 55 -25
8010 -25 -44 -59 32 51 17 -61 -73 -34 30 74 24 -73 -83 -39 58 64 62 -45 -68 -18 22 60 26 -41 -48 2 52 78 7 -48 -59
8041 -59 -36 36 51 3 -63 -78 -38 54 34 -9 -68 -52 -13 61 62 6 -68 -49 13 59 67 25 -80 -50 -16 37 40 -15 -57 -75 -17
8072 -17 80 42 -26 -84 -94 23 58 74 18 -64 -75 -2 37 50 -17 -56 -55 16 63 68 -36 -83 -55 10 57 50 -22 -112 -30 8 68
8103 68 38 -32 -76 -55 34 68 44 -32 -85 -46 31 75 65 -26 -48 -40 5 60 26 -48 -59 -40 56 47 25 -62 -41 -48 42 75 20 -53
8135 -53 -115 -49 42 25 3 -32 -79 -25 37 90 -13 -49 -58 -23 59 75 18 -49 -76 -36 37 73 11 -36 -60 -16 24 74 -9 -57
8165 -57 -69 -37 65 52 22 -78 -73 -11 43 84 3 -54 -47 -1 46 67 -6 -65 -85 10 58 45 -12 -58 -80 -34
$$ packed form
7979D2o2n6L5M4P4k0p5o2K9N3O1j6o4n5L1M7N3l7q0j6O1L0L7pp6n8O2M9M1j0q0
8010b5j9j5R1J9l4p8j2L9O4M4n0r7j0M4R7Okj07k3N0M0L8l4o7pN0N0K6p1n5j1
8041e9K3P2J5m8o6j5M0R2k0m3n9J6L9P4Jn6p4J9O2M6Qm2j05L0L4N3Ln5m2j8N8
8072a7R7l8o8n8j0J17L5J6n6q2j1P3L9J3o7l9JP1M7Nj04m7K8O5M7pp2r0Q2L8O0
8103F8l0p0m4K1Q9L4k4p6n3L9P7M4j0r1k2QM5N5l4p4j1J9R6rk2q7K1pR0L3n5p3
8135e3o2O6R1j7k2l5m7N4O2N3j03l6rL5Q2J6n7o7k7M0P3L6o2m7k4M4M0N0q3m8
8165e7j2L2J02j3l0j00NO2N4M1q1n7PM6M7K1p3n9k0R5M8j3n7m6k2M6
8191c4
$$ Imaginary data points
##PAGE= N=2
##DATA TABLE= (X++(I..I)), XYDATA
$$ plain form
0 0 0 0 0 0 0 0 0 0 0 0 0 0 0 0 0 0 0 6 -8 8 -8 8 -8 10 -16 16 -16 24 -24 32 -32 40 -41 48 -56 64 -70 78 -89
39 -89 97 -106 121 -131 146 -163 179 -196 219 -241 265 -292 322 -354 391 -431 480 -531 593 -663
59 -663 746 -845 968 -1123 1326 -1606 2011 -2664 3891 -7020 33426 55235 11672 14873 20702
74 20702 31989 25527 10706 -6027 -5650 -10344 -18773 -25500 -29533 -41640 -42648 -25576 -1401 5377
88 5377 -10076 -34226 -35596 -9576 18392 22517 13550 13001 24515 31830 28449 18408 10624 9385
102 9385 13022 16198 20067 19196 1634 -25600 -35632 -21914 -4608 -1621 -13462 -25839 -21981 -8890
116 -8890 -8021 -17950 -20174 -11678 136 11943 19491 18985 11923 1207 -4238 7731 29993 37679
130 37679 23340 5795 2498 9692 10904 -2470 -19300 -22180 -11012 -2362 -5697 -15733 -24808
$$ packed form
0@%%%%%%%%%%%%%%%%%Oj4J6j6J6j6J8k6L2l2M0m8N6o4P2q1Q9j04J20j34J48j67
39h9J86k03K27k52K77l09L42l75M15m60N06n57O14o76P45q22R11j011J124j256
59f63J409j591J813k091K449k932L617m675O555j0911M0446K1809m3563L201N829
74B0702J1287o462j4821j6733L77m694q429o727m033j2107j008J7072K4175O778
88E377j5453k4150j370K6020K7968M125q967n49J1514P315l381j0041p784j239
102I385L637L176L869q71j7562k7234j0032J3718J7306K987j1841j2377L858J3091
116h890Q69r929k224Q496J1814J1807P548n06p062j0716n445J1969K2262P686
130C7679j4339j7545l297P194J212j3374j6830k880J1168Q650l335j0036r075
$$ plain form
143 -24808 -30185 -27424 -12924 5547 14476 8949 -2060 -3159 9789 20181 13025 196 1919
156 1919 17318 29471 25821 8704 -6667 -8644 -2947 1278 3965 3175 -6212 -18901 -23404 -18052
170 -18052 -11035 -10954 -16949 -16093 -599 16018 15741 1573 -8593 -4979 7371 17516 19572 16105
184 16105 11366 5578 214 459 5559 5934 -1711 -7307 -2686 5337 3946 -10654 -26481 -26781 -11321
199 -11321 2567 3786 -1876 -6063 -6767 -4069 913 5562 8468 8470 6889 10183 18368 19061 5504 -9732
215 -9732 -10659 2936 16035 14248 -806 -13185 -13199 -7822 -6461 -8353 -9263 -8459 -6048 -2245 902
230 902 -5 -6146 -12933 -10464 4879 20778 21473 8877 -982 836 8796 12291 7634 1855 2226
245 2226 5365 4230 -812 -6154 -11989 -16837 -15257 -6110 3841 5507 -4178 -15720 -15301 -3681 5055
$$ packed form
143b4808n377K761J4500J8471Q929n527j1009j099J2948J0392p156j2829J723
156A919J5399J2153l650j7117j5371j977N697M225K687p90r387j2689m503N352
170a8052P017Q1n995Q56J5494J6617k77j4168j0166L614J2350J0145K056l467
184A6105m739n788n364K45N100L75p645n596M621Q023j391j4600j5827l00J5460
199a1321J3888J219n662m187p04K698M982M649K906Kj581L294Q185O93j3557j5236
215i732r27J3595J3099j787j5054j2379j4N377J361j892r10Q04K411L803L147
230I02r07o141o787K469J5343J5899O95j2596r859J818P960L495m657n779L71
245B226L139j135n042n342n835m848J580R147R951J666r685j1542M19J1620Q736
$$ plain form
260 5055 4060 335 1794 8102 12808 10801 4464 425 790 3760 9323 15242 13575 1343 -12200
275 -12200 -15475 -7486 1268 295 -8479 -12357 -5823 1439 -586 -8588 -13098 -9302 249 9086 12071
290 12071 9023 2376 -4108 -4114 4791 14116 13415 5028 19 3310 8488 5896 -5529 -14179 -10473 175
306 175 5615 2552 -4700 -11190 -13721 -11071 -4906 1549 4151 974 -2912 -250 6545 7669 1193
321 1193 -3991 -35 10692 17795 13642 2530 -5122 -5748 -3281 -215 2715 2632 -1652 -6462 -7427 -4447
337 -4447 -2337 -5847 -11681 -9916 1164 10304 7862 -2477 -9590 -7054 2105 9362 10490 8221 5792
352 5792 3432 2443 3690 3895 -299 -5360 -4706 2356 8637 5130 -7701 -17322 -13738 -2393 4361
367 4361 2618 -2494 -4769 -2936 -342 -103 -1091 -1060 -55 2906 8810 13262 9612 -467 -7735 -5208
$$ packed form
260E055r95l725J459O308M706k007o337m039L65K970N563N919j667j2232j3543
275a2200l275P989Q754r73q774l878O534P262k025q002m510L796R551Q837K985
290A2071l048o647o484oQ905R325p01q387n009L291N178k592j1425q650L706J0648
306A75N440l063p252o490k531K650O165O455K602l177l886K662O795J124o476
321A193n184L956J0727P103m153j1112p652o26K467L066K930q3m284m810r65K980
337d447K110l510n834J765J1080R140k442j0339p113K536R159P257J128k269k429
352E792k360r89J247K05m194n061O54P062O281l507j2831r621L584J1345O754
367D361j743n112k275J833K594K39r88L1J005K961N904M452l650j0079p268K527
$$ plain form
383 -5208 4548 11228 7709 -1088 -5222 -3338 -1724 -3606 -6485 -7353 -5165 -1413 1594 2453 305 -5207
399 -5207 -10063 -7102 3451 11911 10631 2863 -2593 -933 4053 4894 790 -1691 1006 5187 6883
414 6883 5029 -87 -6441 -9943 -7471 -128 6209 4540 -4742 -11732 -8988 -1401 1716 -1322 -4218
429 -4218 -1131 6381 10469 6642 -656 -4802 -3767 1081 7427 10808 7578 24 -5419 -4328 1244
444 1244 3960 -253 -5699 -4492 1617 3878 -1621 -9903 -13289 -8790 -612 4754 5599 3551 -132
459 -132 -3126 -1687 3569 7146 5766 2225 1703 5486 8342 3980 -4902 -9093 -4751 2672 6254 3898
475 3898 -1828 -6889 -8729 -7374 -3808 -149 320 -2413 -3107 960 5122 3462 -2848 -6414 -1619 8364
491 8364 13750 9524 1050 -3826 -3340 -373 2282 2605 587 -1707 -2344 -831 903 -952 -6744 -10011
$$ packed form
383e208R756O680l519q797m134J884J614j882k879q68K188L752L007Q59k148n512
399e207m856K961J0553Q460j280p768n456J660M986Q41m104k481K697M181J696
414F883j854n116o354l502K472P343O337j669r282o990K744P587L117l038k896
429d218L087P512M088l827p298m146J035M848O346L381l230p554n443J091N572
444A244K716m213n446J207O109K261n499q282l386M499Q178N366Q45k048l683
459a32k994J439N256L577j380l541n22L783K856m362q882m191M342P423L582k356
475C898n726n061j840J355L566L659M69k733o94M067M162j660o310l566M795R983
491H364N386m226q474m876M86K967K655L23k018k294o37J513J734j855n792l267
$$ plain form
507 -10011 -4894 4689 9227 4313 -4889 -9391 -5803 496 3013 1735 713 1410 2821 3988 3887
522 3887 1778 -1276 -2110 1428 7609 10299 4816 -5024 -9987 -6556 -346 2137 -233 -3283 -3259 -1218
538 -1218 -809 -2718 -4614 -5259 -4216 -384 5220 8119 5029 -1635 -5355 -1601 6551 10749 7383 1826
554 1826 78 1663 2156 -722 -5122 -7244 -5193 -1074 2094 2417 -1342 -7438 -10125 -5522 2725 7035
570 7035 4264 -1402 -3049 899 4408 2486 -2221 -3134 1247 6707 8744 5705 -116 -4656 -5195 -1683
586 -1683 3541 5905 2460 -3595 -5780 -2928 -177 -1753 -5879 -7112 -2410 4008 5425 1013 -4004
601 -4004 -5653 -3409 1321 5808 7345 5288 1521 -855 665 3798 3733 -68 -2328 453 4985 5474
617 5474 -6 -7332 -10288 -7171 -2045 965 990 -1316 -4308 -5195 -2569 1333 2932 1482 24 2454
$$ packed form
507a0011N117R583M538m914r202m502L588O299K517j278j022O97J411J167j01
522C887k109l054q34L538O181K690n483r840m963L431O210K483k370l050K4K041
538a218M09j909j896o45J043L832N604K899l090o664l720L754Q152M198l366n557
554A826j748J585M93k878m400k122K051M119L168L23l759o096k687M603Q247M310
570G035k771n666j647L948L509j922m707r13M381N460K037l039n821m540n39L512
586a683N224K364l445o055k185K852K751j576m126j233M702O418J417m412n017
601d004j649K244M730M487J537k057l767k376J520L133o5l801k260K781M532M89
617E474n480p326k956L117N126L010K5k306k992q87K626L902J599j450j458K430
$$ plain form
633 2454 7735 9633 4343 -3273 -5596 -1086 5251 7542 4295 -1003 -3913 -3830 -2635 -1569 -1868 -3877
649 -3877 -5071 -2823 1143 2100 -1781 -7336 -8105 -1518 6744 9158 5110 420 -791 1257 3434 3428
665 3428 1955 1060 1404 2339 3193 2309 -1816 -6787 -7743 -3118 2808 4344 -113 -6000 -7501 -4164 -624
682 -624 -65 -875 -639 1127 3292 4422 3427 867 -1545 -1511 2324 7774 9154 4105 -2762 -5283 -2532
699 -2532 1322 1625 -1683 -4024 -2768 -305 -119 -2503 -5532 -6981 -4990 28 4700 5552 1819 -3314
715 -3314 -4397 191 5699 6492 3193 854 2392 5387 5298 1013 -3797 -4742 -1701 1933 3260 1236
731 1236 -3487 -7754 -8146 -4427 -98 1229 -968 -2965 -1207 2657 3581 466 -2729 -1888 2634 7155
747 7155 7992 4821 725 -1926 -2109 213 3138 3451 519 -2713 -3228 -1382 -650 -3214 -6955 -6964 -2138
$$ packed form
633B454N281J898n290p616k323M510O337K291l247n298k910Q3J195J066k99k009
649c877j194K248L966R57l881n555p69O587Q262K414m048m690j211K048K177o
665C428j473q95L44R35Q54q84m125m971r56M625N926J536m457n887j501L337L540
682f24N59q10K36J766K165J130r95k560k412L4L835N450J380n049o867k521K751
699b532L854L03l308k341J256K463J86k384l029j449J991N018M672Q52l733n133
715c314j083M588N508P93l299k339J538K995q9m285m810r45L041L634J327k024
731A236m723m267l92L719M329J327k197j997J758L864R24l115l195Q41M522M521
747G155Q37l171m096k651j83K322K925L13k932l232n15J846P32k564l741rM826
$$ plain form
764 -2138 2994 3799 348 -3711 -4908 -2498 1669 4732 5129 3379 1238 1114 3221 4377 2000 -1787
780 -1787 -2317 1520 5715 5177 -701 -6815 -7920 -4454 -607 643 -675 -2819 -3649 -2503 -685 8
796 8 -932 -2343 -1351 3104 7548 7239 2181 -2599 -2598 1792 5878 5787 2446 -407 -1182 -932 -1103 -2110 -3666
815 -3666 -4581 -3578 -767 1624 1027 -2934 -6830 -6265 -1045 4040 4841 2251 -224 -41 2037 3243
831 3243 2469 1274 1242 2403 4084 4961 3097 -1464 -5575 -5735 -1820 2414 2559 -1734 -5668 -5515 -2609
848 -2609 -824 -1563 -3049 -2605 382 3583 4338 2366 -700 -2369 -703 3887 7706 7026 2558 -1483
864 -1483 -1756 828 2187 51 -3098 -3290 -631 1447 233 -3414 -6669 -6845 -3744 404 2910 2428
880 2428 -459 -2911 -2068 1454 3781 3130 1317 1353 3818 5856 4459 150 -3115 -2777 49 2799
$$ packed form
764b138N132Q05l451m059j197K410M167L063L97j750k141j24K107J156k377l787
780a787n30L837M195n38n878o114j105L466L847J250j318k144q30J146J818O93
796Hr40j411R92M455M444l09n058m780JM390M086r1l341k853p75K50j71j007j556
815c666r15J003K811K391n97l961l896N65N220N085Q01k590k475J83K078J206
831C243p74j195l2J161J681Q77j864m561m111j60L915M234J45m293l934J53K906
848b609J785p39j486M44K987L201P55j972l066j669J666M590L819o80m468m041
864a483k73K584J359k136l149j92K659K078j214l647l255j76L101M148K506m82
880B428k887k452Q43L522K327o51j813L6K465K038j397m309l265L38K826K750
$$ plain form
896 2799 3378 1185 -2441 -4976 -4947 -2861 -834 -1062 -3020 -3432 -1005 1763 1516 -1556 -3875 -2389 2304
913 2304 6350 6646 3815 545 -985 -105 2153 3376 2245 -67 -1150 9 1514 414 -3613 -6822
929 -6822 -5473 -753 2702 1826 -2109 -5181 -4815 -1779 1045 2064 1738 1106 1482 3081 4345 3242
945 3242 238 -1717 -293 3673 6133 4084 -992 -4501 -4146 -1660 47 -354 -1927 -2731 -2230 -1260
961 -1260 -964 -1730 -3125 -3638 -1435 2675 5395 4263 448 -2380 -1357 2275 4782 4070 1879 598
977 598 840 1365 911 -973 -3026 -3488 -1903 765 2227 416 -3768 -6480 -4919 -603 2460 1963 -457
994 -457 -1557 25 2161 2147 326 -983 -183 2470 5018 5304 2577 -1316 -3358 -2002 1407 3328
1010 3328 1581 -1986 -3607 -2405 -759 -1165 -3377 -4591 -2884 599 2896 2279 -217 -2483 -2675 -163
$$ packed form
896B799N79k193l626k535K9K086K027k28j958m12K427K768k47l072k319J486M693
913B304M046K96k831l270j530Q80K258J223j131k312j083J159J505j100m027l209
929f822J349M720L455q76l935l072L66L036K824J019l26o32L76J599J264j103
945C242l004j955J424L966K460k049n076l509L55K486J707m01j573q04N01R70
961a260K96p66j395n13K203M110K720j132l815k828J023L632K507p12k191j281
977E98K42N25m54j884k053m62J585K668J462j811m184k712J561M316L063m97k420
994d57j100J582K136j4j821j309Q00K653K548K86k727l893k042J356L409J921
1010C328j747l567j621J202J646m06k212j214J707L483K297o17k496k266j92K512
$$ plain form
1026 -163 3312 5057 3995 1458 -67 748 2425 2102 -305 -2005 -991 1432 2505 653 -2965 -5460
1042 -5460 -5114 -2628 203 1561 607 -1610 -2567 -1190 1036 1739 537 -650 466 3493 5137 3364
1058 3364 -413 -2677 -1773 1275 3602 3332 887 -1795 -2861 -2062 -619 -514 -2091 -3349 -2131 686
1074 686 2171 349 -3176 -4719 -2380 1922 4340 3491 1103 -539 -251 1290 2446 2045 816 177
1090 177 897 2434 2655 89 -3538 -5012 -2946 598 2247 584 -2418 -3816 -2808 -967 -14 -149
1106 -149 -535 -230 1187 2755 3029 1360 -952 -1664 457 3852 5197 3076 -589 -2566 -1821 -16
1122 -16 605 -504 -1843 -1853 -741 147 -275 -2031 -3954 -3945 -1284 2221 3646 1893 -1291 -2548 -566
1139 -566 2423 3449 2165 683 865 2280 3022 1603 -1145 -2937 -2401 -75 2198 2215 -425 -3661
$$ packed form
1026a63L475J745j062k537j525Q15J677l23k407j700J014K423J073j852l618k495
1042e460L46K486K831J358r54k217r57J377K226P03j202j187J116L027J644j773
1058C364l777k264R04L048K327k70k445k682j066P99J443J05j577j258J218K817
1074F86J485j822l525j543K339M302K418q49k388j642K88J541J156m01j229o39
1090A77P20J537K21k566l627j474K066L544J649j663l002j398J008J841R53j35
1106a49l86L05J417J568K74j669k312p12K121L395J345k121l665j977P45J805
1122a6O21j109j339j0J112Q88m22j756j923RK661L505J425j753l184j257J982
1139e66K989J026j284j482J82J415P42j419k748j792N36K326K273J7k640l236
$$ plain form
1155 -3661 -4599 -2719 -74 779 -540 -1887 -1215 925 1943 739 -1255 -1787 -17 2861 4581 3855
1171 3855 1331 -1182 -1839 -373 1750 2230 591 -1212 -1332 -114 433 -969 -3272 -3954 -2059 680
1187 680 2023 989 -1387 -3141 -2708 -388 2078 2918 1935 479 429 1887 2792 1556 -767 -1558 179
1204 179 2784 3492 1270 -2220 -4000 -3247 -1120 559 456 -1109 -2370 -1962 -445 438 -315 -1793 -1891
1221 -1891 598 3698 4338 2004 -1105 -2113 -399 2245 3332 2242 439 -624 -502 148 135 -1104
1237 -1104 -2565 -2527 -649 1410 1493 -870 -3640 -4093 -1721 1207 2362 1458 -7 -458 411 1412 1437
1254 1437 642 -27 265 1778 3265 2883 330 -2536 -3210 -1269 1296 1961 93 -2269 -2892 -1863 -729
1271 -729 -638 -1403 -1828 -834 1206 2666 2265 139 -1863 -1747 880 3672 4035 1895 -584 -1222 54
$$ packed form
1155c661r38J880K645Q53j319j347O72K140J018j204j994n32J770K878J720p26
1171C855k524k513o57J466K123M80j639j803j20J218N47j402k303o82J895K739
1187F80J343j034k376j754M33K320K466Q40r83j456n0J458R05j236k323p91J737
1204A79K605P08k222l490j780P53K127J679j03j565j261M08J517Q83p53j478r8
1221a891K489L100O40k334l109j008J714K644J087j090j803j063J22O50j3j239
1237a104j461L8J878K059Q3k363k770m53K372K928J155r04j465m51Q69J001K5
1254A437p95o69K92J513J487l82k553k866o74J941K565O65j868k362o23J029J134
1271g29R1p65m25R94K040J460m01k126k002J16K627K792L63k140k479o38J276
$$ plain form
1288 54 1219 625 -1020 -1772 -813 778 1188 -246 -2722 -4091 -3141 -439 1880 2033 101 -1806 -1689
1305 -1689 196 1687 1429 231 -29 1321 3024 3161 1233 -1066 -1970 -856 1178 2485 1673 -712
1321 -712 -2757 -3028 -1753 -437 -593 -1749 -2109 -737 1012 1303 -189 -1946 -2059 2 2691 3918
1337 3918 3039 1022 -612 -472 1029 2189 1670 95 -888 -247 862 625 -1599 -3882 -3948 -1704 841
1354 841 1586 72 -2062 -2867 -1654 348 1593 1385 419 248 1456 2806 2589 614 -1186 -933 1392
1371 1392 3430 3119 581 -2032 -2799 -1793 -401 -44 -901 -1934 -1948 -983 -151 -388 -1685 -2690 -1726
1388 -1726 924 3137 3089 1057 -887 -936 846 2564 2793 1743 665 409 829 1064 154 -1479 -2576
1405 -2576 -2023 -158 1310 740 -1728 -3804 -3607 -1495 538 962 -84 -883 -334 1060 1803 1259 137
$$ packed form
1288E4J165n94j645p52R59J591M10j434k476j369R50K702K319J53j932j907J17
1305a689J885J491k58j198k60J350J703J37j928k299r04J114K034J307q12k385
1321g12k045k71J275J316j56j156l60J372J749K91j492j757j13K061K689J227
1337C918q79k017j634J40J501J160n19j575r83O41J109k37k224k283o6K244K545
1354H41P45j514k134q05J213K002J245k08r66j71J208J350k17j975j800K53K325
1371A392K038l11k538k613p67J006J392L57q57j033j4R65Q32k37j297j005R64
1388a726K650K213m8k032j944m9J782J718K29j050j078k56M20K35r10j633j097
1405b576N53J865J468n70k468k076J97K112K033M24j046p99N49J394P43n44j122
$$ plain form
1422 137 -220 914 2919 3934 2754 33 -2031 -1886 78 1662 1166 -800 -2136 -1810 -777 -542
1438 -542 -1620 -2864 -2763 -1012 1059 1802 730 -1118 -1948 -681 1776 3442 3070 1462 337 705
1454 705 1663 1621 172 -1237 -1232 72 1306 1058 -795 -2923 -3563 -2405 -430 831 438 -1028 -1856 -1080
1472 -1080 282 927 246 -542 -109 1698 3220 2931 1049 -822 -1205 169 1992 2571 1372 -588 -1744
1489 -1744 -1424 -481 -261 -1357 -2501 -2177 -430 930 548 -1357 -2865 -2312 52 2203 2705 1609 166
1506 166 -161 752 1860 1906 864 -23 228 1462 2184 996 -1521 -3239 -2737 -818 695 399 -1221
1523 -1221 -2541 -2369 -1137 0 245 -188 -400 462 1906 2593 1710 -136 -1169 -302 1803 3121 2434
1540 2434 436 -1109 -1229 -322 370 -30 -1071 -1581 -1178 -256 120 -834 -2426 -3039 -1721 642 2183
$$ packed form
1422A37l57J134K005J015j180k721k064J45J964J584m96j966j336L26J033K35
1438e42j078j244J01J751K071P43j072j848q30J267K457J666l72j608j125L68
1454G05R58m2j449j409NJ304J234k48j853k128o40J158J975J261l93j466q28P76
1472a080J362O45o81p88M33J807J522k89j882j871l83J374J823N79j199j960j156
1489a744L20R43K20j096j144L24J747J360l82j905j508N53K364K151N02j096j443
1506A66l27R13J108M6j042q87K51J234P22j188k517j718N02J919J513k96j620
1523a221j320J72J232J137K45m33k12Q62J444O87q83j846j033Q67K105J318o87
1540B434j998j545j20R07O92m00j041n10M03R22L76r54j592o13J318K363J541
$$ plain form
1557 2183 1758 -4 -1192 -571 1084 2067 1729 798 375 1084 1981 1819 366 -1386 -1916 -812 983
1574 983 1624 345 -1934 -3102 -2386 -795 97 -412 -1351 -1241 41 1172 1096 -35 -1028 -633 1167 2936
1592 2936 3249 1858 -88 -997 -347 1044 1446 418 -824 -1124 -415 144 -391 -1805 -2788 -2150 -451
1609 -451 1022 1117 -233 -1707 -1960 -714 998 1807 1368 450 417 1354 2141 1605 161 -859 -392 1094
1627 1094 2032 1317 -715 -2423 -2662 -1508 -40 334 -544 -1524 -1405 -399 469 169 -962 -1494 -330
1644 -330 1697 2795 2043 202 -1060 -628 953 2157 1941 711 -408 -525 107 415 -403 -1745 -2189
1661 -2189 -1202 444 1096 49 -1798 -2652 -1674 163 1382 1214 277 -337 61 933 1275 749 -124 -294
1679 -294 705 2017 2213 848 -1106 -1994 -1217 379 1138 389 -1024 -1824 -1478 -653 -317 -789 -1428 -1166
$$ packed form
1557B183m25j762j188O21J655R83l38r31m23P09Q97j62j453j752n30J104J795
1574I83O41j279k279j168P16J591Q92n09r39J10J282J131p6j131r93L95J800J769
1592B936L13j391j946r09O50J391M02j028j242l00P09N59n35j414r83O38J699
1609d51J473R5j350j474k53J246J712Q09m39r18l3R37P87n36j444j020M67J486
1627A094R38p15k032j708k39J154J468L74q78r80J19J006Q68l00j131n32J164
1644c30K027J098p52j841j262M32J581J204k16j230j119j17O32L08q18j342m44
1661b189R87J646O52j047j847q54R78J837J219j68r37o14L98Q72L42n26q73j70
1679b94R99J312J96j365j954q88P77J596P59p49j413q00L46Q25L36m72o39K62
$$ plain form
1697 -1166 122 1552 1873 779 -773 -1165 140 1971 2671 1718 148 -656 -175 619 631 -322 -1221 -1070
1715 -1070 -25 859 515 -1015 -2533 -2566 -1079 693 1315 404 -925 -1105 -46 1122 1265 526 -23
1732 -23 463 1623 2208 1373 -280 -1485 -1334 -24 1265 1262 -84 -1501 -1808 -1013 -77 -33 -845 -1302 -708
1751 -708 489 1089 416 -849 -1494 -739 950 2238 2151 922 -362 -538 333 1157 981 -4 -715 -427
1769 -427 449 731 -286 -1814 -2383 -1513 188 1251 833 -583 -1553 -1259 -32 919 836 56 -331 300
1787 300 1368 1627 600 -721 -1099 32 1634 2163 1058 -645 -1613 -1314 -253 323 -129 -1019 -1301
1804 -1301 -619 266 430 -496 -1517 -1441 13 1598 2030 972 -490 -1026 -247 957 1433 948 153 -57
1822 -57 396 985 715 -440 -1463 -1472 -356 829 890 -442 -1929 -2186 -1166 243 822 402 -296 -284 532
$$ packed form
1697a166J288J430L21j094j552l92J305J831P00r53j570q04M81P94J2r53q99J51
1715a070J045Q84l44j530j518l3J487J772O22r11j329j80J059J168J43p39n49
1732b3M86J160N85q35j653j205J51J310J289lj346j417l07P95R36M4q12m57N94
1751g08J197O00o73j265o45P55J689J288q7j229j284j76Q71Q24j76r85p11K88
1769d27Q76K82j017j528n69Q70J701J063m18j416r70K94J227R51q3p80l87O31
1787C00J068K59j027j321l78J131J602N29j105j703r68K99J061N76m52q90k82
1804a301O82Q85J64r26j021P6J454J585M32j058j462n36P79J204M76m85p95k10
1822e7M53N89k70j155j023rJ116J185O1j332j487k57J020J409N79m20o98J2Q16
$$ plain form
1841 532 1219 1021 78 -662 -400 874 1960 1700 205 -1264 -1509 -429 843 976 32 -926 -987 -270
1859 -270 228 -171 -1153 -1663 -962 459 1428 1082 -260 -1332 -1016 399 1605 1592 649 -226 -159 594 958
1878 958 318 -701 -1075 -358 827 1300 494 -989 -1880 -1522 -270 742 571 -411 -1146 -858 14 529
1896 529 159 -539 -583 390 1656 1978 1112 -242 -1000 -438 751 1467 973 -257 -1105 -963 -203 128 -411
1915 -411 -1238 -1327 -348 798 1025 8 -1300 -1621 -596 872 1598 1119 50 -469 19 886 1110 469
1933 469 -367 -456 404 1232 972 -400 -1720 -1874 -738 565 918 112 -939 -1222 -567 292 501 -59 -627
1952 -627 -380 606 1377 1089 -128 -1105 -915 342 1532 1621 611 -519 -774 -147 447 416 -334 -916 -717
1971 -717 91 604 181 -1001 -1827 -1408 -20 1169 1237 184 -793 -761 108 965 964 298 -177 146 969 1323
$$ packed form
1841E32O87j98r43p40K62J274J086k60j495j469k45J080J272J33r44r58o1P17
1859b70M98l99r82n10P01J421R69l46j342j072L16J415J206j3r43q75O7P53L64
1878I58o40j019l74P17J185M73q06j483q91L58J252J012j71r82p35K88Q72N15
1896E29l70o98m4R73J266L22q66j354p58N62J189P16m94j230q48J42P60L31n39
1915d11q27q9R79J146K27j017j308l21J025J468P26m79j069n19M88Q67K24o41
1933D69q36q9Q60Q28k60j372j320j54J136J303L53q06j051k83O55Q59K09n60n68
1952f27K47R86P71k88j217r77J90J257J190Q9j010j130k55O27N94l1p50n82J99
1971g17Q08N13m23j182q26M19J388J189O8j053r77L2Q69Q57jo66m75L23Q23L54
$$ plain form
1991 1323 704 -504 -1274 -863 419 1272 798 -562 -1619 -1474 -536 269 74 -614 -902 -309 645 1028
2009 1028 385 -640 -954 -104 1227 1846 1230 -77 -908 -637 325 874 468 -347 -671 -164 503 556 -308
2028 -308 -1333 -1454 -564 635 1015 316 -881 -1404 -808 293 925 659 -34 -218 392 1106 1102 254 -636
2047 -636 -653 272 1289 1323 305 -996 -1479 -887 70 457 -27 -847 -1011 -361 307 332 -462 -1139 -828 388
2067 388 1476 1455 425 -629 -782 140 1114 1340 632 -202 -428 135 575 262 -733 -1387 -1044 38 833
2086 833 517 -651 -1570 -1377 -293 735 877 186 -419 -288 417 906 616 -110 -501 -21 1037 1563 985
2105 985 -279 -1160 -978 -1 718 504 -406 -1090 -935 -357 99 -184 -879 -1007 -286 814 1323 817 -289
2124 -289 -894 -415 714 1470 1118 155 -509 -315 345 641 131 -642 -851 -245 596 833 -8 -1195 -1636
$$ packed form
1991A323o19j208p70M11J282Q53m74j360j057J45R38Q05j95o88k88N93R54L83
2009A028o43j025l14Q50J331O19o16j307q31K71R62N49m06q15l24N07O67N3q64
2028c08j025j21Q90J199L80o99j197n23N96J101O32k66o93j84O10P14mq48q90
2047f36j7R25J017L4j018j301m83N92R57L87m84q20j64O50O68K5p94o77L11J216
2067C88J088k1j030j054j53R22R74K26p08q34k26N63M40l13r95o54L43J082P95
2086H33l16j168r19J93J084J028J42o91o05J31P05M89k90p26l91M80J058N26n78
2105I85j264q81J82R77P19k14r10o84J55N78M56k83o95j28P21J100N09n06j106
2124b89o05M79J129P56l52r63o64J94O60K96n10p73k09O06Q41K37q41j187m41
$$ plain form
2143 -1636 -974 220 861 455 -495 -922 -383 424 771 326 -262 -248 553 1368 1294 347 -733 -972 -220 839
2163 839 1116 391 -615 -1009 -595 80 190 -451 -1014 -891 -127 571 467 -371 -1184 -1003 60 1140 1415
2182 1415 834 -32 -263 289 895 925 287 -398 -386 213 680 320 -746 -1498 -1299 -320 636 686 -142 -977
2202 -977 -1044 -343 396 526 -14 -449 -176 659 1215 859 -63 -707 -307 756 1463 1140 81 -833 -899 -235
2222 -235 308 111 -566 -1001 -624 120 478 11 -886 -1260 -611 511 1123 774 -174 -809 -465 387 986 802
2242 802 199 -98 221 858 981 311 -641 -1005 -484 417 736 97 -965 -1466 -1046 -146 388 156 -422 -564
2262 -564 -45 600 774 201 -495 -562 174 1130 1379 691 -337 -771 -263 566 883 355 -404 -681 -276 226
2282 226 138 -567 -1251 -1171 -265 657 774 24 -795 -903 -87 807 1092 608 -102 -189 381 901 675 -86 -647
$$ packed form
2143a636O62J194O41m06r50m27N39Q07L47m45n88J4Q01Q15p4r47j080k39P52J059
2163H39K77p25j006l94M14O75J10o41n63J23P64O98j04q38q13J81J063J080K75
2182A415n81q66k31N52O06L0o38o85J2N99M67l60j066p52J99R79R56N0q28q35
2202i77o7P01P39J30n40m35K73Q35N56l56r22o44M00J063P07l23j059r14o6O64
2222b35N43j97o77m35L77P44L58m67q97l74O49J122O12l49r48o35L44Q52N99j84
2242H02o03k97L19O37J23o70r52l64N21R01L19o39j062n01M20R00N34k32n78j42
2262e64N19O45J74n73o96o7P36R56K49o88j028m34N08Q29L17n28p59k77M05N02
2282B26q8p05o84Q0R06R22J17p50q19j08Q16Q94K85m84p10q7N70N20k26p61n61
$$ plain form
2303 -647 -450 374 960 771 -209 -1090 -1162 -489 288 328 -293 -881 -825 -163 395 315 -269 -579 -136 793 1374
2324 1374 1108 168 -582 -513 256 875 759 29 -613 -577 -54 322 61 -619 -937 -524 285 740 326 -603
2344 -603 -1166 -800 146 847 731 100 -402 -179 452 823 520 -155 -451 -17 738 962 333 -653 -1121 -677
2364 -677 207 707 344 -427 -862 -585 39 295 -42 -626 -683 -60 709 918 307 -493 -676 -36 898 1237
2384 1237 735 -34 -432 -154 341 445 -100 -693 -773 -247 339 325 -356 -1098 -1124 -376 519 830 345 -393 -557
2405 -557 -71 587 721 286 -190 -111 434 973 822 18 -712 -752 -24 696 681 -72 -881 -1031 -510 124 199
2426 199 -309 -682 -476 195 691 496 -241 -782 -510 372 1081 999 220 -435 -404 207 716 589 2 -405 -281
2447 -281 251 511 81 -764 -1165 -782 21 561 352 -384 -907 -660 40 638 509 41 -220 91 713 972
$$ packed form
2303f47J97Q24N86j89r80q81p2O73P77M0o21n88N6O62N58q0n84l10M43R29N81
2324A374k66r40p50O9P69O19j16p30o42L6N23L76k61o80l18M13Q09M55m14r29
2344f03n63L66R46P01j16o31n02K23O31L71l03o75k96M34P55K24o29r86m68M44
2364f77Q84N00l63p71m35K77O24K56l37n84n7O23P69K09o11q00j83O40R34L39
2384A237n02p69l98K78M95J04n45n93q0N26N86j4o81p42k6P48Q95L11m85p38j64
2405e57M86O58J34m35m76P9N45N39j51q04p30m0P28P20j5p53q09j50N21O34P5
2426A99n08l73K06O71M96j95p37n41K72Q82P09q2p79o55L1O11N09j27n87m07J24
2447b81N32K60m30q45m01L83Q03N40k09p36n23K47P00N98j29m68k61L11O22K59
$$ plain form
2467 972 513 -219 -535 -144 606 941 483 -366 -928 -750 -109 285 39 -521 -775 -435 184 383 -19 -662
2487 -662 -750 -151 704 1073 581 -201 -552 -166 563 883 513 -86 -343 23 473 496 -108 -767 -853 -230 493
2508 493 601 -58 -842 -1040 -508 210 500 137 -362 -398 70 577 604 118 -386 -296 418 1012 957 224 -548
2529 -548 -669 -144 450 495 -26 -588 -665 -250 182 103 -460 -838 -611 135 732 642 -49 -627 -518 124 799
2550 799 843 294 -224 -251 216 598 384 -209 -585 -368 292 684 384 -412 -1007 -846 -169 406 320 -250 -706
2571 -706 -557 74 472 328 -174 -387 6 690 1021 640 -160 -631 -361 354 767 516 -178 -616 -463 42
2591 42 292 -51 -609 -784 -356 316 505 69 -601 -805 -344 463 884 596 -16 -325 -59 444 623 265
2611 265 -260 -460 -6 514 587 9 -682 -864 -373 311 587 163 -481 -741 -381 152 344 -21 -445 -443 88
$$ packed form
2467I72m59p32l16L91P50L35m58q49n62J78O41L94k46n60k54L40O19J99m02o43
2487f62q8N99Q55L69m92p82l51L86P29L20l70n99k57L66M50K3o04o59q6O23P23
2508D93J08o59p84j98N32P18K90l63m99l6M68N07K7m86n04R0P14N94n5p33p72
2529e48j21N25N94M5n21n62p7M15M32p9n63l78K27P46N97r0o91n78J09O42O75
2550G99M4n49n18k7M67L82k14n93l76K17O60L92l00p96n95J61O77N75q6n70m56
2571g06J49O31L98j44n02k13L93O84L31l81q00m71K70P15M13k51o94m38J53N05
2591D2K50l43n58j75M28O72J89m36o70k04M61Q07M21k88o12l09K66N03J79l58
2611B65n25k00M54N20P3n78o91j82M91O84K76m24o44k60L60N33J92l65m24KN31
$$ plain form
2632 88 662 711 146 -466 -460 166 822 946 378 -327 -540 -168 300 280 -207 -674 -655 -154 298 252 -363 -846
2654 -846 -715 -29 674 708 140 -423 -385 109 609 614 211 -186 -82 411 730 489 -221 -711 -617 -11 460 307
2676 307 -334 -884 -767 -223 267 261 -179 -426 -222 336 639 390 -193 -536 -248 428 887 660 -20 -473 -357
2697 -357 187 549 366 -202 -538 -342 110 295 -75 -675 -912 -483 230 588 312 -321 -644 -314 349 690
2717 690 493 -21 -223 73 551 650 201 -366 -496 -88 498 646 185 -552 -844 -525 40 284 -29 -492
2737 -492 -613 -238 241 369 -17 -418 -388 193 778 914 403 -257 -399 13 490 587 195 -340 -466 -139 262
2758 262 247 -249 -672 -617 -93 389 390 -153 -694 -732 -160 419 572 203 -208 -192 228 630 565 76 -337 -226
2780 -226 285 672 474 -173 -739 -716 -144 342 312 -155 -600 -527 -109 268 174 -296 -552 -282 338 707 526
$$ packed form
2632H8N74M9n65o12OO26O56J24n68p05k13L72M68k0m87m67J9N01M52m6o15m83
2654h46J31O86P03L4n68n63L8M94N00Nm03l97J04M93L19k41p10m90R4O06M71j53
2676C07o41n50J17N44M90om40k47K04N58L03k49n83l43K88O76M59k27o80m53J16
2697c57N44L62j83n68l36J96M52J85l70o00k37M29P13L58k76o33l23L30O63L41
2717F90j97n14k02K96M78R9m49n67j30M08N86J48m61p37k92L19N65K44l13m63
2737d92j21L75M79J28l86m01L0N81N85J36n11o60j42M12M77R7l92n35j26L27M01
2758B62j5m96m23N5N24M82Jn43n41l8N72N79J53l69m11J6M20M02o5m89m13J11
2780b26N11L87j98o47n66K3N72M86l0m67m45P3M18L77r4m70k56K70O20L69j81
$$ plain form
2801 526 -39 -478 -239 389 788 652 66 -340 -250 126 324 52 -407 -688 -425 110 352 44 -532 -794
2821 -794 -493 169 564 402 -126 -369 -136 325 560 343 -116 -296 81 573 718 271 -340 -620 -293 283
2841 283 467 129 -419 -708 -476 29 206 -95 -462 -522 -72 460 593 148 -338 -429 28 601 788 401 -150
2862 -150 -331 -44 403 453 39 -406 -452 -51 313 229 -265 -764 -756 -253 290 411 -16 -476 -473 -60 438 500 146
2885 146 -189 -94 363 695 543 3 -412 -362 142 594 443 -40 -555 -590 -190 145 143 -296 -651 -488 -8 351
2907 351 198 -281 -558 -316 278 728 623 107 -292 -203 263 558 454 7 -330 -191 229 392 122 -408
2927 -408 -689 -450 128 423 201 -361 -663 -473 70 412 259 -131 -318 -34 400 581 273 -231 -410 -50
2947 -50 474 679 349 -234 -538 -323 172 347 75 -386 -551 -269 136 258 -92 -476 -515 -101 435 595 238
$$ packed form
2801E26n65m39K39O28L99j36n86m06R0L76J98k72m59k81K63N35K42l08n76k62
2821g94L01O62L95j62n28k43K33M61K35k17m59j80L77M92J45m47o11k80L27N76
2841B83J84l38n48k89K32N05J77l01l67o0M50N32J33m45m86r1M57N73J87l87n51
2862a50j81K87M47N0m14m45m6M01L64q4m94m99QN03N43J21m27m60LM13M98O2l54
2885A46l35R5M57L32j52n40m15N0N04M52j51m83n15l5M00L35km39l55J63M80L59
2907C51j53m79k77K42N94M50j05n16l99Q9M66K95j04m47l37J39M20J63k70n30
2927d08k81K39N78K95k22n62l02J90N43L42j53l90j87K84M34J81l08n04j79L60
2947e0N24K05l30n83l04K15M95J75k72m61j65K82M05J22l50l84l9M14N36J60l57
$$ plain form
2968 238 -282 -425 -59 405 582 284 -129 -252 60 371 360 -18 -462 -504 -105 355 345 -100 -567 -649 -243
2989 -243 231 357 52 -325 -319 20 424 394 33 -308 -209 253 636 568 74 -429 -420 -17 398 359 -62 -424 -442
3012 -442 -65 222 123 -239 -535 -377 121 490 299 -153 -491 -337 129 531 487 107 -219 -168 219 462 284
3033 284 -179 -426 -258 198 408 192 -354 -644 -462 16 348 259 -173 -434 -301 96 350 202 -196 -322
3053 -322 -47 404 611 340 -172 -413 -155 299 523 267 -166 -483 -281 76 215 -42 -378 -493 -206 231
3073 231 385 22 -412 -526 -181 345 522 295 -149 -299 -46 353 454 195 -197 -268 33 395 397 4 -439
3094 -439 -522 -181 269 361 51 -386 -474 -175 236 260 1 -297 -268 84 436 396 -5 -377 -345 65 472 482 103
3117 103 -299 -341 3 309 316 -50 -359 -294 34 310 214 -221 -524 -447 -3 411 399 6 -323 -280 101 426 352
$$ packed form
2968B38n20j43L66M64J77k98m13j23L12L11j1l78m44m2L99M60j0m45m67q2M06
2989b43M74J26l05l77OL39M04l0l61l41R9M62L83o8m94n03RM03M15l9m21l62j8
3012d42L77K87r9l62k96J58M98L69j91m52l38J54M66M02m4l80l26N1L87K43j78
3033B84m63k47J68M56K10k16n46k90J82M78L32q9m32k61J33L97K54j48l98j26
3053c22K75M51K07k71n12k41K58M54K24k56m33l17K02L57J39k57l36j15K87M37
3073B31J54l63m34j14L45N26J77k27m44j50K53L99J01k59l92p1L01L62Kl93m43
3094d39q3L41M50R2l10m37q8K99M11K4k59k98K9L52L52m0m01l72L2M10M07J0l79
3117A03m02m2L44L06Pl66l09O5L28K76r6m35l03P7M44M14j2l93l29M3L81L25p4
$$ plain form
3140 352 1 -271 -177 199 430 262 -167 -463 -278 155 437 277 -143 -496 -375 0 263 141 -172 -371
3160 -371 -184 166 381 184 -220 -395 -160 305 500 312 -159 -407 -246 126 364 196 -126 -317 -124 222
3180 222 325 85 -298 -438 -126 278 422 182 -256 -453 -234 175 359 137 -182 -285 -43 267 357 71
3200 71 -303 -373 -42 337 434 130 -299 -440 -198 233 348 104 -268 -322 -58 263 281 4 -348 -350 25 407
3222 407 435 73 -306 -351 -63 330 417 78 -270 -315 -26 261 213 -132 -411 -331 27 394 314 -54 -386 -356 -4
3245 -4 324 336 52 -269 -245 65 305 234 -105 -331 -205 167 398 303 -104 -405 -355 20 327 278 -79 -332 -266
3268 -266 70 286 138 -141 -372 -178 193 404 214 -178 -416 -260 158 392 273 -71 -279 -186 133 329
3288 329 148 -194 -336 -152 209 332 108 -280 -482 -235 175 353 210 -153 -321 -166 163 306 145 -177
$$ packed form
3140C52l51k72R4L76K31j68m29k96J85M33K82j60m20l53J21L75K63j22l13j99
3160c71J87L50K15j97m04j75K35M65J95j88m71k48J61L72K38j68l22j91J93L46
3180B22J03k40l83j40L12M04J44k40m38j97K19M09J84k22l19j03K42L10R0k86
3200G1l74p0L31L79R7l04m29j41K42M31J15k44l72n4K64L21J8k77l52kL75L82
3222D07K8l62l79m5K88L93Q7l39l48m5K89K87m8l45k79Q0L58L67q0l68l32L0L52
3245dL28J2k84l21K4L10K40p1l39k26J26L72K31r5m07l01N0L75L07m9l57k53O6
3268b66L36K16j48k79k31J94L71K11j90l92k38J56M18K34j19l44k08R3L19J96
3288C29j81l42j42J84L61J23k24l88k02K47M10J78j43l63j68J55L29J43j61l22
$$ plain form
3308 -177 -243 -15 344 387 146 -247 -329 -103 262 365 139 -187 -382 -151 118 225 6 -275 -330 -58 272
3329 272 292 7 -312 -361 -52 307 370 138 -220 -267 -5 272 303 63 -193 -238 45 325 283 -33 -328 -371 -23
3352 -23 285 312 17 -337 -332 -59 183 236 -42 -289 -209 41 310 241 -48 -301 -260 109 382 346 24 -290 -250
3375 -250 8 287 204 -81 -290 -227 61 253 110 -205 -430 -275 99 362 275 -90 -318 -222 86 319 251 -33
3397 -33 -218 -102 176 333 167 -183 -345 -195 184 345 164 -219 -392 -259 59 237 122 -171 -279 -119
3417 -119 163 290 106 -222 -289 -59 250 405 180 -137 -315 -146 197 330 142 -148 -289 -102 208 215 11
3438 11 -292 -337 -87 233 299 69 -232 -376 -126 186 303 100 -172 -251 -24 219 283 33 -232 -272 26 305
3460 305 312 36 -307 -317 -98 218 244 2 -220 -269 -7 230 231 -66 -279 -193 65 330 303 1 -248 -235 18
$$ packed form
3308a77o6K28L59M3k41l93q2K26L65J03k26l26j95K31K69J07k19k81n5K72L30
3329B72K0k85l19m9L09L59O3k32l58m7K62K77L1k40k56m5K83K80m2l16k95m3L48
3352b3L08K7k95l54NK73K42N3k78k47Q0K50K69o9k89k53M1L69K73l6l22l14M0
3375b50K58K79q3k85k09O3K88J92j43l15k25J55L74K63q7l65k28R6L08K33o8k84
3397c3j85J16K78J57j66l50j62J50L79J61j81l83j73J33L18J78j15k93j08J60
3417a19K82J27j84l28o7K30L09J55k25l17j78J69L43J33j88k90j41J87L10Pk04
3438A1l03m5K50L20O6k30l01j44K50L12J17k03k72p9K27K43O4k50k65m0K98K79
3460C05Pk76l43j0K19L16K6k42k22m9K62K37Jk97k13Q6K58K65k7l02k49J3K53
$$ plain form
3483 18 291 279 5 -200 -233 36 233 112 -102 -299 -223 72 297 205 -113 -346 -265 63 308 251 -8 -203
3505 -203 -160 103 292 205 -74 -212 -126 174 319 187 -122 -354 -240 82 276 179 -117 -321 -214 53 188
3526 188 107 -172 -281 -126 183 330 134 -145 -263 -130 223 356 206 -72 -249 -119 140 233 54 -207 -256
3547 -256 -88 170 222 5 -272 -345 -148 176 297 92 -164 -260 -65 176 275 106 -140 -179 61 283 291 25
3569 25 -238 -290 -58 217 258 42 -258 -300 -115 130 183 -41 -240 -227 15 236 206 -45 -244 -212 15 326 295
3592 295 74 -174 -182 43 262 260 35 -184 -171 60 229 138 -112 -344 -277 -13 216 172 -97 -285 -236 14 224
3615 224 160 -32 -175 -140 151 262 180 -69 -233 -140 155 323 196 -95 -282 -222 20 185 107 -143 -256 -139
3637 -139 57 209 70 -162 -248 -122 179 342 184 -89 -220 -127 146 268 141 -59 -212 -69 149 214 46
$$ packed form
3483A8K73j2k74k05l3K69J97j21k14j97P6K95K25r2l18k33Q1L28K45n7k59j95
3505b03M3K63J89q7k79j38Q6L00J45j32l09k32J14L22J94r7k96k04J07K67J35
3526A88q1k79j09J55L09J47j96k79j18J33L53J33j50k78j77J30K59R3j79k61m9
3547b56J68K58N2k17k77p3J97L24J21k05k56r6J95K41R9j69k46l9K40K22Qk66
3569B5k63n2K32K75M1k16l00m2J85K45N3k24j99J3K42K21l0k51j99L2K27L11l1
3592B95k21k48qK25K19kk25k19J3K31J69r1k50k32O7K64K29m4k69j88M9K50K10
3615B24o4j92j43L5K91J11q2k49j64R3K95J68j27k91j87O0K42J65p8k50j13J17
3637a39J96J52j39k32q6J26L01J63j58k73j31R3K73J22j27k00j53J43K18O5j68
$$ plain form
3658 46 -186 -278 -113 158 224 57 -239 -312 -170 121 195 82 -145 -177 -20 190 256 80 -161 -182 17 221 300
3681 300 84 -183 -250 -70 137 232 37 -177 -228 -47 134 150 -58 -240 -237 -10 208 227 20 -202 -214 21 235
3704 235 290 90 -132 -132 35 165 148 -56 -246 -218 2 182 146 -59 -294 -237 -23 211 198 8 -196 -155 45
3727 45 209 160 -43 -167 -97 143 305 226 -53 -223 -133 47 229 157 -73 -252 -192 26 162 60 -137 -240
3749 -240 -129 73 237 109 -121 -240 -151 117 246 176 -62 -171 -51 119 232 142 -65 -168 -66 140 228
3770 228 61 -192 -317 -164 74 170 54 -140 -267 -124 125 204 72 -129 -163 -10 197 248 93 -137 -187 -37
3792 -37 174 265 71 -132 -230 -94 100 157 -1 -197 -229 -71 136 158 -13 -224 -234 -24 219 256 105 -106 -136
3815 -136 6 200 219 41 -121 -135 24 211 166 -60 -250 -238 -24 159 156 -16 -199 -235 -80 100 128 -22 -171
$$ packed form
3658D6k32r2J65K71O6j67k96p3J42K91P4j13k27l2J57K10O6j76k41k1J99K04P9
3681C00k16k67o7J80K07R5j95k14n1J81J81J6k08j82LK27K18J9k07k22j2K35K14
3704B35N5k00k22%J67J30j7k04j90K8K20J80l6k05k35N7K14K34j3j90k04M1K00
3727D5J64m9k03j24P0K40J62p9k79j70R0J80J82p2k30j79O0K18J36j02j97j03
3749b40J11K02J64j28k30j19Q9K68J29p0k38j09J20J70J13r0k07j03J02K06Q8
3770B28j67k53j25J53K38R6j16j94j27J43K49P9j32k01l4J53K07N1j55k30n0J50
3792c7K11R1j94k03r8J36J94N7j58j96l2J58K07K2j71k11j0K10K43L7j51k11l0
3815a36J42J94J9j78j62j4J59J87m5k26j90J2K14J83lj72j83l6J55J80K8j50j49
$$ plain form
3838 -171 -147 69 200 169 0 -195 -114 100 282 225 8 -161 -166 24 166 105 -89 -197 -157 36 127 83 -128
3861 -128 -257 -158 73 193 141 -57 -210 -132 59 220 151 -15 -134 -47 102 199 80 -98 -224 -103 84 199
3883 199 86 -151 -237 -162 42 153 84 -85 -191 -64 132 177 87 -126 -173 -17 196 257 129 -71 -137 -65 91
3906 91 199 96 -109 -185 -87 100 78 -26 -201 -239 -36 146 163 12 -154 -183 -43 168 193 78 -117 -115 5
3929 5 175 174 21 -157 -167 19 190 188 32 -199 -205 -58 110 131 9 -167 -187 -22 121 113 -71 -176 -119 72 220
3954 220 198 -1 -151 -130 18 194 167 2 -135 -143 13 121 111 -72 -220 -148 41 159 90 -93 -210 -154 27
3977 27 174 148 -7 -148 -101 78 212 158 -21 -151 -64 98 211 115 -111 -219 -138 54 185 117 -78 -210 -150
4000 -150 10 108 50 -99 -188 -99 86 184 55 -99 -159 -58 158 223 124 -54 -144 -35 113 167 78 -124 -143 -43
$$ packed form
3838a71K4K16J31l1j69j95Q1K14J82n7k17j69nJ90J42o1j94j08M0J93R1m4k11
3861a28j29R9K31J20n2j98j53P8J91J61o9j66j19Q7J49R7j19j78j26J21J87J15
3883A99j13k37q6P5K04J11o9j69j06J27J96M5r0k13m7J56K13O1j28k00o6P2J56
3906I1J08j03k05p6R8J87k2j04j75l8K03J82J7j51j66k9J40K11K5j15j95KJ20
3929EJ70jj53j78j0J86J71kj56k31oJ47J68K1j22j76k0J65J43qj84j05N7J91J48
3954B20k2j99j50K1J48J76k7j65j37qJ56J08j0j83j48P2J89J18o9j83j17N6J81
3977B7J47k6j55j41M7J79J34n4j79j30Q7J62J13r6k26j08Q1J92J31o8j95j32O0
4000a50J60R8n8j49q9Q9J85R8j29j54o0J01K16O5r9j78r0J09J48N4q9k02j9J00
$$ plain form
4024 -43 137 140 13 -178 -221 -79 98 138 44 -106 -153 -42 101 148 53 -103 -137 36 183 191 23 -142 -151 -32 147
4049 147 174 25 -134 -181 -52 76 120 -2 -157 -146 17 148 163 -38 -161 -128 30 188 167 20 -144 -137 -8
4072 -8 132 132 -30 -138 -112 39 139 98 -60 -190 -145 12 151 115 -73 -213 -155 -10 136 116 -34 -138 -63 91
4096 91 188 124 -47 -114 -69 71 166 127 -47 -178 -119 40 155 82 -84 -153 -88 61 130 46 -91 -160 -56 130 198
4121 198 113 -65 -159 -63 82 172 118 -74 -151 -98 68 117 31 -123 -164 -89 110 123 32 -101 -166 -82 92 162 68 -80
4147 -80 -148 -23 112 153 36 -109 -116 -11 159 149 43 -112 -177 -46 86 134 -12 -142 -151 -53 48 88 -17 -155
4171 -155 -131 -3 144 130 12 -128 -145 21 162 163 68 -100 -96 32 110 102 5 -146 -163 19 132 105 -60 -181 -177
4196 -177 -20 102 110 -15 -132 -67 -5 138 109 -11 -106 -62 55 157 139 -52 -167 -105 25 125 111 -36 -145
$$ packed form
4024d3J80Lj27j91m3J42J77M0r4j50m7J11J43M7r5j56l4J73J47Qj68j65rJ19J79
4049A47K7j49j59m7J29J28M4j22j55J1J63J31J5k01j23L3J58J58k1j47j64PJ29
4072hJ40%j62j08K6J51J00m1j58j30M5J57J39l6j88j40N8J45J46k0j50j04P5J54
4096I1R7o4j71o7M5J40R5l9j74j31N9J59J15p3j66o9O5J49O9q4j37o9J04J86O8
4121A98q5j78r4R6J45R0n4j92p7N3J66M9q6j54m1P5J99J3r1j33o5Q4J74P0r4j48
4147h0o8J25J35M1j17j45pJ05J70j0j06j55o5J31J32M8j46j30rR8J01M0j05j38
4171a55K4J28J47j4j18j40j7J66J41Jr5j68MJ28P8qr7j51j7J82J13k7j65j21M
4196a77J57J22Qj25j17O5O2J43k9j20r5M4J17J02j8j91j15O2J30J00j4j47j09
$$ plain form
4219 -145 -126 37 105 73 -72 -152 -105 46 138 79 -96 -151 -93 52 144 120 -51 -122 -53 83 155 61 -52 -103 -50 86
4245 86 131 55 -130 -165 -103 57 138 50 -94 -171 -69 41 123 49 -73 -114 -53 120 172 61 -48 -135 -27 142 193
4270 193 72 -92 -129 -24 88 124 40 -104 -122 -55 98 112 -7 -132 -147 -26 132 134 26 -90 -134 -7 116
4293 116 133 34 -92 -93 17 132 129 -6 -150 -143 15 119 109 -2 -140 -150 -20 96 127 11 -104 -97 50 141 103
4318 103 9 -88 -83 42 156 137 -4 -112 -75 42 105 91 -51 -111 -118 11 77 52 -84 -165 -108 25 146 90 -23
4343 -23 -154 -81 10 124 88 -17 -87 -39 58 126 80 -54 -136 -66 72 147 81 -64 -142 -92 39 78 49 -77 -132 -83
4369 -83 47 105 49 -58 -117 -32 81 170 88 -64 -109 -67 80 101 28 -92 -125 -64 51 85 39 -88 -125 -68 91 99
4395 99 46 -84 -137 -42 83 141 73 -61 -81 8 112 148 27 -63 -84 10 112 120 16 -92 -143 -57 71 88 34 -118
$$ packed form
4219a45J9J63O8l2j45q0M7J51R2n9j75n5N8J45R2k4j71p1O9J36P2r4j13n1N3J36
4245H6M5p6j85l5O2J60Q1q8j44p7J02J10Q2p4j22m1O1J73N2j11j09q7J08J69N1
4270A93j21j64l7J05J12L6q4j44j8O7J53J4j19j25j5J21J58Kj08j16m4J27J23
4293A16J7r9j26jJ10J15lj35j44PJ58J04j0j11j38j0J30J16L1j16j15PJ47R1l8
4318A03r4r7NJ25J14j9j41j08L7J17O3j4j42o0pJ29O6k5j36q1N7J33J21n6j13
4343b3j31P3R1J14l6j05p0M8R7O8m6j34q2P0J38P5o6j45p8N0J31L9k9j26n5M9
4369h3J30N8n6j07n9Q5J13Q9q2j52m5M2J47K1p3j20l3O1J15L4m6j27l7N7J59Q
4395I9n3j30n3R5J25N8o8j34k0Q9J04L6j21r0k1R4J02Qj04j08n1Q6J28J7n4j52
$$ plain form
4421 -118 -123 -28 41 77 -17 -125 -102 12 141 117 35 -108 -105 7 136 108 34 -73 -74 13 109 67 -38 -112 -118 24 113
4448 113 59 -66 -143 -106 17 110 84 -16 -88 -90 44 118 80 -21 -93 -55 39 114 69 -33 -128 -102 14 93 84 -44 -147
4475 -147 -104 -14 88 45 -55 -102 -41 89 141 72 -35 -111 -44 76 160 109 -30 -118 -71 73 131 61 -52 -98 -61 78
4501 78 98 21 -104 -136 -101 69 105 18 -74 -129 -53 62 144 69 -38 -77 16 122 122 27 -73 -111 -36 94 134 34 -83
4528 -83 -143 -51 56 102 17 -84 -87 -36 84 113 25 -99 -77 4 105 122 21 -78 -85 -19 67 82 -9 -67 -97 -8 90 57
4556 57 -15 -84 -93 15 105 84 -15 -128 -113 -8 85 96 -17 -89 -44 24 133 104 -20 -62 -37 63 144 85 -28 -81 -109
4583 -109 0 78 70 -75 -113 -83 4 53 54 -50 -115 -60 39 127 89 -26 -118 -67 54 120 99 -30 -77 -30 39 83 30 -54
4611 -54 -126 -36 37 74 38 -65 -112 -58 37 94 60 -33 -120 -48 55 80 49 -46 -92 -23 94 125 27 -57 -92 -62 56 102
$$ packed form
4421a18nR5O9L6r4j08K3J14J29k4q2j43LJ12J29k8p4j07jQ7R6m2j05p4oJ42Q9
4448A13n4j25p7L7J23R3k6j00p2kJ34P4l8j01p2L8R4P5m5j02r5K6J16P9rj28j03
4475a47M3R0J02m3j00m7O1J30N2o9j07p6O7J20Q4n1j39q8M7J44N8p0j13m6L7J39
4501G8K0p7j25l2L5J70L6q7r2n5P6J15Q2p5j07l9R3J06%r5j00l8P5J30M0j00j17
4528h3o0R2J07M6q5j01lN1J20K9q8j24K2Q1J01J7j01r9pO6Q6J5r1n8l0Q9R8l3
4556E7p2o9rJ08R0k1r9j13J5J05R3J1j13p2M5O8J09k9j24m2K5J00Q1n9j13n3k8
4583a09J09P8qj45l8L0Q7M9Jj04o5N5R9Q8l8j15r2N1J21O6k1j29m7M7O9M4n3q4
4611e4p2R0P3L7l6j03m7N4R5N7l4r3q7P2J03K5l1r5m6O9J17L1r8q4l5L0J18M6
$$ plain form
4639 102 37 -65 -103 -51 39 79 -13 -83 -109 -24 50 122 21 -89 -96 3 88 126 44 -35 -49 17 82 77 14 -67 -89 -7 68
4668 68 82 0 -119 -142 -26 66 83 8 -89 -102 -9 73 93 -15 -67 -59 24 106 105 1 -79 -67 1 110 84 -3 -67 -60 -3
4697 -3 86 52 -14 -86 -66 21 80 68 -12 -103 -66 -10 97 75 -6 -78 -86 25 120 75 -19 -83 -83 33 94 64 -37 -130 -77 32
4727 32 98 85 -42 -102 -60 38 99 63 -6 -74 -34 50 77 53 -25 -91 -53 61 98 67 -42 -105 -46 41 103 27 -65 -112 -49
4756 -49 44 75 38 -76 -94 -38 39 99 33 -26 -102 -23 57 70 47 -62 -96 -15 79 115 20 -58 -104 -12 86 76 28 -61 -96
4785 -96 -36 58 71 13 -108 -66 -4 56 83 3 -72 -92 -11 84 96 12 -90 -105 10 81 46 3 -58 -93 -7 36 53 -9 -105
4814 -105 -73 13 87 90 14 -77 -71 25 88 62 4 -58 -73 19 89 70 -14 -76 -52 54 95 67 -38 -98 -81 -6 59 52 -27 -107
4844 -107 -92 3 48 30 -30 -95 -57 10 111 50 -18 -92 -28 49 113 64 -23 -72 -28 37 76 27 -41 -97 -52 50 90 38 -57
$$ packed form
4639A02o5j02l8N2R0M0r2p0k6Q5P4P2j01j10pR9Q5L8q2p9j4O6O5no3q1k2Q2P5
4668F8J4q2j19k3J16R2J7p5r7j3R3Q2K0j08n2QQ3Q2jj04q0J2O8J09k6q7o4PN7
4697cQ9l4o6p2K0Q7N9j2q0r1L7N6J07k2q1p2qJ11R5m5r4o4%J16O1l0j01r3N3J09
4727C2O6j3j27o0M2R8O1l6o9o8M0Q4K7k4p8o6L8J14L7l1j09o3N9Q7O2p6r2m7O3
4756d9R3L1l7j14j8N6P7O0o6n9p6P9Q0J3k3j09l4Q1R4L6r5p8m6R2R8j0m8q9l5
4785i6O0R4J3n8j21M2O2O0K7q0p5k0Q1R5J2q4j02j5J15P1l5m3o1l5Q6M3J7o2r6
4814a05L2Q6P4Lp6r1OR6O3k6n8o2j5R2P0j9q4o2K4J06M1k8j05o0J7P5O5pp9q0
4844a07J5R5M5j8o0o5L8O7J01o1o8p4O4P7O4m9q7m9M4O5L9m9o8n6M5J02M0n2r5
$$ plain form
4873 -57 -96 -53 48 88 39 -28 -63 -30 10 77 29 -55 -74 0 66 105 39 -71 -92 -26 55 81 49 -85 -78 -22 35 85 35
4902 35 -66 -67 -2 97 74 11 -49 -70 -10 82 104 53 -52 -67 5 64 70 32 -59 -49 -11 34 67 -20 -108 -102 -53 47 69 -19
4932 -19 -82 -86 1 83 67 -19 -50 -68 21 95 71 4 -67 -56 5 108 80 -9 -75 -37 -2 73 66 -26 -103 -79 32 66 48 -19
4962 -19 -89 -38 16 66 49 -17 -100 -68 21 92 40 -11 -110 -41 30 80 48 -28 -66 -33 51 78 46 -38 -88 -82 26 62 60 -18 -74
4993 -74 -10 54 84 52 -59 -84 -31 68 86 49 -30 -96 -38 27 72 27 -68 -77 -34 26 77 -13 -70 -101 -52 56 64 43 -61 -79
5023 -79 -35 68 88 43 -28 -61 -13 69 102 35 -49 -53 16 70 97 0 -66 -105 -43 49 63 12 -56 -83 -13 60 46 -14 -75 -47
5053 -47 11 91 68 18 -72 -51 -7 77 74 28 -98 -75 -9 55 64 -53 -82 -88 -9 86 66 -32 -65 -85 13 91 76 17 -60 -43 37
5084 37 68 68 13 -66 -28 33 60 57 -33 -87 -95 49 70 50 -49 -102 -54 13 78 25 -49 -54 -22 38 78 58 -33 -61 -15 65 86 52
$$ packed form
4873e7l9M3J01M0m9o7l5L3M0O7m8q4j9P4O6L9o6j10k1O6Q1K6l2j34PN6N7N0n0
4902C5j01jO5R9k3o3o0k1O0R2K2n1j05j5P2N9Ol8r1J0L8M5L3q7q8OM9J00K2q8
4932a9o3mQ7Q2j6q6l1j8Q9P4k4o7p1J1O1J03k8q9o6L8L5P5pr2p7K4J11L4j8o7
4962a9p0N1N4N0j7o6q3L2Q9P1n2n1r9O9P1N0l2p6l8L3Q4K7l2q4n0OJ08L6kp8n6
4993g4O4O4L0l2j11k5N3R9J8l7p9o6N8O5M5m5r5rM3O0N1r0n7l1M9J08Qk1j04j8
5023g9M4J03K0m5p1l3M8Q2L3o7q4mO9N4K7r7o6l9O2R2J4n1o8k7P0P3j4o0o1K8
5053d7N8Q0k3n0r0K1M4Q4lm6j26K3O6O4Rj17k9oP9R5k0r8l3k0R8P8j5n9p7J7Q0
5084C7L1%n5p9L8O1K7lr0n4qJ44K1k0r9n3M8O7O5n3p4nL2O0M0k0r1k8M6Q0K1l4
$$ plain form
5116 52 -23 -79 -19 54 56 23 -7 -74 -27 21 47 9 -43 -88 -21 59 58 51 -13 -59 -30 46 89 42 -42 -75 -17 64 76 -1 -48 -90
5148 -90 -16 51 69 13 -61 -62 -2 36 57 -13 -41 -53 3 81 87 15 -39 -54 -14 72 94 37 -44 -68 -14 65 63 10 -79 -87 5 43
5180 43 25 -26 -83 -88 -5 66 56 -20 -57 -61 2 76 55 27 -60 -40 43 87 82 4 -69 -45 32 58 62 -2 -86 -74 35 81 61 -40
5212 -40 -54 -44 5 66 47 -17 -49 -43 52 83 63 -30 -35 -42 38 58 46 -7 -94 -43 9 74 9 -55 -85 -43 58 83 26 -20 -71
5243 -71 -37 33 72 37 -3 -51 -32 28 73 48 -43 -33 -32 47 64 26 -41 -94 -42 33 61 -5 -63 -78 -42 30 54 11 -69 -68 -14
5274 -14 74 68 14 -37 -73 1 71 70 28 -46 -47 -9 58 66 -11 -73 -83 -5 49 72 -12 -65 -49 -14 47 76 17 -43 -54 6 85 52
5306 52 9 -40 -30 -31 92 56 -6 -98 -77 -15 55 55 -10 -77 -71 3 63 56 -12 -78 -49 22 79 61 -12 -76 -22 39 86 103 4 -55
5338 -55 -49 28 77 72 -43 -50 -70 8 68 44 -27 -97 -55 -6 67 40 -34 -71 -55 12 73 51 -24 -73 -31 58 73 52 -42 -63 -20
$$ packed form
5116E2p5n6O0P3Kl3l0o7M7M8K6l8n2m5O7Q0jpo4m6K9P6M3m7q4l3N8Q1J2p7m7m2
5148i0P4O7J8n6p4jO0L8K1p0k8j2N6P8Op2n4j5M0Q6K2n7q1k4N4P9kn3q9qR2L8
5180D3j8n1n7nQ3P1j0p6l7mO3P4k1k8q7K0Q3M4np8p3K4P7K6Mo4q4J2J09M6k0j01
5212d0j4J0M9O1j9o4l2OR5L1k0r3npQ0K0j2n3q7N1N2O5o5o4l0M2J01K5n7m6n1
5243g1L4P0L9l5m0m8J9O0M5k5r1J0JP9J7l8o7n3N2P5K8o6n8j5L6P2K4m3q0JN4
5274a4Q8on4n1l6P4P0jm2p4jL8O7Qp7o2j0P8N4K3q4n3J6L5O1K9n9o0j1O0P9l3
5306E2m3m9J0jJ23l6o2r2K1O2P0%o5o7OP4O0po8o6K9P1N7j8p3o4N4O1M7J7r9n9
5338e5OP7M9nj15pk0P8O0k4p1p0M2M9P3k7p4l7J6O7O1k2p5m9M2Q9J5k1r4k1M3
$$ plain form
5369 -20 45 89 46 -31 -66 -73 23 55 39 -43 -89 -22 45 75 8 -55 -86 -19 47 83 18 -41 -93 -55 32 74 26 -17 -65 -18 47
5400 47 61 -22 -57 -76 3 39 32 24 -53 -80 -31 75 76 22 -44 -64 -9 59 102 6 -43 -71 -1 100 52 11 -76 -61 -36 51 67
5431 67 1 -83 -74 -9 25 53 -5 -87 -74 3 82 74 6 -66 -54 25 84 49 20 -78 -72 26 77 44 -9 -75 -69 38 72 63 -40 -74
5463 -74 -57 38 62 58 -39 -84 -38 10 55 42 -32 -80 -39 43 93 41 -24 -101 -37 32 51 20 -57 -101 -75 13 71 12 -23 -63 -23
5494 -23 40 95 21 -13 -82 -48 48 97 39 -41 -72 -14 26 81 21 -48 -97 -53 46 60 8 -75 -87 -35 40 78 -1 -72 -76 -64 24
5525 24 51 15 -52 -82 -7 55 56 34 -48 -86 -6 91 58 20 -75 -53 12 71 64 11 -67 -54 -6 72 55 -4 -68 -57 -6 70 58
5556 58 10 -88 -74 -1 57 77 -10 -78 -72 -9 74 57 4 -96 -56 7 51 40 8 -68 -50 -9 83 37 -17 -69 -45 35 76 71 -24
5587 -24 -73 -35 22 69 39 -51 -82 -69 28 81 49 -41 -82 -79 29 70 22 -25 -70 -50 20 74 47 -23 -72 -49 53 82 64 -44
$$ packed form
5369b0O5M4m3p7l5pR6L2j6q2m6O7O7L0o7o3l1O7O6L6o5n9n2L8Q7M2m8m3m8M7O5
5400D7J4q3l5j9P9L6pqp7k7M9J06Jn4o6k0N5O8M3r6m9k8P0J01m8m1q7J5K5Q7J6
5431F7o6q4RO5L4K8n8q2J3P7P9qo8p2J2P9N9l5k9r8OR8N1l3n3o6OJ07L4rj03l4
5463g4J7R5K4mr7m5M6M8M5j3p4m8M1Q2N0n2o5p7O4O9J9l1p7m4K6Q8N8n9l5m0M0
5494b3O3N5p4l4o9L4R6M9n8q0l1N8M0N5o0o9m9M4R9J4n2q3j2N2P5L8p9p1mJ2Q8
5525B4K7l6o7l0P5O2Jk2q2l8Q0R7l3l8r5K2O5N9pn3p8J3M8P8j7n9o4J1N1P6j2
5556E8m8r8J4P3N8K0q7o8OO3Q3j7n3j00M0O3M4j1l2p6J8M1R2m6n4n2K4Q0M1nr5
5587b4m9L8N7M7l0r0l1J3R7N3l2r0m1LJ08M1m8m7m5K0P0N4k7p0m9K3J02K9j8j08
$$ plain form
5617 -44 -71 -53 49 68 56 -47 -45 -20 43 79 42 -31 -82 -37 51 94 24 -23 -43 -28 70 60 36 -70 -83 10 43 71 26
5646 26 -57 -78 -41 28 75 -4 -56 -79 -23 43 94 -19 -58 -75 -22 85 96 4 -32 -48 27 103 74 13 -45 -46 18 46 64 -3
5676 -3 -66 -95 -16 58 41 -31 -97 -93 8 74 55 3 -44 -66 -25 62 95 -19 -77 -71 17 101 49 -10 -64 -47 10 74 55 -14 -81
5707 -81 -45 33 90 28 -20 -78 -49 28 77 28 -18 -61 -49 27 82 62 -33 -54 -46 20 81 25 -19 -82 -25 31 51 18 -26 -86 -65
5738 -65 11 67 21 -30 -77 -16 19 84 58 -38 -73 -33 50 82 50 -34 -59 -5 71 70 37 -68 -73 -21 49 73 7 -53 -83 -26 27
5769 27 61 8 -72 -56 -10 31 96 16 -76 -66 -27 70 70 12 -59 -67 -14 60 60 15 -44 -78 21 59 75 -14 -56 -63 5 56 61 17 -52
5802 -52 -81 17 73 73 -8 -61 -61 0 72 50 -5 -76 -28 8 77 36 -32 -71 -80 13 70 25 -19 -54 -37 41 78 55 -25 -66 -28 30
5834 30 62 54 -18 -47 -61 49 103 65 -28 -78 -50 24 67 48 -55 -80 -53 26 60 22 -42 -84 -50 18 38 32 -42 -66 -43 31
$$ packed form
5617d4k7J8J02J9j2j03KK5O3L6l7p3n1M5Q8M3p0m7k0J5R8j0k4j06j3R3L3K8m5
5646B6q3k1L7O9M7p9n2k3N6O6N1j13l9j7N3J07J1r2l6j6P5P6k9o1n8jO4K8J8o7
5676co3k9P9P4j7p2o6MJ01O6j9n2m7k2M1Q7L3j14n8OQ8Q4n2n9n4J7N7O4j9o9o7
5707h1L6P8N7o2m8n8K9P7M9m9m6m3J2P6N5k0r5k1QO6O1n6m4o3N7N6K0l3m4o0K1
5738f5P6N6m6n1m7O1L5O5k6r6l5M0Q3L2l2q4k5N4P6jl3j05nN2P0K4o6o0l0N7N3
5769B7L4n3q0J6M6M1O5q0r2J0L9R7%n8p1qN3P4%m5n9l4R9L8J6q9m2pO8N1Nm4o9
5802e2k9R8N6%q1n3%O1P2k2n5p1M8L6O9m1o8l9rR3N7m5m4l5J7P8L7k3q0m1L8N8
5834C0L2qp2k9j4J10N4l8r3n0K8P4M3j9j03k5K7P9L4l8o4m2L4O8K0op4k4K3P4
$$ plain form
5864 31 44 28 -43 -90 -35 74 73 56 -27 -54 -2 49 79 24 -35 -83 -27 28 86 -4 -84 -70 7 67 61 12 -32 -42 -15 45 73
5895 73 28 -77 -76 -11 56 85 25 -67 -81 -5 59 71 13 -70 -61 -7 53 39 14 -74 -66 -4 54 81 7 -51 -39 2 76 61 6
5926 6 -65 -57 10 76 55 15 -61 -71 9 54 47 -16 -57 -72 0 71 87 -27 -82 -74 4 41 33 -41 -71 -28 21 59 66 -17 -57 -22 60
$$ packed form
5864C1J3j6p1m7N5J09jj7q3k7N2N1L0n5n9m8N6N5N8r0q0J4P7O0om9m4j0K7O0K8
5895G3m5j05JO5O7K9o0r2j4P6O4J2n8q3RN4O0j4k5q8QO2N8K7p4n8J2M1P4j5n5
5926Fp1QO7O6k1m0p6j0Q0M5po3m1j5P2P1J6j14n5QP8L7qp4l0M3M9L8Pq3m0L5Q2
$$ [...]
8191H0
##END NTUPLES=NMR FID
##END=
