##TITLE=1H_AM_NVBENZEN
 
 8 sc, 
 24.11.2023
##JCAMPDX= 6.0         $$ Bruker NMR JCAMP-DX V2.0
##DATA TYPE= NMR FID
##DATA CLASS= NTUPLES
##ORIGIN= UXNMR, Bruker Analytische Messtechnik GmbH
##OWNER= root
$$ XWIN-NMR		Version 3.5
$$ Fri Nov 24 16:18:16 2023 Russian Standard Time (UT+4h)  she@DPX200
##.OBSERVE FREQUENCY= 200.1313
##.OBSERVE NUCLEUS= ^1H
##.DELAY= (6, 6)
##.ACQUISITION MODE= SIMULTANEOUS
##.ACQUISITION SCHEME= undefined
##.AVERAGES= 8
##.DIGITISER RES= 18
##SPECTROMETER/DATA SYSTEM= spect
##.PULSE SEQUENCE= zg30
##.SOLVENT NAME= D2O
##.SHIFT REFERENCE= (INTERNAL, D2O, 0, 15.7039)
##AUDIT TRAIL= $$ (NUMBER, WHEN, WHO, WHERE, WHAT)
$$ ##TITLE= Audit trail, XWIN-NMR		Version 3.5
$$ ##JCAMPDX= 5.01
$$ ##ORIGIN= Bruker BioSpin GmbH
$$ ##OWNER= she
$$ F:/spectra/data/she/nmr/H-F/1/audita.txt
$$ ##AUDIT TRAIL=  $$ (NUMBER, WHEN, WHO, WHERE, WHAT)
(   1,<2023-11-24 16:16:47.45 +0400>,<she>,<DPX200>,
      <created by zg, POWCHK disabled, PULCHK disabled
       configuration hash MD5:
       00 E9 B6 7A A2 85 ED C7 34 08 36 98 17 FE 4E 26
       data hash MD5: 16K
       26 BD AE 6D D7 85 70 08 1F 0C 8F 5F AE C3 0E AA>)
$$ ##END=
$$ 
$$ hash MD5
$$ E8 B9 E9 2C 0E 9F 7E EC 51 94 8B 4F CB 83 57 A9
##$RELAX= 
##$RELAX= 
##$RELAX= 
##$RELAX= 
##$RELAX= 
##$RELAX= 
$$ Bruker specific parameters
$$ --------------------------
##$DU= <F:/spectra>
##$EXPNO= 1
##$NAME= <H-F>
##$PROCNO= 1
##$TYPE= <nmr>
##$USER= <she>
##$AMP= (0..31)
100 100 100 100 100 100 100 100 100 100 100 100 100 100 100 100 100 100 
100 100 100 100 100 100 100 100 100 100 100 100 100 100 
##$AQSEQ= 0
##$AQ_mod= 1
##$AUNM= <au_zg>
##$AUTOPOS= <>
##$BF1= 200.13
##$BF2= 200.13
##$BF3= 200.13
##$BF4= 200.13
##$BF5= 200.13
##$BF6= 200.13
##$BF7= 200.13
##$BF8= 200.13
##$BYTORDA= 1
##$CFDGTYP= 0
##$CFRGTYP= 5
##$CHEMSTR= <none>
##$CNST= (0..31)
1 1 145 1 1 1 1 1 1 1 1 1 1 1 1 1 1 1 1 1 1 1 1 1 1 1 1 1 1 1 1 1 
##$CPDPRG= <>
##$CPDPRG1= <>
##$CPDPRG2= <>
##$CPDPRG3= <>
##$CPDPRG4= <mlev>
##$CPDPRG5= <mlev>
##$CPDPRG6= <mlev>
##$CPDPRG7= <mlev>
##$CPDPRG8= <mlev>
##$CPDPRGB= <>
##$CPDPRGT= <>
##$D= (0..31)
0 1.2 0 0 0 0 0 0 0 0.06 0 0.03 0 0 0 0 0.0002 0 0 0 0 0 0 0 0 0 0 0 0 
0 0 0 
##$DATE= 1700828206
##$DBL= (0..7)
120 120 120 120 120 120 120 120 
##$DBP= (0..7)
150 150 150 150 150 150 150 150 
##$DBP07= 0
##$DBPNAM0= <>
##$DBPNAM1= <>
##$DBPNAM2= <>
##$DBPNAM3= <>
##$DBPNAM4= <>
##$DBPNAM5= <>
##$DBPNAM6= <>
##$DBPNAM7= <>
##$DBPOAL= (0..7)
0.5 0.5 0.5 0.5 0.5 0.5 0.5 0.5 
##$DBPOFFS= (0..7)
0 0 0 0 0 0 0 0 
##$DE= 6
##$DECBNUC= <off>
##$DECIM= 32
##$DECNUC= <off>
##$DECSTAT= 4
##$DIGMOD= 1
##$DIGTYP= 9
##$DL= (0..7)
0 120 120 120 120 120 120 120 
##$DP= (0..7)
150 150 150 150 150 150 150 150 
##$DP07= 0
##$DPNAME0= <>
##$DPNAME1= <>
##$DPNAME2= <>
##$DPNAME3= <>
##$DPNAME4= <>
##$DPNAME5= <>
##$DPNAME6= <>
##$DPNAME7= <>
##$DPOAL= (0..7)
0.5 0.5 0.5 0.5 0.5 0.5 0.5 0.5 
##$DPOFFS= (0..7)
0 0 0 0 0 0 0 0 
##$DQDMODE= 0
##$DR= 18
##$DS= 0
##$DSLIST= <SSSSSSSSSSSSSSS>
##$DSPFIRM= 0
$$ [...]
##$SUBNAM2= <"">
##$SUBNAM3= <"">
##$SUBNAM4= <"">
##$SUBNAM5= <"">
##$SUBNAM6= <"">
##$SUBNAM7= <"">
##$SUBNAM8= <"">
##$SUBNAM9= <"">
##$SW= 18.0517328524113
##$SWIBOX= (0..15)
0 0 2 0 0 0 0 0 0 0 0 0 0 0 0 0 
##$SW_h= 3612.71676300578
##$TD= 16384
##$TD0= 1
##$TE= 0
##$TE2= 300
##$TE3= 300
##$TEG= 300
##$TL= (0..7)
0 120 120 120 120 120 120 120 
##$TP= (0..7)
150 150 150 150 150 150 150 150 
##$TP07= 0
##$TPNAME0= <>
##$TPNAME1= <>
##$TPNAME2= <>
##$TPNAME3= <>
##$TPNAME4= <>
##$TPNAME5= <>
##$TPNAME6= <>
##$TPNAME7= <>
##$TPOAL= (0..7)
0.5 0.5 0.5 0.5 0.5 0.5 0.5 0.5 
##$TPOFFS= (0..7)
0 0 0 0 0 0 0 0 
##$TUNHIN= 0
##$TUNHOUT= 0
##$TUNXOUT= 0
##$USERA1= <user>
##$USERA2= <user>
##$USERA3= <user>
##$USERA4= <user>
##$USERA5= <user>
##$V9= 5
##$VALIST= <valist>
##$VCLIST= <CCCCCCCCCCCCCCC>
##$VD= 0
##$VDLIST= <DDDDDDDDDDDDDDD>
##$VPLIST= <PPPPPPPPPPPPPPP>
##$VTLIST= <TTTTTTTTTTTTTTT>
##$WBST= 1024
##$WBSW= 4
##$XGAIN= (0..3)
0 0 0 0 
##$XL= 0
##$YL= 0
##$YMAX_a= 232798
##$YMIN_a= -237501
##$ZGOPTNS= <>
##$ZL1= 120
##$ZL2= 120
##$ZL3= 120
##$ZL4= 120
##$ABSF1= 10
##$ABSF2= 0
##$ABSG= 5
##$ABSL= 3
##$ALPHA= 0
##$AQORDER= 0
##$ASSFAC= 0
##$ASSFACI= 0
##$ASSFACX= 0
##$ASSWID= 0
##$AUNMP= <proc_1d>
##$AZFE= 0.1
##$AZFW= 0.1
##$BCFW= 1
##$BC_mod= 2
##$BYTORDP= 1
##$COROFFS= 0
##$CY= 11.3945322036743
##$DATMOD= 1
##$DC= 2
##$DFILT= <>
##$DTYPP= 0
##$F1P= 15.7292609196834
##$F2P= 12.9074282941183
##$FCOR= 0.5
##$FTSIZE= 0
##$FT_mod= 4
##$GAMMA= 1
##$GB= 0.15
##$INTBC= 1
##$INTSCL= 1
##$ISEN= 128
##$LB= 0.24
##$LEV0= 0
##$LPBIN= 0
##$MAXI= 10000
##$MC2= 0
##$MEAN= 0
##$ME_mod= 0
##$MI= 1.114404
##$NCOEF= 0
##$NC_proc= 0
##$NLEV= 6
##$NOISF1= 3.799351
##$NOISF2= 2.8
##$NSP= 1
##$NTH_PI= 0
##$NZP= 0
##$OFFSET= 15.70392
##$PC= 1
##$PHC0= -24324.01
##$PHC1= 41.8527
##$PH_mod= 1
##$PKNL= yes
##$PPARMOD= 0
##$PSCAL= 0
##$PSIGN= 0
##$REVERSE= no
##$SF= 200.130013532006
##$SI= 16384
##$SIGF1= 3
##$SIGF2= 2
##$SINO= 400
##$SIOLD= 16384
##$SREGLST= <1H.CDCl3>
##$SSB= 0
##$STSI= 0
##$STSR= 0
##$SW_p= 3612.71676300578
##$SYMM= 0
##$S_DEV= 0
##$TDeff= 0
##$TDoff= 0
##$TI= <>
##$TILT= no
##$TM1= 0
##$TM2= 0
##$TOPLEV= 0
##$USERP1= <user>
##$USERP2= <user>
##$USERP3= <user>
##$USERP4= <user>
##$USERP5= <user>
##$WDW= 1
##$XDIM= 8192
##$YMAX_p= 0
##$YMIN_p= 0
$$ End of Bruker specific parameters
$$ ---------------------------------
##NTUPLES= NMR FID
##VAR_NAME=  TIME,          FID/REAL,        FID/IMAG
##SYMBOL=    X,             R,               I
##VAR_TYPE=  INDEPENDENT,   DEPENDENT,       DEPENDENT
##VAR_FORM=  AFFN,          ASDF,            ASDF
##VAR_DIM=   8192,          8192,            8192
##UNITS=     SECONDS,       ARBITRARY UNITS, ARBITRARY UNITS
##FACTOR=    0.0002768,     1,               1
##FIRST=     0,             0,               0
##LAST=      2.2672688,     0,               0
##MIN=       0,             -237501,         0
##MAX=       2.2672688,     232798,          0
$$ Real data points
##PAGE= N=1
##DATA TABLE= (X++(R..R)), XYDATA
$$ [...]
$$ plain form
1764 -2635 -4296 -4949 -4365 -2769 -462 1973 3907 4876 4678 3365 1201 -1253 -3405 -4689 -4876 -3869
1780 -3869 -1948 493 2795 4384 4921 4254 2590 259 -2145 -4002 -4871 -4582 -3190 -1019 1413 3481
1796 3481 4683 4772 3702 1754 -660 -2903 -4402 -4841 -4103 -2402 -81 2279 4057 4821 4456 3014
1812 3014 841 -1570 -3575 -4678 -4670 -3521 -1548 847 3013 4427 4761 3969 2199 -118 -2431 -4107
1828 -4107 -4768 -4324 -2815 -639 1739 3641 4645 4550 3354 1351 -1021 -3113 -4429 -4669 -3790 -1998
1844 -1998 298 2534 4103 4688 4158 2625 442 -1863 -3688 -4589 -4400 -3148 -1126 1181 3198 4403
1860 4403 4544 3622 1797 -475 -2662 -4122 -4619 -3996 -2414 -247 2016 3731 4551 4252 2960 918
1876 918 -1362 -3290 -4397 -4443 -3434 -1591 661 2759 4125 4527 3829 2217 49 -2149 -3770 -4468
$$ packed form
1764b635j661o53N84J596K307K435J934R69j98j313k164k454k152j284j87J007
1780c869J921K441K302J589N37o67j664k331k404j857q69K89J392K171K432K068
1796C481J202Q9j070j948k414k243j499m39P38J701K321K360J778P64l65j442
1812C014k173k411k005j103QJ149J973K395K166J414L34p92j770k317k313j676
1828d107o61M44J509K176K378J902J004r5j196k003k372k092j316k40Q79J792
1844a998K296K236J569N85n30j533k183k305j825r01J89J252K022K307K017J205
1860D403J41r22j825k272k187j460m97O23J582K167K263J715Q20k99j292k042
1876I18k280j928j107m6J009J843K252K098J366M02o98j612k168k198j621o98
$$ plain form
1892 -4468 -4104 -2760 -718 1506 3361 4349 4310 3259 1388 -826 -2848 -4127 -4416 -3643 -2020 141
1908 141 2262 3806 4405 3954 2574 526 -1651 -3418 -4314 -4192 -3054 -1198 995 2916 4101 4308
1924 4308 3470 1813 -326 -2374 -3831 -4318 -3785 -2363 -328 1775 3449 4243 4046 2871 1003 -1132
1940 -1132 -2978 -4073 -4180 -3282 -1616 484 2440 3787 4192 3640 2180 178 -1873 -3455 -4168 -3889
1956 -3889 -2688 -833 1246 3013 4014 4033 3114 1426 -623 -2517 -3781 -4097 -3452 -1968 -10 1986
1972 1986 3459 4070 3718 2494 650 -1387 -3048 -3959 -3887 -2909 -1207 789 2595 3734 3967 3253 1765
1989 1765 -168 -2072 -3450 -3965 -3550 -2278 -451 1498 3063 3862 3699 2717 1017 -922 -2644 -3686
2005 -3686 -3836 -3056 -1546 349 2161 3428 3874 3353 2059 241 -1619 -3079 -3786 -3554 -2484 -787
$$ packed form
1892d468L64J344K042K224J855R88l9j051j871k214k022j279k89P73J623K161
1908A41K121J544N99m51j380k048k177j767q96J22J138J856K193J921J185K07
1924D308q38j657k139k048j457m87N33J422K035K103J674P94j97j175j868k135
1940a132j846j095j07Q98J666K100J956J347M05n52j460k002k051j582p13K79
1956c889J201J855K079J767J001J9r19j688k049j894j264l16O45J484J958J996
1972A986J473O11l52j224j844k037j661r11P2R78J702J996J806J139K33p14j488
1989A765j933j904j378n15M15J272J827J949J565P99j63r82j700j939j722j042
2005c686j50P80J510J895J812J267M46n21j294j818j860j460p07K32J070J697
$$ plain form
2021 -787 1086 2691 3624 3694 2841 1327 -535 -2237 -3397 -3733 -3149 -1826 -49 1724 3087 3656 3370
2038 3370 2258 592 -1213 -2712 -3548 -3520 -2647 -1135 674 2291 3359 3578 2962 1622 -129 -1819
2054 -1819 -3062 -3557 -3187 -2024 -389 1344 2735 3462 3352 2419 902 -838 -2353 -3303 -3436 -2742 -1383
2071 -1383 303 1926 3061 3425 2985 1813 187 -1486 -2749 -3372 -3172 -2189 -690 982 2407 3249
2087 3249 3287 2536 1153 -496 -2015 -3042 -3302 -2782 -1563 9 1638 2797 3300 3003 1969 469 -1169
2104 -1169 -2477 -3191 -3112 -2309 -915 692 2136 3021 3182 2574 1333 -249 -1762 -2819 -3212 -2803 -1739
2121 -1739 -232 1317 2551 3133 2972 2074 670 -870 -2236 -3018 -3080 -2374 -1102 454 1878 2860 3125
2138 3125 2637 1520 8 -1474 -2611 -3083 -2827 -1870 -450 1079 2335 3013 2955 2188 892 -642 -2004
$$ packed form
2021g87J873J605R33P0q53j514j862j702j160l36N84J323J777J773J363N69k86
2038C370j112j666j805j499q36K8Q73J512J809J617J068K19o16j340j751j690
2054a819j243m95L70J163J635J733J391P27j10r33j517j740j515r50j33O94J359
2071a383J686J623J135L64m40j172j626j673j263o23K00R83J499J672J425Q42
2087C249L8p51j383j649j519j027k60N20J219J572J629J159N03k97j034j500j638
2104a169j308p14P9Q03J394J607J444Q85J61o08j241j582j513j057l93M09J064
2121a739J507J549J234N82j61q98j404j540j366p82o2P06J272J556J424R82K65
2138C125m88j117j512j482j137m72K56R57J420J529J256O78n8p67j296j534j362
$$ plain form
2155 -2004 -2884 -3050 -2478 -1318 184 1608 2665 3042 2688 1689 253 -1242 -2414 -3003 -2863 -2026 -690
2172 -690 816 2107 2903 2973 2336 1120 -367 -1770 -2718 -3005 -2578 -1504 -76 1389 2491 2998 2760
2189 2760 1864 507 -987 -2206 -2911 -2900 -2196 -944 539 1875 2739 2949 2438 1332 -114 -1541 -2553
2206 -2553 -2986 -2649 -1708 -327 1128 2293 2900 2798 2030 738 -722 -1998 -2779 -2901 -2295 -1132 292
2223 292 1673 2618 2941 2529 1540 132 -1289 -2390 -2893 -2713 -1889 -587 855 2093 2787 2825 2157 988
2241 988 -449 -1782 -2669 -2910 -2432 -1387 8 1396 2441 2878 2630 1727 412 -1014 -2187 -2818 -2769
2258 -2769 -2047 -829 600 1870 2696 2858 2336 1247 -164 -1514 -2488 -2866 -2549 -1608 -284 1124 2232
2275 2232 2817 2701 1936 700 -736 -1957 -2710 -2823 -2235 -1116 276 1607 2515 2823 2454 1466 119
$$ packed form
2155b004q80j66N72J160J502J424J057L77l54r99j436j495j172n89J40Q37J336
2172f90J506J291P96P0o37j216j487j403r48k87M27J074J428J465J102N07k38
2189B760q96j357j494j219p05J1P04J252J483J336Q64K10n11j106j446j427j012
2206b553m33L37R41J381J455J165O07j02p68j292j460j276p81j22O06J163J424
2223B92J381R45L23m12r89j408j421j101n03J80Q24J302J442J238O94L8o68j169
2241I88j437j333q87k41M78J045J395J388J045M37k48r03j315j426j173o31M9
2258b769P22J218J429J270Q26J62n22j089j411j350r74l78L17R41J324J408J108
2275B232N85j16p65j236j436j221p53j13N88J119J392J331R08L08l69r88j347
$$ plain form
2292 119 -1250 -2305 -2808 -2627 -1802 -544 867 2045 2716 2748 2100 950 -435 -1716 -2571 -2787 -2344 -1313
2310 -1313 18 1366 2360 2783 2534 1673 387 -991 -2112 -2714 -2674 -1985 -812 548 1780 2565 2729
2327 2729 2221 1173 -158 -1459 -2397 -2758 -2452 -1553 -252 1088 2161 2699 2588 1854 669 -687 -1867
2344 -1867 -2581 -2671 -2110 -1038 293 1548 2431 2724 2331 1417 118 -1191 -2220 -2695 -2521 -1742 -546 781
2362 781 1923 2578 2612 2021 927 -400 -1626 -2448 -2678 -2277 -1307 -31 1271 2233 2649 2422 1614 402
2380 402 -907 -1988 -2589 -2556 -1884 -785 542 1704 2470 2617 2143 1156 -134 -1388 -2281 -2632 -2340 -1480
2398 -1480 -269 1015 2032 2575 2464 1784 654 -643 -1768 -2478 -2567 -2057 -1051 210 1421 2269 2565
2415 2565 2237 1367 162 -1089 -2068 -2542 -2401 -1673 -554 725 1812 2451 2487 1943 898 -340 -1518
$$ packed form
2292A19j369j055n03J81Q25J258J411J178O71L2o48j150j385j281q55k16M43J031
2310a313J331J348R94M23k49q61j286j378j121o02M0O89J173J360J232P85J64
2327B729n08j048j331j301r38l61L06Q99J301J340J073N38j11p34j185j356j180
2344a867p14r0N61J072J331J255Q83K93l93r14j299j309j029m75J74P79J196J327
2362G81J142O55L4n91j094j327j226q22k30M01R70J276J302R62M16k27q08j212
2380D02j309j081o01L3O72J099J327J162P66J47m74r87j290j254q93l51K92Q60
2398a480J211J284J017N43j11o80j130j297j125p10q9N10J006J261J211Q48K96
2415B565l28q70j205j251r79m74J41P28J119J279J087O39L6n44j045j238j178
$$ plain form
2432 -1518 -2279 -2520 -2134 -1224 -19 1184 2091 2498 2281 1544 396 -834 -1865 -2437 -2425 -1828 -786 437
2450 437 1551 2276 2460 2044 1121 -66 -1240 -2105 -2456 -2212 -1451 -309 885 1878 2386 2330 1714 680
2468 680 -520 -1596 -2263 -2379 -1915 -1001 185 1300 2118 2406 2099 1299 159 -999 -1917 -2354 -2236 -1570
2486 -1570 -522 655 1655 2239 2298 1784 846 -321 -1390 -2137 -2340 -1999 -1169 -58 1056 1923 2298 2136
2504 2136 1447 414 -730 -1675 -2212 -2224 -1679 -736 397 1418 2096 2247 1888 1044 -39 -1132 -1913 -2237
2522 -2237 -2032 -1309 -289 823 1698 2173 2107 1552 585 -506 -1476 -2078 -2168 -1762 -910 162 1189 1895 2171
2541 2171 1909 1177 165 -895 -1714 -2123 -2020 -1431 -486 552 1480 2032 2099 1647 801 -227 -1216 -1873 -2096
2560 -2096 -1801 -1063 -67 939 1715 2058 1909 1295 365 -648 -1507 -1993 -1994 -1508 -669 344 1264 1847 1995
$$ packed form
2432a518p61k41L86R10J205J203R07M07k17p37j148j230j031n72J2N97J042J223
2450D37J114P25J84m16r23j187j174q65l51K44P61J142J194R93N08n6o16j034
2468F80j200j076o67j16M64R14J186J115Q18K88l07q00j140j158r18m37J18O66
2486a570J048J177J000N84N9n14r38j167j069p47k03L41Q30J111J114Q67L75j62
2504B136o89j033j144r45n37j2N45R43J133J021O78J51l59q44j083j093p81l24
2522b237K05P23J020J112Q75M75o6n55r67j091r70o02r0M06Q52J072J027P06K76
2541B171k62p32j012j060q19m09J03N89R45J038R28N52O7m52q46j028r89o57k23
2560b096K95P38R96J006P76L43j49o14r30j013q59m86jM86Q39J013R20N83J48
$$ plain form
2579 1995 1644 911 -56 -1009 -1710 -1990 -1789 -1141 -227 725 1523 1937 1879 1364 517 -456 -1297 -1828 -1899 -1513
2599 -1513 -774 176 1066 1707 1906 1659 1007 115 -807 -1527 -1865 -1755 -1212 -394 539 1329 1762 1792 1369 610
2619 610 -309 -1130 -1681 -1818 -1526 -851 16 884 1535 1798 1621 1057 230 -650 -1351 -1729 -1679 -1227 -469 403
2639 403 1164 1657 1725 1394 713 -145 -957 -1527 -1726 -1500 -912 -109 727 1370 1675 1568 1076 321 -512 -1219
2659 -1219 -1617 -1628 -1243 -557 261 1023 1514 1637 1346 743 -52 -823 -1396 -1618 -1446 -920 -157 620 1260 1582
2679 1582 1531 1101 396 -396 -1081 -1491 -1550 -1209 -578 191 909 1415 1553 1321 753 8 -740 -1296 -1530 -1416
2699 -1416 -931 -232 517 1149 1475 1441 1064 425 -327 -998 -1425 -1493 -1185 -607 128 835 1341 1500 1306 796
2719 796 88 -650 -1202 -1465 -1367 -931 -259 472 1083 1426 1429 1079 457 -274 -936 -1374 -1459 -1193 -642 75 761
$$ packed form
2579A995l51p33r67r53p01k80K01O48R14R52P98M14n8n15q47r73q41n31p1L86
2599a513P39R50Q90O41J99k47o52q92r22p20l38J10N43Q18R33P90M33L0m23p59
2619F10r19q21n51j37K92O75Q67Q68O51K63j77n64q27q80p01l78N0M52P58Q72
2639D03P61M93O8l31o81q58q12n70j99K26N88Q03Q36O43L05j07m92p55q33p07
2659a219l98j1L85O86Q18P62M91J23k91o03p95p71n73k22J72N26P63P77O40L22
2679A582n1m30p05p92o85m10n9L41O31P69P18N06J38k32n68p45p48n56k34J14
2699a416M85O99P49O32L26l4l77o39p52o71m27o8L08N78P35P07N06J59j94n10
2719G96p08p38n52k63R8M36O72P31O11L43Ll50o22p31o62m38q5K66N51P17O86
$$ plain form
2740 761 1245 1439 1270 780 106 -592 -1158 -1433 -1343 -944 -303 412 1029 1379 1414 1099 506 -211 -861 -1303 -1421
2761 -1421 -1187 -673 34 714 1218 1434 1296 856 181 -525 -1111 -1398 -1367 -990 -374 343 954 1340 1388 1111
2781 1111 545 -166 -816 -1285 -1420 -1220 -712 -37 650 1163 1393 1294 870 234 -469 -1040 -1356 -1342 -994 -406
2801 -406 299 938 1318 1401 1150 598 -92 -756 -1228 -1395 -1219 -760 -109 576 1126 1388 1302 913 285 -417 -1007
2822 -1007 -1345 -1363 -1054 -464 213 853 1285 1384 1142 646 -49 -700 -1186 -1398 -1254 -802 -142 532 1095 1369
2842 1369 1329 971 357 -339 -944 -1306 -1355 -1069 -515 154 799 1247 1390 1195 718 50 -624 -1151 -1389 -1289
2862 -1289 -887 -242 446 1022 1346 1344 1006 431 -268 -880 -1294 -1389 -1127 -602 71 724 1207 1376 1231 782 133
2883 133 -547 -1082 -1351 -1300 -916 -308 379 964 1320 1335 1069 511 -182 -805 -1245 -1371 -1180 -685 -28 650 1138
$$ packed form
2740G61M84J94j69m90o74o98n66k75R0L99O41P15O17L50L5l15n93p17o50m42j18
2761a421K34N14P07O80N04K16j38m40o75p06n86k87L1L77O16P17O11L86M8k77
2781A111n66p11o50m69j35K00N08O75O87N13K30r9m24o36p03n71l16J4L48N88
2801d06P05O39L80Q3k51n52o90o64m72j67J76M59O51O85N50K62q6l89o28p02n90
2822a007l38j8L09N90O77O40M32R9k42m96o95o51m86k12J44M52O60O74N63K74
2842A369m0l58o14o96o05l62m9K86N54O69O45M48J43j95m77o68o74n27k38J00
2862a289M02O45O88N76L24kl38n75o99o12m14r5K62N25O73O53M83J69j45m49o49
2883A33o80n35k69N1L84O08O87N85L56J5k66n58o93o23m40j26J91M95O57O78M88
$$ plain form
2904 1138 1362 1238 825 200 -488 -1045 -1355 -1337 -983 -404 272 902 1282 1360 1097 583 -96 -743 -1193 -1364
2924 -1364 -1191 -721 -80 586 1109 1361 1276 902 276 -412 -981 -1318 -1349 -1026 -462 205 838 1255 1356 1137
2944 1137 643 -33 -685 -1189 -1385 -1253 -810 -180 496 1061 1351 1313 956 356 -325 -929 -1300 -1362 -1084 -531
2964 -531 139 782 1241 1386 1214 720 78 -602 -1115 -1358 -1278 -870 -267 423 1007 1342 1332 1022 448 -245 -859
2985 -859 -1283 -1376 -1152 -637 28 691 1178 1368 1238 795 159 -529 -1071 -1358 -1315 -956 -358 329 943 1307 1362
3006 1362 1097 549 -112 -775 -1221 -1364 -1180 -712 -61 609 1121 1371 1279 889 271 -416 -994 -1325 -1343 -1024
3026 -1024 -464 208 834 1248 1357 1132 628 -36 -697 -1175 -1368 -1241 -808 -165 496 1048 1350 1311 968 390
3046 390 -299 -907 -1281 -1346 -1073 -554 123 740 1214 1372 1197 733 97 -568 -1084 -1341 -1277 -885 -291 389 954
$$ packed form
2904A138K24j24m13o25o88n57l10J8L54N79O76O30L80P8k63n14o79o47m50j71
2924a364J73M70O41O66N23K52q5l74o26o88n69l37l1L23N64O67O33M17J01k19
2944A137m94o76o52n04j96J32M43O30O76N65K90l8l57o00o81o04l71o2K78N53
2964e31O70O43M59J45j72m94o42o80n13k43Q0M08O03O90N84L35j0l10n74o93o14
2985h59m24r3K24N15O65O63M87J90j30m43o36o88n42k87M3L59N98O87O14L64N5
3006A362k65n48o61o63m46j43J84M68O51O70N12K50r2l90o18o87n78l31j8L19
3026a024N60O72O26M14J09k25n04o64o61m78j93J27M33O43O61N52L02l9l43n78
3046C90o89o08l74o5K73N19O77O17M74J58j75m64o36o65n16k57O4L92N94O80N65
$$ plain form
3067 954 1295 1314 999 456 -208 -821 -1243 -1349 -1149 -650 -15 634 1129 1334 1213 802 198 -472 -1007 -1300
3087 -1300 -1279 -949 -373 287 874 1247 1322 1082 573 -72 -699 -1139 -1307 -1166 -720 -104 540 1047 1292 1233 863
3108 863 290 -367 -909 -1247 -1278 -996 -468 163 756 1156 1290 1082 631 15 -604 -1070 -1268 -1160 -780 -198
3128 -198 430 945 1234 1230 922 392 -236 -798 -1150 -1238 -1013 -542 66 657 1090 1243 1105 702 105 -488 -972
3149 -972 -1214 -1165 -832 -281 313 849 1160 1192 926 431 -165 -715 -1096 -1200 -1019 -594 -11 557 998 1188 1102
3170 1102 737 190 -401 -882 -1149 -1124 -844 -325 246 772 1117 1177 968 507 -75 -633 -1014 -1159 -1034 -635
3190 -635 -87 480 921 1130 1084 753 232 -339 -826 -1110 -1119 -855 -384 175 705 1042 1137 943 532 -15 -547
3211 -547 -956 -1113 -1012 -657 -128 425 879 1118 1079 786 323 -242 -746 -1046 -1094 -871 -439 108 629 998 1118
$$ packed form
3067I54L41J9l15n43o64o13m22j06K00M99O35O49M95K05j21m11o04o70n35k93
3087a300K1L30N76O60N87L73P5k40n09o45o27m40j68J41M46O16O44N07K45n9l70
3108H63n73o57n42l38l1K82N28O31N93M00J34k08m51o16o19m66j98J08L80N82
3128a98O28N15K89ml08n30o28n62l52q8K25M71O08N91M33J53j38m03n97n93m84
3149i72k42M9L33N51N94N36L11L2k66m95n96n50l81j04J81M25N83N68M41J90q6
3170A102l65n47n91m81k67K5K80N19N71N26L45O0k09m61n82n58l81j45J25L99
3190f35N48N67M41K09m6l31n21n71m87k84rK64M71N59N30L37R5j94m11n47n32
3211e47m09j57J01L55N29N53M54K39l9k93m63n65n04l00m8K23M32N47N21L69J20
$$ plain form
3232 1118 978 577 49 -480 -909 -1103 -1018 -700 -219 346 798 1057 1070 804 337 -198 -686 -1011 -1067 -882 -469
3253 -469 49 576 944 1085 980 617 119 -416 -827 -1038 -1014 -719 -253 269 742 1020 1061 828 393 -125 -612
3274 -612 -959 -1060 -909 -519 -31 491 876 1043 960 641 162 -364 -777 -1027 -1006 -751 -300 218 683 976 1039
3295 1039 848 443 -67 -550 -893 -1015 -898 -542 -65 424 831 1026 968 685 218 -287 -726 -979 -998 -773
3315 -773 -360 145 607 919 1004 840 464 -16 -504 -859 -1006 -914 -602 -143 358 762 982 957 693 272 -216
3336 -216 -653 -936 -982 -783 -388 93 551 868 976 858 527 48 -412 -780 -952 -905 -615 -180 295 702 933
3357 933 937 698 304 -172 -601 -887 -954 -788 -432 24 493 802 933 835 518 87 -373 -736 -915 -870 -613 -207
3379 -207 259 663 897 910 719 331 -112 -537 -819 -915 -774 -443 -1 444 774 924 837 551 116 -321 -692
$$ packed form
3232A118j40m01n28n29m29j94Q5L18M81N65M52K59J3k66m67n35m88l25n6J85M13
3253d69N18N27L68J41j05l63m98n35m11k11K4K95M66N22M73K78M1k33m35n18m87
3274f12l47j01J51L90M88N22L85J67q3l19m79n26m13k50K1K55M51N18M65K93O3
3295A039j91m05n10m83l43j22J17L56M77M89M07J95n8k83m67n05m39k53j9K25
3315g73M13N05M62L12Q5j64l76m80m88l55j47R2L12M59N01M04K20k5k64m21m88
3336b16m37k83m6J99L95M81M58L17J08j18l31m79m60l68j72M7K90M35M75M07K31
3357I33Mk39l94m76m29k86o7J66L56M56M69L09J31r8l17m31m60l63j79M5K57M06
3379b07M66M04K34J3j91l88m43m25k82r6J41L31M42M45L30J50q7k86m35m37l71
$$ plain form
3400 -692 -893 -876 -632 -222 214 606 854 878 704 333 -119 -520 -811 -902 -755 -442 -8 422 755 900 822
3421 822 550 148 -289 -669 -872 -863 -622 -243 203 602 857 902 730 373 -76 -492 -795 -914 -800 -483 -71
3442 -71 390 713 895 836 586 158 -291 -660 -890 -891 -661 -267 170 575 834 893 736 395 -38 -469 -775 -887
3464 -887 -789 -474 -58 389 737 914 851 609 203 -242 -636 -871 -889 -693 -322 126 546 826 916 775 431
3485 431 -11 -449 -789 -926 -850 -566 -127 316 692 889 881 636 247 -212 -615 -872 -913 -716 -349 94 537
3506 537 833 918 808 484 37 -387 -749 -922 -861 -589 -159 291 683 909 910 695 306 -168 -589 -872 -942 -799
3528 -799 -455 4 451 785 925 850 543 121 -358 -725 -932 -924 -668 -259 220 636 902 948 760 377 -71
3549 -71 -523 -822 -937 -810 -473 -38 420 772 949 877 602 180 -285 -677 -910 -926 -702 -310 151 579 859
$$ packed form
3400f92k01J7K44M10M36L92K48K4j74l71m52m01k91r1J47L13M34M30L33J45p8
3421H22k72m02m37l80k03RK41L79M46L99K55M5j72l57m49m16l03j19J14L17M12
3442g1M61L23J82n9k50m28m49l69k30jK30L94M37M05K59N9j57l41m33m31l06j12
3464h87R8L15M16M47L48J77o3k42m06m45l94k35j8J96L71M48M20K80R0j41l44
3485D31m42m38l40j37P6K84M39M43L76J97qk45l89m59m03k57m1J97L67M43M43
3506E37K96Q5j10l24m47m24l62j73O1K72M30M50L92K26Jk15l89m74m21k83p0J43
3528g99L44M59M47L34J40p5l07m22m79l67k07QK56M09M79M16K66M6j88l83m48
3549g1m52k99j15J27L37M35M58L52J77p2k75m22m65l92k33j6K24L92M61M28K80
$$ plain form
3570 859 947 792 440 -19 -473 -806 -964 -867 -580 -136 331 731 932 920 681 266 -195 -625 -874 -930 -744
3591 -744 -378 80 522 842 955 840 516 68 -397 -766 -932 -893 -612 -199 275 663 903 920 704 315 -142
3612 -142 -564 -856 -944 -800 -461 -12 453 786 934 858 568 150 -319 -700 -908 -911 -663 -272 193 612 884
3633 884 930 762 411 -40 -486 -797 -916 -809 -500 -80 367 734 908 875 614 196 -243 -640 -893 -915 -714
3654 -714 -341 106 531 814 908 774 448 13 -421 -756 -903 -835 -564 -145 306 675 892 894 671 300 -145
3675 -145 -561 -822 -895 -730 -398 43 468 777 907 801 512 107 -352 -691 -872 -849 -633 -235 213 594 829
3696 829 872 675 342 -101 -505 -789 -889 -770 -461 -50 379 714 870 810 564 163 -254 -620 -827 -828 -628
3717 -628 -276 142 538 792 871 718 406 -13 -412 -720 -855 -774 -504 -119 303 641 812 805 584 221 -193
$$ packed form
3570H59Q8j55l52m59m54l33j58R7K87M44M67M00K01j2k39m15m61m30k49n6J86
3591g44L66M58M42L20J13j15l24m48m65l69j66L9K81M13M74L88K40J7k16l89m57
3612a42m22k92q8J44L39M49M65L33J48p6k90m18m69l81k08lK48L91M65M19K72
3633H84M6j68l51m51m46l11j19J07L09M20M47L67J74l3k61m18m39l97k53k2K01
3654g14L73M47M25K83R4j34l26m35m34l35j47O8K71M19M51L69K17Kk23l71m45
3675a45m16k61p3J65L32M41M25L09J30j06k89m05m59l39j81K3K16L98M48L81K35
3696H29M3j97l33m43m04k84j00J19L09M11M29L35J56o0k46m01m17l66k07jK00
3717f28L52M18L96K54P9j53l12m19l99l08j35Q1K70L85M22L38J71pk21l63m14
$$ plain form
3738 -193 -562 -799 -837 -679 -352 57 450 722 820 714 436 51 -345 -643 -806 -759 -526 -154 235 593 778
3759 778 791 620 287 -108 -477 -717 -794 -666 -370 -3 383 663 793 717 464 106 -280 -597 -775 -757 -567
3780 -567 -217 151 514 716 763 611 326 -63 -429 -672 -765 -681 -407 -41 314 618 755 714 493 155 -215
3801 -215 -533 -714 -730 -556 -254 117 445 678 737 622 331 -7 -351 -626 -722 -672 -424 -110 257 538 694
3822 694 684 478 171 -181 -485 -685 -704 -552 -281 69 396 630 693 614 357 27 -292 -554 -674 -628 -414 -102
3844 -102 232 510 661 657 499 201 -116 -422 -620 -664 -548 -278 32 344 561 652 570 356 53 -277 -539 -655
3866 -655 -629 -441 -145 178 462 617 640 484 216 -100 -375 -587 -634 -526 -284 26 333 558 646 579 369 73
3888 73 -232 -491 -617 -600 -428 -142 175 435 592 604 463 209 -99 -381 -579 -638 -538 -306 -1 292 514
$$ packed form
3738a93l69k37l8J58L27M09L93K72R8j06k78l85l96k98j63M7K33L72L89L58J85
3759G78J3j71l33l95l69k40p7J28K96L67L86K80J30p6k53l58l86l17j78J8J90
3780e67L50L68L63K02M7j52k85l89l66k43r3Q4K74L66L55L04J37m1k21l38l70
3801b15l18j81j6J74L02L71L28K33N9j15k91l38l44k75r6N0K48L14L67K81J56
3822F94j0k06l07l52l04k00j9J52K71L50L27K34O3p9k57l30l19k62j20M6K14L12
3844a02L34K78J51mj58k98l17l06j98m4J16K70L10L12K17R1q2k14l03l30k62j16
3866f55K6J88K96L23K84J55K3j56k68l16k75k12m7J08K42L10L07K25Q8o7k10k96
3888G3l05k59j26J7J72K86L17K60J57J2j41k54l08k82j98n9J00K32L05K93K22
$$ plain form
3909 514 622 564 358 77 -233 -480 -611 -596 -434 -158 146 412 590 618 490 242 -68 -355 -546 -606 -521 -293
3931 -293 -2 298 512 616 559 364 89 -220 -467 -608 -600 -449 -189 117 387 558 597 478 235 -69 -348
3952 -348 -548 -617 -552 -337 -31 266 516 617 585 393 111 -192 -439 -588 -603 -453 -180 123 395 573 613 516
3974 516 278 -42 -321 -545 -625 -567 -353 -64 240 486 617 587 401 135 -188 -451 -614 -631 -495 -223 77
3995 77 378 575 634 541 306 -6 -304 -541 -633 -572 -385 -79 223 484 630 631 464 176 -130 -418 -602 -639 -523
4018 -523 -272 47 343 563 644 561 337 30 -278 -533 -667 -634 -439 -134 183 455 620 640 497 226 -86
4039 -86 -393 -599 -659 -553 -318 -1 317 556 667 614 417 104 -215 -495 -634 -634 -462 -188 141 426 624 674
4061 674 533 287 -48 -360 -593 -678 -609 -380 -61 249 521 663 623 447 154 -184 -470 -638 -664 -523 -260
$$ packed form
3909E14J08n8k06k81l10k47j31J5J62K76L04K66J78K8j28k48l10k87j91o0Q5K28
3931b93K91L00K14J04n7j95k75l09k47j41QJ51K60L06K70J71L9j19k43l04k79
3952c48k00o9O5K15L06K97K50J01l2j92k82l03k47j49j5J50K73L03K72J78M0r7
3974E16k38l20k79k24q0N8K14K89L04K46J31l0j86k66l23k63j63j7J36K72L00
3995G7L01J97N9r3k35l12k98k37r2O1J87L06L02K61J46Jj67k88l06k88j84l7J16
4018e23K51L19K96K20Q1q3k24l07l08k55j34L3J95L05L17K72J65K0j43k71l12
4039h6l07k06o0J06K35L17L18K39J11n3j97l13l19k80j39%J72K74L29K85J98N0
4061F74j41k46l35l12k33q5O9K29L19L10K72J42m0j76k93l38k86j68k6J41K63
$$ plain form
4082 -260 76 387 607 678 590 350 27 -289 -540 -654 -630 -420 -115 222 500 664 675 513 217 -108 -412
4103 -412 -615 -669 -576 -325 7 324 560 674 617 397 94 -242 -514 -666 -655 -486 -192 132 443 625 663 540
4125 540 297 -30 -334 -566 -653 -590 -371 -53 256 520 668 647 471 175 -158 -449 -628 -646 -518 -269 55
4146 55 368 575 655 579 350 37 -276 -526 -666 -621 -451 -148 179 459 625 640 494 233 -92 -371 -579 -653
4168 -653 -550 -314 -9 307 546 654 607 407 112 -201 -468 -623 -623 -469 -201 114 388 574 624 522 285
4189 285 -11 -311 -551 -641 -590 -392 -97 205 473 609 605 437 179 -136 -406 -581 -608 -501 -271 39 324 544
4211 544 618 546 352 64 -228 -462 -581 -552 -399 -142 156 409 576 590 472 229 -65 -332 -535 -594 -517 -328
4233 -328 -47 233 454 581 540 379 119 -166 -411 -557 -569 -446 -203 77 340 510 573 486 276 15 -250
$$ packed form
4082b60L36L11K20P1q8k40l23l16k51j14K4K10L05L37K78J64J1j62k96l25l04
4103d12k03n4R3K51L32L17K36J14n7k20l03l36k72j52J1J69K94L24L11J82L8j23
4125E40k43l27l04k32q7O3K19L18L09K64J48k1j76k96l33k91j79j8J28K49L24
4146E5L13K07Q0p6k29l13l13k50j40M5J70L03L27K80J66J5j46k61l25k79k08p4
4168f53J03K36L05L16K39J08m7k00k95l13k67j55%J54K68L15K74J86N0j02k37
4189B85k96l00k40r0N1J98K95L02K68J36mj68k58l15k70j75k7J07K30L10K85K20
4211E44P4p2j94k88k92k34j19K9J53K57K98K53J67J4j18k43k94k67k03n9P7J89
4233c28K81K80K21J27m1j61k60k85k45j46j2J23K43K80K63J70O3q7k10k61k65
$$ plain form
4254 -250 -448 -556 -516 -346 -90 179 404 537 526 409 176 -83 -336 -500 -535 -455 -248 3 259 435 520 477
4276 477 310 62 -195 -408 -526 -513 -383 -163 97 333 479 520 418 221 -20 -254 -434 -495 -437 -278 -35
4297 -35 203 396 489 470 344 130 -121 -326 -453 -476 -376 -179 47 262 414 467 402 238 13 -208 -394 -471
4319 -471 -446 -314 -110 127 309 432 435 338 164 -56 -272 -405 -426 -377 -213 -4 213 368 438 408 267 82 -140
4342 -140 -300 -390 -393 -301 -113 81 266 380 401 327 175 -20 -203 -351 -395 -360 -233 -44 146 302 369 368 236 84
4366 84 -113 -267 -360 -366 -288 -145 44 216 324 353 307 184 17 -146 -285 -342 -312 -218 -50 122 267 342 346 244
4390 244 105 -62 -217 -311 -332 -270 -154 13 164 272 310 278 169 15 -133 -260 -323 -306 -211 -74 77 221 296
4413 296 303 223 109 -41 -171 -258 -289 -242 -126 9 140 258 302 262 177 30 -104 -216 -270 -254 -180 -68 73 188
$$ packed form
4254b50j98j08M0J70K56K69K25J33j1j17k33k59k53j64l5Q0K07K51K56J76Q5m3
4276D77j67k48k57k13j18J3J30K20K60K36J46M1j02j97k41k34j80o1N8J59K43
4297c5K38J93R3j9j26k14k51k05j27k3J00J97K26K15J52N3o5j64k25k21j86p7
4319d71K5J32K04K37J82J23Lr7j74k20k16j33k1M9J64K09K17J55P0l0j41j85k22
4342a40j60r0lR2J88J94J85J14K1p4j52j95j83j48m4L5J27J89J90J56O7jj32j52
4366H4j97j54r3oP8J43J89J72J08K9m6j23j67j63j39n7L0R4J68J72J45P5Mj02
4390B44j39j67j55r4k1O2J16J67J51J08L8l2j09j54j48j27o3J7R5J37J51J44P5
4413B96Pq0j14j50j30q7l1M7J16J35J31J18M4m0q5j47j34j12n4J6P4J12J41J15
$$ plain form
4437 188 256 258 199 93 -41 -165 -251 -277 -225 -129 -11 115 210 248 212 138 17 -105 -193 -235 -224 -173 -38 76 170 240
4463 240 247 184 88 -29 -140 -200 -233 -190 -102 9 121 192 228 204 131 10 -104 -192 -236 -221 -154 -55 55 159 208 205 152
4490 152 61 -45 -150 -221 -218 -179 -97 21 126 196 223 202 122 15 -98 -178 -211 -194 -123 -30 82 170 223 223 168 58 -46
4517 -46 -148 -205 -228 -173 -86 20 114 194 207 176 91 -10 -115 -192 -229 -200 -136 -22 76 172 209 214 152 45 -48 -157 -202
4544 -202 -208 -148 -71 39 146 213 235 191 112 5 -111 -185 -217 -199 -128 -23 89 181 220 208 147 44 -72 -172 -232 -235
4570 -235 -178 -91 35 140 205 226 192 99 0 -120 -205 -238 -211 -122 -21 93 197 244 239 169 60 -55 -163 -228 -243 -171
4596 -171 -102 24 150 218 252 196 129 -3 -120 -227 -260 -240 -165 -54 73 174 242 235 170 71 -56 -176 -241 -269 -210
4621 -210 -111 22 134 221 263 228 163 28 -92 -203 -257 -235 -170 -55 77 193 258 258 204 107 -35 -161 -252 -276 -238
$$ packed form
4437A88O8Kn9j06j34j24q6k6N2R6J18J26R5L8l6p4j21j22q8m2J1N1J35J14R4P0
4463B40Po3r6j17j11o0l3M3Q8J11J12P1L6k4p3j21j14q8m4J5O7R9J10J04M9ln3
4490A52r1j06j05p1LL9Q2J18J05P0K7k1q0j07j13q0l3J7P1R3J12Q8N3%n5j10j04
4517d6j02n7k3N5Q7J06R4Q0J3l1q5j01j05p7l7K9O4J14R8R6L7No2j07r3j09m5
4544b02oO0P7J10J07O7K2m4p9j07j16p4l2J8P1J05J12R2L9j2o1j03j16j00o0l
4570b35N7Q7J26J05O5K1l4r3r9j20q5l3K7Q9J01J14J04M7np0j09j15j08o5j5P2
4596a71O9J26J26O8L4n6o7j32j17j07l3K0P5J11J27J01O8po5r9j27j20o5k8N9
4621b10R9J33J12Q7M2l5o5j35j20j11n4K2O5J15J32J16O5%n4r7j42j26r1k4L8
$$ plain form
4646 -238 -140 -13 122 222 263 245 160 52 -106 -218 -274 -280 -210 -83 55 174 264 285 232 128 -12 -131 -241 -278
4670 -278 -247 -162 -28 118 239 299 287 200 78 -54 -188 -270 -292 -238 -123 19 159 252 286 251 156 11 -129 -247
4694 -247 -302 -279 -211 -65 63 203 278 286 228 107 -29 -177 -261 -289 -242 -149 -7 137 256 308 288 195 62 -78 -213
4719 -213 -278 -293 -215 -95 40 188 267 303 248 140 -3 -150 -273 -317 -284 -201 -55 87 216 289 284 225 92 -66
4743 -66 -192 -296 -299 -244 -131 11 156 264 308 282 188 42 -103 -216 -288 -283 -207 -68 75 201 283 309 245 122 -26
4768 -26 -165 -267 -319 -282 -175 -30 111 235 292 290 200 71 -70 -225 -295 -305 -241 -126 15 169 271 305 272 166
4792 166 24 -106 -235 -292 -270 -188 -54 93 217 299 310 247 121 -25 -163 -257 -290 -256 -154 -19 134 233 289 272
4816 272 188 51 -95 -222 -284 -290 -233 -108 36 166 269 294 248 152 11 -125 -230 -281 -257 -168 -39 94 221 292
$$ packed form
4646b38R8J27J35J00M1j8q5j08j58j12n6oP0J27J38J19R0K1n3j04j40j19j10l7
4670b78L1Q5J34J46J21O0j2q7j22j32j34q2k2N4J15J42J40R3L4l5r5j45j40j18
4694b47n5K3O8J46J28J40P5Qn8j21j36j48q4k8M7R3J42J44J19N2k0r3j33j40j35
4719b13o5j5P8J20J35J48P9L6n5j08j43j47j23m4L3Q3J46J42J29P3nn9j33j58
4743f6j26j04lN5J13J42J45J08M4k6r4j46j45j13p2NP6J39J43J26Q2K6o4j23j48
4768b6j39j02n2L7J07J45J41J24N7kr0j29j41j55p0j0O4J15J41J54J02L4l3j06
4792A66j42j30j29n7K2Q2J34J47J24Q2J1o3j26j46j38r4l3L4J02J35J53R9N6j7
4816B72q4j37j46j27o2oN7J25J44J30J03K5m6r6j41j36j05n1K4Q9J29J33J27P1
$$ plain form
4840 292 290 223 98 -38 -164 -263 -283 -228 -128 16 125 235 283 259 167 30 -97 -216 -286 -274 -206 -91 52 176
4864 176 248 273 219 117 -13 -132 -230 -270 -230 -141 -32 113 205 269 266 191 79 -47 -165 -236 -252 -202 -104 21 140
4889 140 222 257 232 139 31 -105 -209 -258 -255 -167 -66 61 152 229 230 188 87 -34 -165 -220 -237 -220 -129 -13 108 204
4915 204 242 228 148 43 -69 -168 -218 -220 -156 -70 53 150 220 225 181 96 4 -113 -198 -224 -206 -143 -28 72 160 204 202 142
4943 142 48 -57 -155 -205 -217 -178 -91 27 126 187 211 182 114 13 -95 -173 -204 -190 -134 -32 61 172 212 220 160 70 -26
4970 -26 -120 -192 -200 -167 -97 9 96 182 196 171 101 15 -84 -150 -210 -181 -137 -44 59 121 187 187 151 67 -23 -113 -171 -186 -153 -89
5000 -89 8 95 158 199 177 106 27 -58 -139 -173 -174 -121 -42 50 131 183 183 133 66 -14 -107 -159 -185 -159 -94 -1 80 136 176 167 101 23
5032 23 -69 -143 -181 -172 -118 -52 50 136 170 179 159 79 -12 -95 -155 -179 -134 -80 5 88 161 186 161 110 31 -52 -141 -173 -179 -140 -56
$$ packed form
4840B92ko7j25j36j26r9k0N5J00J44J09J10M8k4r2j37j27j19p0J2O8J15J43J24
4864A76P2K5n4j02j30j19r8m0M0Q9J09J45R2O4lp5j12j26j18p1j6N0R8J25J19
4889A40Q2L5k5r3j08j36j04m9LQ8J01J27R1P7Jm2j01j21j31n5j7J7R1J16J21R6
4915B04L8j4q0j05j12r9n0kO4Q6J23R7P0Nm4q5r2j17q5k6J8O3J15J00Q8M4ko0
4943A42r4j05r8n0j2L9Q7J18R9O1K4k9o8j01j08p8l1J4N6J02R3J11M0Qo0r0r6
4970b6r4p2qL3P0J06Q7Q6J4k5p0q6r9o6o0K9M4R3J03O2O6%l6q4r0r0n8j5L3O4
5000h9R7Q7O3M1k2p1p9q5q1l4jN3P9R2Q1N2%n0o7q0r3n2k6K6O5R3Q1N6M0ro6p8
5032B3r2p4l8RN4O6J02Q6L4Rk0q0r1q3o0k4M5N4Q5Q3P3K5k5n1p9q3q9l2oL9Q4
$$ plain form
5063 -56 35 100 163 178 143 74 -6 -97 -152 -177 -158 -104 -13 77 138 185 182 116 55 -45 -109 -166 -164 -111 -48 44 117 174 183 166 96
5094 96 5 -88 -151 -180 -171 -103 -13 65 140 182 165 120 43 -48 -119 -177 -178 -142 -66 25 104 166 183 164 91 4 -83 -147 -178 -155 -97
5125 -97 -13 80 156 192 193 148 62 -29 -119 -160 -171 -145 -66 28 115 176 202 164 95 3 -97 -165 -195 -192 -120 -32 54 126 185 182 140
5156 140 58 -39 -136 -195 -196 -154 -76 19 115 188 196 184 122 33 -63 -163 -182 -174 -127 -46 68 145 191 198 160 71 -24 -118 -201 -211 -192
5187 -192 -107 -10 92 170 205 184 128 32 -75 -160 -211 -209 -162 -71 41 141 209 225 190 120 6 -94 -177 -204 -184 -109 -16
5214 -16 97 190 218 222 160 63 -50 -136 -209 -216 -171 -95 17 130 211 221 195 114 9 -100 -190 -232 -222 -169 -53 63 172
5241 172 222 234 182 88 -29 -139 -217 -245 -205 -101 -3 123 212 254 230 167 61 -78 -170 -227 -224 -170 -85 37 165 226
5267 226 255 215 112 -4 -121 -222 -256 -237 -154 -42 78 180 256 246 190 76 -56 -166 -229 -253 -204 -103 18 138
$$ packed form
5063e6R1O5O3J5l5o9q0r1n5k5J9N4R1R0O1M7lo6o1j00o4n7KN3O3R2P3N7Rj7p0
5094I6r1r3o3k9RO8R0P8P5M2j7m5p7r1p1n8jL6P6R1P9O2J7j9p3q7q7o4l1K3N8
5125i7Q4R3P6L6Jm5q6r1r0m1j1K6P9R4Q7O1K6l8o9r2j00o8l0LP2Q8Q6P2N9lm2
5156A40q2r7r7n9jM2P8R5R6P3Qj2o2q9r6j00j9QM7Q1J14P7M6Pl8q9r5r4q3j0J9
5187a92Q5R7J02P8L5k1n6r6j07q5n1KM7R1J12J00O8J6l5p0j14j00q3k7K0P5R3
5214a6J13R3K8Mo2r7j13q6p3pM5P6J12J13Q1J0k6q1j05j09r0m2J0N3J16J16J09
5241A72N0J2n2r4j17j10p8k8M0J04R8J26Q9M2k4o3j06j39r2n7LN4Q5J22J28O1
5267B26K9m0j03j16j17j01l4J9Q3J12J20J02P6j0n6j14j32j10o3k4M9J01J21J20
$$ plain form
5291 138 233 275 251 160 47 -84 -194 -252 -248 -168 -60 59 184 256 272 236 106 -22 -132 -230 -284 -245 -150 -24 108
5316 108 209 260 254 180 58 -73 -195 -259 -270 -222 -108 22 161 245 290 254 154 19 -105 -212 -276 -259 -176 -54
5340 -54 84 200 278 280 221 95 -39 -164 -241 -289 -244 -145 -17 118 225 279 257 174 48 -80 -204 -286 -287 -228 -110
5365 -110 41 157 256 287 243 144 18 -115 -223 -283 -268 -183 -47 93 217 272 297 225 106 -29 -156 -257 -280 -241
5389 -241 -147 1 133 232 288 269 176 56 -97 -210 -281 -289 -220 -104 35 170 255 277 240 145 6 -129 -237 -275 -259
5414 -259 -165 -48 113 222 287 284 225 95 -32 -160 -256 -272 -235 -126 10 152 243 290 261 170 36 -102 -216 -289
5438 -289 -283 -219 -90 53 179 261 269 234 133 -3 -146 -246 -282 -255 -163 -28 104 233 286 279 207 88 -47 -174 -247
5463 -247 -273 -221 -113 20 151 248 282 266 172 30 -100 -222 -277 -266 -202 -77 52 179 246 271 215 109 -24 -166
$$ packed form
5291A38R5M2k4r1j13j31j10n8MQ0J08J19J25P2J6l6j30j28j10r8n4L9R5J26J32
5316A08J01N1op4j22j31j22o4j1M8J14J30J39Q4M5l6j00j35j24j07o4J7Q3J22
5340e4J38J16P8Kn9j26j34j25p7m8M5R9J28J35J07N4k2q3j26j28j24q2jN9J18
5365a10J51J16R9L1m4r9j26j33j08o0J5Q5J36J40J24N5K5p2j19j35j27j01k3L9
5389b41R4J48J32R9N6j9r3j20j53j13p1qO9J16J39J35Q5K2l7r5j39j35j08l8J6
5414b59R4J17J61J09O5ln9j30j27j28r6j6L7J09J36J42R1M7k9r1j34j38j14p3
5438b89OO4J29J43J26Q2Ql5j01j36j43j00l6K7R2J35J32J29N3pp2j19j35j27p3
5463b47k6N2J08J33J31R7L4j6r4j42j30j22n5J1O4J25J29J27O7K5n6j06j33j42
$$ plain form
5487 -166 -241 -285 -245 -151 -27 105 221 284 265 187 74 -59 -177 -253 -252 -208 -102 44 157 250 274 242 157 19 -103
5512 -103 -217 -274 -247 -179 -65 74 185 251 256 197 95 -40 -159 -247 -276 -228 -139 -5 112 207 256 236 163 56 -68
5537 -68 -181 -237 -257 -195 -82 35 162 237 268 230 136 11 -109 -199 -246 -240 -156 -50 81 191 247 245 191 75 -61 -165
5563 -165 -251 -260 -218 -121 2 109 205 246 222 158 48 -76 -187 -234 -234 -174 -83 43 157 243 250 208 120 7 -103 -200 -231
5590 -231 -218 -129 -28 81 181 242 227 163 75 -44 -160 -228 -238 -200 -113 -4 112 190 222 187 120 22 -88 -184 -222 -214
5616 -214 -156 -54 54 161 210 222 181 95 -14 -117 -190 -214 -187 -105 -4 104 184 222 206 149 51 -60 -152 -201 -207 -157
5642 -157 -88 26 122 180 201 167 93 -9 -99 -174 -214 -198 -127 -39 62 147 200 193 156 65 -15 -118 -176 -197 -154 -86 17 123
5670 123 171 207 178 129 24 -50 -138 -181 -182 -127 -57 45 116 163 178 134 66 -19 -98 -164 -188 -166 -97 -11 66 131 167 152 106
$$ packed form
5487a66p5m4M0R4J24J32J16O3j9p8j13j33j18p6JM4J06J46J13R3K4l2q5j38j22
5512a03j14n7K7O8J14J39J11O6Nn9j02j35j19q8k9M8Q9J34J17R5M9k0p3j07j24
5537f8j13n6k0O2J13J17J27P5L1l8r4j25j20r0m7OQ4J06J31J10N6kn4j16j36j04
5563a65q6rM2R7J23J07R6M1k4o4j10j24j11m7%O0R1J26J14Q6Pm2q8j13j10r7l1
5590b31J3Q9J01J09J00O1j5o4q8j19j16o8j0L8Q7J09J16P8L2l5o7r8j10r6l8Q
5616b14N8J02J08J07M9J2m1q6j09j03p3k4K7Q2J01J08Q0L8j6n7r8j11r2m9oN0
5642a57O9J14R6N8K1l4p4j02r0p5m0J6P1Q8J01Q5N3pl7r1q0j03n8k1M3O8J03J06
5670A23M8L6k9m9j05p4q8m3jN5P0J02P1M7J5m4o8q5p9o6k4K2O9Q6P7O5L6j5m6
$$ plain form
5699 106 37 -57 -127 -150 -154 -122 -44 33 111 156 174 147 84 10 -71 -125 -153 -126 -81 -5 76 130 146 147 96 23 -54 -122 -172 -162 -112
5730 -112 -70 10 94 131 139 114 58 -17 -87 -127 -149 -129 -90 -8 49 113 147 149 108 43 -30 -93 -129 -135 -95 -43 30 92 136 159 126
5761 126 73 -9 -69 -122 -155 -135 -77 -20 47 106 140 129 81 24 -50 -113 -141 -145 -109 -55 17 85 140 145 117 70 8 -66 -115 -128 -126
5792 -126 -76 -4 65 121 147 141 100 43 -31 -97 -138 -158 -105 -54 20 97 133 141 114 58 5 -96 -137 -151 -147 -96 -21 50 123 145 139
5823 139 96 38 -38 -102 -146 -149 -111 -61 33 107 161 161 147 87 12 -56 -124 -149 -131 -93 -26 47 120 158 148 111 45 -38 -116 -159 -162
5854 -162 -146 -82 -4 74 130 157 146 81 16 -65 -129 -171 -158 -117 -44 50 115 160 171 144 72 -6 -84 -145 -157 -143 -79 -1 86 144
5884 144 168 168 105 32 -57 -128 -158 -173 -129 -62 24 102 150 166 144 69 -21 -97 -165 -180 -163 -98 -31 57 137 164 173 132 52 -28 -112
5915 -112 -161 -174 -132 -65 18 105 170 194 160 111 8 -60 -140 -166 -165 -127 -45 49 117 166 186 142 65 -32 -118 -184 -189 -155 -94 -3
$$ packed form
5699A06o9r4p0k3mL2P8P7P8M5J8k7o3p4q1n4k8K7M5P6Q1N4J6Jn1p3p7o8n0J0N0
5730a12M2Q0Q4L7Qk5n6p5p0m0k2K0L9Q2N7O4L4Km1o5p3o3l6oM0N2P3O2M4K3l3
5761A26n3q2o0n3l3K0N8N7O7N9L4j1m8n7p4o3k8mL6N4P2O8N5Nk8m7o2p4m9j3K
5792a26N0P2O9N6K6om1n7p4o6m1k0N3N1P4P7L6Qk7n6n3j01m1j4MN1P5P1P3K2o
5823A39m3n8p6o4m4lL8N0R4P4N4%j4o0p5o8o8k5J8L8O7P3P3L8j0l7o6q3p8m3l
5854a62J6O4P8P8N6K7j1o5o5q1o4m2J3M1P3R4O5M5J1k7p2p8p8o1j2J4O4P8Q7N8
5884A44K4%o3p3q9p1l0j5M4O7Q6P8M8J6k2p5r0p6o8j5J7O5O7Q8Q0K7Rm1q0q0q4
5915a12m9j3M2O7Q3Q7O5K4l4m9j03o8q0k6JL8Q2R4O8M9K0m4p7r7q6o6nL4O1R1
$$ plain form
5945 -3 82 160 186 174 116 36 -61 -141 -181 -182 -136 -55 51 125 192 211 178 99 10 -94 -151 -189 -165 -111 -29 55 145 188 184 134 54
5976 54 -35 -112 -194 -215 -170 -93 9 78 152 188 174 106 16 -67 -153 -196 -189 -133 -51 42 134 193 194 174 91 -5 -99 -169 -200 -167 -104
6007 -104 -10 69 168 199 193 133 50 -49 -142 -196 -198 -176 -91 4 102 171 187 171 113 16 -90 -161 -214 -198 -140 -62 50 132 203 202
6037 202 165 86 -16 -106 -184 -204 -173 -104 -12 84 166 195 199 150 52 -43 -126 -196 -212 -167 -90 16 102 175 195 170 104 8 -98
6066 -98 -171 -211 -212 -146 -63 48 138 189 200 169 76 -14 -103 -174 -200 -170 -110 -10 91 166 214 207 145 59 -43 -120 -179 -198 -162
6095 -162 -82 8 110 174 204 175 108 17 -92 -168 -202 -204 -146 -56 43 118 177 185 143 86 -3 -108 -176 -190 -172 -101 -1 78 157
6124 157 200 201 145 62 -33 -112 -178 -195 -153 -71 24 106 165 186 167 109 15 -77 -150 -183 -193 -142 -63 26 109 159 177 137 75 -13
6154 -13 -94 -156 -169 -176 -106 -26 67 138 182 177 135 63 -28 -101 -153 -169 -141 -88 -1 90 150 176 163 106 27 -38 -127 -170 -155 -129 -66
$$ packed form
5945cQ5P8K6j2n8q0r7q0m0jM6Q1J06P4O7J9l3p9q9j04n7l8K4N4Q2Q4R0M3mn0q0
5976E4q9p7q2k1M5P7J02O9P4L6j4o8r0q3q6m3PN6Q2R3R2N9Jk0q3r6r4p0l1L3O3
6007a04R4P9R9L1oo0q3r9r3n4kK2Q5R5R8O9J6j6n8r7j06p1n3J6N8P8J12Q2P1j
6037B02l7p9j02r0p8k0L1O9R2R6Q2K9Mm9r8r5q3p0j6M5P7J06Q6P3K0k5o6r6j06
6066i8p3m0jO6Q3J11R0N1J1l1r3r0q9p1k6L0O0J00J01P5M8po2q6j02p7n9j9L6
6095a62Q0R0J02O4L0k9o7r1j09p6l4kN8R0R9P5N9Qm2n7q9j05o8j4J8P1J00P9P9
6124A57M3Jn6q3r5p9o6j7M2Q2R5Q2N9K1j9n8r4r2p3l3j0N1P9Q9Q3N0J8m0o2q8
6154a3q1o2j3pP0Q0R3P1M4nm2p2r1p3n2j6K8N3Q7R1O0K6j3n7p9o5q9m3J5K6O3
$$ plain form
6185 -66 13 97 146 147 127 75 -7 -88 -143 -160 -146 -100 -32 45 118 158 157 116 65 -10 -86 -120 -152 -113 -64 14 74 127 154 145 97 28
6217 28 -32 -99 -137 -150 -107 -47 17 87 129 129 117 58 -2 -73 -118 -150 -132 -96 -36 31 96 122 139 114 55 -10 -75 -107 -131 -109 -65
6248 -65 -3 54 109 135 124 90 38 -18 -79 -102 -110 -81 -45 6 64 98 107 94 52 13 -39 -87 -112 -106 -89 -39 10 66 88 111 87 51
6280 51 -4 -51 -87 -108 -101 -64 -24 44 81 104 102 87 47 -11 -48 -72 -85 -61 -45 12 45 78 95 86 58 16 -32 -72 -90 -96 -79 -47
6312 -47 1 40 75 75 65 35 -2 -37 -72 -85 -80 -57 -28 20 54 74 76 71 36 8 -32 -54 -61 -59 -40 12 28 56 73 70 61 35 -6 -39
6346 -39 -63 -68 -70 -44 -13 15 37 45 49 44 13 -30 -46 -64 -77 -66 -30 -14 24 50 63 48 36 27 -11 -25 -36 -50 -51 -14 5 34 51 58
6380 58 59 39 22 -16 -29 -40 -50 -38 -30 -1 25 36 42 37 21 11 -21 -44 -52 -59 -41 -14 -7 17 42 43 45 32 10 -9 -26 -34 -35 -22 -9 10
6416 10 37 52 56 50 35 27 2 -22 -41 -44 -30 -10 9 14 34 40 44 26 0 -11 -36 -43 -51 -41 -26 1 15 26 47 43 27 11 -9 -33 -33 -38
$$ packed form
6185f6P9Q4M9Jk0n2q2q1n5j7J4M6O8P7P3M0jm1n1p5p6l4l2L9M9P8O0N3K7rm8o9
6217B8o0o7l8j3M3O0O4P0M2%j2n9o0p1m5l2J8L6O0O7O5K6J7k5n9o5o5l2k4K2M4
6248f5O2N7N5K6j1l4n2n6o1k3qK9L6N1N8L4Rj3m2l9n2m8k5OJ7N0M9N6K2K3k4l6
6280E1n5m7l6k1PL7M0O8L7K3kj5m0n8l7k4j3K4J6N7L3L3J7rk8m2m8m0j8oJ7L2
6312d7M8L9L5%j0l0l7l5l5j3NK3K9M8L4K0Knl5k8m0k2pKJ9N2J6K8J7lrk6m1l3
6346c9k4nkK6L1K8K2QMnl1m3j6j8j3J1L6J6L8K6J3j5j2rl8j4j1j4jL7J9K9J7P
6380E8Jk0j7l8j3j1j0J2QK9K6J1Onj6j0l2k3qpJ8K7PK4K5JKj3k2j9j7qjJ3J3J9
6416A0K7J5Moj5qk5k4j9lJ4K0J9NK0OMj8k6j1k5pqJ0J5K7J4J1K1mj6j6k0k4%n
$$ plain form
6452 -38 -19 -14 4 31 36 56 41 29 11 -8 -16 -32 -35 -28 -12 8 24 32 37 41 26 10 -15 -43 -55 -53 -46 -25 6 14 32 48 39 13 7 -23 -33
6489 -33 -36 -36 -27 -20 20 25 53 54 46 35 11 -5 -40 -42 -42 -29 -5 18 38 46 61 49 20 -1 -22 -46 -49 -58 -37 -24 1 29 41 44 40 16 -25
6526 -25 -32 -48 -58 -42 -29 -7 15 39 52 57 43 23 -8 -25 -34 -37 -35 -20 6 36 56 56 52 37 7 -12 -39 -56 -55 -38 -20 -4 29 46
6560 46 40 40 19 -7 -23 -53 -67 -60 -53 -24 -4 31 50 43 54 32 4 -22 -35 -43 -37 -25 -4 28 48 62 54 40 18 2 -21 -51 -49 -41 -27
6595 -27 5 30 37 37 42 28 7 -25 -52 -62 -62 -38 -20 -4 29 42 55 47 34 0 -26 -35 -46 -38 -16 0 14 42 55 59 42 30 7 -21
6629 -21 -38 -33 -23 -33 3 24 31 42 31 9 2 -24 -44 -42 -55 -31 -17 -7 15 34 29 23 9 -10 -23 -29 -38 -30 -17 -3 15 40 38 38 26 15
6665 15 8 -18 -29 -18 -19 -10 9 35 42 34 32 19 7 -9 -28 -41 -29 -29 -12 6 17 32 18 6 -4 -23 -32 -32 -31 -27 -17 5 24 29 39 30 14
6702 14 8 -11 -11 -12 -7 -4 18 12 32 41 26 15 6 -12 -25 -31 -16 -16 1 4 28 19 16 0 -7 -14 -42 -26 -16 -26 -7 7 14 19 7 9 -1 -4 -19 -13
$$ packed form
6452c8J9NJ8K7NK0j5j2j8j9qj6lPJ6K0J6QNMj5j6k5k8j2KPK1L1QJ8J6rk6ol0j0
6489c3l%RPM0NK8Jqj1k4j6l5k%J3K4K3K0QJ5j2k9k1k1k4lrK1J3K5K8J2Lmk4m1
6526b5pj6j0J6J3K2K2K4J3Nj4k0l1j7rlKJ5K6L0K0%mj5l0j9k7j7JJ7J8J6L3J7
6560D6o%k1k6j6l0j4PPK9K0L5J9pJ1k2k8k6j3qOJ2K1L2K0J4qj4k2j6k3l0KQJ4
6595b7L2K5P%Nj4k1l2k7j0%K4J8J6L3J3J3qj3l4k6rj1QK2J6J4K8J3Mj7j2k3k8
6629b1j7NJ0j0L6K1PJ1j1k2pk6k0Kj3K4J4J0K2J9noj4j9j3orQJ3J4J8K5k%j2j1
6665A5pk6j1J1jRJ9K6Pqkj3j2j6j9j3J2%J7J8J1J5j4j2j0j9r%JMJ0K2J9NJ0rj6
6702A4oj9%jNLK2oK0Rj5j1rj8j3oJ5%J7LK4rlj6ppk8J6J0j0J9J4PNj2Kj0lj5O
$$ plain form
6742 -13 -18 0 1 15 34 35 24 21 3 1 -11 -18 -13 -11 5 16 24 21 22 16 10 -4 -25 -37 -41 -37 -24 -3 18 27 36 15 7 -15 -30 -45 -51 -35 -18 1
6782 1 21 31 46 56 39 1 -2 -30 -25 -43 -32 -8 12 41 54 61 47 36 -4 -26 -54 -59 -53 -32 -13 15 29 52 38 32 7 -30 -48 -76
6816 -76 -70 -52 -27 -6 29 45 54 61 41 4 -30 -45 -61 -54 -35 -8 35 60 83 81 68 30 6 -50 -68 -70 -66 -41 -2 45 65 78 73 48
6850 48 9 -43 -78 -94 -99 -75 -31 5 53 67 81 68 35 3 -54 -86 -100 -93 -63 -16 29 83 103 104 79 33 -14 -60 -94 -104 -88 -54
6882 -54 -6 48 96 105 94 71 4 -40 -92 -111 -119 -94 -49 9 65 103 114 101 58 -7 -60 -102 -118 -117 -81 -19 42 92 132 125 102 49
6914 49 -11 -66 -112 -127 -102 -54 -1 71 120 145 125 76 24 -45 -107 -148 -143 -114 -50 18 79 122 132 108 51 -2 -83 -130 -151 -129 -92
6945 -92 -37 47 117 146 146 134 59 -16 -86 -133 -148 -114 -58 9 86 147 164 150 104 48 -38 -109 -147 -145 -122 -69 35 100 147 171 140
6976 140 84 5 -79 -143 -167 -161 -110 -46 41 125 165 164 127 64 -13 -90 -149 -160 -137 -80 -4 87 149 181 164 120 52 -36 -111 -156 -165
$$ packed form
6742a3nJ8JJ4J9Jj1lj8kj2pNKJ6J1QlJooj4k1j2mMJ3K1K1RRk1qk2j5j5oJ6J7J9
6782AK0J0J5J0j7l8lk8Nj8J1K4K0K9J3Pj4j1m0k2k8nOK1J9K8J4K3j4ok5l7j8k8
6816g6OJ8K5K1L5J6RPk0l7l4j5j6PJ9K7M3K5K3kj3l8k4n6j8kMK5L9M7K0J3nk5
6850D8l9n2l5j6nK4M4L6M8J4J4j3l3l2n7l2j4PL0M7M5N4K0Jk5m6m7m6l4j0J6L4
6882e4M8N4M8Rj1k3o7m4n2j9qK5M5N8N6L8J1j3m3o5n3m2j6JL6O2O1N0M0pk3n3
6914D9o0n5m6j5K5M8N3P2M9K5k0m9n2o9o2m1NK9O4O8O1M3J0k4n7n3q1m7k1K2L7
6945i2N5Q4P0K9%j2p5p5p0m7j5L4N6O7P7O1J7j4m6n6q6p1l8KK3N3J04O5M7K4l1
6976A40n6p9q4o4k4ON1O4Q7Q4M0jl7o3p7p7n9j1K3N7P6R1O2L2j7m4o8q8p5m5r
$$ plain form
7007 -165 -140 -56 5 106 161 180 161 97 11 -85 -155 -183 -174 -121 -57 54 119 169 177 140 60 -27 -101 -163 -182 -153 -96 -15 92
7036 92 155 197 178 133 53 -44 -127 -168 -183 -131 -61 19 107 169 186 155 93 8 -89 -149 -188 -190 -136 -57 44 118 178 195 144 78
7066 78 -26 -112 -180 -210 -170 -112 -18 83 162 207 195 139 48 -36 -129 -184 -178 -144 -69 31 114 185 209 176 113 20 -75 -152 -195
7095 -195 -194 -138 -49 46 129 187 193 157 83 -21 -115 -181 -208 -170 -108 -23 71 153 196 187 141 61 -31 -130 -179 -189 -149 -66 30 109 184
7126 184 205 179 113 29 -66 -156 -198 -182 -133 -51 46 134 168 191 154 70 -1 -118 -182 -207 -176 -110 -25 65 159 192 180 135 53
7155 53 -36 -130 -176 -194 -151 -68 19 123 189 207 184 117 26 -72 -154 -193 -180 -128 -43 48 128 187 196 149 79 -11 -110 -182 -213 -173
7185 -173 -104 -28 64 145 187 179 130 43 -48 -127 -174 -191 -153 -72 29 108 172 201 176 114 38 -68 -125 -177 -163 -115 -42 56 126
7214 126 179 182 150 69 -3 -89 -159 -191 -159 -105 -19 62 131 170 160 130 41 -41 -123 -179 -181 -142 -75 15 92 158 181 154 98 17 -62
$$ packed form
7007a65K5Q4O1J01N5J9j9o4q6r6p0k8RN3O4J11O5N0Ql7q0q7p4o2j9K9N7Q1J07
7036I2O3M2j9m5q0r7q3m1j5N2P0Q0Q8O2J7l1o2q5r7o0l9kN4P9J01P4O0J7n1o6
7066G8j04q6o8l0M0N8R4J01P9M5j2n6r1q4r3n5OL4P5J00Q3P1K4l3o3r3r5p7m3
7095a95JN6Q9R5Q3N8Ol6p4j04r4o6k7L8O2Q5R4Q2M3rm6q0r2r9m9j0M0Q3R6P9P5
7126A84K1k6o6q4r5r0m2J6M9Q2R7Q8L4K3l7q4p1j17o4k5L1O6Q5R0R4L3j2m5q2
7155E3q9r4m6j8M3Q3Q7J04O6J8k3o7r1r8q2l9J3N2Q5R1Q0N9Rm7p0r0r9p2l1M0
7185a73O9P6R2Q1M2qm9q7r1p9m7j7L8Q1J01P9O4K9k5o2p6j06n7n2J4M8P3R8P0
7214A26N3Ll2q1p2q6p0l2L2N4Q6Q1O9L9j0l0q9q2q2n6kL9O7R0P7O6K3k7n6q1p9
$$ plain form
7245 -62 -128 -162 -169 -107 -37 52 129 176 181 141 76 -16 -103 -157 -163 -141 -78 -16 78 145 164 152 98 34 -55 -113 -168 -178 -124 -67 10 94
7277 94 154 172 149 83 8 -65 -129 -147 -132 -86 -17 61 115 163 168 123 68 -18 -88 -133 -151 -126 -73 -3 73 120 148 136 90 14 -54
7308 -54 -109 -152 -149 -116 -48 17 83 135 141 104 66 -13 -70 -120 -142 -120 -71 -6 54 118 138 140 110 35 -25 -74 -126 -120 -96 -53 7 63
7340 63 121 129 114 62 2 -67 -110 -137 -124 -95 -37 39 82 118 108 91 42 -32 -77 -112 -129 -107 -70 7 61 107 131 108 68 19 -45
7371 -45 -88 -102 -108 -69 -25 17 80 121 122 106 56 -9 -66 -102 -116 -109 -77 -16 38 87 107 93 63 15 -41 -92 -114 -115 -93 -36 18 64
7403 64 98 120 86 63 -11 -58 -87 -115 -92 -58 -2 53 81 124 109 76 34 -21 -69 -93 -91 -75 -34 17 67 90 95 77 34 -23 -66
7434 -66 -95 -112 -107 -59 -20 22 64 83 90 58 20 -27 -69 -97 -100 -65 -30 23 77 93 109 95 67 9 -38 -75 -98 -85 -54 -15 33 81
7466 81 93 91 62 19 -31 -88 -108 -109 -80 -44 0 54 75 88 77 44 -14 -58 -88 -98 -91 -51 2 30 71 108 109 80 29 -17 -57 -89
$$ packed form
7245f2o6l4pO2P0Q9P7M7Nm0o5r2q7n4oK2O3O2R4O7J9j2n4o4q9n8n5j0N4N7P7Q4
7277I4O0J8k3o6p5p3o4j8J5M6O9P8N4M8Nm5n5q6p0m5j8K5N3P0P6M7K8j2m6p6o8
7308e4n5m3LL3O8O5O6N2Ol7l8p9n7n0k2K2M9O5O0O4K0Kl0p5o0m9n2OK4M3O0N6
7340F3N8Qj5n2o0o9m3k7J3K9N8P6M3L6j0j7m9p4m5l5j7K2L7P7N4M6K4k3m0m9o4
7371d5m3j4oL9M4M2O3M1Jj6n0o5n7l6j4PL2O1N4M9K0j4l0m8n6n1k2jK2N7N4M6
7403F4L4K2l4k3p4m7k9k8K3L4N6N5K8M3j5l3m2n5m8k4KJ6M1N1N0K3Nj8m3n7m3
7434f6k9j7NM8L9M2M2J9Pl2l8m7m2k8lL5L5N3N4J6J6j4k8n8m7l7k3J3L1L9M8M8
7466H1J2kk9m3n0n7k0jK9L6M4N4K1J3j1l3n8m4l0j0PM0N3K8M1L7Jk9n1m6m0l2
$$ plain form
7498 -89 -96 -70 -29 15 54 92 105 107 61 9 -44 -95 -106 -98 -62 -27 20 61 99 91 64 28 -14 -76 -106 -111 -93 -38 14 57 92 101 92 64
7532 64 13 -39 -84 -115 -92 -69 -24 40 83 112 108 90 44 -12 -62 -93 -114 -97 -65 9 48 87 107 105 70 14 -45 -110 -135 -117 -96
7563 -96 -47 12 64 108 120 100 45 -2 -77 -112 -126 -89 -49 -9 47 102 133 131 96 35 -14 -70 -118 -124 -106 -55 23 74 115 132 106
7594 106 69 -4 -56 -119 -141 -135 -92 -37 37 84 119 119 91 30 -19 -78 -128 -138 -117 -64 -2 59 114 152 127 86 28 -34 -83 -127 -132
7625 -132 -97 -43 16 83 124 133 113 62 -12 -72 -134 -149 -145 -86 -29 38 98 124 120 91 37 -38 -97 -155 -157 -122 -71 4 71 125 141 128
7657 128 87 21 -49 -109 -136 -136 -102 -38 41 92 138 151 125 78 2 -82 -132 -155 -138 -102 -22 50 109 147 136 102 40 -46 -110 -156
7687 -156 -161 -136 -72 7 71 123 154 138 98 18 -54 -120 -156 -143 -103 -37 44 112 154 163 127 78 0 -84 -128 -138 -133 -89 -15 60 118
7718 118 143 144 104 45 -43 -119 -167 -164 -139 -81 5 76 131 150 135 76 16 -56 -119 -164 -150 -102 -38 39 112 167 171 125 76 1 -73
$$ packed form
7498h9pK6M1M4L9L8J3Km6n2n3n1j1QL6L5M7M1L8qk7l6m2o2l0nJ8N5N2M3L5Rrk8
7532F4n1n2m5l1K3K3M5O4M3K9mj8m6n6n0l1k1J7L2P4L9L9K0kl5n6n9o5k5J8K1
7563i6M9N9N2M4J2k0n5m7p5l5j4L7M0M0N6N5L1kl5o1m9n6m8oJ8N1P8N1M1J7k6
7594A06l7p3n2o3k2OM3N5P4M7L5%k8o1m9n9n0j0K1N3O2O1N5L8k5m1n8o2m9m4n
7625a32L5N4N9O7M1Rk0n1p4o0o2j5MN9N7O7O0K6mk9n4p5n9n8kL5N1P5O7N4J6j3
7657A28m1o6p0o0k7%L4O4P9N1M6J3k6m7p6q4n0k3J7L6Q0P2N9L8j1l4o2q6o4m6
7687a56nK5O4P9O4N2L1j6m0q0p2o6l6J3M0O6Q1O8M2Rl6m9p8q4m4j0NM4P4P5N8
7718A18K5Jm0n9q8p6m8LK5N8Q6P1N5J9j5n9o0p2o3m5J4M8O4P7P3N5Mm6m9p5p4
$$ plain form
7749 -73 -134 -156 -138 -92 -16 57 128 160 146 113 52 -38 -106 -149 -172 -138 -87 3 77 132 155 136 80 9 -64 -135 -153 -153 -116 -52 39
7780 39 105 154 170 139 82 6 -59 -130 -147 -129 -82 -12 67 123 167 153 105 46 -29 -99 -154 -175 -144 -80 -3 71 135 149 140 94 10
7811 10 -60 -130 -161 -167 -120 -57 29 98 138 152 125 71 2 -81 -130 -148 -140 -78 -10 70 128 157 159 124 57 -24 -92 -144 -155 -130 -77 -4
7843 -4 68 125 151 132 90 18 -70 -125 -169 -153 -129 -58 22 91 133 153 115 69 -4 -71 -127 -146 -131 -96 -21 53 119 158 146 112 50
7874 50 -22 -95 -137 -142 -132 -60 1 69 119 141 139 94 19 -50 -119 -150 -157 -118 -63 4 84 130 142 113 59 -5 -80 -115 -149 -134 -92 -23
7906 -23 51 112 141 147 125 55 -9 -70 -116 -141 -117 -66 -2 73 112 140 127 89 24 -45 -103 -136 -145 -114 -52 11 73 111 130 115 65
7937 65 2 -74 -113 -133 -125 -87 -25 34 94 126 135 98 46 -22 -62 -98 -124 -105 -54 7 65 118 136 126 87 27 -44 -95 -131 -128 -105 -58
7969 -58 5 57 104 113 97 41 11 -60 -114 -133 -106 -74 -31 39 85 112 119 96 45 -22 -74 -111 -110 -91 -47 2 54 98 116 107 76 32
$$ packed form
7749g3o1k2J8M6P6P3P1L2j4l3o1r0o8m3k3L4N1R0P4N5K3j9n6p1p3p1j8%L7O4R1
7780C9O6M9J6l1n7p6o5p1j7J8M7P0P9N6M4j4m8n9p5p0n5k1L1O4P7P4O4J4rm6q4
7811A0p0p0l1oM7O3Q6O9M0J4k7n4o9q3m9j8QO2O8Q0N8K9Kl5o7q1o8n2j1K5N3P3
7843dP2N7K6j9m2p2q8n5m4J6K4P1Q0O9M2K0l8m6p3o7n6j9J5L5P5P4O6L9j2l4o2
7874E0p2p3m2nJ0P2O1O8N0K2km5p5o9o9l1pL9N5O7Q0M6J2k9n4o4p5l5l4J5M2O9
7906b3P4O1K9Ok2p0o4o1m6k5K4N1O4P5L9K8j3l8o5o9n8l3rL1O2O3O2L8J9j5n0
7937F5o3p6l9k0QL8O2N9O0L2Rl7n2o8m0l6k6J9N1O1N8N3J8j0l9o0p1n1l6LK3M7
7969e8O3N2M7Rj6n6l0p1n4j9K7L2M3P0M6K7Pk3n1o7n2l7JJ9M4M9N2M4J8rl1m4
$$ plain form
8001 32 -26 -82 -106 -115 -85 -41 11 70 95 95 82 45 -7 -53 -104 -128 -109 -78 -35 15 63 91 97 77 31 -23 -70 -105 -109 -86 -44 14
8033 14 54 81 110 100 72 20 -30 -78 -99 -99 -73 -25 17 71 97 90 76 35 -12 -60 -85 -112 -102 -65 -31 22 59 82 83 63 15 -24
8065 -24 -68 -93 -99 -79 -37 19 57 93 101 88 60 11 -23 -71 -71 -89 -49 -6 29 70 88 82 75 29 -19 -69 -96 -94 -86 -48 -14 22 52 69
8099 69 75 51 4 -36 -61 -85 -88 -65 -30 15 50 77 78 63 45 5 -33 -66 -74 -62 -45 0 35 63 75 85 56 24 -9 -41 -76 -75 -58
8132 -58 -38 2 28 65 72 61 28 -19 -43 -72 -81 -80 -53 -34 14 56 68 61 43 21 -8 -43 -71 -76 -56 -23 11 42 63 70 78 48 21 -18
8166 -18 -43 -68 -62 -47 -10 33 46 71 72 51 20 -4 -41 -66 -66 -75 -41 -6 17 53 63 59 34 13 -35
$$ packed form
8001C2n8n6k4rL0M4N2N9K5%j3l7n2m6n1k4J9L1M3N0M8K8Ok0m6n4m7l5mK3M2N8
8033A4M0K7K9j0k8n2n0m8k1%K6M8M2N4K6pj4m1m7m8k5k7J0L7L4N3L7K3Jk0m8l9
8065b4m4k5oK0M2N6L8L6Qj3k8m9l4m8%j8M0M3L5M1J8opm6m8n0k7KQL8L4L6L0J7
8099F9Ok4m7m0k5k4lK3L5M5L5K7Jj5j8m0l8l3qJ2J7M5L5K8J2J0k9l2l3l2l5JJ7
8132e8K0M0K6L7Pj1l3m7k4k9rJK7J9M8M2J2pj8k2k9l5k8nK0L3L4L1K1PQl0k7l9
8166a8k5k5OJ5L7M3J3K5Jk1l1k4l7k5%rL4L5K3L6J0mk5k1m8
8191c5
$$ Imaginary data points
##PAGE= N=2
##DATA TABLE= (X++(I..I)), XYDATA
$$ plain form
0 0 0 0 0 0 0 0 0 0 0 0 0 0 0 0 0 0 0 0 0 0 0 0 0 0 0 0 0 0 0 0 4 -4 4 -4 4 -8 8 -8 9 -10 12 -12 12 -13 19 -20 21 -24 24 -28
50 -28 32 -33 40 -40 45 -51 55 -62 66 -75 80 -90 99 -110 120 -125 114 -35 -427 6950 97991 189993
72 189993 232798 222607 159014 59860 -52701 -150460 -212146 -222413 -180817 -97132 7365 108662
84 108662 181992 211652 190467 125325 31498 -67644 -149091 -193798 -191873 -144568 -63808 30554
96 30554 116227 172727 187398 157109 89985 2438 -84472 -149645 -178485 -163946 -110735 -31597
108 -31597 53604 124855 165057 165073 125638 56676 -24517 -98657 -147645 -160537 -134617 -77041 -1982
121 -1982 72003 127311 151082 138055 92324 25149 -46459 -105784 -138329 -137199 -103052 -44806
133 -44806 23090 84314 123996 133340 110279 61144 -2050 -63592 -109038 -127409 -114761 -74583
$$ packed form
0@%%%%%%%%%%%%%%%%%%%%%%%%%%%%%%MqQqQj2J6j6J7j9K2k4K4k5L2l9M1m5M8n2
50b8O0o5P3q0Q5r6J06j17J28j41J55j70J89k09K30k45K39j49l92P377R1041R2002
72A89993M2805j0191o3593r9154j12561r7759o1686j0267M1596Q3685J04497J01297
84A08662P3330K9660k1185o5142r3827r9142q1447m4707J925M7305Q0760R4362
96C0554Q5673N6500J4671l0289o7124q7547q6910o5173k8840J4539N3211P9138
108c1597Q5201P1251M0202J6l9435o8962q1193p4140m8988j2892K5920N7576P5059
121a982P3985N5308K3771j3027m5731o7175p1608n9325l2545J130L4147N8246
133d4806O7896O1224L9682R344k3061m9135o3194o1542m5446j8371J2648M0178
$$ plain form
145 -74583 -16895 43950 93555 119677 116656 85285 33787 -25302 -77447 -110174 -115810 -93197
157 -93197 -48387 7605 60790 98742 111975 98014 60394 8754 -44167 -85701 -105633 -99832
169 -99832 -69747 -23316 28062 71750 97496 99083 76647 35953 -12859 -57739 -88170 -96512
181 -96512 -81535 -46800 -1266 44012 78061 92685 84678 56058 14219 -30628 -67471 -87660
193 -87660 -86112 -63760 -26035 17547 56383 81153 85738 69561 36457 -5012 -44867 -73269
205 -73269 -83556 -73318 -45364 -6744 33015 64219 79489 75009 52539 17411 -21327 -54464
217 -54464 -73842 -74958 -57885 -26811 10216 44359 67201 73438 61598 34970 116 -34305
229 -34305 -59997 -70754 -64028 -41875 -9624 24447 52342 67042 65274 47521 18317 -14957
$$ packed form
145g4583N7688O0845M9605K6122l021l1371n1498n9089n2145l2727n636K2613
157i3197M4810N5992N3185L7952J3233j3961l7620n1640n2921m1534j9932N801
169i9832L0085M6431N1378M3688K5746J587k2436m0694m8812m4880l0431q342
181i6512J4977L4735M5534M5278L4049J4624q007k8620m1839m4847l6843k0189
193h7660J548K2352L7725M3582L8836K4770M585j6177l3104m1469l9855k8402
205g3269j0287J0238K7954L8620L9759L1204J5270m480k2470l5128l8738l3137
217e4464j9378j116J7073L1074L7027L4143K2842O237j1840k6628l4854l4421
229c4305k5692j0757O726K2153L2251L4071K7895J4700j768j7753k9204l3274
$$ plain form
241 -14957 -44337 -62519 -65300 -51954 -26154 5861 36036 57181 64035 55169 32905 2757 -27635
254 -27635 -51110 -61693 -57160 -38551 -10795 19337 44467 58448 57973 43252 18160 -11200 -37450
267 -37450 -54426 -57779 -47042 -24780 3279 30289 49749 56739 49870 30692 4290 -23043 -44515
280 -44515 -54951 -51818 -36009 -11488 15657 38756 52295 52825 40504 18223 -8229 -32577 -48778
293 -48778 -52902 -44103 -24489 896 25955 44454 52013 46737 30132 6211 -18962 -39405 -50083
306 -50083 -48384 -34960 -12983 11844 33741 47172 49025 38876 19296 -4796 -27583 -43467
318 -43467 -48641 -41872 -25002 -2082 21051 38995 47237 43887 29892 8656 -14416 -33918 -44909
331 -44909 -44933 -33927 -14797 7801 28298 41764 44920 37071 20284 -1356 -22378 -37906 -43957
$$ packed form
241a4957k9380j8182k781J3346K5800L2015L0175K1145O854q866k2264l0148l0392
254b7635k3475j0583M533J8609K7756L0132K5130J3981m75j4721k5092k9360k6250
267c7450j6976l353J0737K2262K8059K7010J9460O990o869j9178k6402k7333k1472
280d4515j0436L133J5809K4521K7145K3099J3539N30j2321k2281k6452k4348j6201
293d8778m124Q799J9614K5385K5059J8499P559n276j6605k3921k5173k0443j0678
306e0083J699J3424K1977K4827K1897J3431J853j0149j9580k4092k2787j5884
318d3467n174O769J6870K2920K3133J7944Q242l350j3995k1236k3072j9502j0991
331d4909k4J1006J9130K2598K0497J3466L156p849j6787k1640k1022j5528o051
$$ plain form
344 -43957 -39278 -25014 -4796 16383 33450 42155 40541 28990 10522 -10394 -28543 -39640 -40893
357 -40893 -32164 -15667 4515 23358 36446 40387 34515 20160 1099 -18118 -32727 -39211 -36054
370 -36054 -24041 -6320 12822 28646 37380 36796 27277 11087 -7601 -24309 -34952 -36874 -29826
383 -29826 -15416 2535 19810 32051 36369 31687 19268 2245 -15203 -28795 -35282 -32961 -22642
396 -22642 -6767 10554 25260 33610 33654 25437 10981 -5983 -21458 -31530 -33832 -27743 -14920
409 -14920 1491 17402 28995 33382 29525 18454 2869 -13231 -26115 -32440 -30820 -21582 -7115
422 -7115 8973 22854 31003 31532 24277 11137 -4682 -19228 -29081 -31661 -26506 -14848 414 15408
436 15408 26676 31241 28212 18169 3788 -11450 -23844 -30332 -29340 -21157 -7834 7339 20607
$$ packed form
344d3957M679J4264K0218K1179J7067Q705j614j1551j8468k0916j8149j1097j253
357d0893Q729J6497K0182J8843J3088L941n872j4355j9061j9217j4609o484L157
370c6054J2013J7721J9142J5824Q734n84r519j6190j8688j6708j0643j922P048
383b9826J4410J7951J7275J2241M318m682j2419j7023j7448j3592o487K321J0319
396b2642J5875J7321J4706Q350M4q217j4456j6964j5475j0072k302O089J2823
409a4920J6411J5911J1593M387l857j1071j5585j6100j2884o325J620R238J4467
422g115J6088J3881Q149N29p255j3140j5819j4546r853k580N155J1658J5262J4994
436A5408J1268M565l029j0043j4381j5238j2394o488R92Q183J3323J5173J3268
$$ plain form
449 20607 28862 29884 23659 11582 -3205 -17143 -26873 -29923 -25667 -15087 -920 13441 24435
462 24435 29425 27144 18229 4895 -9562 -21623 -28384 -28085 -20976 -8665 5596 18500 26810 28529
476 28529 23226 12242 -1636 -15086 -24779 -28420 -25004 -15538 -2288 11417 22324 27710 26253
489 26253 18381 6017 -7696 -19540 -26534 -27039 -20866 -9645 3872 16407 24879 27249 22890 12994
503 12994 -76 -13017 -22818 -26942 -24480 -16016 -3668 9471 20344 26132 25561 18671 7298 -5840
517 -5840 -17491 -24858 -26104 -20947 -10723 2106 14310 23068 26060 22745 13818 1611 -10935 -20813
531 -20813 -25545 -24050 -16635 -5236 7378 18145 24470 24764 19024 8644 -3763 -15183 -22913 -24949
545 -24949 -20966 -11791 132 12000 20908 24683 22400 14651 3397 -8620 -18481 -23858 -23320 -17145
$$ packed form
449B0607Q255J022o225j2077j4787j3938r730l050M256J0580J4167J4361J0994
462B4435M990k281q915j3334j4457j2061o761K99P109J2311J4261J2904Q310J719
476B8529n303j0984j3878j3450r693l641L416R466J3250J3705J0907N386j457
489B6253p872j2364j3713j1844o994n05O173J1221J3517J2535Q472K370m359r896
503A2994j3070j2941r801m124K462Q464J2348J3139J0873N788n71o890j1373j3138
517e840j1651p367j246N157J0224J2829J2204Q758K992l315q927j2207j2546r878
531b0813m732J495P415J1399J2614J0767O325K94n740j0380j2407j1420p730k036
545b4949L983R175J1923J1868Q908L775k283p749j1254j2017r861n377N38O175
$$ plain form
559 -17145 -6763 5120 15765 22537 23712 19173 9906 -1636 -12785 -20738 -23621 -20711 -12777 -1798
573 -1798 9538 18517 22947 21707 15249 5036 -6239 -16001 -21802 -22245 -17289 -8108 2934 13215
587 13215 20231 22295 18862 10896 299 -10258 -18312 -21847 -20010 -13331 -3392 7202 16084 20949
601 20949 20702 15381 6332 -4169 -13597 -19677 -20916 -17003 -9025 1159 10901 18027 20647 18228 11359
616 11359 1764 -8159 -16095 -20001 -19035 -13365 -4527 5367 13892 18996 19402 15066 7084 -2571 -11507
631 -11507 -17654 -19389 -16397 -9368 -167 9038 16029 19025 17371 11431 2797 -6518 -14140 -18323 -17974
646 -17974 -13222 -5271 3879 12031 17245 18157 14666 7529 -1290 -9801 -15872 -18029 -15761 -9633 -1243
661 -1243 7413 14198 17507 16466 11437 3625 -4957 -12332 -16651 -16840 -12934 -5845 2543 10319 15517
$$ packed form
559a7145J0382J1883J0645O772J175m539r267j1542j1149p953k883K910P934J0979
573a798J1336Q979M430j240o458j0213j1275r762n801m43M956R181J1042J0281
587A3215P016K064l433p966j0597j0557q054l535J837O679R939J0594Q882M865
601B0949k47n321r049j0501r428o080j239L913P978J0184R742P126K620k419o869
616A1359r595r923p936l906R66N670Q838R894Q525N104M06m336p982r655q936
631a1507o147j735K992P029R201R205O991K996j654n940q634r315p622m183L49
646a7974M752P951R150Q152N214R12l491p137q819q511o071k157K268O128Q390
661a243Q656O785L309j041n029p812q582p375m319j89L906P089Q388P776N198
$$ plain form
676 15517 16904 14132 7933 -164 -8163 -14139 -16619 -15002 -9742 -2101 5921 12542 16012 15561 11280
691 11280 4266 -3702 -10755 -15124 -15784 -12539 -6272 1498 8802 13972 15648 13480 8037 644 -6799
706 -6799 -12597 -15242 -14151 -9578 -2701 4776 11059 14591 14518 10881 4629 -2740 -9370 -13706 -14612 -11950
722 -11950 -6356 758 7619 12628 14464 12781 7917 1189 -5821 -11370 -14118 -13357 -9332 -3051 3949
737 3949 9915 13469 13639 10515 4769 -2055 -8360 -12601 -13719 -11464 -6392 183 6692 11505 13540
752 13540 12154 7827 1627 -4931 -10257 -13058 -12610 -9101 -3329 3143 8876 12398 12866 10162 4976
767 4976 -1381 -7368 -11540 -12886 -11012 -6489 -383 5762 10500 12622 11632 7806 2053 -4125 -9313
782 -9313 -12170 -12051 -8938 -3685 2454 7941 11467 12173 9861 5159 -778 -6461 -10588 -12050 -10569 -6478
$$ packed form
676A5517J387k772o199q097p999n976k480J617N260P641Q022O621L470m51m281
691A1280p014p968p053m369o60L245O267P770P304N170J676k168n443p393p443
706f799n798k645J091M573O877P477O283L532p3l637o252p369o630m336r06K662
722a1950N594P114O861N009J836j683m864o728p010n549k748P61M025O281P000
737C949N966L554J70l124n746o824o305m241j118K255N072O575O509M813K035
752A3540j386m327o200o558n326k801M48L509N772O472N733L522M68k704n186
767D976o357n987m172j346J874M523O106O145M738K122r90l826n753o178n188
782i313k857J19L113N253O139N487L526P06k312m702n937n683m127j462J481M091
$$ plain form
798 -6478 -829 4957 9529 11731 11052 7624 2401 -3414 -8339 -11222 -11311 -8617 -3840 1859 7048 10545
814 10545 11387 9433 5149 -341 -5719 -9705 -11269 -10068 -6362 -1158 4320 8687 10941 10451 7411
829 7411 2547 -2903 -7598 -10433 -10659 -8281 -3849 1459 6405 9765 10690 8965 5060 -54 -5138 -8916
845 -8916 -10540 -9486 -6155 -1311 3819 7989 10196 9864 7093 2597 -2498 -6981 -9721 -10084 -7925 -3864
861 -3864 1143 5843 9090 10120 8574 4988 155 -4661 -8346 -9958 -9110 -6018 -1475 3419 7459
876 7459 9640 9462 6901 2723 -2171 -6456 -9178 -9613 -7650 -3859 893 5381 8561 9621 8295 4915
892 4915 382 -4263 -7832 -9480 -8767 -5888 -1609 3093 6960 9163 9060 6731 2755 -1902 -6050 -8742
908 -8742 -9251 -7458 -3851 673 5036 8134 9254 8045 4874 536 -3944 -7414 -9096 -8471 -5787 -1692
$$ packed form
798f478N649N786M572K202o79l428n223n815m925k883q9K694M777N699N189L497
814A0545Q42j954m284n490n378l986j564J201L706N204N478M367K254m90l040
829G411m864n450m695k835k26K378M432N308M946L360R25j725l905n114n084l778
845h916j624J054L331M844N130M170K207l32k771m496n095m483k740l63K159M061
861c864N007M700L247J030j546l586m833m816l685j612Q48L092M543M894M040
876G459K181j78k561m178m894m285k722m35J963L791M752M488L180J060j326l380
892D915m533m645l569j648P13K879M279M702L867K203j03k329l976m657m148k692
908h742n09J793L607M524M363L098J120j209l171m338m480l470j682O25K684M095
$$ plain form
924 -1692 2809 6592 8776 8777 6598 2815 -1636 -5690 -8317 -8931 -7280 -3889 480 4704 7756 8918
940 8918 7828 4857 669 -3668 -7096 -8788 -8303 -5765 -1826 2565 6298 8482 8603 6534 2925 -1447
956 -1447 -5402 -8062 -8737 -7222 -3967 274 4432 7492 8715 7793 4927 898 -3369 -6778 -8543 -8178
972 -8178 -5800 -2038 2274 5963 8227 8442 6574 3113 -1121 -5074 -7767 -8586 -7253 -4159 -57 4080
988 4080 7167 8552 7774 5105 1199 -3032 -6475 -8380 -8184 -5983 -2334 1896 5649 8015 8419 6729
1004 6729 3412 -723 -4691 -7460 -8448 -7306 -4413 -437 3666 6811 8323 7757 5306 1566 -2566
1019 -2566 -6049 -8039 -8077 -6095 -2674 1425 5148 7593 8211 6748 3693 -312 -4212 -7069 -8213 -7317
1035 -7317 -4646 -840 3166 6387 8040 7730 5487 1946 -2107 -5601 -7719 -7956 -6212 -2987 992
$$ packed form
924a692M501L783K184Jk179l783m451m054k627o14J651L391M369M224L052J162
940H918j090k971m188m337l428j692M85K538L939M391L733K184J21k069l609m372
956a447l955k660o75J515L255M241M158L060J223r22k866m029m267l409j765L65
972h178K378L762M312L689K264K15j868l461m234l953k693q19J333L094M102M137
988D080L087J385p78k669l906m231l443j905J96K201L649M230L753K366M04j690
1004F729l317m135l968k769r88J142K893L976M103L145J512n66k451l740m132
1019b566l483j990l8J982L421M099L723K445O18j463l055m005l900k857j144Q96
1035g317K671L806M006L221J653l10k243l541m053l494k118k37J744L225L979
$$ plain form
1050 992 4687 7237 8024 6804 3958 130 -3718 -6616 -7901 -7244 -4801 -1230 2687 5866 7645 7521
1066 7521 5536 2238 -1643 -5077 -7291 -7688 -6218 -3213 561 4193 6774 7712 6727 4107 494 -3276
1082 -3276 -6190 -7630 -7140 -4926 -1510 2294 5498 7375 7420 5642 2500 -1248 -4705 -6961 -7553 -6229
1098 -6229 -3430 216 3812 6416 7489 6678 4266 788 -2857 -5784 -7303 -7031 -5011 -1800 1869
1113 1869 5048 6977 7212 5634 2728 -884 -4258 -6564 -7291 -6185 -3596 -116 3398 6053 7229
1128 7229 6626 4396 1103 -2474 -5406 -7028 -6927 -5087 -2056 1530 4692 6704 7074 5685 2936 -551
1144 -551 -3885 -6254 -7087 -6180 -3752 -448 3006 5654 6951 6506 4469 1370 -2114 -5013 -6719 -6750
1160 -6750 -5128 -2275 1157 4278 6331 6855 5662 3104 -220 -3505 -5874 -6842 -6099 -3879 -708 2667
$$ packed form
1050I92L695K550P87j220k846l828l848k898j285O57K443L571L917L179J779j24
1066G521j985l298l881l434k214l97J470L005L774L632K581R38r85k620l613l770
1082c276k914j440M90K214L416L804L204J877M5j778l142l748l457k256n92J324
1098f229K799L646L596K604J073q11k412l478l645k927j519K72K020L211L669
1113A869L179J929K35j578k906l612l374k306p27J106K589L480L514K655J176
1128G229o03k230l293l577k932j622J01J840L031L586L162K012L70j389k749l487
1144e51l334k369q33R07K428L304L454K648J297m45k037l099l484k899j706l1
1160f750J622K853L432L121K053N24j193k558l324l285k369r68P43K220L171L375
$$ plain form
1176 2667 5325 6729 6435 4578 1611 -1782 -4702 -6473 -6676 -5193 -2490 865 3976 6079 6732 5673
1192 5673 3271 47 -3187 -5628 -6697 -6099 -4022 -959 2340 5041 6499 6373 4661 1849 -1469
1207 -1469 -4387 -6212 -6547 -5230 -2682 566 3652 5827 6586 5708 3464 356 -2856 -5322 -6513 -6097
1223 -6097 -4173 -1260 2000 4732 6311 6339 4791 2125 -1131 -4078 -6004 -6486 -5366 -2948 198 3304
1239 3304 5554 6460 5776 3673 702 -2501 -5007 -6344 -6088 -4349 -1576 1629 4390 6076 6290 4946
1255 4946 2409 -721 -3672 -5675 -6341 -5409 -3176 -172 2918 5214 6285 5778 3890 1039 -2086 -4676
1271 -4676 -6107 -6053 -4505 -1883 1221 4027 5795 6186 5028 2672 -363 -3316 -5415 -6212 -5452 -3412
1287 -3412 -511 2539 4909 6083 5785 4041 1352 -1711 -4320 -5842 -5961 -4588 -2145 885 3660
$$ packed form
1176B667K658J404k94j857k967l393k920j771k03J483K703L355L111K103O53j059
1192E673k402l224l234k441j069N98K077L063L299K701J458j26j712k812l318
1207a469k918j825l35J317K548L248L086K175P59q78k244l108l212k466j191M16
1223f097J924K913L260K732J579K8j548k666l256k947j926m82J120K418L146L106
1239C304K250R06o84k103k971l203k506j337K56J739K773L205K761J686K14j344
1255D946k537l130k951k003o66R32K233L004L090K296J071n07j888k851l125k590
1271d676j431N4J548K622L104K806J768L91j158k356l035k953k099p97P60K040
1287c412K901L050K370J174k98j744k689l063k609j522j19J373K443L030K775
$$ plain form
1302 3660 5515 6043 5071 2898 -37 -2944 -5098 -6020 -5454 -3553 -818 2169 4570 5864 5727 4159
1318 4159 1629 -1395 -3996 -5634 -5897 -4706 -2388 535 3326 5259 5936 5137 3100 306 -2610 -4820
1334 -4820 -5871 -5465 -3746 -1125 1833 4273 5687 5707 4331 1903 -1004 -3659 -5386 -5808 -4797 -2647
1350 -2647 175 2975 4971 5817 5175 3306 633 -2251 -4507 -5715 -5497 -3938 -1435 1442 3954 5461
1366 5461 5660 4432 2186 -650 -3324 -5125 -5731 -4886 -2890 -154 2630 4721 5673 5236 3513 955
1382 955 -1879 -4214 -5506 -5466 -4071 -1722 1112 3622 5237 5597 4540 2443 -317 -2987 -4900 -5613
1398 -5613 -4964 -3106 -490 2282 4433 5512 5244 3685 1248 -1561 -3920 -5339 -5457 -4231 -1997 770
1414 770 3322 5039 5551 4688 2691 39 -2660 -4649 -5513 -5024 -3314 -807 1950 4162 5395 5287
$$ packed form
1302C660J855N28r72k173k935k907k154r22N66J901K735K987K401J294j37j568
1318D159k530l024k601j638k63J191K318K923K791J933O77p99k037k794k916k210
1334d820j051M06J719K621K958K440J414K0j376k428k907k655j727m22J011K150
1350b647K822K800J996Q46o42j869k673k884k256j208K18J559K503K877K512J507
1366E461J99j228k246k836k674j801o06Q45J996K736K784K091R52m37j723k558
1382I55k834k335j292M0J395K349K834K510J615L60j057k097k760k670j913p13
1398e613O49J858K616K772K151J079k68j559k437k809k359j419j18J226K234K767
1414G70K552J717N12q63j997k652k699j989q64M89J710K507K757K212J233j08
$$ plain form
1430 5287 3893 1572 -1171 -3614 -5146 -5439 -4412 -2308 370 2978 4785 5483 4797 2960 411 -2292
1446 -2292 -4359 -5423 -5120 -3603 -1198 1531 3852 5211 5328 4123 1948 -741 -3260 -4917 -5415 -4554
1462 -4554 -2633 -28 2583 4537 5395 4916 3277 817 -1863 -4058 -5248 -5172 -3827 -1585 1099 3482
1478 3482 4992 5297 4287 2281 -326 -2875 -4659 -5334 -4690 -2926 -448 2177 4221 5235 4988 3498
1494 3498 1212 -1458 -3715 -5052 -5170 -4007 -1913 715 3142 4760 5245 4442 2569 70 -2490 -4368
1510 -4368 -5192 -4764 -3154 -808 1801 3902 5064 4993 3696 1520 -1066 -3371 -4835 -5120 -4163 -2188
1526 -2188 309 2775 4487 5137 4527 2816 426 -2120 -4087 -5063 -4803 -3386 -1136 1427 3607 4886
1542 4886 4994 3870 1840 -672 -3032 -4593 -5050 -4275 -2465 -46 2436 4238 5045 4615 3070 772
$$ packed form
1430E287j394k321k743k443j532k93J027K104K678K608J807O98o86j837k549k703
1446b292k067j064L03J517K405K729K321J359J17j205k175k689k519j657m98Q61
1462d554J921K605K611J954Q58m79j639k460k680k195j190P6J345K242K684K383
1478C482J510L05j010k006k607k549j784o75O44J764K478K625K044J014k47j490
1494C498k286k670k257j337j18J163K094K628K427J618M85q03j873k499k560j878
1510d368q24M28J610K346K609K101J162p1j297k176k586k305j464k85R57J975
1526b188K497K466J712O50o10j711k390k546j967r76K60J417K250K563K180J279
1542D886J08j124k030k512k360j561m57P75J810K419K482J802Q07m30j545k298
$$ plain form
1558 772 -1739 -3797 -4916 -4847 -3599 -1484 1026 3270 4687 4973 4030 2146 -321 -2687 -4366 -4997
1574 -4997 -4409 -2759 -416 2038 3974 4930 4694 3295 1136 -1369 -3501 -4743 -4868 -3770 -1795 681
1590 681 2960 4497 4953 4197 2435 51 -2360 -4159 -4937 -4521 -2996 -776 1703 3722 4815 4757 3519
1607 3519 1456 -1029 -3221 -4620 -4902 -3979 -2111 305 2640 4299 4936 4340 2722 414 -2025 -3918
1623 -3918 -4864 -4625 -3257 -1111 1369 3480 4725 4836 3759 1795 -658 -2933 -4461 -4920 -4185 -2432
1639 -2432 -64 2343 4122 4930 4518 3023 797 -1674 -3708 -4828 -4773 -3579 -1507 964 3182 4590
1655 4590 4930 4026 2186 -223 -2605 -4285 -4959 -4407 -2814 -505 1948 3901 4891 4705 3383 1242
1671 1242 -1243 -3412 -4710 -4896 -3873 -1931 525 2853 4444 4984 4304 2600 228 -2219 -4092 -4968
$$ packed form
1558G72k511k058j119O9J248K115K510K244J417K86r43j884k467k366j679o31
1574d997N88J650K343K454J936R56k36j399k159k505k132j242j25J098J975K476
1590F81K279J537M56p56j762k384k411j799p78M16J525K220K479K019J093n8j238
1607C519k063k485k192j399k82R23J868K416K335J659O37n96j618k308k439j893
1623c918r46K39J368K146K480K111J245J11j077j964k453k275j528m59P35J753
1639b432K368K407J779Q08m12j495k226k471k034j120N5J194K072K471K218J408
1655D590L40r04j840k409k382j680o74N52J593K309K453J953R90j86j322k141
1671A242k485k169j298j86J023J942K456K328J591N40o80j704k372k447j873q76
$$ plain form
1687 -4968 -4651 -3204 -992 1506 3613 4827 4874 3723 1709 -782 -3065 -4599 -4995 -4204 -2398 5
1703 5 2437 4232 5012 4565 3025 771 -1739 -3775 -4875 -4822 -3572 -1502 1011 3242 4670 4975 4069
1720 4069 2191 -243 -2641 -4345 -5020 -4477 -2838 -529 1969 3918 4938 4749 3430 1275 -1242 -3413
1736 -3413 -4757 -4955 -3948 -2003 458 2819 4439 5005 4357 2671 327 -2142 -4015 -4942 -4649 -3251
1752 -3251 -1062 1421 3530 4778 4860 3788 1807 -647 -2950 -4485 -4960 -4208 -2481 -92 2304 4113
1768 4113 4919 4539 3072 842 -1618 -3669 -4800 -4795 -3621 -1575 879 3114 4554 4919 4060 2267 -118
1785 -118 -2477 -4199 -4903 -4429 -2896 -646 1792 3753 4796 4699 3446 1400 -1045 -3201 -4553 -4824
1801 -4824 -3908 -2084 292 2593 4230 4852 4282 2707 456 -1927 -3816 -4762 -4581 -3271 -1202 1210
$$ packed form
1687d968L17J447K212K498K107J214M7j151k014k491k283j534l96P91J806K403
1703EK432J795P80m47j540k254k510k036j100N3J250K070K513K231J428L05r06
1720D069j878k434k398j704o75N43J639K309K498J949J020j89j319k155k517k171
1736c413j344j98J007J945K461K361J620N66o48j686k344k469j873r27K93J398
1752c251K189K483K109J248Q2j072j981k454k303j535m75P52J727K389K396J809
1768D113Q06l80j467k230k460k051j131NJ174K046K454K235J440L65q59j793k385
1785a18k359j722p04M74J533K250K438J961J043r7j253k046k445k156j352k71
1801d824R16J824K376K301J637O22n70j575k251k383j889r46J81J310K069K412
$$ plain form
1817 1210 3302 4556 4726 3752 1886 -480 -2726 -4281 -4783 -4147 -2522 -272 2084 3887 4732 4452
1833 4452 3096 1018 -1381 -3380 -4542 -4611 -3588 -1680 655 2825 4286 4698 3986 2335 82 -2200
1849 -2200 -3903 -4662 -4292 -2899 -800 1524 3446 4509 4482 3388 1464 -826 -2927 -4286 -4591 -3815
1865 -3815 -2118 101 2338 3942 4600 4133 2695 580 -1677 -3523 -4493 -4358 -3203 -1253 1007 3038
1881 3038 4272 4490 3631 1912 -310 -2459 -3970 -4512 -3970 -2497 -380 1835 3582 4427 4211 2998
1897 2998 1059 -1170 -3122 -4251 -4377 -3454 -1714 491 2548 3963 4411 3799 2297 187 -1960 -3619
1913 -3619 -4376 -4074 -2815 -859 1330 3185 4227 4256 3275 1523 -654 -2649 -3980 -4323 -3639 -2099 -7
1930 -7 2072 3648 4297 3927 2617 671 -1475 -3240 -4194 -4129 -3090 -1315 815 2712 3951 4201 3466
$$ packed form
1817A210K092J254J70r74j866k366k246j555n02O36J625K250K356J803Q45k80
1833D452j356k078k399j999j162o9J023J908K335K170J461M12p12j651k253k282
1849b200j703p59L70J393K099K324J922J063k7j094j924k290k101j359l05P76
1865c815J697K219K237J604O58m67j438k115k257j846r70J35J155J950K260K031
1881C038J234K18q59j719k222k149j511n42N42J473K117K215J747Q45k16j213
1897B998j939k229j952j129j26R23J740K205K057J415M48o12j502k110k147j659
1913c619p57L02J259J956K189J855J042K9r81j752k177j995j331l43O84J540K092
1930gK079J576O49l70j310j946k146j765r54O5J039J775K130J897J239K50p35
$$ plain form
1947 3466 1915 -158 -2162 -3645 -4197 -3771 -2448 -515 1570 3228 4107 3965 2897 1149 -944 -2770
1963 -2770 -3911 -4063 -3292 -1704 301 2254 3623 4099 3595 2235 322 -1687 -3264 -4028 -3814 -2703
1979 -2703 -935 1078 2809 3851 3932 3086 1489 -482 -2343 -3606 -3981 -3406 -2029 -139 1791 3267
1995 3267 3931 3630 2514 738 -1209 -2855 -3774 -3771 -2887 -1285 640 2405 3566 3867 3221 1812 -55
2012 -55 -1898 -3265 -3852 -3459 -2273 -519 1350 2892 3715 3617 2665 1048 -815 -2491 -3528 -3738 -3020
2029 -3020 -1598 225 1969 3252 3710 3271 2053 318 -1459 -2910 -3613 -3453 -2467 -865 951 2507
2045 2507 3455 3580 2811 1380 -407 -2051 -3220 -3585 -3079 -1833 -152 1579 2914 3523 3273 2219 650
2062 650 -1109 -2564 -3393 -3409 -2598 -1152 577 2138 3177 3436 2870 1593 -62 -1711 -2918 -3423 -3096
$$ packed form
1947C466j551k073k004j483n52M26J323J933K085J658Q79j42j068j748k093j826
1963b770j141j52P71J588K005J953J369M76n04j360j913k009j577p64K14J111
1979b703J768K013J731J042Q1q46j597j971j861j263l75N75J377J890J930J476
1995C267O64l01j116j776j947j646r19LQ84J602J925J765J161L01o46j409j867
2012e5j843j367n87L93J186J754J869J542Q23r8r52j617j863j676j037k10P18
2029c020J422J823J744J283M58m39j218j735j777j451p03J60R86J602J816J556
2045B507R48J25p69j431j787j644j169l65N06J246J681J731J335O09k50j054j569
2062F50j759j455q29j6Q11J446J729J561J039K59n66j277j655j649j207n05L27
$$ plain form
2079 -3096 -2015 -451 1237 2592 3316 3242 2361 935 -738 -2213 -3148 -3308 -2666 -1370 260 1827 2918
2096 2918 3314 2895 1773 214 -1391 -2645 -3268 -3070 -2146 -689 932 2301 3123 3158 2431 1118 -468
2113 -468 -1946 -2929 -3219 -2703 -1532 -4 1544 2688 3172 2897 1915 455 -1104 -2392 -3084 -3036 -2226 -888
2131 -888 674 2072 2939 3114 2509 1318 -222 -1703 -2746 -3129 -2736 -1702 -239 1281 2478 3065 2896
2148 2896 2020 672 -855 -2178 -2962 -3033 -2354 -1121 407 1819 2779 3053 2598 1497 37 -1425 -2540
2165 -2540 -3028 -2783 -1848 -474 1023 2269 2960 2933 2181 907 -589 -1940 -2812 -3005 -2444 -1317 141
2182 141 1589 2601 2996 2666 1683 283 -1193 -2356 -2971 -2838 -2038 -733 748 2043 2833 2917 2317 1127
2200 1127 -323 -1703 -2656 -2972 -2550 -1516 -99 1330 2428 2953 2734 1869 548 -921 -2152 -2851 -2859
$$ packed form
2079c096J081J564J688J355P24p4q81j426j673j475r35j60O42J296J630J567J091
2096B918L96m19j122j559j605j254o23J98R24J457J621J369Q22L5p27j313j586
2113d68j478r83k90N16J171J528J548J144M84k75r82j460j559j288o92M8Q10J338
2131h88J562J398Q67J75o05j191j540j481j043l83L93J034J463J520J197N87j69
2148B896q76j348j527j323p84p1O79J233J528J412R60K74m55j101j460j462j115
2165b540m88K45R35J374J497J246O91k7p52j274j496j351q72j93N61J127J458
2182A41J448J012L95l30r83j400j476j163o15J33Q00J305J481J295P90Q4o00j190
2200A127j450j380r53l16M22J034J417J429J098N25k19q65j321j469j231o99q
$$ plain form
2217 -2859 -2162 -943 514 1835 2702 2925 2426 1349 -79 -1489 -2506 -2938 -2639 -1709 -362 1076 2242
2234 2242 2859 2779 2028 785 -666 -1938 -2734 -2875 -2309 -1194 231 1596 2554 2897 2538 1568 212 -1199
2252 -1199 -2311 -2837 -2709 -1890 -627 811 2036 2760 2817 2191 1048 -380 -1688 -2599 -2882 -2455 -1435
2269 -1435 -70 1320 2371 2851 2625 1780 492 -933 -2105 -2771 -2774 -2090 -916 504 1782 2624 2835
2286 2835 2363 1304 -65 -1424 -2423 -2824 -2542 -1636 -344 1062 2175 2791 2691 1963 753 -643 -1879
2303 -1879 -2653 -2768 -2225 -1133 239 1543 2468 2798 2443 1492 180 -1186 -2240 -2769 -2619 -1843 -614
2320 -614 772 1944 2649 2706 2124 1008 -344 -1631 -2485 -2753 -2336 -1367 -49 1273 2288 2754 2530 1716
2338 1716 458 -882 -2030 -2650 -2637 -1987 -863 495 1730 2516 2708 2234 1228 -92 -1382 -2335 -2719
$$ packed form
2217b859O97J219J457J321Q67K23m99j077j428j410j017m32K99R30J347J438J166
2234B242O17q0p51j243j451j272p96j41N66J115J425J365R58L43l59r70j356j411
2252a199j112n26J28Q19J263J438J225P24N7o26j143j428j308r11k83M27J020
2269a435J365J390J051M80k26q45j288j425j172o66lO84J174J420J278Q42K11
2286B835m72j059j369j359r99m01K82R06J292J406J113O16j00p28j210j396j236
2303a879p74j15N43J092J372J304R25L30l55r51j312j366j054n29J50P76J229
2320f14J386J172P05N7n82j116j352j287q54k68M17R69J318J322J015M66k24q14
2338A716j258j340j148o20J3O50J124J358J235P86J92m74j006j320j290r53l84
$$ plain form
2355 -2719 -2441 -1584 -340 987 2067 2636 2578 1873 743 -593 -1773 -2529 -2652 -2139 -1117 189 1447
2372 1447 2347 2677 2363 1459 228 -1079 -2117 -2624 -2501 -1753 -591 723 1855 2521 2596 2022 963 -353
2390 -353 -1552 -2398 -2639 -2249 -1320 -79 1197 2155 2606 2414 1623 463 -838 -1911 -2534 -2531 -1928 -863
2408 -863 427 1602 2382 2579 2167 1206 -20 -1264 -2166 -2569 -2330 -1526 -365 916 1943 2501 2459 1813
2426 1813 721 -537 -1662 -2379 -2510 -2034 -1069 157 1357 2183 2514 2212 1377 215 -1027 -1977 -2478
2443 -2478 -2367 -1685 -609 626 1702 2366 2444 1924 962 -248 -1395 -2198 -2456 -2135 -1296 -139 1064 1992
2461 1992 2430 2284 1589 506 -705 -1738 -2338 -2373 -1821 -839 354 1451 2179 2403 2009 1143 -16 -1159
2479 -1159 -2036 -2385 -2182 -1425 -349 812 1789 2305 2270 1659 686 -488 -1517 -2198 -2323 -1895 -1003 128
$$ packed form
2355b719K78Q57J244J327J080N69n8p05j130j336j180p56j23N13J022J306J258
2372A447R00L30l14r04j231j307j038n07J23P48J162J314J132O66P5n74j059j316
2390c53j199q46k41L90R29J241J276R58M51j92p91j160j301j073o23LO03J065
2408h63J290J175P80J97m12r61j226j244r02m03K39Q04J161J281J027N58m2o46
2426A813j092j258j125p17j31M76R65J226J200Q26L31l02q35j162j242r50n01
2443b478J11O82J076J235J076O64P8n20r62j210j147q03k58L21Q39J157J203R28
2461A992M38j46o95j083j211j033o00l5N52R82J193J097P28K24l94q66j159j143
2479a159q77l49K03P57J076J161R77N16l5o11r73j174j029o81j25M28Q92J131
$$ plain form
2497 128 1234 2030 2339 2085 1311 248 -896 -1794 -2263 -2185 -1561 -574 560 1547 2172 2240 1786 894 -227
2516 -227 -1280 -2019 -2258 -1955 -1182 -120 983 1813 2219 2075 1427 441 -671 -1595 -2137 -2156 -1653 -745 332
2535 332 1329 1992 2185 1846 1052 8 -1030 -1816 -2157 -1971 -1313 -331 727 1595 2078 2060 1552 654 -397
2554 -397 -1346 -1964 -2103 -1738 -946 69 1065 1796 2082 1855 1181 221 -790 -1609 -2032 -1955 -1399 -507 503
2573 503 1388 1935 2003 1579 791 -205 -1135 -1780 -1992 -1721 -1028 -70 885 1634 1963 1842 1260 380 -590 -1409
2593 -1409 -1874 -1898 -1441 -650 321 1186 1758 1912 1594 892 -50 -944 -1629 -1904 -1722 -1126 -259 675 1431 1829
2613 1829 1783 1288 505 -438 -1233 -1729 -1816 -1435 -737 155 1017 1622 1822 1588 958 99 -767 -1440 -1767 -1647
2633 -1647 -1147 -361 535 1265 1694 1713 1315 591 -268 -1066 -1593 -1741 -1455 -820 3 839 1441 1700 1530 991
$$ packed form
2497A28J106P96L09k54p74j063j144q98m69P8O24R87J134R87O25O8m54q92j121
2516b27j053p39k39L03P73J062J103Q30M06j44o48r86j112r24n42j9N03R08J077
2535C32R97O63J93l39p94j044j038p86l41J86O58R82J058Q68M83j8n08q98j051
2554c97r49o18j39L65P92J015R96P31K86k27o74r60j011q19m23P7N56Q92J010
2573E03Q85N47O8m24p88r96r30o45k12K71O93R58R55P49L29j21n82q80r70q19
2593a409m65k4M57P91R71Q65N72J54l18p02r42q94o85k75J82N96Q67R34P56L98
2613A829m6m95p83r43p95m96q7L81O98Q92Q62O05K00k34o30q59q66o73l27J20
2633a647N00P86Q96P30M29J9l98p24q59p98n27j48K86O35Q23Q36O02K59j70n39
$$ plain form
2653 991 204 -622 -1293 -1658 -1594 -1170 -451 389 1113 1567 1631 1302 651 -161 -923 -1448 -1616 -1401 -835 -50 723
2674 723 1337 1603 1484 1004 280 -518 -1182 -1546 -1546 -1153 -499 296 999 1455 1556 1258 671 -89 -822 -1355 -1541
2695 -1541 -1369 -849 -130 636 1225 1514 1437 1003 322 -426 -1078 -1455 -1470 -1139 -513 238 917 1379 1497 1257
2715 1257 707 -11 -739 -1271 -1481 -1335 -863 -187 554 1147 1462 1399 1008 373 -370 -1012 -1404 -1445 -1140 -558
2735 -558 161 849 1310 1446 1236 730 27 -686 -1200 -1434 -1316 -878 -199 497 1099 1411 1388 1017 409 -306
2755 -306 -942 -1343 -1414 -1132 -583 130 790 1276 1426 1243 760 77 -607 -1168 -1423 -1334 -922 -280 415 1027 1374
2776 1374 1380 1039 445 -246 -895 -1310 -1405 -1162 -621 60 736 1233 1421 1262 797 136 -556 -1114 -1380 -1322 -933
2797 -933 -322 387 988 1339 1379 1080 502 -190 -849 -1277 -1395 -1193 -681 -16 671 1172 1398 1280 837 193
$$ packed form
2653I91p87q26o71l65O4M24P19Q40P24M54O4l29o51q12p62n25j68K15N66P85P73
2674G23O14K66j19m80p24p98o64l64%L93O54P95P03M56J01k98n87p60p33n33j86
2695a541J72N20P19P66N89K89p7m34o81p48o52l77j5L31O26P51O79M62J18k40
2715A257n50p18p28n32k10J46M72O76P41N93L15o3l91o35p43o42l92m1L05N82
2735e58P19O88M61J36k10n06p03p13n14k34J18M38O79O96O02L12k3l71o08p15
2755c06o36m01p1K82N49P13O60M86J50j83m83o83o84n61k55Q9M12O42O95O12L47
2776A374Ol41n94o91o49m15r5K43N41O81O76M97J88j59m65o61o92n58k66N8L89
2797i33O11P09O01L51M0k99n78o92o59m28j18K02N12O65O87N01K26j18m43o44
$$ plain form
2817 193 -494 -1070 -1374 -1351 -991 -384 308 940 1313 1383 1105 562 -135 -781 -1235 -1381 -1199 -709 -60 623 1153
2838 1153 1385 1290 881 252 -439 -1022 -1347 -1359 -1021 -445 240 861 1283 1387 1141 628 -61 -711 -1205 -1392
2858 -1392 -1263 -802 -167 530 1091 1365 1325 947 341 -356 -954 -1324 -1355 -1070 -529 166 807 1250 1376 1177
2878 1177 686 29 -636 -1143 -1366 -1260 -849 -210 459 1033 1346 1329 987 402 -281 -892 -1287 -1371 -1124 -603
2898 -603 76 718 1195 1373 1211 759 111 -571 -1095 -1356 -1303 -913 -304 393 976 1318 1352 1052 489 -200 -822
2919 -822 -1242 -1363 -1155 -644 7 671 1156 1362 1234 811 178 -492 -1048 -1352 -1314 -971 -371 301 905 1286
2939 1286 1348 1072 541 -129 -772 -1222 -1377 -1192 -734 -75 590 1115 1358 1283 881 270 -416 -994 -1326 -1340 -1020
2960 -1020 -454 240 858 1264 1369 1148 627 -30 -696 -1190 -1378 -1243 -799 -168 513 1054 1344 1306 928 348
$$ packed form
2817A93o87n76l04K3L60O07O92O32L73P0k78n43o97o46m54j46J82M90O49O83N30
2838A153K32r5m09o29o91n83l25j2L38N76O85O21M22J04k46n13o89o50m94j87
2858a392J29M61O35O97N61K74m0l78o06o97n98l70l1K85N41O95O41M43J26j99
2878A177m91o57o65n07k23J06M11O39O69N74L13j7l42n85o83o11l95q4K47N21
2898f03O79O42M77J78j62m52o48o82n24k61N3L90O09O97N83L42L4l00n63o89o22
2919h22m20j21K08N11O51O64M85K06j28m23o33o70n56l04L8L43O00O72O04L81
2939A286O2k76n31o70o43m50j55J85M58O59O65N25K43p5m02o11o86n78l32j4L20
2960a020N66O94O18M06J05k21n21o57o66m94j88J35M44O31O81N41K90l8l78n80
$$ plain form
2980 348 -336 -946 -1324 -1366 -1095 -538 133 768 1218 1366 1201 724 57 -611 -1127 -1370 -1278 -875 -265 435 1008
3001 1008 1346 1348 1032 455 -226 -847 -1268 -1368 -1142 -634 20 690 1170 1369 1227 785 163 -512 -1066 -1356
3021 -1356 -1314 -958 -367 311 912 1298 1362 1075 553 -126 -763 -1217 -1361 -1197 -723 -70 580 1104 1357 1280 886
3042 886 267 -404 -977 -1308 -1330 -1018 -456 215 827 1234 1361 1139 634 -20 -668 -1150 -1363 -1249 -811 -201
3062 -201 474 1021 1321 1285 940 374 -310 -899 -1270 -1334 -1080 -555 93 737 1173 1346 1183 726 100 -556 -1067
3083 -1067 -1323 -1251 -888 -278 370 940 1273 1311 1028 478 -179 -786 -1210 -1322 -1121 -650 -18 619 1097 1314
3103 1314 1190 792 197 -448 -982 -1275 -1243 -937 -384 257 841 1199 1285 1047 554 -69 -685 -1126 -1274 -1135
3123 -1135 -718 -112 517 1019 1269 1201 860 303 -327 -880 -1216 -1240 -975 -466 146 724 1113 1243 1057 622
$$ packed form
2980C48o84o10l78m2K71N57O71O35M50J48j65m77o67o68n16k43R2M03O10P00N73
3001A008L38Kl16n77o81o21m21j00K26N08O54O70M80J99j42m42o22o75n54k90
3021a356M2L56N91O78O01L86O4k87n22o79o37m54j44J64M74O53O50N24K53p7l94
3042H86o19o71n73l31k2L12N62O71O12M07J27k22n05o54o48m82k13J14M38O10
3062b01O75N47L00l6l45n66o84n89l71o4K54N25O48O44M36J73j63m57o26o56n11
3083a067k56P2L63O10O48N70L33L8k83n50o57o07m24j12K01M71O32O37M78K17
3103A314j24l98n95o45n34k93L2L06N53O41N84L58Q6k38m93o23o16m41j48J39
3123a135M17O06O29N02K50o8l41n57o30n53l36k4K65N09O12N78L89J30j86m35
$$ plain form
3143 622 29 -581 -1039 -1247 -1144 -762 -210 399 904 1178 1167 878 362 -241 -784 -1134 -1193 -983 -510 81 650
3164 650 1058 1197 1064 664 104 -479 -947 -1178 -1120 -786 -257 320 837 1139 1164 895 418 -162 -709 -1080 -1163
3185 -1163 -1007 -573 -9 548 965 1154 1052 685 161 -409 -879 -1133 -1107 -810 -316 261 762 1080 1131 915
3205 915 460 -100 -635 -999 -1130 -980 -584 -48 491 919 1127 1064 731 219 -335 -811 -1094 -1097 -839 -382 172
3226 172 673 1010 1112 922 512 -21 -550 -946 -1106 -1012 -636 -119 409 853 1069 1040 760 283 -262 -733 -1031
3247 -1031 -1083 -849 -403 134 620 982 1089 940 546 28 -496 -897 -1083 -1002 -669 -187 354 788 1032 1045 776
3268 776 328 -212 -689 -1001 -1052 -872 -459 50 545 924 1057 934 581 85 -437 -831 -1036 -989 -694 -236 289
3289 289 742 1009 1029 800 369 -133 -621 -948 -1049 -880 -499 -7 500 869 1034 939 622 140 -346 -791 -1016
$$ packed form
3143F22n93o10m58k08J03L82N52O09N05K74j1k89n16o03n43l50n9K10M73N91N69
3164F50M08J39j33m00n60n83m68k31N8L34N29N77N17L02K5k69m77n80n47l71q3
3185a163J56M34N64N57M17J89j02l67n24n70m70k54K6K97M94N77N01L18N1k16
3205I15m55n60n35l64j31J50L96N36N39M28K08o3l33n12n54m76k83lK58M57N54
3226A72N01L37J02j90m10n33n29l96j60R4L76N17N28M44K16k9k80m77n45m71k98
3247a031n2K34M46N37M86L62J07j49l94n18n24m01j86Q1L33M82N41M34K44J3k69
3268G76m48n40m77l12n1J80M13N09M95L79J33j23l53m96n22l94k05M7K95M58N25
3289B89M53K67K0k29m31n02m88l27j01J69L81M92N07L69J65r5l17m82m86m45k25
$$ plain form
3310 -1016 -985 -736 -296 215 667 942 1009 816 416 -80 -556 -893 -1013 -888 -542 -60 428 809 999 942 650
3331 650 213 -294 -721 -962 -972 -745 -336 158 599 913 993 820 452 -33 -486 -845 -990 -886 -587 -140 338
3352 338 727 933 916 661 244 -240 -651 -909 -941 -751 -367 103 544 839 947 814 471 22 -425 -786 -934
3373 -934 -863 -566 -150 312 701 913 901 665 274 -186 -601 -874 -930 -756 -388 59 502 808 915 805 493
3394 493 47 -384 -744 -917 -867 -599 -182 270 647 868 877 660 280 -159 -582 -841 -898 -734 -385 48 476
3415 476 780 893 808 498 78 -349 -713 -890 -853 -595 -192 251 628 867 882 669 300 -128 -556 -826 -898
3436 -898 -765 -434 8 440 763 897 811 539 115 -338 -694 -881 -855 -622 -221 234 620 861 885 695 337
3457 337 -109 -522 -815 -896 -766 -430 -7 433 759 899 828 549 136 -316 -693 -893 -878 -654 -262 182 586
$$ packed form
3310a016L1K49M40N11M52K75O7j93m00m96m76l37j20J25L46M82M88L81J90n7k92
3331F50m37n07m27k41j0K27M09M94M41L14Q0j73l68m85m53l59j45J04K99M47M78
3352C38L89K06j7k55m17m84m11k58l2J90L84M70M41K95J08j33l43m49m47l61j48
3373i34P1K97M16M62L89K12j2k36l91m60m15k73n6J74L68M47M43L06J07j10l12
3394D93m46m31l60j73N0K68M17M52L77K21Rk17l80m39m23k59n7J64L49M33M28
3415D76L04J13q5l10m20m27l64j77L7K58M03M43L77K39J5k13l69m28m28k70p2
3436h98J33L31M42M32L23J34q6k72m24m53l56j87K6K33M01M55L86K41K4j90l58
3457C37m46m13k93q1J30L36M23M40L26J40p1k79m13m52l77k00J5K24L92M44M04
$$ plain form
3478 586 843 911 723 379 -74 -497 -805 -926 -817 -507 -73 374 736 916 873 607 185 -270 -662 -882 -897
3499 -897 -674 -293 149 568 858 922 768 430 -19 -471 -793 -928 -841 -537 -112 344 707 916 881 633 231
3520 231 -230 -639 -887 -928 -748 -382 88 512 836 944 818 493 48 -401 -774 -947 -883 -602 -178 287 689
3541 689 921 923 703 320 -157 -584 -866 -947 -797 -429 19 471 804 939 855 544 105 -357 -737 -934 -912 -665
3563 -665 -257 212 633 901 942 755 376 -81 -529 -840 -967 -830 -520 -57 410 773 952 905 633 205 -267
3584 -267 -677 -908 -934 -707 -331 138 569 865 951 802 438 -10 -471 -803 -943 -859 -572 -139 317 706 910
3605 910 895 650 261 -212 -616 -879 -934 -755 -391 58 506 818 941 829 519 79 -382 -749 -927 -887 -622
3626 -622 -202 255 649 893 916 720 331 -126 -548 -855 -938 -803 -462 -22 427 763 904 841 553 132 -320
$$ packed form
3478E86K57O8j88l44m53m23l08j21J09L10M34M47L62J80m3k66m22m55l92k20j5
3499h97K23L81M42M19K90O4j54l38m49m52l22j35Q7L04M25M56L63K09l5k48m02
3520B31m61m09k48m1J80L66M70M24L24J08j26l25m45m49l73j73O4K81M24M65M02
3541F89K32Kk20l83m77m27k82q1J50L68M48M52L33J35q4l11m39m62l80j97K2K47
3563f65M08M69M21K68M1j87l79m57m48l11j27J37L10M63M67L63J79m7k72m28m72
3584b67m10k31k6K27L76M69M31K96Q6j49l64m48m61l32j40Q4K87M33M56L89K04
3605I10j5k45l89m73m04k63n5J79L64M49M48L12J23j12l10m40m61l67j78M0K65
3626f22M20M57L94K44K3j96l89m57m22l07q3J35L41M40M49L36J41o3k88m21m52
$$ plain form
3647 -320 -689 -911 -899 -674 -275 181 589 844 911 750 396 -57 -478 -784 -918 -818 -521 -83 358 718 893
3668 893 868 624 214 -235 -623 -867 -891 -706 -341 91 504 801 896 768 463 31 -400 -741 -894 -838 -580
3689 -580 -172 283 647 851 866 652 285 -159 -559 -820 -883 -727 -392 21 442 749 872 790 510 115 -319
3710 -319 -670 -854 -823 -604 -216 196 580 807 854 674 341 -77 -462 -757 -848 -750 -455 -52 352 673 830
3731 830 793 525 171 -253 -607 -809 -820 -624 -290 133 496 769 829 697 398 -13 -406 -688 -821 -749 -471
3752 -471 -111 291 612 798 775 568 215 -177 -539 -756 -812 -644 -328 56 432 698 797 683 423 47 -340
3773 -340 -640 -781 -747 -518 -170 215 546 754 766 593 276 -109 -467 -700 -777 -641 -356 14 365 641 754
3794 754 698 467 112 -261 -566 -738 -709 -516 -202 166 503 697 725 579 287 -69 -408 -648 -741 -640 -389
$$ packed form
3647c20l69k22J2K25L99M56M08K55O7j61l54m53m21l06j34J00K97M38M41L60J75
3668H93k5k44m10m49l88k44k4J85L65M32M13K97R5j28l05m32m31l41j53N6K58
3689e80M08M55L64K04J5k14l67m44m00k61o3J56L35M13M21L07J23q2k80l95m34
3710c19l51j84L1K19L88M12L84K27M7j80l33m18l85k95r1R8K95M03M04L21J57
3731H30l7k68l54m24l54k02j1J96L34M23L63K73O0j32k99m11l93k82j33P2K78
3752d71L60M02L21J86k3k07l53l92l62k17n6J68L16L84L76K66R9j14k60l76l87
3773c40l00j41L4K29L48L85L31K08J2j73l17l85l58k33p7J36K85L70L51K76J13
3794G54n6k31l55l73l05j72K9J93L14L68L37J94K8j46k92l56l39k40r3J01K51
$$ plain form
3815 -389 -46 299 579 703 672 466 143 -219 -524 -680 -686 -525 -222 114 448 656 699 584 321 -16 -349
3836 -349 -598 -695 -619 -395 -72 268 523 666 645 453 155 -170 -476 -651 -659 -510 -246 81 386 595 662 567
3858 567 315 2 -311 -552 -675 -602 -394 -94 236 496 642 631 468 197 -134 -426 -596 -637 -500 -254 61
3879 61 360 576 635 548 323 16 -289 -529 -638 -596 -399 -110 202 464 603 606 450 182 -125 -412 -590 -629
3901 -629 -505 -265 52 337 551 620 553 342 37 -261 -508 -623 -572 -397 -114 202 452 603 602 465 207 -109
3923 -109 -386 -577 -619 -507 -278 28 319 523 610 534 322 42 -248 -492 -613 -581 -402 -130 160 428 580
3944 580 623 472 215 -89 -369 -569 -628 -501 -281 3 313 517 632 566 373 82 -226 -476 -602 -591 -418
3965 -418 -151 163 426 599 618 474 238 -79 -365 -567 -632 -538 -318 -16 285 509 622 567 389 85 -212
$$ packed form
3815c89L43L45K80J24l1k06l23l62l05j56oJ61L03L36L34K08M3j15k63l37l33
3836c49k49r7P6K24L23L40K55J43k1j92k98l25l06j75qJ49K64L27L05K09O7r5
3858E67k52l13l13k41j23P3K08L00L30K60J46j1j63k71l31k92j70m1J37K46L15
3879F1K99K16N9q7k25l07l05k40j09M2J97K89L12K62J39Lj56k68l07k87j78l9
3901f29J24K40L17K85K14O9o7k11l05k98k47j15N1J75K83L16K50J51jj37k58l16
3923a09k77j91m2J12K29L06K91K04Q7p6k12k80k90k44j21L2J79K72K90K68J52
3944E80M3j51k57l04k80k00n9J27K20K84L10K04J15o6j93k91l08k50j26J1J73
3965d18K67L14K63J73J9j44k36l17k86k02o5R4K20L02L01K24J13n5j78l04k97
$$ plain form
3986 -212 -467 -615 -601 -452 -183 128 409 596 637 519 271 -41 -341 -554 -634 -560 -348 -34 267 503 641
4007 641 611 414 130 -189 -450 -626 -633 -496 -218 84 388 588 639 542 301 -7 -315 -548 -664 -600 -393 -92
4029 -92 232 504 645 625 469 180 -130 -429 -612 -650 -520 -267 61 354 577 679 597 369 51 -278 -530
4050 -530 -658 -642 -446 -158 170 455 636 656 507 242 -100 -400 -606 -667 -589 -335 -16 297 557 666 610 414
4072 414 112 -232 -498 -651 -660 -489 -203 129 431 630 672 566 305 -26 -339 -580 -669 -611 -387 -82 247 509
4094 509 665 647 468 170 -161 -459 -647 -674 -550 -275 42 352 582 658 588 365 46 -285 -536 -669 -630 -445
4116 -445 -139 190 478 648 663 516 250 -83 -385 -597 -671 -576 -334 -15 318 543 673 613 415 112 -218
4137 -218 -487 -660 -648 -501 -218 109 400 606 670 544 309 -7 -335 -565 -666 -612 -397 -93 225 501 651
$$ packed form
3986b12k55j48J4J49K69L11K81J87M1j18k48l12l00k13q0P4K12L14L01K36J38
4007F41l0j97k84l19k61j76pJ37K78L02L04K00N1r7k41l08l08k33j16O4K07L01
4029i2L24K72J41k0j56k89l10k99j83l8J30K53L28K93K23J02q2k28l18l29k52
4050e30j28J6J96K88L28K85J81K0j49k65l42l00k06o1P8K54L19L13K60J09n6j96
4072D14l02l44k66j53rJ71K86L32L02J99M2j06k61l31l13k41q9N8K24L05L29K62
4094E09J56j8j79k98l31k98j88k7J24K75L17L10K30P6p0k23l19l31k51j33L9J85
4116d45L06L29K88J70J5j47k66l33l02k12p4R5K42L19L33K25J30o0j98l03l30
4137b18k69j73J2J47K83L27K91K06O4j26k35l16l28k30j01N4K15L04L18K76J50
$$ plain form
4158 651 653 470 186 -132 -409 -600 -640 -523 -264 42 341 574 655 588 364 69 -251 -495 -627 -609 -446 -158
4180 -158 152 426 596 634 508 248 -58 -362 -565 -639 -559 -343 -40 254 511 621 593 416 142 -178 -428
4201 -428 -590 -613 -468 -221 87 367 565 620 539 314 10 -273 -513 -611 -565 -374 -110 188 435 581 578 432
4223 432 181 -112 -387 -557 -596 -513 -276 6 291 494 586 534 351 86 -205 -437 -567 -561 -415 -175 115 374
4245 374 541 583 470 253 -14 -294 -492 -574 -496 -318 -51 213 428 543 524 378 138 -144 -378 -517 -543 -436
4267 -436 -226 42 295 469 537 454 276 33 -226 -427 -529 -499 -347 -110 152 371 500 511 407 200 -60
4288 -60 -294 -447 -507 -434 -254 -14 237 411 501 455 319 89 -162 -355 -474 -479 -359 -156 80 287 434 475 392
4311 392 212 -26 -240 -405 -481 -440 -278 -66 162 353 441 434 331 138 -103 -283 -400 -429 -350 -188 48 242
$$ packed form
4158F51Kj83k84l18k77j91m0J17K59L06K99K33Q1o7k24k95l20k44j32J8J63K88
4180a58L10K74J70L8j26k60l06l04k03p4Q0K16L03K94K57J10k8j77k74l20k50
4201d28j62k3J45K47L08K80J98N5q1k25l04k83k40r8M6J91K64K98K47J46lj46
4223D32k51k93k75j70l9Q3K37K82K85K03R2n2j83k65k91k32j30OJ46K40K90K59
4245C74J67M2j13k17k67k80j98q2P8J78K67K64K15J15j9j46k40k82k34j39k6J07
4267d36K10K68K53J74O8q3j78k43k59k01j02L0J52K37K62K19J29J1j04k07k60
4288f0k34j53o0P3J80K40K51J74R0m6j36k30k51j93j19nJ20K03K36K07J47M1q3
4311C92j80k38k14j65p6M1J62K12K28J91Q8pj03j93k41j80j17k9P9J62K36J94
$$ plain form
4333 242 385 447 388 245 36 -175 -343 -421 -393 -278 -95 108 285 394 389 312 146 -63 -237 -370 -412 -343 -211
4356 -211 -19 176 314 391 355 241 66 -130 -274 -370 -371 -271 -113 67 236 338 368 306 164 -12 -178 -308
4378 -308 -354 -307 -197 -36 133 275 348 331 237 81 -93 -242 -337 -337 -269 -126 35 190 294 327 270 151 0 -142
4402 -142 -265 -315 -298 -194 -46 99 234 305 294 213 89 -61 -197 -282 -293 -221 -116 35 161 261 284 252 150
4425 150 1 -124 -236 -283 -268 -179 -56 84 202 256 263 193 79 -65 -176 -261 -273 -218 -112 16 142 224 257 229
4449 229 145 25 -110 -206 -254 -222 -151 -34 79 177 241 234 182 68 -52 -151 -220 -235 -181 -91 4 130 200 235 208 119 3
4476 3 -104 -194 -233 -219 -151 -37 76 169 218 213 149 49 -50 -161 -203 -204 -161 -74 30 137 199 219 197 114 3 -112 -188
4503 -188 -221 -190 -112 -22 83 155 217 201 153 43 -64 -158 -224 -218 -169 -63 35 136 190 209 181 92 -8 -122 -186 -221 -193
$$ packed form
4333B42J43O2n9j43k09k11j68p8K8J15J83K03J77J09np7j66k09j74j33m2O9J32
4356b11J92J95J38P7l6j14j75j96j44r6jJ00J58J80J69J02L0o2j42j76j66j30
4378c08m6M7J10J61J69J42P3j7r4j56j74j49r5%O8J43J61J55J04L3n7j19j51j42
4402a42j23n0J7J04J48J45J35P1j1q1j24j50j36q5j1P2J05J51J26J00K3l2j02
4425A50j49j25j12m7J5Q9J23J40J18N4Pp0j14j44j11q5j2N5J06J28J26Q2L3k8
4449B29q4j20j35r6m8L2P1J17J13R8O4pn2j14j20r9o9j5N4R0R5J26P0L5k7q9j16
4476Cj07r0l9J4O8J14J13R3M9no4j00r9j11m2jM3Q7J04J07O2K0k2q3j11j15p6
4503a88l3L1P8R0J05P2O2j6m8j10j07r4o6OM9J06R8J01N4J9k8q9j00j14o4l5K8
$$ plain form
4530 -193 -111 -11 90 185 227 211 146 50 -58 -159 -203 -201 -150 -54 49 155 218 216 190 90 -9 -126 -211 -228 -192 -122 -23
4557 -23 87 180 217 193 131 31 -86 -186 -233 -226 -169 -66 46 151 224 235 198 87 -10 -117 -198 -226 -196 -119 -4 108
4583 108 196 235 221 153 43 -70 -181 -234 -241 -181 -88 46 155 233 239 196 108 -13 -148 -227 -267 -221 -152 -23 92 196
4609 196 247 242 170 61 -59 -181 -245 -251 -185 -94 34 160 237 266 240 134 10 -113 -209 -256 -240 -162 -28 88 187 247
4635 247 251 185 84 -61 -185 -252 -279 -233 -117 8 147 224 280 237 161 21 -114 -222 -284 -258 -188 -65 69 194
4659 194 271 286 223 109 -23 -144 -241 -279 -247 -144 -7 131 228 286 268 180 58 -90 -215 -293 -290 -219 -106 50 168
4684 168 255 283 230 130 -5 -145 -245 -298 -268 -177 -37 104 225 291 286 219 89 -54 -183 -273 -299 -241 -128 16
4708 16 149 266 306 276 175 33 -103 -236 -301 -290 -212 -83 59 204 292 303 239 125 -28 -158 -272 -317 -287 -173
$$ packed form
4530a93Q2J00J01R5M2j6o5r6j08j01m4KN1R6J03J06O3kk6j00r9j17q5j7L6P0R9
4557b3J10R3L7k4o2j00j17j00m7PN7J03J12J05P3J1l7j11r7j07q1k8L0P7J15J12
4583A08Q8L9j4o8j10j13j11n3pO0R3J34J09P8Om3q8j21j35p9m0M6O9J29J15J04
4609A96N1np2j09j20j22o4oO6R1J28J26P7K9k6j06j24j23r6m7J6P8J34J16R9O0
4635B47Mo6j01j45j24o7k7M6J16J25J39P7N6m3p6j40j35j08o2K6P0J23J34J25
4659A94P7J5o3j14j32j21r7l8L2J03J37J38R7N8j8q8j22j48j25p8LP1J13J56J18
4684A68Q7K8n3j00j35j40j00n3L0R1J40J41J21O6no7j30j43j29r0k6N8J13J44
4708A6J33J17M0l0j01j42j36j33o5J1P8J29J42J45Q8J1o4j14j53j30j14m5L0J14
$$ plain form
4732 -173 -28 127 237 298 300 219 68 -75 -208 -287 -308 -241 -126 41 184 271 295 268 156 20 -134 -257 -296 -294
4756 -294 -200 -70 92 213 294 300 225 100 -47 -187 -289 -308 -273 -157 -9 134 252 307 275 188 52 -99 -230
4779 -230 -305 -290 -221 -97 57 200 281 309 264 148 7 -154 -256 -300 -275 -179 -34 112 219 289 286 210 89 -58
4803 -58 -191 -270 -307 -254 -136 14 155 271 296 275 171 42 -119 -236 -291 -281 -207 -84 63 202 276 298 240 121
4827 121 -8 -157 -245 -291 -248 -166 -24 111 224 288 280 199 73 -66 -198 -276 -292 -232 -129 28 142 227 278 239 155
4852 155 12 -121 -226 -279 -263 -181 -67 74 198 270 284 230 117 -28 -159 -237 -266 -230 -138 -9 120 223 262 251
4876 251 162 51 -82 -195 -248 -252 -197 -89 33 153 244 242 212 121 -3 -128 -218 -268 -237 -157 -44 80 187 238 234 172
4902 172 80 -52 -162 -234 -243 -200 -101 21 132 221 255 223 144 35 -86 -185 -240 -223 -157 -60 55 147 222 227 169 88 -38
$$ packed form
4732a73J45J55J10O1Kq1j51j43j33p9k1O7J15J67J43Q7K4k7j12j36j54j23l9K
4756b94R4J30J62J21Q1Op5j25j47j40j02j9L5J16J48J43J18N5l2q7j36j51j31
4779b30p5J5O9J24J54J43Q1K8m5j16j41j61j02m4K5R6J45J46J07P0lp6j21j47
4803e8j33p9l7N3J18J50J41J16K5k1j04j29j61j17n5J0P4J23J47J39P4K2n8j19
4827A21j29j49q8m6M3Q2J42J35J13O4qq1j26j39j32p8j6O0J03J57J14Q5N1l9q4
4852A55j43j33j05n3J6Q2J14J41J24P2J4n4j13j45j31p8k9L6R2J29J29J03L9j1
4876B51q9j11j33j13n3mN5J08J22J20R1kl0r1j24j25r0n0L1Q0J13J24J07N1mo2
4902A72r2j32j10p2rM3R9J22J11Q9L4l2p9j09j21r9n5J7O6R7J15R2P5Nn8q1j26
$$ [...]
8191f8
##END NTUPLES=NMR FID
##END=
