##TITLE=1H_AM_NVBENZ6
 
 8 sc, 
 8.04.2022
##JCAMPDX= 6.0         $$ Bruker NMR JCAMP-DX V2.0
##DATA TYPE= NMR FID
##DATA CLASS= NTUPLES
##ORIGIN= UXNMR, Bruker Analytische Messtechnik GmbH
##OWNER= root
$$ XWIN-NMR		Version 3.5
$$ Fri Apr  8 11:17:21 2022 Russian Standard Time (UT+4h)  she@DPX200
##.OBSERVE FREQUENCY= 200.13135
##.OBSERVE NUCLEUS= ^1H
##.DELAY= (6, 6)
##.ACQUISITION MODE= SIMULTANEOUS
##.ACQUISITION SCHEME= undefined
##.AVERAGES= 8
##.DIGITISER RES= 18
##SPECTROMETER/DATA SYSTEM= spect
##.PULSE SEQUENCE= zg30
##.SOLVENT NAME= CDCl3
##.SHIFT REFERENCE= (INTERNAL, CDCl3, 0, 15.7039)
##AUDIT TRAIL= $$ (NUMBER, WHEN, WHO, WHERE, WHAT)
$$ ##TITLE= Audit trail, XWIN-NMR		Version 3.5
$$ ##JCAMPDX= 5.01
$$ ##ORIGIN= Bruker BioSpin GmbH
$$ ##OWNER= she
$$ F:/spectra/data/she/nmr/H-F/1/audita.txt
$$ ##AUDIT TRAIL=  $$ (NUMBER, WHEN, WHO, WHERE, WHAT)
(   1,<2022-04-08 11:16:05.76 +0400>,<she>,<DPX200>,
      <created by zg, POWCHK disabled, PULCHK disabled
       configuration hash MD5:
       00 E9 B6 7A A2 85 ED C7 34 08 36 98 17 FE 4E 26
       data hash MD5: 16K
       F4 04 52 E8 B3 0D E6 7F 93 D2 2F 1D E7 94 ED 3C>)
$$ ##END=
$$ 
$$ hash MD5
$$ A7 44 60 BF 76 6D 48 EA 2B 07 8B FB BB 21 83 65
##$RELAX= 
##$RELAX= 
##$RELAX= 
##$RELAX= 
##$RELAX= 
##$RELAX= 
$$ Bruker specific parameters
$$ --------------------------
##$DU= <F:/spectra>
##$EXPNO= 1
##$NAME= <H-F>
##$PROCNO= 1
##$TYPE= <nmr>
##$USER= <she>
##$AMP= (0..31)
100 100 100 100 100 100 100 100 100 100 100 100 100 100 100 100 100 100 
100 100 100 100 100 100 100 100 100 100 100 100 100 100 
##$AQSEQ= 0
##$AQ_mod= 1
##$AUNM= <au_zg>
##$AUTOPOS= <>
##$BF1= 200.13
##$BF2= 200.13
##$BF3= 200.13
##$BF4= 200.13
##$BF5= 200.13
##$BF6= 200.13
##$BF7= 200.13
##$BF8= 200.13
##$BYTORDA= 1
##$CFDGTYP= 0
##$CFRGTYP= 5
##$CHEMSTR= <none>
##$CNST= (0..31)
1 1 145 1 1 1 1 1 1 1 1 1 1 1 1 1 1 1 1 1 1 1 1 1 1 1 1 1 1 1 1 1 
##$CPDPRG= <>
##$CPDPRG1= <>
##$CPDPRG2= <>
##$CPDPRG3= <>
##$CPDPRG4= <mlev>
##$CPDPRG5= <mlev>
##$CPDPRG6= <mlev>
##$CPDPRG7= <mlev>
##$CPDPRG8= <mlev>
##$CPDPRGB= <>
##$CPDPRGT= <>
##$D= (0..31)
0 1.2 0 0 0 0 0 0 0 0.06 0 0.03 0 0 0 0 0.0002 0 0 0 0 0 0 0 0 0 0 0 0 
0 0 0 
##$DATE= 1649402165
##$DBL= (0..7)
120 120 120 120 120 120 120 120 
##$DBP= (0..7)
150 150 150 150 150 150 150 150 
##$DBP07= 0
##$DBPNAM0= <>
##$DBPNAM1= <>
##$DBPNAM2= <>
##$DBPNAM3= <>
##$DBPNAM4= <>
##$DBPNAM5= <>
##$DBPNAM6= <>
##$DBPNAM7= <>
##$DBPOAL= (0..7)
0.5 0.5 0.5 0.5 0.5 0.5 0.5 0.5 
##$DBPOFFS= (0..7)
0 0 0 0 0 0 0 0 
##$DE= 6
##$DECBNUC= <off>
##$DECIM= 32
##$DECNUC= <off>
##$DECSTAT= 4
##$DIGMOD= 1
##$DIGTYP= 9
##$DL= (0..7)
0 120 120 120 120 120 120 120 
##$DP= (0..7)
150 150 150 150 150 150 150 150 
##$DP07= 0
##$DPNAME0= <>
##$DPNAME1= <>
##$DPNAME2= <>
##$DPNAME3= <>
##$DPNAME4= <>
##$DPNAME5= <>
##$DPNAME6= <>
##$DPNAME7= <>
##$DPOAL= (0..7)
0.5 0.5 0.5 0.5 0.5 0.5 0.5 0.5 
##$DPOFFS= (0..7)
0 0 0 0 0 0 0 0 
##$DQDMODE= 0
##$DR= 18
##$DS= 0
##$DSLIST= <SSSSSSSSSSSSSSS>
$$ [...]
##$SUBNAM2= <"">
##$SUBNAM3= <"">
##$SUBNAM4= <"">
##$SUBNAM5= <"">
##$SUBNAM6= <"">
##$SUBNAM7= <"">
##$SUBNAM8= <"">
##$SUBNAM9= <"">
##$SW= 18.05172834244
##$SWIBOX= (0..15)
0 0 2 0 0 0 0 0 0 0 0 0 0 0 0 0 
##$SW_h= 3612.71676300578
##$TD= 16384
##$TD0= 1
##$TE= 0
##$TE2= 300
##$TE3= 300
##$TEG= 300
##$TL= (0..7)
0 120 120 120 120 120 120 120 
##$TP= (0..7)
150 150 150 150 150 150 150 150 
##$TP07= 0
##$TPNAME0= <>
##$TPNAME1= <>
##$TPNAME2= <>
##$TPNAME3= <>
##$TPNAME4= <>
##$TPNAME5= <>
##$TPNAME6= <>
##$TPNAME7= <>
##$TPOAL= (0..7)
0.5 0.5 0.5 0.5 0.5 0.5 0.5 0.5 
##$TPOFFS= (0..7)
0 0 0 0 0 0 0 0 
##$TUNHIN= 0
##$TUNHOUT= 0
##$TUNXOUT= 0
##$USERA1= <user>
##$USERA2= <user>
##$USERA3= <user>
##$USERA4= <user>
##$USERA5= <user>
##$V9= 5
##$VALIST= <valist>
##$VCLIST= <CCCCCCCCCCCCCCC>
##$VD= 0
##$VDLIST= <DDDDDDDDDDDDDDD>
##$VPLIST= <PPPPPPPPPPPPPPP>
##$VTLIST= <TTTTTTTTTTTTTTT>
##$WBST= 1024
##$WBSW= 4
##$XGAIN= (0..3)
0 0 0 0 
##$XL= 0
##$YL= 0
##$YMAX_a= 310106
##$YMIN_a= -313292
##$ZGOPTNS= <>
##$ZL1= 120
##$ZL2= 120
##$ZL3= 120
##$ZL4= 120
##$ABSF1= 10
##$ABSF2= 0
##$ABSG= 5
##$ABSL= 3
##$ALPHA= 0
##$AQORDER= 0
##$ASSFAC= 0
##$ASSFACI= 0
##$ASSFACX= 0
##$ASSWID= 0
##$AUNMP= <proc_1d>
##$AZFE= 0.1
##$AZFW= 0.1
##$BCFW= 1
##$BC_mod= 2
##$BYTORDP= 1
##$COROFFS= 0
##$CY= 11.3945322036743
##$DATMOD= 1
##$DC= 2
##$DFILT= <>
##$DTYPP= 0
##$F1P= 2.36226072786647
##$F2P= -0.459571619588291
##$FCOR= 0.5
##$FTSIZE= 0
##$FT_mod= 4
##$GAMMA= 1
##$GB= 0.15
##$INTBC= 1
##$INTSCL= 1
##$ISEN= 128
##$LB= 0.24
##$LEV0= 0
##$LPBIN= 0
##$MAXI= 10000
##$MC2= 0
##$MEAN= 0
##$ME_mod= 0
##$MI= 1.114404
##$NCOEF= 0
##$NC_proc= 0
##$NLEV= 6
##$NOISF1= 3.799351
##$NOISF2= 2.8
##$NSP= 1
##$NTH_PI= 0
##$NZP= 0
##$OFFSET= 15.70392
##$PC= 1
##$PHC0= -18472.84
##$PHC1= 18.20078
##$PH_mod= 1
##$PKNL= yes
##$PPARMOD= 0
##$PSCAL= 0
##$PSIGN= 0
##$REVERSE= no
##$SF= 200.130013532006
##$SI= 16384
##$SIGF1= 3
##$SIGF2= 2
##$SINO= 400
##$SIOLD= 16384
##$SREGLST= <1H.CDCl3>
##$SSB= 0
##$STSI= 0
##$STSR= 0
##$SW_p= 3612.71676300578
##$SYMM= 0
##$S_DEV= 0
##$TDeff= 0
##$TDoff= 0
##$TI= <>
##$TILT= no
##$TM1= 0
##$TM2= 0
##$TOPLEV= 0
##$USERP1= <user>
##$USERP2= <user>
##$USERP3= <user>
##$USERP4= <user>
##$USERP5= <user>
##$WDW= 1
##$XDIM= 8192
##$YMAX_p= 0
##$YMIN_p= 0
$$ End of Bruker specific parameters
$$ ---------------------------------
##NTUPLES= NMR FID
##VAR_NAME=  TIME,          FID/REAL,        FID/IMAG
##SYMBOL=    X,             R,               I
##VAR_TYPE=  INDEPENDENT,   DEPENDENT,       DEPENDENT
##VAR_FORM=  AFFN,          ASDF,            ASDF
##VAR_DIM=   8192,          8192,            8192
##UNITS=     SECONDS,       ARBITRARY UNITS, ARBITRARY UNITS
##FACTOR=    0.0002768,     1,               1
##FIRST=     0,             0,               0
##LAST=      2.2672688,     0,               0
##MIN=       0,             -313292,         0
##MAX=       2.2672688,     310106,          0
$$ Real data points
##PAGE= N=1
##DATA TABLE= (X++(R..R)), XYDATA
$$ [...]
1359B574o748L668N536n559m091O475J802p216L40P141k342o123M466M988n785
$$ 2574 -4174 -506 5030 -529 -4620 1855 3657 -3559 -3219 3922 1580 -4543 -77 4911 -874
1374h74l159O636R88p080R37O559l002n647M734M293n851k376O613L69o716J554
$$ -874 -4033 2603 3591 -3489 -2552 4007 1005 -4642 92 4385 -1466 -3842 2771 3140 -3576 -2022
1390b022O114l520n088N060L558o037j559O639l73o465K400N672m243m430N500
$$ -2022 4092 572 -4516 544 4102 -1935 -3494 3145 2772 -3693 -1293 4379 136 -4294 1206
1405A206K669o389p07O613j376o150L251N126m853l649O015J809o467L18O437
$$ 1206 3875 -2514 -3221 3392 2016 -4134 -883 4243 -610 -4259 1756 3565 -2902 -2584 3853
1420C853k156n721L911M446n373k917O063R62o400R97O152k706n108M429L849
$$ 3853 1697 -4024 -113 4333 -1040 -3957 2106 3068 -3332 -2335 3817 1111 -3997 432 4281
1435D281n502k276O029J69o319J509N626l262m548M815L358n533j341O162m57
$$ 4281 -1221 -3497 2532 2701 -3618 -2109 3517 255 -4293 522 3880 -1653 -2994 3168 2711
1450B711n983K124N132l972m150N047K515n785n90O119j082n639K941M702m480
$$ 2711 -3272 -1148 3984 12 -4138 909 3424 -2361 -2951 3168 2086 -3553 -612 4090 -390
1465c90l461N347J635n970J39N951j873n217L678M205m850k676N631Q48n997Q90
$$ -390 -3851 1496 3131 -2839 -2700 3251 1378 -3839 -161 4044 -806 -3482 2149 2997 -3000 -2110
1481b110N625k642m750M141L590n141j931N739J31n805J483N212l183m323M462
$$ -2110 3515 873 -3877 264 3854 -1287 -3218 2521 2652 -3153 -1670 3542 359 -3964 498
1496D98K935n279j236N694l81n497K115M858l545l713M686K357n320p18N559j058
$$ 498 3433 -1846 -3082 2612 2231 -3266 -1151 3707 162 -3551 1135 3492 -1828 -2546 3013 1955
1512A955n283K507M313l995l266M913J682n388J52N482j598m828L265L887m513
$$ 1955 -3328 -821 3492 -503 -3769 1144 2826 -2562 -2410 3072 1474 -3354 -89 3798 -715
1527g15k554N119P75n496P78N269k409m357L921L279m722j784N314P7n442J469
$$ -715 -3269 1850 2625 -2871 -2093 3176 767 -3590 331 3610 -1112 -2896 2418 2495 -2947 -1478
1543a478M781k989l899M122K727m870j147N218m12n071J803M423l219l502M249
$$ -1478 3303 314 -3585 537 3264 -1606 -2753 2465 2053 -3018 -1215 3208 -11 -3513 736
1558G36K240m702o54N091o98m757K198M006l551l095M253J578m910j42M923j361
$$ 736 2976 -1726 -2380 2711 2013 -2744 -546 3460 -91 -3186 1067 2645 -2265 -2407 2516 1155
1574A155m390K846L617l896k355M690Q95m964O74M780k113m058L424L014m367
$$ 1155 -3235 -389 3228 -668 -3023 1667 2562 -2402 -1728 3052 939 -3119 305 3319 -1048
1589a048j702M769J00m907J273M449k614l575L770K567m355j128M702k82m680
$$ -1048 -2750 2019 2119 -2788 -1515 2934 320 -3255 515 3082 -1273 -2401 2301 2019 -2661
1604b661J481M027k839l278L698K196m213p57M621m36m322J830L735l017k918
$$ -2661 -1180 2847 8 -3270 428 2624 -1589 -2346 2275 1839 -2483 -653 3082 65 -2853
1619b853L773J635m381k68M478j095m054K425L331l550k268M179P95m513N56M384
$$ -2853 920 2555 -1826 -2094 2384 1289 -2765 -340 2991 -559 -2827 1352 2147 -2366 -1810 2574
1635B574j882l650L228K792l904j483M377Q6m523J160L981k503l289L388K309
$$ 2574 692 -2958 270 3062 -842 -2325 2052 2138 -2385 -1225 2756 253 -3036 352 2661
1650B661m002j025M347k23m207J402L736k522l042L379K019l897p81M157l25m017
$$ 2661 -1341 -2366 1981 1758 -2449 -1047 2689 167 -2875 504 2523 -1374 -2155 2002 1677 -2340
1666b340J595L504k719k686L453J606l981l39M151r74l765K177L054l213k157
$$ -2340 -745 2759 40 -2646 807 2413 -1568 -1907 2244 1270 -2495 -318 2736 -477 -2634
1681b634L858P94m184N34M005j719l372K919K566l662j384M043O8m124J099L742
$$ -2634 1224 2018 -2166 -1632 2373 654 -2718 201 2767 -895 -2279 1764 1832 -2292 -1193 2549
1697B549k249k981L198K122l657r87L962k33l970J223L388k353k833L086J937
$$ 2549 300 -2681 517 2639 -1018 -2005 1957 1724 -2246 -1023 2365 12 -2821 265 2202
1712B202l566p23L928k64l685J478L278k490k543L203J467l700l48L839q71l536
$$ 2202 -1364 -2087 1841 1577 -2108 -630 2648 158 -2385 818 2285 -1415 -1763 2076 1205 -2331
1728b331K030K853l007j985L544P22l874M95L722j597l121K726K386l383j261
$$ -2331 -301 2552 -455 -2440 1104 1826 -2048 -1553 2169 572 -2549 177 2563 -820 -2081
1743b081L761N3l862J029L435k096k770K942J995l394q74L745k03l656J173L167
$$ -2081 1680 1733 -2129 -1100 2335 239 -2531 411 2406 -988 -1862 1883 1680 -1976 -803 2364
1759B364k197k658K852J741l384p29L603k81l484J348L087k299k334L035J441
$$ 2364 167 -2491 361 2102 -1282 -2011 1592 1311 -2173 -825 2262 -37 -2371 664 2105
1774B105l371k87L626p80l267J850K648k818j922L255O54l649M10L449j473k895
$$ 2105 -1266 -1553 2073 1293 -1974 -124 2524 -294 -2216 1039 1693 -1956 -1546 1903 430 -2465
1790b465K528K272l114j163L502P7l543R10L187j939k605K718J829l148q17L461
$$ -2465 63 2335 -779 -1942 1560 1637 -1906 -996 2191 252 -2353 365 2194 -954 -1771 1690
1806A690j51l367J099K984k038k467K693J618l160o95L358l40l259J253K800k159
$$ 1690 1539 -1828 -729 2255 217 -2250 443 2061 -1099 -1794 1564 1224 -2035 -782 2018 -141
1822a41k202K837J323l167k16L384o94l015J781K514k577j743L051O32l357L16
$$ -141 -2343 494 1817 -1350 -1566 1818 1124 -1891 -110 2404 -173 -1916 1135 1767 -1590 -1274
1838a274L201j370k773K253K065k887j162L202J30l291Q30L028j742k399K522
$$ -1274 1927 557 -2216 37 2102 -785 -1947 1255 1385 -1906 -1076 1952 210 -2189 333
1853C33J764k929q03L226j49l184J014K794j892k284K559J527k951n84L150l15
$$ 333 2097 -832 -1635 1591 1442 -1742 -728 2066 174 -2110 449 1976 -975 -1559 1591 1276
1869A276l095J210K586k126k083K636J197l017j90L194o59k800J712K363k374
$$ 1276 -1819 -609 1977 -149 -2232 404 1601 -1416 -1606 1588 929 -1871 -159 2204 -170
1884a70j606K848O48l151K95K989j238k591K066J974k673j139K964J56l097O99
$$ -170 -1776 1072 1720 -1431 -1136 1853 615 -1976 90 2064 -609 -1748 1216 1372 -1725 -1026
1900a026K798j602k306K318J644k720p59L024j05k964R84K656j779k112K432J407
$$ -1026 1772 170 -2136 182 1826 -894 -1653 1371 1266 -1698 -714 1942 163 -1949 483 1890
1916A890k769n13K977l74k869J187K410k037j896K508J026k850j50K945o98k626
$$ 1890 -879 -1392 1585 1211 -1658 -471 1939 -98 -1994 514 1540 -1310 -1460 1485 787 -1839
1932a839J599K174k260j476K691O07k870L00K819j107k394J929J832k474j078
$$ -1839 -240 1934 -326 -1802 889 1496 -1374 -1074 1745 638 -1756 173 2005 -469 -1547
1947a547K709J40k906O44K586j476k144K164J545k518p04K794j24k742R09K406
$$ -1547 1162 1302 -1604 -960 1626 150 -1994 170 1715 -803 -1507 1287 1163 -1579 -670 1736
1963A736j701j920K259J268k557l81K791l83k594J178K202j930j688K316Q79k671
$$ 1736 35 -1885 374 1642 -915 -1296 1495 1112 -1482 -304 1898 -32 -1720 596 1475 -1196
1979a196q9K687p25k412J501J979k101j320K475N09k649L00K572j051k171J788
$$ -1196 -1285 1402 677 -1735 -234 1745 -356 -1676 799 1308 -1341 -1041 1531 480 -1691 97
1995I7J660k223r53K520J35k610O18K360j365j948J960J353k339o13K527j93k474
$$ 97 1757 -466 -1419 1101 1236 -1374 -756 1604 239 -1709 251 1604 -735 -1348 1179 986 -1488
2012a488Q88K152j581j677K114J049k355k68K508m44k340J154J936j784j426K178
$$ -1488 -600 1552 -29 -1706 408 1457 -898 -1166 1342 898 -1442 -288 1648 -136 -1562 616
2028F16P36k399K0K427p28k158J367J716j974j183K251L92k374L13K322r33j934
$$ 616 1352 -1047 -1027 1400 672 -1486 -119 1597 -377 -1560 691 1083 -1291 -978 1344 411 -1523
2045a523J670J515k048q47K274Q9k381N32K121j271j729J782J219k083n11K305
$$ -1523 147 1662 -386 -1233 1041 1130 -1251 -719 1402 131 -1598 184 1403 -680 -1191 1114
2061A114j88k219Q50J920j465j491J908R07k173j93K217m59k103J086J712j663
$$ 1114 926 -1293 -443 1477 12 -1479 429 1336 -837 -1030 1187 728 -1375 -289 1423 -240
2077b40j241J991O30k135P3K208o82j904J285J530j757j054K011L28k196K84K047
$$ -240 -1481 510 1140 -995 -922 1286 604 -1300 -15 1515 -242 -1296 715 1043 -1153 -869 1178
2094A178q86j747J493J364j829p37K070J23k099N22J936j129j572J590J079j933
$$ 1178 292 -1455 38 1402 -427 -1164 906 1029 -1070 -548 1388 259 -1313 277 1356 -577
2110e77n31K043k10k047P46J736j304j309J771Q76j901j36K069l91j887R40J520
$$ -577 -1108 935 725 -1322 -576 1160 -144 -1453 318 1194 -707 -843 1226 835 -1052 -112 1408
2127A408j529j167J732N37j967L6J986n96j707J194J406j567r16J840L11j956
$$ 1408 -121 -1288 444 981 -986 -950 1036 440 -1267 -73 1333 -234 -1150 690 1001 -955
2143i55K48J854q14j598J324J219j683o80J849J00j913M56J756j001j385J452
$$ -955 -707 1147 333 -1265 59 1278 -405 -1085 764 864 -1049 -593 1163 162 -1223 229
2159B29R95j687m45J844j41j866O55J523j212j236J536P62j745j48J859l22j658
$$ 229 1224 -463 -908 936 795 -1071 -416 1107 -105 -1341 195 957 -788 -936 923 601 -1057
2176a057R08J429j315j009J611M85j751K6J723n79j570J040J179j448q06J611
$$ -1057 -149 1280 -35 -1044 567 1052 -699 -673 1050 471 -1099 -59 1120 -328 -1134 477
2192D77K85j734K81J671p37j347J193J055j483n75J641K6j663M37J487q80j231
$$ 477 762 -972 -691 980 243 -1104 89 1144 -339 -914 727 753 -910 -473 1014 134 -1097
2209a097J314Q52j502l59J612j43j593N65J352j055j073J346O62j516j66J606
$$ -1097 217 1069 -433 -792 820 677 -916 -351 1001 -54 -1127 219 881 -635 -801 805
2225H05l08j474P56J232j141q89J399M68j508O9J540m73j337R28J046j291o87
$$ 805 497 -977 -221 1011 -130 -1019 380 848 -660 -591 949 476 -861 67 1113 -178 -865
2242h65J390J71j529K51J398p06j169J080Q64j313m39J444jj423M46J308p98j019
$$ -865 525 696 -833 -582 816 110 -1059 21 885 -428 -867 577 576 -847 -401 907 109 -910
2260i10J174P17j316k90J409j52j414M99J175r22r42J183N84j332j46J406k61
$$ -910 264 981 -335 -625 784 632 -782 -283 892 -30 -972 211 795 -537 -683 723 462
2277D62j301O39J074j006q13J226L96j331N8J361m25j158Q46R13j118n46J269
$$ 462 -839 -200 874 -132 -945 281 677 -654 -596 765 340 -818 28 941 -177 -723 546
2294E46J18j315K69J220o62j008R59O95j211l63J254r5j264M37J132p31q59J069
$$ 546 664 -651 -382 838 176 -832 127 822 -389 -752 502 407 -857 -420 712 -19 -878 191
2312A91O41j161k03J276j26j255M72J064q63q48J039N18j210j76J257k20j198
$$ 191 832 -329 -532 744 618 -637 -165 899 36 -812 227 745 -465 -641 616 396 -802
2329h02N82R92r11p30J134L57j206M7J217l97j044P56P98j018m87J156R6j179
$$ -802 -220 772 -139 -869 265 622 -584 -537 680 283 -761 -5 793 -225 -712 444 540 -639
2347f39L14J108n91q66R25O00j095l00J117j35j185L91R87p28p87R74N50j069
$$ -639 -325 783 192 -674 251 851 -244 -544 573 438 -747 -356 631 -97 -884 90 640 -429
2365d29j75J193j14j138M58R87p47p73R76N22j128j46J183k19j114N09R10q75
$$ -429 -604 589 475 -663 -205 782 35 -738 238 760 -368 -514 669 450 -664 -155 755 -120
2383a20o99J035L31j145O1J152l72r63P54P26r62m15J069K5j091L05R95o07p59
$$ -120 -819 216 547 -598 -537 615 243 -720 34 760 -202 -617 452 477 -614 -309 686 79 -680
2402f80Q85N12j010j92J061j41j052M01R02p09p14R09M39j035j57J074j47j058
$$ -680 205 717 -293 -485 576 435 -617 -216 686 -23 -737 172 611 -424 -581 493 346 -712
2420g12M50R20p03p04R60M58j043j05J121k07j053N18Q58q31o07R82K59j073Q9
$$ -712 -262 658 -45 -749 211 669 -374 -479 642 435 -618 -100 758 -73 -680 302 561 -512 -423
2439d23J052m21q91P21O29r39l36J010l2j008L70R07o24o53Q62M22r80j10R74
$$ -423 629 208 -683 38 667 -272 -608 402 370 -638 -268 639 15 -638 224 646 -334 -444 530
2458E30k16r42M46Q07p05n89Q95L73r53p6J004k20r83M66Q02p32o40R19L65r97
$$ 530 314 -628 -182 625 -80 -669 226 599 -354 -430 574 354 -629 -163 639 -93 -733 186 551 -446
2478d46k7J052k41r45N65P70q01n48R74J86j012J31R63m53q03P10N43r11k57R58
$$ -446 -473 579 338 -607 -42 728 -73 -621 353 539 -473 -342 621 168 -635 75 618 -293 -550 408
2498D08q9r27L89Q21o34n75Q41L36r45l8R37k67q79M88P30o99n10Q69L00r24j6
$$ 408 319 -608 -219 602 -32 -607 234 570 -375 -413 524 257 -622 -134 596 -103 -613 256 556 -368 -384
2519c84R48k57q99N00P31p24n45Q88L01r66J4R73l10q90N55O79q06m52R25J44
$$ -384 564 307 -592 -92 639 -85 -630 258 559 -407 -393 580 270 -620 -65 614 -192 -644 281 425
2539D25r42K09R08m53p13P24M65q77k18Q95j36r00M05P47o25n05Q15L03q84J3
$$ 425 -517 -308 600 147 -566 158 623 -254 -472 423 287 -613 -208 539 -86 -591 224 527 -357 -344
2559c44Q86k81q05M77O59p08m66Q46K21q88L3Q92k90q15N16O60p19m48Q45K28
$$ -344 542 261 -544 -67 592 -116 -582 264 485 -403 -370 522 232 -583 -67 593 -126 -574 271 499
2579D99r10O4R17l47p92N84N89p86l56Q71N9q92K36Q02m95o39P04L85q27j27Q64
$$ 499 -411 -347 570 223 -569 15 604 -182 -538 333 392 -500 -264 538 43 -596 108 493 -334 -461 403
2600D03j55p95M52O87o26m31P63K21q35K0Q08l21p35M84N79o78l83Q22J60q30
$$ 403 248 -547 -95 592 -34 -465 298 519 -316 -296 512 191 -544 -60 519 -159 -542 280 440 -390
2620c90J01Q13l37p50N33N58p28l60Q15J35q45J70Q11l94o65O01M75p55k56Q27
$$ -390 -289 524 187 -563 -30 528 -200 -560 255 390 -455 -285 526 132 -533 68 543 -212 -468 359
2640C59k5q15L04P34n05n45O99L01q15o4P82k28p52M42O07o41l56P68J79p87J08
$$ 359 334 -481 -177 557 52 -493 206 507 -308 -372 410 182 -570 -128 479 -162 -518 250 429 -358 -250
2661b50P87l20o79N19N02o76l26P58P6q27J55P30l78o55N71M77p19k28Q11K7p80
$$ -250 537 217 -462 57 559 -117 -443 315 391 -436 -281 449 71 -584 -13 464 -255 -483 328 355 -425
2682d25K39P33m66n86O19L63p49j63Q06j15p35L78O53n43m52P03K20p88jP42k72
$$ -425 -186 547 81 -505 114 477 -272 -435 371 256 -479 -101 552 9 -443 260 480 -308 -309 433 161
2703A61o93M73N39o45l17P30J10p70J16P23l45o33N39M84o61k37P71M2p28K16
$$ 161 -532 -59 480 -165 -482 248 358 -412 -296 427 82 -551 -12 472 -189 -426 345 387 -341 -125
2723a25O73m31n82N49L65p36j74P49o7p15L15O59m65m71O43K78p23o5P26j80o76
$$ -125 548 117 -465 84 449 -287 -461 288 221 -494 -179 480 15 -456 187 465 -258 -323 403 223 -453
2744d53L73N60n61l67O62J91p13K7P12k63o18M41M95o15k98O87P2p17J28O57l49
$$ -453 -80 480 -81 -448 214 405 -308 -281 431 168 -450 -9 486 -129 -427 260 332 -385 -257 400 51
2765E1n67N04M17o24j96P21J0o82K46O14m00m89N47L05o49j15O69j04o66L10N27
$$ 51 -516 -12 405 -219 -415 306 316 -366 -120 494 94 -395 152 457 -192 -307 362 258 -408 -98 429
2786D29m77m03N79J88o41j8O61j63n76L70N07n11l17O10J33o75L2O20k42n56M07
$$ 429 -48 -451 128 316 -325 -343 318 155 -421 -51 456 -55 -372 238 371 -304 -272 348 106 -450 -43
2807d3M55n36k51O30J07o61J07N98l01n48M49L65n75j78O28Qo19K25N50l67m33
$$ -43 412 -124 -375 255 362 -299 -192 406 105 -443 6 371 -204 -382 246 254 -365 -140 410 43 -390
2828c90N16K51n80n8N99j24n50L09M55m67l25N34J29n92J0N60j89n12L63M04m57
$$ -390 126 377 -203 -261 338 214 -336 -27 428 -39 -364 170 299 -293 -283 277 88 -424 -61 343 -114
2849a14k39N46J24n92O2N64k21n04L79L90m89k39N76O7n97J09N42k91m72M27L29
$$ -114 -353 193 317 -275 -213 351 130 -374 5 395 -94 -333 243 310 -287 -178 364 73 -399 28 357
2870C57n22j51N61rn58K15M71l62l71M83J87n47k1N56j61m83L22M05m43k55N20
$$ 357 -165 -316 245 236 -322 -107 364 2 -369 114 301 -246 -267 289 128 -355 -33 372 -71 -326 194
2891A94Q4n40N1N12k08m45L52L48m51j98N07O2n40Q1N11k43m43L56L52m55j98
$$ 194 278 -262 -211 301 93 -352 0 348 -103 -301 206 268 -272 -191 320 77 -366 -10 342 -113 -311
2912c11N34M4n35J17M94k80m21L90K84m76j28N18l1n08J99M45l70l22M46J79n07
$$ -311 223 267 -268 -151 343 63 -358 32 316 -160 -288 230 199 -309 -110 335 -35 -357 89 268 -239
2933b39mN05j37m39L05L56l99k35M68P3n02N8M65j98m12L36L19m11j75M72M7m75
$$ -239 -243 262 125 -314 -9 347 -52 -287 181 254 -248 -190 275 77 -335 1 320 -91 -266 206 253 -222
2955b22P2M56k29m05L29L04m20j87M99L8m98J03M54k34l98L60K59m47j15M83j6
$$ -222 -150 306 77 -328 1 305 -115 -302 197 235 -263 -160 294 60 -338 22 281 -166 -281 202 186
2976A86m72J87M06l06k93L92J57m48k0M44j19m06K53L26l43k06M10P6m18M7M09
$$ 186 -286 -99 307 1 -292 100 257 -191 -211 233 114 -292 -39 287 -56 -262 148 224 -194 -147 262
2997B62j80l48K68K83l53j87M06M5m36O2M16j83l71L13K80l64j77M33N2m39P0
$$ 262 82 -266 2 285 -68 -255 151 196 -240 -178 238 55 -316 -3 277 -87 -264 169 221 -218 -148
3018a48M15k12l59L24K43l76j30M30qm19J48L55k61k81L35J64l97k5M10q0l41
$$ -148 267 55 -304 20 263 -113 -243 187 179 -240 -92 263 2 -279 56 220 -177 -202 208 128 -213
3039b13K08L03l09j85L47O4l99K9L52j53l08K45K40l00j45L62N5l91O5L63j83
$$ -213 -5 298 -11 -196 151 215 -184 -155 197 44 -264 -19 221 -79 -224 138 193 -198 -133 230 47
3060D7l17K62K55l53j35L89L4l91Q3L73j97l00K86K22l63r4L88j5l85J42L22k51
$$ 47 -270 -8 247 -106 -241 148 182 -209 -126 247 50 -250 36 258 -105 -199 189 174 -211 -69 253 2
3082Bk47L06J46l74k1L74r6l28K01K71k83j74L43N0l46M5L38j60k73K44K06l12
$$ 2 -245 61 207 -167 -188 186 90 -238 -37 234 -49 -223 120 170 -176 -131 207 47 -226 18 224 -88
3104h8j19L39Rl47R4K99j79k48K50K10l12q6L57jl55J05L08k09k66K76J78l45
$$ -88 -207 132 141 -206 -112 187 8 -240 10 220 -92 -178 179 178 -177 -72 236 27 -239 37 215 -130
3126a30o3L59k4l40J61K83k42k20K94J11l53lL35j02l07K11K40k65j53L25M1l36
$$ -130 -193 166 142 -198 -37 246 4 -216 78 189 -164 -167 168 66 -241 -30 210 -55 -208 117 158 -178
3148a78O3L03j53k55K48J72k83p5L10k0l04J04K80k01k24K61J46k90n7L20l9l15
$$ -178 -115 188 35 -220 28 200 -83 -158 152 132 -172 -68 212 11 -213 48 194 -96 -153 167 128 -187
3170a87J23K74k08k18K69J29l13m1L27m3l19J47K61k24j99K95J01l14kL18r2k86
$$ -187 -64 210 2 -216 53 182 -131 -172 155 112 -207 -60 201 -23 -222 73 174 -140 -142 176 84 -202
3192b02K00K04k53j37K96J5l11P5K75j44k11K33J61k63m1K70k5k85J02K27j94
$$ -202 -2 202 -51 -188 108 123 -188 -113 162 18 -193 40 201 -62 -103 167 142 -143 -41 186 -8
3213hj77K28R9k65j7K91m3k60J35K15k01j86K24J08k88qK85p6k48J38K34k04j50
$$ -8 -185 43 142 -123 -140 151 108 -152 -17 198 -3 -189 35 143 -145 -153 132 56 -192 -54 180 -24 -174
3236a74K49P4k68j3K91r9k24J75J86k16j19K58K1k72P1K16j55j72J94J15k35l2
$$ -174 75 149 -119 -132 159 60 -164 11 197 -19 -138 120 141 -131 -60 156 1 -171 23 138 -97 -129
3258a29K43l5k20R5K01j70j44K24O0k23j2K16o7k02J21J74j78j17K18P6k21NK44
$$ -129 114 79 -141 -46 155 -15 -159 65 125 -98 -110 106 39 -163 -42 132 -46 -163 55 131 -90 -85 159
3281A59p5k17J21J67j85j37K16N7k47L4K37q7j88J62J59j99q0K10ok17O2J92j41
$$ 159 84 -133 -12 155 -30 -167 49 106 -141 -107 130 43 -145 17 176 -23 -103 107 101 -116 -54 138 -3
3304cj33J72O5j79j4J97p1j71J03J47j59r8J83N2j86K3J84o7j59J05J35j52r7
$$ -3 -136 36 101 -78 -92 105 34 -137 -34 113 -46 -144 39 91 -95 -72 112 45 -114 -9 126 -26 -123
3327a23J75M7j89J0K05n3j74J15J59j80q4J68L4k07J1J90r1j63J33J19j70m0J73
$$ -123 52 99 -90 -80 125 72 -102 13 172 -8 -92 76 110 -97 -86 104 13 -150 -17 102 -68 -108 65
3350F5Jj76P9J37j03r9J46M9j62NJ59o9j39J03R9j36n4J44J2j45M6J33o3j25J05
$$ 65 66 -110 -31 106 3 -96 50 99 -63 -58 101 32 -107 -4 95 -41 -95 49 61 -84 -38 95 32 -93 12
3375A2R5j41m8J33K1j40K8J30o6j10J04J00j35n5J38oj40K5J41q7j10J22N9j34
$$ 12 107 -34 -82 51 72 -68 -40 90 24 -86 18 118 -17 -72 66 60 -80 -55 86 -1 -111 11 70 -64
3399f4j9J32l7j12P7R4j18l1J18Nr5L5R8n6p5R4L3j06pJ01k0j10N4P6o8o6R6L3
$$ -64 -83 49 12 -100 -23 71 -47 -78 40 45 -50 -15 83 27 -48 46 79 -27 -34 67 47 -63 -9 67 -1 -67 29 62
3427F2j08JQ8pr8M1Q5o6p1Q6L7r7pJ01l9q3N5P9p0m8R6Nr3K4Q7m8o3N0M2p0j6
$$ 62 -46 -45 43 36 -62 -21 64 -2 -73 13 50 -47 -54 47 8 -75 -20 59 -11 -59 37 42 -51 -27 60 12 -51 -1 41 -29 -45
3458d5R3l0o8O1N9p6l2Q2mq3K6P9m6n9N8N0q3k4Q0jr0K6N5l5o7P2L6o4j6P9j2
$$ -45 48 18 -50 11 70 -6 -38 44 40 -43 -17 62 16 -43 15 65 -18 -42 38 37 -53 -27 28 -7 -74 -2 34 -30 -46 33 21
3489B1o2J6O6m4n6P0K9n9j7P9j9n9M6M7o0k8N7J3q0K4P0m9n6O2K0n7k1O7Kq2L8
$$ 21 -41 -25 41 -3 -59 11 40 -19 -36 43 24 -35 11 58 -2 -30 27 40 -40 -16 54 5 -51 11 31 -26 -47 20 22 -60 -22
3520b2O3m0l9O6K9p9qO1np2K1O4m2m3N5J7n1rP1j8n9L7N0m7l3O8J4o3K3M7l3l7
$$ -22 41 1 -38 28 57 -22 -30 31 26 -46 -25 39 -3 -46 9 26 -25 -34 37 19 -40 -3 47 0 -33 35 49 -14 9 56 23 -14
3552a4L8K8q2QN3j4o6K3N0k6m9N8K6o8%M5No4J5O6l5m3N4K5o4LN6lo2L7L4m1l4
$$ -14 24 52 -30 -22 31 17 -49 -26 24 -2 -51 7 33 -35 -35 10 15 -49 -34 32 -3 -46 8 33 -31 -28 28 25 -37 0 34 -7 -41
3585d1N9J6n7MN5j3n4K9K9n0oN5J3p4L1O3m0m3N7J7o6qL9jp2K8M7m7k4O1J7n4
$$ -41 18 34 -23 -19 36 23 -31 -2 27 -23 -29 26 39 -35 -4 59 19 -24 33 50 -16 -24 15 14 -58 -30 17 -30 -54 7 24 -30
3617c0NM7kn0K8N2m9j7K9K4m3qN9l1m5L3M8o1l5P1J2p0K0M1k9l8M6K6n8j4N9j1
$$ -30 -25 22 20 -30 -2 50 1 -16 13 37 -6 -14 45 14 -31 2 50 -11 -46 25 37 -33 -13 28 -1 -39 7 33 -25 -39 20 9
3649Io2M2M4m7l5P2J3p3J1O9l1n7M0M2n5l9P0Oo0OO5j2o6N0O0n5k4N2K3o5JO1
$$ 9 -53 -11 33 -14 -49 23 36 -37 -26 43 12 -45 -5 37 -18 -57 13 19 -41 -35 30 18 -48 2 62 7 -17 35 58 -7 -6 55
3681E5m1o2M6L7n6j5O0oo5L6M5m0n5N2M9r2mQ3k4p4M5P0o3k2P7J0p9J0O7l1n9
$$ 55 14 -48 -2 35 -21 -36 24 18 -47 -11 34 -6 -61 -9 40 -52 -56 27 3 -71 -26 44 -19 -41 36 46 -33 -23 44 13 -46
3712d6N7M3n9l1O5J3o4QN4k5o5L3N2n3l8P1K1p4J7O5l3n2M4M4o4k0P7j3p9L6O0
$$ -46 11 54 -5 -36 29 42 -22 -14 40 15 -50 -17 35 -18 -56 15 36 -38 -21 44 11 -41 3 47 -17 -37 40 27 -52 -16 44
3743D4m7m7O4J5o7LP1k9p2N3N6o4l4P3K8q9K4P2l0o4O1M7o1l2N6K0q8J2O2l9n8
$$ 44 -3 -50 14 29 -38 -35 36 7 -65 -12 44 -20 -54 19 47 -42 -18 54 24 -40 21 68 7 -25 31 51 -37 -25 37 -2 -60
3774f0M2N7p1k5P1Po6OP6m6n3M9L9n6k5R6np3L8P0n9m8O7J9p8JP1l1o3M2N9p1
$$ -60 -18 39 -32 -57 14 21 -45 -39 37 -9 -62 -13 26 -30 -55 41 36 -37 1 71 12 -36 31 50 -28 -27 44 13 -50 -8 51 -20
3806b0l7R1Kq3K0P8n0n7O6L9o4k4P9Kq5K9O5m4p0N3M5q2j4P1Qq7M0P7m4p1P8M9
$$ -20 -57 34 36 -47 -27 51 1 -56 10 49 -15 -39 40 42 -43 -14 51 7 -63 -10 35 -47 -61 10 18 -69 -29 48 4 -67 11 60
3838F0q2j0Q4mq9L5O8o7m2Q9J3q7RQ8m6o6O3L7q0l7R6j4r8M2Q8n4o9P6L8q7j0
$$ 60 -22 -32 52 48 -41 -6 62 -5 -47 42 55 -32 -23 65 19 -47 16 53 -27 -64 32 18 -80 -38 50 -4 -73 3 41 -46 -56
3869e6J08k1r0K8R4o5o2R5K5r7j0J07l6p6M1Q7q2n2R2J7r6KJ21m3r8P8P2q3n3
$$ -56 52 31 -59 -31 63 -2 -64 31 56 -41 -51 56 20 -56 -15 72 -10 -62 30 47 -49 -47 74 31 -67 11 83 0 -53
3898e3J02Lj09K1R6n3r3P7P0j02l6J29j1j19L4J09q9o0R6L6r9oJ14j7j11O7Q7
$$ -53 49 52 -57 -36 60 7 -86 -9 61 -41 -77 52 41 -78 -44 65 -24 -84 12 48 -51 -57 57 40 -71 -4 83
3925H3q9o3J06L5j22J6J11m5r8P4P2r4n3J04K2j32K5J08m8j07R4O7r6m5J11J7
$$ 83 -6 -69 37 72 -50 -34 77 32 -66 8 80 -14 -67 37 59 -73 -48 60 12 -95 -1 66 -30 -75 36 53
3951E3j20L5J02n5r7R8O8j32k7J31j6j17M4J12q4p8J17M1j32lJ46n9j09Q8R1j11
$$ 53 -67 -32 70 15 -82 16 84 -48 -75 56 40 -77 -33 79 -5 -83 34 75 -57 -60 86 27 -82 6 97 -14
3977a4p2J34K9j44L2J36p6j07R5O7j18n1J29Qj29K8J21o5j03J00O1j16l0J41j2
$$ -14 -86 48 77 -67 -35 101 25 -82 13 80 -38 -89 40 48 -81 -53 68 3 -100 0 61 -55 -85 56 44
4002D4j18M6J27r8p0J11M3j15k1J28l3j17O5J01j00p4J17L5j38QJ43o0j15R9P2
$$ 44 -74 -28 99 1 -69 42 85 -30 -51 77 44 -73 -8 93 -7 -81 36 71 -67 -59 84 24 -91 8 80
4027H0j21m9J54pj28L5J18p0j08J07P3j28n4J42nj32N1J12p4r7J01Q3j32l1J42
$$ 80 -41 -90 64 57 -71 -36 82 12 -96 11 84 -44 -98 44 39 -93 -42 70 -4 -101 0 83 -49 -80 62
4052F2kj34M4J11p1q4J02P1j26j8J27m1j21O9J00j10p2J24K6j40J7J24n6j16R2
$$ 62 60 -74 -30 81 10 -74 28 99 -27 -45 82 41 -80 -11 89 -21 -93 31 57 -83 -66 58 2 -114 -22
4077b2R4j17m7J38J0j46M5J33p7j10J20P4j36l0J36j5j27M8J10p1j00R9P5j14
$$ -22 72 -45 -92 46 56 -90 -45 88 11 -99 21 95 -41 -71 65 50 -77 -29 81 10 -90 9 84 -30
4101c0m1J35jj38M5J10q3p3J06M2j16k0J31k8j20O8J08j01p3J17J8j34K6J26n8
$$ -30 -71 64 63 -75 -30 80 -3 -76 30 72 -44 -64 67 39 -81 -13 95 -6 -79 38 56 -78 -52 74 16
4126A6j08R9P2j27l6J24Lj37N5J15p3q7J03P6j18j7J17j2j09K6J05p3q9R0M4j03
$$ 16 -92 7 79 -48 -84 40 43 -94 -39 76 3 -84 19 95 -23 -40 77 65 -44 -18 87 14 -75 15 59 -44
4152d4k5J05Lj04K2J08o6p3R1M3j02j3J01k3j05O3Q7j00l5J09J9j22K3J04n1q0
$$ -44 -69 36 39 -65 -43 65 -1 -74 17 60 -42 -55 46 23 -82 -19 68 -32 -67 42 61 -61 -38 66 15 -65
4178f5Q4N2r7k1J05j9j01L8Q8p3o0R5M0r7qR7k6q8M8Q2o0n8O6M1r5j1P6j4q0L2
$$ -65 19 71 -26 -47 58 39 -62 -24 64 -9 -69 26 66 -31 -39 58 32 -56 -8 74 14 -44 22 63 -32 -43 33 19 -61 -29
4208b9P1n9n5P6J7p8J5R2l4p1O3M5o1k8Q7%r5K2Q8o2m2O2L7q8pR9k7q7M3O7p6
$$ -29 42 -17 -72 4 21 -57 -42 50 16 -55 8 53 -8 -36 51 51 -44 -22 66 4 -38 24 61 -27 -34 65 38 -49 -6 61 -15
4239a5l9P5K2r4LQ7k6p4N1O7p5l1P9J7q5NQ9l1p0M4N4n9m3P6J1q5J8P3l5o2O9
$$ -15 -54 21 43 -51 -48 39 13 -61 -10 57 -18 -49 30 47 -38 -33 56 25 -45 -1 53 -6 -49 27 38 -47 -29 44 9 -53 16
4270A6M5q4kP9nq7M6O3o7o1P4K4q5QP6m3o9M9O7o5l1P7Rp6J8P8l7p2N3M8o2k7
$$ 16 61 -23 -25 54 49 -38 8 71 4 -57 17 41 -44 -36 40 -3 -72 -23 44 -21 -52 25 34 -42 -24 54 17 -55 -2 46 -16 -43
4302d3N8K1p1J0P4l3n3N2L4o0l0P0J3p5OP6l9n8O8K3n4j9N5no6L9N6o6l1O6K8
$$ -43 15 36 -35 -25 49 16 -37 15 49 -11 -41 29 42 -33 -27 49 10 -48 20 43 -11 -30 25 20 -46 -7 49 -17 -48 18 46
4333D6p2KN8k1o4L4M0m6l3P5Mp0J4O4j5o1N1L8n3k0P8%p3J0O3l5n5L8M7p1k6P4
$$ 46 -26 -24 34 13 -51 -17 23 -23 -56 19 23 -47 -33 31 16 -45 6 44 -9 -29 49 49 -24 -14 49 14 -41 -3 44 -27 -53 21
4365B1Oo8J5O3l0n5N4L6q0mO9k6n0K6N7m5m9P0K7p1%P2k6n7L5O4n6l4P1jo1J7
$$ 21 27 -41 -26 37 7 -48 6 42 -38 -42 27 1 -49 -23 34 -11 -60 10 37 -34 -34 38 12 -45 -10 54 -2 -36 35 34 -27 -10
4397a0M8k0n9M5M6o7k5Q3np0K6O2l2m5M6K6o6k1P0k0n8K0O0m2m7N9K2o3KP2l2
$$ -10 38 18 -41 4 50 -17 -42 41 36 -34 -8 54 22 -23 23 49 -17 -38 32 12 -46 -26 34 -8 -55 4 26 -37 -35 37 5
4428En1M3L7m0l5P4K0p7OP6l0o2M3M8n5k6O7qo4J2N6l4m9M2M1o4j1N8no8L3N8
$$ 5 -46 -3 34 -6 -41 33 53 -24 -18 58 28 -34 9 57 2 -24 43 35 -29 -17 39 5 -44 -2 39 -25 -36 22 17 -51 -18 40
4460D0m3m6O2K4o3k1Q5qp4K9O0o0l9O1K9q2NP2j0p8L3P3o3k6P4K5o3nO6k2o6L8
$$ 40 -3 -49 13 37 -26 -47 38 30 -44 -15 45 -15 -54 7 36 -46 -41 31 21 -57 -24 49 -14 -40 34 59 -4 -9 57 35 -31 7
4492GN6p3l6Q2j1p0J2O9l1p0N6M4p7pP3j2n6K2O0m2n7O3L7o3LO6k1n7K7O7n7n6
$$ 7 63 -10 -46 36 25 -45 -33 36 5 -65 -9 35 -42 -49 24 12 -44 -22 38 -4 -61 2 39 -24 -21 45 24 -33 -6 61 4 -52
4524e2Q3J9p7pO1j0o4M3M9n6l8O1K2o9nQ3j7p9N3N8p6l2P8mo7J4P4n8n8P2L5p9
$$ -52 31 50 -27 -34 27 17 -47 -4 45 -11 -49 12 34 -35 -40 43 26 -53 0 58 -18 -50 28 24 -43 -29 45 -13 -71 1 36 -43
4556d3k5R1Lq3L1Q7n1o2P0L9p7j3J00k6q5N1N9o0m8P6K6r1j3R4l1q2N1P1q1m5
$$ -43 -68 23 26 -57 -26 61 10 -52 18 57 -20 -33 67 41 -44 7 66 6 -42 34 60 -31 -44 50 19 -63 -12 59 -22 -67
4586f7R6Qj00J8R1m7p3N4P3q0l2Q6J6r5L1Q7m6o6P1N7j00l1J01mj02L1J00p6o9
$$ -67 29 37 -63 -45 46 -1 -74 -20 53 -27 -59 27 43 -52 -21 66 20 -46 25 82 -18 -49 52 48 -54 -23 77 1 -68
4615f8Q9L5q6k4J07l5r0O1P8p6n8R4M0j10nJ04l4q1N2P0r3m7J13J3j01PR9l6j00
$$ -68 21 56 -30 -54 53 18 -72 -11 67 -9 -67 27 67 -43 -48 56 22 -59 -7 63 -30 -77 36 49 -52 -45 54 18 -82
4644h2P1O9q8l3J12rj02L1J14p4p2R3N4j00k5J09j4j03K5J06q6p3R4L7j08rJ12
$$ -82 -11 58 -30 -63 49 40 -62 -31 83 9 -63 30 84 -16 -41 68 54 -49 -24 82 -4 -77 17 54 -54 -63 49
4671D9k7j06O5P2p5o2J11K2j10J1J27m8j07P5Q6j01m9J24%j22K8J14p0q6R1O4
$$ 49 22 -84 -19 53 -22 -84 27 49 -61 -50 77 29 -78 -3 83 -18 -67 57 57 -65 -37 77 7 -79 12 76
4697G6j17j3J09jj16N1Q0n8q6R9M9j20j0J09j1j18O4Q6q2p2J09K5j10j3J36m8
$$ 76 -41 -54 55 54 -62 -11 69 11 -75 24 73 -47 -57 52 41 -77 -13 73 -9 -81 28 53 -57 -70 66 18
4723A8j07O3Q9o9o9J18J2j09RJ15m3r4P9O8r8m1J04J0j10K5R5m6r5R6N2j14j5
$$ 18 -89 -26 63 -6 -75 43 55 -54 -45 70 27 -67 12 80 -18 -59 45 55 -55 -30 65 19 -76 20 72 -42 -57
4750e7J00nj09L7J13q4p1Q7N3j08j7J10k1j05N5R0p8p1R6M2j17OJ18l5j01Q1P4
$$ -57 43 38 -71 -34 79 -5 -76 11 64 -44 -61 49 28 -77 -22 68 -10 -81 15 57 -60 -54 64 29 -72 9 83
4777H3q5o0J12Nj08K6J00n4q2P3O7j02m3J36j0j19L2R9o2q4P5O5j05k1J22j8j11
$$ 83 -2 -62 50 55 -53 -27 73 19 -63 10 77 -25 -68 68 58 -61 -29 70 8 -76 -1 64 -41 -62 60 42 -69
4804f9M1R7o5q9R1O7j24j2J27l8r4N4J01r4o1J10K6j13KJ14l3j11Q0P3q5n2J01
$$ -69 -28 69 4 -85 6 73 -51 -63 64 26 -68 -14 87 -7 -68 42 68 -45 -43 71 38 -73 7 80 -5 -57 44
4831D4K1j12K4R8o6q6Q7O2j06l1J03J0j17L5J07p9o7Q7O0j13k3J18j8j08L7J02
$$ 44 65 -47 -23 75 9 -77 10 72 -34 -65 38 48 -69 -34 73 -6 -73 14 74 -39 -62 56 38 -70 -33 69
4857F9o5p7J03M8j24nJ19j5j16O5R4r4o8J08L8j33K0R9l7j02P6P5j00m5J05J5
$$ 69 4 -73 30 78 -46 -51 68 53 -63 2 96 2 -66 42 80 -53 -33 66 29 -73 3 78 -22 -67 38 53
4883E3j22K4J03o3p5P7O5r4l7J23j2j07L3J02o6q3R5O0j12j8J09j1j08M4J04o6
$$ 53 -69 -45 58 -5 -80 -3 62 -32 -69 54 42 -65 -32 70 4 -79 16 76 -36 -54 55 44 -64 -20 84 18
4909A8r0J00M8j13j4J16k2j05M1J01q0o3R3M6j18j4J28m3j00N2Q6r3o1J20J0j16
$$ 18 -72 28 76 -37 -51 65 43 -62 -21 80 0 -63 30 76 -42 -56 72 29 -71 -19 67 -26 -87 33 43 -73
4935g3K3J07m9q5Q0O0q2m5J04J9j05K0J02n6p0P1O5j04j8R0jj12K7J06o8q1Q9
$$ -73 -50 57 8 -77 3 63 -19 -64 40 59 -46 -26 76 20 -50 21 86 -18 -36 54 53 -59 -32 74 6 -75 14
4962A4N8j08k9J06jj08M5Q9p1p6R2N0j05oJ02m6p8O4P1q5m6R0K4j01LJ08l4q8
$$ 14 72 -36 -65 41 40 -68 -23 66 -5 -81 11 61 -44 -50 52 6 -72 -8 63 -22 -68 22 46 -55 -52 56 22 -66
4990f6O0P1p0m2R1Rr5J4R9m1q8P5O1j01l5J07lj12N3P3m8q3P3M9q9l1J08mj10
$$ -66 -6 65 -5 -47 44 53 -42 -28 71 30 -58 17 78 -23 -58 49 46 -66 -13 60 12 -71 2 51 -38 -69 39 35 -75
5019g5L6Q9n1p6Q6M5q7k3J05l0q7N6P6p5o1R9L7j04J3R3l9r5O4P7q4l8P9K4j09
$$ -75 -39 50 -1 -77 9 54 -33 -56 49 19 -68 -12 64 -11 -72 27 64 -40 -27 66 27 -68 -4 73 -11 -49 30 54 -55
5048e5J8R0m1q4O6O2r6k7J04mr2K2R2n1p5O3P2r3k8R7%j14M3R4n9o9Q4M1r0j8
$$ -55 -37 53 12 -72 -6 56 -40 -67 37 33 -59 -37 55 4 -71 -8 64 -29 -57 40 40 -74 -31 63 4 -65 19 60 -30 -48
5078d8J07k6r2M4Q5n9o1Q5L2j07NR5k7r4M9Q1q3n9J08J9j20K6R3l6j02O5O8r2
$$ -48 59 33 -59 -15 70 11 -50 35 67 -40 -35 60 33 -61 -12 69 -14 -73 35 54 -66 -40 53 17 -85 -20 48 -44
5106d4k9R9Rr9J5J08o1p1R0N4j02j6R9Pj05K9R9o7q6Q9M8j09j1J06j9j03N6Q5
$$ -44 -73 26 35 -64 -49 59 -2 -73 17 71 -31 -47 52 59 -46 -17 82 15 -71 18 66 -43 -54 52 33 -70 -14 71
5134G1q9p0J10L6j13qJ28l0j11O1R2r6o9J24J2j11QJ17m7j01P7Q9r7o5J22J9j15
$$ 71 -18 -88 22 58 -55 -63 65 35 -76 -15 77 -19 -88 36 48 -63 -55 62 15 -86 -9 80 -17 -82 40 59 -56
5161e6K8J19o9r5Q8O9j14l5J08J1j20L9J09q5p6J02M7j15j4J21k3j23M8R7o5q2
$$ -56 -28 91 22 -73 15 84 -30 -65 43 54 -66 -27 82 -3 -79 23 70 -45 -59 62 39 -84 -36 61 -4 -86
5187h6J09L6j17j2J29j6j27P3Q9r2o0J16K5j36K7J19m7j03P1R0j14l2J02J5j22
$$ -86 23 59 -58 -70 59 43 -84 -11 78 -14 -74 42 67 -69 -42 77 30 -73 -2 88 -26 -58 44 59 -63
5212f3K4J26p6j04J08O7j17l7J17Qj35N4R4o1r3J03O1j26l4J40j1j26N8J00q5
$$ -63 -39 87 11 -93 15 82 -35 -72 45 53 -82 -28 66 5 -88 15 76 -50 -84 56 45 -81 -23 77 -8
5237hp3J11L4j17j1J39m0j26Q0R2r9o0J34K0j33KJ42m9j19P9R3j10m8J18K1j37
$$ -8 -81 30 64 -53 -64 75 35 -91 -11 81 -18 -78 56 76 -57 -55 87 38 -81 -2 91 -19 -67 51 72 -65
5263f5K0J30o9j05P8R0j31k7J28j2j28N0J16q2r2J19O3j24k7J32k0j19O0J08q6
$$ -65 -45 85 16 -89 -11 79 -52 -79 49 37 -91 -41 75 -7 -99 20 83 -41 -68 64 44 -75 -15 93 7
5288Gq2J17L8j24qJ38m7j14P0R1j09n5J16L8j36KJ42n5j27Q7J09j29n7J34Oj25
$$ 7 -75 42 80 -44 -52 86 39 -75 -5 86 -23 -78 38 76 -60 -58 84 29 -98 -11 98 -31 -88 46 52 -73
5314g3L3J27p1j11J03P5j32j5J16j3j24N1J21r2q4J16M4j07k6J38k0j35O7J18
$$ -73 -40 87 16 -95 8 83 -49 -64 52 39 -85 -34 87 -5 -89 27 71 -36 -62 76 56 -79 -12 106
5338A06r1r4J21L2j22j2J43n0j27Q9J00j13p7J33L6j48K7J36p4j15J07P5j13n4
$$ 106 15 -79 42 74 -48 -60 83 33 -94 -5 95 -18 -95 38 74 -74 -47 89 15 -100 7 82 -31 -85
5362h5J33J5j37K0J28n8j11J05O9j19m0J47pj37N7J22q8r8J21N0j28j5J32m3j34
$$ -85 48 63 -74 -54 74 16 -95 10 79 -40 -80 67 60 -77 -20 102 14 -84 37 87 -41 -56 76 33 -101
5387a01Q8J09j05p9J25K9j19LJ21m5j18Q3R5j13n8J30J3j40L4J37p1j07Q7Q9j14
$$ -101 -13 96 -9 -88 37 66 -53 -50 71 26 -92 -9 86 -27 -85 45 58 -82 -48 89 18 -89 -2 87 -27
5412b7n8J42Qj34L9J16p5r9J11N7j12k7J29nj41O5J00p3r8J03O4j26k9J34k2j27
$$ -27 -85 57 65 -69 -30 86 11 -88 23 80 -32 -59 70 65 -76 -11 89 16 -82 21 85 -41 -70 64 42 -85
5438h5O7Q4q8p0J14L1j22NJ29m6j10Q4R2j18m6J24K9j43K5J21n4j02Q2Q3j16l9
$$ -85 -18 66 -22 -92 22 53 -69 -64 65 19 -91 -7 85 -33 -79 45 74 -69 -44 77 23 -79 3 86 -30 -69
5464f9J27Oj36M1J17p0q8Q8P2j16k5J05nj19N1J06q5q4J05M8j22k0J24j5j30P4
$$ -69 58 64 -72 -31 86 16 -72 16 88 -28 -53 52 47 -72 -21 85 0 -84 21 69 -53 -73 51 36 -94 -20
5490b0Q8p3p2J03M1j18MJ16k6j19O9Q5q9n9J25K8j40K4J18n3j06Q3P9j02n4J22
$$ -20 68 -5 -77 26 67 -51 -47 69 43 -76 -7 78 -11 -70 55 83 -57 -33 85 32 -74 9 88 -14 -68 54
5516E4J7j34K2J24o3j01J02O1j09m1J26%j34L8J10o1r2Q9O4j23j4J26j5j12M2
$$ 54 71 -63 -41 83 20 -81 21 82 -27 -68 58 58 -76 -38 72 11 -81 8 72 -51 -65 61 46 -66 -24
5541b4R7p5p2J14M6j25pJ20k2j12N6J07j01o7J05L8j34J4J06k5j20P0R4j02p5
$$ -24 73 -2 -74 40 86 -39 -46 74 52 -60 -4 103 2 -65 40 78 -56 -42 64 39 -81 -11 83 -19 -94
5566i4J43Qj32K1J23n0j03Q4P3r1m4J15jj11K4J15p3r0J03N7j18l3J43j7j09N2
$$ -94 49 57 -75 -54 69 19 -84 0 73 -18 -62 53 52 -59 -35 80 7 -83 20 77 -41 -74 69 52 -57 -5
5592eQ9p7p0J04K7r7k1J32l4j26O2J01q3q0J11L8j33NJ19l3j08P1Q3r4n6J06L4
$$ -5 84 7 -63 41 68 -29 -50 82 48 -78 -16 85 2 -78 33 71 -62 -57 62 29 -79 -8 75 -19 -75 31 65
5619F5j33K8J04l3j10Q1Q1j03n0J19J4j18K4J05n2r9R1O7j01k8J00Qj16M1J11
$$ 65 -68 -40 64 31 -79 2 83 -20 -70 49 63 -55 -31 74 22 -77 14 81 -20 -48 52 60 -56 -15 96
5644I6q7p1P7N5j13j2J07j8j23O5R6q5p3J10L4j14mJ21m1r2N7R0r5m1J05K5j32
$$ 96 9 -62 15 70 -43 -55 52 34 -89 -24 72 -13 -86 24 58 -56 -60 61 20 -72 -15 75 -20 -61 44 69 -63
5671f3K7J21n8r0P0Q5j17l3J11Nj17L4J07o0r8J03O2j12l0J04Kj28M4J12q0r2
$$ -63 -36 85 27 -63 7 92 -25 -58 53 58 -59 -25 82 22 -76 27 89 -23 -53 51 53 -75 -31 81 1 -91
5697i1J08L9j07JJ12k7j13O2R5r2n9Q8M8j21J5J20l7j08P0R5j08m9J19J8j18J2
$$ -91 17 56 -51 -50 62 35 -78 -16 79 -13 -72 16 64 -57 -42 78 41 -67 3 98 -10 -59 60 78 -40 -28
5723b8J07n5r3P2Q3j04o7J23J3j19J7J32p2j02J10M8r4m6J32j0j10L0J07o5r2
$$ -28 79 24 -69 3 86 -18 -85 38 51 -68 -51 81 9 -93 17 65 -29 -75 57 47 -63 -33 74 9 -83
5748h3R6O7j33j7J30k7j03O1R7j03n7J06M0j29PJ16m0j07Q4Q7j15n1J24K4j24
$$ -83 13 80 -53 -70 60 33 -70 -9 88 -15 -72 34 74 -55 -48 68 28 -79 5 92 -23 -74 50 74 -50
5773e0J8J15n9j03Q9P2j19m1J24Jj23L9J21q3q9J10N9j26k8J38j0j31M7J25r4
$$ -50 -32 83 24 -79 10 82 -37 -78 46 47 -76 -37 84 1 -88 22 81 -45 -73 65 55 -76 -29 96 2
5798Bq0J01O2j29j9J29j8j27O5J08r9p6J25L8j39MJ28l3j28O9R9j03o9J34J7j42
$$ 2 -78 23 85 -44 -63 66 48 -79 -14 94 -5 -81 44 82 -57 -53 75 42 -86 -17 82 -21 -90 44 61 -81
5824h1K4J38n6j27J05P9j22m3J35mj24L4J27p8j04J20N9j16l6J40j6j25N5J16
$$ -81 -57 81 25 -102 3 82 -40 -83 52 48 -76 -42 85 7 -97 23 82 -34 -70 70 54 -71 -16 100
5848A00j04q4J13N4j20k0J44m0j14N7J03r4p8J09M1j38J2J34n4j15Q0R9j14n5
$$ 100 -4 -88 25 79 -41 -61 83 43 -71 -14 89 -5 -83 26 67 -71 -59 75 21 -94 -14 85 -29 -84
5872h4J21J7j29K4J26o3j02R4R2j34k9J30Kj41M9J17p7j01J11O5j26k3J24j3j35
$$ -84 37 54 -75 -51 75 12 -90 4 96 -38 -67 63 65 -76 -27 90 13 -88 23 88 -38 -61 63 50 -85
5897h5O1J15j05o4J06M6j27oJ31m5j18O7J09j03p0J22K5j19KJ26m1j20Q6Q2j07
$$ -85 -24 91 -14 -78 28 74 -53 -59 72 27 -91 -24 85 -18 -88 34 59 -60 -58 68 27 -93 -7 75 -32
5922c2n0J31J9j41L2J34q0q4Q5P4j18l3J25Lj41O3J08q2r4J06N8j20l4J31k0j25
$$ -32 -82 49 68 -73 -41 93 13 -71 14 88 -30 -63 62 65 -76 -13 95 13 -81 25 83 -37 -71 60 40 -85
5948h5O6R3r2p7J16M1j23rJ34l1j11O8Q6r3o4J23J9j30J7J20n7r6Q6O5q5n3J31
$$ -85 -19 74 -18 -95 21 62 -61 -70 64 33 -78 -10 76 -17 -81 42 61 -69 -52 68 11 -85 1 66 -19 -72 59
5975E9Oj28M5J03p2j04J01P1j07k9J21j2j28N3R3q1p8J01N4j25rJ22k2j10O0R3
$$ 59 65 -63 -18 85 13 -91 10 81 -26 -55 66 54 -74 -21 72 -9 -87 14 68 -57 -66 56 34 -76 -16 77
6001G7q8o1J01M3j22qJ43n4j13P8Q0r3m5J10K9j21PJ10m5r5P6P5j06l0J04%j13
$$ 77 -11 -72 29 72 -50 -58 85 31 -82 -4 76 -17 -62 48 77 -44 -37 73 28 -67 9 84 -22 -52 52 52 -61
6028f1L3J03p1q3R9N1j18j9J16qj18M7R7o8q8J08N1j21nJ18l6r1O1O9p5n8R7L0
$$ -61 -28 75 4 -79 20 71 -47 -66 50 42 -76 -29 68 0 -88 20 71 -50 -55 63 27 -64 -3 66 -9 -67 30 60
6056F0j15J5J03l6r4P6O9r5m4J12Qj14J4J07m8q4P7N9j01l2J09oj10L8R2o4p4
$$ 60 -55 -40 63 27 -67 9 78 -17 -61 51 59 -55 -41 66 18 -66 11 70 -31 -63 46 40 -70 -32 60 -4 -78
6083g8Q5N0j02j7R7pj01M9R3p2n6P7M8j02lJ05l8p1M5P3p8n9J07K0j06j0J08m9
$$ -78 7 57 -45 -62 35 28 -73 -24 69 -3 -59 18 66 -36 -39 66 28 -43 2 75 -3 -62 45 65 -41 -51 57 8
6111Hp6O7O6r6m2J01J1j05K5R6n1p7O7O6q9l8J06lr3K2R7o2p6P2N2q1k4R8kr4
$$ 8 -68 -1 65 -31 -73 28 39 -66 -41 55 4 -73 -6 60 -29 -67 39 36 -57 -35 62 0 -76 -4 48 -33 -57 41 39 -55
6141e5L1Q4o0n6Q8M4j09j0J03j5r8M5Q3p7m9P5K8r6LQ2k3q6O0N7q0m1Q6K9j02
$$ -55 -24 60 0 -56 32 76 -33 -43 60 45 -53 -8 75 -2 -51 24 52 -44 -41 41 18 -68 -8 49 -31 -72 14 43 -59
6170e9J0J10m6q4O6O1p4l2Q9kr8K8R2n2p0N6P4j02k4J04j8q1L5Q1m8p0P9K7r0
$$ -59 -49 61 15 -69 -3 58 -16 -48 41 39 -59 -31 61 9 -61 -5 69 -33 -57 47 29 -52 -17 64 16 -54 25 52 -38
6199c8oR0rj00M7P5o6n1P1K0r0RR0l0q2O4M5o6l4Q6J4q7PQ6k8p9O5N4o6m1Q3K0
$$ -38 -44 46 37 -63 -16 59 -7 -58 13 33 -57 -48 42 12 -70 -6 39 -27 -61 25 39 -48 -41 45 17 -62 3 57 -9 -50 33 53
6231E3r5K2P7m6o0O0M7p2l4Q0lq7L0Q5o1o2P0M3r5pQ2Mq6L1Q2o2p1R0J9p9mR2
$$ 53 -42 -20 57 11 -49 11 58 -14 -48 32 29 -58 -28 57 -4 -66 4 47 -48 -55 27 31 -55 -24 58 -4 -75 15 34 -45 -49 43
6263D3k8p4M8O1n8m6Q5K5r1rJ01k9p6O5N1p7m4R6Mr1J8Q0m5o3N5N4q8qP8oq2K6
$$ 43 15 -59 -11 50 -8 -54 31 56 -35 -44 57 28 -48 17 68 -9 -53 43 47 -44 -26 54 9 -54 1 55 -33 -41 37 31 -51 -25
6295b5P7n8n8P6K6q0j7Q4jr3M3P3n4l9O3K1p6jQ7k2p0M3O7n8n8P5K9r5J2Q0l4
$$ -25 52 -6 -64 12 38 -42 -59 25 24 -69 -26 47 -7 -46 17 38 -38 -39 48 26 -44 -1 66 8 -50 25 54 -41 -29 51 17
6326A7p2N2N1o4m0Q6J8r9J6Q0l7p0O1M9p6k8R3mr1L4P6m4o1O3L6r3J0Q3j8p7K9
$$ 17 -55 -3 48 -16 -56 30 48 -51 -35 45 8 -62 -1 48 -28 -56 37 33 -58 -24 52 8 -53 10 46 -47 -37 46 28 -49 -20
6357b0P3o2m5P1L0p8j0R5k9q0N7O0o9m6P9J8q8kR4m8q5O4O0p1k6Q6Kr2K1Q5m0
$$ -20 53 -9 -54 17 47 -31 -41 54 25 -55 2 62 -7 -53 26 44 -44 -46 48 0 -85 -21 39 -32 -58 28 30 -62 -41 44 4
6388Do2O2M6p9rR3or0L7O5n4n7O4L7q8pQ4j2p3M2O3n2n5P3J8p7j0Q3j9p4M4O9
$$ 4 -58 4 50 -29 -38 55 49 -41 -4 61 7 -50 14 51 -37 -44 40 28 -45 -3 60 8 -47 26 44 -33 -43 40 21 -53 -9 60
6420F0p9l5Q0J3r0MQ9l4p8N8O5q7k6Q2J6q4K9N8k3o5O1M4q2j1P7j0q1M7N6n5n2
$$ 60 -19 -54 26 39 -51 -47 42 8 -70 -12 53 -34 -60 22 38 -46 -17 41 18 -47 14 58 -24 -35 42 32 -49 -2 54 -1 -53
6451e3P1K5q2nQ3j6q1L6O4n4m2O5L2r1J7P9k5q5N0N9o5l5P2Rq4J8Q5m6o2P9M3
$$ -53 18 43 -39 -44 39 23 -58 -22 42 -12 -54 11 43 -48 -31 48 23 -62 -12 47 -18 -53 19 28 -56 -38 47 1 -61 18 61
6482F1p6j7Q0rp9K0P9m9o6P8M1p6k5Q9k2q3M2O6o5n8Q5L2r3mQ5k7o0M4N8o4m4
$$ 61 -15 -32 48 39 -40 -20 59 10 -56 22 63 -13 -38 51 29 -54 -12 54 -11 -69 16 48 -45 -49 36 9 -51 -7 51 -13 -57
6513e7P2K5q9J4P3l5n0N5M4p4j6P3J3p7K4P1n9m6N3M1p3j0P9j9q0N8L1m3n1P6
$$ -57 15 40 -49 -35 38 3 -47 8 52 -22 -38 35 48 -29 -5 66 7 -39 14 55 -18 -28 51 32 -48 10 41 -2 -53 23
6543B3J3p1mP6k1p4M1N2n1l8P4J7r0K0Q1l1p3O4N3p6k4N6K7q0K1P1l5o7N5L8o2
$$ 23 36 -35 -39 37 16 -58 -17 35 -16 -54 20 37 -53 -33 48 17 -56 8 61 -15 -39 17 44 -36 -15 56 21 -46 9 47 -15
6574a5k8Q5j6o6K9Q1n3o0P8K7p3k4P0op8L5O7o1m6O5K4p3LP0j9o2L9N4n2m6P8
$$ -15 -43 42 26 -40 -11 70 17 -43 35 62 -11 -35 35 29 -49 -14 53 -8 -54 11 35 -38 -35 35 16 -46 -7 47 -5 -51 27
6605B7Ro7K2P0m1o1N6L9n8j3N3J2p8J7O1m5m9O0K4n4j9P8j9p5L3N5m5m0O0K0o5
$$ 27 36 -31 -9 61 20 -41 15 54 -4 -17 36 48 -30 -13 48 3 -46 14 38 -16 -35 43 24 -51 -18 37 -8 -48 12 32 -33
6636c3kO6j5o7L6N6o3m0P6J6p7K1O8k7m9L7N3n0m5P8on9K3M3j5o6N5K4n4k0P1
$$ -33 -35 31 16 -51 -15 41 -22 -62 14 30 -47 -26 42 15 -34 3 56 6 -39 39 33 -26 -3 40 25 -41 14 38 -16 -36 35
6667C5oo3K4N3n4m0N1L5o6j4P1lo2K3N6n3k8N5J6o7PO4j7n8M4M3n0m5P8Oo1KP1
$$ 35 29 -34 -10 43 -11 -51 0 35 -31 -45 26 23 -39 -16 40 -13 -41 14 30 -37 -30 34 17 -41 3 46 -4 -49 29 35 -26 -24 47
6700D7k7n9M5M9n7l7P3Ln8KO7m0m9M9K9o2j9P1pn8QP5m6o0O6J9n5j3O3j1o0K7
$$ 47 20 -39 6 55 -2 -39 34 37 -21 -19 48 8 -41 8 37 -25 -44 27 20 -38 -30 45 -1 -61 5 24 -31 -44 19 8 -52 -25
6732b5P2n2k7M8K3n9jO8k7o7M1M4l4m2N1K7q0K5M6j6m8L3M5o9k5N8J0o0NO5l5
$$ -25 47 -5 -32 16 39 -20 -21 47 20 -47 -6 38 4 -38 13 40 -40 -15 31 15 -33 0 45 -24 -49 9 19 -41 -36 29 -6
6763fm7L7L8m7j6N2Mn5L0M4l5m3O1K5n2qM9on6K6M7m0n1O7J4n6%N6k7m7L9L1l0
$$ -6 -53 -16 22 -25 -41 11 15 -40 -10 34 -1 -44 17 42 -10 -18 31 25 -31 -5 42 2 -49 18 32 -24 -24 32 5 -42 -3 28 -2
6796bl4N5J7o4JN4k6m2L7K2m3k6N4J0n9K1M2j5n1M4L4n5MM0ol9J4N2m2l3N3K2
$$ -2 -36 19 36 -28 -27 27 1 -41 -4 18 -25 -51 3 13 -46 -25 17 2 -49 -5 29 -26 -22 18 12 -27 -13 39 -3 -36 17 39
6828C9n3j2O1j7m9J7M1l7l1M1K0m7qM0j6l5K9M2l3m2N2J9n3J4L7j9l5L2L2m7k0
$$ 39 -14 -26 35 18 -31 -14 27 -10 -41 0 20 -27 -35 5 -11 -46 -17 25 -8 -50 2 21 -32 -18 19 0 -35 -3 29 -18 -38
6859c8M2J6n7MO4k0n0M2L7n6j0N2j0m4J8M2l2l7M9J6m7pM6j0m7J9M4l7k9M2J2
$$ -38 4 20 -37 -33 31 11 -39 3 40 -16 -26 26 16 -28 -10 32 0 -37 12 28 -19 -26 20 10 -37 -18 26 -11 -40 2 14
6890A4m7nM3ll9K9K4l3j5M7Nn5K8M4k6m1L9L0l7l2N4J0n4J5M1k2m0L3L9o2j5N4
$$ 14 -33 -38 5 2 -37 -8 16 -17 -32 15 20 -35 -7 37 11 -30 9 39 2 -30 24 34 -20 -5 36 14 -26 7 46 -16 -31 23
6922B3Qo6L1L9k1m2L8J1m6mM1Jn3K3M0l3l0N0J7m3pO0l7k9J2M1k4l4L8J8l2pM6
$$ 23 31 -35 -4 35 14 -28 10 21 -25 -29 12 13 -40 -17 23 -10 -40 10 27 -16 -23 37 0 -29 -17 24 0 -34 4 22 -10 -17 29
6955B9j7m8K7M5m1j3M0om0OM8j8m7L4K4l7j9N5j2m7J5M1l6k6L4J7m2j0N1Qo1K9
$$ 29 12 -36 -9 36 -5 -18 22 16 -24 -18 30 12 -35 -1 23 -14 -33 22 10 -37 -22 19 -17 -43 -9 8 -34 -44 7 15 -46 -17
6987a7M0m3j5M6J1m0j4O7k2m2K0L5k5l5M2K6o5PO0l4l8L3L2m7k3M8J9o5J1N9k7
$$ -17 23 -20 -35 11 22 -18 -32 35 13 -29 -9 26 1 -34 8 34 -31 -24 36 2 -36 -3 29 -18 -41 7 26 -39 -28 31 4
7018Dm7L5L3m9j9N4Mn0K0M2k6m4M0K5n0kN0jn5L3L0l6j7M6J4m4rM8j2m9L2K5l7
$$ 4 -43 -8 25 -24 -43 11 15 -35 -15 27 1 -43 -3 22 -28 -30 20 19 -36 -3 27 -9 -26 20 34 -10 -19 29 17 -32 0 25 -12
7051a2l6M2K8n4J4M8k0m7M5J1k9k6M6J3o5J4N6k1m4M2L9o2j8N7mn1J4N2l5l3N1
$$ -12 -48 -6 22 -32 -18 30 10 -37 8 19 -10 -36 10 23 -42 -28 28 7 -37 5 44 -18 -36 21 17 -34 -20 32 -3 -36 15
7082A5J6m8nP0k6m7K6M0m3l1N5K3p2%N0j1n8K9L9m5j8N3mn4J8N9m2l6L5L2l7j5
$$ 15 31 -17 -22 48 22 -25 1 41 -2 -33 22 45 -27 -27 23 12 -46 -17 22 -23 -41 12 8 -46 -28 31 -11 -47 -12 20 -17 -32
7114c2N7lm5J6L6k3m5L8K7m8j5P1j5n6L4L9m1l3N7K1n9jM5j4m9K1N3l9l4N1J3
$$ -32 25 22 -23 -7 29 6 -39 -1 26 -22 -37 34 19 -37 -3 36 -5 -38 19 40 -19 -20 25 11 -38 -17 36 -3 -37 14 27
7145B7o6KO3l4m3L6L8n0j9N3J0n2J6N4l1m3L8M0m2k8N1J6o8J5N3m4k8M7L2o4j4
$$ 27 -39 -37 26 -8 -51 -15 23 -27 -46 7 17 -35 -19 35 4 -39 -1 39 -3 -31 20 36 -32 -17 36 -8 -36 11 43 -21 -35
7176c5N7Ko3K5M8n2j9M8J4n3oN4k1m4L4L9m5k9N1J7o3J7M2k8l4L6L8m5pO0jn2
$$ -35 22 24 -39 -14 34 -18 -37 11 25 -28 -34 20 -1 -45 -11 28 -17 -46 5 22 -41 -24 18 -10 -44 -8 30 -15 -22 38 37 -15
7208a5QM5k3n0M8K1m3j6N7qn5J8M5l7k6L1L4o2qO3j3n5K0M9l7k8M4J7n7PM9ln8
$$ -15 -7 38 15 -35 13 34 -9 -25 32 24 -31 -13 32 -5 -31 0 34 -28 -36 27 14 -41 -21 28 -9 -37 7 24 -33 -26 23 20 -38
7241c8K2M6l9k8M9J4n0NO4l3m0K2M5m5j9N5Jn8J3N4k3m7L7L3n1j6L8Om9J4M3k9
$$ -38 -16 30 -9 -37 12 26 -24 -19 45 12 -28 -6 39 -6 -25 30 31 -27 -14 40 17 -30 7 40 -11 -27 11 17 -32 -18 25 -4
7273dl9M8K6n8kL8lm6K0M8m0k4M5K0m6rN7k4m3L6L7l6k9M4J7n1OL9rl9K2L5l7
$$ -4 -43 5 31 -27 -29 9 6 -40 -20 28 -12 -36 9 29 -17 -26 31 7 -36 0 37 1 -28 16 33 -18 -12 27 18 -21 1 36 -1
7306ak5M6J0m6JL4k2l7L7J6l1l2M9Jl7J3M2j5m2K6L1m1j2N0Nm7J4M5l3j9L6Ok9
$$ -1 -26 20 30 -16 -15 19 -3 -40 -3 13 -18 -50 -1 0 -37 -24 18 3 -39 -13 18 -23 -35 15 20 -27 -13 32 -1 -20 16 22 -7
7339gj5M5ol6K1L7l1m3N1J4m4mM6j5m1K6K4k1l9M4Ol7JL6ln3K9L9n0j2M8J0m0
$$ -7 -22 23 17 -19 2 39 8 -35 16 30 -14 -18 28 13 -28 -2 22 1 -38 6 12 -25 -24 12 9 -44 -15 24 -26 -38 10 20 -20
7372b0JN5k1l2K2K4l7NK6kl1J4K8j4l5L2K2m4j5M3Nm3%M0k1l4L7K0l6rL2ql2J8
$$ -20 -19 36 15 -17 5 29 -8 -3 23 21 -10 4 32 18 -17 15 37 -7 -22 21 26 -17 -17 23 2 -32 5 25 -11 -20 12 4 -28 -10
7406a0L2k1l0M0%l0PL5j8m1L8K7l6j4L9nk1ML1mm2M0K6m6j6M1Ql9j1L7j7l2L4
$$ -10 22 1 -29 11 11 -19 -12 23 5 -36 2 29 -7 -21 18 13 -8 -4 27 23 -19 21 47 1 -15 26 34 -5 -16 21 4 -28 6
7439FK0n0pL3Pl5PM4k3l2L6J9l3j0M0j1m0J7L6k0l1M0J3m2J0K6rk9J7L8l3k9L6
$$ 6 26 -24 -31 2 9 -26 -19 25 2 -30 6 25 -8 -18 22 11 -29 -12 24 4 -27 13 26 -16 -6 20 11 -18 -1 37 4 -25 11
7472A1J6l5j1M0j5l5K8K8m5qL9qk7jL8j9l2L2K4j9k6L4kk8J3L3j8l3K1L9m7j4
$$ 11 27 -8 -19 21 6 -29 -1 27 -18 -26 13 5 -22 -23 15 -4 -36 -4 20 1 -25 9 7 -21 -8 25 7 -26 -5 34 -13 -27
7504b7M7Ol8kN0m2j6L0J3l0qM6j2m1K3L3k0l1L0J3l4pL3ml7J1L6l5j3L7jl0pL5
$$ -27 20 26 -12 -14 36 -6 -22 8 21 -9 -17 29 17 -24 -1 32 12 -19 11 24 -10 -17 16 12 -25 -14 22 -13 -26 11 10 -20 -27 8
7538Hk0j7K5L1l4j0K9J1l7QL6ql8L1J7m0j3M8pm1K2K9k1l3K4K4k9j9N3j4l9K3
$$ 8 -12 -29 -4 27 -7 -17 12 23 -14 -6 30 22 -16 15 32 -8 -21 27 20 -21 1 30 9 -24 0 24 -5 -24 29 15 -24 -1
7570aK6l0j5J6K2l6%M5j9m1K5K9k9k8M3J0m1K0L3k1l6M0J4l3oM6jl9LL5j7l5L2
$$ -1 25 -5 -20 -4 18 -18 -18 27 8 -33 -8 21 -8 -36 7 17 -24 -4 29 8 -28 12 26 -7 -13 33 32 -7 -4 31 14 -21 11
7603A1J1k5k0L8Jn2K1L7k5k8M0Ql2qM1j0l8J9L1k7j8K6J6k3j7N8k8j7J6K8l8k0
$$ 11 22 -3 -23 15 16 -36 -15 22 -3 -31 9 17 -15 -23 18 8 -30 -11 20 -7 -25 1 17 -6 -23 35 7 -10 6 34 -4 -24
7635b4M6ll4kN7k4l6K7K4l9j2N6qm7PM2k5l4K5K9k9j9L2rl5K5L9k5n0N3J3l7j3
$$ -24 22 19 -15 -17 40 16 -20 7 31 -8 -20 36 28 -19 -12 30 5 -29 -4 25 -4 -23 9 0 -35 -10 29 4 -46 7 20 -17 -30
7668c0M9pm4K4L2l1k7N4%m0RL3nm0K9K4k6k1L1Qm9J7M4k1l6K9K1m3j6M8km0mM6
$$ -30 19 12 -32 -8 24 -7 -34 20 20 -20 -11 22 17 -23 6 30 4 -17 14 22 -27 -10 34 13 -23 6 27 -16 -32 16 14 -26 -30 16
7702A6k9k6K9L4m8lM4qk7JM0k7k4M2K0m7jN8k7l1J6L3m0k2M1J4m1LL2nl9K2L7
$$ 16 -13 -39 -10 24 -24 -27 17 9 -18 -17 23 -4 -28 14 34 -13 -14 44 17 -14 2 35 -5 -27 14 28 -13 -10 22 17 -22 0 37
7735C7m4j4L8Qn9J0M5k2l6L1K6m0oM6j4l3RM7l1m5M0L8m2qM5nl7J7M3l5l1L9N
$$ 37 -7 -21 17 25 -34 -24 21 -1 -37 -6 20 -20 -26 20 6 -27 -18 29 -2 -47 -7 31 -11 -19 26 21 -16 1 44 9 -22 17 22
7768B2l4NM9j9m0K0L5m0k4M8J0n5qN5j7l6K1L8m2mK6jl7J3M0j9l6L1L2m6oM7n
$$ 22 -12 -7 42 23 -17 3 38 -2 -26 22 32 -23 -31 24 7 -29 -8 30 -12 -16 10 9 -28 -15 25 6 -30 1 33 -13 -19 28 23
7801B3m3J4L1ml6L4J3m4J5L1j0l0KL7k2l6L3Ol9J4K7rl9K5K3l2k0L7Ll2J0M5k6
$$ 23 -20 -6 25 21 -15 19 32 -12 3 34 24 -6 -4 33 11 -25 8 14 -25 -11 16 7 -32 -7 16 -16 -36 1 4 -28 -18 27 1
7834Ak9K6K0k6k7N3kl7JM5k3k7K1K5l6j0M4jm6J4M8k1l4L0J3m4QL7ql3J4K7k3
$$ 1 -28 -2 18 -8 -35 18 16 -21 -20 25 2 -25 -4 21 -15 -25 19 18 -28 -14 34 13 -21 9 22 -22 -14 23 15 -18 -4 23 0
7867@l1K4K0l7oM5j6l3J8L6l4j8L3J0k5qM3j2k1J7K2k6j7L1Rl0kL2j9j7K1Nrk0
$$ 0 -31 -7 13 -24 -30 15 -1 -34 -16 20 -14 -32 1 11 -14 -22 21 9 -12 5 27 1 -16 15 24 -6 -8 24 5 -12 9 14 5 -15
7901a5K9nm2L0J8j3l0K9L2m9lM0k1k2J0K1k9j6L2Lk4NL2j7k2K6K4l5rJ5K7m3J8
$$ -15 14 9 -33 -3 15 2 -28 1 33 -16 -19 21 0 -22 -12 9 -20 -36 -4 -1 -25 -20 12 -5 -27 -1 23 -12 -21 -6 21 -22 -4
7934dK7j3j9KK4rk2J7Rk2kL5k4k8L5J3m3kM0j5j4MJ6jm2K4K0k8JK6jk8KL0lk8
$$ -4 23 10 -9 -7 17 8 -14 3 12 -10 -12 23 -1 -29 6 19 -24 -26 14 -1 -15 -11 5 4 -38 -14 6 -22 -21 5 4 -24 -22 8 5 -23
7970b3L0J7k6j3L2j3j3J4K9k8k2L0J2k7j0L9k9pOK7l4j5L5qj3MK3j6k8J5K8j9
$$ -23 7 24 -2 -15 17 4 -9 5 34 6 -16 14 26 -1 -11 28 -1 -8 -2 25 -9 -24 11 3 -10 -6 17 1 -27 -12 16 -3
8002ck6L1J1l4J9J3j9j5K7Rk2jK7mk4RK2k3j0L4mk2QJ6jm1L0K4l3k8M0Jk6oL1
$$ -3 -29 2 13 -21 -2 11 -8 -23 4 13 -9 -10 17 13 -11 -2 20 -3 -13 21 17 -5 3 19 18 -23 7 31 -2 -30 10 11 -15 -21 10
8037A0j0k6K0K2l8pK3Rl3OK9pl3L1J2j5MJ2Lk9RL0k0k9J8J8l0JK9Ok9J1K5j8j4
$$ 10 0 -26 -6 16 -22 -29 -6 3 -30 -24 5 -2 -35 -4 8 -7 -3 9 12 -17 -8 22 2 -27 -9 9 -21 -20 9 15 -14 -3 22 4 -10
8072a0J4Pj9rL9j4l0J5J5k0j7L5rj9qL5kl8J2K1j7pL2%k8jK9lk0QK1j2oL1j0k7
$$ -10 4 11 -8 -17 22 8 -22 -7 8 -12 -29 6 -3 -22 -30 5 3 -35 -23 -2 -19 -26 6 6 -22 -23 6 3 -17 -9 12 0 -6 25 15 -12
8108a2KL1j7k1J5K4l0nL1k0k4J2K5j9k8L0J2j5qK1rk3J1L6l6k0L4kk0J1K6j0l2
$$ -12 -10 21 4 -17 -2 22 -8 -13 18 -2 -26 -14 11 -8 -36 -6 6 -9 -17 4 -5 -28 -17 19 -17 -37 -3 -5 -25 -14 12 2 -30
8141c0K9J5j3k2L4Nl3J9K0ok7K7Ok4j2L4ol7PK0jl4K6K0l8%M2pl6OL6k0l2L0J3
$$ -30 -1 14 1 -21 13 18 -15 4 24 18 -9 18 24 0 -12 22 16 -21 -14 6 5 -29 -3 17 -21 -21 21 14 -22 -16 20 0 -32 -2 11
8176A1k8%K7j0k0MM6k3l0L4Lk7jM0j7
$$ 11 -17 -17 10 0 -20 -16 30 7 -23 11 14 -13 -14 26 9
8191I
$$ Imaginary data points
##PAGE= N=2
##DATA TABLE= (X++(I..I)), XYDATA
0@%%%%%%%%%%%qJ6j6J6k4L2m0M8n6P2q8J04j20J44j74J99k26K65l06L47l97M53
$$ 0 0 0 0 0 0 0 0 0 0 0 0 -8 8 -8 8 -16 16 -24 24 -32 40 -48 56 -64 80 -94 105 -121 144 -162 185 -212 241
33B41n14N84o58P38q30R29j036J154j283J427j584J751j934K136k356K597k861
$$ 241 -273 311 -347 391 -439 490 -546 608 -675 752 -832 919 -1015 1121 -1235 1362 -1499
50a499L150l471L826m218M656n151N710o349P086p947Q974j0218J1764j3746J6385
$$ -1499 1651 -1820 2006 -2212 2444 -2707 3003 -3346 3740 -4207 4767 -5451 6313 -7433 8952
65H952k0098K5745l5440N6459j77500J68014K83974m92877m9357M59725m4352
$$ 8952 -11146 14599 -20841 35618 -141882 26132 310106 -182771 -232128 227597 183245
76A83245m61934K15177L68756l08765k87068L98645J45515m34086k5334M44584
$$ 183245 -278689 -63512 305244 -3521 -290589 108056 253571 -180515 -205849 238735
86B38735j19670l92508K32217L24344l29178k12672L83701R4297m09708L4019
$$ 238735 119065 -273443 -41226 283118 -46060 -258732 124969 219266 -190442 -156423
96a56423L86302j49492l38057K53006K56603l26482j54509L73298L8770l79869
$$ -156423 229879 80387 -257670 -4664 251939 -74543 -229052 144246 183016 -196853
106a96853P5080L53871j83434k92480K70384K05498l26864j00145L53627p914
$$ -196853 -121773 232098 48664 -243816 26568 232066 -94798 -194943 158684 150770
116A50770l46681J15270L05462k08805k41239K76893J52681l23560n4653L34276
$$ 150770 -195911 -80641 224821 16016 -225223 51670 204351 -119209 -173862 160414
126A60414m8693l12987J43385K65047k19020j89872K76139J04362k99940q612
$$ 160414 111721 -201266 -57881 207166 -11854 -201726 74413 178775 -121165 -129777
136a29777K99344q2049k71496J61542K16986k28711j48471K67435O3115k83241
$$ -129777 169567 87518 -183978 -22436 194550 -34161 -182632 84803 147918 -135323
146a35323K3450K72972j04486k34014J77541J77246k28139j05419K56886K4087
$$ -135323 -111873 161099 56613 -177401 140 177386 -50753 -156172 100714 124801
156A24801k65349N5256K44649j29622k02791J90878J46261k30715p1041K51701
$$ 124801 -140548 -85292 159357 29735 -173056 17822 164083 -66632 -137673 114028
166A14028n976k45074Q0110K15509j47733j69614J96585J05203k27146l5108K35492
$$ 114028 108052 -137022 -56912 158597 10864 -158750 37835 143038 -84108 -119216 116276
177A16276l5515k21873J02767J87823j58394j36937J96230P4343k15614o658K14934
$$ 116276 80761 -141112 -38345 149478 -8916 -145853 50377 124720 -90894 -97552 117382
188A17382n9018j91798J18772J53900j63197j02468J93099M2504k05075J9425
$$ 117382 58364 -133434 -14662 139238 -23959 -126427 66672 109176 -95899 -76474
198g6474J95652p8913j70214J29045J28433j67734p5052J88562J5460j91333M3615
$$ -76474 119178 40265 -129949 -904 127529 -40205 -115257 73305 88765 -102568 -58953
209e8953J77272r7854j45668J42847J01566j72034m8805J85413p986j81737O3119
$$ -58953 118319 20465 -125203 17644 119210 -52824 -101629 83784 75798 -105939 -42820
220d2820J59848j11183j22972J48324P6946j69640k2759J75420l1945j64700Q0220
$$ -42820 117028 5845 -117127 31197 108143 -61497 -84256 91164 59219 -105481 -25261
231b5261J36886j22652j00371J50534N3330j64127j492J63730m6148j45567R1640
$$ -25261 111625 -11027 -111398 39136 92466 -71661 -73153 90577 44429 -101138 -9498
242i498J16228j26969p6334J47805K8767j56746J8242J50327o3389j28960J03406
$$ -9498 106730 -20239 -96573 51232 79999 -76747 -58505 91822 28433 -100527 2879
253B879R7837j30707n6996J46727J0736j50199L4377J36435p7549j12170J11691
$$ 2879 100716 -29991 -86987 59740 70476 -79723 -45346 91089 13540 -98630 13061
264A3061P7898j34347l4873J45749q876j41326N1591J24324q9363r6778J17364
$$ 13061 90959 -43388 -78261 67488 58612 -82714 -31123 93201 3838 -92940 24424
275B4424N9140j34101j7041J38109k5134j28722O5151J07663r8099p6814J20170
$$ 24424 83564 -50537 -67578 70531 45397 -83325 -18174 89489 -8610 -85424 34746
286C4746L9356j31390M46J30035l9926j16121P4707R1874j01720n9895J19148
$$ 34746 74102 -57288 -56842 73193 33267 -82854 -8147 83727 -17993 -77888 41260
297D1260K2470j25058J6876J19230n2874j01902Q4118P5990j07077m3292J18645
$$ 41260 63730 -61328 -44452 74778 21904 -79998 4120 80110 -26967 -70259 48386
308D8386O185j20103K9702J09822o2921q8966R0739O0889j07981k6634J15598
$$ 48386 54571 -65532 -35830 73992 11071 -77895 12844 73733 -34248 -60882 54716
319E4716r367j13047M3186R8216p3568p5375R5809M6387j07937j2072J11496k1619
$$ 54716 45349 -67698 -24512 73704 136 -75239 20570 66957 -40980 -53052 58444 36825
331C6825j03211N2683Q5015p9423o1200R6720L0144j05526K872J04627l3447r2454
$$ 36825 -66386 -13703 71312 -8111 -69311 27409 57553 -47973 -45101 59526 26079 -66375
343f6375O2248P3517q3851m7339R6536J6426j01343J3949R5807m3570q1288O9051
$$ -66375 -4127 69390 -14461 -61800 34736 51162 -50181 -36232 59575 16005 -65283 3768
355C768O0041q6450l2838R6127L091r7054K5992Q7639n2813p0897P3865M8062
$$ 3768 63809 -22641 -55479 40648 43739 -53315 -27323 60316 7503 -63394 10471 58533
367E8533q7526k0128R3420q740q9832L6228P7890o0199n9252P8147L5074q7965
$$ 58533 -28993 -49121 44299 35559 -54273 -18045 59845 -354 -59606 18541 53615 -34350
379c4350p653Q9820j9358q3165M4313O8348o5478m8087P8999K2985q5550L581
$$ -34350 -42003 47817 28459 -54706 -10393 57955 -7523 -55610 23389 46374 -39176 -35595
391c5595Q4339k9182p4424N2180N8118o9480l6828Q0030J2053q3016J3706P8387
$$ -35595 48744 19562 -54862 -2682 55436 -14044 -50872 29158 41211 -41805 -28099 50288
403E0288l6898o5631N7138M7890p1611k5918P8350N45p9056K2671P1105m4457
$$ 50288 13390 -52241 4897 52787 -18824 -44742 33608 34153 -44903 -22232 48873 4416
415D416n6834O2156L8257p2269j5073P6676q295p3793L0402O3151n0417m7625
$$ 4416 -52418 9738 47995 -24274 -39347 37329 29034 -44759 -14357 48794 -1623 -49248
427d9248O4519K7724p2221m703P4245j7338o7958L8220N5663n5277l9088O6188
$$ -49248 15271 42995 -29226 -33929 40316 22978 -44980 -6760 48903 -6374 -45462 20726
439B0726J7867p1742M203O9770k5562o1414M4364M7466n9069k9327O7466Q289
$$ 20726 38593 -33149 -28946 40824 15262 -46152 -1788 45678 -13391 -42718 24748 33037
451C3037o9503J3159O5739l2321n4427M9743L9406o0848k0378O6228p52o6523
$$ 33037 -36466 -23307 42432 10111 -44316 5427 44833 -16015 -36393 29835 29083 -37440
463c7440K0261N8984l8927m6976N2969L0861o1687j1453O5215q468o2075K7108
$$ -37440 -17179 41805 2878 -44098 8871 39732 -21955 -33408 31807 23339 -38736 -11628
475a1628N3007m3325l9670N5281K2628o1570k996O2605j5716n7323L3253M6868
$$ -11628 41379 -1946 -41616 13665 36293 -25277 -28273 34332 18616 -38707 -5454 41414
487D1414m7896l2202N7136J4486o1144M433N9864k2510n2411L8477L9886n1024
$$ 41414 -6482 -38684 18452 32938 -28206 -23773 36091 13581 -38830 -353 39533 -11491
499a1491k4903N7566O285n9866J1949N5939k8351m6091M3222L3717n2391j6784
$$ -11491 -36394 21172 27457 -32409 -20460 35479 7128 -38963 4259 37976 -14415 -31199
511c1199N7439r76n6926J7899N0517l3728m0190M5669K5825n3241r394N5740p811
$$ -31199 26240 25264 -31662 -13763 36754 3026 -37164 8505 34330 -18911 -28305 27435 19624
524A9624n3308K3781M5406l7769l3619M7874J8996n3048k274N3774j4094m9152
$$ 19624 -33684 -9903 35503 -2266 -35885 11989 30985 -22063 -24337 29437 15343 -33809
536c3809K8961L9783m1291k7118M9452J2115n2452M723N1511j9836m4695L3464
$$ -33809 -4848 34935 -6356 -33474 15978 28093 -24359 -19636 31875 12039 -32656 808
548H08L3875m4362k1136M9470M694n1548J0598M7790k4811l9356L7613K8476m5310
$$ 808 34683 -9679 -30815 18655 23349 -28199 -17601 30189 5378 -33978 3635 32111 -13199
561a3199j3740M9379j305m8853J5932M3491k9453l4089L9745K1884m5833p666
$$ -13199 -26939 22440 21135 -27718 -11786 31705 2252 -31837 7908 29792 -16041 -23707
573b3707M8048p365m5812K0965L8436l2870k8561M1416J5924m5857j162M6251
$$ -23707 24341 16976 -28836 -7871 30565 -2305 -30866 10550 26474 -19383 -20545 25706
585B5706j2669m1974K5203L3802l6101k3003M2501R505m4961M502M4072j7232
$$ 25706 13037 -28937 -3734 30068 -6033 -29036 13465 22970 -21991 -17489 26583 9351
597I351l7782K9643K8871l7944j7121M2633L588m4280R455M0450k2354l3671L2008
$$ 9351 -28431 1212 30083 -7861 -24982 17651 21239 -23041 -13586 26864 4510 -29161 2847
610B847K3609l9324j1480M2667j705m1461J4735L7298k5286k8680L4783J8341
$$ 2847 26456 -12868 -24348 18319 16614 -24847 -10112 27186 1900 -26780 8003 26344
622B6344l9866o012M0975p084l9556J8317L2879k8891k3938L6095J3282l9205
$$ 26344 -13522 -19534 21441 14357 -25199 -6882 25997 -2894 -26832 9263 22545 -16660
634a6660m21L9913j1422l5941K2163K8432l1420j9501L6611P696l8896M463L7661
$$ -16660 -17081 22832 11410 -24531 -2368 26064 -5356 -24857 11754 19450 -19446 -14983 22678
647B2678j5317l2105K5550K4466l2827j4321L6832K598l7672Q870L4874j9271
$$ 22678 7361 -24744 806 25272 -7555 -21876 14956 17554 -20118 -11248 23626 4355
659D355k8512K8241J9913l4227r597L6385k265l6286J2656L1777k2608k4412L0480
$$ 4355 -24157 4084 23997 -10230 -19827 16558 14293 -21993 -9337 22440 -168 -24580 5900
672E900J5705l4182m336L6152o308l3889J6502K8173k5465k0889L1107J0965l4545
$$ 5900 21605 -12577 -16913 19239 12931 -20958 -4456 23717 -1748 -22637 8470 19435 -15110
685a5110k93L4381j0025l0825J9420K4837k6894j6450L1792O576l3394L627L2255
$$ -15110 -15403 18978 8953 -21872 -2452 22385 -4509 -20959 10833 17409 -15985 -12358 19897
698A9897j3303k8132K1828K0919k8257j2424L1542K699l2279P563L0244j6412
$$ 19897 6594 -21538 290 21209 -7048 -19472 12070 14769 -17510 -9947 20297 3885
710C885k4468K4206J7308k9452q510L1628j935l1380J1006K7520j9382k1403K6347
$$ 3885 -20583 3623 20931 -8521 -17031 14597 12662 -18718 -7712 19808 426 -20977 5370
723E370J3525k9954l837L1009n694k9410J4377K4536k2166j7592K7426R460k9579
$$ 5370 18895 -11059 -14896 16113 10419 -18991 -4614 19922 -2244 -19836 7590 17050 -12529
736a2529O1K9793q903k6772J6774K0833k3498j4102K7090N411k8640L673K7680
$$ -12529 -12468 17325 8422 -18350 -1576 19257 -4241 -18343 8747 14158 -14482 -10809 16871
749A6871j1527k3389J8982J7802k4310j0457K7043J581k7709O574K5380j4319
$$ 16871 5344 -18045 937 18739 -5571 -16028 11015 12596 -15113 -8539 16841 2522
761B522k0749K1082J4444k5202o413K7144j962k6733J0036K3432j7395j7949K2839
$$ 2522 -18227 2855 17299 -7903 -14316 12828 10866 -15867 -5831 17601 206 -17743 5096
774E096J0965k5926k909K6742n486k5000J3006K0597j9248j4633K3764P482k5662
$$ 5096 16061 -9865 -12774 13968 8482 -16518 -3512 17085 -2163 -16796 6968 14450 -11212
787a1212O85K5301q282k2569J4730J7653k0285j1479K3457M188k4179L463K3317
$$ -11212 -10527 14774 6492 -16077 -1347 16306 -3979 -15458 7999 12187 -11992 -8529 14788
800A4788j0285j9839J6412J4423k0979q349K2994J048k3470O325K1688j2599j7154
$$ 14788 4503 -15336 1076 15499 -5480 -13829 9165 10213 -13257 -6932 14756 2157 -14997
813a4997J8242J1807k1825n164K3097k655k2762R243J9583j5314j4713K0332Q893
$$ -14997 3245 15052 -6773 -11937 11160 8505 -14257 -5014 14569 -745 -15458 4874 13767
826A3767k2496j433K2978n555k1363J1734J7151j7401j1919K0760N515k1976J516
$$ 13767 -8729 -10162 12816 7261 -14102 -2368 14783 -2618 -14537 6223 11738 -10238 -8722
839h722K1780p845j9004J3576J4464j8017r231K0257K770k1013L747J9816r499
$$ -8722 13058 5213 -13791 -215 14249 -3768 -12999 7258 10028 -10985 -7238 12578 3079
852C079j6404J4617J2017j8286o412K0035l5k0071O094J8222j1525j4502J6250
$$ 3079 -13325 1292 13309 -4977 -11389 8646 8611 -11460 -5366 12856 1331 -13171 3079
865C079R587j9121l655K0015k766j9441Q618J6649j3918j2155J7810O863j9680
$$ 3079 12666 -6455 -10110 9905 7139 -12302 -3684 12965 -953 -13108 4702 11565 -8115
878h115p27J9940n509j8312J0879J4613j5286r852J8323M425j9221J872J8606
$$ -8115 -8842 11098 5589 -12723 -1844 12769 -2517 -12369 5954 10379 -8842 -6970 11636
891A1636p362j6268J1938J2219j5997p602J7897J987j8134L713J7257q525j4217
$$ 11636 4274 -11994 -56 12163 -3834 -11436 6461 8448 -9686 -5973 11284 2759 -11458
904a1458J3033J0060j6145n412J7327k92j7559N639J5846j0327j2250J4466Q220
$$ -11458 1575 11635 -4510 -9922 7405 7113 -10446 -4807 11039 712 -11538 2928 11148
917A1148j6747k940J7659k762j7000P714J4312j2283j0611J5659N817j7307l08
$$ 11148 -5599 -8539 9120 6358 -10642 -2928 11384 -899 -11510 4149 9966 -7341 -7649
930g649J7348n014j5889R637J2748j3597q494J6157L722j6786J672J6420o509
$$ -7649 9699 4685 -11204 -1567 11181 -2416 -10910 5247 8969 -7817 -6145 10275 3766
943C766j4238J0693J0553j4030o547J5650J642j6117L392J5108p725j2442J1527
$$ 3766 -10472 221 10774 -3256 -9803 5847 7489 -8628 -5236 9872 2147 -10295 1232
956A232Q901j4272m636J5500l71j5361N098J3848r187j0853J2780O940j4959k409
$$ 1232 10133 -4139 -8775 6725 6354 -9007 -3909 9939 752 -10101 2679 9619 -5340 -7749
970g749J5454k564j4884P033J2735j0857q989J3931N031j5094k59J5142m683j4015
$$ -7749 7705 5141 -9743 -2710 10025 -832 -9821 4110 9141 -5953 -6212 8930 4247 -9768
984i768Q520J0797j2110p304J4198L132j4784J843J4420n796j2298R507R301j2482
$$ -9768 -1248 9549 -2561 -9865 4333 7465 -7319 -5476 8944 3148 -9150 357 9658 -2824
998b824n594J3887J122j4131L147J3206p040j0936J0442P584j2795l820J3683
$$ -2824 -8418 5469 6591 -7540 -4393 8813 1773 -9163 1279 8863 -3932 -7752 5931
1011E931m90j3596M783J2223q349r280J1378N948j3197j950J3632k599j3046O350
$$ 5931 5441 -8155 -3372 8851 502 -8778 2600 8548 -4649 -6599 7033 4434 -8612 -2262
1025b262J0929r652p852J2327M255j3298Q4J3216m129j2047P596R468j0706o160
$$ -2262 8667 -985 -8837 3490 7745 -5553 -5469 7747 3618 -8429 -833 8635 -2071 -8231
1039h231J2490K427j2988J670J2574n509j0845Q589P904j1113m688J2431Q99j2459
$$ -8231 4259 6686 -6302 -4632 7942 2433 -8412 177 8081 -3032 -7720 4711 5610 -6849
1053f849L262J1704o471r424R439O458j1642l179J2189r09j2116M492J0752p579
$$ -6849 -3587 8117 1646 -7778 1661 8119 -3523 -6702 5487 4578 -7538 -3046 7706 127
1067A27q071J0356N134j1702j469J2035k438j1516N716R494q708o769J0863L611
$$ 127 -7944 2412 7546 -4156 -5625 6410 3972 -7544 -1828 7666 -1042 -7811 3052 6663
1081F663j1680J57J1700l710j0569O818Q230r460n378J1025K006j1494J650J1086
$$ 6663 -5017 -4860 6840 3130 -7439 -621 7609 -1851 -7229 3796 5802 -5692 -4042 7044
1095G044m974r497P808O948j0034l973J1168M83j1186L092J0330o081q350Q654
$$ 7044 2070 -7427 381 7329 -2705 -6678 4490 4973 -6213 -3121 7209 1128 -7222 1432
1109A432N577j0529k453J1033j050j0724M383R541p113p025R375M248j0572j173
$$ 1432 7009 -3520 -5973 5060 4010 -6714 -2331 7210 97 -6928 2447 6695 -3877 -5050
1123e050J0706k397j0143N323Q310p725n819R710L082j0441K91J0220l478r333
$$ -5050 5656 3259 -6884 -1561 6749 -976 -6795 2915 5997 -4444 -4153 6067 2589 -6744
1137f744O029P275q451m634R938J765j0126J633R892m563q501P095N945r194l484
$$ -6744 -715 6560 -1891 -6525 3413 5178 -4948 -3315 6577 2014 -6487 608 6553 -2641 -6125
1152f125J0016K65j0110L084R386n649p271Q076M928r638k056R987j314r778M058
$$ -6125 3891 4156 -5954 -2870 6516 867 -6404 1672 6600 -3038 -5094 4893 3579 -6199 -2141
1167b141Q413o608o284Q660L749r550p12R739k214r036M914P410p113n172Q641
$$ -2141 6272 -336 -6620 2040 5789 -3761 -4473 5266 3052 -5984 -1070 6340 -773 -5945 2696
1182B696K592r401K93R188l232q280N602O444p620m062Q992J433r236J593Q855
$$ 2696 5288 -4113 -3820 5368 2136 -6144 -542 5902 -1718 -5780 3212 4645 -4591 -2998 5857
1197E857m310p582O605N351q427k845R283Mr205L042Q405n531o664P541M179r038
$$ 5857 1547 -6035 570 5921 -2506 -5351 3932 3936 -5269 -2227 6178 647 -6017 1524 5703 -3335
1213c335j611R305j382q805M173P731o224n509Q097L087q939o06Q787k409q311
$$ -3335 -4946 4359 2977 -5828 -1655 6076 -148 -5657 2440 5527 -3412 -4018 4769 2360 -5951
1228e951M684O702o566m451Q183K336q519N42Q411l172p594N152N678p233l660
$$ -5951 -1267 5435 -1131 -5582 2601 4937 -3582 -3040 5371 2199 -5395 -243 5435 -1798 -5458
1243e458Q292J086q439J758Q166m103o797O302M740p944k433Q545l32q533L085
$$ -5458 2834 3920 -4519 -2761 5405 1302 -5495 807 5547 -2397 -4830 3715 3383 -5150 -2065
1258b065P697n318n852P261L681q392j176Q588j633q197M012O862o037m958P603
$$ -2065 5632 314 -5538 1723 5404 -2988 -4164 4424 2791 -5406 -1394 5468 -569 -5527 2076
1273B076K679q278j28Q239k342p458M558O068o289m034P528J788q028N89P667
$$ 2076 4755 -3523 -3651 4588 2246 -5212 -654 5414 -875 -4909 2619 4407 -3621 -3032 4635
1288D635l079o880N030N208o637l056P742Q91p785J731P405m068o254N825M162
$$ 4635 1556 -5324 -294 4914 -1723 -4779 2963 3854 -3931 -2200 5205 1137 -5117 708 4870
1303D870p393k083P960m27p708L052P029m953n314O698L222p823r86P830j603
$$ 4870 -2523 -4606 3354 2927 -4781 -1729 5300 347 -4967 1731 4953 -2870 -3856 3974 2371
1318B371p424L822O323n571m360P029K356p617j42P434k332o929M191N461n792
$$ 2371 -5053 -1231 5092 -479 -4839 2190 4546 -3071 -3213 4221 1889 -5040 -849 4612 -1180
1333a180l576P023J746p234P42P117k842o283M552M640o260k945O990O57p174
$$ -1180 -4756 2267 4013 -3221 -2479 4638 1796 -4487 65 4705 -1555 -4500 2490 3147 -4027
1348d027J639O809l602n552N479L918o665j814P212m38p114K635O281m640m864
$$ -4027 -2388 4421 819 -4733 746 4664 -2001 -3815 3397 2959 -4155 -1520 4761 121 -4743
1363d743O053K915p005q23P234j366o671L516N714n104m036O323K057p009j26
$$ -4743 1310 4225 -2780 -3603 3631 2265 -4406 -890 4824 -280 -4316 2007 4064 -2945 -3071
1378c071O781k116o241L904N063n256l260O451J496o707O07O411k660n770M221
$$ -3071 3710 1594 -4647 -743 4320 -936 -4196 2255 3751 -2956 -2349 4062 1402 -4368 -147
1393a47M318n652k531O498P25o514J469O186l417n203M795L460o115j791O587
$$ -147 4171 -1481 -4012 2486 3211 -3303 -1834 4352 935 -4268 527 3987 -2128 -3919 2668
1408B668k73o344K493N855l980m403N500K701o446r08O418j336o172L076N252
$$ 2668 2395 -3949 -1456 4399 419 -3984 1516 4217 -2229 -3137 3281 1945 -4227 -1151 4101
1423D101m604l605N884K009o313l9O271k004n811L551M495n001l025N903J333
$$ 4101 -503 -4108 1776 3785 -2528 -2567 3704 1700 -4111 -560 3935 -1066 -4091 1812 3145
1438C145o166P24O061k457n182M031L942n245k364N935N12o096J330N635l113
$$ 3145 -3021 -2297 3764 1307 -3875 156 4098 -1147 -3511 2424 2936 -3160 -1830 3805 692
1453F92m765M500L289n551j594O026j89n868K122N313l695m125M941K509n817
$$ 692 -4073 427 3716 -1835 -3429 2597 2408 -3460 -1338 3975 280 -3845 1096 3605 -2212
1468b212q39N978j039n629K884M853m204l413N344J786n939p0N776j896n319L406
$$ -2212 -3051 2927 1888 -3741 -857 3996 -208 -3621 1723 3509 -2430 -2500 3276 1380 -3939 -533
1484e33M250m642k699N625J086n812O94N511k463m917L791L627m939k013N627
$$ -533 3717 -925 -3624 2001 3087 -2725 -2031 3480 1017 -3900 -109 3518 -1421 -3434 2193
1499B193N87n553J352N292k894m416M044K911n175j663N462j72n423J937M930
$$ 2193 2780 -2773 -1421 3871 977 -3439 605 3516 -1659 -3322 2140 1968 -3455 -1518 3412
1514C412l170l778M535K481n279q55N438r29n227K484M459l855l201M929J690
$$ 3412 242 -3536 999 3480 -1799 -2654 2784 1855 -3372 -888 3571 -284 -3485 1444 3134
1529C134n398o1N380j671m928L183L885m324k495N154J001n413O97N108k343m478
$$ 3134 -2264 -2325 3055 1384 -3544 -361 3524 -800 -3295 1859 2860 -2553 -1856 3252 909 -3569
1545c569L506L302m547j933N169M71n078J204M831k512m051L722K808m617j502
$$ -3569 -63 3239 -1308 -3241 1928 2399 -2679 -1475 3356 844 -3207 515 3323 -1294 -2796
1560b796M931qm943J521M481k866l596L888K299m708r63M949o05m677K215M176
$$ -2796 2135 2127 -2816 -1295 3186 320 -3276 612 2911 -1797 -2760 2189 1584 -3093 -878 3298
1576C298l290k931M415J635m930j92M811j543m562K745L580l911k300M737J003
$$ 3298 8 -2923 1492 3127 -1803 -1995 2816 1273 -3289 -544 3036 -875 -3175 1562 2565
1591B565m859O16M711k018m136L149L037m149j868M633M99m674R52M434k171l727
$$ 2565 -2294 -1678 3033 1015 -3121 28 3065 -1084 -2952 1681 2180 -2494 -1542 2892 721 -3006
1607c006L260K708m041j522M468K25m476J213M139k439l370L397K233m230j060
$$ -3006 254 2962 -1079 -2601 1867 2092 -2384 -1171 2968 529 -2841 556 2789 -1441 -2501
1622b501M435m51m302J820L817k919k758L972J572m396j76M432j288m111K572
$$ -2501 1934 1483 -2819 -999 2818 -101 -2859 1113 2685 -1711 -1887 2545 1257 -2854 -282
1637b82L281l591k099M244Q23m491N06M244j932l752K908K794l728j627M298N12
$$ -282 2999 -592 -2691 1553 2376 -2115 -1609 2635 703 -3049 -141 2653 -1075 -2702 1596 2108
1653B108m235Q76M031j974l486K895K485l757j441M061K71m060J060L881k142
$$ 2108 -2127 -1251 2780 806 -2680 215 2700 -1057 -2498 1563 1834 -2226 -1166 2715 573
1668E73l115L092K082l834j085M049l61m014J651L507k620k570L619J517m072
$$ 573 -2542 550 2632 -1202 -2287 1762 1401 -2613 -962 2545 -75 -2645 974 2491 -1581
1683a581j69M054j201l775K315L041l316j901L985P57m076N16L947j763l485K681
$$ -1581 -1750 2304 1103 -2672 -357 2684 -632 -2533 1452 2209 -1867 -1351 2596 833 -2652 29
1699B9K512l506j553L897M34l970Q09L740j813l153K710K378l402j333L805K59
$$ 29 2541 -965 -2518 1379 1813 -2157 -1348 2392 579 -2574 136 2514 -888 -2221 1584 1843
1715A843l776R53L563j980k971K825J970l597j000L750l14l718J506L305k464
$$ 1843 -1933 -980 2583 603 -2368 457 2427 -1170 -2170 1580 1266 -2452 -946 2359 -105
1730a05k380L378J391l787j53L797j122l501K201K790l062j778L696O89l822M95
$$ -105 -2485 893 2284 -1503 -1656 2141 1019 -2482 -281 2509 -553 -2331 1365 2054 -1768 -1273
1746a273L657j661l198K515K357l224j427L639M01l679P16L442j726l006K479
$$ -1273 2384 723 -2475 40 2397 -827 -2254 1385 1786 -1893 -1177 2265 539 -2467 12
1761A2K178l224j236L550K96l483R06L428j796k714K668J870l320r68L468l02
$$ 12 2190 -1034 -2270 1280 1576 -1907 -1001 2427 631 -2083 585 2455 -865 -1833 1635 1333
1777A333l545J362L009k317k269L091J308l506j46L561r82l211K033K652k797
$$ 1333 -2212 -850 2159 -158 -2427 664 1972 -1534 -1680 1881 899 -2312 -279 2373 -424
1792d24j657L412O50l554M10L355j515l002K312K213k980j304L397L87l386O68
$$ -424 -2081 1331 1981 -1573 -1163 2192 677 -2325 -13 2200 -780 -2084 1313 1700 -1686 -1018
1808a018L206j629k794K291J979l020j194L310K23l277Q92L167j669k505K539
$$ -1018 2188 559 -2235 56 2035 -985 -2179 1131 1354 -1923 -1031 2136 467 -2038 501
1823E01J761l082q54L275k57l243J264K829k163k133K853J187l292k28L239r06
$$ 501 2262 -820 -1674 1601 1344 -1899 -635 2194 31 -2102 751 1938 -1354 -1582 1657 751
1839G51l058J833K479k540j561L170P28l250L60L187j356k801K095K088k762j305
$$ 751 -2307 -474 2005 -535 -2096 1074 1802 -1448 -1088 2099 743 -2058 37 2125 -637 -1942
1855a942L158L75l191O23L029j492k614K186J852k844j109L086J59l124Q27K936
$$ -1942 1216 1591 -1600 -977 2052 560 -2054 132 1984 -860 -1969 1117 1276 -1848 -1021 1915
1871A915j643k337K416J631k875p26L121k30l009J229K664k026j993K657J114
$$ 1915 272 -2065 351 1982 -893 -1619 1502 1272 -1737 -508 2156 130 -1863 794 1908
1886A908l110k29L014q26k872J663K342k371j516K925O93l047K77K953j196k643
$$ 1908 -1202 -1431 1583 757 -2115 -452 1890 -481 -1997 928 1621 -1426 -1149 1804 608 -2035
1902b035J953J994k554j177K982L97k972N87K849j410k460K056J720k704j013
$$ -2035 -82 1912 -642 -1819 1163 1560 -1412 -825 2024 614 -1846 210 1930 -774 -1787
1917a787K896Q1k937Q44K722j610k166K291J456k759o25K917l04k786J231K481
$$ -1787 1109 1190 -1747 -903 1819 209 -1957 334 1790 -969 -1594 1323 1019 -1767 -536 1945
1933A945j874j807K536J039k845j94K804p77k678J506K136k215j436K662O49k821
$$ 1945 71 -1736 800 1839 -1006 -1200 1604 827 -1851 -345 1791 -424 -1860 802 1451 -1370
1949a370K35K762j103k413J798J861k352j110K752L37k758N68K610j341k226J961
$$ -1370 -1135 1627 524 -1889 -91 1770 -582 -1692 1060 1397 -1361 -793 1817 476 -1750 211
1965B11J590k497q44K700L2k694Q32K448j578j979K112J246k574n43K702l18k559
$$ 211 1801 -696 -1540 1160 1192 -1502 -670 1778 200 -1779 333 1579 -995 -1538 1164 846 -1713
1982a713J184K274j740j629K341R25k627j43K584p29k420J416J972k004j298K462
$$ -1713 -529 1745 5 -1624 717 1642 -985 -1128 1456 727 -1693 -277 1695 -309 -1607 855
1998H55N83k587K15K468j047k224J627J647k166r77K513K67k471N88K362j263
$$ 855 1438 -1149 -934 1534 487 -1737 -110 1537 -629 -1606 907 1174 -1297 -709 1653 390
2014C90j973J839J335k298o88K450n2k408Q59K198j478j699J972J044k346m22
$$ 390 -1583 256 1591 -707 -1395 1055 1003 -1405 -546 1652 174 -1525 447 1491 -855 -1277
2030a277K405m20k309J105J991j625j423K160Q24k356o0K347o51k175J312J741
$$ -1277 1128 708 -1601 -496 1495 -130 -1553 607 1431 -925 -985 1362 711 -1464 -152 1589
2046A589j860j155K189M81k337K14K218r47j980J521J486j952q39K290K01k258
$$ 1589 -271 -1426 763 1244 -1093 -879 1339 392 -1588 -67 1419 -533 -1372 918 1119 -1139
2062a139N68K091j202j764J643J168k102n78K240j32k127Q21J975j365j474J846
$$ -1139 -571 1520 318 -1446 197 1365 -737 -1315 925 793 -1334 -513 1462 97 -1377 469
2078D69Q99k113l12K157l97k066J023J747j527j281J917P01k130n6K103o14j919
$$ 469 1368 -745 -1057 1100 703 -1363 -340 1407 -120 -1401 516 1217 -913 -969 1134 520 -1399
2095a399J196J619j639j008K016M50k106J78J989q87j847J329J289j792p67K032
$$ -1399 -203 1416 -223 -1231 785 1235 -871 -693 1296 409 -1438 -109 1180 -612 -1379 653
2111F53K22k023N43J946j020j549J536J090j886n51K010j34j997O94J742j275
$$ 653 875 -1148 -605 1341 321 -1228 308 1398 -488 -1039 971 837 -1160 -466 1276 1
2127Aj379J642Q31j893k62J994l14j823R47J619j360j140J723O08j974p4J888
$$ 1 -1378 264 1095 -798 -1060 934 620 -1203 -256 1363 3 -1137 586 1194 -780 -854 1034
2144A034n82j771J077J456j492r02J827M22j885J73J815p66j633J209J187j615
$$ 1034 452 -1319 -242 1214 -278 -1180 647 1069 -816 -643 1172 406 -1227 -18 1169 -446
2160d46p09J811J82j860M35J708r49j412J364J002j671m48J870o9j728O52J588
$$ -446 -1155 656 838 -1022 -587 1121 172 -1240 124 1126 -545 -993 877 808 -920 -268 1320
2177A320j112j263J453O80j750k85J713l29j659Q47J448j207r76J591N38j691
$$ 1320 208 -1055 398 1078 -672 -957 756 427 -1232 -385 1063 -144 -1120 471 1009 -682
2193f82k0J693n54j529R82J223j326p74J600L18j668J88J575o96j417J072J020
$$ -682 -702 991 437 -1092 -110 1113 -213 -987 613 931 -737 -549 1026 330 -1087 -15 1005
2210A005j405n98J586J38j607L83J512q37j265J189Q50j456m19J597l3j529N88
$$ 1005 -400 -998 588 726 -881 -498 1014 177 -1088 101 951 -505 -924 673 640 -889 -301
2227c01J396r33j069J272O51j522k19J504k97j452P21J229j114q49J356M03j496
$$ -301 1095 162 -907 365 1016 -506 -725 779 482 -970 -249 980 -134 -983 373 776 -720
2244g20MJ462n04j301R20J062j160o02J447K42j450K36J358o62j220R61Q45j269
$$ -720 -716 746 242 -1059 -139 923 -237 -839 608 850 -600 -364 994 332 -888 73 918 -351
2262c51n02J382R8j405L51J304p39j106J040P48j270l93J412k3j365M97J232q23
$$ -351 -853 529 627 -778 -427 877 138 -968 72 820 -450 -843 569 546 -819 -322 910 87
2280H7r43J117N95j340j82J354k41j254O62J094r91p20J204L19j350K1J252n05
$$ 87 -856 261 856 -484 -666 688 447 -807 -145 949 -42 -762 442 761 -589 -568 684 179
2298A79j149Q21Q63j066m86J291J64j256K84J210o04j003Q94P48j120m14J235
$$ 179 -970 -149 714 -352 -838 453 617 -639 -355 855 251 -752 142 890 -230 -644 591
2315E91M4j257K88J144o83j017R12O67j160l51J273Mj211M41J140p36q44J009
$$ 591 635 -622 -334 810 127 -890 22 689 -471 -822 451 455 -756 -315 825 89 -755 254
2333B54N40j213j87J215k36j153O36R65q70o24J097L05j198Q6J113m81j022P55
$$ 254 794 -419 -606 609 373 -780 -144 821 -49 -673 424 729 -469 -383 730 249 -773 -18
2351a8P29j011m32J117R1j156K73J062n63r02Q61O77j006l42J178O7j155K96J066
$$ -18 711 -300 -732 385 476 -680 -407 655 92 -810 51 728 -278 -620 558 625 -530 -234 832
2370H32o22r37Q48O09j094l53J176l2j146L95J047o91q18R57N13j126j41J151
$$ 832 210 -727 121 730 -364 -717 459 427 -719 -324 723 32 -786 171 684 -442 -583 568
2388E68k25j030N90Q89q45n64J028K11j111J17J015m82q92P58O52r44l38J084
$$ 568 343 -687 -97 792 -53 -617 411 622 -489 -372 643 161 -731 27 679 -265 -603 481
2406D81K4j076K67R39n91q34Q00N73r76k69J099N0j045L21J024o02q33Q16N64
$$ 481 505 -571 -304 635 44 -790 10 583 -393 -662 437 487 -558 -237 787 185 -648 168 732
2425G32j031l02J091n1j077L96R67o80p45R06M17j069j10J074k66r72O04P89q21
$$ 732 -299 -601 490 439 -638 -242 725 45 -700 206 623 -446 -556 518 252 -720 -116 673 -148
2444a48m51R94J59j035J71R46n06q05P40N57r11k51J008l6r95L42Q74o02p44Q10
$$ -148 -599 395 554 -481 -310 636 130 -675 65 622 -289 -540 468 432 -563 -221 653 51 -693 117
2464A17M62r27k09J010l9j000L51R09o14p56Q17N01r71k13J062q2r84M15Q85o77
$$ 117 579 -348 -557 453 414 -586 -235 674 60 -696 121 622 -349 -562 500 418 -566 -151 734 57
2484E7o76Q73L26j021n7R95l06q89O08P11q00l77R61P8r75K38Q54n44p13P55M68
$$ 57 -619 254 580 -441 -498 497 191 -698 -90 621 -179 -556 405 483 -492 -254 600 56 -657 98 566
2505E66q87j73R76j14q98L78Q00o36o39P86L89q91j46R70j05r07L74Q22o35o61
$$ 566 -321 -494 482 368 -530 -152 648 12 -627 159 548 -343 -489 481 376 -531 -157 665 30 -631
2525f31P94M01r52j46R70j34r20M57Q01o77n75Q85K84r63J9R35l35q24O07O06
$$ -631 163 564 -388 -534 436 302 -618 -161 640 -37 -612 273 557 -406 -387 548 213 -611 -4 602
2545F02q09l29R06L9r25K62Q16n46o32P49M19q38j22R00j43q63L71P30o23n85
$$ 602 -207 -536 370 409 -516 -254 562 16 -616 133 552 -286 -408 492 349 -514 -143 587 -36 -621
2565f21P63L44q75o8R14j26q49M23P43o38n77P75L27r15p6R23j98q42M83O97o77
$$ -621 142 486 -389 -457 457 331 -518 -95 648 10 -567 208 535 -380 -456 467 269 -573 -90 607 -70
2586g0m93Q36J80r25Q4Q44l49p31O35N60p74k22Q60j8q38K77P39n45n97P03L35
$$ -70 -563 273 453 -472 -388 456 107 -624 11 571 -203 -425 435 417 -421 -144 595 50 -547 156 491
2607D91q28q9Q63j77p85M04O54n86m97P23K92q49kQ42k11p75M45O47o34m67P64
$$ 491 -337 -426 437 260 -525 -121 533 -53 -550 173 465 -384 -386 456 245 -530 -85 562 -72 -539 225
2628B25K42q56K0Q52k67p46N18N93o79l77P87J12q66J67P65m16o43O09M55p58
$$ 225 467 -389 -369 483 216 -530 -12 581 -98 -475 312 424 -442 -275 490 74 -569 40 495 -263
2648b63j79Q19q6q03L42O77n40m77P11K94p39l5P88k12p42M07N63o37m54P17J84
$$ -263 -442 377 291 -512 -170 507 -33 -510 201 495 -244 -279 509 297 -445 -38 525 -112 -566 151 335
2669C35p84N4Q06k61o67N11N75o43l75P52J21q22J05P65l58o51N76M94o99k46
$$ 335 -449 -395 411 150 -517 -6 569 -74 -449 303 424 -398 -293 472 114 -537 39 533 -166 -412
2689d12P92qp94K30P02m67n59O33L41p45j01P73j47p37L55O08n65m36P05K33p43
$$ -412 380 372 -422 -192 510 43 -516 117 458 -287 -388 385 238 -499 -144 464 -101 -537 168 401 -342
2710c42K8P73k33o59M58N38o22l60O92J23p69J03P10l30o38N05M59o41k81P38
$$ -342 -314 459 226 -433 25 563 -59 -419 273 396 -373 -270 440 110 -528 -23 436 -205 -486 252
2730B52M9p26K08P09l85n53N88L80o95j84P08p4p31K66O28m68m51O27L03p01n3
$$ 252 301 -425 -217 492 107 -446 142 522 -173 -357 351 277 -454 -188 440 -28 -479 148 451 -250 -303
2751c03P24j72o77L41N15n35m13O56J91o87M5P13k15o21M37M83n71l11O62J08
$$ -303 421 249 -428 -87 428 -107 -520 136 327 -360 -315 398 183 -438 -1 482 -89 -400 262 370
2771C70o92J25O62l17n54M81L88o23k30O38k2o84K12O01l70m62N58L31o20r0O55
$$ 370 -322 -197 465 148 -406 75 463 -160 -390 248 226 -458 -246 355 -15 -477 81 412 -208 -298 357
2792C57q5o34K70N30m61m09N59K41o25l7O46j50n98L29M91m80l63N90J79o28J2
$$ 357 272 -362 -92 438 -23 -432 127 368 -257 -294 352 202 -396 -67 424 -56 -419 171 350 -278 -266
2813b66O34k12n79L87M30n13k81O03R3o10J18O07l02m63M48L32n54j88O00n2o12
$$ -266 368 156 -423 -36 394 -119 -400 203 296 -314 -196 411 109 -354 94 426 -128 -316 284 232 -380
2834c80K22N04l80l88N05K45n75m8N84j19n42K76M74m04l25N26J86n62j1N74j67
$$ -380 -158 346 -34 -422 83 328 -247 -295 289 170 -372 -96 378 -26 -351 175 361 -201 -212 362 195
2855A95n46K93M40m45l17N31J53n80L5N80k07n07L60L86m83k45N48O0n70J27N38
$$ 195 -351 -58 382 -63 -380 151 304 -276 -241 339 132 -375 -15 371 -112 -357 191 251 -319 -192 346
2876C46k89m20M38K74n18j15N44p0n22K35M60l90l17M90J75n33j2N22j55m85K71
$$ 346 57 -363 75 349 -169 -284 260 190 -332 -97 363 -27 -344 146 321 -212 -224 298 143 -342 -71
2897g1L93m01k66M92J49n21K2N18j61m77L01L84m24k90N15J19n34M7N30j90m72
$$ -71 322 -79 -345 147 296 -225 -203 315 154 -323 -22 362 -62 -352 163 282 -252 -205 325 135 -337
2918c37L44L38m58k21N08N4n29J34M80k69l75M17K50m86r0M90o5m83K22M02l45
$$ -337 7 345 -113 -334 174 228 -301 -167 313 44 -331 86 336 -150 -240 250 185 -298 -76 326 -19
2939a9k89M30J57m80nM78j43m47K85L47l69k48M59J24m90K2M82j65m47K70L62
$$ -19 -308 122 279 -201 -206 272 129 -318 -33 314 -55 -303 156 280 -210 -188 294 129 -318 -48 314
2960C14l88k44M51J29m90M6M78j70m39L13L12m09j98M57N3m74J22M46k46l39L48
$$ 314 -74 -318 133 262 -228 -182 296 126 -313 0 312 -97 -295 162 215 -259 -137 309 63 -276 72
2981G2K30m29j10M53o8m36J96L67k91k50L92J37m18j5M16j22m03K11L18l17k27
$$ 72 302 -127 -237 216 148 -288 -92 275 -16 -266 126 263 -155 -170 246 124 -279 -68 250 -67 -294
3002b94L92J24m18K1M25j26l85K32L18l40k29L90J23m33K4M40j51l84K66K92l61
$$ -294 98 222 -196 -175 250 124 -261 -29 289 -51 -280 110 233 -200 -176 264 113 -271 -5 287 -74
3023g4j81M05M0m31R5L95j99l13L17K12l64r0M07n3l84J58L03k54k38L19J33l75
$$ -74 -255 150 190 -241 -146 249 50 -263 54 266 -98 -188 219 166 -218 -60 243 -11 -249 70 203 -172
3045a72j1L68j00l41J89K92k67k01L59R6l70NL67j28l32K07K76k96j78L52Q6l74
$$ -172 -183 185 85 -256 -67 225 -42 -243 116 212 -158 -153 214 86 -246 -39 237 -59 -237 115 201 -173
3067a73M2L75j37l43K53K35l28j52L52M2l93Q8L57j90k75K86J92l51q6L67l5l53
$$ -173 -131 244 107 -236 17 252 -76 -228 124 166 -227 -139 218 28 -247 39 231 -120 -206 161 126 -227
3089b27J54K99k36k06L17J14l46J2L19j04l27J97K39k82j49L18P0l30M6L35j32
$$ -227 -73 226 -10 -216 101 215 -131 -119 200 96 -231 -34 205 -77 -226 92 162 -168 -122 213 81
3110H1k90K31K06k79j46L34L0l44O8L27j59k82K41K11l13j23L52Rl55J06L18j99
$$ 81 -209 22 228 -51 -197 137 167 -177 -109 218 59 -223 18 229 -84 -207 145 154 -201 -95 223 24
3132B4k56K67J70l35n9L35n0l25J75K69k27j92L15R3l28J2L17j24k95K05K07k70
$$ 24 -232 35 205 -130 -189 146 96 -229 -54 215 -12 -204 111 204 -124 -112 205 81 -214 -9 198 -72
3154g2j20L02M4l07P0K94j65k47K19J78k92j06L30J2l20Q5K92j49k65K55J58k96
$$ -72 -192 110 154 -153 -83 211 46 -201 18 196 -96 -202 128 140 -180 -95 197 48 -217 38 196 -100
3176a00r0L24%l31J09K94j85k24K73J38l08n4L12n8l08J51K41k18j81K85Q6k90
$$ -100 -190 134 134 -197 -88 206 21 -203 70 208 -100 -154 158 100 -208 -57 184 -34 -215 70 156 -134
3198a34L4K88j05k42J81J89k56j06K75Pk81P3K44j70j98K16J43k47o3K72mk66
$$ -134 -100 188 83 -159 22 211 -45 -151 124 131 -150 -77 167 -3 -201 15 158 -89 -152 120 116 -150
3220a50J01K26j63j99K05J36k80n4K79nk59J06K50j71j91K34J20k59m0K62n4k58
$$ -150 -49 177 14 -185 20 156 -124 -178 101 96 -163 -57 193 22 -169 65 185 -74 -114 148 94 -164
3242a64J23K24k08j37K33P5k68K2K43j19k09J78J44k15o0K45nk17R6J89j53j66
$$ -164 -41 183 -25 -162 71 146 -122 -100 143 24 -185 -7 137 -78 -138 107 102 -115 -19 170 17 -149
3264a49J91Q9k23n9K37l0k13J16J96j51j27J96R1k30m3K31m0k41R9J97j68j33
$$ -149 42 131 -92 -151 86 56 -157 -41 155 4 -123 73 164 -66 -109 122 82 -159 -60 137 -31 -164
3286a64K04J03k31rK30n0k08J09J84j91j05K05L7k16J3K05r2j68J40J19j89m6
$$ -164 40 143 -88 -97 133 83 -125 -16 168 -23 -128 77 114 -102 -89 116 24 -144 -4 115 -74 -120
3308a20J96j7j82Q5J73j35j27J67O6j84nJ86l3j81R3J54j36j15J65P1j97mJ93
$$ -120 76 59 -123 -38 135 0 -127 40 106 -78 -83 103 70 -111 -18 136 0 -115 50 121 -76 -80 113
3331A13n7j60Q8J44j31j18J65N7k01oJ86o1j64J15J35j41o8J87J6j70M2J54r2
$$ 113 56 -104 -16 128 -3 -121 44 101 -100 -106 80 19 -145 -30 105 -36 -104 83 99 -71 -29 125 33
3354C3j50J41O5j56j3J56m7j28R3J08j15o8J29K9j58K7J44n2j27Q5J11j19n9J40
$$ 33 -117 24 89 -67 -80 76 29 -99 -6 102 -13 -81 48 77 -81 -54 90 38 -89 -4 107 -12 -71 69
3378F9J9j42PJ28m9j16P8J02j11q2J39L5j45KJ39o7j05Q0R8j25l1J34Mj37O8J07
$$ 69 88 -54 -47 81 32 -84 -6 96 -15 -97 42 77 -68 -66 73 6 -99 -19 79 -46 -77 57 61 -76 -8 99
3404I9r7n9R8L2j25K5J04n9p9Q0M8j02j8R9j7r7L9Q9n8q1R5M6j00j4J03j6r9L4
$$ 99 2 -57 41 73 -52 -27 77 18 -61 19 67 -35 -53 46 29 -68 -29 60 2 -79 16 62 -38 -52 51 35 -64 -30
3432c0Q9n9o0P8L7q9j1J04k3q8L7P6p7m8Q8K7r5J1R2m6o9O6M6p9k2Q5j7o7K5P7
$$ -30 59 0 -60 18 55 -34 -45 59 36 -52 -15 61 -16 -64 24 51 -44 -33 59 13 -56 10 56 -23 -45 40 23 -44 -19 58
3462E8n3m7P6K9q8KQ0m6p7O1M7o9k2O3Rp4J2Q0l7o4O0M7p9j1P5J6q3K0O9m9m4
$$ 58 5 -42 34 63 -25 -23 57 11 -66 -5 42 -27 -49 14 23 -51 -39 41 4 -60 0 47 -32 -43 32 48 -35 -15 54 5 -39
3493c9N3L5p4j0P2%q4L5P1o3l6P2J1p9J6O4l6n8M4M4o2k4P7Oo5OP0m0o4O8K9n8
$$ -39 14 49 -25 -35 37 37 -47 -12 59 -4 -40 32 43 -36 -20 44 8 -50 -6 38 -24 -48 29 35 -30 -24 46 6 -58 10 39 -19
3525a9l3P7mn5K1N9m3n0N1L1o2pO0Rn7K8N4n5m6O6J6o9kO2l0n2M0N0o4j8O6J1
$$ -19 -52 25 21 -34 -13 46 3 -47 4 35 -27 -34 26 35 -22 6 60 5 -41 25 41 -28 -30 32 2 -50 -10 40 -24 -42 24 35
3557C5q5K3O3l2n5N1M4n2k6O2Lo5PO7m0n4N7L8n9j4O6%o4K5N4m2m4N2K0n6oN8
$$ 35 -50 -27 36 4 -51 0 44 -8 -34 28 31 -34 -27 40 0 -54 3 41 -18 -32 34 34 -30 -5 49 7 -37 15 35 -21 -27 31
3589C1k1m1L6L3m1j9N7Ko1j0Q0l7n6M4L5p1rO3on8K1N0l1k9N1M2n6k0O2Ko0J1
$$ 31 10 -31 5 38 -3 -22 35 37 -24 -34 46 9 -47 -3 32 -39 -48 15 9 -49 -28 22 -9 -38 13 55 -1 -21 41 43 -17 -6
3621fM2l1m0M1K8m6j4O3k1n6K3N4m5l5M9J7n4JN8k7m4M5M5p0qO7j5p3K2O8l5o1
$$ -6 36 5 -35 6 34 -12 -26 37 16 -40 -17 37 -8 -43 6 23 -31 -30 28 1 -43 2 47 -23 -31 36 21 -52 -30 38 3 -58
3653e8P7K7p8MO2rp5L7M1n5l2N2M0o3LP4j1n3K2O7o2l8N1J6o0j7P6l6n0L3M7n0
$$ -58 19 46 -32 -28 34 25 -50 -13 28 -27 -59 -7 33 -30 -27 47 36 -17 5 72 10 -28 23 39 -21 -38 38 2 -48 -15 32 -18
3685a8k5N1J4p6J3P0m3l3M8L4p1j4Q9j5p0L8N6m5m6P4K1p8jP5l0o8M9M8n8k3M9
$$ -18 -43 8 22 -54 -41 29 -14 -47 1 35 -36 -50 39 24 -46 -8 48 3 -43 31 52 -26 -27 48 18 -50 -1 47 -11 -34 15
3716A5K9p9pP3k0p0N1L1l1l7P1J8n6JO4j6o8L8L5n5l5O7Qq7K5P4m5n0N8M4q6J
$$ 15 44 -35 -42 31 11 -59 -8 23 -8 -45 26 44 -12 -11 53 37 -31 7 42 -13 -48 19 27 -60 -35 39 -6 -56 2 46 -40 -39
3748c9Q3j7p4M1O1o4l0P4J7o4nP0k4o9M3N1o5m8P1Qp3nR5l0o0L5O0n8l0O6J5p2
$$ -39 44 27 -47 -6 55 -9 -39 35 52 -12 -17 53 29 -40 3 54 -11 -59 12 20 -53 -58 37 7 -53 -18 42 -16 -46 20 35 -37
3780c7J0P6k3n9N7M0o8k9P8lp4K3O9n8n3O6L2p9j8Q8k9o7M8O9p0m2Q0K4q8J2Q8
$$ -37 -27 49 26 -33 24 64 -4 -33 45 42 -32 -9 60 2 -51 15 47 -32 -50 38 9 -58 -10 59 -11 -53 27 51 -37 -25 63
3811F3l9p5N3N5o5l7O8J1p8J4O4l0p9N6N4p5k5Q9J8p0K2O6l8o6O0N3q0k7Q4j5
$$ 63 24 -51 2 57 -8 -45 23 34 -44 -30 34 4 -75 -19 35 -40 -65 24 42 -28 -6 60 22 -44 16 69 -11 -38 46 31
3841C1p9K9P7n6o2Q2K5q5mQ8l3q9N2P3p6m1R0Lq2K1R8m4p3O1O7r4l2J06Lj05K8
$$ 31 -48 -19 58 2 -60 22 47 -38 -42 46 13 -76 -24 49 -27 -68 22 25 -57 -36 62 18 -55 6 73 -21 -53 53 56 -49 -21
3872b1Q2n2q5P6N4j01j3J00j6r1M8R1p6o5J00K7r6j0J14l2r8M7Q2r0n6J11K1j15
$$ -21 61 9 -76 0 54 -47 -60 40 24 -67 -19 72 -4 -69 31 58 -38 -48 66 34 -64 -17 65 -25 -81 30 51 -64
3900f4QJ13l9j01Q2O3r9m4J20Qj09K6J16p2r4J03O2j12k8J26pj13N0R2q7p2J02
$$ -64 -56 57 18 -83 -1 62 -37 -81 39 47 -62 -36 80 8 -86 17 79 -33 -61 65 58 -55 -5 87 0 -72 30
3927C0L9j28rJ38l4j22O5R2q6q4J16L6j11LJ21m2j01Q0P9q5o3J08K5j24K3J16
$$ 30 69 -59 -68 70 36 -86 -21 71 -15 -99 17 53 -58 -55 66 24 -77 3 82 -3 -66 42 67 -57 -34 82
3953H2m8j21Q3P5j09l6J24jj15L2J17p1j01J12O4j36rJ35l1j22O4J11j10p0J20
$$ 82 34 -87 -4 71 -38 -74 50 49 -66 -34 83 12 -89 23 87 -49 -58 77 46 -76 -12 99 -11 -81 39
3978C9M3j53J9J21m7j23Q0J10j24o0J29K1j35J9J34n7r8P5J03j14o7J34K9j38
$$ 39 82 -71 -52 69 22 -101 -21 89 -35 -95 34 55 -80 -61 73 16 -82 -7 96 -18 -85 49 78 -60
4002f0L2J23p4r1Q8O9j33l3J21%j23M7J12q2r0J14O0j31k3J52l8j30Q9R6j08p1
$$ -60 -28 95 21 -70 18 87 -46 -79 42 42 -81 -34 78 -4 -94 20 80 -51 -74 78 40 -90 -1 95 -13 -84
4028h4J37K2j54L1J39o7j21R2R3j22n3J30K0j38K6J38o4j03Q4Q0j11m7J34K6j49
$$ -84 53 75 -79 -48 91 24 -97 -5 88 -34 -87 43 63 -75 -49 89 25 -78 6 86 -25 -72 62 88 -61
4053f1M6J12p1j04R8P2j27l5J34rj46M7J23q5r9J21M5j35jJ45l9j27R2J10j10
$$ -61 -15 97 26 -78 20 92 -35 -70 64 55 -91 -44 79 -6 -105 16 61 -74 -75 70 31 -96 -4 106 -4
4078dp6J41J7j43K1J31n8j14Q1Q9j11o0J27J3j29K6J22o1r5R1P7j12m2J26%j24
$$ -4 -80 61 78 -65 -44 87 29 -85 -4 85 -26 -86 41 54 -75 -49 73 12 -83 8 85 -27 -69 57 57 -67
4104f7K3J23n6j05R1P2j21k6J23rj22N4R1p5q2J20K3j21MJ21m1j21R8Q3j07n6
$$ -67 -44 79 23 -82 9 81 -40 -66 57 48 -74 -20 71 -4 -86 34 57 -64 -60 61 20 -101 -3 80 -27 -83
4130h3J37J2j23K8J09m4j03R2O8j04m8J10Jj19J8J15n9r0P5O0q3l8J00K6j17K6
$$ -83 54 66 -57 -29 80 36 -67 25 93 -11 -59 51 52 -67 -49 66 7 -83 -8 52 -31 -69 31 57 -60 -34
4156c4J10o2p6P0N8r8k6J03qr9N0R0r4m7Q8N2j20lJ02m5q2N7Q3j04k0R5mr1J4
$$ -34 76 14 -62 8 66 -32 -58 45 37 -62 -12 78 -16 -63 25 77 -43 -46 56 11 -71 -14 69 -35 -55 40 36 -55 -41
4185d1R9m6p6P7N3q8l0J05lj05L9Q3p3n7N9M6r4j4Q7nq4L6P5m4o2P8L9q4KR1l4
$$ -41 58 12 -64 13 66 -22 -52 53 50 -55 -16 67 -6 -63 -4 42 -52 -66 21 16 -68 -32 43 -1 -63 15 54 -30 -28 63 29
4216B9q0N3O4o7n4Q0J2q7J5Q7m7o9P3N1r2j0R0k1q5L7O2m4o9Q4K1q1%Q9j4p7L9
$$ 29 -51 2 66 -1 -55 25 37 -50 -35 52 5 -64 9 60 -32 -42 48 27 -58 -21 41 -3 -72 12 33 -48 -48 41 27 -50 -11
4247a1O3n0n5P7K1o7j2Q3k9p5L8O3n8l7O9K3q4J1Q1l7n6O2M5p3k0P3rq7K7Q3n7
$$ -11 52 2 -53 24 45 -22 -34 49 20 -55 -17 46 -12 -49 20 43 -41 -30 51 14 -42 20 65 -8 -28 45 36 -51 -24 59 2
4278Bn6O1K8p6j5Q6k8o4O1N5n8n8R3No4nO9j4o5L4O3o3m0P5J1o1KP1l0m6K2N5
$$ 2 -54 7 35 -41 -56 30 2 -62 -1 54 -4 -62 31 36 -28 -33 36 22 -43 -9 54 -9 -49 26 37 -24 -22 49 19 -27 -5 50
4310E0n3m2O3J7p5NQ0l5o7N2M4n1l5P3J3p5J1P7m4n1M6M2p4qP7j6q1M4M9n5l5
$$ 50 -3 -45 18 35 -40 -35 45 10 -57 -5 39 -12 -47 26 39 -36 -25 52 8 -43 3 45 -29 -37 40 24 -57 -13 36 -19 -54
4341e4O2L7q3J0Q5k3o5M2N4p0m4P5J1o8kO7k2p0M8M8n4k9O1J9o6RO2k7n6M8L5
$$ -54 8 45 -38 -28 57 34 -31 11 65 -5 -49 26 37 -31 -33 34 12 -58 -10 38 -16 -45 16 35 -31 -22 40 13 -43 5 40
4372D0p2k3Q2lp6L2O3m1m4N3L6p0j4O9j0n0K9M9n4k5L5L3o4jN9j9o3N3M0n4j9
$$ 40 -32 -55 27 24 -52 -20 43 2 -42 11 47 -23 -37 32 22 -28 1 50 -4 -29 6 39 -25 -26 33 14 -49 4 44 -10 -29
4403b9N9J8p8J9N8k7o1L9L7n9k6P1j3n5J9P2m2m3M2L1m6j8Q0j7n6J6O3m2m5N8
$$ -29 30 48 -30 -11 47 20 -41 -2 35 -24 -50 21 8 -47 -28 44 2 -41 1 32 -14 -32 48 31 -25 -9 54 12 -33 25
4433B5J6o2oP1k5o0L7M6n5l5O1J8q1K5N6j4o9M9L5n5k0O1Oo6K3N7l7l6N3K0m8
$$ 25 41 -21 -27 44 19 -41 -4 42 -13 -48 13 31 -50 -25 31 17 -52 -3 32 -23 -43 18 24 -42 -19 38 1 -35 18 38 -10
4464a0l0P6j9o2L3N0l9n2N3L6p0pO4Mo6M5M9m0m7N4K1o3MO4k6o9L7N1n8m2P6P
$$ -10 -40 36 17 -45 -12 38 -1 -53 0 36 -34 -41 23 27 -39 6 55 15 -32 22 43 -20 -16 48 22 -47 -10 41 -17 -59 17 24
4496B4p3NP7l3n5M6N7o9l0Q3Pp9L3O5m9n7O0L7o0j7P0j2o6L1N5m1n6N0M0p7nO7
$$ 24 -49 -44 33 0 -55 -9 48 -21 -51 32 39 -40 -7 58 9 -48 12 49 -11 -28 42 30 -36 -5 50 9 -47 3 43 -34 -39 28
4528B8%r1M0P5m6n0O4J8p2RO5mp6L4N5o0m0O9J6q2J3P5l7o8O3N9p4k2Q0Kq7K2
$$ 28 28 -63 -23 52 6 -44 20 38 -34 -25 40 36 -40 -6 49 -11 -51 18 34 -48 -35 40 3 -65 -2 57 -17 -39 41 43 -44 -22
4560b2Q7m7p1P3M5q0k2Q7j2p7K1Q0m5q3P3N0q3l0Q8pq4L6Q5o6o4P2L2q0qR8j4
$$ -22 65 18 -53 20 65 -15 -37 50 38 -39 -18 62 17 -66 7 57 -26 -56 32 25 -59 -23 62 -4 -68 4 36 -44 -52 46 32
4591C2q4N2P6p6l8Q0K0r5J2Q2l9p4N4O0q7l1R0J2j03K4R5n8n5N0N5q2k8J04Lj03
$$ 32 -52 0 76 0 -38 42 62 -33 -21 61 22 -52 2 62 -25 -56 34 46 -57 -33 62 4 -51 -1 54 -28 -56 48 51 -52
4621e2M2P2n6p0P3M9r5j8R6oj02M4Q7q1m2Q3M0j12PJ11l6q6O1O0q8m1R4K3j06
$$ -52 -10 62 6 -64 9 58 -37 -55 41 35 -67 -23 64 -17 -59 24 64 -48 -41 70 34 -52 9 69 -19 -60 34 57 -49
4650d9J9J02m2j01Q1O2j01k5J03j0j10L4J00n8q3Q3M5q4k6J07j1j08N1R2o2p6
$$ -49 -30 72 30 -71 10 72 -29 -54 49 39 -71 -37 63 5 -78 5 50 -34 -60 47 36 -72 -21 71 9 -67
4676f7J03M5j20KJ03k3j13O4P6q5n6R4L6j10PJ16n0r7P8P6r3m6J11%j16K3J20
$$ -67 36 81 -39 -37 66 43 -70 -6 70 -15 -71 23 59 -51 -44 72 22 -75 3 79 -14 -60 51 51 -65 -42 78
4703G8n9r6Q3O4j15k2J28rj20M7R0p1q1J02L3j02pJ01j1j10N9Q8p6o1J13L3j26
$$ 78 19 -77 6 70 -45 -67 61 52 -68 -21 69 -2 -83 19 52 -50 -57 44 33 -77 -18 70 -6 -67 46 79 -47
4730d7QJ21n0r9O5Q7r1n9J15Mj10K2J02m5j00Q1O2r0n6J16K8j42N3J01p0p9R4
$$ -47 -39 82 32 -67 -2 85 -6 -65 50 54 -56 -34 68 23 -77 4 66 -24 -80 36 64 -78 -25 76 6 -73 21
4757B1N5j08k9J07Jj22M9R6p7o6R5N0r9k1J12l6r9O2Q7q7p1J06K7j13J5J15l4
$$ 21 76 -32 -61 46 47 -75 -26 70 -7 -73 22 72 -27 -48 64 28 -71 -9 78 -9 -80 26 53 -60 -45 70 36
4784C6j12O7Q8r7n6J10Rj15M0R3n2q6Q7O2j01m4J19Mj07K2J02n3r1R7N5j00k3
$$ 36 -76 -9 79 -18 -74 36 45 -70 -30 63 11 -75 12 74 -27 -71 48 52 -55 -33 69 16 -75 22 77 -23 -46
4811d6J06j2j10L8J14p4q7R4M3j17JJ23l5j09O0J03q9o7R9L8j27J4J13m2j01O8
$$ -46 60 48 -62 -24 90 16 -71 23 66 -51 -50 73 38 -71 -11 92 3 -64 35 73 -54 -40 73 31 -70 -2
4837bP3r5m4J13Rj02J3J01m6r0P1P1r9m3J15Jj20M1J06o1q6R5N2r8l1J25k3j11
$$ -2 71 -24 -68 45 54 -48 -35 66 20 -70 1 72 -27 -70 45 46 -74 -33 73 12 -74 21 73 -25 -56 69 46 -65
4865f5L1J02o4o6Q9L8j13qJ06j1j15N5R2q8o0R5L7j11QJ08l1j01P4P7r3m7J07
$$ -65 -34 68 4 -62 27 65 -48 -56 50 39 -76 -21 71 -17 -77 18 55 -56 -48 60 29 -72 2 79 -14 -61 46
4892D6Mj05PJ28n6j04R1O2r9l3J08Mj09K5J10o8q2P3O8r5l4J13pj07L1R9o8p4
$$ 46 50 -55 -48 80 24 -80 11 73 -26 -59 49 53 -56 -31 79 11 -71 2 70 -25 -59 54 47 -60 -29 70 2 -72
4920g2Q9M7j00l4J22j2j18M5J09r2o7J06M3j06mJ10l8r6O4R1r4n6J03K2j11J6
$$ -72 17 64 -36 -70 52 40 -78 -33 76 -16 -83 23 66 -40 -44 66 28 -68 -4 87 -7 -63 40 62 -49 -33
4946c3J04l1r8N8Q3j06l9J04J4j08PJ04m3q4P2N2p9m2J10Oj12L7R5n7q6Q5N9j01
$$ -33 71 40 -58 0 83 -23 -62 42 56 -52 -45 59 16 -68 4 56 -23 -65 45 51 -61 -24 71 14 -72 13 72 -29
4974b9j8R6lj01M2Q3p1o2R4L2r9pJ12l6r2N6P8q5m8R2L3j07kJ06l7r3N7P7q0m9
$$ -29 -47 49 46 -55 -13 70 -1 -63 31 63 -36 -43 69 33 -59 -3 75 -10 -58 34 67 -40 -42 64 27 -66 -9 68 -12 -61
5004f1R6J2j05J5J04n3q8P6O4r1m1J03J2r4J7Q7l5q3P5N9r5k7J08Mj11L5Q3n9
$$ -61 35 47 -58 -43 61 8 -80 -4 60 -31 -72 31 43 -51 -34 53 18 -65 10 69 -26 -53 55 59 -52 -17 66 7
5032Go6P4M4q3k4J05l3q7M4P5o4n8Q5L5j04oJ13l1j03P2P9j01l3R2J9q9NR4m3
$$ 7 -59 15 59 -24 -48 57 24 -63 -19 56 -8 -66 19 54 -50 -56 57 26 -77 -5 74 -27 -60 32 51 -38 -33 61 18
5061A8q0O7N6q5m4J12jj01K3J05m7r5Q7M8q3m5J29j8j04L9Q0n2o8Q4M5r5l2J15
$$ 18 -62 5 61 -24 -68 44 43 -58 -35 70 23 -72 15 63 -20 -65 64 46 -58 -19 61 9 -59 25 70 -25 -57 58
5089E8l0r4L9R5q9n3R4L9j00j0J05k1j12P5Q2r2n4J03K8j08J0J03l7r7O9P6r6
$$ 58 28 -66 -27 68 -21 -74 20 59 -41 -51 54 33 -79 -4 78 -14 -68 35 63 -45 -35 68 31 -66 3 79 -17
5116a7l4R2K1j13J6J09o8q4Q5O0r9m1J09Kj04M4J03p5p9R6M2j15lJ10j9j14M8
$$ -17 -51 41 62 -51 -35 74 6 -78 7 67 -32 -73 36 38 -66 -22 81 6 -73 23 65 -50 -53 57 38 -76 -28
5143b8R8q2p2J10L3j06%J16k8j13O0R3r0n5J01L5j13NJ15l8j13Q2O7r9m7J22J9
$$ -28 70 -12 -84 26 59 -47 -47 69 41 -72 -12 81 -9 -64 37 72 -41 -36 79 41 -72 10 77 -22 -69 53 72
5170G2j34L3R5m2j09R7O8j18l1J12jj18M1J07p0r0J09N3j10k1J31k0j21M6J12
$$ 72 -62 -29 66 24 -85 12 80 -38 -69 43 42 -76 -35 72 2 -88 21 74 -36 -57 74 54 -67 -21 91
5195I1p8r4J16M0j25jJ24l2j20O1J02j02o7J16M7j43K7J09n0j08P9R9j12o9J30
$$ 91 13 -81 35 75 -50 -51 73 41 -79 -18 84 -18 -85 31 78 -65 -38 71 21 -87 -8 91 -21 -90 40
5220D0Qj23K6J21n9j01R6O6j08l0J22Lj23L3J19q6q3R9M3j00j9J14nj32O3J06
$$ 40 48 -75 -49 72 13 -88 8 74 -34 -64 58 61 -62 -29 90 4 -79 20 63 -37 -56 58 53 -79 -16 90
5246I0q9q3J19M5j31KJ22l5j27P7J04j02p4J25K7j31PJ23m2j11P4Q5j01m3J16
$$ 90 1 -82 37 82 -49 -47 75 40 -87 -10 94 -8 -82 43 70 -61 -54 69 27 -84 -10 75 -26 -69 47
5271D7Rj17J8J20n1j05R9O7j17l2J14jj13L4J13p2r3J06N2j18k8J39j6j41O2J27
$$ 47 56 -61 -43 77 26 -79 20 87 -30 -62 52 51 -62 -28 85 13 -80 26 78 -40 -68 71 55 -86 -24 103
5297A03j01r3J15O1j39lJ41l7j29P0J01j08o1J17L0j33K0J33o3j18Q8R7j23l8
$$ 103 2 -91 24 85 -54 -57 84 47 -82 -12 89 -19 -80 37 67 -66 -46 87 24 -94 -6 91 -32 -70
5321g0J28K0j44K0J33o5r9Q9P9j31l0J42j6j26L6J19p6r7J17N7j47LJ25j7j30
$$ -70 58 78 -66 -46 87 22 -77 12 91 -40 -70 72 56 -70 -34 85 9 -88 29 86 -61 -58 67 50 -80
5346h0O1J11j08p1J26M6j43qJ50m9j30R3Q8r2p5J27L4j35KJ48n4j16P6R8j30l2
$$ -80 -19 92 -16 -87 39 85 -58 -66 84 35 -95 -2 86 -6 -81 46 80 -55 -53 95 41 -75 1 99 -31 -63
5372f3J23J2j31L8J17q1r7J06N9j22j6J25j1j34N3J10p8r4J07M8j18j8J39l4j35
$$ -63 60 72 -59 -21 96 15 -82 24 83 -39 -55 70 59 -75 -22 88 10 -84 23 71 -47 -65 74 40 -95
5397i5P5J20j13o9J20L8j29jJ40l8j16N9R6r3p1J35K5j45J1J40n1j15P7P8j05
$$ -95 -20 100 -13 -82 38 76 -53 -54 86 48 -68 -9 87 -6 -77 58 83 -62 -51 89 38 -77 0 78 -27
5422b7m3J16J5j22K2J19o6r6P9P8j16k7J16j1j16M8J19r0q7J18M3j18j1J27j8
$$ -27 -70 46 61 -61 -39 80 14 -82 -3 75 -41 -68 48 37 -79 -31 88 -2 -89 29 72 -46 -57 70 52
5447E2j27O0J07r5o5J10M2j40KJ36l9j13P3Q8r8o9J22K7j44L0J15m2j17Q8P6j23
$$ 52 -75 -15 92 -3 -68 42 84 -56 -54 82 43 -70 3 91 -7 -76 46 73 -71 -41 74 32 -85 3 79 -44
$$ [...]
8191a9
##END NTUPLES=NMR FID
##END=
