##TITLE=1H_AM_NVBENZ1280
 CDCL3
 8 sc, 
 11.04.2022
##JCAMPDX= 6.0         $$ Bruker NMR JCAMP-DX V2.0
##DATA TYPE= NMR FID
##DATA CLASS= NTUPLES
##ORIGIN= UXNMR, Bruker Analytische Messtechnik GmbH
##OWNER= root
$$ XWIN-NMR		Version 3.5
$$ Mon Apr 11 10:53:47 2022 Russian Standard Time (UT+4h)  she@DPX200
##.OBSERVE FREQUENCY= 200.13135
##.OBSERVE NUCLEUS= ^1H
##.DELAY= (6, 6)
##.ACQUISITION MODE= SIMULTANEOUS
##.ACQUISITION SCHEME= undefined
##.AVERAGES= 8
##.DIGITISER RES= 18
##SPECTROMETER/DATA SYSTEM= spect
##.PULSE SEQUENCE= zg30
##.SOLVENT NAME= CDCl3
##.SHIFT REFERENCE= (INTERNAL, CDCl3, 0, 15.7039)
##AUDIT TRAIL= $$ (NUMBER, WHEN, WHO, WHERE, WHAT)
$$ ##TITLE= Audit trail, XWIN-NMR		Version 3.5
$$ ##JCAMPDX= 5.01
$$ ##ORIGIN= Bruker BioSpin GmbH
$$ ##OWNER= she
$$ F:/spectra/data/she/nmr/H-F/1/audita.txt
$$ ##AUDIT TRAIL=  $$ (NUMBER, WHEN, WHO, WHERE, WHAT)
(   1,<2022-04-11 10:52:12.60 +0400>,<she>,<DPX200>,
      <created by zg, POWCHK disabled, PULCHK disabled
       configuration hash MD5:
       00 E9 B6 7A A2 85 ED C7 34 08 36 98 17 FE 4E 26
       data hash MD5: 16K
       62 73 5B B6 1B CF 07 5F A2 A6 17 71 31 F9 6C 9D>)
$$ ##END=
$$ 
$$ hash MD5
$$ 0A FC 2C 1E 9C 74 5D C3 67 99 73 9E A9 4A B9 CD
##$RELAX= 
##$RELAX= 
##$RELAX= 
##$RELAX= 
##$RELAX= 
##$RELAX= 
$$ Bruker specific parameters
$$ --------------------------
##$DU= <F:/spectra>
##$EXPNO= 1
##$NAME= <H-F>
##$PROCNO= 1
##$TYPE= <nmr>
##$USER= <she>
##$AMP= (0..31)
100 100 100 100 100 100 100 100 100 100 100 100 100 100 100 100 100 100 
100 100 100 100 100 100 100 100 100 100 100 100 100 100 
##$AQSEQ= 0
##$AQ_mod= 1
##$AUNM= <au_zg>
##$AUTOPOS= <>
##$BF1= 200.13
##$BF2= 200.13
##$BF3= 200.13
##$BF4= 200.13
##$BF5= 200.13
##$BF6= 200.13
##$BF7= 200.13
##$BF8= 200.13
##$BYTORDA= 1
##$CFDGTYP= 0
##$CFRGTYP= 5
##$CHEMSTR= <none>
##$CNST= (0..31)
1 1 145 1 1 1 1 1 1 1 1 1 1 1 1 1 1 1 1 1 1 1 1 1 1 1 1 1 1 1 1 1 
##$CPDPRG= <>
##$CPDPRG1= <>
##$CPDPRG2= <>
##$CPDPRG3= <>
##$CPDPRG4= <mlev>
##$CPDPRG5= <mlev>
##$CPDPRG6= <mlev>
##$CPDPRG7= <mlev>
##$CPDPRG8= <mlev>
##$CPDPRGB= <>
##$CPDPRGT= <>
##$D= (0..31)
0 1.2 0 0 0 0 0 0 0 0.06 0 0.03 0 0 0 0 0.0002 0 0 0 0 0 0 0 0 0 0 0 0 
0 0 0 
##$DATE= 1649659931
##$DBL= (0..7)
120 120 120 120 120 120 120 120 
##$DBP= (0..7)
150 150 150 150 150 150 150 150 
##$DBP07= 0
##$DBPNAM0= <>
##$DBPNAM1= <>
##$DBPNAM2= <>
##$DBPNAM3= <>
##$DBPNAM4= <>
##$DBPNAM5= <>
##$DBPNAM6= <>
##$DBPNAM7= <>
##$DBPOAL= (0..7)
0.5 0.5 0.5 0.5 0.5 0.5 0.5 0.5 
##$DBPOFFS= (0..7)
0 0 0 0 0 0 0 0 
##$DE= 6
##$DECBNUC= <off>
##$DECIM= 32
##$DECNUC= <off>
##$DECSTAT= 4
##$DIGMOD= 1
##$DIGTYP= 9
##$DL= (0..7)
0 120 120 120 120 120 120 120 
##$DP= (0..7)
150 150 150 150 150 150 150 150 
##$DP07= 0
##$DPNAME0= <>
##$DPNAME1= <>
##$DPNAME2= <>
##$DPNAME3= <>
##$DPNAME4= <>
##$DPNAME5= <>
##$DPNAME6= <>
##$DPNAME7= <>
##$DPOAL= (0..7)
0.5 0.5 0.5 0.5 0.5 0.5 0.5 0.5 
##$DPOFFS= (0..7)
0 0 0 0 0 0 0 0 
##$DQDMODE= 0
##$DR= 18
##$DS= 0
##$DSLIST= <SSSSSSSSSSSSSSS>
$$ [...]
##$SUBNAM2= <"">
##$SUBNAM3= <"">
##$SUBNAM4= <"">
##$SUBNAM5= <"">
##$SUBNAM6= <"">
##$SUBNAM7= <"">
##$SUBNAM8= <"">
##$SUBNAM9= <"">
##$SW= 18.05172834244
##$SWIBOX= (0..15)
0 0 2 0 0 0 0 0 0 0 0 0 0 0 0 0 
##$SW_h= 3612.71676300578
##$TD= 16384
##$TD0= 1
##$TE= 0
##$TE2= 300
##$TE3= 300
##$TEG= 300
##$TL= (0..7)
0 120 120 120 120 120 120 120 
##$TP= (0..7)
150 150 150 150 150 150 150 150 
##$TP07= 0
##$TPNAME0= <>
##$TPNAME1= <>
##$TPNAME2= <>
##$TPNAME3= <>
##$TPNAME4= <>
##$TPNAME5= <>
##$TPNAME6= <>
##$TPNAME7= <>
##$TPOAL= (0..7)
0.5 0.5 0.5 0.5 0.5 0.5 0.5 0.5 
##$TPOFFS= (0..7)
0 0 0 0 0 0 0 0 
##$TUNHIN= 0
##$TUNHOUT= 0
##$TUNXOUT= 0
##$USERA1= <user>
##$USERA2= <user>
##$USERA3= <user>
##$USERA4= <user>
##$USERA5= <user>
##$V9= 5
##$VALIST= <valist>
##$VCLIST= <CCCCCCCCCCCCCCC>
##$VD= 0
##$VDLIST= <DDDDDDDDDDDDDDD>
##$VPLIST= <PPPPPPPPPPPPPPP>
##$VTLIST= <TTTTTTTTTTTTTTT>
##$WBST= 1024
##$WBSW= 4
##$XGAIN= (0..3)
0 0 0 0 
##$XL= 0
##$YL= 0
##$YMAX_a= 42927
##$YMIN_a= -41964
##$ZGOPTNS= <>
##$ZL1= 120
##$ZL2= 120
##$ZL3= 120
##$ZL4= 120
##$ABSF1= 10
##$ABSF2= 0
##$ABSG= 5
##$ABSL= 3
##$ALPHA= 0
##$AQORDER= 0
##$ASSFAC= 0
##$ASSFACI= 0
##$ASSFACX= 0
##$ASSWID= 0
##$AUNMP= <proc_1d>
##$AZFE= 0.1
##$AZFW= 0.1
##$BCFW= 1
##$BC_mod= 2
##$BYTORDP= 1
##$COROFFS= 0
##$CY= 11.3945322036743
##$DATMOD= 1
##$DC= 2
##$DFILT= <>
##$DTYPP= 0
##$F1P= 2.36226072786647
##$F2P= -0.459571619588291
##$FCOR= 0.5
##$FTSIZE= 0
##$FT_mod= 4
##$GAMMA= 1
##$GB= 0.15
##$INTBC= 1
##$INTSCL= 1
##$ISEN= 128
##$LB= 0.24
##$LEV0= 0
##$LPBIN= 0
##$MAXI= 10000
##$MC2= 0
##$MEAN= 0
##$ME_mod= 0
##$MI= 1.114404
##$NCOEF= 0
##$NC_proc= 0
##$NLEV= 6
##$NOISF1= 3.799351
##$NOISF2= 2.8
##$NSP= 1
##$NTH_PI= 0
##$NZP= 0
##$OFFSET= 15.70392
##$PC= 1
##$PHC0= -18300.01
##$PHC1= 12.60078
##$PH_mod= 1
##$PKNL= yes
##$PPARMOD= 0
##$PSCAL= 0
##$PSIGN= 0
##$REVERSE= no
##$SF= 200.130013532006
##$SI= 16384
##$SIGF1= 3
##$SIGF2= 2
##$SINO= 400
##$SIOLD= 16384
##$SREGLST= <1H.CDCl3>
##$SSB= 0
##$STSI= 0
##$STSR= 0
##$SW_p= 3612.71676300578
##$SYMM= 0
##$S_DEV= 0
##$TDeff= 0
##$TDoff= 0
##$TI= <>
##$TILT= no
##$TM1= 0
##$TM2= 0
##$TOPLEV= 0
##$USERP1= <user>
##$USERP2= <user>
##$USERP3= <user>
##$USERP4= <user>
##$USERP5= <user>
##$WDW= 1
##$XDIM= 8192
##$YMAX_p= 0
##$YMIN_p= 0
$$ End of Bruker specific parameters
$$ ---------------------------------
##NTUPLES= NMR FID
##VAR_NAME=  TIME,          FID/REAL,        FID/IMAG
##SYMBOL=    X,             R,               I
##VAR_TYPE=  INDEPENDENT,   DEPENDENT,       DEPENDENT
##VAR_FORM=  AFFN,          ASDF,            ASDF
##VAR_DIM=   8192,          8192,            8192
##UNITS=     SECONDS,       ARBITRARY UNITS, ARBITRARY UNITS
##FACTOR=    0.0002768,     1,               1
##FIRST=     0,             0,               0
##LAST=      2.2672688,     0,               0
##MIN=       0,             -41964,          0
##MAX=       2.2672688,     42927,           0
$$ Real data points
##PAGE= N=1
##DATA TABLE= (X++(R..R)), XYDATA
$$ [...]
$$ plain form
1723 -1674 -1830 -173 1756 2205 700 -1421 -2078 -422 2071 3064 1698 -649 -1614 -476 1182 1378
1739 1378 -123 -1799 -2051 -652 1093 1377 -283 -2394 -2786 -892 1687 2562 996 -1216 -1780 -259
1755 -259 1530 1847 491 -1041 -1070 572 2288 2248 217 -2061 -2336 -234 2011 2109 -53 -2279 -2536
1772 -2536 -886 842 866 -594 -1798 -1326 599 2250 1964 -219 -1998 -1530 886 2769 2377 164
1788 164 -1708 -1565 128 1473 1198 -304 -1519 -1093 611 1804 971 -1243 -2763 -2047 284 1952
1804 1952 1394 -600 -1974 -1537 249 1732 1594 162 -991 -472 1214 2228 1277 -1021 -2389 -1403
1820 -1403 931 2283 1479 -639 -2114 -1634 222 1528 1057 -701 -1886 -1161 709 1636 376 -1782
1836 -1782 -2563 -979 1504 2661 1612 -555 -1648 -733 1174 2201 1337 -553 -1535 -501 1249 1625
$$ packed form
1723a674j56J657J929M49j505k121o57J656K493R93j366k347r65J138J658J96
1739A378j501j676k52J399J745K84j660k111l92J894K579Q75j566k212n64J521
1755b59J789L17j356j532k9J642J716m0k031k278k75K102K245R8k162k226k57
1772b536J650J728K4j460j204M72J925J651k86k183j779M68K416J883l92k213
1788A64j872J43J693J345k75j502j215M26J704J193q33k214j520P16K331J668
1804A952n58j994j374M37J786J483j38j432j153N19J686J014r51k298j368R86
1820a403K334J352q04k118j475M80J856J306m71j758j185P25J870R27j260k158
1836a782p81J584K483J157j049k167j093R15J907J027q64j890r82J034J750L76
$$ plain form
1852 1625 40 -1983 -2409 -728 1368 1971 560 -1468 -2309 -1289 669 1600 668 -997 -1423 -127
1868 -127 1608 1900 454 -1248 -1313 314 2082 2365 806 -1339 -2214 -1119 685 1339 197 -1476 -1845
1885 -1845 -439 1236 1295 -210 -1666 -1535 202 2004 2170 442 -1613 -2074 -556 1440 1931 518
1901 518 -1168 -1234 333 1697 1402 -320 -1785 -1521 299 1858 1614 -315 -2230 -2282 -350 1553 1608
1918 1608 -20 -1399 -1132 428 1579 1000 -652 -1714 -1091 732 2101 1679 -278 -1884 -1486 443
1934 443 1962 1642 -58 -1366 -1028 303 1098 409 -1133 -2012 -1319 545 1760 1143 -722 -2015 -1355
1951 -1355 646 2148 1620 -58 -1147 -676 658 1513 831 -812 -1689 -855 991 1984 1011 -1175 -2387
1968 -2387 -1448 623 1733 1000 -759 -1693 -954 649 1408 589 -914 -1502 -309 1592 2303 916 -1253
$$ packed form
1852A625j585k023m26J681K096O03j411k028q41J020J958R31r32j665m26J296
1868a27J735K92j446j702o5J627J768K83j559k145q75J095J804O54j142j673l69
1885a845J406J675N9j505j456J31J737J802J66j728k055m61J518J996M91j413
1901E18j686o6J567J364k95j722j465K64J820J559k44j929j915n2J932J903N5
1918A608j628j379K67J560J151n79j652j062O23J823J369m22j957j606L98J929
1934D43J519l20j700j308L38J331P95o89j542q79O93J864J215o17j865j293O60
1951a355K001J502n28j678j089M71J334Q55o82j643q77Q34J846R93r73k186j212
1968b387R39K071J110p33j759r34P39J603P59q19j503n88J193J901P11j387k169
$$ plain form
1985 -1253 -2048 -816 1142 1891 784 -959 -1599 -670 801 1293 296 -1162 -1491 -187 1542 1767 175
2002 175 -1695 -2147 -746 1103 1592 496 -986 -1439 -437 1076 1532 496 -861 -1028 356 1873
2018 1873 1903 214 -1630 -1855 -450 1165 1459 195 -1392 -1858 -738 790 1103 -100 -1438 -1350 301
2035 301 1842 1636 -54 -1603 -1462 232 1895 1971 464 -1159 -1419 -135 1258 1190 -314 -1623 -1250
2052 -1250 380 1556 995 -786 -2050 -1560 263 1676 1515 -59 -1451 -1339 165 1383 1094 -383
2068 -383 -1369 -743 850 1741 982 -672 -1625 -984 743 1941 1512 -167 -1508 -1274 146 1155 613
2085 613 -853 -1693 -978 504 1253 490 -1006 -1754 -930 901 2059 1482 -247 -1424 -913 660 1586
2102 1586 947 -563 -1254 -392 988 1555 534 -1130 -1849 -868 931 1743 766 -1103 -2076 -1194 514
$$ packed form
1985a253p95J232J958P49j107j743o40R29J471M92r97j458l29J304J729K25j592
2002A75j870m52J401J849M89j096j482m53J002J513M56j036j357j67J384J517
2018A873L0j689j844k25J405J615K94j264j587m66J120J528L13j203j338Q8J651
2035C01J541k06j690j549J41J694J663P6j507j623k60J284J393o8j504j309L73
2052a250J630J176n61j781j264M90J823J413j61j574j392J12J504J218k89j477
2068c83r86O26J593Q91p59j654r53O41J727J198m29j679j341K34J420J009n42
2085F13j466q40P15J482P49p63j496p48Q24J831J158n77j729j177N11J573R26
2102A586o39j510o91Q62J380N67j021j664p19R81J799Q12r77j869r73Q82J708
$$ plain form
2119 514 1238 401 -919 -1277 -227 1257 1600 499 -1013 -1374 -157 1524 2063 804 -1040 -1656 -577
2136 -577 903 1297 296 -1006 -1265 -249 932 1024 -219 -1559 -1733 -413 1271 1585 301 -1236 -1497
2153 -1497 -212 1279 1619 646 -593 -756 196 1263 1203 -132 -1585 -1619 -178 1336 1395 -62 -1577
2170 -1577 -1623 -239 1208 1335 199 -1032 -1061 75 1167 960 -439 -1625 -1291 370 1826 1571 -51
2187 -51 -1354 -1133 303 1509 1353 -1 -1155 -969 197 1131 710 -752 -1725 -1083 554 1631 1067
2204 1067 -537 -1641 -1252 205 1311 1005 -239 -1132 -758 567 1431 949 -426 -1149 -441 1057 1815
2221 1815 997 -712 -1750 -1270 60 1011 617 -667 -1501 -975 426 1272 655 -642 -1201 -303 1243
2238 1243 1823 881 -707 -1512 -824 655 1510 897 -525 -1271 -637 723 1255 350 -1103 -1490 -479 931
$$ packed form
2119E14P24q37j320l58J050J484L43j101j512l61J217J681N39j259j844o16J079
2136e77J480L94j001j302k59J016J181R2j243j340j74J320J684L14j284j537k61
2153a497J285J491L40r73j239j63R52J067o0j335j453l4J441J514N9j457j515
2170a577m6J384J447J27j136j231k9J136J092k07j399j186L34J661J456k55j622
2187e1j303K21J436J206j56j354j154J86J166R34m21j462r73O42J637J077n64
2204A067j604j104L89J457J106l06j244q93L74J325Q64m82j375p23P08J498P58
2221A815q18j709j038M80J330R51l94j284q34N26J401Q46o17j297n59Q98J546
2238A243N80r42j588q05O88J479Q55o13j422p46O34J360N32r05j453l87J011J410
$$ plain form
2256 931 1262 174 -1288 -1804 -709 879 1598 812 -529 -1069 -168 1136 1389 273 -969 -1155 -70
2273 -70 1192 1309 144 -1254 -1494 -414 1047 1445 437 -965 -1300 -379 737 778 -234 -1312 -1208
2290 -1208 -1 1224 1312 190 -1031 -1130 120 1510 1697 485 -889 -1162 -155 896 827 -273 -1286
2307 -1286 -1071 129 1238 1112 -190 -1474 -1430 -61 1269 1273 -83 -1315 -1203 3 1084 940 -166
2324 -166 -976 -601 721 1636 1225 -228 -1359 -1071 330 1398 1042 -388 -1437 -1143 93 920 533
2341 533 -555 -1227 -710 537 1263 686 -691 -1519 -914 629 1562 1091 -191 -985 -553 630 1323 842
2359 842 -300 -1023 -571 563 1114 334 -1086 -1800 -1037 454 1296 728 -600 -1252 -633 613 1267 739
2377 739 -438 -989 -294 920 1330 432 -965 -1446 -480 1005 1514 622 -736 -1320 -640 561 1007 259
$$ packed form
2256I31L31j088j462n16J095J588P19p86j341n40R01J304K53j116j242j86J085
2273g0J262J17j165j398k40J080J461L98j008j402l35R21J116M1j012j078J04
2290a208J207J225Q8j122j221r9J250J390J87j212j374k73J007J051o9j100j013
2307a286K15J200J109j26j302j284M4J369J330Mj356j232J12J206J081j44j106
2324a66q10L75J322R15m11j453j131K88J401J068l56j430j049K94J236Q27l87
2341E33j088o72N17J247P26n77j377q28O05J543R33m71j282p94M32J183O93m81
2359H42j142p23M52J134N51p80j420p14P63J491Q42n68j328o52O19J246O54n28
2377G39j177n51O95J214M10q98j397m81R66J485N09q92j358n84O80J201M46p48
$$ plain form
2395 259 -887 -1245 -354 874 1119 132 -1103 -1296 -125 1205 1494 494 -802 -1164 -337 831 1116
2412 1116 312 -774 -977 -33 1060 1084 -36 -1176 -1201 -106 1065 1118 19 -1194 -1405 -457 714 982
2430 982 147 -861 -840 233 1248 1162 47 -973 -850 362 1357 1236 53 -1148 -1260 -226 845
2447 845 855 -169 -1157 -1030 70 957 658 -466 -1303 -908 362 1358 1170 -64 -1074 -875 321 1299
2465 1299 1116 -25 -946 -697 411 1103 569 -611 -1377 -847 392 1195 762 -494 -1391 -1013 207 1088
2483 1088 724 -375 -1053 -570 532 1076 563 -522 -1031 -397 827 1472 886 -372 -1114 -653 548 1210
2501 1210 657 -498 -1167 -647 326 742 104 -963 -1388 -648 580 1157 501 -711 -1241 -482 850 1469
2519 1469 866 -249 -743 -115 890 1150 370 -763 -1135 -362 799 1076 153 -1111 -1520 -611 650 1028
$$ packed form
2395B59j146l58Q91J228K45r87j235j93J171J330K89j000j296l62Q27J168K85
2412A116q04j086k03R44J093K4j120j140k5J095J171N3j099j213k11R48J171K68
2430I82q35j008K1J073J015q6j115j020J23J212R95j21j183j201j12J034J071
2447H45J0j024r88J27J100Q87k99j124q37L95J270R96j88j234j010J99J196R78
2465A299j83j141r21K49J108O92n34j180p66N30J239Q03m33j256q97L78J220Q81
2483A088l64j099o78M83J102N44n13j085n09O34J224O45n86j258p42M61J201O62
2501A210n53j155o69N20R73M16o38j067m25P40J228N77o56j212n30P59J332O19
2519A469o03j115m94O28J005K60p80j133l72P73J161K77r23j264m09R09J261L78
$$ plain form
2537 1028 246 -819 -1051 -262 734 925 127 -861 -906 56 1149 1286 264 -897 -1035 -47 1052 1164
2555 1164 270 -737 -896 -149 735 758 -139 -1038 -1012 -56 942 880 -217 -1234 -1205 -142 917 990 86 -818
2575 -818 -773 142 1023 1018 128 -743 -595 449 1260 963 -237 -1221 -1111 -25 863 733 -270 -1131 -1008 -16
2595 -16 864 699 -328 -1035 -661 449 1191 784 -401 -1171 -773 406 1220 990 -68 -883 -558 407 1068
2614 1068 676 -374 -1053 -628 434 955 360 -852 -1383 -849 310 1028 656 -348 -980 -552 468 1076
2632 1076 595 -389 -853 -253 796 1170 509 -595 -1068 -462 602 1127 557 -531 -1167 -708 320 772
2650 772 190 -746 -1028 -312 747 1081 344 -642 -963 -194 887 1271 526 -640 -1047 -399 590 897 187
2669 187 -731 -882 -74 858 987 131 -885 -1082 -257 773 980 107 -913 -1159 -340 675 856 125 -674
$$ packed form
2537A028p82j065k32P89R96J91p98r88m5R62J093J37j022j161j38R88J099J12
2555A164q94j007j59P47Q84K3q97q99K6R56R98o2j097j017K9J063J059P3r04r04
2575h18M5R15Q81nq90q71J48J044Q11k97j200r84J10J086Q88j30j003q61J23R92
2595a6Q80j65j027p07L74J110P42m07j185p70L98J179Q14k30j058q15L25R65O61
2614A068l92j050o79M25J062N21n95j212n31N34J159P18l72j004o32M28J020O08
2632A076m81r84m64O00J049L74o61j104m73O06J064N25n70j088o36M59J028M52
2650G72n82r36k82P16J059L34p37r86l21P69J081L84p45j166m07O48R89L07p10
2669A87r18j51Q08R32J29q56j016j97Q25J030K07q73j020k46Q19J015J81p31p99
$$ plain form
2688 -674 -643 192 1052 998 109 -808 -835 47 996 991 77 -938 -1003 -141 726 719 -90 -867 -824 26 789 622 -289
2711 -289 -1060 -919 134 1053 1034 55 -784 -687 230 1036 960 47 -734 -615 197 825 533 -463 -1197 -925 187
2732 187 1002 742 -264 -1019 -781 236 950 689 -231 -853 -574 367 949 557 -391 -997 -488 592 1231
2751 1231 778 -320 -969 -603 322 857 483 -459 -977 -578 332 776 334 -628 -1054 -464 600 1067 497
2770 497 -515 -1027 -502 459 960 544 -326 -713 -250 648 1000 437 -541 -913 -306 645 938 218 -801
2789 -801 -1198 -602 407 812 329 -541 -858 -227 674 982 271 -620 -834 -94 854 1011 235 -744 -987 -286
2809 -286 663 926 261 -648 -842 -143 682 725 -21 -867 -891 -80 808 836 7 -842 -898 -97 804 934 184
2830 184 -625 -710 29 793 708 -101 -800 -696 152 895 824 -75 -876 -833 -39 778 768 -70 -833 -807 10 679
$$ packed form
2688f74L1Q35Q60n4q89r17k7Q82R49nr14j015o5Q62Q67pq09p77M3Q50P63j67r11
2711b89p71J41J053R19j9r79q39R7R17Q06p6r13p81J19Q12O28k92r96p34K72J112
2732A87Q15k60j006p55K38J017P14k61r20o22K79R41N82l92r48o06N09J080O39
2751A231m53j098o49L66R25N35l74r42n18L99R10M44m42r62m26N90J064M67n70
2770D97j012n12N25R61N01m16q70l87M63Q98L52n63r78l72O07R51K93p20j019
2789h01l97N96J009M05m83q70l17O31R01L08p11q91k14P40R48J57p76r79k43P01
2809b86R49K63o65r09j94O99Q25M3p46q46k4Q11Q88K8q29q49n6Q01R01J30p50
2830A84q09q5P39P64q5q09o99J04Q48P43p1q99q01M3P94Q17j0q38p63K6Q17O69
$$ plain form
2852 679 579 -239 -829 -562 312 1014 838 -81 -823 -652 228 932 771 -144 -857 -684 130 721 470 -397
2872 -397 -874 -562 317 898 573 -393 -994 -681 305 921 626 -258 -824 -467 417 891 522 -325 -760 -331
2892 -331 535 947 462 -503 -1050 -589 353 846 422 -443 -920 -462 365 745 336 -467 -761 -293 558 927
2912 927 372 -494 -882 -325 585 999 448 -417 -777 -316 489 755 222 -585 -839 -252 523 775 156 -734
2932 -734 -965 -335 608 889 254 -586 -791 -184 616 805 248 -493 -648 21 786 875 123 -712 -847 -91
2952 -91 712 845 77 -715 -832 -203 538 618 -39 -740 -732 6 735 693 -70 -777 -708 119 857 833 108 -617
2974 -617 -646 35 710 653 -32 -680 -640 123 743 595 -213 -864 -697 114 779 668 -158 -776 -696 56 721
2995 721 610 -113 -688 -518 282 880 600 -215 -777 -506 316 907 619 -219 -827 -644 137 692 450 -326
$$ packed form
2852F79j00q18n90K67Q74P02j76r19p42J71Q80P04j61r15p13J73Q14N91k51q67
2872c97m77L12Q79N81l25r66o01L13R86O16k95q84n66L57Q84M74l69q47m35M29
2892c31Q66M12m85r65n47M61R42M93m24q65m77M58Q27L80m09q03k94M68Q51L69
2912I27n55q66l88N57R10M14n51q65l60M61Q05K66n33q07k54N87P75K52o19q90
2932g34k31O30R43K81o35q40k05O07Q00J89n57p41j55O69P65Q9p52q35j35P56
2952i1Q03J33p68p92j17O29P41Q0o57p01QP38P29m2p63p07O9Q27P38k4p25p25
2974f17k9O81O75n7o85o48M0P63O20j48q08o51J67Q11O65j11q26o18Q0P52O65
2995G21j11p23n75J70Q00N98k80q15n62K71Q22N91k88q38o08J83P81N55k42p76
$$ plain form
3015 -326 -820 -507 320 766 428 -389 -833 -438 422 914 537 -260 -778 -458 360 802 468 -307 -676 -314
3035 -314 457 777 285 -527 -836 -371 432 802 339 -468 -844 -433 384 782 350 -420 -684 -201 521 744
3055 744 224 -540 -755 -202 619 822 288 -532 -776 -288 505 745 225 -525 -723 -197 494 636 75 -643
3075 -643 -733 -123 664 830 225 -581 -728 -93 666 774 164 -543 -632 -27 606 595 -35 -663 -681 -2 689
3096 689 699 -10 -736 -749 -73 582 628 -43 -653 -601 57 628 586 -38 -630 -509 209 826 713 -33 -704 -632
3118 -632 83 674 550 -112 -672 -541 82 594 444 -223 -730 -552 195 737 536 -224 -745 -550 208 737
3138 737 597 -111 -614 -410 286 701 454 -273 -745 -462 304 728 406 -388 -828 -493 284 729 443 -280
3158 -280 -676 -377 297 704 341 -398 -722 -305 439 796 377 -421 -741 -316 447 784 387 -315 -656 -299
$$ packed form
3015c26m94L13Q27M46l38q17m44L95Q60M92l77p97n18L20Q18M42l34p75l69L62
3035c14P71L20m92q12l09M65Q03L70m63q07l76M11Q17L98m32p70k64M83P22K23
3055G44n20p64k15N53Q21K03n34q20k44M88P93K40n20p50j98N26O91J42n61p18
3075f43r0O10P87J66o05q06j47O35P59J08o10p07q9O05O33j1o30o28j8O79O91
3096F89J0p09p26j3O76O55M6o71o10N2O58N71m2o24n92J21P18O17j13p46o71P2
3118f32P15N91j24o62n60J31O23N12j50o67n07J78P47N42k01p60n21J95P58N29
3138G37j40p08n03K04O96M15k47p27m72K83P66M24l22p94m40L35P77M45k86p23
3158b80l96K99O74M07l63p39l24M17P44L57m19p98l20M25P63L37l97p02l41L57
$$ plain form
3178 -299 393 650 221 -504 -730 -273 458 655 165 -524 -785 -286 433 715 271 -415 -650 -204 501 687
3198 687 220 -449 -556 -35 640 761 159 -552 -728 -174 504 644 84 -568 -718 -217 464 612 59 -559
3218 -559 -584 31 678 683 41 -590 -647 -6 605 664 80 -582 -621 -54 562 567 0 -556 -514 97 652 560 -106
3241 -106 -671 -596 70 665 590 -56 -640 -570 69 587 516 -113 -626 -438 173 669 522 -165 -650 -481 211
3262 211 742 565 -126 -638 -513 138 605 382 -280 -646 -446 212 632 408 -284 -719 -433 282 780 495
3282 495 -204 -629 -398 280 672 393 -258 -607 -317 330 655 314 -376 -699 -352 336 709 345 -372 -673
3302 -673 -343 302 637 288 -339 -593 -205 401 672 219 -437 -700 -246 452 691 247 -460 -655 -236 387
3322 387 615 199 -387 -592 -177 455 586 105 -509 -642 -156 515 671 147 -470 -612 -138 475 607 157
$$ packed form
3178b99O92K57m29p25k26M57P31J97m90o89k61M99P19K82m44o86k35M46P05J86
3198F87m67o69j07N21O75J21o02p11j76N54O78J40n60o52j50N01O81J48n53o18
3218e59k5O15O47No42o31n7O41O11N9n84o62l9N67O16Nn67n56M2O11N55r2o66
3241a06n65P5O66N95p5o46n84P0O39N18p1o29n13J88O11M96j47o87m85J69O92
3262B11N31j77o91n12J25O51M67k23o62l66K00O58M20k24o92m35K86P15M98k85
3282D95o99m25K31O78L92k79o51l49K90O47L25l41o90l23L47O88L73l64p17l01
3302f73L30O45L35l49o27k54L88O06K71m53o56k63M54O98K39m44p07j95M19O23
3322C87K28m16n86k05M15O32J31m81o14j33M86O71J56n24o17j42M74O13J32m50
$$ plain form
3342 157 -421 -548 -41 492 584 60 -549 -593 -36 584 605 68 -551 -628 -100 482 542 32 -526 -560 -28 540
3364 540 530 -21 -566 -485 121 652 618 11 -549 -516 50 588 523 -29 -538 -494 96 548 434 -158 -643 -491
3386 -491 137 628 479 -135 -607 -501 108 597 483 -118 -550 -381 216 607 377 -195 -600 -366 233 614
3406 614 440 -206 -653 -419 184 601 433 -211 -593 -381 217 565 325 -311 -599 -321 296 622 345 -273
3426 -273 -617 -330 310 654 365 -224 -565 -241 327 596 273 -363 -593 -235 380 565 213 -402 -661 -288
3446 -288 323 591 236 -361 -577 -183 370 551 184 -387 -530 -103 479 607 174 -410 -577 -166 430 585
3466 585 167 -388 -545 -141 419 513 52 -461 -524 -86 459 532 62 -500 -586 -111 453 535 92 -445 -510 -26
3488 -26 476 508 23 -478 -477 51 534 523 -32 -532 -522 -2 517 517 -7 -512 -496 24 493 427 -71 -513 -442 102
$$ packed form
3342A57n78j27N07N33R2n24o09m4N57O20K1n37o19p7N28N82O0n10n58l4N32N68
3364E40j0n51n45Q1O06N31l4o07n60L3N66N38o5n52n09M4N90M52j14n92m85J52
3386d91O28M91j49o14m72J06O09M89j14o01m32J69N97L91k30n72m05K34N99L81
3406F14j74o46m47K34O03M17j68o44l82K12N98L48k40o36k88K78O17L26k77o18
3426b73l44K87O40L44k89n89l41L24N68K69l23o36k30L58O15J85l52o15k59L73
3446b88O11K68l55n97k16L94N53J81l67n71j43M27N82J28m33n84j67M11N96J55
3466E85m18n55j57M04N60R4m61n13o3M38N45P3m70n62q6M75N64Q2m43n37o5M84
3488b6N02L2m85n01JN28M83j1n55n00J0N20N19%n24n05J6N20M69o6m98m42P1N44
$$ plain form
3512 102 578 478 -99 -557 -458 85 542 464 -72 -541 -418 80 511 388 -159 -519 -381 171 555 406 -162
3533 -162 -569 -419 174 575 399 -166 -551 -354 163 541 344 -172 -526 -313 259 556 312 -254 -618 -382
3553 -382 246 553 362 -225 -544 -293 208 545 299 -242 -524 -238 321 556 240 -324 -568 -288 332 572
3573 572 284 -282 -529 -255 273 542 184 -329 -558 -205 349 506 163 -400 -566 -189 389 574 224 -320
3593 -320 -495 -131 372 526 176 -379 -486 -92 381 497 82 -431 -541 -98 385 481 105 -441 -570 -153
3613 -153 351 451 48 -421 -468 9 487 517 71 -387 -450 8 504 513 34 -458 -485 -51 436 455 11 -437
3635 -437 -465 40 459 408 -85 -509 -485 43 464 402 -86 -496 -439 46 461 412 -30 -410 -331 171 512 409
3657 409 -107 -487 -377 129 529 396 -150 -526 -396 105 471 325 -152 -487 -327 125 456 277 -205 -483
$$ packed form
3512A02M76j00n77m58R9N43M57p8n36m69J23M98M31j23n47l60J38N52L84j49n68
3533a62m07J50N93M01j76n65l85J97N17L78j97n16l54K13N72K97k44n66l64K36
3553c82O28L07j91n87l19K51N01L37k46n41k82K86N59K35l16n64k44K80O20K40
3573E72k88n66k47K74N28K69l58n13k29L53N54J57l43n63j66L77N78J85l50n44
3593c20j75L64N03J54l50n55j07L94M73J16m15n13j10M43M83R6l76n46j29M17
3613a53N04J00m03m69m7M77M78L0m46m58o3M58M96Rm79m92k7M34M87J9m44m48
3635d37k8N05M19n1m93m24K4N28M21o2m88m10N7M85M15m9m42l80P9N02L41j03
3657D09n16l80J10N06M00j33n46l76J30N01L66j46m77l35J60M52L31j79m82k78
$$ plain form
3677 -483 -330 214 558 396 -152 -438 -250 230 536 318 -157 -464 -279 183 428 220 -296 -557 -279 249
3697 249 509 273 -253 -515 -258 249 476 232 -274 -460 -190 274 501 213 -275 -454 -138 361 559 221
3717 221 -321 -482 -203 259 479 140 -322 -487 -160 332 468 110 -357 -506 -90 368 503 123 -383 -506
3737 -506 -150 345 451 123 -328 -420 -77 409 488 84 -410 -458 -43 393 437 20 -451 -495 -88 371 438 49
3759 49 -338 -381 -2 436 442 29 -394 -393 39 435 440 -29 -443 -411 8 417 405 -35 -458 -401 21 362 325 -106
3783 -106 -477 -383 69 449 375 -58 -395 -318 162 496 416 -30 -396 -341 128 443 276 -163 -487 -322 132 464
3805 464 295 -187 -482 -352 127 436 290 -162 -475 -314 137 470 260 -176 -391 -190 276 543 314 -161
3825 -161 -433 -252 227 482 263 -246 -449 -258 207 412 182 -274 -460 -211 240 448 189 -305 -477 -201
$$ packed form
3677d83J53N44L44j62n48k86J88M80L06k18m75l07J85M62K45k08n16k61K78N28
3697B49K60k36n26k62K57N07K27k44n06j86K70M64K27k88m88j79L16M99J98l38
3717B21n42j61K79M62K20l39m62j65L27M92J36l58m67j49M16M58J35l80n06j23
3737e06L56M95J06l28m51r2L43M86P9m04m94m8M15M36M4m17m71m4M07M59O7l89
3759D9l87m3L79M38Om13m23JM32L96Nm69m14L2M19M09j2m40m23N7M22L41l7m31
3783a06l71R4M52L80p4m33l37P7M80L34q0m46l66N5M69L15j67m39l24J65M54L32
3805D64j69m82k95J30M79L09j46m52l13J61M51L33k10m36k15K01M66K67k29m75
3825a61k72J81M79K55k19n09k03J91M65K05k30m56j86K49M51K08k59m94j72K76
$$ plain form
3845 -201 279 493 229 -223 -392 -124 338 505 212 -235 -374 -98 296 420 117 -355 -514 -178 257 385
3865 385 110 -330 -453 -135 286 408 111 -326 -419 -43 352 440 98 -342 -409 4 410 468 125 -301 -380 -37
3887 -37 357 402 12 -365 -412 -45 322 321 -64 -447 -438 -33 379 375 23 -371 -374 18 398 370 29 -336 -330 60 437
3912 437 390 -39 -361 -320 73 408 315 -68 -443 -373 51 341 287 -89 -409 -312 110 438 326 -98 -406 -267
3934 -267 155 460 334 -99 -422 -314 116 417 273 -113 -379 -258 128 413 248 -189 -431 -305 169 388
3954 388 211 -212 -431 -252 176 402 246 -154 -352 -174 240 479 230 -188 -402 -198 233 402 182 -236
3974 -236 -426 -218 195 398 171 -235 -419 -161 246 409 133 -248 -387 -127 286 413 190 -230 -416 -108
3994 -108 275 386 125 -269 -416 -104 246 347 43 -349 -396 -70 305 400 96 -272 -384 -46 344 400 103
$$ packed form
3845b01M80K14k64m52j69K68M62J67k93m47j39K76L94J24l03m72j59L36M35J28
3865C85k75m40j23L18M21J22k97m37r3L76L95Q8l42m40o7M13M06N8l43m26p9L43
3887c7L94M5l90l77m7L67L67jl85l83RM05M12ml52l94lL92L80k8l41l65OL90L77
3912D37m7m29l22M1L93L35r3l83l75P0M24K90n4l76l20R7M22L28j12m24l08J39
3934b67M22L05j26m33l23J08M30L01j44l86k66J21L86K85j65m37k42J26M74K19
3954C88j77m23k19J79M28K26j56m00j98J78M14K39k49m18k14K04M31J69k20m18
3974b36j90K08M13K03k27m06j84K58M07J63k76l81j39K60M13J27k23m20j86L08
3994a08L83J11k61l94j47L12L50J01l04l92m7L26L75R5l04l68j12L38L90N6k97
$$ plain form
4015 103 -264 -337 -18 323 370 36 -326 -322 12 359 368 20 -331 -401 -68 304 294 -15 -388 -386 -20 282 289 -7
4039 -7 -351 -299 79 403 386 29 -308 -267 65 392 344 -17 -339 -289 84 331 257 -114 -379 -315 65 368 262
4062 262 -122 -422 -321 73 368 281 -92 -324 -201 154 401 282 -96 -366 -212 164 407 239 -187 -426
4082 -426 -281 132 341 202 -139 -371 -241 100 336 163 -220 -405 -215 181 378 215 -186 -375 -145 235
4102 235 462 249 -147 -331 -125 232 368 158 -223 -404 -192 176 312 75 -253 -437 -189 185 364 130
4122 130 -238 -363 -119 234 348 138 -233 -303 -53 308 385 140 -235 -365 -80 283 348 83 -257 -374 -116
4143 -116 221 306 26 -291 -355 -52 284 323 47 -290 -369 -15 303 327 46 -276 -305 -2 303 340 31 -275
4165 -275 -292 14 323 303 -21 -336 -351 -5 279 267 -48 -345 -325 6 304 305 -3 -296 -210 116 386 310 -23
$$ packed form
4015A03l67p3L19L41M7l34l62ML34L47Rl48l51p0L33L72j0l09l73KL66L02Pk96
4039gl44N2L78L24j7l57l37M1L32L27m8l61l22N0L73K47p4l71k65O4L80L03j06
4062B62l84l00J01L94K95q7l73k32J23L55K47j19l78k70J54L76K43j68m26k39
4082d26J45M13K09j39l41k32J30L41K36j73l83j85J90L96J97j63m01j89K30L80
4102B35K27k13l96j84K06L57J36k10l81j81K12L68J36k37l28j84K48L74J79k34
4122A30l68j25K44L53J14k10l71p0K50L61P7k45l75j30K85L63O5k65l40j17K58
4143a16L37Q5k80l17o4L03L36L9k76l37p9L54L18K4k81l22k9L03L05L7l09l06
4165b75j7L06L09k0l24l15j5L46K84j2l15k97K0L31K98Jl08k93Q6L26K70p6l33
$$ plain form
4188 -23 -307 -244 80 332 283 -58 -342 -291 69 277 218 -113 -346 -262 66 317 209 -107 -336 -215 122 381
4210 381 273 -75 -292 -218 116 353 237 -110 -315 -218 144 349 160 -178 -341 -196 158 348 199 -148 -358
4231 -358 -219 140 349 161 -153 -325 -184 173 340 160 -189 -342 -139 232 357 163 -166 -348 -147 167
4251 167 300 111 -231 -358 -159 170 276 88 -242 -340 -109 240 363 120 -189 -294 -66 249 342 118 -214
4272 -214 -285 -71 231 319 61 -253 -335 -66 273 291 19 -284 -325 -67 254 277 66 -250 -312 -27 251 299 -8
4295 -8 -284 -288 5 322 313 11 -268 -274 -19 284 290 11 -251 -252 37 287 271 -38 -295 -281 31 285 263 -63 -329
4320 -329 -247 23 300 262 -31 -268 -214 78 291 244 -86 -331 -251 58 300 215 -82 -342 -260 58 304 217 -83
4343 -83 -273 -196 74 312 197 -112 -331 -187 144 345 232 -116 -310 -182 121 303 206 -132 -295 -150 128
$$ packed form
4188b3k84O3L24K52m9l41k84N1L60K08n9l31k33Q4L28K51j08l16k29J21L37K59
4210C81j08l48k17P4L34K37j16l47k05R7L62K05j89l38j63J45L54J90j49l47k10
4231c58J39L59K09j88l14j72J41L57J67j80l49j53K03L71J25j94l29j82K01L14
4251A67J33j89l42j27J99L29J06j88l30r8K31L49J23k43l09j05K28L15R3k24l32
4272b14p1K14L02Q8k58l14q2K69L39J8k72l03m1K58L21K3k11l16o2K85K78M8l07
4295hk76mK93L17rl02k79oK55L03Ok79k62jK89K50j6l09k57J4L12K54k2l26k66
4320c29Q2K70K77l8k93k37N4K92K13m7l30k45Q0L09K42q5k97k60Q2L18K46q7l00
4343h3j90P7K70K38j15l09k19J44L31K01j13l48j94J28L03J82r7l38j63J45K78
$$ plain form
4364 128 284 147 -169 -284 -166 182 305 166 -158 -310 -150 154 304 145 -194 -325 -157 150 295 108
4384 108 -156 -287 -81 205 319 112 -183 -305 -106 195 292 93 -201 -277 -95 214 286 75 -211 -289 -50
4405 -50 248 322 76 -254 -322 -69 181 272 55 -211 -280 -46 239 268 55 -229 -251 -13 235 280 14 -293 -270
4428 -270 -38 258 315 50 -219 -224 25 250 247 1 -251 -263 17 224 213 -31 -260 -237 21 284 257 -9 -234
4451 -234 -210 45 255 196 -60 -289 -251 39 246 215 -69 -287 -200 74 294 253 -72 -256 -197 49 242 183 -111
4474 -111 -266 -182 89 318 217 -101 -259 -189 123 317 178 -111 -294 -202 88 267 146 -114 -270 -123 120
4495 120 289 168 -123 -296 -149 120 265 155 -141 -287 -115 136 293 160 -115 -245 -78 165 291 106
4515 106 -191 -297 -164 136 267 71 -198 -279 -101 170 297 125 -127 -240 -71 229 303 88 -201 -273 -65
$$ packed form
4364A28J56j37l16j15J18L48J23j39l24j52J60L04J50j59l39j31J68L07J45j87
4384A08k64j31K06K86J14k07k95j22J99L01R7j99k94p6J82L09P2k11k86p8K39
4405e0K98P4k46l30o8K53K50R1k17k66o9K34K85K9k13k84k2K38K48M5k66l07K3
4428b70K32K96N7k65k69nK49K25lk46k52j2K80K07j1k44k29K3K58K63k7k66k25
4451b34K4K55K10n9k56k29L8K90K07l1k84k18Q7K74K20m1l25j84N9K46J93n9k94
4474a11j55Q4K71K29j01l18j58P0L12J94j39k89j83R2K90J79j21k60j56J47K43
4495A20J69j21k91j73J47K69J45j10k96j46J72K51J57j33k75j30J67K43J26j85
4515A06k97j06J33L00J31j96k69q1J78K71J27j72k52j13J69L00P4k15k89p2K08
$$ plain form
4536 -65 200 264 63 -196 -295 -69 202 249 53 -204 -279 -76 182 225 20 -231 -264 -57 222 285 14 -187 -248
4559 -248 -15 244 272 20 -200 -222 4 247 242 -6 -211 -210 -12 250 237 -23 -256 -274 -17 186 157 -61 -253
4582 -253 -266 -2 241 222 -22 -206 -182 75 296 249 -21 -270 -210 35 223 185 -96 -272 -181 39 215 158 -66
4605 -66 -225 -184 80 259 174 -111 -260 -197 82 255 186 -59 -223 -145 107 282 148 -98 -271 -163 125 256
4627 256 127 -137 -290 -154 87 249 133 -119 -259 -158 114 227 100 -135 -247 -99 189 295 135 -92
4647 -92 -230 -73 169 280 113 -145 -254 -74 116 225 70 -197 -272 -94 163 247 94 -182 -253 -77 188
4668 188 242 118 -133 -228 -33 191 221 74 -175 -247 -53 189 258 46 -183 -254 -79 179 229 27 -220 -232 -39
4691 -39 174 202 31 -213 -207 -6 224 245 24 -188 -202 27 220 226 37 -207 -199 12 203 184 -18 -246 -226 -4
$$ packed form
4536f5K65O4k01k59r9K26K71M7j96k57p5K03K58M3k05k51l3K07K79O3k71k01o1
4559b48K33K59K8k52k20k2K26K43nk48k05JJ98K62j3k60k33j8K57K03k9k18j92
4582b53j3K64K43j9k44j84K4K57K21m7k70k49O0K45J88l8k81j76R1K20J76n7k24
4605f6j59M1K64J79q5k85j49O3K79J73o9k45j64P8K52J75j34k46j73J08K88J31
4627B56j29k64j53J36K41J62j16k52j40J01K72J13j27k35j12J48K88J06j60k27
4647i2j38J57K42J11j67k58j09J80J90J09j55k67p5J78K57Q4j53k76p1J76K65
4668A88N4j24k51r5J95K24L0j47k49p2J94K42O9k12k29p1J75K58N0k02k47j2J93
4691c9K13K8j71k44OK01K30K1k21k12j4K29J93Oj89k44QK11J91j9k02k28K0K22
$$ plain form
4715 -4 202 166 -56 -245 -228 -2 210 188 -21 -214 -159 67 264 222 -30 -179 -147 114 228 170 -51 -257 -187
4738 -187 35 234 156 -104 -250 -196 42 191 125 -79 -237 -143 115 263 168 -87 -195 -118 111 249 144 -91
4760 -91 -252 -151 100 216 121 -112 -264 -108 106 220 124 -132 -261 -127 112 197 122 -118 -244 -91 138 264
4782 264 120 -95 -203 -79 174 244 92 -134 -224 -77 159 242 54 -178 -228 -125 133 183 43 -187 -254 -92
4804 -92 158 221 65 -146 -225 -14 212 284 98 -135 -187 -11 164 218 33 -183 -181 -38 146 193 14 -191 -232
4827 -232 -25 186 205 17 -207 -229 -14 195 178 24 -185 -177 3 221 226 1 -194 -191 11 231 197 -16 -224
4850 -224 -189 -11 186 183 -27 -224 -182 15 218 166 -34 -199 -179 54 226 198 -15 -198 -150 81 240 188 -31
4873 -31 -194 -149 48 195 141 -102 -268 -176 30 186 105 -88 -227 -125 86 215 164 -75 -173 -106 99 234 138
$$ packed form
4715dK06l6k22j89J7K26K12k2k09j93N5K26J97m2k52j49L2K61J14n8k21k06P0
4738a87K22J99p8k60j46N4K38J49o6k04j58R4K58J48r5k55j08P7K29J38j05k35
4760i1j61J01K51J16r5k33j52J56K14J14r6k56j29J34K39Q5p5k40j26J53K29J26
4782B64j44k15j08J24K53P0j52k26r0J47K36Q3j88k32n0J03K58N0j40k30o7J62
4804i2K50O3j56k11p9K11K26P2j86k33n2J76J75N4j85k16KJ43J84M7j79k05m1
4827b32K07K11J9j88k24k2K15K09j7j54k09QJ80K18Nk25j95LK02K20l4k13k08
4850b24L5J78J97lk10j97M2J97K03n2k00j65K0K33J72k8k13j83M8K31J59n2k19
4873c1j63M5J97J47n4k43j66R2K06J56q1j93j39J02K11J29n1k39r8O7K05J35r6
$$ plain form
4896 138 -85 -200 -120 100 241 131 -112 -201 -120 77 208 63 -125 -232 -127 77 187 101 -133 -240 -86
4917 -86 148 241 100 -129 -185 -87 136 227 96 -130 -194 -34 145 214 75 -173 -221 -66 100 184 46 -174 -236
4940 -236 -90 131 177 42 -152 -198 -36 188 228 66 -114 -141 -5 180 240 70 -162 -213 -50 155 185 35
4962 35 -197 -190 -23 162 184 -21 -215 -198 -22 163 156 -20 -169 -194 14 185 216 31 -144 -138 18 193 181 -8
4986 -8 -197 -156 26 190 164 -25 -198 -181 31 194 165 -25 -225 -179 21 176 136 -49 -207 -152 50 226 156
5009 156 -34 -163 -122 85 220 161 -67 -200 -158 53 164 86 -93 -221 -136 71 196 129 -66 -187 -100 110
5031 110 212 130 -72 -182 -94 83 180 114 -78 -178 -109 98 179 69 -112 -223 -112 64 182 72 -129 -209
5053 -209 -108 122 184 89 -129 -187 -93 137 186 50 -126 -197 -44 142 203 83 -117 -167 -38 161 204 65 -148
$$ packed form
4896A38k23j15Q0K20J41j10k43q9Q1J97J31j45j88j07J05K04J10q6k34j07J54
4917h6K34R3j41k29n6R8K23R1j31k26o4J60J79O9j39k48m8J55J66Q4j38k20o2
4940b36J46K21M6j35j94m6J62K24M0j62j80k7J36J85O0j70k32n1J63K05L0j50
4962C5k32PJ67J85K2k05j94J7J76J85pj76j49k5K08J71L1j85j75OJ56J75j2j89
4986hj89M1J82J64k6j89j73J7K12J63k9j90k00M6K00J55m0j85j58N5K02J76p0
5009A56j90j29M1K07J35n9k28j33M2K11J11p8j79j28Q5K07J25o7j95j21Q7K10
5031A10J02q2k02j10Q8J77R7o6j92j00O9K07Q1j10j81j11J11J76J18j10k01q0
5053b09J01K30O2r5k18n8R4K30M9j36j76p1J53J86O1j20k00n0J29J99M3j39k13
$$ plain form
5076 -148 -204 -61 114 159 32 -148 -203 -46 156 208 47 -112 -172 -19 159 206 37 -139 -175 -46 147 165 5
5099 5 -155 -148 -16 146 152 -14 -178 -184 -1 118 133 -34 -163 -181 52 169 163 12 -151 -151 18 204 182 -21 -173
5124 -173 -127 33 180 136 -45 -185 -161 24 164 115 -78 -213 -171 37 146 107 -72 -203 -165 44 170 134 -29
5147 -29 -147 -92 55 184 115 -50 -179 -128 81 167 112 -75 -193 -120 44 212 132 -91 -184 -77 76 189 84
5170 84 -122 -165 -105 86 166 73 -91 -171 -98 99 160 94 -84 -155 -94 86 151 46 -124 -215 -88 78 168 71 -133
5195 -133 -194 -71 111 190 78 -94 -178 -34 134 170 75 -114 -145 -15 130 200 81 -120 -189 -52 144 155 13
5218 13 -122 -183 -32 112 142 10 -143 -163 -22 134 163 -10 -119 -158 -27 168 144 37 -133 -154 26 156 177
5241 177 51 -135 -148 3 177 117 20 -167 -151 15 144 160 -21 -154 -125 4 131 127 -13 -134 -141 30 149
$$ packed form
5076a48n6J43J75M5j27j80n5J57K02N2j61j59o0J53J78M7j69j76l6J29J93J8j60
5099Ej60PJ32J62Oj66j64oJ83J19J5j67j29j8K33J17oj51j63%J69J86k2k03j52
5124a73M6J60J47m4j81j40K4J85J40m9j93j35M2K08J09l9j79j31L8K09J26l6j63
5147b9j18N5J47J29o9j65j29N1K09Q6n5j87j18P3J64J68q0k23r3J07J53J13j05
5170H4k06m3O0J91Q0r3j64q0P3J97O1o6j78p1O1J80O5j05j70r1J27J66R0r7k04
5195a33o1J23J82P9j12j72q4J44J68L6r5j89l1J30J45P0j19k01o9J37J96J1j42
5218A3j35o1J51J44L0j32j53k0J41J56K9j73j09l9J31J95k4j07j70k1J80J30K1
5241A77j26j86j3J51J74o0r7j87J6J66J29J6j81j33K9J29J27mj40j21pJ71J19
$$ plain form
5264 149 120 -51 -169 -148 43 146 138 -53 -167 -135 11 156 127 -42 -140 -116 56 175 137 -52 -164 -117 59
5287 59 184 102 -47 -149 -86 68 190 75 -52 -180 -102 61 160 80 -95 -189 -75 86 148 60 -80 -181 -95
5310 -95 92 168 72 -77 -147 -92 82 152 83 -72 -159 -52 81 177 72 -121 -151 -68 82 166 58 -90 -117 -48 102
5335 102 166 52 -101 -150 -47 117 171 47 -90 -152 -74 126 161 19 -111 -169 -55 106 146 7 -139 -139 -44 135
5359 135 140 19 -117 -151 -54 127 156 24 -111 -120 11 140 157 8 -113 -131 -10 132 150 2 -121 -160 -21 152
5383 152 106 -10 -140 -148 27 110 130 -39 -149 -142 10 123 111 -13 -154 -131 42 133 137 -10 -133 -102 47 168
5407 168 110 -5 -147 -92 65 159 85 -34 -153 -121 64 163 87 -59 -125 -120 71 135 94 -76 -150 -100 35 165 66
5432 66 -96 -148 -78 65 174 76 -55 -139 -74 98 135 57 -89 -163 -73 53 165 73 -80 -151 -50 98 142 67 -109
$$ packed form
5264A49k9j71j18K1J91J03qj91j14L2J46J45k9j69r8K4J72J19l8j89j12M7J76
5287E9J25q2j49j02O3J54J22j15j27j28P8J63R9q0j75r4J14J61O2q8j40j01Q6
5310i5J87P6r6j49p0N5J74P0o9j55q7J07J33R6j05j93l0Q3J50Q4j08j48k7O9J50
5335A02O4j14j53m9J03J64N4j24j37o2P8K00L5j42j30n8J14J61M0j39j46%R5J79
5359A35Nj21j36l4R7J81K9j32j35rJ31J29J7j49j21j8J21J42J8j48j23l9J39J73
5383A52m6j16j30qJ75Q3K0j69j10PJ52J13j2j24j41K3J73R1Mj47j23L1J49J21
5407A68n8j15j42N5J57R4p4j19j19L2J85R9p6j46o6NJ91O4m1j70p4N0J35J30r9
5432F6j62n2P0J43J09r8j31q4O5J72L7p8j46p4R0J26J12r2j53p1J01J48M4p5j76
$$ plain form
5457 -109 -161 -56 103 165 95 -68 -112 -13 101 157 58 -111 -127 -41 65 125 41 -85 -145 -69 90 116 41 -118 -162
5482 -162 -61 110 142 45 -122 -144 -23 117 118 33 -65 -105 0 145 118 21 -80 -113 -1 117 126 -3 -139 -129 -27
5507 -27 109 96 -9 -127 -129 -5 107 111 -6 -124 -126 6 114 121 -22 -139 -96 3 132 110 -30 -138 -122 38 129
5532 129 96 -35 -152 -88 26 144 120 -51 -133 -110 32 138 67 -16 -125 -88 57 131 80 -20 -136 -88 55 123
5556 123 88 -47 -151 -90 40 137 72 -80 -144 -113 40 108 84 -55 -129 -64 101 140 87 -86 -145 -69 89 140 81
5581 81 -71 -147 -64 62 132 49 -81 -128 -71 79 124 24 -78 -136 -64 80 137 41 -89 -113 -44 59 125 43 -90
5606 -90 -133 -18 71 116 34 -88 -132 -40 103 137 11 -113 -141 -46 77 86 -10 -100 -101 -17 113 142 18 -96 -108 -2
5632 -2 101 129 1 -87 -110 -23 116 95 20 -94 -115 -10 87 85 -31 -147 -117 -34 92 64 -8 -122 -135 19 120 123
$$ packed form
5457a09n2J05J59O2p0j63m4R9J14N6r9j69j6Q6J06O0q4j26o0P6J59K6p5j59m4
5482a62J01J71L2r7j67k2J21J40Jq5r8m0J05J45k7r7j01l3J12J18Rj29j36J0J02
5507b7J36j3j05j18kJ24J12Mj17j18kJ32J08Pj43j17M3R9J29k2j40j08J6J60R1
5532A29l3j31j17O4J14J18k4j71q2K3J42J06p1q3j09L7J45P4n1j00j16M8J43O8
5556A23l5j35j04O1J30R7o5j52o4L1J53O8k4j39p4O5J65L9n3j73n9P6J58N1n9
5581H1j52p6Q3J26P0q3j30m7N7J50M5j00j02n8P2J44N7r6j30k4O9J03O6q2j33
5606i0m3J15Q9M5q2j22m4R2J43L4j26j24k8R5J23Rr6r0jQ4J30K9j24j14j2J06
5632bJ03K8j28q8k3Q7J39k1p5j14k1J05R7kj16j16L0Q3J26k8p2j14j3J54J01L
$$ plain form
5658 123 6 -100 -68 55 143 99 -22 -104 -58 32 113 85 -9 -117 -118 18 117 73 -16 -101 -80 16 106 81 -33 -128 -57
5685 -57 51 129 83 -35 -138 -45 61 132 82 -65 -122 -59 49 99 50 -71 -115 -62 46 108 61 -66 -118 -38 38 105
5711 105 58 -64 -104 -35 76 144 65 -54 -120 -53 85 133 27 -64 -129 -46 83 94 33 -106 -130 -32 76 90 1 -98
5737 -98 -123 -42 121 97 45 -60 -109 -26 101 119 4 -93 -99 9 101 106 35 -92 -109 -37 66 79 19 -100 -116 -31 98
5764 98 129 2 -79 -89 -4 75 83 -9 -90 -112 9 90 79 14 -113 -109 -20 79 70 2 -84 -86 1 96 93 -21 -122 -93 13 84
5794 84 106 -25 -104 -61 17 134 85 -16 -94 -75 17 103 73 -27 -106 -78 18 108 36 -53 -136 -103 6 100 66 -40 -110
5821 -110 -56 22 93 71 -35 -104 -56 77 97 69 -37 -114 -51 65 119 76 -42 -94 -70 37 97 50 -67 -112 -50 38
5847 38 112 47 -42 -119 -54 44 127 44 -88 -96 -68 55 107 44 -43 -110 -45 46 66 30 -84 -94 -36 62 110 8 -108 -99 -50
$$ packed form
5658A23j17j06L2J23Q8m4j21q2M6R0Q1k8r4j08jJ36R9m4q9q5K1R6R0k5j14r5P1
5685e7J08P8m6j18j03R3J06P1n0j47n7O3J08N0m9j21m4N3J08O2m7j27n2Q0P6O7
5711A05m7j22m0O9J11O8p9j19o6O7J38M8j06r1o5Q3J29J1o1j39k4R8J08J4q9r9
5737i8k5Q1J63k4n2j05m9Q3J27J8j15r7oJ08R2Np1j27j7P2J03J3o0j19j6Q5J29
5764I8L1j27q1j0Q5P9Qr2q1k2J21Q1j1o5j27MQ9R9ro8q6kQ7R5lj14j01K9J06P1
5794H4K2j31p9M3P8J17m9j01p8J9R2Q6l0j00p9K8R6R0p2q9q3L3J09R4l4j06p0
5821a10N4P8P1k2j06o9M8J33K0k8j06p7O3J16N4m3j18n2K4J07O0m7j17m5O2Q8
5847C8P4o5q9p7O5R8Q3q3j32qK8J23N2o3q7o7O5R1K0l6j14j0N8R8M8j02j16RM9
$$ plain form
5876 -50 57 102 35 -105 -104 -16 97 121 34 -53 -108 1 91 125 28 -63 -115 -19 77 73 16 -105 -84 -11 57 70 -33 -114
5904 -114 -107 -26 91 80 7 -67 -69 14 102 87 2 -69 -65 11 112 106 -2 -79 -78 45 106 94 5 -88 -103 -11 109 71 -40
5933 -40 -83 -90 13 74 78 -29 -101 -85 34 97 80 -25 -94 -62 56 106 52 -41 -102 -61 36 100 58 -54 -111 -53 40 89
5961 89 34 -44 -100 -48 30 102 42 -54 -102 -48 43 101 46 -40 -109 -38 62 117 42 -47 -104 -48 51 92 31 -89 -95 -54 54
5990 54 70 11 -58 -95 -29 59 99 36 -73 -102 -34 53 81 74 -76 -71 2 98 97 7 -61 -108 -14 76 83 13 -66 -103 -32 54 87
6021 87 0 -80 -85 4 66 76 -6 -115 -93 4 57 57 4 -95 -83 -2 73 100 -31 -74 -65 6 67 74 -40 -106 -67 40 79 73 -14
6052 -14 -86 -77 -11 105 64 7 -64 -77 15 71 57 -34 -76 -79 0 76 62 -41 -85 -65 39 74 38 -66 -117 -82 27 100 56
6081 56 -50 -94 -69 34 111 65 -32 -93 -41 27 90 50 -56 -78 -19 25 83 36 -53 -97 -37 35 93 55 -52 -100 -67 13
$$ packed form
5876e0J07M5o7j40JQ8J13K4q7q7n5J09R0L4r7r1n2R6R6mn7j21K1P3O8J3j03q1
5904a14PQ1J17j1p3p4kQ3Q8j5q5p1MP6J01oj08p7JJ23O1j2q9r3j5R2J20l8j11
5933d0m3pJ03O1Mj07p2J6J19O3j7j05o9L2J18N0n4r3o1M1R7O4m2j12n7N8R3M9
5961H9n5p8n6N2P8P2o0r6m8N4R1N8n5q6o9P1J00N5p5q9n7N6R9M1o1j20oM1J08
5990E4J6n9o9l7O6Q8M0o3j09k9O8Q7K8pj50NP3R6jr0o8m7R4R0Pp0p9l7P1Q6L3
6021H7q7q0nQ9O2J0q2j09K2R7N3%n3r9J2Q1P5K7j31m3RP1O1Pj14o6L9J07L9oq7
6052a4p2RO6J16m1n7p1j3R2N6j4r1m2lP9P6j4j03m4K0J04L5l6j04n1L5J09P3m4
6081E6j06m4K5J03P7m6r7o1N2O8O3m0j06k2N9M4N8m7q9m4O0P2N8l8j07m8L3Q0
$$ plain form
6109 13 62 11 -55 -109 -21 66 50 59 -48 -104 -37 65 68 -3 -94 -93 -29 66 83 27 -41 -60 -20 42 69 26 -35 -77 -6 71 94
6140 94 11 -53 -77 -6 80 105 4 -43 -68 -13 40 65 15 -81 -74 -16 41 51 -20 -76 -79 -24 43 82 13 -88 -74 -5 47 60
6170 60 3 -53 -60 10 74 69 3 -91 -75 8 93 54 -13 -88 -71 15 64 43 2 -93 -74 4 94 49 -23 -71 -51 33 87 61 -15
6201 -15 -89 -57 3 78 36 4 -72 -49 -6 70 30 -28 -119 -68 43 62 50 -46 -85 -65 45 66 53 -52 -97 -31 66 85 17
6230 17 -48 -88 -26 49 78 41 -51 -88 -45 28 73 25 -76 -84 -47 27 73 1 -47 -89 -30 46 75 30 -41 -50 -39 32 61 53 -47
6261 -47 -52 -30 39 101 26 -89 -66 -23 84 81 -1 -76 -72 -37 53 74 3 -51 -84 -23 68 63 1 -61 -101 14 68 77 -17 -75 -70 -15
6293 -15 46 48 -14 -86 -97 -6 63 65 16 -53 -78 6 80 69 0 -43 -63 28 98 69 -15 -75 -64 37 54 62 -6 -86 -44 9 42
6324 42 40 -54 -106 -87 8 62 48 -23 -53 -37 23 58 61 -3 -81 -26 29 84 62 -15 -83 -36 43 90 44 -18 -63 -46 14 70 51
$$ packed form
6109A3M9n1o6n4Q8Q7j6Rj07n6O7J02Lp1r1JO4R5J7n6o8j9M0O2K7m3o1m2P1P7K3
6140I4q3o4k4P1Q6K5j01m7k5N5N3K5n0r6PN8N7J0p1n6lN5O7L9o9j01J4O9N2J3
6170F0n7n6pP0O4no6r4J6Q3Q5l9o7p5J7Q6M9k1m1r5J9P8R0m5p2m8K0Q4N4k6p6
6201a5p4L2O0P5m2l2p6K3M3P6m0n8r1N1J11J9j2r6l9K0J10K1j3j05m5O6R7J9o8
6230A7o5m0O2P5K9l7r2l7M3P3M5m8j01qL7P4M6p2m8m2N9P6K9m5p1rJ1P1K9qj00
6261d7nK2O9O2p5j15K3M3J07lq2p5ML5R0K1p1n4l3O1R1no2o2m0J15N4Rr4n8NN5
6293a5O1Ko2p2j1R1O9Km9o9k5Q4P4j1o9m3k0R1P0k9q4o0J1J01J7Qo8q0M2N3L3
6324D2kr4n2J9R5N4j4p1l0J6O0L5Lo4p8N5N5N5k2p7o8M7P9M7m6o2m5J7O0N6j9
$$ plain form
6355 51 -35 -53 -38 42 46 24 -16 -67 -39 52 66 51 -48 -95 -40 25 41 32 -44 -90 -58 24 65 28 -56 -88 -31 26 75 18 -37
6386 -37 -83 -39 51 80 26 -38 -68 -18 48 63 5 -39 -39 4 71 86 3 -61 -73 -14 39 68 4 -85 -95 -22 71 49 2 -55 -73
6417 -73 -19 54 80 0 -56 -51 26 82 92 -10 -63 -67 3 73 38 -7 -70 -71 13 83 59 3 -64 -52 -13 54 32 -18 -41 -55 -17
6448 -17 55 48 -26 -73 -58 -26 43 48 -36 -65 -39 8 57 73 -35 -49 -39 20 30 21 -20 -77 -51 5 49 56 -17 -59 -35 39 79 59
6480 59 -19 -66 -23 47 63 31 -32 -71 -37 14 62 21 -43 -83 -44 26 33 2 -40 -66 -30 54 62 28 -50 -68 -16 57 60 15 -49 -76
6512 -76 -33 35 56 10 -59 -55 -29 59 71 -7 -53 -65 -5 66 63 0 -54 -57 -29 41 73 14 -59 -72 -28 49 44 -4 -48 -63 -24 42
6544 42 42 -30 -63 -83 -10 34 56 13 -55 -48 10 54 62 -10 -39 -66 7 57 97 -30 -37 -59 23 71 60 -16 -55 -78 -6 72 43 -8
6576 -8 -71 -74 -7 79 45 -32 -103 -58 14 54 17 -40 -58 -45 -1 66 37 -3 -80 -49 22 61 72 -27 -20 -45 22 68 22 -14 -79 -24
$$ packed form
6355E1q6j8J5Q0Mk2m0n1K8R1J4j5r9m7N5O5J6rp6m6L2Q2M1l7q4l2N7N7M9n7n5
6386c7m6M4R0K9n4o4l0N0O6J5n8m4%M3O7J5q3o4j2N9N3K9o4q9j0P3R3k2m7n7j8
6417g3N4P3K6q0n6NP7N6J0j02n3mP0P0l5m5o3jQ4P0k4n6o7J2L9O7k2n0k3j4L8
6448a7P2pp4m7J5L2O9Nq4k9K6M7M9J6j08j4J0N9J0rm1n7K6N6M4Pp3m2K4P4M0k0
6480E9p8m7M3P0J6l2o3l9L4N1M8m1o4m0L9P0Pl1m2k6L6Q4Ql4p8j8N2P3Lm5o4k7
6512g6M3O8K1m6o9MK6Q8J2p8m6j2O0P1lo3n4lK8P0L2n9p3j3M4P7nm8m4j5L9O6
6544D2%p2l3k0P3M4K2m3o8PN8M4Qp2k9k7P3N0M0j27pk2Q2M8j1p6l9k3P2P8k9n1
6576ho3lO7Q6l4p7p1M5P2M0l7n7j8J3M4O7k9m0p7L1P1L9J1r9Pk5O7M6m6l6o5N5
$$ plain form
6608 -24 7 65 34 -56 -66 -24 18 62 49 -21 -54 -36 33 57 -4 -33 -83 -47 15 56 0 -48 -63 -10 47 58 16 -50 -64 -23
6638 -23 30 70 24 -24 -66 -14 51 58 15 -35 -69 -20 68 102 41 -58 -73 -30 51 74 14 -28 -79 5 46 35 4 -49 -66 0 32
6669 32 43 -1 -80 -74 -6 34 57 -11 -56 -58 -27 72 72 14 -59 -51 -1 64 43 -11 -32 -56 30 39 78 32 -22 -54 -13 77 59 -11 -56
6702 -56 -51 6 61 25 -17 -50 -46 -17 33 35 2 -78 -46 15 63 30 -42 -66 -57 56 71 32 -8 -26 -27 36 75 38 4 -74 -15 46
6734 46 72 38 -18 -46 -12 31 70 38 -4 -36 -30 38 67 9 -20 -60 -24 29 53 24 -18 -56 -27 28 49 33 -41 -47 -32 37 94
6765 94 14 -33 -48 7 51 61 21 -26 -63 -20 62 62 7 -40 -60 4 42 62 24 -19 -55 -5 50 67 -2 -56 -69 -46 43 56 1
6796 1 -73 -56 -13 49 43 -4 -20 -52 6 53 50 -23 -40 -77 -13 35 59 -5 -42 -22 3 51 49 8 -45 -37 22 80 27 5 -49 -56 -5
6829 -5 46 41 6 -36 -38 -7 60 26 -32 -41 -75 2 41 27 -20 -87 -36 39 71 34 -9 -50 -36 22 50 69 9 -36 -26 5 49 54 -15
$$ packed form
6608b4L1N8l1r0j0M2M2M4j3p0l3J8O9K4o1k9n0L6O2M1n6m8j5N3N7J1m2o6j4M1
6638b3N3M0m6m8m2N2O5Pm3n0l4M9Q8L4o1r9j5M3Q1K3o0m2n1Q4M1j1l1n3j7O6L2
6669C2J1m4p9OO8M0K3o8m5kL1R9%n8p3QN0O5k1n4k1k4Q6RL9m6n4l2M1R0j8p0m5
6702e6NN7N5l6m2l3MK9N0Kl3q0L2O1M8l3p2k4RJ13J5l9m0j8jO3L9l7l4p8N9O1
6734D6K6l4n6k8L4M3L9l2m2l2OO8K9n8k9m0L6N3K4k9m2l8K9N5K1j6p4oJ5O9N7
6765I4q0m7j5N5M4J0m0m7l7M3Q2%n5m7k0O4L8K0l8m3l6N0N5J7o9n4j3K3Q9J3n5
6796Ap4J7M3O2om7j6l2N8M7lp3j7l7O4M8K4o4l7K0K5M8km1n3QN9N8n3k2n4pN1
6829eN1nl5m2kL1O7l4n8rl4P7L9j4m7o7N1P5L2l7m3m1J4N8K8J9o0m5J0L1M4No9
$$ plain form
6862 -15 -45 -41 23 44 36 -13 -57 -33 16 12 18 -20 -62 -28 28 67 18 -52 -50 -51 24 62 27 -56 -65 -8 27 64 30 -31 -58 -18 52 65
6896 65 7 -67 -29 -16 74 80 7 -58 -46 -22 46 52 17 -48 -33 -18 32 61 40 -27 -58 -6 40 25 -10 -42 -53 -18 38 46 -21 -69
6928 -69 -49 -13 47 39 -18 -22 -45 8 34 62 7 -37 -39 26 66 64 16 -30 -52 2 37 41 -4 -71 -48 -27 43 23 -21 -50 -55 -7 37
6961 37 33 -21 -49 -45 7 46 36 -47 -68 -50 -17 20 10 -31 -42 -32 -22 36 34 -15 -52 -21 30 71 48 -28 -55 -28 21 44 30 0
6993 0 -61 -8 22 36 42 -32 -64 -20 26 58 17 -67 -75 -54 9 43 -2 -39 -55 -14 23 53 18 -18 -62 -3 30 58 19 -21 -53 -12
7025 -12 35 54 34 -29 -66 -10 28 30 12 -26 -54 -44 58 31 5 -47 -63 -34 32 56 17 -52 -84 -36 25 54 8 -35 -14 -27
7055 -27 54 17 4 -47 -17 -18 41 31 -8 -40 -61 -20 47 47 -8 -55 -45 -15 43 51 6 -25 -31 5 71 35 -10 -25 -55 -11 30 44
7087 44 1 -39 -86 9 43 11 -36 -60 -74 -12 32 32 -19 -56 -54 -1 54 37 -7 -29 -49 6 26 36 -14 -52 -34 6 71 20 -22
$$ packed form
6862a5l0MO4K1qm9m4K4M9mOl8m2L4N6L9m9p0KjP5L8l5q3rN7L5L7l4o1k7M0P0J3
6896F5n8p4L8J3R0Op3o5J2K4O8Ol5o5J5J5N0K9k1o7l1N2M6j5l5l2j1L5N6Qo7m8
6928f9K0L6O0qn7mk3N3K6K8n5m4kO5M0km8m6k2N4L5Mm5o7K3K1P0k0m4k9nM8M4
6961C7mn4k8MN2L9j0q3k1J8L3L7j0m1j1J0J0N8km9l7L1N1M1k3p6k7K7M9K3j4l0
6993@o1N3L0J4Op4l2M4M6L2m1q4qK1O3L4m5l7j6M1L7L0l5l6m4N9L3K8l9m0l2M1
7025a2M7J9k0o3l7N6L8Kj8l8k8J0J02k7k6n2j6K9O6K4l9o9l2M8O1K9m6m3K1j3
7055b7Q1l7j3n1L0jN9j0l9l2k1M1O7%n5m7J0L0N8Qm5l1oL6O6l6m5j5l0M4M1J4
7087D4m3m0m7R5L4l2m7k4j4O2M4%n1l7KN3N5j7m4k2k0N5K0J0n0l8J8M0O5n1m2
$$ plain form
7118 -22 -28 -36 24 51 3 -13 -48 -36 5 26 15 -21 -30 -25 31 66 32 -34 -45 -17 27 50 17 -25 -59 -29 6 39 38 -15 -48 -18 8
7151 8 45 22 -27 -45 -22 27 34 27 -11 -46 -5 20 46 11 -18 -52 -14 24 28 21 -37 -54 -24 32 34 6 -51 -49 -49 8 48 -13 -57 -47
7185 -47 -14 51 24 11 -23 -28 -17 29 63 34 -10 -24 3 15 58 7 -40 -45 -8 56 43 0 -75 -46 -9 32 38 -12 -59 -68 -10 25
7217 25 26 -20 -58 -40 5 41 49 -19 -56 -60 9 39 25 -24 -47 -22 -4 39 20 1 -53 -31 13 48 24 -18 -33 -27 -7 43 60 -38
7249 -38 -49 -12 11 29 31 -51 -45 -36 5 29 -9 -18 -60 -30 12 53 16 -57 -65 -31 2 57 17 -31 -45 -19 8 41 11 8 -48 -23 21
7282 21 42 24 -18 -32 -13 57 42 -2 -43 -53 -19 20 37 -4 -69 -34 -6 29 66 21 -36 -43 -30 22 35 -8 -52 -92 -20 16 36
7313 36 11 -56 -52 17 41 45 33 -31 -51 3 41 63 32 -57 -29 10 37 50 8 -48 -45 -16 44 58 -5 -35 -55 7 35 54 6 -42
7345 -42 -39 -18 -2 26 -21 -41 -22 15 56 43 -21 -72 -54 26 24 54 1 -11 -35 8 48 39 13 -53 -17 20 46 33 -23 -43 -17 2
$$ packed form
7118b2oqO0K7m8j6l5J2M1K1j1l6rNN6L5l4o6j1K8M4K3l3m2l4L0L5L3jn3l3L0K6
7151HL7k3m9j8K3M9Ppl8l5M1K5K6l5k9l4L8L8Mpn8j7L0N6Kk8n7K%N7M0o1m4J0
7185d7L3O5k7j3l4nJ1M6L4k9m4j4K7J2M3n1m7nL7O4j3m3p5K9L7M1On0m7rN8L5
7217B5Jm6l8J8M5L6Qo8l7mO9L0j4m9k3K5J8M3j9j9n4K2M4L5k4m2j5OK0N0J7r8
7249c8j1L7K3J8Kq2ORM1K4l8rm2L0M2M1l7p3qL4L3N5m0m8j4K6K7L3l0ln6K5M4
7282B1K1j8m2j4J9P0j5m4m1j0L4L9J7m1o5L5K8L5L7m5n7pJ3N2J3m3m4m0P2L6K0
7313C6k5o7MO9K4Mj2o4k0N4L8K2l1q9K8L9K7J3m2n6LK9O0J4o3l0k0O2K8J9m8m8
7345d2LK1J6K8m7k0J9L7M1j3o4n1J8Q0kL0n3j2k4M3M0rk6o6L6L7K6j3n6k0K6J9
$$ plain form
7377 2 63 10 -18 -8 -43 5 29 29 -27 -38 -2 -5 24 7 -14 -51 -9 17 29 33 -37 -44 -54 12 31 5 -21 -54 -29 34 37 18 -18
7410 -18 -32 -15 34 49 10 -17 -59 -15 25 21 22 -8 -38 -47 4 57 -42 -26 -34 -27 28 51 -8 -41 -59 -17 23 48 4 -33 -35 -16 2
7443 2 30 14 -24 -50 4 63 32 2 -52 -30 -18 39 31 -17 -64 -58 -2 44 35 13 -61 -47 11 32 47 8 -45 -64 -1 27 34 -21 -31
7476 -31 -54 -8 17 16 13 -27 -27 -7 35 32 -14 -39 -53 -5 45 27 -34 -45 -20 28 60 12 12 -47 -8 33 37 20 3 -11 -33 0 31
7509 31 16 -4 -33 2 -8 24 28 -16 -20 -23 13 54 20 -36 -55 -20 21 30 -6 -45 -31 -9 -6 9 28 -4 -38 -12 46 53 -12 -16 -31 -32
7543 -32 43 42 7 -17 -46 9 10 26 -1 -47 -24 -22 1 11 -13 -41 -50 -52 13 31 21 -40 -34 -16 1 17 22 -41 -49 -2 23 52 1 -11
7577 -11 -49 -19 48 31 8 -36 -4 -8 15 23 21 -28 -21 27 50 23 -14 -54 -44 -5 28 31 -6 -29 -40 -22 54 11 -20 -28 -55 -8 18
7610 18 23 -35 -44 -57 16 43 47 -10 -31 -31 25 35 7 2 -52 -20 22 -5 24 -15 -25 -38 21 14 33 -28 -45 -38 6 35 2 -35 -25 -34
$$ packed form
7377BO1n3k8J0l5M8K4%n6j1L6lK9j7k1l7M2K6J2Mp0pj0O6J9k6k6l3K5O3Lj9l6
7410a8j4J7M9J5l9k7m2M4M0mJl0l0rN1N3r9J6qPN5K3n9l3j8M2M0K5m4l7kJ9J8
7443BK8j6l8k6N4N9l1l0n4K2J2N7qm8m7ON6M6rk2p4J4N8K1J5l9n3j9O3K8Pn5j0
7476c1k3M6K5jlm0%K0M2lm6k5j4M8N0j8o1j1K5M8L2m8%n9L9M1Mj7j7j4k2L3L1
7509C1j5k0k9L5j0L2Mm4mlL6M1l4n6j9L5M1Rl6l9J4K2LJ5J9l2l4K6N8Po5mj5j
7543c2P5jl5k4k9N5JJ6k7m6K3KK3J0k4k8rkO5J8j0o1OJ8J7J6No3qM7K5K9n1j2
7577a1l8L0O7j7k3m4L2mK3Qkm9PM8K3k7l7m0J0L9L3Ll7k3j1J8P6m3l1qk7M7K6
7610A8Nn8rj3P3K7Mn7k1%N6J0k8nn4L2M2k7K9l9j0j3N9pJ9o1j7PM4K9l3l7J0r
$$ plain form
7644 -34 18 40 7 -7 -56 -36 35 35 13 -36 -74 -12 -12 46 22 -11 -21 3 30 34 -3 -16 -36 1 28 43 15 -10 -27 -9 48 29
7676 29 18 -32 -25 -24 17 33 3 -22 -33 -21 27 3 -16 -29 -46 -26 6 48 2 -38 -41 -49 33 34 0 -25 -20 -22 37 57 7 -32 -11 -1
7710 -1 29 36 7 -26 -50 1 15 34 -27 -39 -24 -1 1 31 -9 -29 -51 9 36 17 7 -27 -30 6 20 44 2 -43 -45 42 31 10 -20
7743 -20 -33 -33 15 34 8 -17 -46 -16 3 29 28 -17 -20 -19 10 7 20 -18 -18 -31 10 21 18 -21 -17 -23 7 40 10 -48 -40 -43 9 3 -2 -43 -62
7780 -62 -29 -3 9 22 -17 -29 -10 11 49 28 -30 -28 3 10 46 21 -39 -24 -3 1 37 -5 -52 -63 -12 22 25 4 -31 -32 -32 18 44
7813 44 14 -51 -48 14 14 35 3 -32 -15 -13 20 56 -5 -16 -14 -1 28 27 6 -35 -26 -16 66 24 8 -43 2 3 41 39 10 -16 -24 22 53
7848 53 29 -14 -51 -33 20 21 -5 -34 -47 -66 5 23 14 -7 -36 -62 1 14 4 -7 -6 -42 17 39 33 6 -26 -23 21 5 42 10 -42
7881 -42 -32 13 20 18 -1 -25 -15 15 39 37 -22 -17 -17 12 5 23 -7 -50 -16 45 36 22 -15 -28 -50 5 28 19 -20 -31 -10 10 8 9 -9
$$ packed form
7644c4N2K2l3j4m9K0P1%k2m9l8O2%N8k4l3j0K4K7Ml7j3k0L7K7J5k8k5j7J8N7j9
7676B9j1n0PJM1J6l0k5j1J2M8k4j9j3j7K0L2M2m6m0lqQ2Jl4k5NkN9K0n0l9K1J0
7710aL0Pk9l3k4N1J4J9o1j2J5K3KL0m0k0k2O0K7j9j0l4lL6J4K4m2m5kQ7j1k1l0
7743b0j3%M8J9k6k5k9L0J9K6jm5lJK9lJ3l8%j3M1J1ll9MoL0L3l0n8QlN2onm1j9
7780f2L3K6J2J3l9j2J9K1L8k1n8KL1PL6k5o0J5K1ML6m2m7j1N1L4Lk1l5j%N0K6
7813D4l0o5LO2%K1l2l5J7KL3L6o1j1KJ3K9jk1m1RJ0Q2m2j6n1M5JL8kk9k6qM6L1
7848E3k4m3l7J8N3Jk6k9j3j9P1J8rk1k9k6O3J3j0j1Jl6N9K2ok7l2LM4j6L7l2n2
7881d2J0M5Pkj9k4J0L0K4kn9N%K9pJ8l0m3L4O1rj4l7j3k2N5K3rl9j1K1K0kJj8
$$ plain form
7916 -9 -38 -21 32 53 30 -24 -20 -19 25 54 3 -11 -18 -18 15 45 16 -6 -60 -14 3 36 18 -36 -35 1 22 38 8 -20 -23 1 19 17
7950 17 -1 -35 -46 -7 27 17 6 -8 -31 8 44 25 15 -27 -34 14 37 26 7 -11 -44 14 14 11 3 -48 -34 -24 18 -2 -16 -15 -15
7983 -15 -7 39 5 -3 -41 -24 20 21 2 -15 -51 -39 -29 30 25 0 -26 -14 21 45 21 -12 -19 -27 41 33 18 -3 -38 5 -1 56 9 -24
8017 -24 -45 -33 -1 30 12 -13 -29 -31 -4 15 5 -18 -40 -39 -15 39 12 -21 -17 -13 12 8 15 -31 -36 -14 32 27 19 -9 -19 -1 17 34 8
8052 8 -9 -50 -16 13 21 -1 -50 -33 -1 38 7 -4 -37 -32 -6 10 32 5 -27 -52 -9 19 24 -24 -39 -45 4 19 9 -13 -27 -11 -8
8085 -8 8 28 36 -26 -47 -6 24 24 4 -28 -4 -5 48 29 20 -30 -23 14 47 15 -19 -20 -38 1 4 38 -10 -16 -58 6 24 3 -7 -33 -18
8120 -18 11 43 28 3 -8 -12 20 34 42 -8 -19 0 14 46 16 -18 -37 20 31 39 29 -42 -19 0 8 22 0 -16 -17 -25 -5 14 32
8153 32 -9 -60 -20 16 21 20 -8 -26 -29 23 42 -9 -13 -41 8 -1 14 21 -42 -52 -9 12 54 4 -17 -28 -12 22 36 23 -16 -46 -9
$$ packed form
7916ik9J7N3K1k3n4MJM4K9n1j4p%L3L0k9k2n4M6J7L3j8n4JL6K1J6l0k8lK4J8k
7950A7j8l4j1L9L4j0j1j4k3L9L6j9j0m2pM8K3j1j9j8l3N8%lqn1J4J0M2k0j4J%
7983a5QM6l4ql8J7M4Jj9j7l6J2J0N9nk5k6J2L5K4k4l3pqO8qj5k1l5M3oN7m7l3
8017b4k1J2L2L1j8k5j6kK7J9j0k3k2JK4N4k7l3MMK5mPm6nK2M6nqk8j0J8J8J7k6
8052Hj7m1L4K9Qk2m9J7L2L9l1j1l3NK6J6K2k7l2k5M3K8Nm8j5oM9J5j0k2j4J6L
8085hJ6K0Qo2k1M1L0%k0l2K4jN3j9rn0PL7L3l2l4jj8L9LL4m8om2O4J8k1j0k6J5
8120a8K9L2j5k5j1mL2J4Qn0j1J9J4L2l0l4j9N7J1Qj0p1K3J9QJ4k2j6jqK0J9J8
8153C2m1n1M0L6Njk8j8lN2J9n1mk8M9rJ5Po3j0M3K1M2n0k1j1J6L4J4j3l9l0L7
$$ plain form
8186 -9 12 41 8 -47 -23
$$ packed form
8186iK1K9l3n5K4
8191b3
$$ Imaginary data points
##PAGE= N=2
##DATA TABLE= (X++(I..I)), XYDATA
$$ plain form
0 0 0 0 0 0 0 0 0 0 0 0 0 0 0 0 0 0 0 0 -8 8 -8 8 -8 8 -16 16 -16 17 -24 24 -32 32 -40 42 -48 56 -64 70 -78 88
40 88 -97 106 -119 130 -146 161 -178 195 -214 235 -260 288 -316 350 -386 428 -475 527 -591 664
60 664 -754 863 -1001 1181 -1429 1788 -2366 3448 -6183 29013 42927 333 4395 11981 27532
75 27532 27651 10449 -15594 -19090 -14214 -6471 -4667 -17332 -41964 -41033 -11555 15919 13818 -8475
89 -8475 -28689 -24737 -2980 15643 17120 10042 3995 4257 12242 25675 27217 9059 -8983 -4367
103 -4367 14796 27318 18933 -6418 -26261 -23204 -9874 -2103 1101 -2256 -14706 -19899 -8467
116 -8467 3911 3175 -9349 -22129 -16841 7308 23099 14741 -2033 -10531 -7455 6825 23874
129 23874 29014 18937 4303 -1601 6681 17732 11446 -11352 -26368 -17958 338 6717 -3802
$$ packed form
0@%%%%%%%%%%%%%%%%%%qJ6j6J6j6J6k4L2l2L3m1M8n6O4p2Q2r0J04j20J34j48J66
40H8j85K03k25K49k76L07l39L73m09M49m95N48o04O66p36Q14r03J002j118J255
60F64j418J617j864K182k610L217m154N814r631L5196J3914m2594M062P586J5551
75B7532J19j7202k6043l496M876P743J804j2665k4632R31K9478K7474k101k2293
89h475k0214L952K1757J8623J477p078o047K62P985J3433J542j8158j8042M616
103d367J9163J2522q385k5351j9843L057J3330P771L204l357j2450n193J1432
116h467J2378p36j2524j2780N288K4149J5791q358j6774q498L076J4280J7049
129B3874N140j0077j4634n904Q282J1051o286k2798j5016Q410J8296O379j0519
$$ plain form
142 -3802 -20469 -29882 -23902 -6002 9825 12710 2993 -8701 -7209 9826 21497 11843 -4907
155 -4907 -7171 6151 21879 25722 12897 -4311 -11318 -7311 2494 11894 8693 -8806 -21947 -17513
169 -17513 -5141 -732 -8516 -19008 -17222 -1745 12341 14186 7356 -1738 -7782 -3426 11097 22082
183 22082 17692 2660 -7363 -3412 7918 11186 1274 -9632 -9239 -767 6316 7376 -290 -14485
197 -14485 -23009 -16087 221 10840 5992 -8940 -15504 -4332 10300 12126 4035 -2293 -1083 7763
211 7763 17400 17377 5873 -8570 -14724 -5873 10727 16278 3185 -12715 -14442 -4294 3953 2186
225 2186 -6616 -12713 -9396 -212 6783 6359 -2571 -13925 -14624 10 16144 17816 6842 -2742 -2033
240 -2033 6124 11587 8273 931 -3165 -2788 1187 6608 5424 -6375 -18365 -17431 -4610 7545 7910
$$ packed form
142c802j6667r413N980J7900J5827K885r717j1694J492J7035J1671r654j6750
155d907k264J3322J5728L843j2825j7208p007M007R805R400l201j7499j3141M434
169a7513J2372M409p784j0492J786J5477J4086J845o830r094o044M356J4523J0985
183B2082m390j5032j0023L951J1330L268r912j0906L93Q472P083J060p666j4195
197a4485q524O922J6308J0619m848j4932o564J1172J4632J826q091o328J210Q846
211G763R637k3j1504j4443o154Q851J6600N551j3093j5900j727J0148Q247j767
225B186q802o097L317R184O995m24q930j1354o99J4634J6134J672j0974r584P09
240b033Q157N463l314p342m096L77L975N421j184j1799j1990R34J2821J2155L65
$$ plain form
255 7910 -2907 -12167 -10234 -2047 3503 4420 1461 -3022 -2433 6275 15086 13416 1399 -9559 -7206
270 -7206 7278 18001 12896 -1048 -10113 -9739 -3725 1893 1276 -5902 -12009 -9479 445 8195 4151
285 4151 -9579 -17147 -7863 8526 15608 9814 -634 -6290 -3102 4989 9884 7906 1437 -3748
299 -3748 -1203 8078 11943 2445 -11184 -14663 -5844 5326 8495 1535 -8072 -12046 -9212 -2907 3034
314 3034 3471 -2582 -6648 -1128 8599 11203 3653 -5982 -7363 1757 12108 13967 7501 -1284 -7618
329 -7618 -7172 477 6952 4003 -5122 -9804 -4710 4168 5618 -3774 -13473 -12269 -2075 7405 10003
344 10003 4507 -5245 -10239 -4808 6056 11995 7510 -1948 -4553 3639 11905 8727 -2425 -9769
358 -9769 -7564 1027 8564 8038 -766 -10562 -13563 -7195 3153 6889 -65 -7978 -6093 2670 7468
$$ packed form
255G910j0817r260J933Q187N550R17k959m483N89Q708Q811j670j2017j0958K353
270g206J4484J0723n105j3944r065L74O014N618o17p178o107K530R924P750m044
285D151j3730p568R284J6389P082n794j0448n656L188Q091M895j978o469n185
299c748K545R281L865r498j3629l479Q819J1170L169o960r607l974K834O305N941
314C034M37o053m066N520R727K604p550r635j381R120J0351J859o466q785o334
329g618M46P649O475k949r125m682N094Q878J450r392r699J204J0194R480K598
344A0003n496r752m994N431J0864N939m485r458k605Q192Q266l178j1152p344
358i769K205Q591P537n26q804r796l001O368J0348L736o954p913J885Q763M798
$$ plain form
373 7468 3725 -4015 -7829 -3497 5273 11225 10581 3600 -5420 -8042 -565 8756 9196 1313 -5477 -4914
389 -4914 620 3508 -620 -7512 -10306 -7144 -184 6868 7683 -478 -9825 -9768 -18 9571 10012 2063
405 2063 -4484 -2439 4164 6727 3277 -2460 -6269 -3808 4749 11571 8520 -2835 -12199 -10603 280
420 280 8246 4653 -4824 -8908 -5139 886 3557 645 -5064 -7123 -1812 7353 12516 7788 -3697
435 -3697 -10421 -4892 5971 10045 5044 -1997 -4487 -1370 3369 4393 668 -4393 -6462 -2712 4964
450 4964 8254 1262 -9742 -13326 -6989 2176 6179 2994 -2464 -3906 -787 3586 6214 4652 -880
465 -880 -3930 1009 9233 10831 2896 -7426 -10599 -3906 5066 7425 2625 -3716 -7019 -5219 245
480 245 3291 -788 -7765 -8917 -1589 7556 8755 128 -8713 -7633 1675 9884 11142 5987 -1095
$$ packed form
373G468l743p740l814M332Q770N952o44o981r020k622P477R321M40p883o790N63
389d914N534K888m128o892k794L162O960P052Q15q161r347N7R750R589M41p949
405B063o547K045O603K563l450n737l809K461Q557O822l051j1355r364J596J0883
420B80P966l593r477m084L769O025K671k912n709k059N311R165N163m728j1485
435c697o724N529J0863M074n001p041k490L117M739J024l725n061k069L750P676
450D964L290o992j1004l584O337R165M003l185n458j442L119M373K628j562n532
465h80l050M939Q224J598p935j0322l173O693Q972K359m800o341l303J800N464
480B45L046m079o977j152P328R145J199q627q841J080R308Q209J258n155p082
$$ plain form
495 -1095 -4113 -642 4636 4998 -1030 -7867 -7711 648 7855 4971 -4591 -10382 -7616 272 6790 6993
511 6993 1520 -4351 -5871 -2288 2988 3863 -1695 -6621 -3631 4559 9080 5627 -1954 -6484 -3968
526 -3968 2805 7981 7920 2889 -3944 -6608 -2139 3918 3705 -2474 -6946 -4351 2501 6035 1882 -6004
542 -6004 -10158 -7509 -563 5966 6903 840 -5965 -5341 2311 8982 7983 1260 -2741 1155 7972 8953
558 8953 2563 -5625 -10007 -7521 -105 5331 3179 -4646 -10313 -7890 452 5682 2584 -3539 -4131
573 -4131 1408 6884 7038 1855 -4481 -6437 -2001 5367 9496 6308 -1754 -6801 -3678 3134 5245
588 5245 1009 -3883 -4317 -577 3210 3036 -1434 -6463 -7877 -3719 3962 8397 4404 -3982 -7635 -3553
604 -3553 2912 5208 1924 -2529 -2860 1077 5088 5752 2058 -3766 -5804 -325 7990 10174 3436 -5956
$$ packed form
495a095l018L471N278L62o028o837J56Q359P207k884r562n791K766P888O518K03
511F993n473n871j520L583N276Q75n558m926K990Q190M521l453p581m530K516
526c968O773N176o1n031o833k664M469O057k13o179m472K595O852L534m153p886
542f004m154K649O946O529R37o063o805O24P652O671r99o723m001L896O817R81
558H953o390q188m382K486P416N436k152p825n667K423Q342N230l098o123n92
573d131N539N476J54n183o336j956M436P368M129l188q062n047L123O812K111
588E245m236m892m34L740L787j74m470n029j414M158P681M435l993q386l653M082
604c553O465K296l284m453l31L937M011O64l694n824k038N479Q315K184o738r392
$$ plain form
620 -5956 -9354 -4576 1842 2625 -1922 -6021 -5721 -1454 3227 3919 -829 -6360 -5746 2022 10085 10459
636 10459 2646 -5279 -5417 821 5819 5129 963 -2641 -2669 969 4069 2475 -3427 -8441 -7268 25
652 25 6193 4327 -3304 -8324 -6634 -863 3936 4541 1693 -905 -434 2865 6039 5174 -457 -5279
668 -5279 -3225 3871 8267 5296 -2128 -7347 -6461 -1307 3041 3129 -507 -4564 -5060 -902 3430 1954
684 1954 -4248 -7653 -3638 4412 8884 5672 -1655 -5599 -3061 2709 7041 6662 1479 -3440 -2683 2359
700 2359 4985 1321 -5454 -8042 -2986 4387 6052 878 -5661 -8243 -5350 646 4662 3286 -1597
715 -1597 -4482 -2078 3343 5613 1972 -3283 -3230 2463 7838 7963 3152 -2785 -5461 -3058 1915 4659
731 4659 2535 -2959 -6609 -4460 517 1707 -2260 -6139 -5479 -513 4583 5493 1536 -3489 -5135 -1782
$$ packed form
620e956l398M778O418P83m547m099L00M267M681O92m748n531O14P768Q063L74
636A0459p813p925j38O238M998o90m166l604k8L638L100j594n902n014J173P293
652B5O168j866p631n020J690N771M799O05k848k598M71L299L174q65n631m822
668e279K054P096M396k971p424n219Q86N154M348Q8l636m057m96M158M332j476
684A954o202l405M015Q050M472l212p327l944K538N770M332l79n183m919P57N042
700B359K626l664o775k588N056P373J665n174o539k582K893N996M016j376m883
715a597k885K404N421K270l641n255N3N693N375J25m811n937k676K403M973K744
731D659k124n494l650K149M977J190l967l879O60M966N096R10l957n025j646L353
$$ plain form
747 -1782 4663 8662 5848 -594 -3336 75 4669 4887 164 -4564 -4280 324 4260 3515 -1496 -7387
763 -7387 -9053 -4112 3029 5261 753 -5056 -5591 -545 4370 3865 -686 -3390 -1061 3952 7433 6389
779 6389 826 -4618 -4583 856 6317 6274 562 -4971 -4904 -607 1870 -80 -3781 -5546 -3761 488 3456
796 3456 2145 -2534 -6407 -5271 942 6805 6648 1564 -2284 -1315 2470 4902 3806 370 -1988 -1009
812 -1009 2334 4658 2800 -3168 -8136 -6724 -192 4477 2810 -2709 -6397 -4936 -329 2777 1792
827 1792 -1301 -3031 -1013 3901 7153 4522 -2014 -5378 -1908 4904 8271 5016 -1351 -4508 -2563
842 -2563 1034 2490 472 -3425 -5367 -2902 1757 3293 -600 -6245 -7657 -2800 3962 6074 2713
857 2713 -1753 -3121 -805 2889 4720 3137 -197 -1442 1074 4839 5346 846 -4835 -5805 -1444 3307
$$ packed form
747a782O445L999k814o442k742L411M594K18m723m728K84M604L936p45n011n891
763g387j666M941P141K232m508n809n35N046M915n05m551k704K329N013L481j044
779F389n563n444L5N439N461m3n712n533O7M297K477j950l701j765J785M249K968
796C456j311m679l873J136O213N863j57n084l848R69L785K432j096l436k358R79
812a009L343K324j858n968m968J412O532M669j667n519l688J461M607L106r85
827A792l093j730K018M914L252k631o536l364L470O812L367l255o367l157J945
842b563L597J456k018l897j942K465M659J536l893n645j412M857O762K112l361
857B713m466j368K316L694J831j583l334j245K516L765N07m500n681r70M361M751
$$ plain form
873 3307 3904 305 -4355 -6402 -4417 -488 1770 532 -2619 -3672 -242 4550 5192 776 -3681 -3341
889 -3341 1487 6417 6990 2880 -2147 -4010 -1739 2389 4071 1088 -3556 -4379 -459 3263 2167 -3119
905 -3119 -7196 -5800 -206 4251 3988 -22 -4166 -4649 -737 4141 5076 1663 -1761 -971 3199 5867
921 5867 3438 -1882 -4619 -2459 2046 4787 3525 -1088 -5387 -5596 -1849 2006 2134 -1436 -4357 -3050
937 -3050 1005 2963 805 -2728 -3943 -1575 3026 6222 5283 1008 -2908 -2904 1165 5073 4432 18
953 18 -3182 -2073 1147 2416 20 -3973 -5703 -3445 1106 4034 2550 -2492 -6351 -4770 888 4796
969 4796 3491 -602 -2535 -207 3677 4776 2021 -1753 -2823 -104 4200 6014 2674 -3425 -6587
984 -6587 -4067 974 3237 713 -3375 -4415 -1705 1406 1810 -448 -3078 -3325 -30 4391 5704 2338
$$ packed form
873C307N97l599m660k047J985L929K258j238l151j053L430M792O42m416m457L40
889c341M828M930N73m110n027j863K271M128J682k983m644q23L920L722j096n286
905c119m077J396N594M457k63m010m144m83L912M878R35l413l424P90M170K668
921E867k429n320k737K160M505K741j262m613m299k09L747L855J28l570k921J307
937c050M055J958k158l533j215K368M601L196r39m275l916MM069L908o41m414
953A8l200J109L220J269k396l993j730K258M551K928j484n042l859J581N658L908
969D796j305m093j933K328L884J099k755l774j070K719M304J814l340o099l162
984f587K520N041K263k524m088j040K710L111M04k258k630k47L295M421J313l366
$$ plain form
1000 2338 -2629 -4335 -1186 3567 5017 2323 -1064 -1994 -250 1890 2107 -241 -3288 -3892 -996 2914
1016 2914 3696 -50 -5044 -6144 -2266 2470 3696 1296 -1878 -2691 -494 2477 3241 883 -2104 -2340
1032 -2340 1379 5661 5613 642 -4242 -4395 -354 3666 3780 185 -3557 -4154 -1797 948 1066 -1874
1048 -1874 -4734 -3681 1105 4870 3823 -869 -4273 -2870 1863 5330 4705 1392 -1562 -1816 528
1063 528 2812 2110 -1352 -3852 -2519 1416 3717 1586 -3099 -5689 -3920 148 3003 2715 -126 -2848
1079 -2848 -2732 163 2837 2468 -399 -2425 -732 3321 5137 2652 -1710 -3927 -2412 1432 4171
1094 4171 3272 -444 -3672 -3512 -383 2272 1111 -2646 -4410 -1908 2138 3458 841 -3227 -4698
1109 -4698 -2093 2514 5080 3814 -37 -2777 -1477 2406 4250 1927 -1759 -2725 -8 3240 3307 -307
$$ packed form
1000B338m967j706L149M753J450k694l387r30J744K140K17k348l047o04K896L910
1016B914P82l746m994j100L878M736J226k400l174q13K197K971P64k358k987k36
1032b340L719M282m8m971m884j53M041M020J14l595l742n97K357K745J18k940
1048a874k860J053M786L765j047m692l404J403M733L467o25l313k954k54K344
1063E28K284p02l462k500J333L935K301k131m685k590J769M068K855k88k841k722
1079b848J16K895K674l69k867k026J693M053J816k485m362k217J515L844K739
1094D171q99l716l228J60L129K655j161l757j764K502M046J320k617m068j471
1109d698K605M607K566j266l851k740J300L883J844k323l686r66K717L248O7l614
$$ plain form
1125 -307 -4200 -4966 -2365 1509 3416 1372 -2742 -4553 -2409 1183 2629 590 -2087 -1946 1141 3845
1141 3845 3577 805 -2163 -2724 -52 3727 4939 2344 -1820 -3702 -1782 1471 2167 -404 -3093 -3054
1157 -3054 -621 1667 1582 -1136 -4150 -4292 -953 3257 4556 1759 -2363 -3268 -108 3447 3774 1285
1173 1285 -1198 -1080 1518 3602 2704 -808 -4018 -3966 -397 3450 3339 -796 -4645 -4558 -1149 1947 1769
1190 1769 -854 -2636 -1537 1242 3062 2153 -990 -3360 -2083 2178 5241 4182 122 -2970 -2305
1205 -2305 874 2984 2014 -528 -2207 -1649 430 1824 489 -2794 -4666 -3057 924 3545 2246
1220 2246 -1582 -3933 -2598 697 2942 2665 541 -1145 -381 2113 3591 2155 -1224 -3218 -1399
1235 -1399 2600 4349 1951 -2339 -4616 -3316 -100 1955 1021 -1681 -3233 -1973 1029 2609 776
$$ packed form
1125c07l893p66K601L874J907k044m114j811K144L592J446k039k677J41L087K704
1141C845k68k772k968n61K672L779J212k595m164j882J920L253O96k571k689L9
1157c054K433K288q5k718l014j42L339M210J299k797m122r05L160L555L27k489
1173A285k483J18K598K084q98l512l210N2L569L847j11m135l849Q7L409L096j78
1190A769k623j782J099K779J820r09l143k370J277M261L063j059m060l092O65
1205b305L179K110r70k542j679N58K079J394j335l283j872J609L981K621j299
1220B246l828k351J335L295K245k77k124j686P64K494J478j436l379j994J819
1235a399L999J749k398m290k277J300L216K055r34k702j552J260L002J580j833
$$ plain form
1250 776 -2632 -3481 -319 3834 4942 2178 -1712 -3144 -1045 2276 3622 2118 -752 -2238 -807
1265 -807 1847 2317 -482 -3618 -3787 -768 2493 2658 -413 -3628 -4142 -1869 1317 2828 1601 -963
1281 -963 -1791 191 2806 3161 796 -1777 -1552 1413 3966 3541 468 -2757 -3660 -1674 1340 2418
1297 2418 398 -2654 -3525 -1509 1194 1368 -1258 -3376 -2398 903 3588 3342 427 -2583 -2676 281
1313 281 3631 4250 1660 -1633 -2034 562 2732 1809 -1265 -3223 -2135 930 2890 1645 -1790 -4398
1329 -4398 -3914 -668 2454 2461 -574 -3012 -2260 615 2539 1581 -811 -1821 -40 2849 4220 2848
1345 2848 -318 -2670 -1934 1248 3532 2543 -732 -3117 -2610 -276 939 -333 -2582 -3352 -1778 859
1361 859 2442 1270 -1733 -3465 -1908 1801 4254 3335 208 -1749 -637 1831 2916 1609 -734
$$ packed form
1250G76l408q49L162M153J108k764l890j432K099L321J346j504k870j486J431
1265h07K654M70k799l136j69L019L261J65l071l215n14K273L186J511j227k564
1281i63q28J982K615L55k365k573K25K965K553m25l073l225r03J986L014J078
1297B418k020l052q71K016K703J74k626k118R78L301K685k46k915l010r3K957
1313B81L350O19k590l293m01K596K170r23l074j958J088L065J960j245l435k608
1329d398M84L246L122Pl035k438P52K875J924r58k392j010J781K889J371j372
1345B848l166k352P36L182K284r89l275k385N07K334J215j272k249p70J574K637
1361H59J583j172l003j732J557L709K453r19l127j957J112K468J085j307k343
$$ plain form
1376 -734 -1921 -580 1967 2895 768 -2864 -4605 -2772 981 2837 939 -2358 -3584 -1920 786
1391 786 1937 650 -1411 -1768 314 3079 3736 1382 -1980 -2867 -150 3249 4007 1599 -1515 -2518
1407 -2518 -942 1161 1448 -299 -2320 -2672 -792 1564 1696 -938 -3692 -3658 -732 2530 3185 1047
1423 1047 -1395 -1770 -32 2111 2721 1294 -769 -1127 829 2877 2563 -319 -3145 -3084 -240 2482
1439 2482 2423 -103 -2760 -3325 -1498 856 1404 -362 -2371 -2189 363 2772 2386 -552 -2733 -1651
1455 -1651 1665 4116 3683 882 -1786 -1996 85 2100 1850 -522 -2646 -2172 379 2006 577 -2474
1471 -2474 -3912 -2415 827 2883 2076 -619 -2494 -1961 474 2613 2378 191 -1319 -307 2024 2982
1487 2982 1332 -1486 -2722 -1291 1312 2622 1455 -1295 -3337 -2892 -350 1674 1170 -992 -2214
$$ packed form
1376g34j187J341K547R28k127l632j741J833L753J856j898l297j226J664K706
1391G86J151j287k061l57K082K765O57k354l362q87K717L399P58k408l114j003
1407b518J576K103K87j747k021l52J880K356J32k634k754L4K926L262O55k138
1423A047k442l75J738K143O10j427k063l58J956K048l14k882k826O1K844K722
1439B482n9k526k657n65J827K354N48j766k009J82K552K409l86k938k181J082
1455a651L316K451m33k801k668k10K081K015k50k372k124M74K551J627j429l051
1471b474j438J497L242K056q07k695j875N33K435K139k35k187j510J012K331R58
1487B982j650k818j236J431K603J310j167k750k042M45K542K024n04k162j222
$$ plain form
1502 -2214 -1062 1286 2322 739 -1692 -2469 -761 2012 3480 2297 -648 -2546 -1519 1292 3048
1517 3048 1963 -659 -1993 -648 1489 1730 -346 -2839 -3493 -1516 1330 2353 580 -2331 -3494
1532 -3494 -1632 1610 3036 1582 -729 -1137 631 2530 2545 485 -1665 -1771 304 2582 2847 524
1548 524 -2511 -3437 -1542 1049 1608 -128 -2191 -2379 -662 1094 1067 -514 -1973 -1642 610 3101 3409
1565 3409 1066 -1628 -2032 51 2452 2764 798 -1347 -1611 -162 1236 1049 -783 -2605 -2352 5
1581 5 2222 1980 -744 -3328 -3259 -532 2019 2113 130 -1561 -1345 600 2392 2111 106 -1426 -720 1806
1599 1806 3615 2583 -680 -3075 -2443 141 1953 1326 -929 -2628 -2189 -267 1054 472 -1414 -2580
1615 -2580 -1347 1400 2922 1610 -1102 -2495 -1215 1488 3095 2413 328 -1029 -620 1023 2056
$$ packed form
1502b214J152K348J036j583k431p77J708K773J468j183k945j898J027K811J756
1517C048j085k622j334J345K137K41k076k493o54J977K846J023j773k911j163
1532c494J862L242J426j454k311m08J768J899J5k060k150j06K075K278K65k323
1548E24l035r26J895K591N59j736k063j88J717J756k7j581j459L31K252K491L08
1565C409k343k694m04K083K401L12j966k145k64J449J398j87j832j822K53K357
1581EK217k42k724k584O9K727K551R4j983j691K16J945J792k81k005j532P06K526
1599A806J809j032l263k395O32K584J812o27k255j699M39J922J321n82j886j166
1615b580J233K747J522j312k712j393J280K703J607o82k085j357M09J643J033
$$ plain form
1630 2056 1121 -1088 -2268 -1122 1103 1946 267 -2427 -3613 -2204 416 1907 1217 -770 -2039 -1318
1646 -1318 791 2117 1219 -776 -1521 41 2522 3231 1319 -1348 -2228 -649 1764 2772 1450 -1153
1662 -1153 -2629 -1747 292 1087 -363 -2466 -2761 -697 1657 1977 11 -2109 -2270 -137 2405 3178
1678 3178 1631 -711 -1586 -232 1754 2065 315 -1589 -1517 394 2090 1652 -544 -2570 -2592 -650 1466
1695 1466 1870 183 -2037 -2553 -901 1139 1437 -40 -1412 -1015 951 2509 2101 48 -1718 -1635 321
1712 321 2428 2595 483 -1820 -2181 -429 1460 1395 -423 -1937 -1492 381 1668 979 -1194 -2886 -2371
1729 -2371 123 2308 2179 -18 -1974 -1588 707 2498 2043 118 -1087 -401 1353 2245 1116 -1317
1745 -1317 -2782 -1927 525 2134 1366 -1090 -2739 -1992 215 1508 811 -823 -1615 -650 1149 1935 900
$$ packed form
1630B056r35k209j180J146K225Q43j679k694j186J409K620J491o90j987j269P21
1646a318K109J326q98j995p45J562K481P09j912k667q80J579K413J008j322k603
1662a153j476Q82K039P95j450k103k95K064K354L20j966k120j61K133K542P73
1678C178j547k342q75J354J986L11j750j904P2J911J696m38k196k026k2J942K116
1695A466M04j687k220n16J652K040K98j477j372L97J966J558m08k053j766Q3J956
1712C21K107J67k112k303l61J752J889o5j818j514M45J873J287o89k173j692N15
1729b371K494K185j29k197j956L86K295J791m55j925j205O86J754Q92j129k433
1745a317j465Q55K452J609p68k456j649P47K207J293o97j634p92R65J799P86j035
$$ plain form
1762 900 -1011 -1928 -727 1778 3129 1993 -450 -1817 -1072 737 1651 743 -1054 -1943 -1128 448 1138
1779 1138 32 -1941 -2638 -1051 1500 2670 1293 -1032 -2095 -917 1167 2072 1129 -570 -1275 -224
1795 -224 1501 2060 525 -1560 -2054 -294 1977 2459 485 -2015 -2760 -1339 651 1346 231 -1389
1811 -1389 -1738 -290 1518 1788 184 -1683 -1675 402 2483 2416 401 -1676 -1998 -462 1416 1843 551
1828 551 -985 -1264 46 1462 1339 -513 -2202 -1922 9 1655 1382 -495 -2279 -2249 -461 1421 1857
1845 1857 653 -856 -980 501 1962 1633 -206 -1643 -1183 779 2265 1748 -374 -2115 -2015 -276
1861 -276 1544 1566 -160 -1857 -1743 -101 1241 720 -1125 -2193 -1176 1092 2449 1758 -286 -1716
1877 -1716 -1155 862 2397 1921 -55 -1587 -1235 437 1363 400 -1393 -2085 -884 1049 1974 967 -1080
$$ packed form
1762I00j911r17J201K505J351j136k443j367P45J809R14r08j797q89Q15J576O90
1779A138j106j973o97J587K551J170j377k325j063J178K084R05r43j699p05J051
1795b24J725N59j535k085m94J760K271M82j974k500p45J421J990O95j115j620
1811a389l49J448J808K70j604j867QK077K081o7k015k077l22J536J878M27j292
1828E51j536k79J310J416j23j852j689K80J931J646k73j877j784L0J788J882M36
1845A857j204j509j24J481J461l29j839j437M60J962J486n17k122j741J00J739
1861b76J820K2j726j697J14J642J342n21j845j068J017K268J357o91k044j430
1877a716N61K017J535m76j976j532L52J672R26r63j793o92J201J933R25j007k047
$$ plain form
1894 -1080 -2215 -1377 637 1925 1268 -587 -1739 -962 742 1476 585 -912 -1387 -175 1598 2208 994
1911 994 -1009 -2065 -1208 829 1924 1001 -924 -1857 -981 697 1324 309 -1217 -1574 -336 1368 1847
1928 1847 463 -1522 -2326 -958 1315 2198 1064 -796 -1492 -254 1379 1737 447 -1076 -1348 -65
1944 -65 1497 1586 -117 -2152 -2469 -818 1266 1777 324 -1394 -1620 -219 1266 1423 189 -1100 -1052
1961 -1052 470 1854 1725 18 -1748 -1790 0 1815 1836 202 -1421 -1537 -315 936 911 -377 -1474
1978 -1474 -1284 225 1564 1346 -400 -1854 -1517 368 2019 1846 213 -1368 -1362 -13 1228 1112 -206
1995 -206 -1348 -1055 599 1832 1283 -655 -1962 -1371 576 1984 1439 -455 -1856 -1629 -165 1109
2011 1109 795 -636 -1617 -911 883 1940 1142 -741 -1730 -728 1248 2313 1524 -342 -1539 -1120 362
$$ packed form
1894a080j135Q38K014J288o57j855j152P77J704P34q91j497m75J212J773O10j214
1911I94k003j056Q57K037J095r23j925r33Q76J678O27j015j526l57J238J704M79
1928A847j384j985q04J368K273Q83j134j860o96J238J633L58j290j523k72J283
1944f5J562Q9j703k035l17J651K084N11j453j718k26J401J485J57j234j289M8
1961a052J522J384j29j707j766m2J790J815K1j634j623j16J222J251k5j288j097
1978a474J90J509J339k18j746j454L37J885J651j73j633j581OJ349J241j16j318
1995b06j142K93J654J233n49j938j307N91J947J408n45j894j401K27J464J274
2011A109l14j431r81P06J794J057p98j883r89J002J976J065p89j866j197M19J482
$$ plain form
2028 362 1313 706 -847 -1659 -843 737 1395 295 -1509 -2056 -876 998 1877 1041 -649 -1553 -833 746
2046 746 1681 1032 -448 -1135 -244 1221 1579 345 -1330 -1828 -626 1129 1744 680 -1070 -1911 -1035
2063 -1035 653 1481 576 -940 -1439 -325 1147 1353 16 -1522 -1716 -288 1453 1921 699 -1049
2079 -1049 -1580 -399 1340 1828 663 -887 -1164 36 1281 1078 -445 -1873 -1776 -270 1286 1425 -23
2096 -23 -1612 -1799 -362 1264 1507 252 -1011 -955 335 1419 1122 -244 -1347 -1045 474 1847 1672
2113 1672 101 -1460 -1519 -131 1227 1169 -208 -1432 -1279 -30 936 588 -704 -1668 -1178 457 1788
2130 1788 1536 -113 -1527 -1272 364 1694 1436 21 -1077 -764 521 1377 851 -618 -1531 -974 639
2147 639 1693 957 -928 -2146 -1559 138 1324 876 -561 -1333 -680 712 1500 867 -510 -1243 -375
$$ packed form
2028C62R51o07j553q12Q16J580O58j100j804n47J180J874Q79q36j690r04P20J579
2046G46R35o49j480o87Q91J465L58j234j675m98J202J755O15j064j750q41Q76
2063a035J688Q28r05j516m99J114J472K06j337j538j94J428J741M68j222j748
2079a049n31J181J739M88j165j550k77J200J245k03j523j428R7J506J556J39j448
2096b3j589j87J437J626K43j255j263N6J290J084k97j366j103L02J519J373j75
2113A672j571j561n9J388J358n8j377j224J53J249R66l48j292r64M90J635J331
2130A788k52j649j414K55J636J330k58j415j098L13J285Q56n26j469r13N57J613
2147F39J054p36j885j218N87J697J186m48j437p72O53J392P88o33j377p33Q68
$$ plain form
2164 -375 1222 1922 884 -983 -1904 -1073 614 1405 744 -639 -1294 -596 669 1250 428 -934 -1466 -523
2182 -523 983 1491 397 -1301 -1838 -761 889 1588 870 -447 -1024 -324 944 1341 456 -929 -1358
2199 -1358 -266 1225 1521 241 -1319 -1709 -603 1016 1492 497 -953 -1461 -659 656 1053 -13 -1291
2216 -1291 -1302 91 1552 1693 347 -1075 -1213 118 1531 1644 447 -1036 -1448 -442 726 756 -433
2233 -433 -1526 -1342 92 1365 1207 -233 -1413 -1218 132 1436 1469 251 -1055 -1116 25 1147 1068
2250 1068 -63 -1058 -720 612 1504 1030 -428 -1581 -1386 -22 1130 973 -321 -1467 -1325 -27 1141
2267 1141 978 -219 -1050 -588 737 1568 1009 -514 -1516 -1045 460 1546 1244 -173 -1292 -936 449
2284 449 1332 822 -525 -1332 -781 524 1097 307 -1116 -1835 -1060 532 1564 1015 -417 -1214 -576 813
$$ packed form
2164c75J597P00j038j867r21Q31J687P91o61j383o55O98J265N81q22j362n32R43
2182e23J506N08j094j698n37J077J650O99p18j317n77P00J268L97q85j385m29
2199a358J092J491K96j280j560l90J106J619M76r95j450n08Q02J315L97j066j278
2216a291j1J393J461J41j346j422j38J331J413J13j197j483m12J006J168L0j189
2233d33j093J84J434J273j58j440j180J95J350J304L3j218j306o1J141J122p9
2250A068j131r95L38J332Q92m74j458j153J95J364J152j57j294j146J42J298J168
2267A141j63j197q31M62J325Q31n59j523j002M71J505J086l02j417j119L56J385
2284D49Q83n10j347q07N51J305N73p90j423p19P75J592J032n49j432p97O38J389
$$ plain form
2302 813 1475 787 -527 -1036 -303 896 1249 385 -983 -1526 -642 879 1578 749 -751 -1463 -776 517
2320 517 994 230 -938 -1254 -440 772 1138 298 -917 -1233 -227 1265 1773 826 -689 -1231 -418 788
2338 788 1147 296 -853 -1111 -247 846 1041 21 -1271 -1515 -344 1059 1291 128 -1244 -1500 -413
2355 -413 925 1187 302 -674 -707 333 1400 1360 115 -1141 -1132 118 1237 1174 -203 -1488 -1519 -320 803
2374 803 825 -95 -971 -868 199 1174 920 -303 -1270 -958 389 1480 1172 -146 -1159 -987 150 1168
2392 1168 1077 15 -929 -791 229 1021 644 -595 -1466 -969 375 1298 893 -373 -1329 -1022 239 1181
2410 1181 983 -166 -1012 -724 416 1198 704 -562 -1234 -578 816 1552 926 -490 -1344 -885 332 1131
2428 1131 653 -603 -1330 -829 370 963 277 -863 -1290 -388 1013 1514 735 -545 -1143 -484 794 1421
$$ packed form
2302H13O62o88j314n09P33J199L53q64j368n43Q84J521O99q29j500p12O87J293
2320E17M77p64j168l16Q14J212L66q40j215l16J006J492N08r47j515n42Q13J206
2338G88L59q51j149k58Q64J093J95j020j292k44J171J403K32j163j372k56J087
2355d13J338K62q85r76l3J040J067m0j245j256RJ250J119o3j377j285l1J199J123
2374H03K2r20q76J03J067R75k54j223r67L12J347J091l08j318j013J72J137J018
2392A168r1j062r44J38J020P92l77j239q71M97J344R23m05j266r56L07J261R42
2410A181j98j149q46K88J140P82m94j266o72O56J394P36o26j416q54M59J217P99
2428A131m78j256p27N01J199N93o86j140m27R02J401N01p79j280n98O59J278O27
$$ plain form
2446 1421 752 -465 -1039 -404 661 978 185 -1006 -1293 -402 752 1056 194 -1031 -1450 -616 670 1223
2464 1223 559 -568 -937 -163 901 1157 306 -750 -927 9 1076 1233 260 -1008 -1317 -417 802 1149
2482 1149 268 -882 -1149 -334 720 807 -155 -1106 -1096 -19 1035 1075 5 -1102 -1160 0 1214 1368
2500 1368 363 -719 -742 209 1092 965 -62 -995 -849 137 963 754 -439 -1513 -1390 -191 898 851
2518 851 -204 -1078 -910 163 1036 906 -31 -725 -455 650 1399 1024 -169 -1141 -894 255 1150 857
2536 857 -263 -1146 -903 72 789 478 -461 -1133 -745 365 1017 600 -572 -1325 -817 475 1314 929 -196
2555 -196 -952 -551 490 1133 710 -340 -898 -418 688 1196 519 -760 -1349 -712 561 1073 489 -704
2573 -704 -1307 -767 267 829 290 -659 -1027 -293 866 1273 542 -619 -956 -151 998 1342 542 -579
$$ packed form
2446A421o69j217n74O35J065L17p93j191k87Q91J154L04q62j225m19Q34J286N53
2464A223o64j127l69P74J064K56q51j056j77R36J067J57r73j268l09R00J219L47
2482A149q81j150k67Q15J054Q7r62r51J0J077J054M0j070j107n8J160J214J54
2500A368j005j082k3R51Q83j27j027r33J46R86Q26k09j193j074J23J199J089m7
2518H51j055q74J68J073Q73j30r37o94K70J105P49l75j193r72K47J149Q95k93
2536H57j120q83K43R75P17l11r39o72L88J110O52m17j172p53N08J292Q39l85j125
2555a96p56M01J041O43m23j050n58M80J106N08o77j279n89O37J273N12n84j193
2573g04o03N40J034N62n39r49l68P34J159M07p31j161l37Q05J149L44q00j121
$$ plain form
2591 -579 -1072 -481 464 835 181 -805 -1050 -264 727 923 84 -960 -1185 -293 763 1065 264 -790 -1062
2610 -1062 -304 754 1062 392 -537 -689 116 1092 1125 140 -920 -1054 -116 899 949 1 -1066 -1226 -365
2629 -365 644 799 -17 -918 -892 112 965 848 -146 -999 -873 236 1194 1145 138 -804 -854 93 975 877
2649 877 -90 -956 -805 102 782 486 -518 -1218 -885 234 1073 903 -92 -933 -745 230 1002 787 -155
2668 -155 -903 -611 329 949 539 -394 -985 -596 470 1204 842 -251 -1047 -798 185 890 527 -468 -1073
2687 -1073 -661 326 860 454 -536 -991 -426 681 1290 783 -372 -1029 -557 506 1087 615 -399 -878
2705 -878 -335 527 913 307 -709 -1119 -497 570 980 280 -857 -1261 -582 495 1015 475 -428 -714 -75
2724 -75 797 1035 365 -587 -854 -167 787 1014 216 -878 -1154 -400 604 883 252 -602 -847 -211 615 738
$$ packed form
2591e79m93N91R45L71o54r86k45P86R91J96q39j044k25Q92J056L02q01j054k72
2610a062P58J058L08o70r29j52Q05R76L3r85j060j34R38J015N0r48j067j60Q61
2629c65J009J55q16r01K6J004Q53j17r94q53J26J109R58m9j007r42n0R47Q82r8
2649H77r67q66J51R07O80k96j004p00L33J119Q39j70r95q41J88R75P72k15r42
2668a55p48K92R40O20m10r33n91L89J066P34l62j093p96K49R83P05l63r95o05
2687a073M12R87N34m06r90m55N65J107O09n07j155o57M72J063N81m72j014m79
2705h78N43Q62L86o06j016m10O22J067M10p00j137m04O79J077N20n40r03k86O39
2724g5Q72K38o70r52k67O87R54K27p98j094k76P54J004K79o31q54k45O36Q26J23
$$ plain form
2744 738 33 -837 -957 -140 848 979 165 -824 -909 -69 907 1051 347 -594 -736 -40 738 742 -75 -904 -908 -21
2766 -21 902 829 -121 -1003 -959 -57 799 796 12 -855 -820 -19 772 749 -97 -776 -557 412 1161 961 -54 -875
2788 -875 -747 149 891 701 -206 -967 -863 -25 652 488 -348 -940 -598 397 1002 668 -305 -945 -671 283
2808 283 965 711 -153 -817 -587 288 870 575 -302 -837 -465 445 950 470 -514 -1101 -654 324 901 552
2828 552 -353 -931 -537 352 893 447 -441 -832 -348 585 956 418 -540 -946 -425 586 1048 541 -421 -885
2848 -885 -398 468 822 213 -665 -926 -340 535 791 132 -709 -960 -288 709 1031 443 -463 -775 -194 658
2868 658 850 200 -606 -768 -73 675 809 85 -792 -918 -208 672 863 165 -725 -903 -243 604 723 75
2888 75 -660 -677 55 826 855 114 -710 -771 32 869 911 94 -771 -838 -109 661 636 -88 -755 -700 18 750 624
$$ packed form
2744G38p05q70j20Q17R88J31q14r89q5Q40R76J44p04r41j42O96P78Mq17q29mQ87
2766b1R23p3r50q82M4R02Q56lp84q67L5Q01P91k3q46o79K19R69P49k00j015q21
2788h75J28Q96P42j90r07p61J04Q38O77j64q36n92L42R95O05l34r73o40K74R54
2808B83O82k54q64o64K30Q75N82k95q77n35L72R10N05m80r84n87M47R78N77l49
2828E52r05n78L94Q89N41m46q88l91M84R33L71n38r58m06N21J011M62n07r62m64
2848h85M87Q66L54o09q78k61N86Q75K56o59q41k51O72R97L22n88r06l12N81Q52
2868F58J92o50q06j62O95P48J34p24q77j26P10Q80J91o98q90j78O60Q47J19o48
2888G5p35j7P32P71K9p41q24o1Q03Q37M2q17q65o7P29P70k5p24o67N5P18P32j26
$$ plain form
2911 624 -179 -906 -755 117 892 803 -91 -804 -678 141 781 679 -64 -676 -496 287 841 605 -263 -909
2931 -909 -664 216 835 586 -295 -928 -711 114 698 480 -246 -751 -507 302 811 531 -330 -827 -439 467
2951 467 1013 661 -266 -790 -464 333 808 505 -304 -779 -450 336 732 274 -561 -974 -501 405 874 424
2971 424 -488 -854 -418 407 851 475 -325 -699 -261 533 835 292 -556 -819 -240 621 862 289 -551 -867
2991 -867 -357 469 762 232 -570 -796 -274 521 703 101 -635 -761 -89 720 884 267 -553 -718 -144 635
3011 635 820 236 -520 -708 -118 558 595 -41 -731 -780 -75 685 702 37 -720 -795 -128 629 748 114 -581
3032 -581 -642 56 678 664 -5 -674 -571 116 812 705 -42 -776 -758 -23 666 632 -53 -734 -633 89 642
3053 642 529 -212 -746 -549 224 811 609 -195 -785 -634 183 819 648 -106 -678 -505 229 713 471 -289
$$ packed form
2911F24q03p27J51Q72P75q9q94p13J26Q19O40j02p43o12J80P83N54k36q68o46
2931i09K45Q80O19k49q81o33K17Q25N84k18p26n05K44Q09N09k80q61m97L88R06
2951D67N46l52r27n24L26P97M75l03q09m75L29P86L96m58q35m13M73R06M69m50
2971D24r12l66M36Q25M44l76q00l74M38P94L02n43q48k63N79Q61K41n73q40l16
2991h67N10Q26K93n30q02k26N22P95J82o02p36j26O72Q09J64o17q20j65N74P79
3011F35J85n84p56j88N90O76L7o36o90m9P05P60J7o65p57p5O67P57J19o34o95
3032e81o1O98O22j4o69o69J03O87O96j07p47p34J8P35O89l4o85o81J01P22N53
3053F42j13p41n34J97P73N87k02q04n90J51Q17O36j71p54n72J73P34M84k42p60
$$ plain form
3073 -289 -749 -510 268 708 420 -378 -884 -590 245 775 558 -229 -687 -375 344 762 414 -325 -697 -328
3093 -328 407 804 440 -364 -811 -457 362 798 400 -379 -763 -419 262 626 231 -473 -751 -307 422 764
3113 764 310 -436 -756 -253 546 865 379 -362 -647 -230 466 682 223 -498 -694 -200 555 725 139 -622
3133 -622 -823 -258 505 708 162 -540 -700 -202 511 657 162 -475 -570 9 691 726 84 -607 -717 -73 588
3154 588 642 81 -597 -683 -98 545 632 32 -564 -593 5 650 590 -95 -732 -684 0 706 670 33 -585 -591 69
3177 69 657 625 -5 -559 -503 174 724 538 -162 -757 -596 112 667 533 -152 -741 -656 76 597 468 -213
3198 -213 -669 -439 290 748 501 -218 -660 -399 358 793 552 -168 -706 -478 193 617 379 -299 -729 -415
3218 -415 271 626 347 -367 -735 -382 351 773 444 -301 -714 -411 295 651 337 -322 -654 -253 393 641
$$ packed form
3073b89m60K39P78M40k88p98n06K94Q35N30k17p87m58L12P19M18l48p39l72L69
3093c28P35L97l64q04m47L54Q19M36l98p79l84L44O81L64l95p04k78M44P29L42
3113G64m54p46l20N03P99L19m86p41k85M17O96K16m59p21j96M94P55J70n86p61
3133f22k01N65P63K03n46p02j60M98P13J46m95o37r5N79O82L5o42o91j10O44O61
3154E88N4n61o78q6N85O43Q7o00n96k9N98O45o0o85o37M8O84P06l6o37o18oO60
3177F9N88l2o30n54N6O77N50j86p00n95J61P08N55j34o85n89Q5P32N21j29o81
3198b13m56K30P29M58k47p19m42K61P57M35k41p20n38K28O71M24k38o78m30L14
3218d15O86L55k79p14l68L53P33M22l29p45m13L03P06L56l14o59l32M01O46K48
$$ plain form
3238 641 288 -432 -692 -237 405 738 361 -399 -709 -310 375 666 243 -404 -667 -183 450 629 132 -527
3258 -527 -707 -196 486 726 251 -473 -653 -163 504 674 208 -445 -550 -113 491 569 46 -596 -707 -119
3278 -119 515 623 72 -571 -654 -108 538 604 100 -485 -491 3 542 571 -3 -570 -559 32 596 597 -1 -614 -619
3301 -619 -54 530 540 -5 -551 -519 42 554 493 -111 -576 -516 138 684 553 -95 -663 -567 65 628 517 -84
3323 -84 -574 -448 142 606 423 -200 -653 -443 214 645 465 -235 -735 -487 150 614 418 -167 -566 -396
3343 -396 207 629 396 -265 -633 -333 315 698 373 -284 -636 -407 291 664 377 -246 -626 -362 257 560
3363 560 260 -392 -654 -307 371 642 272 -385 -637 -280 361 664 314 -288 -556 -236 378 617 237 -377
3383 -377 -606 -182 448 606 196 -439 -672 -251 371 612 191 -440 -621 -193 410 551 129 -448 -575 -65
$$ packed form
3238F41l53p20k60M55O42L33l77p60l10L99O85K91m23o47k63M84O33J79m97o59
3258e27j80N11O82K40m75p24j80M90O67J70m66o53j05M37O04P8n23o42j11N88
3278a19O34J08n51o43q3N46O46O6n04n85oM94N39K9n74n67J1N91N64Jn98o13n
3301f19N65N84J0n45n46L2N61N12o1o04m65O0O54N46j31o48n68R6O32N63j11o01
3323h4m90J26N90M64j83o23m53K10O57M31j80p00n00K48O37M64j96n85l99J70
3343c96O03M22k33o61l68L00O48L83l25o57l52K29O98L73k87o23l80K64O19L03
3363E60l00o52k62L47O78K71l70o57k52L57O41L03l50o02k68L20O14K39l80o14
3383c77k29M24O30J58m10o35k33M21O22K41m21o31j81M28O03J41m22n77j27N10
$$ plain form
3403 -65 505 617 119 -473 -590 -110 496 601 148 -455 -542 -84 449 509 55 -507 -538 -26 502 532 -37 -579
3425 -579 -605 -50 506 534 26 -501 -508 35 544 511 -2 -451 -449 88 594 494 -71 -552 -524 53 536 488 -84
3448 -84 -569 -502 18 492 385 -141 -545 -417 152 574 428 -157 -613 -440 161 617 448 -119 -551 -412 169
3469 169 573 375 -170 -536 -337 234 616 343 -242 -628 -385 218 608 379 -227 -574 -339 199 549 302
3489 302 -239 -570 -274 283 574 305 -286 -581 -262 338 651 321 -271 -537 -288 278 556 254 -316 -544
3509 -544 -229 323 562 191 -382 -598 -208 399 611 229 -364 -541 -179 357 509 161 -360 -547 -144 392
3529 392 552 129 -425 -565 -140 429 552 142 -406 -525 -153 408 503 120 -398 -471 -47 465 517 43 -471
3550 -471 -516 -46 463 539 44 -479 -541 -42 421 467 31 -445 -437 -2 493 449 -35 -501 -461 53 505 494 -14
$$ packed form
3403f5N70J12m98n92j17M80O06J05m53o03q7M58N33O0m54n62l1N12N28L0n69n42
3425e79k6N55N56K8n08n27pN43N09l3n13m49KN37N06j00n65m81K8N77M83m8n72
3448h4m85O7N20M74j07n26m04J28N69M22j46n85m56J73O01M56j69n67m32J39N81
3469A69M04j98n45l66J99N71L82k73n85l86K43O03L90k29o06l47K35N38L50k47
3489C02n41l31K96N57K91k69n91k95L19O00L13l30n92k66K49N66K78l02n70k28
3509e44L15N52K39l71n73k16L90O07K12l82n93j77L62N36J52l48n21j87M03N36
3529C92J60m23n54j40M25N69J23m10n48j19L72N61R5l83n18p3M24N12N2m74n14
3550d71m5M70N09P6m95n23o2M99M63M6m36m76QM35M95m4m84m66M0N14M52j1n08
$$ plain form
3573 -14 -474 -480 42 470 464 -14 -466 -404 101 497 400 -131 -565 -430 101 493 377 -131 -555 -440 64 526
3595 526 423 -113 -507 -353 193 539 358 -150 -498 -306 210 572 361 -150 -539 -356 149 504 306 -221
3615 -221 -564 -358 148 474 265 -278 -537 -309 259 579 358 -216 -506 -247 273 519 308 -227 -497 -229
3635 -229 268 520 231 -278 -499 -194 328 549 236 -304 -579 -278 289 484 137 -340 -533 -211 280 490
3655 490 183 -339 -458 -101 397 563 166 -343 -488 -151 388 512 171 -330 -450 -119 362 463 55 -392
3675 -392 -504 -121 366 440 24 -451 -511 -80 411 513 128 -352 -379 16 464 439 22 -398 -442 -29 448 421
3697 421 -21 -479 -483 -14 451 455 6 -435 -419 5 382 364 -90 -465 -401 57 473 458 -53 -453 -391 115 494
3720 494 420 -37 -445 -366 98 424 334 -130 -475 -329 139 485 354 -136 -467 -345 122 479 341 -159 -478
$$ packed form
3573a4m60oN22M28om78m52O2N05L96r7n31m34J35N31L92j16n08m24J15N04M62
3595E26j03n36l94J54N46L46j81n08l48J92N16L62k11n11l89J83N05L55j98n27
3615b21l43K06N06L26k09n43k59K28N68L20k21n74k90K59N20K46k11n35k70K68
3635b29M97K52k89n09k21L05N22K21l13n40k75L01N67J95l47m77j93L22M91K10
3655D90l07n22j19L57M98J66l97n09j45L37N39J24l41n01j20L31M81J01m08m47
3675c92j12L83M87P4m16m75o0M31M91J02l85m80k7L95M48k5m17m20m4M13M77k7
3697D21m42m58mM69M65Mm49m41J6M24L77j8m54l75O4M58M16j5n11m00O2N06L79
3720D94p4m57m08P9M64L26r0m64l45J46M68L46j31m90l31J22M67L57j38n00l19
$$ plain form
3741 -478 -338 132 471 283 -150 -465 -245 252 540 301 -186 -499 -318 197 461 248 -246 -524 -314 185
3761 185 447 231 -215 -446 -175 273 524 249 -234 -476 -194 296 522 258 -222 -456 -209 279 458 200
3781 200 -278 -481 -163 273 430 95 -357 -528 -170 301 480 174 -295 -406 -130 362 463 176 -306 -418
3801 -418 -76 367 441 92 -369 -446 -83 352 444 121 -358 -453 -113 289 367 25 -419 -455 -71 336 411 6
3823 6 -377 -424 17 462 499 56 -357 -366 14 410 373 6 -387 -366 56 412 357 -59 -455 -395 -15 377 335 -98
3847 -98 -480 -395 3 377 360 -28 -363 -261 135 481 404 -18 -389 -278 150 470 333 -105 -474 -346 58
3868 58 385 264 -168 -448 -297 133 396 220 -198 -473 -299 192 456 293 -132 -415 -246 206 473 317
3888 317 -96 -354 -174 228 447 254 -244 -483 -260 174 431 214 -292 -483 -269 196 382 187 -240 -418
$$ packed form
3741d78J40M70L39j88m33l15K20M97K88k39m87l13J81N15K64k13m94k78K10M99
3761A85K62k16m46k31K71M48K51k75m83k42K82M90K26k64m80k34K47M88J79k58
3781B00m78k03L18M36J57l35m52j71L58M71J79l06m69j11K76M92J01k87m82j12
3801d18L42M43P4l49m61p7L63M35R2l23m79r5L40M02P8l42m44l6L84M07P5m05
3823Fl83m7M41M45L7m43m13rL80L96l7l67l93K1M22L56n5m16l96O0L80L92m2m33
3847i8l82Q5L98L74j7l88l35J02L96L46p7m22l71J11M28L20j37m38l69J28M04
3868E8L27j21m32k80J51M30K63j76m18k75J74M91K64j63m25k83J69M52K67j56
3888C17m13k58J80M02K19j93m98k39K23M34K57k17n06j91K14M65J86j95m27j78
$$ plain form
3908 -418 -167 257 422 186 -269 -404 -122 318 457 211 -219 -406 -135 283 411 131 -266 -441 -161 262
3928 262 349 75 -348 -443 -120 337 422 130 -310 -406 -97 280 425 90 -285 -392 -71 319 390 77 -334 -394
3950 -394 -34 393 408 42 -376 -432 -39 309 340 6 -354 -390 -28 355 368 -7 -330 -326 76 425 409 -6 -358
3973 -358 -338 22 364 330 -28 -411 -364 16 336 296 -81 -392 -319 69 367 303 -101 -393 -329 76 421 336 -46
3996 -46 -340 -258 115 393 291 -121 -407 -287 119 377 246 -191 -451 -306 95 387 263 -151 -400 -230 145
4017 145 385 241 -166 -369 -206 223 446 251 -177 -387 -190 205 437 259 -165 -404 -203 163 343 125
4037 125 -280 -442 -222 177 342 134 -240 -421 -155 265 436 208 -143 -341 -104 269 407 139 -243 -348
4057 -348 -97 273 380 92 -302 -401 -142 235 331 62 -325 -406 -127 225 325 60 -279 -346 -52 317 421
$$ packed form
3908d18K51M24J65k36m55j35K82M40J39k46m30j87K71M18J28k80l97j75K80M23
3928B62Q7k74m23r5L23M57Q5k92m40r6L09L77J45l35l75j07L21L90P1l13m11o0
3950c94L60M27J5l66m18n6L93L48L1l34l60l6L62L83J3l75l23MM02L49j6m15l52
3973c58K0L60L42l4l58l83M7L80L20m0l77l11P3L88K98o4m04k92O4M05L45q5l82
3996d6k94Q2L73K78j02m12k86J20M06K58j31m37k60J45M01K92j24m14k49J70L75
4017A45K40j44m07k03J63M29K23j95m28k10J97L95K32j78m24k39K01L66J80k18
4037A25m05j62K20L99J65k08l74j81K66M20J71k28l51j98K37L73J38k68l82j05
4057c48K51L70J07k88l94r9K59L77R6k69l87q1K79L52J00k65l39o7K94L69J04
$$ plain form
4078 421 96 -281 -352 -40 341 424 76 -283 -340 -78 300 353 29 -331 -323 -47 293 298 -34 -399 -370 -58 293
4101 293 327 -2 -329 -326 55 362 335 46 -272 -240 83 374 333 -47 -339 -332 29 313 264 -97 -390 -345 5
4124 5 322 255 -88 -364 -283 58 342 256 -88 -347 -232 134 387 285 -47 -321 -213 117 379 228 -129 -356
4146 -356 -219 131 358 207 -166 -383 -216 150 365 215 -178 -377 -207 134 339 211 -155 -335 -175 219
4166 219 396 210 -170 -343 -149 224 390 177 -202 -388 -186 166 312 126 -205 -364 -148 204 342 98
4186 98 -230 -341 -100 286 386 148 -201 -307 -93 246 330 104 -207 -341 -103 228 299 35 -294 -337 -90
4207 -90 239 327 72 -303 -345 -83 276 329 94 -256 -305 -10 299 320 44 -256 -315 -6 279 304 34 -276 -337
4230 -337 -24 265 309 38 -299 -285 -24 274 268 -24 -329 -307 10 303 293 -13 -282 -268 56 365 292 12 -290
$$ packed form
4078D21l25l77p1L12L81Q3l48l59n7K62L78N3l24l60QK76L40Nl32l65K9L12L51
4101B93L4l29l27LL81L07k7k89l18L2L23K91m1l80k92PL61K84m9l61k93M5L50
4124EL17o7l43k76Q1L41K84q6l44k59J15L66K53j02l32k74J08L30K62j51l57k27
4146c56J37L50K27j51l73k17J67L66K15j50l93j99J70L41K05j28l66j80J60L94
4166B19J77j86l80j73J94L73J66k13l79j86K02L52J46j86l31j59K16L52J38k44
4186I8l28j11K41L86J00k38l49j06K14L39Q4k26l11j34K38L31P1k64l29m3K47
4207i0L29Q8k55l75m2K62L59N3k35l50m9K95L09K1k76l00n9L09K85K5k70l10o1
4230c37L13K89M4k71l37J4K61K98ok92l05K2L17K93j0l06k69J4L24L09p3k80l02
$$ plain form
4253 -290 -236 61 293 244 -57 -318 -302 47 306 220 -89 -334 -249 68 324 251 -61 -278 -186 132 334 221
4275 221 -115 -283 -192 148 316 236 -118 -350 -212 112 308 190 -106 -325 -241 127 300 192 -133 -337 -195
4296 -195 159 360 177 -157 -321 -174 165 342 167 -162 -287 -177 190 348 155 -175 -278 -102 203 324
4316 324 150 -193 -326 -162 165 313 106 -177 -319 -100 181 327 121 -191 -272 -55 252 343 99 -235 -340
4337 -340 -76 209 305 62 -235 -297 -68 222 288 51 -258 -280 -23 246 296 45 -259 -305 -28 275 303 55
4359 55 -237 -256 -3 243 281 6 -274 -267 0 257 258 -19 -281 -282 7 305 290 8 -287 -235 0 255 211 -72
4383 -72 -305 -267 18 240 227 -41 -286 -197 64 314 258 -28 -267 -240 84 255 208 -81 -282 -189 102 293 229
4406 229 -63 -252 -209 110 295 212 -93 -283 -206 67 291 168 -105 -279 -164 135 292 181 -129 -312 -169
$$ packed form
4253b90N4K97K32m9l01k61J6L49K59q6l09k45Q5L17K56p3l12k17R2L18K02j13
4275B21l36j68R1L40J68q0l54k32J38L24J96j18k96k19Q4L68J73j08l25k04J42
4296a95L54K01j83l34j64J47L39J77j75l29j25J10L67J58j93l30j03J76L05J21
4316C24j74l43j33J64L27J48k07k83j42K19K81J46k06l12q1K17L07R1k44l34j05
4337c40K64K85R6k43k97o2K29K90O6k37l09k2K57K69N0k51l04m6K77L03K8k48
4359E5k92j9K53K46L8k75k80PK67K57Jk77k62jK89K98j5k82k95N2K35K55m4k83
4383g2k33L8K85K22j3k68k45Q9K61K50n6k86k39K7L24J71m7k89k01R3K91J91o4
4406B29k92j89M3L19J85q3l05j90P7K73K24j23k73j74J15K99J57j11l10j83J43
$$ plain form
4427 -169 138 304 142 -134 -314 -184 123 289 151 -111 -275 -115 163 293 124 -186 -325 -162 155 307
4447 307 142 -159 -298 -109 186 281 123 -174 -283 -98 169 293 55 -225 -312 -94 213 295 74 -202 -263
4468 -263 -73 189 279 60 -192 -264 -66 216 246 25 -229 -275 -28 224 300 81 -211 -254 -7 222 277 44
4490 44 -227 -259 -28 232 230 21 -252 -243 17 246 269 13 -247 -253 -21 229 203 -21 -232 -213 32 278 248 25
4514 25 -227 -187 65 288 228 -38 -260 -240 -26 221 187 -86 -280 -215 45 241 203 -42 -254 -183 89 270 211
4537 211 -77 -288 -192 57 297 202 -50 -249 -146 114 255 198 -81 -286 -207 96 270 148 -136 -297 -175
4558 -175 136 302 151 -105 -231 -150 130 271 143 -130 -260 -117 193 282 164 -95 -241 -104 149 270 143
4579 143 -144 -268 -160 111 210 56 -196 -310 -75 155 289 109 -123 -236 -63 194 288 119 -148 -242 -73
$$ packed form
4427a69L07J66j62k76j80J30L07J66j38k62j64J60K78J30j69l10j39J63L17J52
4447C07j65l01j39J89K95R5j58k97j09J85K67J24k38k80q7K18L07Q2k21k76o1
4468b63J90K62R0k19k52p2J98K82L0k21k54m6K47K52P6k19k92m3K47K29N5k33
4490D4k71l2K31K60kk09k73RK60K29K3k56k60oK32K50k6k24k11J9K45K46l0k23
4514B5k52M0K52K23o0k66k22K0K14K47l4k73j94O5K60J96l8k45k12P1K72J81n9
4537B11k88k11R6K49K40r5k52j99J03K60J41n7k79k05P9L03J74j22k84j61J22
4558a75L11J66j51k56j26Q1K80J41j28k73j30J43L10Q9j18k59j46J37K53J21j27
4579A43k87j24J08K71R9j54k52j14K35K30J34j80k32j13J73K57R4j69k67r4J69
$$ plain form
4600 -73 211 262 62 -196 -264 -59 202 264 39 -208 -264 -99 170 242 36 -191 -253 -44 196 256 68 -189 -227
4623 -227 -10 228 251 48 -210 -237 -8 247 242 18 -209 -261 -11 207 204 -8 -248 -231 7 197 168 -34 -248
4646 -248 -194 22 240 246 21 -193 -153 61 250 197 -31 -215 -178 31 251 199 -71 -253 -212 48 233 188 -57
4669 -57 -253 -197 48 249 191 -68 -226 -159 85 290 157 -83 -239 -167 92 262 177 -82 -257 -168 83 227
4691 227 94 -98 -257 -147 99 231 110 -127 -255 -126 128 268 162 -118 -237 -120 133 255 130 -119
4711 -119 -241 -77 163 256 103 -156 -225 -143 114 243 75 -179 -278 -114 127 197 80 -159 -234 -66 205 288
4733 288 108 -142 -195 -13 206 284 97 -138 -219 -79 149 213 32 -206 -239 -70 163 221 25 -202 -257 -22
4755 -22 206 227 42 -212 -208 2 224 229 28 -170 -168 29 220 193 17 -212 -192 -2 189 204 -9 -246 -234 -23
$$ packed form
4600g3K84N1k00k58o8K05K61O2k25k47n6J65K69P2k06k27o2K09K40O0j88k57l8
4623b27K17K38K3k03k58k7K29K55nk24k27n2K50K18lk12k40J7K38J90k9k02k14
4646b48N4K16K18Ok25k14M0K14J89n3k28j84L7K09K20n2k70j82M1K60J85m5k45
4669e7j96N6K45K01n8k59j58O7K44K05j33k40j56P2K59J70q5k59j75Q9K51J44
4691B27j33j92j59J10K46J32j21k37j28J29K54J40j06k80j19J17K53J22j25k49
4711a19j22J64K40R3j53k59o9Q2K57J29j68k54r9J64K41P0j17k39p5J68K71Q3
4733B88j80k50n3J82K19P8j87k35q1J40K28O4j81k38l3J69K33N8j96k27n5K35
4755b2K28K1j85k54MK10K22Nk01j98KJ97J91k7j76k29K0J90J91J5k13k37J2K11
$$ plain form
4779 -23 199 166 -5 -213 -196 12 206 183 -13 -232 -157 65 259 205 -9 -175 -177 68 227 192 -36 -206 -167
4802 -167 36 168 136 -107 -293 -222 46 206 157 -109 -217 -163 88 233 183 -46 -208 -121 74 241 134 -86
4824 -86 -225 -139 81 244 138 -82 -233 -124 104 207 139 -99 -214 -142 80 214 125 -115 -191 -97 138 249
4846 249 126 -102 -213 -90 129 242 93 -145 -217 -85 120 178 46 -156 -232 -87 131 214 57 -174 -240 -83
4868 -83 153 210 56 -129 -169 -30 177 246 63 -120 -172 -8 183 210 30 -195 -243 -92 122 208 14 -161 -219
4891 -219 -26 169 185 33 -193 -196 -31 191 217 21 -162 -169 16 201 228 34 -176 -160 -17 198 165 -22 -207
4914 -207 -201 -16 179 137 -61 -207 -189 -3 204 196 -12 -173 -177 50 222 171 -22 -202 -151 75 228 173 -44 -185
4938 -185 -133 33 237 137 -50 -219 -189 33 182 85 -101 -241 -144 104 223 168 -62 -153 -92 127 221 155 -91
$$ packed form
4779b3K22l3j71k08J7K08J94k3j96k19P5K22J94n4k14j66kK45J59l5k28j70L9
4802a67K03J32l2k43j86P1K68J60m9k66j08N4K51J45n0k29j62Q7J95J67j07k20
4824h6j39Q6K20J63j06k20j51J09K28J03o8k38j15P2K22J34q9k40p6R4K35J11
4846B49j23k28j11J23K19J13j49k38p2J32K05N8j32k02p6J45K18Q3j57k31o6J57
4868h3K36N7j54j85m0J39K07O9j83j83n2J64J91K7j80k25m8J51K14Q6j94j75n8
4891b19J93J95J6j52k26lJ65K22K6j96j83pJ85J85K7j94k10J6J43K15l3j87j85
4914b07OJ85J95m2j98j46J8J86K07qk08j61mK27J72n1j93j80N1K26J53n5k17j41
4938a85N2J66K04j00j87j69L0K22J49r7j86j40R7K48J19n5k30r1O1K19R4o6k46
$$ plain form
4961 -91 -185 -127 80 182 134 -93 -225 -110 101 203 113 -125 -210 -149 86 191 81 -125 -234 -104 104 236
4983 236 113 -93 -177 -91 141 227 63 -120 -221 -87 112 204 102 -123 -182 -65 138 176 46 -130 -197 -97
5005 -97 111 154 21 -149 -244 -62 163 226 78 -119 -179 -34 177 204 24 -137 -189 -50 137 158 10 -177 -220
5028 -220 -29 170 194 5 -174 -193 -27 158 161 -23 -139 -167 0 167 169 17 -183 -173 25 187 182 -18 -184
5051 -184 -199 -20 154 121 -7 -188 -160 17 190 126 -51 -188 -152 35 177 129 -37 -200 -148 36 227 159 -25
5074 -25 -142 -101 85 200 131 -54 -196 -163 47 160 108 -92 -225 -151 65 177 153 -43 -157 -85 83 200 103
5097 103 -71 -183 -103 100 167 124 -91 -190 -72 112 208 85 -97 -190 -87 97 184 60 -94 -197 -65 93
5119 93 201 79 -102 -192 -45 120 169 80 -122 -168 -66 111 191 73 -112 -174 -67 169 178 29 -125 -208 -91
$$ packed form
4961i1r4N8K07J02m8k27j32J15K11J02r0k38q5O1K35J05j10k06j09J30K08J32
4983B36j23k06q4Q6K32Q6j64j83j01J34J99R2j02k25n9J17K03L8j30j76o7J00
5005i7K08M3j33j70r5J82K25O3j48j97o0J45K11K7j80j61n2J39J87K1j48j87m3
5028b20J91J99K4j89j79j9J66J85Lj84j16k8J67J67Kj52k00J0J98J62nk00j66
5051a84j5J79J74l3j28j81K8J77J73o4j77j37L6J87J42m8j66j63N2J84J91o8j84
5074b5j17M1J86J15o9j85j42L3K10J13n2k00j33P4K16J12k4j96j14P2J68J17r7
5097A03j74j12Q0K03O7m3k15r9J18J84R6j23j82r3J03J84Q7j24j54j03J32J58
5119I3J08j22j81r0J47J65M9q9k02m6J02J77Q0j18j85o2J07K36Rj49j54q3J17
$$ plain form
5142 -91 107 165 32 -155 -203 -52 120 185 19 -100 -136 -17 139 182 49 -119 -178 -33 161 184 29 -133 -130
5165 -130 -45 145 170 3 -153 -161 -22 132 175 10 -165 -159 -5 174 160 3 -156 -157 11 157 155 0 -155 -145
5189 -145 19 149 159 0 -157 -142 17 166 125 -13 -183 -157 -6 158 150 -48 -166 -103 61 180 144 -53 -153
5212 -153 -117 70 210 131 -26 -156 -94 42 159 93 -70 -168 -91 86 182 127 -72 -190 -104 75 151 83 -40 -160
$$ packed form
5142i1J98N8j33j87m8J51J72O5j66j19l6J19J56M3j33j68n9J45J94K3j55j62L
5165a30Q5J90K5j67j56qJ39J54M3j65j75OJ54J79j4j57j59jJ68J46kj55j55J0
5189a45J64J30J0j59j57J5J59J49m1j38j70K6J51J64qj98j18O3J64J19l6j97j00
5212a53L6J87J40p9j57j30O2J36J17o6j63r8P7J77R6n5j99j18Q6J79P6o8j23j20
$$ [...]
8191I
##END NTUPLES=NMR FID
##END=
