##TITLE=1H_AM_NVBENZ
 
 8 sc, 
 24.3.2023
##JCAMPDX= 6.0         $$ Bruker NMR JCAMP-DX V2.0
##DATA TYPE= NMR FID
##DATA CLASS= NTUPLES
##ORIGIN= UXNMR, Bruker Analytische Messtechnik GmbH
##OWNER= root
$$ XWIN-NMR		Version 3.5
$$ Fri Mar 24 14:14:50 2023 Russian Standard Time (UT+4h)  she@DPX200
##.OBSERVE FREQUENCY= 200.13135
##.OBSERVE NUCLEUS= ^1H
##.DELAY= (6, 6)
##.ACQUISITION MODE= SIMULTANEOUS
##.ACQUISITION SCHEME= undefined
##.AVERAGES= 8
##.DIGITISER RES= 18
##SPECTROMETER/DATA SYSTEM= spect
##.PULSE SEQUENCE= zg30
##.SOLVENT NAME= DMSO
##.SHIFT REFERENCE= (INTERNAL, DMSO, 0, 15.7039)
##AUDIT TRAIL= $$ (NUMBER, WHEN, WHO, WHERE, WHAT)
$$ ##TITLE= Audit trail, XWIN-NMR		Version 3.5
$$ ##JCAMPDX= 5.01
$$ ##ORIGIN= Bruker BioSpin GmbH
$$ ##OWNER= she
$$ F:/spectra/data/she/nmr/H-F/1/audita.txt
$$ ##AUDIT TRAIL=  $$ (NUMBER, WHEN, WHO, WHERE, WHAT)
(   1,<2023-03-24 14:13:37.95 +0400>,<she>,<DPX200>,
      <created by zg, POWCHK disabled, PULCHK disabled
       configuration hash MD5:
       00 E9 B6 7A A2 85 ED C7 34 08 36 98 17 FE 4E 26
       data hash MD5: 16K
       1F FC 9A 5C B3 A5 4F 3D 0D C5 92 A8 BF EF 63 1A>)
$$ ##END=
$$ 
$$ hash MD5
$$ 55 47 1D B0 20 5A 7D 0E 57 6F A6 15 93 E9 84 91
##$RELAX= 
##$RELAX= 
##$RELAX= 
##$RELAX= 
##$RELAX= 
##$RELAX= 
$$ Bruker specific parameters
$$ --------------------------
##$DU= <F:/spectra>
##$EXPNO= 1
##$NAME= <H-F>
##$PROCNO= 1
##$TYPE= <nmr>
##$USER= <she>
##$AMP= (0..31)
100 100 100 100 100 100 100 100 100 100 100 100 100 100 100 100 100 100 
100 100 100 100 100 100 100 100 100 100 100 100 100 100 
##$AQSEQ= 0
##$AQ_mod= 1
##$AUNM= <au_zg>
##$AUTOPOS= <>
##$BF1= 200.13
##$BF2= 200.13
##$BF3= 200.13
##$BF4= 200.13
##$BF5= 200.13
##$BF6= 200.13
##$BF7= 200.13
##$BF8= 200.13
##$BYTORDA= 1
##$CFDGTYP= 0
##$CFRGTYP= 5
##$CHEMSTR= <none>
##$CNST= (0..31)
1 1 145 1 1 1 1 1 1 1 1 1 1 1 1 1 1 1 1 1 1 1 1 1 1 1 1 1 1 1 1 1 
##$CPDPRG= <>
##$CPDPRG1= <>
##$CPDPRG2= <>
##$CPDPRG3= <>
##$CPDPRG4= <mlev>
##$CPDPRG5= <mlev>
##$CPDPRG6= <mlev>
##$CPDPRG7= <mlev>
##$CPDPRG8= <mlev>
##$CPDPRGB= <>
##$CPDPRGT= <>
##$D= (0..31)
0 1.2 0 0 0 0 0 0 0 0.06 0 0.03 0 0 0 0 0.0002 0 0 0 0 0 0 0 0 0 0 0 0 
0 0 0 
##$DATE= 1679652817
##$DBL= (0..7)
120 120 120 120 120 120 120 120 
##$DBP= (0..7)
150 150 150 150 150 150 150 150 
##$DBP07= 0
##$DBPNAM0= <>
##$DBPNAM1= <>
##$DBPNAM2= <>
##$DBPNAM3= <>
##$DBPNAM4= <>
##$DBPNAM5= <>
##$DBPNAM6= <>
##$DBPNAM7= <>
##$DBPOAL= (0..7)
0.5 0.5 0.5 0.5 0.5 0.5 0.5 0.5 
##$DBPOFFS= (0..7)
0 0 0 0 0 0 0 0 
##$DE= 6
##$DECBNUC= <off>
##$DECIM= 32
##$DECNUC= <off>
##$DECSTAT= 4
##$DIGMOD= 1
##$DIGTYP= 9
##$DL= (0..7)
0 120 120 120 120 120 120 120 
##$DP= (0..7)
150 150 150 150 150 150 150 150 
##$DP07= 0
##$DPNAME0= <>
##$DPNAME1= <>
##$DPNAME2= <>
##$DPNAME3= <>
##$DPNAME4= <>
##$DPNAME5= <>
##$DPNAME6= <>
##$DPNAME7= <>
##$DPOAL= (0..7)
0.5 0.5 0.5 0.5 0.5 0.5 0.5 0.5 
##$DPOFFS= (0..7)
0 0 0 0 0 0 0 0 
##$DQDMODE= 0
##$DR= 18
##$DS= 0
##$DSLIST= <SSSSSSSSSSSSSSS>
##$DSPFIRM= 0
$$ [...]
##$SUBNAM2= <"">
##$SUBNAM3= <"">
##$SUBNAM4= <"">
##$SUBNAM5= <"">
##$SUBNAM6= <"">
##$SUBNAM7= <"">
##$SUBNAM8= <"">
##$SUBNAM9= <"">
##$SW= 18.05172834244
##$SWIBOX= (0..15)
0 0 2 0 0 0 0 0 0 0 0 0 0 0 0 0 
##$SW_h= 3612.71676300578
##$TD= 16384
##$TD0= 1
##$TE= 0
##$TE2= 300
##$TE3= 300
##$TEG= 300
##$TL= (0..7)
0 120 120 120 120 120 120 120 
##$TP= (0..7)
150 150 150 150 150 150 150 150 
##$TP07= 0
##$TPNAME0= <>
##$TPNAME1= <>
##$TPNAME2= <>
##$TPNAME3= <>
##$TPNAME4= <>
##$TPNAME5= <>
##$TPNAME6= <>
##$TPNAME7= <>
##$TPOAL= (0..7)
0.5 0.5 0.5 0.5 0.5 0.5 0.5 0.5 
##$TPOFFS= (0..7)
0 0 0 0 0 0 0 0 
##$TUNHIN= 0
##$TUNHOUT= 0
##$TUNXOUT= 0
##$USERA1= <user>
##$USERA2= <user>
##$USERA3= <user>
##$USERA4= <user>
##$USERA5= <user>
##$V9= 5
##$VALIST= <valist>
##$VCLIST= <CCCCCCCCCCCCCCC>
##$VD= 0
##$VDLIST= <DDDDDDDDDDDDDDD>
##$VPLIST= <PPPPPPPPPPPPPPP>
##$VTLIST= <TTTTTTTTTTTTTTT>
##$WBST= 1024
##$WBSW= 4
##$XGAIN= (0..3)
0 0 0 0 
##$XL= 0
##$YL= 0
##$YMAX_a= 80892
##$YMIN_a= -193543
##$ZGOPTNS= <>
##$ZL1= 120
##$ZL2= 120
##$ZL3= 120
##$ZL4= 120
##$ABSF1= 10
##$ABSF2= 0
##$ABSG= 5
##$ABSL= 3
##$ALPHA= 0
##$AQORDER= 0
##$ASSFAC= 0
##$ASSFACI= 0
##$ASSFACX= 0
##$ASSWID= 0
##$AUNMP= <proc_1d>
##$AZFE= 0.1
##$AZFW= 0.1
##$BCFW= 1
##$BC_mod= 2
##$BYTORDP= 1
##$COROFFS= 0
##$CY= 11.3945322036743
##$DATMOD= 1
##$DC= 2
##$DFILT= <>
##$DTYPP= 0
##$F1P= 2.36226072786647
##$F2P= -0.459571619588291
##$FCOR= 0.5
##$FTSIZE= 0
##$FT_mod= 4
##$GAMMA= 1
##$GB= 0.15
##$INTBC= 1
##$INTSCL= 1
##$ISEN= 128
##$LB= 0.24
##$LEV0= 0
##$LPBIN= 0
##$MAXI= 10000
##$MC2= 0
##$MEAN= 0
##$ME_mod= 0
##$MI= 1.114404
##$NCOEF= 0
##$NC_proc= 0
##$NLEV= 6
##$NOISF1= 3.799351
##$NOISF2= 2.8
##$NSP= 1
##$NTH_PI= 0
##$NZP= 0
##$OFFSET= 15.70392
##$PC= 1
##$PHC0= -19188.14
##$PHC1= 14.80078
##$PH_mod= 1
##$PKNL= yes
##$PPARMOD= 0
##$PSCAL= 0
##$PSIGN= 0
##$REVERSE= no
##$SF= 200.130013532006
##$SI= 16384
##$SIGF1= 3
##$SIGF2= 2
##$SINO= 400
##$SIOLD= 16384
##$SREGLST= <1H.CDCl3>
##$SSB= 0
##$STSI= 0
##$STSR= 0
##$SW_p= 3612.71676300578
##$SYMM= 0
##$S_DEV= 0
##$TDeff= 0
##$TDoff= 0
##$TI= <>
##$TILT= no
##$TM1= 0
##$TM2= 0
##$TOPLEV= 0
##$USERP1= <user>
##$USERP2= <user>
##$USERP3= <user>
##$USERP4= <user>
##$USERP5= <user>
##$WDW= 1
##$XDIM= 8192
##$YMAX_p= 0
##$YMIN_p= 0
$$ End of Bruker specific parameters
$$ ---------------------------------
##NTUPLES= NMR FID
##VAR_NAME=  TIME,          FID/REAL,        FID/IMAG
##SYMBOL=    X,             R,               I
##VAR_TYPE=  INDEPENDENT,   DEPENDENT,       DEPENDENT
##VAR_FORM=  AFFN,          ASDF,            ASDF
##VAR_DIM=   8192,          8192,            8192
##UNITS=     SECONDS,       ARBITRARY UNITS, ARBITRARY UNITS
##FACTOR=    0.0002768,     1,               1
##FIRST=     0,             0,               0
##LAST=      2.2672688,     0,               0
##MIN=       0,             -193543,         0
##MAX=       2.2672688,     80892,           0
$$ Real data points
##PAGE= N=1
##DATA TABLE= (X++(R..R)), XYDATA
0@%%%%%%%%%%%%%%%%%%%%%%%nJ3j6J6j6J6j6J7k2K9l2L3l8M5m9N4o1O9p7Q5r6
$$ 0 0 0 0 0 0 0 0 0 0 0 0 0 0 0 0 0 0 0 0 0 0 0 0 -5 8 -8 8 -8 8 -8 9 -13 16 -16 17 -21 24 -25 29 -32 37 -40 45 -51
44e1J04j14J30j45J60j75J91k11K33k55K81l12L46l84M28m81N44o18P09q28R90
$$ -51 53 -61 69 -76 84 -91 100 -111 122 -133 148 -164 182 -202 226 -255 289 -329 380 -448 542
65E42j214J556k155L489j2254M884J8311r061j8444j9610j958J5024K6297J8164
$$ 542 -672 884 -1271 2218 -10036 -5152 13159 4098 -14346 -33956 -35914 -20890 5407 23571
79B3571J003j8074k2707j3477O013K0377K1859P067j1752k4157k1374o059J2273
$$ 23571 24574 6500 -16207 -29684 -23671 -3294 18565 25632 13880 -10277 -31651 -37710 -25437
92b5437J9509J2494m895k0867k5369j4571K888J5860J5355J994j5634k5149k0483
$$ -25437 -5928 6566 1671 -19196 -44565 -59136 -56248 -40388 -25033 -23039 -38673 -63822 -84305
105h4305m613J1411J7590R506p362k1002k2157j0550P022J8747J6798L326j2190
$$ -84305 -88918 -77507 -59917 -50411 -57773 -78775 -100932 -111482 -104460 -85713 -68915 -65589 -77779
118g7779j9530j3263K597J7508K1819J3183k056j3733j3796j851J3798K2828J9823
$$ -77779 -97309 -110572 -107975 -90467 -68648 -55465 -57521 -71254 -85050 -86901 -73103 -50275 -30452
131c0452O724p643j3252o488P778K0342K2770J3229j665j1876j0909M76J4707
$$ -30452 -23728 -31371 -44623 -51111 -43333 -22991 -221 13008 11343 -533 -11442 -10966 3741
144C741K2106J7401L831r535j4194p167O741J7727J8207P948o461j5799j3831
$$ 3741 25847 43248 47079 37544 23350 16183 22924 40651 58858 66806 60345 44546 30715
157C0715k293J0456J5933J0298k970j5076j8015j0276K601J2082J1615J382j1578
$$ 30715 28422 38878 54811 65109 62139 47063 29048 18772 21373 33455 45070 46452 34874
170C4874j8676j5424m030P920J2345O336n847j5968j7436r060L685J2077J0773
$$ 34874 16198 774 -3256 4664 17009 23345 17498 1530 -15906 -24966 -21281 -9204 1569
183A569R22j0998j6848j2383p29J0370J3826P376m586j3730j3753m785P401J4795
$$ 1569 2491 -8507 -25355 -37738 -38467 -28097 -14271 -6895 -11481 -25211 -38964 -43749 -36348 -21553
197b1553J2538K273q743j3134q029L324J3397J5277Q039l232j1230j0545j554
$$ -21553 -9015 -6742 -15485 -28619 -36648 -33324 -19927 -4650 3389 157 -11073 -21618 -23172
210b3172R515J5096J1741J635q684j2136o613M002J2516J3365N750n382j2390
$$ -23172 -13657 1439 13180 14815 6131 -6005 -12618 -8616 3900 17265 23015 17633 5243
223E243j0775j889Q389J3219R079j268j0765j3245p227L439J1375J1200L155p432
$$ 5243 -5532 -7421 968 14187 23266 21998 11233 -2012 -9239 -5800 5575 16775 19930 12498
237A2498j3544j1111j704Q137J1786P115k917j1575j2895o101M154J1082J0206
$$ 12498 -1046 -12157 -13861 -5724 6062 13177 10260 -1315 -14210 -20311 -16157 -5075 5131
250E131K047p742j2505r155N1R177J2052O699k933j0441j0932l926O067J2164
$$ 5131 7178 -564 -13069 -22224 -22173 -12996 -944 5755 2822 -7619 -18551 -22477 -16410 -4246
264d246J0279J975p285j1442p527J961J0374J2176O395l424j0524j0090k562P002
$$ -4246 6033 8008 723 -10719 -18246 -16285 -5911 6265 12660 9236 -1288 -11378 -13940 -6938
278f938J2133R599Q10q192j1224o575K617J0304J1207M672m772j0776r554j887
$$ -6938 5195 14794 15604 7412 -3812 -10387 -7770 2534 13741 18413 13641 2865 -6689 -8576
292h576P108J1207P797p90q895j1098n886L197R910R938L325n782j1016q904r77
$$ -8576 -1468 9739 17536 16746 7851 -3247 -9133 -5936 3974 13912 17237 11455 439 -8465 -9442
307i442P472J0922P003j797r364j0613m928M055J0337R623K396o367j0803q088
$$ -9442 -1970 8952 15955 14158 4794 -5819 -10747 -6692 3645 13268 15664 9297 -1506 -9594
321i594Q0Q185J0646O019k607r501j0030l859M821R998Q517J243p050j0604p174
$$ -9594 -9514 -1329 9317 15336 12729 3228 -6802 -10661 -5840 4158 12675 13918 6868 -3736 -10910
336a0910P88P994R700M664l773r787r510l234N037R653P463K7p587j0439o618
$$ -10910 -10122 -2128 7572 12236 8463 -1324 -10834 -14068 -9031 622 8085 8112 525 -9914 -16532
351a6532J571Q434R372L926m200r729q810j944O126J0012P280k49p510r532m963
$$ -16532 -14961 -6527 2845 6771 2571 -7158 -15968 -17912 -11786 -1774 5506 5257 -2253 -11785 -16748
366a6748L066R240R461L642m256q787p073k35P256J0259O892n39o988q228l393
$$ -16748 -13682 -4442 5019 8661 4405 -4382 -11455 -11690 -4434 5825 12717 12178 5190 -3038 -6431
381f431M264R576Q995K968m544q588o352N49P347R605N754j804q017q629l415
$$ -6431 -2167 7409 16404 19372 14828 6240 -112 437 7784 17389 23143 21339 13322 4693 1278
396A278L914Q718P526J046o291r617o833J00O600Q197L731l631r044q985l483
$$ 1278 5192 13910 21436 22482 16191 6574 -259 -159 6441 14638 18369 14738 5694 -3291 -6774
411f774L708P678N844n01p165r685o387N66O314P244K735m269q920q110k397M425
$$ -6774 -3066 4612 10456 9955 2790 -6895 -13282 -12716 -6402 842 3577 -692 -9612 -17722 -20119 -15694
427a5694P984N753n67o676q498m743K181P761Q137L232l475p666o405l96O273
$$ -15694 -7710 -1957 -2524 -9200 -17698 -22441 -20260 -12499 -4362 -1130 -4605 -12271 -18676 -19072 -12799
442a2799R076O350r5n967p266l090L650Q401Q106K926l702p244n388M71O428Q532
$$ -12799 -3723 2627 2532 -3435 -10701 -13791 -10141 -1740 6366 9292 5590 -1654 -7042 -6571 -143 8389
458H389N283j166o414p047k773L617P713O723J331m890p886n689K51N820P199
$$ 8389 13672 12506 6092 -955 -3728 -111 7602 14325 15656 10766 2880 -2809 -2558 3262 10461
473A0461L620k740p608p684k978L242O889N572L9n953q224n434O38N975O974L003
$$ 10461 14081 11341 3733 -3951 -6929 -3687 3202 8774 8813 2860 -5364 -10798 -10160 -4185 2789 5792
489E792l123p267o696j722M422P549N593J15n211o895l655K383P060P373L280
$$ 5792 2669 -4598 -11294 -13016 -8594 -1045 4548 4663 -548 -7443 -11098 -8715 -1655 5718 8998
504H998k587o186n043N4N633Q166N906L13m772n924k389L326P655P517K919k934
$$ 8998 6411 225 -4818 -4764 869 9035 14941 15254 10482 4558 2169 5495 13150 20667 23586 20652
520B0652o223m850K84N694P586M729j034n937o758l027K674O346N560P99m879
$$ 20652 14429 9579 9863 15557 23143 27872 26838 20901 14143 11116 13790 20136 25696 26495 21616
535B1616p700n784n91M302N681K519l132p406p484l558J901N139L963q48o014
$$ 21616 13916 8132 7541 11843 17524 20043 16911 9505 2021 -1537 364 5503 9466 8618 2604
550B604q107n890o21M092N010J637l675p527p239k806K641N584M155o65n613p253
$$ 2604 -5503 -11393 -12014 -7922 -2912 -1275 -4950 -12477 -19716 -22522 -19881 -14297 -10142 -10807 -16420 -23673
566b3673m372J044N474O109K496k829o170n219p04M510O986M996O3m460n567k512
$$ -23673 -28045 -27001 -21527 -15418 -12922 -15751 -21921 -27140 -27844 -23334 -16348 -11352 -11289 -15749 -21316 -23828
582b3828K722O601O493K599k474n397m174M20N191O959M629l14m609n334k044
$$ -23828 -21106 -14505 -8012 -5413 -7887 -13284 -17458 -17038 -11847 -4888 -259 -573 -5182 -10516 -12560
597a2560L004O419N943J778l249n808m246L20M896O299L540j497n437n799k288
$$ -12560 -9556 -3137 2806 4584 1335 -4473 -8719 -8399 -3503 2796 6336 4839 -598 -6397 -8685
612h685K734N769M800N38m172o278m280M61M652N550K677k177n652n396j621L156
$$ -8685 -5951 -182 4618 5156 984 -5294 -9574 -9113 -4461 1089 3766 1589 -4063 -9459 -11080 -7924
628g924N735M539K39m201n668l386J295N204N789K584k104n200m676p56L950O193
$$ -7924 -2189 2350 2589 -1612 -7280 -10666 -9371 -4167 1622 4206 2102 -3098 -7774 -8530 -4580 1613
644A613M564J96l989n303k614K054N633N768K376k375n157m188j53M194N954L951
$$ 1613 6177 6373 2384 -2919 -5533 -3479 2154 7922 10298 7923 2766 -1422 -1575 2619 8573 12524
660A2524n72m488n182k370K088N229M817J166l257n559m252j98L841N089K806
$$ 12524 11952 7464 2282 -88 2000 7229 12046 13212 9955 4396 144 -54 3787 8876 11682
675A1682j561n140n480k389K055M781M104M17l900n849m121K1L822M884K288k063
$$ 11682 10121 4981 -499 -2888 -833 3948 8052 8469 4569 -1280 -5401 -5380 -1558 3326 5614 3551
691C551n273n171j929K475M925L894L4l922n371l395Q34M399M841K134k058m819
$$ 3551 -1722 -6893 -8822 -6347 -1422 2472 2506 -1416 -6787 -10182 -9348 -4949 -108 2026 -32 -4851
707d851m310q52L224N144L805Ql744m725k499J565M685M897J900k192m621l832
$$ -4851 -9161 -10013 -6789 -1645 2160 2168 -1576 -6301 -8800 -7235 -2550 2347 4247 2055 -2566 -6398
723f398l77L510N208L456m04l838m666k209J832M701M492J360k563m768l645m5
$$ -6398 -6775 -3265 1943 5399 4995 1157 -3509 -5718 -3886 815 5307 6667 4104 -664 -4309 -4354
739d354L534M805K831r99m178m495j795J968M484L888O53k996m688l241K95L581
$$ -4354 -820 3985 6816 5817 1639 -2856 -4651 -2683 1801 5689 6342 3346 -1342 -4583 -4288 -707
755g07M490K250j421m178m224j388K304M467L610L49l115m575k856P33L788M401
$$ -707 3783 6033 4612 434 -3790 -5178 -2874 1593 5203 5552 2437 -2138 -4994 -4261 -473 3928
771C928K027j653m218l898r33K590M506L312n9l282m350k399J093L911M047J476
$$ 3928 5955 4302 84 -3814 -4747 -2157 2349 5661 5602 2320 -2030 -4429 -3336 575 4622 6098
787F098j978m168l529m93K809M227K762m86l442m146k005J379L817L738J075k271
$$ 6098 4120 -48 -3577 -4070 -1261 2966 5728 5242 1800 -2346 -4351 -2972 845 4583 5658 3387
803C387m158l253j88K915M173K506p78l519l969j699J664L954L559Q01k382m053
$$ 3387 -771 -4024 -4212 -1297 2876 5382 4604 1085 -2884 -4583 -2919 1035 4594 5395 3013 -1040
819a040k873K24L194M049K202j005l511l598j199K023L952L262M39k561l794k463
$$ -1040 -3913 -3689 -495 3554 5756 4751 1240 -2358 -3557 -1534 2418 5680 6119 3558 -236 -2699
835b699N90L318L803J791j339l532l381r72K196L823K840N7k821l869k353P66
$$ -2699 -2109 1209 5012 6803 5464 1932 -1449 -2421 -225 3598 6438 6495 3674 -195 -2548 -1782
851a782L258L494J415j709l752l326p54K245L666K501l87l070l784k035R66L278
$$ -1782 1476 4970 6385 4676 924 -2402 -3156 -911 2755 5256 4869 1799 -1985 -4020 -3054 224
867B24L274R05j969l699k975k89K444L552K178o57l098l497j516J392L367L140
$$ 224 3498 4403 2434 -1265 -4240 -4529 -2085 1467 3645 2988 -110 -3607 -5123 -3731 -364 2776
883B776Q04k067l538k531J31K711L631K117p72l055l252j177J659L520L039N28
$$ 2776 3580 1513 -2025 -4556 -4425 -1714 1917 4034 3262 207 -3045 -4222 -2563 957 3996 4524
899D524k180l436k370L80K896L433J669j073l158l146r26J844L343K547Q0k481
$$ 4524 2344 -1092 -3462 -3082 -186 3247 4916 3843 685 -2461 -3387 -1543 1800 4347 4427 1946
915A946l477k111N63K783L094J238j506l339l003p37J831L195K257k67k716l419
$$ 1946 -1531 -3642 -3079 -296 2798 4036 2530 -809 -3812 -4549 -2718 477 2734 2467 -249 -3668
931c668j936P35K850K962J060j658l288k753m10K158L219K201l87k703l089j429
$$ -3668 -5604 -4869 -2019 943 2003 345 -2943 -5696 -6106 -3948 -729 1472 1085 -1618 -4707 -6136
947f136J190L046K947Q85j725l031k235J14K480L289J989n53k575k793r77J568
$$ -6136 -4946 -1900 1047 1932 207 -2824 -5059 -4945 -2465 824 2813 2260 -315 -3108 -4085 -2517
963b517L195K791O41j765k926k014M02K616L172J698p82k688k732q80J636L063
$$ -2517 678 3469 4110 2345 -581 -2595 -2193 423 3595 5293 4511 1823 -909 -1789 -153 2910
979B910K464K56k101l031j971M38K533K849J219j222k870k693p18J693K862K013
$$ 2910 5374 5630 3529 498 -1473 -1035 1498 4347 5566 4344 1474 -1219 -1937 -244 2618 4631
995D631j98k307l019j721O55K489K586Q72j456k933k469m54J774K783J843l87
$$ 4631 4433 2126 -893 -2614 -1959 530 3116 3988 2532 -401 -2870 -3324 -1550 1233 3076 2689
1011B689k395k886j463Q36K582K529P49j539k846k241j43J948K790J730n22k421
$$ 2689 294 -2592 -4055 -3219 -637 1892 2641 1102 -1744 -3985 -4128 -2180 610 2340 1818 -603
1027f03k679j113J104K580K374M75j714k757j926J33K027K644J375q19k467k494
$$ -603 -3282 -4395 -3291 -711 1663 2138 424 -2333 -4259 -4126 -2099 545 1920 1101 -1366 -3860
1043c860q61J242K525K076J80j874k694j753K91K087K446J172j006k533k354o89
$$ -3860 -4721 -3479 -954 1122 1302 -572 -3266 -5019 -4728 -2641 -195 977 -29 -2562 -4916 -5605
1059e605J379K490J917Kj973k578j510N36K196K388R76j154k404k054l39J649
$$ -5605 -4226 -1736 181 183 -1790 -4368 -5878 -5342 -3146 -758 218 -936 -3340 -5394 -5733 -4084
1075d084K512J750j76j931k330j121Q77K307K271Q06j221k313j774kJ750K506
$$ -4084 -1572 178 2 -1929 -4259 -5380 -4503 -2196 75 881 -340 -2653 -4427 -4429 -2679 -173
1091a73J614l26j972k202r16R96K347K202N77j332k299j699R9J865K407J361n43
$$ -173 1441 1115 -857 -3059 -3975 -2979 -632 1570 2147 815 -1484 -3183 -3084 -1219 1188 2549 2006
1108B006k047k189p82J123K281J914K68j525k328j499K66J849K222J056q09k134
$$ 2006 -41 -2230 -3012 -1889 392 2306 2574 1049 -1279 -2778 -2512 -663 1559 2615 1806 -328
1124c28j996n66J235K229J705M6j622k217j323M49J941K124Q93q94k103j870l79
$$ -328 -2324 -2890 -1655 574 2279 2325 703 -1514 -2837 -2388 -447 1677 2570 1676 -427 -2297 -2676
1141b676J365K230J591o8j686k142j129O37J991K031P31j056k090j689j57J482
$$ -2676 -1311 919 2510 2442 756 -1386 -2515 -1878 113 2144 2875 1819 -271 -1960 -2117 -635
1157f35K182J360l32j777k019r07P88K000J794M25j220k100j559kJ537K022J121
$$ -635 1547 2907 2575 798 -1221 -2128 -1340 660 2454 2879 1659 -441 -2000 -2002 -465 1557 2678
1174B678n14j852j967p97Q73J943J688K75j334k094j437J26J576J974J011o38
$$ 2678 2164 312 -1655 -2452 -1579 364 2052 2327 993 -1101 -2538 -2412 -836 1138 2149 1511
1190A511j872j856o01J047J980J570J13j386j979j198L83J716J920Q53p42j827
$$ 1511 -361 -2217 -2818 -1771 209 1779 1892 506 -1473 -2671 -2288 -572 1348 2201 1459 -368
1206c68j621l03J216J994J474kj427j840r90N49J777J849P23q29j796j542k11
$$ -368 -1989 -2292 -1076 918 2392 2390 963 -877 -1867 -1318 459 2308 3031 2202 406 -1136 -1347
1223a347J303J943J323j43j496j827r10O42J762J691N22r97j846j442o8J337J822
$$ -1347 -44 1899 3222 3079 1583 -244 -1154 -512 1250 2941 3463 2466 620 -822 -890 447 2269
1240B269J091m00j625j743p60P39J701J505K66j178j842j331O8J373J717Q81n44
$$ 2269 3360 2960 1335 -408 -1168 -429 1272 2777 3043 1865 23 -1308 -1240 133 1850 2731 2187
1257B187j661j700o04Q45J698J408J59j235j807j166K12J425J705Q14o37j649
$$ 2187 526 -1174 -1778 -933 765 2173 2332 1097 -710 -1876 -1664 -239 1466 2280 1643 -6
1273fj539m31R72J753J296J0j250j697r68M15J545J612O30p29j596j362j60J114
$$ -6 -1545 -1976 -1004 749 2045 2055 805 -892 -1860 -1445 100 1712 2342 1613 17 -1345 -1505 -391
1291c91J702J189j18j287j569p72N67J562J550N18q10j548j255q1J194J668J054
$$ -391 1311 2500 2382 1095 -474 -1246 -679 883 2433 2951 2141 593 -662 -743 451 2119 3173
1308C173k15j317j514o91O58J563J408L64r04j561j130N4J219J568Q57m03j391
$$ 3173 2958 1641 127 -564 94 1657 3065 3429 2525 964 -166 -112 1107 2675 3532 3129 1738
1325A738j442n23P33J497J225J16j049j556j029J42J229J424O42n76j443j395
$$ 1738 296 -227 506 2003 3228 3344 2295 739 -290 -148 1081 2505 3147 2571 1128 -267
1341b67m31P71J413J078Mj125j537r57K46J211J342N35o47j445j295k94Q42J414
$$ -267 -698 73 1486 2564 2568 1443 -94 -1051 -805 406 1748 2283 1636 191 -1104 -1398 -556 858
1359H58R82j33j158j443p60L89J281J266L95p37j395j109q5R79J385Q64k19j159
$$ 858 1840 1707 549 -894 -1654 -1265 16 1282 1677 940 -455 -1564 -1649 -670 715 1579 1360 201
1377B01j330n67N51J280J202L01p93j344j002K1J005J342P47l29j195j274n20
$$ 201 -1129 -1696 -1145 135 1337 1638 845 -499 -1501 -1480 -475 867 1614 1285 90 -1184 -1704
1394a704N60J262J061J46q84j357r33P7R96J231N77m93j263j195l83O34J212R20
$$ -1704 -1144 118 1179 1325 441 -916 -1849 -1772 -776 455 1032 539 -724 -1919 -2302 -1668 -456 464
1412D64k0j001j289p90J97J043J136M65n68j193j078k43P44J219Q86m6r20j178
$$ 464 444 -557 -1846 -2636 -2439 -1396 -260 205 -363 -1556 -2634 -2877 -2133 -914 -28 -74 -994 -2172
1430b172o36L71J141J168M89n18j108q98n3R04J288Q92n5r14j052m22N28J220
$$ -2172 -2808 -2437 -1296 -128 361 -157 -1265 -2163 -2216 -1312 -24 868 813 -101 -1153 -1575 -1047 173
1448A73J140L58n89j063p90R2R61J221P20j95r50j036l90N56J131R58J85p09j150
$$ 173 1313 1671 1082 19 -771 -679 282 1503 2223 2028 1078 42 -348 208 1339 2297 2482 1773 623
1467F23q23O1Q59J060N42l90j091j108m48M81J010P95k2q66j222q20O7Q28R57
$$ 623 -200 -139 720 1780 2322 1932 841 -267 -715 -234 776 1571 1549 683 -539 -1359 -1292 -464 493
1486D93L69n24j157j053l18N80R82P25j16r00j110o29K15R18R51L46n38j037q58
$$ 493 862 338 -819 -1872 -2190 -1610 -628 97 -19 -919 -2029 -2658 -2443 -1525 -574 -228 -766 -1803 -2661
1505b661j47P17J057P34o4q15r90m63M00J013J009L61m99r42p31K9P92J101P04
$$ -2661 -2808 -2091 -1034 -300 -364 -1179 -2169 -2632 -2232 -1219 -210 151 -348 -1290 -2021 -1992 -1200 -99 605
1524F05j37q27r31l41M62J009R11K03o12j002o91P0P83R83N08l25r12r36l50M65
$$ 605 468 -359 -1290 -1631 -1169 -160 751 954 342 -660 -1351 -1281 -498 485 993 668 -244 -1180 -1530 -1065
1544a065R34P47L7p23j030o91P8P42Q64M05m04r65r09l14M82Q85O77k2p48r68
$$ -1065 -131 616 653 -70 -1100 -1791 -1713 -971 -107 298 -106 -1071 -1980 -2294 -1812 -927 -250 -272 -1020 -1988
1564a988n76J85Q04Q77L45m07q88p40j03O39R75O85l0o68q21l67L78R21R15L51
$$ -1988 -2564 -2379 -1575 -698 -353 -760 -1648 -2388 -2491 -1852 -877 -192 -222 -890 -1711 -2078 -1700 -779 136 487
1584D87l82p89o01N7P39J015O61l6o44p31k96M46R42Q78K73m05p90n55Q6P32R16
$$ 487 105 -684 -1285 -1228 -489 526 1187 1151 507 -224 -520 -74 868 1746 2019 1614 824 269 355 1087 2003
1605B003N48j78p30p74k60M23Q18O99O3n88q78n81O1O46P54L06l57q62q02k86
$$ 2003 2551 2373 1643 869 609 1032 1850 2549 2612 2024 1146 565 626 1272 2026 2332 1975 1113 311 25
1625B5L80P34N25o9o86r11n56P6O07O70K44m20q65p57k16M08P22N14r9o87q15
$$ 25 405 1139 1664 1595 909 -2 -558 -482 125 795 1039 619 -246 -1003 -1219 -811 -89 425 326 -361 -1176
1646a176m46J92O94P09K26m00p48n97k7N84Q05N34p1n91o62k47L81P98P35K47
$$ -1176 -1622 -1430 -736 -27 199 -201 -949 -1546 -1573 -989 -184 350 279 -312 -974 -1221 -840 -42 693 940
1666I40l61o78m52J16O56Q24M96r9n51o11j83M12P73O63J83m16o55m53J16O05
$$ 940 579 -99 -551 -435 221 1045 1541 1442 891 280 97 509 1282 1945 2128 1712 1057 604 720 1325
1686A325P22L72k15o49o35k02L58O65M93k6n55p67m55O5N17N73J74l85p50o68
$$ 1325 2047 2419 2204 1555 920 718 1076 1741 2234 2208 1653 886 431 496 1013 1586 1760 1375 625 -43
1706d3k18L28N97L84j45o23p45m38R4N29N43J48l85p15n85j22M06O20L98j14n66
$$ -43 -261 67 664 1048 903 280 -465 -903 -809 -280 263 411 26 -689 -1274 -1396 -990 -370 28 -86 -652
1727f52o33l07K36O15N89J72l51o00m36L4N38O96M05j06n04n31j56L51O71N60
$$ -652 -1285 -1592 -1356 -741 -152 20 -331 -931 -1367 -1333 -795 -99 306 200 -304 -835 -991 -640 31 591
1747E91J44l54n94l83J08N27O16L41j99n57n56j97L08N69M66Nm65o46m33L1M49
$$ 591 735 381 -213 -596 -488 39 655 996 797 240 -316 -513 -205 364 830 835 370 -276 -709 -678 -229
1768b29N14J88l07o35n93k11K67N13L51j09n37o67l75Q8M48M65J24l13o06n01
$$ -229 285 473 166 -469 -1062 -1273 -1006 -493 -142 -251 -788 -1455 -1830 -1742 -1294 -829 -705 -1018 -1624 -2125
1788b125p4L66N71L71o2m32n14k06K45N85N64K32k03m50l29R0N15O72M74Nl39
$$ -2125 -2199 -1833 -1262 -891 -953 -1385 -1899 -2105 -1860 -1275 -711 -479 -682 -1132 -1461 -1371 -856 -184 290 295 -44
1809d4l97q6L59O49O07K15k14m18k81J42N40O07L64q2m24m28j07L19N34M31L7
$$ -44 -441 -527 -168 481 1088 1303 1089 671 390 532 1072 1679 2043 1961 1537 1109 1002 1321 1855 2286 2323
1830B323l70n44l54M2L88M26J36k68n78n49k31J83L80K63j29n01o49m22j4L12
$$ 2323 1953 1409 1055 1097 1485 1911 2047 1779 1201 652 421 604 984 1247 1118 617 -32 -454 -468 -156
1850a56L27O9l42n97n32j81K18M08K62j35m59n45k85J13M27M02J28k67m58l62
$$ -156 171 240 -102 -699 -1231 -1412 -1194 -786 -524 -659 -1118 -1663 -1948 -1835 -1408 -1006 -878 -1145 -1603 -1965
1870a965J4L80N26L44k8l57l59j11K80N55N08J82j82l62k39J16M59N51L49l4l30
$$ -1965 -1951 -1571 -1045 -701 -729 -1086 -1445 -1556 -1276 -721 -213 -31 -213 -575 -814 -698 -239 312 661 627 297
1891B97l39r0K82N08M18R2k66m19k64P4L84M41J94j79m38m18j26K16M08K89o3
$$ 297 -42 -132 150 658 1076 1168 902 483 219 293 677 1118 1312 1133 695 277 151 367 775 1064 1001
1912A001l82m89l17M6L20L45Q9k55m84m22j25K14L78K36p3l70m57k51R8L62L64
$$ 1001 619 130 -187 -141 179 524 613 358 -126 -548 -673 -459 -81 155 82 -288 -745 -996 -898 -536 -172
1933a72J34k13m08l16nL04M34K86l6l03l46j14K10M36M05J18j93l38k25P6L62
$$ -172 -38 -251 -659 -975 -980 -676 -242 44 8 -295 -641 -755 -545 -109 296 414 221 -117 -342 -266 96
1954I6M40K61o3l13l08r1K19M17L42P0k30l63k50O3L13L44J78j29l63l51j37J81
$$ 96 536 797 734 421 113 22 241 658 1000 1070 840 477 227 290 603 947 1125 996 633 282 145 326
1976C26L24K40l1l17m12k74J6K73K91O8k13m16l73r8J92K79K00q4l25l98k13N4
$$ 326 650 890 859 542 130 -144 -128 145 436 504 291 -125 -498 -596 -404 -125 75 -9 -334 -732 -945 -891
1998h91K77K90O0k08l82k86m6K13L15J86n3l08l22j45J14K96K89Q6k04l08k39
$$ -891 -614 -324 -264 -472 -854 -1140 -1186 -973 -658 -472 -525 -833 -1155 -1300 -1186 -890 -601 -515 -719 -1027 -1266
2019a266K9K43L34J92o6k78k77q5J77L29K82M8j94l02j80O7K89L25J70r1k63k39
$$ -1266 -1237 -994 -660 -468 -534 -812 -1089 -1174 -997 -668 -386 -338 -532 -834 -1014 -947 -658 -333 -163 -254 -517 -756
2041g56p2K04L38K49L2j75k83j55R3K93L22J54j02k44k30k1K25L20K34J1k12k51
$$ -756 -828 -624 -286 -37 -5 -180 -463 -618 -525 -232 90 244 142 -102 -332 -353 -128 192 426 437 225 -26
2063b6j45J23K95K92R5j34k75k07JK09L07J89m8k30k62j20J24K61K61N8j60k83
$$ -26 -171 -48 247 539 634 500 225 18 19 228 535 724 676 446 184 64 188 449 710 768 608 325
2085C25k08J1K05K79J49p7k46k48j09J18K66K14M1j73k60j97M2K35K68J48r8k32
$$ 325 117 128 333 612 761 684 438 190 81 199 465 679 720 547 287 90 132 367 635 783 685 453
2107D53k14m7J64K93K32J5j73k38j31Q8K41K72J24r9k19k12k3J64K68J79j9j85
$$ 453 239 192 356 649 881 896 723 485 354 442 683 955 1079 980 761 549 526 690 958 1137 1118 933
2129I33k48j28N5K15K25M9j34k55k25n8J30K21J10p3k47k92j63M0J71J76k8j95
$$ 933 685 557 612 827 1052 1101 967 712 487 429 559 780 890 817 570 278 115 155 326 502 474 279
2151B79l00k49l6J25J81O8r9k54k69j23P1J96J64K2j70k35j68J4J93K41J17m6
$$ 279 -21 -270 -306 -181 0 68 -31 -285 -554 -677 -606 -410 -246 -224 -394 -629 -797 -783 -590 -349 -232 -278
2173b78j87j79k5J53K51K27O0j01j69p7J01K50K70J64m0j38j31K4J94K68K09L5
$$ -278 -465 -644 -669 -516 -265 -38 22 -79 -248 -325 -224 26 296 460 420 282 151 175 369 637 846 881
2195H81j20j66q5Q5K21K03Q6j03k05j86l4J21J76R7p3k08k47j57J1J22J21j8j89
$$ 881 761 595 510 595 816 1019 1105 1002 797 611 577 698 874 971 898 690 443 286 297 419 540 522 333
2218C33k79k21p9N2J17M0j16k58k66j52J9J22J02k8j95k28j78l2J26J60P1p0j78
$$ 333 54 -167 -246 -194 -77 -37 -153 -411 -677 -829 -810 -688 -586 -614 -809 -1037 -1215 -1247 -1121 -961 -890 -960 -1138
2241a138j69l5J17K02J69M4r8j26p1R0K14K24J42j2r6j04M1J60K47J86O2o7j04
$$ -1138 -1307 -1342 -1225 -1023 -854 -810 -908 -1034 -1105 -1015 -801 -577 -435 -447 -543 -647 -606 -446 -199 -13 49 -18 -122
2264a22m2Q4K14K02J08m3j26j22K2J30J80J18j6j46j59r6N1J41J16J5j28k02j46
$$ -122 -164 -80 134 336 444 401 275 153 175 305 485 603 587 441 282 186 237 378 494 509 381 179 33
2287C3m0O9J18O0q6j91j89r4K6J15J00nj17j72j41nJ02J43Q0m6j26j41l7Q5J79
$$ 33 -7 62 180 240 154 -37 -226 -320 -294 -179 -79 -84 -201 -373 -514 -519 -417 -274 -194 -240 -366 -507 -544 -459 -280
2312b80J33N5q9j21p0N8J90J66J13j6r8r2K2J37K02J42L2o5j03l8O7J63J51Q1
$$ -280 -147 -92 -181 -302 -372 -314 -124 42 155 139 41 -51 -29 108 310 452 484 419 316 278 345 508 659 740
2336G40n9j27j04rR4J31Q4k6j28j38r7K0J02R8rj12j64j41l7M8J08L6p3j53j53
$$ 740 681 554 450 441 535 666 750 724 596 458 361 381 483 581 572 460 296 155 118 166 274 310 237 84 -69
2361f9r7K4R9Q1rj13j60r0k3Q8J12O5n7j15j12m1P2J43J13M5p3r3n9L6J42J55
$$ -69 -166 -142 -43 38 29 -84 -244 -334 -357 -269 -157 -92 -149 -264 -376 -417 -345 -202 -89 -44 -117 -210 -269 -233 -91 64
2387F4P9j6q1p6NJ02J54J18K9n6j06m7N4J30J29N5k9j16r2j6Q0J20P1k1j01j25
$$ 64 143 127 46 -30 -25 77 231 349 378 322 216 169 223 353 482 537 508 392 300 284 364 484 555 534 433 308
2413C08p6K3P9R0Mq7j23j34k9M9P1M3m8j18j37q5J9P2P3Kr3j26r7k3Q6Q5M5m0
$$ 308 232 255 334 424 428 341 218 84 55 104 175 218 170 52 -85 -170 -151 -79 -6 -4 -97 -223 -320 -343 -257 -172 -127 -167
2441a67r5j12l9M0J05R4J9o7j05p6L3P4J36M4k0r1p3k5N7J11R2J6o2r0n5K1Q1
$$ -167 -262 -374 -413 -373 -268 -174 -155 -222 -327 -403 -370 -296 -160 -116 -136 -227 -300 -325 -268 -157 -65 -49 -111 -201 -256 -235 -154
2468a54J03N0l9r8p8k1N2R9O8jq7j02n1J6Q6Q6K2n4r0j06pO0Q3N7k2n9j08m8K5
$$ -154 -51 -1 -40 -138 -216 -237 -185 -86 -18 -19 -106 -208 -259 -243 -157 -71 -49 -103 -193 -299 -306 -246 -163 -106 -128 -187 -295 -343 -318
2497c18J08Q2J2n0r1o6QP4Q7O4j7n1r4k2M4R4Q2Ql7q4m3J4O5R1N7k5p5o4k4N4
$$ -318 -210 -128 -116 -166 -257 -323 -315 -241 -154 -90 -107 -158 -252 -274 -230 -136 -54 -46 -83 -167 -210 -196 -131 -40 17 -8 -83 -147 -171 -117
2527a17P4P8Nn3r2m2OP2Q3K5k8q5p4j8M8Q6N3Jp2o5l8J1P7Q3K7k6p2m7J1N5R1
$$ -117 -43 35 40 -13 -105 -147 -141 -69 14 39 11 -74 -148 -166 -118 -32 21 22 -50 -115 -153 -142 -65 18 45 19 -53 -100 -89 -34 57
2558E7O5J7l9n9j6N9Q2J01M5k0m9l5K9Q6R5P0Rm2n4%M4Q1Q4K5l9o3l2JN9P3K2
$$ 57 122 139 100 41 25 84 166 267 312 292 243 208 237 323 418 488 497 455 401 401 445 526 610 635 596 533 501 502 561 634 656
2589F56j4o3p1l1K4N7K7j0o1r0p9jK9L8Nn8q3r8l8J8L9K4l4o8r6m7jL6M5J1m4
$$ 656 642 579 508 477 501 558 585 575 514 424 345 344 373 411 416 358 275 177 139 157 196 220 186 118 22 -25 -26 10 55 66 22
2620B2o8n6j3L0P0K5%n3m1l0K7N8N4N4l4m3k9J9N2P5N0Rl2m7rM5O5N6M2l8o1k6
$$ 22 -46 -102 -115 -85 -15 10 10 -43 -84 -114 -87 -29 25 79 45 2 -27 -8 44 119 169 178 146 99 90 135 200 256 298 260 199 173
2652A73LN2N9J8l0m7n7l1J8L5L4j6n8o7l9j8J8M0%m8p1n9l9L1K2J2j9n5o9m3J0
$$ 173 176 228 287 305 275 228 171 140 158 193 227 211 153 86 47 29 47 87 87 39 -32 -91 -130 -99 -77 -65 -84 -139 -208 -251 -241
2683b41K4M5J6l0n8l7oM5M2M7J1k6m2oM2N6P3L7ll2k0K3N3P4N3jol0nM0P4M1L5
$$ -241 -217 -172 -156 -186 -244 -281 -287 -242 -200 -153 -142 -168 -210 -216 -174 -118 -45 -8 -11 -43 -63 -40 13 87 140 139 133 103 98 138 212 253 288
2716B88j1o0k5RM6M1K9j5m2n2l3RL5K9on5o4m6k2PL1ol4o9p3l1LL0Oj0o5o3l5
$$ 288 277 217 192 201 247 288 317 302 260 208 175 184 219 248 242 187 123 77 55 62 93 87 53 -16 -89 -120 -117 -87 -81 -91 -156 -219 -254
2749b54oJ8K7Jj3n2m7oK6L9M0j1k9l2j2K0M2O3L6j3l2pQN3O0L9J9j7l0J3L1N3
$$ -254 -260 -242 -215 -214 -227 -279 -326 -332 -306 -267 -227 -238 -267 -299 -311 -291 -249 -186 -150 -163 -195 -202 -194 -141 -81 -42 -23 -40 -70 -57 -26 27
2781B7M9J9%l5j4jM7L9L6Jm4l6j4J3K9L0%l0n0k6qPL4Pk5m7m8j9QK5L1k2l4n2
$$ 27 76 95 95 60 46 45 92 131 167 168 124 88 74 87 116 146 146 116 66 40 32 39 73 80 55 8 -40 -59 -51 -26 5 -17 -51 -103
2815a03l5kK2L9K0k9l5l4lK2K9N7mk0l7j2L4M5L7J7J0k1n%L9N4L8J6j8rk0L7M7
$$ -103 -138 -140 -118 -79 -59 -88 -123 -157 -160 -138 -109 -52 -56 -76 -113 -125 -91 -46 -9 8 18 -3 -8 -8 31 85 123 139 121 112 92 129 176
2848A76L5M3j8k4j5PL1L9K2Lk5l9lOL9L0J0l6l6l2kJ9K2Rj6l5m3k7MK1K2rl7l9
$$ 176 211 254 236 212 197 204 235 274 296 299 274 235 232 238 277 307 317 281 245 213 211 230 252 261 245 210 167 140 144 165 187 178 141 102
2882A02l1oJ5J5Qj3m2l8nJ6KK0Jl8l1k0KK0K1K3k9k5k6mJ8L5J7nk4k5j9K0K2K6
$$ 102 71 65 80 95 103 90 48 10 5 21 23 43 44 6 -25 -45 -43 -23 -2 21 -8 -33 -59 -63 -45 -10 7 2 -22 -47 -66 -46 -24 2
2916BQok7k8kK2K7L6j0k5k2j4%L7K1Pj1k9k0qL7J6J9pk4k6pPJ9L3%j5k7k0%K2
$$ 2 10 4 -23 -51 -53 -31 -4 32 22 -3 -25 -39 -39 -2 19 26 15 -14 -34 -42 -5 11 30 23 -1 -27 -34 -27 -8 25 25 10 -17 -37 -37 -15
2952a5L0K6j2l1l2LJ1J3K4Mj7k1j1mL4K2oj3j2k8jJ3J8J3Qk9k6j6JL5J7Kj3j3
$$ -15 15 41 29 -2 -34 -31 -20 -7 17 21 4 -17 -28 -32 2 24 18 5 -7 -35 -36 -23 -5 8 16 -13 -39 -55 -54 -19 -2 0 -13 -26
2986b6k1pL0K3J0pj2j9lOJ0L5Qrk2j5PL0K4K6Kk4j9kJ9L1J7J3pk3j1KL0J0K1o
$$ -26 -47 -54 -24 -1 9 2 -10 -29 -32 -26 -16 19 27 18 -4 -19 -12 18 42 68 70 46 27 25 44 75 92 105 98 75 64 66 96 106 127 121
3022A21k0k9jJ8J7J8lj0k2j2kJ5J0J3kk9j3k1QL1M%k8k9j5kK5jJ9j9j3l0MmK7
$$ 121 101 72 71 89 106 124 121 111 89 77 75 90 100 113 111 82 69 48 56 87 91 91 63 34 19 17 42 41 60 41 28 -2 2 -2 25
3057B5K6k8jj6LrJ4L5MLk4olJ7L2J1mkj1kJ4J0L6Mj3j6jnJ3L0J4j0k5j7mJ1J6
$$ 25 51 23 22 6 9 0 14 49 53 56 32 26 23 40 72 83 79 77 66 64 78 88 124 128 115 99 98 93 106 136 150 140 115 98 94 105 121
3094A21Mmj7j4k8j2J8QJk1l5j9j9JPpLl0l2j2j2J2J%j2l1k1NONPKj9j4j2J1J8
$$ 121 125 121 104 90 62 50 68 76 77 56 21 2 -17 -16 -9 -16 -13 -43 -75 -87 -99 -87 -86 -86 -98 -129 -150 -145 -139 -134 -127 -125 -144 -158 -170 -159 -141
3131a41J5J4pj5kROK8J9qj0okK1K0L2Mkj3jLJ8K6J2mj4krkK8J8%j1pj5KJ2J1%
$$ -141 -126 -112 -119 -134 -136 -127 -121 -93 -74 -82 -92 -98 -100 -79 -59 -27 -23 -25 -38 -39 -36 -18 8 20 16 2 0 -9 -11 17 35 35 24 17 2 4 16 27 27
3170B7j0lk0nnL0KKk3kj8J4oJ6Moj3%oPJ9J5jj5j5%J4OK4QlnmqK8MK7onj8jK2
$$ 27 17 14 -6 -11 -16 14 16 18 -5 -7 -25 -11 -17 -1 3 -3 -16 -16 -22 -15 4 19 18 3 -12 -12 2 8 32 40 37 32 28 20 48 52 79 73 68 50 49 71
3212G1J6J1JrplLjJ3J1Mk1kk2%ROj1j9k5mj5J0Jqok1k1k0%OMj0j9k0j1JO%Jjj8
$$ 71 87 98 99 90 83 80 83 82 95 106 110 89 87 65 65 74 80 69 50 25 21 6 16 17 9 3 -18 -39 -59 -59 -53 -49 -59 -78 -98 -109 -108 -102 -102 -101 -102 -120
3254a20j3lJ4lJ3Pj3oj5PJ4K1Kj2jk%J7JK0Nj3jnJ1J8RJ0pqpj0K4RPmlrnNJ4J0
$$ -120 -133 -136 -122 -125 -112 -105 -118 -124 -139 -132 -118 -97 -95 -107 -108 -110 -110 -93 -92 -72 -67 -80 -81 -86 -75 -57 -48 -38 -45 -53 -60 -70 -46 -37 -30 -34 -37 -46 -51 -46 -32 -22
3296b2Nj3j2MMlQJ0ojj6MJ7OKJ1j0nLmK0J3%KnPqJ4K7J2J4j5lj5J4K7OJ7%j0%
$$ -22 -17 -30 -42 -38 -34 -37 -29 -19 -25 -26 -42 -38 -21 -15 -13 -2 -12 -17 -14 -18 2 15 15 17 12 19 11 25 52 64 78 63 60 45 59 86 92 109 109 99 99
3337I9mRJ4J6nmj1nNkK1Jppj5oJ1Lk%j7k0pMkKOj5j6j3j1J1LkMj9j4j1RjJ4no
$$ 99 95 104 118 134 129 125 114 109 114 112 133 134 127 120 105 99 110 113 111 111 94 74 67 71 69 71 77 62 46 33 22 33 36 34 38 19 5 -6 3 2 16 11 5
3380Ej0pjPJ0Pooj4JmJ9NJ1j0qKKJ7PpqPqQoQpMmjnj1OJ4pj0Jj5oMKNLnj1j1N
$$ 5 -5 -12 -13 -6 4 11 5 -1 -15 -14 -18 1 6 17 7 -1 1 3 20 27 20 12 19 11 19 13 21 14 18 14 13 8 -3 3 17 10 0 1 -14 -20 -16 -14 -9 -6 -11 -22 -33 -28
3428b8lK1Pj1j4mj0J0JJ5Jj5pMLj1K2J1j5nOmJ4oJ1jlrQqK0OpMj9RMKJ5rjLmp
$$ -28 -31 -10 -3 -14 -28 -32 -42 -32 -31 -16 -15 -30 -37 -33 -30 -41 -19 -8 -23 -28 -22 -26 -12 -18 -7 -8 -11 -20 -12 -20 0 6 -1 3 -16 -7 -3 -1 14 5 4 7 3 -4
3472dOnJ4j1jJrp%NJ2j0Mj8LRKJ0ploqnJ7QkMOmklJ4RrPkjJK2JlK1k3jKPQRj5
$$ -4 2 -3 11 0 -1 0 -9 -16 -16 -11 1 -9 -5 -23 -20 -11 -9 1 -6 -9 -15 -23 -28 -11 -3 -5 -1 5 1 -1 -4 10 19 10 17 15 14 15 37 38 35 56 33 32 34 41 49 58 43
3521D3LQk2NOMJ2j4j4rMpJ9opjoj8OqMOj0j1%mqJ7Oj0rmpQRPRoNjqRJ9%RLj0L
$$ 43 46 54 32 37 43 47 59 45 31 22 26 19 38 32 25 24 18 0 6 -2 2 8 -2 -13 -13 -17 -25 -8 -2 -12 -21 -25 -32 -24 -15 -8 1 -5 0 -1 -9 0 19 19 28 31 21 24
3569B4RKJ2MkkkJ2pORNj2jKrJ5jmnrpkpKjk1qj1j7Oj1J1j5qj1j4JqJ0qj5jqj1
$$ 24 33 35 47 51 49 47 45 57 50 56 65 70 58 57 59 50 65 64 60 55 46 39 37 30 32 31 10 2 -9 -26 -20 -31 -20 -35 -43 -54 -68 -67 -75 -65 -73 -88 -89 -97 -108
3614a08jRolRoJJ1MPJjJ1MKPJ2J5J4mLJ1PJ0K1KMJ9ONOJ0LJ4kJpQPKmnjj1j0m
$$ -108 -109 -100 -106 -109 -100 -106 -105 -94 -90 -83 -82 -83 -72 -68 -66 -59 -47 -32 -18 -22 -19 -8 -1 9 30 32 36 55 61 66 72 82 85 99 97 98 91 99 106 108 104 99 98 87 77 73
3660G3Rnjj3j5j3qmpJlj6j2npmlmrk5jjQJlJqJ6k%NJK1qJ2JNPJ2J1J1RjKK0NJ
$$ 73 82 77 76 63 48 35 27 23 16 17 14 -2 -14 -19 -26 -30 -33 -37 -46 -71 -72 -73 -65 -64 -67 -66 -74 -58 -60 -60 -55 -54 -33 -41 -29 -28 -23 -16 -4 7 18 27 26 28 48 53 54
3707E4J5kqJ5J5JOLJNk1QjmoRqk0mKrpqlk1nj7j2Kj2qk6j3j1Kj2nj4kk0lLkJK
$$ 54 69 67 59 74 89 90 96 99 100 105 84 92 91 87 81 90 82 62 58 60 51 44 36 33 12 7 -10 -22 -20 -32 -40 -66 -79 -90 -88 -100 -105 -119 -121 -141 -144 -141 -143 -142 -140
3752a40jnklRPJ1OOjNoL3PLJ3kJ7J9J4PJ6OJ0RJPJ5J3NJ2nNPj2J9oOjj0kj0Nl
$$ -140 -141 -146 -148 -151 -142 -135 -124 -118 -112 -113 -108 -114 -81 -74 -71 -58 -60 -43 -24 -10 -3 13 19 29 38 39 46 61 74 79 91 86 91 98 86 105 99 105 104 94 92 82 87 84
3796H4Jj5qqKpj3Jnj2j8rLj0o%j1rlk1%j%Lrlj0jJNJ2pJlKRnJ3RNJ2mOlJ4J0Q
$$ 84 85 70 62 54 56 49 36 37 32 20 2 -7 -4 -14 -20 -20 -31 -40 -43 -64 -64 -65 -65 -62 -71 -74 -84 -85 -84 -79 -67 -74 -73 -76 -74 -65 -70 -57 -48 -43 -31 -35 -29 -32 -18 -8 0
3843@J4j0JQJ3PKMKoJ5pJ5Mkm%Lm%J0ppj2nj3JMNk0qk2Rnrjj2qqKj4lj0Lj0op
$$ 0 14 4 5 13 26 33 35 39 41 35 50 43 58 62 60 56 56 59 55 55 65 58 51 39 34 21 22 26 31 11 3 -19 -10 -15 -24 -25 -37 -45 -53 -51 -65 -68 -78 -75 -85 -91 -98
3890i8jKjRlrpj5K0jMOjjOjJ0J3lLMjLRJ7jQJJ1nJ2PJJ1LkPRMj1K4JNj1Lj0J1
$$ -98 -99 -97 -98 -89 -92 -101 -108 -123 -103 -104 -100 -94 -95 -96 -90 -91 -81 -68 -71 -68 -64 -65 -62 -53 -36 -37 -29 -28 -17 -22 -10 -3 -2 9 12 10 17 26 30 19 43 44 49 38 41 31 42
3937D2J9j4KNj1JlOOj0Jj4lpPLmj5lomjmK%nnk2RO%rLnroKK6%JLKj8J0J5ORNq
$$ 42 61 47 49 54 43 44 41 47 53 43 44 30 27 20 27 30 26 11 8 2 -2 -3 -7 -5 -5 -10 -15 -37 -28 -22 -22 -31 -28 -33 -42 -48 -46 -20 -20 -19 -16 -14 -32 -22 -7 -1 8 13 5
3986EMOJ4RJ2NlONJ1LRJ6nMMJ2QnJ2jJj7J5jNmKkOj3Nmkllj3kj0oj0Pj2nj4ro
$$ 5 9 15 29 38 50 55 52 58 63 74 77 86 102 97 101 105 117 125 120 132 131 132 115 130 129 134 130 132 130 136 123 128 124 122 119 116 103 101 91 85 75 82 70 65 51 42 36
4033C6JnJ3k5j4Jpj0KKkj1k8J6lqJ9pQk1PlLJ1MlPlNPpK9MkMkjJ5NPJpLj0RJ0
$$ 36 37 32 45 20 6 7 0 -10 -8 -6 -8 -19 -47 -31 -34 -42 -23 -30 -22 -43 -36 -39 -36 -25 -21 -24 -17 -20 -15 -8 -15 14 18 16 20 18 17 32 37 44 45 38 41 31 40 50
4079E0QjrJj7MLrOKj9lj4MNk4Lj0j4pj3%j0%mj8j3nrJ0qqkk0NlPLj3MkjrJ5oJ1
$$ 50 58 57 48 49 32 36 39 30 36 38 19 16 2 6 11 -13 -10 -20 -34 -41 -54 -54 -64 -64 -68 -86 -99 -104 -113 -103 -111 -119 -121 -141 -136 -139 -132 -129 -142 -138 -140 -141 -150 -135 -141 -130
4125a30nLo%RLK0PJ3k0J0JPK5J6qQkJKJ7MJ3kQnJOJ2jlQjqLPJ4j4jolKpjNqlj
$$ -130 -135 -132 -138 -138 -129 -126 -106 -99 -86 -106 -96 -95 -88 -63 -47 -55 -47 -49 -48 -46 -29 -25 -12 -14 -6 -11 -10 -4 8 7 4 12 11 3 6 13 27 13 12 6 3 5 -2 -3 2 -6 -9 -10
4173a0j1qkQKj0lj1joONmj1Nj1%PJ5mJpN%LK1J6olkmNJ2J4kJ7j2NPJ2JOJ1j8J0
$$ -10 -21 -29 -31 -23 -21 -31 -34 -45 -46 -52 -46 -41 -45 -56 -51 -62 -62 -55 -40 -44 -43 -50 -45 -45 -42 -21 -5 -11 -14 -16 -20 -15 -3 11 9 26 14 19 26 38 39 45 56 38 48
4218D8%LJ9J5j5%LrRRJ5j3J1j4OlJ8MJLj3llOoJ7Kj8Oj8NKJnJ0Jj9j5PJNj5lr
$$ 48 48 51 70 85 70 70 73 64 73 82 97 84 95 81 87 84 102 106 107 110 97 94 91 97 91 108 110 92 98 80 85 87 88 83 93 94 75 60 67 68 73 58 55 46
4262D6lMrONrrk%jkjQj4OJj9J0QOolnoJ2KJ1Lj1nLN%NJ0J0k0%JjJ8nJ6j2mj2O
$$ 46 43 47 38 44 49 40 31 29 29 28 26 25 33 19 25 26 7 17 25 31 25 22 17 11 23 25 36 39 28 23 26 31 31 36 46 56 36 36 37 36 54 49 65 53 49 37 43
4309D3MJ5NpkqKKPMmj3rRmrjMrj5j0j2JlMk3%k0oJpLj7rj5mqMrNpj4%jmJ0%Kq
$$ 43 47 62 67 60 58 50 52 54 61 65 61 48 39 48 44 35 34 38 29 14 4 -8 -7 -10 -6 -29 -29 -49 -55 -54 -61 -58 -75 -84 -99 -103 -111 -107 -116 -111 -118 -132 -132 -133 -137 -127 -127 -125 -133
4358a33qPlNQOJ5pJ0j0K2J1RJ4NKMNJ3J8LJ6j0PJJ7LOJlnMpJ2J2jk0Qj5ljmJj4
$$ -133 -141 -134 -137 -132 -124 -118 -103 -110 -100 -110 -88 -77 -68 -54 -49 -47 -43 -38 -25 -7 -4 12 2 9 10 27 30 36 37 34 29 33 26 38 50 49 29 37 22 19 18 14 15 1
4402Ajj0j1nlnoj0qj3qrRkpj4kpqPOJ1oMj2J1MJ5J4JoRPJ0J2J0J3NMJ1K3OJ2J5
$$ 1 0 -10 -21 -26 -29 -34 -40 -50 -58 -71 -79 -88 -79 -81 -88 -102 -104 -111 -119 -112 -106 -95 -101 -97 -109 -98 -94 -79 -65 -64 -70 -61 -54 -44 -32 -22 -9 -4 0 11 34 40 52 67
4446F7K3j2K6%J5J9J2kJ0mP%kJ7%omOj0oJKrpj4l3%olj7oj6qj8pornk2j4opj0
$$ 67 90 78 104 104 119 138 150 148 158 154 161 161 159 176 176 170 166 172 162 156 157 159 150 143 129 96 96 90 87 70 64 48 40 22 15 9 0 -5 -27 -41 -47 -54 -64
4489f4mJNj0j5J4pJRK%%JK6%K6j3J3JPRJ4J3J4J9%mRJ6jK1JOJokJ3PPkrj4oNl
$$ -64 -68 -67 -62 -72 -87 -73 -80 -79 -70 -68 -68 -68 -67 -41 -41 -15 -28 -15 -14 -7 2 16 29 43 62 62 58 67 83 82 103 104 110 111 105 103 116 123 130 128 119 105 99 104 101
4534A01Jj4pj6rj6nqjk9j2j3k3Lj9rqj7j7j8%j0nKj6j0mmk%JokJ0mORJ1mJ6nO
$$ 101 102 88 81 65 56 40 35 27 26 -3 -15 -28 -51 -48 -67 -76 -84 -101 -118 -136 -136 -146 -151 -149 -165 -175 -179 -183 -185 -185 -184 -190 -192 -182 -186 -180 -171 -160 -164 -148 -153 -147
4576a47J6JK2J7J5k0J9J1rL7NJ2%M%J3JRmJ1mJmLJ1Lj4j0j2rKrkkj1j2j9Jrpo
$$ -147 -131 -130 -108 -91 -76 -96 -77 -66 -75 -38 -33 -21 -21 -17 -17 -4 -3 6 2 13 9 10 6 9 20 23 9 -1 -13 -22 -20 -29 -31 -33 -44 -56 -75 -74 -83 -90 -96
4617i6nnrj7pJJRj3nommQmRlpNPjK4K%kMOK8nJ7J3jJ2JQPJ5K2rRJOJ3OJ1kLjJ
$$ -96 -101 -106 -115 -132 -139 -138 -137 -128 -141 -146 -152 -156 -160 -152 -156 -147 -150 -157 -152 -145 -146 -122 -120 -120 -122 -118 -112 -84 -89 -72 -59 -60 -48 -47 -39 -32 -17 5 -4 5 6 12 25 31 42 40 43 42 43
4666D3MNJ1jjrKOjlJ0Mk5ljLkJ3j4Pj6Oj6k%lJj0RmqJ8Nj2jlPlJM%QLlJ1KMQJ0
$$ 43 47 52 63 62 61 52 54 60 59 56 66 70 45 42 41 44 42 55 41 48 32 38 22 20 20 17 18 8 17 13 5 23 28 16 15 12 19 16 17 21 21 29 32 29 40 42 46 54 64
4715F4j3lJ2lOKNkqlJRMj3nmjJJLj0Oj0KrnOMqnNj7Nj2J2Jmj2oJ6pJ0j6PqJ8r
$$ 64 51 48 60 57 63 65 70 68 60 57 58 67 71 58 53 49 48 49 50 53 43 49 39 41 32 27 33 37 29 24 29 12 17 5 17 18 14 2 -4 12 5 15 -1 6 -2 16 7
4762GnKLkJ%j2%NoJ1%j1j0jj0J2Nk0MlKj9%Qj1nqlNm%mqjjj7NLjmolPj4oJ0J2
$$ 7 2 4 7 5 6 6 -6 -6 -1 -7 4 4 -7 -17 -18 -28 -16 -11 -31 -27 -30 -28 -47 -47 -39 -50 -55 -63 -66 -61 -65 -65 -69 -77 -78 -79 -96 -91 -88 -89 -93 -99 -102 -95 -109 -115 -105 -93
4810i3pkkj1K1J3%KQJ0pMLJ3J1JQMJLjJ3RrRmJJ9mJ4j4JqNmlRroo%oj1jolj2j4
$$ -93 -100 -102 -104 -115 -94 -81 -81 -79 -71 -61 -68 -64 -61 -48 -37 -36 -28 -24 -23 -20 -21 -8 1 -8 1 -3 -2 17 13 27 13 14 6 11 7 4 13 4 -2 -8 -8 -14 -25 -26 -32 -35 -47 -61
4858f1jj3Lj0Nj4j6lnkNkOqj%NJ3JMMP%OJ2J3J9kJ1J2OJ8J1J7J0kJ5OJ1J2MJ8
$$ -61 -62 -75 -72 -82 -77 -91 -107 -110 -115 -117 -112 -114 -108 -116 -117 -117 -112 -99 -98 -94 -90 -83 -83 -77 -65 -52 -33 -35 -24 -12 -6 12 23 40 50 48 63 69 80 92 96 114
4900A14RkLJ5J4j2J4j6J6%nq%qlrJ2k3roj2knj2j6j4pMk4pJ0j9ok0Qqknk1KlK
$$ 114 123 121 124 139 153 141 155 139 155 155 150 142 142 134 131 122 134 111 102 96 84 82 77 65 49 35 28 32 8 1 11 -8 -14 -34 -26 -34 -36 -41 -62 -60 -63 -61
4942f1KoJ4plOLK0oJ7%J7JQJ5OJ7J0LRJ1NJ6J4J0MnMOJ0lKlJ0k0j2J0Lj0mqrj3
$$ -61 -59 -65 -51 -58 -61 -55 -52 -32 -38 -21 -21 -4 -3 5 20 26 43 53 56 65 76 81 97 111 121 125 120 124 130 140 137 139 136 146 126 114 124 127 117 113 105 96 83
4985H3nj3lk3qk2j6j0j3mj2j8j8pj2rj0njj1j1PoJKnNNOoJK1%J1KLJ8J0OOPRK0
$$ 83 78 65 62 39 31 9 -7 -17 -30 -34 -46 -64 -82 -89 -101 -110 -120 -125 -126 -137 -148 -141 -147 -146 -144 -149 -144 -139 -133 -139 -138 -117 -117 -106 -104 -101 -83 -73 -67 -61 -54 -45 -25
5028b5LOJ4QJ7LJ5nMJ4OQkJPrjqL%qqj6kKj1qmj8j0k6Nj8Mj1k3j2Kj8qJj3opj5
$$ -25 -22 -16 -2 6 23 26 41 36 40 54 60 68 66 67 74 65 64 56 59 59 51 43 27 25 27 16 8 4 -14 -24 -50 -45 -63 -59 -70 -93 -105 -103 -121 -129 -128 -141 -147 -154 -169
5073a69%Nj1LKqJ1k1K3MJ1KkKJ2J1PJ3J5PMRNLMK4J3RJ6pNJ0J1PjQrlklLJ0j3
$$ -169 -169 -164 -175 -172 -170 -178 -167 -188 -165 -161 -150 -148 -150 -148 -136 -125 -118 -105 -90 -83 -79 -70 -65 -62 -58 -34 -21 -12 4 -3 2 12 23 30 29 37 28 25 23 20 23 33 20
5116B0nj1JJqJqnj5j2%olnpj0omrljoloLj4OK0oMOj0%RJ8lOQQKRRJ3NJ0MRLRJ1
$$ 20 15 4 5 6 -2 -1 -9 -14 -29 -41 -41 -47 -50 -55 -62 -72 -78 -82 -91 -94 -95 -101 -104 -110 -107 -121 -115 -95 -101 -97 -91 -101 -101 -92 -74 -77 -71 -63 -55 -53 -44 -35 -22 -17 -7 -3 6 9 18 29
5166B9J3PNRrjK8nJ3lqJ1pJ5o%%Ooj4oRmoJj1%qo%Oj9j1qJ1j1nPj1lmJloOOj4
$$ 29 42 49 54 63 54 53 81 76 89 86 78 89 82 97 91 91 91 97 91 77 71 80 76 70 71 60 60 52 46 46 52 33 22 14 25 14 9 16 5 2 -2 -1 -4 -10 -4 2 -12
5213a2jq%RJ2%oJ0j0lOJ1MNOqLoJ9J2jkrl%J6mJ6rLqpJMnjjmKj4MoOMpj1pKLK
$$ -12 -13 -21 -21 -12 0 0 -6 4 -6 -9 -3 8 12 17 23 15 18 12 31 43 42 40 31 28 28 44 40 56 47 50 42 35 36 40 35 34 33 29 31 17 21 15 21 25 18 7 0 2 5 7
5263GoJ1pjj2%J5%Kk1pJ5%JJ2lkj7JlPNQj5MmMkNJ2j3%kjnOQJ1rpJpQNjQoj1j
$$ 7 1 12 5 4 -8 -8 7 7 9 -12 -19 -4 -4 -3 9 6 4 -13 -12 -15 -8 -3 5 -10 -6 -10 -6 -8 -3 9 -4 -4 -6 -7 -12 -6 2 13 4 -3 -2 -9 -1 4 3 11 5 -6 -7
5312gRLOQj0Pj5k%J0JLorKKlNJm%j0LJJ2Kjj0pRMKQNjk0nJ9%MMj3LojN%Pnlmj6
$$ -7 2 5 11 19 9 16 1 -1 -1 9 10 13 7 -2 0 2 -1 4 5 1 1 -9 -6 -5 7 9 8 -2 -9 0 4 6 14 19 18 -2 -7 12 12 16 20 7 10 4 3 8 8 15 10 7 3 -13
5364a3mJ3Pj1jLj2joNK0oj0qpJ4mJ4JmqqR%K1%LqlrJ9RP%j0P%j2J0J5nmPj3J3
$$ -13 -17 -4 3 -8 -9 -6 -18 -19 -25 -20 0 -6 -16 -24 -31 -17 -21 -7 -6 -10 -18 -26 -17 -17 4 4 7 -1 -4 -13 6 15 22 22 12 19 19 7 17 32 27 23 30 17 30
5409C0klJ0Pj3Oj4nMkKLj5j5kJkj3J1qj0k0J3KKpnj7jloJ3qNnj4jJK1opQj4oJ2
$$ 30 28 25 35 42 29 35 21 16 20 18 20 23 8 -7 -9 -8 -10 -23 -12 -20 -30 -50 -37 -35 -33 -40 -45 -62 -63 -66 -72 -59 -67 -62 -67 -81 -82 -81 -60 -66 -73 -65 -79 -85 -73
5454g3kKJ6%oj1J0LJ5%OLRrOMJ1LQrjnK2oJ4Mj4RLj4%K2Omjj2%KL%oJ1j8qKJ1
$$ -73 -75 -73 -57 -57 -63 -74 -64 -61 -46 -46 -40 -37 -28 -37 -31 -27 -16 -13 -5 -14 -15 -20 2 -4 10 14 0 9 12 -2 -2 20 26 22 21 9 9 11 14 14 8 19 1 -7 -5 6
5500Fjkk2nkJ0rJ8j0Jpj4%MK1qJ4rlrMJ0K0MlOj7ONMJ2OPmoLJ3kJ4m%j0Jj1K3
$$ 6 5 3 -19 -24 -26 -16 -25 -7 -17 -16 -23 -37 -37 -33 -12 -20 -6 -15 -18 -27 -23 -13 7 11 8 14 -3 3 8 12 24 30 37 33 27 30 43 41 55 51 51 41 42 31 54
5545E4Lnlrj6NKJ0lrmj2j5R%kKpj8j4ONjOj0j0k0nJ9mMj9Mk0nLQPJ6jj9j6PK0
$$ 54 57 52 49 40 24 29 31 41 38 29 25 13 -2 7 7 5 7 0 -18 -32 -26 -21 -22 -16 -26 -36 -56 -61 -42 -46 -42 -61 -57 -77 -82 -79 -71 -64 -48 -49 -68 -84 -77 -57
5589e7OPJ3j5%J0rK7lPJ0nlRJ2K0RJ0j6Jj0J7K7OPqk0JRJ0kNQrj4JmJ8%krk0l
$$ -57 -51 -44 -31 -46 -46 -36 -45 -18 -21 -14 -4 -9 -12 -3 9 29 38 48 32 33 23 40 67 73 80 72 52 53 62 72 70 75 83 74 60 61 57 75 75 73 64 44 41
5632D1J2nkJ0j5j7qLkJ6k1J4j8noQKJ2nno%%PJ8j0Qj1J0j6OJ0J6Mmmj7J2LRJ1
$$ 41 53 48 46 56 41 24 16 19 17 33 12 26 8 3 -3 5 7 19 14 9 3 3 3 10 28 18 26 15 25 9 15 25 41 45 41 37 20 32 35 44 55
5673E5Kj0Nj1J5J9LmJpj5MPJ5Jjj1kj1KK2q%j6qmKMKlj0nk2nJ3NQj7pj8mnJ8J
$$ 55 57 47 52 41 56 75 78 74 75 68 53 57 64 79 80 79 68 66 55 57 79 71 71 55 47 43 45 49 51 48 38 33 11 6 19 24 32 15 8 -10 -14 -19 -1 0
5717@jk0Kj9J3KJ1K3k2Mj9LNJ6J6Lrj7ORRK1Mnn%LPJ0jJ8nj0j1KL0j2J4rknpQ
$$ 0 -1 -21 -19 -38 -25 -23 -12 11 -11 -7 -26 -23 -18 -2 14 17 8 -9 -3 6 15 36 40 35 30 30 33 40 50 49 67 62 52 41 43 73 61 75 66 64 59 52 60
5760F0POmmk9%LLPlnj6j5j5J5OJj1oj5nqMJ3Kj0j8k2PQ%KNj3okONQRok4kpJ8K2
$$ 60 67 73 69 65 36 36 39 42 49 46 41 25 10 -5 10 16 17 6 0 -15 -20 -28 -24 -11 -9 -19 -37 -59 -52 -44 -44 -42 -37 -50 -56 -58 -52 -47 -39 -30 -36 -60 -62 -69 -51 -29
5806b9k%j1%oRJ5J5PJj2j4RJ2K0J2qnj3J0JJ3J7J0qk9%JQK1%mk2j0j6J8J3J0j3
$$ -29 -31 -31 -42 -42 -48 -39 -24 -9 -2 -1 -13 -27 -18 -6 14 26 18 13 0 10 11 24 41 51 43 14 14 15 23 44 44 40 18 8 -8 10 23 33 20
5845B0pk7j7J3PJ0Jkj7j5kKJ6Qrj3j5kLRQPooqoK0J9%Kj6qJ0OJ9kPmj8MoK4J8
$$ 20 13 -14 -31 -18 -11 -1 0 -2 -19 -34 -36 -34 -18 -10 -19 -32 -47 -49 -46 -37 -29 -22 -28 -34 -42 -48 -28 -9 -9 -7 -23 -31 -21 -15 4 2 9 5 -13 -9 -15 9 27
5888B7Mppj9J0OJ2J4lqj3kmJ3J9oMk7nrJ3RKlj1j0j3KLJ0n%k2j2j5J4JJjj2j5
$$ 27 31 24 17 -2 8 14 26 40 37 29 16 14 10 23 42 36 40 13 8 -1 12 21 23 20 9 -1 -14 -12 -9 1 -4 -4 -26 -38 -53 -39 -38 -37 -38 -50 -65
5929f5qj2J8QNk1nj8jJ4NRkj1j1jRK4JJ3j2pqLL6J0Q%j1nKJ2J0J9Jrj1LRRJ0N
$$ -65 -73 -85 -67 -59 -54 -75 -80 -98 -99 -85 -80 -71 -73 -84 -95 -96 -87 -63 -62 -49 -61 -68 -76 -73 -37 -27 -19 -19 -30 -35 -33 -21 -11 8 9 0 -11 -8 1 10 20 25
5971B5lok1RJ8J2Ojj2j4j%QJ0Qj1j8nlJ1J8J1j3j6j1mqJ6Nnj1pj8oK1NRoj8j9
$$ 25 22 16 -5 4 22 34 40 39 27 13 12 12 20 30 38 27 9 4 1 12 30 41 28 12 1 -3 -11 5 10 5 -6 -13 -31 -37 -16 -11 -2 -8 -26 -45
6011d5k%J7MKkk5kkNJ1K0j0j9pkJ6J2QJ0j0k2%J2KL0%Kj3j2KJ0RJ3J0j3rj8%K2
$$ -45 -47 -47 -30 -26 -24 -26 -51 -53 -55 -50 -39 -19 -29 -48 -55 -57 -41 -29 -21 -11 -21 -43 -43 -31 -29 1 1 3 -10 -22 -20 -10 -1 12 22 9 0 -18 -18 4
6051DJ3J8k3qj5jJ1J7Rnj5j9j4JK6J2Pj0k1j1LJ1MJ1rj0j1j0K2%J1Rj3j9j0JK3
$$ 4 17 35 12 4 -11 -12 -1 16 25 20 5 -14 -28 -27 -1 11 18 8 -13 -24 -21 -10 -6 5 -4 -14 -25 -35 -13 -13 -2 7 -6 -25 -35 -34 -11
6088a1K4lplj2mJ5RJ5jlj6qJ0K2J2J2qopkJ3K3K0rrj6QJ4PJ6K0j2j3qJ5NJ1J5
$$ -11 13 10 3 0 -12 -16 -1 8 23 22 19 3 -5 5 27 39 51 43 37 30 28 41 64 84 75 66 50 58 72 79 95 115 103 90 82 97 102 113 128
6127A28ok3rmjJ5J0Mk5j8j1oQJ2Pj7j1k1j5PJ4jnj7k3qqRJ0J3j9j8j1rJ1J0J2
$$ 128 122 99 90 86 85 100 110 114 89 71 60 54 62 74 81 64 53 32 17 24 38 37 32 15 -8 -16 -24 -15 -5 8 -11 -29 -40 -49 -38 -28 -16
6164a6j1k4pJmK0J4Rj2j5j1QJ0J6Rmnoj5K5J4K4Lj0rj3QJ3K7LOk1knJ7MK9j8k
$$ -16 -27 -51 -58 -57 -61 -41 -27 -18 -30 -45 -56 -48 -38 -22 -13 -17 -22 -28 -43 -18 -4 20 23 13 4 -9 -1 12 39 42 48 27 25 20 37 41 70 52 50
6203E0oj9OJ2OJ0j2pk3j1J5JJ3Ok7j2j6j1RK6mqj9j6j7J1J3J6j0j2j6j5J6J5J1
$$ 50 44 25 31 43 49 59 47 40 17 6 21 22 35 41 14 2 -14 -25 -16 10 6 -2 -21 -37 -54 -43 -30 -14 -24 -36 -52 -67 -51 -36 -25
6238b5joj1qKJ5J5J5Nmj0jLK7K3jlj6kOJ8J6lJ3j0rqJ5J6J0Rj5j6j2mK6LQj2k8
$$ -25 -26 -32 -43 -51 -49 -34 -19 -4 1 -3 -13 -14 -11 16 39 38 35 19 17 23 41 57 54 67 57 48 40 55 71 81 90 75 59 47 43 69 72 80 68 40
6278D0j8%KJ0J0pj3l0j7kJ8J7qll3j4oJ2JOKk0j6j3NJ4J3jnj1k1OJ1K2MNmj6j4
$$ 40 22 22 24 34 44 37 24 -6 -23 -25 -7 10 2 -1 -34 -48 -54 -42 -41 -35 -33 -53 -69 -82 -77 -63 -50 -51 -56 -67 -88 -82 -71 -49 -45 -40 -44 -60 -74
6317g4J1L6j1L2j3ojlK2K1NJ0j9qJJ8K2J3J5jk9kONK3J0pj4j1lMJ6J9nk1k2rm
$$ -74 -63 -27 -38 -6 -19 -25 -26 -29 -7 14 19 29 10 2 3 21 43 56 71 70 41 39 45 50 73 83 76 62 51 48 52 68 87 82 61 39 30 26
6355B6J4QkLl8k1LJ2J0J0j2j0k1k2NKK2Mnj5j6j3J4K2J6nj6l2PJ6J8J8ljj7j7
$$ 26 40 48 46 49 11 -10 -7 5 15 25 13 3 -18 -40 -35 -33 -11 -7 -12 -27 -43 -56 -42 -20 -4 -9 -25 -57 -50 -34 -16 2 -1 -2 -19 -36
6391c6JK8RJ4prk0mJ3J7JJ8j5k2mPJ4QOMj1l0kJ2kK0pj2j4pjJ0J2Jmj4k1nJ6O
$$ -36 -35 -7 2 16 9 0 -20 -24 -11 6 7 25 10 -12 -16 -9 5 13 19 23 12 -18 -20 -8 -10 10 3 -9 -23 -30 -31 -21 -9 -8 -12 -26 -47 -52 -36 -30
6431c0K1j8kl2j3J1MJ7Mok9JoJ6MPpnj9p%K1K1Lj0j2j2jK2J4QMj7r%nK6K0oj2
$$ -30 -9 -27 -29 -61 -74 -63 -59 -42 -38 -44 -73 -72 -78 -62 -58 -51 -58 -63 -82 -89 -89 -68 -47 -44 -54 -66 -78 -79 -57 -43 -35 -31 -48 -57 -57 -62 -36 -16 -22 -34
6471c4j8OmJ9J6Pj5lqMLJ2J1J4j9j3j5J0RK0rPk1rJJ4J0J3qj3k0OoK1J6J1j1j8
$$ -34 -52 -46 -50 -31 -15 -8 -23 -26 -34 -30 -27 -15 -4 10 -9 -22 -37 -27 -18 2 -7 0 -21 -30 -29 -15 -5 8 0 -13 -33 -27 -33 -12 4 15 4 -14
6509a4qj3L0PJ6oj1k7%%J8K0J0j8j9j9MK6J0Nj2rk0LMK2JNqj4pOJ0L3qRj2rLP
$$ -14 -22 -35 -5 2 18 12 1 -26 -26 -26 -8 12 22 4 -15 -34 -30 -4 6 11 -1 -10 -30 -27 -23 -1 0 5 -3 -17 -24 -18 -8 25 17 26 14 5 8 15
6549A5K1K3kj0j1LJ1J8J7J3%k4JlJ8J4J6nlj3qJ0K0J7nmj1j4N%K8J0mj2l2qJ3
$$ 15 36 59 57 47 36 39 50 68 85 98 98 74 75 72 90 104 120 115 112 99 91 101 121 138 133 129 118 104 109 109 137 147 143 131 99 91 104
6586A04J4Qnj4k0j8nJ8J4j%k6j2j7RJ3J8j0j2l2k0J1J2J1jmk8j5pJ3J3RJ2j6j5
$$ 104 118 126 121 107 87 69 64 82 96 95 95 69 57 40 49 62 80 70 58 26 6 17 29 40 39 35 7 -8 -15 -2 11 20 32 16 1
6621Aj3PK8J0J4j6jj4kK7K2J0Oj7j2kNK1J4Nlj3j7qK7NOJj2k3rRlJ8pj4k4j8q
$$ 1 -12 -5 23 33 47 31 30 16 14 41 63 73 79 62 50 48 53 74 88 93 90 77 60 52 79 84 90 91 79 56 47 56 53 71 64 50 26 8 0
6660@KRJ3j7k3j4k9J2K2pnj9k7j4OPJ9jj1k1kj9J0J6K1Qk0j1nNK8K3mrjj4OK5
$$ 0 2 11 24 7 -16 -30 -59 -47 -25 -32 -37 -56 -83 -97 -91 -84 -65 -66 -77 -98 -100 -119 -109 -93 -72 -64 -84 -95 -100 -95 -67 -44 -48 -57 -58 -72 -66 -41
6698d1K6NLj2oj0J2L2J7Olj6QjJ3J0jK1k1j5nJJ6J4mol1k1%J4J3Pj7k9k0m%Q%
$$ -41 -15 -10 -7 -19 -25 -35 -23 9 26 32 29 13 21 20 33 43 42 63 42 27 22 23 39 53 49 43 12 -9 -9 5 18 25 8 -21 -41 -45 -45 -37 -37
6737c7j5mj9j8mJ1LJ9j5k1k2oJ3J4J8lkk0J1mK5J7J4oolOK1K5K2Ljj2%OJ8L3J
$$ -37 -52 -56 -75 -93 -97 -86 -83 -64 -79 -100 -122 -128 -115 -101 -83 -86 -88 -108 -97 -101 -76 -59 -45 -51 -57 -60 -54 -33 -8 14 17 16 4 4 10 28 61 62
6775F2Mj8%qK3K0Rqj4k2Qj1K4J0lj3k1j1nJ2J0Jj1k8k1j%J2Qnk5k4joPJ9Kj5q
$$ 62 66 48 48 40 63 83 92 84 70 48 56 45 69 79 76 63 42 31 26 38 48 49 38 10 -11 -12 -12 0 8 3 -22 -46 -47 -53 -46 -27 -25 -40 -48
6814d8k8PjK2Rkrpj0J3J4J5QorqJ1J1K4J3LKj6KJ6K1J6J2jk7PnK2J6NJj5lrJJ0
$$ -48 -76 -69 -70 -48 -39 -41 -50 -57 -67 -54 -40 -25 -17 -23 -32 -40 -29 -18 6 19 22 24 8 10 26 47 63 75 74 47 54 49 71 87 92 93 78 75 66 67 77
6855G7MQmj9k6JJ3NJ0j5k1k8j6J4JRll0nk1KLJ4Kkk3j6NpJ3K1Jj4k2qJ7J8J6P
$$ 77 81 89 85 66 40 41 54 59 69 54 33 5 -11 3 4 13 10 -20 -25 -46 -44 -41 -27 -25 -27 -50 -66 -61 -68 -55 -34 -33 -47 -69 -77 -60 -42 -26 -19
6894a9nj2j0RJ4J6K0lj4j1pK1J4K3lj3j0qJK1J3Mrj6%j8J0K0LQk0j3k4J2J2J0
$$ -19 -24 -36 -46 -37 -23 -7 13 10 -4 -15 -22 -1 13 36 33 20 10 2 3 24 37 41 32 16 16 -2 8 28 31 39 19 6 -18 -6 6 16
6930A6k%k0j7jnK7qK1k2j7ppK2J2Lrj5k2jJ4J4RPk2j0kLK3LJ2k0mjoJ4J2K0j4
$$ 16 14 14 -6 -23 -24 -29 -2 -10 11 -11 -28 -35 -42 -20 -8 -5 -14 -29 -51 -52 -38 -24 -15 -8 -30 -40 -42 -39 -16 -13 -1 -21 -25 -26 -32 -18 -6 14 0
6969@rj6KJ4J4K2Kj9qj8J1J2J4KKj4j4lJ0KJ3jrk1j9QJ5K4%nk0kJkJ7J1J1j8k7
$$ 0 -9 -25 -23 -9 5 27 29 10 2 -16 -5 7 21 23 25 11 -3 -6 4 6 19 18 9 -12 -31 -23 -8 16 16 11 -9 -11 -10 -12 5 16 27 9 -18
7008a8J1mJ8J6J6lrk7J0J8K0PJ2j4j7lJ7J1K0J0lk0rJJ1J0K0mj8j6j0J2J3J5q
$$ -18 -7 -11 7 23 39 36 27 0 10 28 48 55 67 53 36 33 50 61 81 91 88 68 59 60 71 81 101 97 79 63 53 65 78 93 85
7043H5Kj3k1mJ1K2Lj2Pl2oNJ9K2nj1j6k3J5PK5Kmk8rOPJ0J2J0rk5lJ0K1J6Oj2
$$ 85 87 74 53 49 60 82 85 73 80 48 42 47 66 88 83 72 56 33 48 55 80 82 78 50 41 47 54 64 76 86 77 52 49 59 80 96 102 90
7081I0j6nkJ5K2J1pk1j6mNRROk0j5rj6PJ5J0j0j5k5opK3J2j3lj9k2j2J0K2Jj5
$$ 90 74 69 67 82 104 115 108 87 71 67 72 81 90 96 76 61 52 36 43 58 68 58 43 18 12 5 28 40 27 24 5 -17 -29 -19 3 4 -11
7118a1j5j9j2JK2Moj2k3LnJ8J7pQk0nkK4QJ7J2j0j9lQK0K7J1lj9nJ0J1K6PMqq
$$ -11 -26 -45 -57 -56 -34 -30 -36 -48 -71 -68 -73 -55 -38 -45 -37 -57 -62 -64 -40 -32 -15 -3 -13 -32 -35 -27 -7 20 31 28 9 4 14 25 51 58 62 54 46
7157D6j5JK3MRqj1j7j6J1K3KJk1k9j3nJ8J1%j4k6j3j1K2J0kMk9k7kJ5JJ9jj0k0
$$ 46 31 32 55 59 68 60 49 32 16 27 50 52 53 32 3 -10 -15 3 14 14 0 -26 -39 -50 -28 -18 -20 -16 -45 -72 -74 -59 -58 -39 -40 -50 -70
7194g0j7J4J9K2Jmpj8kPK3J5Qj6rrPJ2M0Kj3j6P%NK0KJ2j2j5j4J0L4nOml2nmJ7
$$ -70 -87 -73 -54 -32 -31 -35 -42 -60 -62 -55 -32 -17 -9 -25 -34 -43 -36 -24 16 18 5 -11 -4 -4 1 21 23 35 23 8 -6 4 38 33 39 35 3 -2 -6 11
7234A1LJ3ok9j4nkJ6Rj2rj5j8j3J1L6kj4k7k0KJ0K3KJpk0LlK7J6MllrjJ7J4K8
$$ 11 14 27 21 -8 -22 -27 -29 -13 -4 -16 -25 -40 -58 -71 -60 -24 -26 -40 -67 -87 -85 -75 -52 -50 -49 -56 -76 -73 -76 -49 -33 -29 -32 -35 -44 -45 -28 -14 14
7273A4Rlj4N%J9K8J2J0k3pkJ2K1J7lrj1qjK7J3kj3k3opRJ4%ok1k4mJ0oK0j4ol2
$$ 14 23 20 6 11 11 30 58 70 80 57 50 48 60 81 98 95 86 75 67 66 93 106 104 91 68 62 55 64 78 78 72 51 27 23 33 27 47 33 27 -5
7313ekJMJ2Okl5Lj8RJ1K5jk7j3j7%J7K0J5j0k1j2NQJ9POqrrkK1K3Nmj4j9pK0J7
$$ -5 -7 -6 -2 10 16 14 -21 -18 -36 -27 -16 9 8 -19 -32 -49 -49 -32 -12 3 -7 -28 -40 -35 -27 -8 -1 5 -3 -12 -21 -23 -2 21 26 22 8 -11 -18 2 19
7354A9J0%j3j5lKJ9J1%nk2j6MKK3nmj5j7knJ7J7pj8ol0J6RJ5PJj1l0Q%J9K0j1
$$ 19 29 29 16 1 -2 0 19 30 30 25 3 -13 -9 -7 16 11 7 -8 -25 -27 -32 -15 2 -5 -23 -29 -59 -43 -34 -19 -12 -11 -22 -52 -44 -44 -25 -5 -16
7393a6Kpk4RL4PJ6kj9pRNK3J7kjk7jJ0J8J3J0mj0k1LPK1J1Ml2ookPJ4Ok2j2k0
$$ -16 -14 -21 -45 -36 -2 5 21 19 0 -7 2 7 30 47 45 44 17 16 26 44 57 67 63 53 32 35 42 63 74 78 46 40 34 32 39 53 59 37 25 5
7433EjJ4jJ2nk0j6ojJ1J7qj3j1j0pJ5J3MLj0k5jJ0NK6Lj4j5j3%J0L0Pj0j3k0K
$$ 5 4 18 17 29 24 4 -12 -18 -19 -8 9 1 -12 -23 -33 -40 -25 -12 -8 -5 -15 -40 -41 -31 -26 0 3 -11 -26 -39 -39 -29 1 8 -2 -15 -35 -33
7471c3MK1K5prk0J0kJ3LJ7Kl1j8MJ0K5QJk4oolJ9%J7j6j3k7K1OJ1K5k3j4qj1M
$$ -33 -29 -8 17 10 1 -19 -9 -11 2 5 22 24 -7 -25 -21 -11 14 22 23 -1 -7 -13 -16 3 3 20 4 -9 -36 -15 -9 2 27 4 -10 -18 -29 -25
7509b5QK1J2j1l2LMNK3PMj9lj0ML2J7qoj1OnJ8K1J1krj2JQK1J4Jj8j3kjJ5J5J0
$$ -25 -17 4 16 5 -27 -24 -20 -15 8 15 19 0 -3 -13 -9 23 40 32 26 15 21 16 34 55 66 64 55 43 44 52 73 87 88 70 57 55 54 69 84 94
7549I4k2j6kpNJ2Qpkk4rOMJ7lj6j5j8QRPNOk3nj4lK1OJ0pj5j4MQK6qpjj6jmK5
$$ 94 72 56 54 47 52 64 72 65 63 39 30 36 40 57 54 38 23 5 13 22 29 34 40 17 12 -2 -5 16 22 32 25 10 -4 0 8 34 26 19 18 2 1 -3 22
7592B2PLj2j8j3KJ5J8J2ok3qpRJ4J2mlk2mjOJ4K2k4j4nj9J5OJ2J2l0j1j5MNK5
$$ 22 29 32 20 2 -11 -9 6 24 36 30 7 -1 -8 1 15 27 23 20 -2 -6 -7 -1 13 35 11 -3 -8 -27 -12 -6 6 18 -12 -23 -38 -34 -29 -4
7630dnnj7j7LJL0oRk5rqJ9J1NNLj6k2J3K0PJ1p%j7lRJ4J0RKj7j4J8OK2kJ2k0j0
$$ -4 -9 -14 -31 -48 -45 -44 -14 -20 -11 -36 -45 -53 -34 -23 -18 -13 -10 -26 -48 -35 -15 -8 3 -4 -4 -21 -24 -15 -1 9 18 20 3 -11 7 13 35 33 45 25 15
7671A5j3J6K0jJ3j9j0k2J1J9n%qrj6oJK3Njj8j0j5NRJ6Jnk1j5oK0OJ2moj7j6J2
$$ 15 2 18 38 37 50 31 21 -1 10 29 24 24 16 7 -9 -15 -14 9 14 13 -5 -15 -30 -25 -16 0 1 -4 -25 -40 -46 -26 -20 -8 -12 -18 -35 -51 -39
7710c9J5J5%Kk5j0lJ9J0J0nj0j5qkJ6J5Pj4j0j3rJ5K0kjj0pJkK6Nqj0j0j2KK1
$$ -39 -24 -9 -9 -7 -32 -42 -45 -26 -16 -6 -11 -21 -36 -44 -46 -30 -15 -8 -22 -32 -45 -54 -39 -19 -21 -22 -32 -39 -38 -40 -14 -9 -17 -27 -37 -49 -47 -26
7748b6J5mNql0LQK2J1Lk3p%j4J7K2Pj0j0j5OJ8LJ9Kj5lk7J4K7RJ2j6j5%rJ5J9
$$ -26 -11 -15 -10 -18 -48 -45 -37 -15 -4 -1 -24 -31 -31 -45 -28 -6 1 -9 -19 -34 -28 -10 -7 12 14 -1 -4 -31 -17 10 19 31 15 0 0 -9 6 25
7786B5NPj7kk%OK9nj2j1j4%J2J5Mjj8k4%PJ5Oj2mk6kMjJ1Kj3mk1nkK2LOj1k5j
$$ 25 30 37 20 18 16 16 22 51 46 34 23 9 9 21 36 40 39 21 -3 -3 4 19 25 13 9 -17 -19 -15 -16 -5 -3 -16 -20 -41 -46 -48 -26 -23 -17 -28 -53 -54
7828e4j0K3J8mqjj5mPK2JMj4lk0J6K3O%Oj5k1KJ6J7J9j4mj2QMJ1J0Mjj9mmK4%
$$ -54 -64 -41 -23 -27 -35 -36 -51 -55 -48 -26 -25 -21 -35 -38 -58 -42 -19 -13 -13 -7 -22 -43 -41 -25 -8 11 -3 -7 -19 -11 -7 4 14 18 17 -2 -6 -10 14 14
7868A4L1j8lj2j3J2J7J6Okj5j6%J6J0J1Pj6j6KMJ3J3Rj5k1kKJ0J4Rqj7p%RJ6N
$$ 14 45 27 24 12 -1 11 28 44 50 48 33 17 17 33 43 54 61 45 29 31 35 48 61 70 55 34 32 34 44 58 67 59 42 35 35 44 60 65
7906F5Nj4j3qJ3QK3qmqlJj4K5nJ7k8j4jQJ5%Lnk7lolJ9j3Lrk0%%JMLok7mKMJ6
$$ 65 70 56 43 35 48 56 79 71 67 59 56 57 43 68 63 80 52 38 37 45 60 60 63 58 31 28 22 19 38 25 28 19 -1 -1 -1 0 4 7 1 -26 -30 -28 -24 -8
7950hk%j0j9%pJ9Qkkk4nJ0J1K0pPk1j4MK0NLJ7j7j8mNK1J9Pj2k3qQJQK1j3Nj6
$$ -8 -10 -10 -20 -39 -39 -46 -27 -19 -21 -23 -47 -52 -42 -31 -11 -18 -11 -32 -46 -42 -22 -17 -14 3 -14 -32 -36 -31 -10 9 16 4 -19 -27 -19 -18 -10 11 -2 3 -13
7991a3JJ3%J0J0j7llpJ9OJ4llj8j0OJ7J3jj5mj1lJ3J9Nj0Kk4kPJ2JPoj4Jj1J8
$$ -13 -12 1 1 11 21 4 1 -2 -9 10 16 30 27 24 6 -4 2 19 32 31 16 12 1 -2 11 30 35 25 27 3 1 8 20 21 28 22 8 9 -2 16
8031A6J8olj3jmNJ5PMrj2k2J4J2NRllk1KOJ7PKj3rj1J0MJ0J0qrk4LOJ1jOj5rm
$$ 16 34 28 25 12 11 7 12 27 34 38 29 17 -5 9 21 26 35 32 29 8 10 16 33 40 42 29 20 9 19 23 33 43 35 26 2 5 11 22 21 27 12 3 -1
8074amJ3PJ%k0mkJ5RLmj1j6nJ2PK3jj7j0%omK2mqpj5mOJ5Rnk1nrj%PPmj0j1rM
$$ -1 -5 8 15 16 16 -4 -8 -10 5 14 17 13 2 -14 -19 -7 0 23 22 5 -5 -5 -11 -15 7 3 -5 -12 -27 -31 -25 -10 -1 -6 -27 -32 -41 -42 -42 -35 -28 -32 -42 -53 -62 -58
8120e8J6%Lj1qj0ORJ2mMj6mJj0K9J5mj9pqJ8R%kmjolJ7RLjj0J%J1nJ5Kmj0LmJ5
$$ -58 -42 -42 -39 -50 -58 -68 -62 -53 -41 -45 -41 -57 -61 -60 -70 -41 -26 -30 -49 -56 -64 -46 -37 -37 -39 -43 -44 -50 -53 -36 -27 -24 -25 -35 -34 -34 -23 -28 -13 -11 -15 -25 -22 -26 -11
8165a1J7j0Rj9mKJ3JJ3Jjqk1J0OK3Lnj7j0LQJ6qJ0j8
$$ -11 6 -4 5 -14 -18 -16 -3 -2 11 12 11 3 -18 -8 -2 21 24 19 2 -8 -5 3 19 11 21 3
8191C
$$ Imaginary data points
##PAGE= N=2
##DATA TABLE= (X++(I..I)), XYDATA
0@%%%%%%%%%%%%%%Qj6J6j6J7k5L2l3M1m9N7o7P6r0J06j22J38j56J79k04K30k61
$$ 0 0 0 0 0 0 0 0 0 0 0 0 0 0 0 8 -8 8 -8 9 -16 16 -17 24 -25 32 -35 41 -49 57 -65 73 -83 96 -108 122 -139
36a39K94l27L65m08M54n05N61o21O87p61Q41r26J018j123J239j365J505j660J834
$$ -139 155 -172 193 -215 239 -266 295 -326 361 -400 441 -485 533 -590 649 -716 789 -871 963
55I63k028K250k504K795l138L549m049M673n481O567q120J0548j4911K5261r7583
$$ 963 -1065 1185 -1319 1476 -1662 1887 -2162 2511 -2970 3597 -4523 6025 -8886 16375 -81208
70h1208j12335M9312J0733K2717j6005j3586k1229O450J7294L3829J9980P897
$$ -81208 -193543 -144231 -133498 -110781 -126786 -140372 -161601 -155151 -137857 -104028 -84048 -76151
82g6151j3875j2584n076J7263K7156K9700J2085l578j5273q156O184K4723K8343
$$ -76151 -90026 -102610 -107686 -90423 -63267 -33567 -21482 -25060 -40333 -48489 -42305 -17582 10761
95A0761K0106Q71j2702j5778k636J4172K5993K2213P502j0666j8832j3286L292
$$ 10761 30867 31738 19036 3258 622 14794 40787 63000 70502 59836 41004 27718 31010
108C1010J7564K1340J0978o540j9973j9859p891Q312J7549J3256j733j6996k2902
$$ 31010 48574 69914 80892 74352 54379 34520 26629 34941 52490 65746 64013 47017 24115
121B4115j5497l5J3260J5242M774j0723k1000j9356o544Q771J6152J1377k261
$$ 24115 8618 8583 21843 37085 41859 31136 10136 -9220 -15764 -6993 9159 20536 18275
134A8275j5723j9661j1272L670J5304J6296N995q531j7202j4189j538J2512J8699
$$ 18275 2552 -17109 -28381 -24711 -9407 6889 12884 4353 -12849 -27038 -28576 -16064 2635
147B635J2953p02j2769j5166o467P865J8104J7357O396p261j4716j0902J566J3990
$$ 2635 15588 14886 2117 -13049 -19516 -11651 6453 23810 30206 22945 8229 -2673 -1107 12883
161A2883J8109J1256k063j3077j4466n547P324J5454J3468K408j0358j6234j1744
$$ 12883 30992 42248 40185 27108 12642 7095 14419 29873 43341 45749 35391 19157 7413
174G413q9J0940J3790O375o249j5649j5840o664N600J2715R789j065j2663j7286
$$ 7413 7324 18264 32054 38429 32180 16531 691 -5973 -373 12342 22131 21066 8403 -8883
188h883j1839J15J0349J2071M409p592j5905j4661m820O953J3057R478j278j1745
$$ -8883 -20722 -20607 -10258 1813 6222 -1370 -17275 -31936 -36756 -29803 -16746 -7268 -8546 -20291
202b0291j4674q319L250J2533J3306N244n831j2494j0322n69J0302J5013J0537
$$ -20291 -34965 -43284 -40034 -27501 -14195 -8951 -14782 -27276 -37598 -38167 -27865 -12852 -2315
215b315K22r135j1365m638O371J4163J3738N498n347j1317q429J205J1061J4750
$$ -2315 -2093 -11228 -22593 -27231 -20860 -6697 7041 12539 7192 -4125 -12554 -11349 -288 14462
229A4462R573j144r974j1191m191O384J3436J2001L041p318j2380q889Q05J0047
$$ 14462 24035 22891 12917 1726 -2465 3919 17355 29356 32397 25079 12699 3810 4615 14662
243A4662J2449O495l770j1774j2115m539N414J1204R059K55r376j3219q802O41
$$ 14662 27111 33606 29836 18062 5947 1408 6822 18026 27085 27340 17964 4745 -4057 -3416
257c416Q945J0713M520n436j2214j1437l763N989J1192Q309o21r426j2392p501
$$ -3416 5529 16242 20762 15326 3112 -8325 -12088 -6099 5093 13402 12781 3355 -9037 -16538
271a6538K304J0164J0863M196n444j1625j0112j793P579J1710Q128r02r282j1235
$$ -16538 -14234 -4070 6793 10989 5545 -6080 -16192 -17985 -10406 1304 9432 8530 -752 -11987
285a1987n579L831J0723J0614L428n873j0880q584l95Q232J1379O983j896r318
$$ -11987 -17566 -13735 -3012 7602 11030 5157 -5723 -14307 -14702 -6470 4909 11892 9996 678
299F78j0466m542M621J0615R513K208o592j0992p982M64Q503J0854O063k915r870
$$ 678 -9788 -14330 -9709 906 10419 12627 6035 -4957 -12939 -12475 -3972 6882 12945 10030 160
314A60j0137l631N313J0713R033J252p258j0665o956J468R086J0581N138l572
$$ 160 -9977 -13608 -8295 2418 11451 12703 5445 -5220 -12176 -10708 -1622 8959 14097 10525
328A0525r620r134k348O199J0572Q108M23p383j0038n744K459R061R786M086m356
$$ 10525 905 -8229 -10577 -4378 6194 14302 14725 7342 -2696 -8440 -5981 3080 12866 16952 12596
343A2596r772q502j625O251J0051O998r25q247j0154n546K650Q871Q840K640n556
$$ 12596 2824 -5678 -7303 -1052 8999 15997 15072 6825 -3329 -8875 -6225 2646 11486 14126 8570
358H570j0288q477j231O512R397N763k047q814r961m680L346Q713P989J654o047
$$ 8570 -1718 -10195 -11426 -4914 4483 10246 8199 -615 -10576 -15256 -11910 -3197 4792 6446 399
373C99r846p206k3P033R259N121k442q256q558l112M655R405P970J505n583q729
$$ 399 -9447 -16653 -16676 -9643 -384 4737 2295 -5961 -14519 -17631 -12976 -3571 4399 5904 321 -8408
389h408n694J640Q219R609N104k400p910p627j774N600R595P641Q38o189q650
$$ -8408 -14102 -12462 -4243 5366 10470 8070 160 -7467 -9241 -3641 5954 13595 14433 8244 -406
404d06n029K064P989Q763L692l747q473p565j664N235Q471N782r42p251r028n122
$$ -406 -5435 -3371 4618 13381 17073 13326 4853 -2712 -4376 859 9330 15112 14170 6919 -2109 -7231
420g231J829P002O994J857n134r250p760j708M813P443M558k135p974r044m655
$$ -7231 -5402 1600 8594 10451 5317 -3933 -11693 -13401 -8588 -1145 3413 1278 -6696 -15740 -20395
435b0395K300P255O889J451n168q653o554k28O214Q380M927j601o883p346k526
$$ -20395 -18095 -10840 -3951 -2500 -7668 -16321 -22875 -23103 -16889 -8509 -3582 -5183 -12066 -19412 -21938
450b1938M321Q585P505K049m251p046m409J876P531Q954N169j231n896n680q31
$$ -21938 -17617 -9032 -1527 522 -3729 -10775 -15184 -13308 -5777 3177 8346 7115 1219 -4461 -5292
465e292N448R051P454J702m257o548l673K441P675Q333M044k401o825o323j226
$$ -5292 156 9207 16661 18363 14106 7558 3885 6326 14001 22334 26378 23977 17152 10829 9603
480I603M844P736N539m36o271q064m701J390O063O225J610m673q389p142j906
$$ 9603 14447 22183 27722 27286 21015 12951 8250 9640 15703 21928 23538 18865 10476 3334 1428
495A428L784O197L552k285p349q345m655J320N494N082M65n240q335o614j172
$$ 1428 5212 11409 14961 12676 5327 -3018 -7673 -6353 -859 4223 4688 -552 -8887 -15501 -16673
510a6673M282O162L294k330p016p471l289K635O522N850J021m604p098m900O27
$$ -16673 -12391 -6229 -2935 -5265 -12281 -19752 -23041 -20406 -13884 -8034 -7013 -11617 -18715 -23615 -22988
525b2988N894P367M029j688n932n941j628M131P415O016J029m237o395l842J603
$$ -22988 -17094 -9727 -5698 -7386 -13318 -19259 -20887 -16756 -9341 -3325 -2296 -6533 -12928 -16770 -15167
540a5167O184O880L307k287o105n589j206M105O756N026j05n099o633l867J448
$$ -15167 -8983 -2103 1204 -1083 -7188 -12777 -13983 -9878 -3122 1904 1799 -3300 -9933 -13800 -12352
555a2352N744N985K076l382o783n956j329L917O221M001j064n763o937l633J823
$$ -12352 -6608 -623 1453 -1929 -8712 -14668 -15997 -12080 -5859 -1858 -2922 -8685 -15622 -19255 -17432
570a7432N734N642J594l695o559n029k03M743O602M110r80n113n545k038L232
$$ -17432 -11698 -6056 -4462 -8157 -14716 -19745 -19948 -15205 -8603 -4493 -5473 -10586 -16131 -18169 -14937
585a4937O717O014J806l028n365l596J276N849P110M279o73m554m711r04M120
$$ -14937 -8220 -2206 -400 -3428 -8793 -12389 -11113 -5264 1846 6125 5452 898 -3813 -4717 -597
600e97P099O105J695l236n274l087J669N919O818L544j625n195m974j121L735
$$ -597 6502 12607 14302 11066 5792 2705 4374 10293 17111 20655 19030 13835 8861 7740 11475
615A1475O284M682O1m486o103l700J099M917N163J745l126o261n545j468L079
$$ 11475 17759 22441 22502 18016 11913 8213 9312 14229 19392 21137 18011 11750 6205 4737 7816
630G816N146L342j184n446o451l682R97M540M583J007l757o394n303j101L380
$$ 7816 12962 16304 15120 9674 3223 -459 538 5078 9661 10668 6911 517 -4786 -5887 -2507
645b507N232L036j441n328n993k951J898N145M721J064l481n744m177J93M364
$$ -2507 2725 5761 4320 -1008 -7001 -9952 -8054 -2909 1812 2876 -605 -6349 -10526 -10333 -5969
660e969N633L282j274m779m857j615K898N639M798Q59l329n114l285Q97M733N545
$$ -5969 -336 2946 1672 -3107 -7964 -9579 -6681 -1042 3756 4615 1286 -3828 -7113 -6216 -1483 4062
676D062K770j594m766m662j211L137N478M249L25l789n329l178J100M595N079
$$ 4062 6832 5238 472 -4190 -5401 -2264 3214 7463 7788 3999 -1330 -4508 -3408 1187 6266
691F266K119k300n194m604j030L101N122L538n33m275n266k864J324M508M495
$$ 6266 8385 6085 891 -3713 -4743 -1642 3480 7018 6485 2210 -3056 -5920 -4596 -88 4407
706D407J354k720n119m166m72L395M954L084q05m212m865k160J881M710M437J204
$$ 4407 5761 3041 -2078 -6244 -6716 -3321 1633 4717 3912 -300 -5165 -7325 -5444 -734 3703 4907
722D907k790m861l574R4L796N082K961j003m184m485j671K335M904M203Q21k948
$$ 4907 2117 -2744 -6318 -6224 -2428 2654 5615 4612 428 -4057 -5728 -3393 1511 5714 6535 3587
738C587m715l168O09L987M753K424j420m299m188j218K591M624L619J92l335m598
$$ 3587 -1128 -4296 -3687 300 5053 7477 6057 1758 -2430 -3648 -1057 3567 7186 7378 4043 -555
754e55k830Q21L919M348J790j929m403l999r76K700M514L186k57l534m585k526
$$ -555 -3385 -2564 1355 5703 7493 5564 1161 -2838 -3814 -1114 3400 6586 6329 2795 -1790 -4316
770d316J162M001M116J447k180m430l664m64K934M424K865n97l639m255j952J545
$$ -4316 -3154 847 4963 6410 4230 -200 -3864 -4328 -1394 3030 5895 5298 1659 -2596 -4548 -3003
786c003M058L816R58k403m234l182j7L136M218K368r54l670m016j566J806L977
$$ -3003 1055 4871 5829 3426 -808 -3990 -4007 -871 3347 5715 4761 1091 -2925 -4491 -2685 1292
802A292L468N88k636m254k940K28L163M043K051j290l827l852j320J964L960L209
$$ 1292 4760 5348 2712 -1542 -4482 -4254 -1091 2952 5003 3713 -114 -3966 -5286 -3322 638 3847
818C847K14k861m133k611N74L333L822J692j549l809l463p98K312L890K900m6
$$ 3847 4061 1200 -2933 -5544 -4970 -1637 2185 3877 2328 -1481 -4944 -5742 -3430 460 3360 3314
834C314k946l816k056J023L454L710J419j705l646l083m14K533L956K673l23k964
$$ 3314 368 -3448 -5504 -4481 -1027 2683 4102 2397 -1249 -4332 -4746 -2213 1743 4416 4093 1129
850A129l695j833J263L563L480J069j934l749k975j73K665L720K241p39l243l638
$$ 1129 -2566 -4399 -3136 427 3907 4976 3042 -707 -3682 -3855 -1190 2530 4771 4032 789 -2849
866b849j524J406L391L066N24k369l778k681L9K640L428J729j167l411l440j300
$$ -2849 -4373 -2967 424 3490 4014 1645 -2133 -4814 -4775 -2135 1293 3022 1855 -1556 -4996 -6296
882f296J609L327K744K66k525l675k419L85K867L354J686j264l332l124q68J971
$$ -6296 -4687 -1360 1384 1650 -875 -4550 -6969 -6584 -3717 -363 1323 59 -3273 -6397 -7265 -5294
898e294L511K767J67k523l349j949Q37L133L406J467j370l152k697l63K316L541
$$ -5294 -1783 984 1151 -1372 -4721 -6670 -5833 -2700 706 2173 803 -2349 -5046 -5409 -3093 448
914D48K516q6k523l164j510J182L193L198J108j560l176k539j69K366L413K153
$$ 448 2964 2878 355 -2809 -4319 -3137 56 3254 4362 2802 -374 -2913 -3082 -716 2697 4850
930D850m76k731l194j490J199L118K872O66j901l329k548n8K386L214J712q38
$$ 4850 4374 1643 -1551 -3041 -1842 1276 4148 4814 2913 -416 -2964 -3022 -636 2578 4290 3452
946C452k915l147j207J399L044K585L43k163l259k139L08K511L031J488j098k923
$$ 3452 537 -2610 -3817 -2418 626 3211 3554 1391 -1868 -4007 -3699 -1188 1843 3331 2233 -690
962f90k780q15J663L106K414J56k185l077j839O15K715L019J338j175k901k624
$$ -690 -3470 -4285 -2622 484 2898 3054 869 -2208 -4047 -3432 -717 2302 3640 2465 -436 -3060
978c060n16J900L113K260q0k317l006j605Q27K716K794R32j502k931k440l19J945
$$ -3060 -3576 -1676 1437 3697 3617 1300 -1706 -3311 -2484 232 3026 3958 2456 -475 -2915 -3234 -1289
995a289K897J813n00k527k919j418R67K607K433N50j764k996k274j44J941K714
$$ -1289 1608 3421 2921 394 -2525 -3943 -2976 -369 2064 2614 850 -2146 -4420 -4564 -2623 91
1011I1J565p55k646k794j212J092K601K316M06j867k863k018J40K176K705J439
$$ 91 1656 901 -1745 -4539 -5751 -4659 -2058 258 664 -1203 -4066 -6084 -5944 -3768 -1063 376
1027C76q23k518k462p90J466K716K222K71j855k597j564N64K337K679J272r55
$$ 376 -447 -2965 -5427 -6217 -4751 -2035 187 458 -1397 -3994 -5558 -4994 -2657 22 1294 339
1043C39k427k159l95J666K764K063O5j877k504j334P57K448K575J018j082k439
$$ 339 -2088 -4247 -4642 -2976 -212 1851 1916 39 -2465 -3799 -3042 -594 1981 2999 1917 -522
1059e22k090k58J784K676J817j86k057k468j194Q75K410K325O98j351k484j895
$$ -522 -2612 -2870 -1086 1590 3407 3221 1164 -1304 -2498 -1623 787 3112 3810 2459 -25 -1920
1075a920o1J855K512J493n09k104k314r42J077K393K088M11j454k406j685J87
$$ -1920 -1981 -126 2386 3879 3370 1266 -1048 -1990 -913 1480 3568 3979 2525 119 -1566 -1379
1091a379J938K404J289o44k100k198p36J200K381J966K35j534k331j527L21K000
$$ -1379 559 2963 4252 3608 1508 -690 -1426 -226 2155 4121 4356 2822 491 -1036 -715 1285
1107A285K308J051q24k126k068n61J335K296J671k5j708k295j349N34J952K070
$$ 1285 3593 4644 3820 1694 -374 -935 400 2696 4367 4342 2634 339 -1010 -476 1476 3546
1123C546P27j063k221j922l55J370K184J445k63j851k238j187O25J978J962N67
$$ 3546 4273 3210 989 -933 -1288 82 2266 3711 3448 1597 -641 -1828 -1203 775 2737 3304
1139C304j188k211j805k13J506K150J338l83j876k132r48Q40K048J882M42j276
$$ 3304 2116 -95 -1900 -2113 -607 1543 2881 2498 622 -1510 -2458 -1618 430 2312 2754 1478
1155A478k125j520J09J667K141J171n31j851j879o25J060K112J725K46j329k030
$$ 1478 -647 -2167 -2058 -391 1750 2921 2390 539 -1340 -1965 -905 1207 2932 3178 1849 -181
1171a81j320K92J755K036J002o78j872j827n19J141K039J584Q8j463k042j243
$$ -181 -1501 -1209 546 2582 3584 2906 1034 -793 -1312 -171 1868 3452 3540 2077 35 -1208
1187a208L82J749J917P93q62j951j735l87J208J979J350j71j576j991j082N61
$$ -1208 -826 923 2840 3633 2771 820 -915 -1302 -94 1885 3235 3064 1488 -503 -1585 -1024
1203a024J742J741N55j009j958j588j68J305J908J207l11j621j864q69O66J800
$$ -1024 718 2459 3014 2005 47 -1541 -1709 -404 1504 2711 2400 779 -1085 -1954 -1288 512
1219E12J699M63j069j885j445k8J410J915J121l81j629j789p18Q45J838J581L05
$$ 512 2211 2674 1605 -280 -1725 -1753 -343 1572 2693 2312 683 -1106 -1824 -979 859 2440 2745
1236B745j157j863j271J74J489J819R27n77j678j651m98R52J788J422P7j295j810
$$ 2745 1588 -275 -1546 -1372 117 1936 2863 2286 608 -1043 -1541 -589 1199 2621 2698 1403 -407
1253d07j114K95J514J700P23p10j696j602m00J013J758J268k8j349j805r94L95
$$ -407 -1521 -1226 288 1988 2711 2001 305 -1297 -1697 -684 1074 2342 2314 965 -840 -1834 -1439
1270a439J538J630O01q33j716j452k22J121J718J137k11j421j675q14N81J583
$$ -1439 99 1729 2330 1497 -219 -1671 -1893 -772 946 2083 1872 451 -1224 -2038 -1457 126
1286A26J500M01r21j667j273l4J220J667R81l17j425j562o28O94J577J418L16
$$ 126 1626 2027 1106 -561 -1834 -1868 -648 1019 2000 1683 258 -1304 -1932 -1238 339 1757 2073
1303B073r92j618j153P2J277J624Q70m38j429j483n45P97J575J274J50j074j587
$$ 2073 1081 -537 -1690 -1618 -341 1283 2153 1715 286 -1197 -1742 -945 630 1904 2054 980 -607
1320f07j036K29J321J494O56n83j482j374l41Q64J506J100n5j188j539q88L14
$$ -607 -1643 -1414 -93 1401 2057 1474 -8 -1382 -1723 -859 647 1747 1692 504 -1035 -1923 -1609
1337a609J283J378M88p41j497j304k84Q91J407R59j91j246j529q16M05J250J240
$$ -1609 -326 1052 1540 799 -698 -2002 -2286 -1395 12 971 780 -466 -1995 -2811 -2406 -1156 84
1354H4L71q36j510j200j45R50J368Q17l28j273j383o25N45J288J162K23q77j383
$$ 84 455 -381 -1891 -3091 -3236 -2286 -918 -101 -429 -1702 -3085 -3710 -3165 -1877 -715 -492 -1369 -2752
1372b752j002Q1J078J348P40l52j201j211l94P25J366J148K36q34j271p85K56
$$ -2752 -3754 -3673 -2595 -1247 -507 -859 -2060 -3271 -3665 -2940 -1574 -426 -190 -1024 -2295 -3080 -2824
1389b824J183J394P48l67j149j066k40Q25J416J097J20q49j226o75L65J231J290
$$ -2824 -1641 -247 501 134 -1015 -2081 -2321 -1496 -80 1017 1137 288 -938 -1613 -1248 -17 1273
1406A273N53n01j175j029j32Q72J301Q87q5j006j228o15L79J123J122L16o77j262
$$ 1273 1826 1325 150 -879 -1011 -139 1162 2049 1964 958 -270 -885 -506 617 1739 2055 1378 116
1424A16j031j30P91J176P13k63j092j254o02L92J062J004K08p57j258r44k3Q51
$$ 116 -915 -1045 -254 922 1635 1372 280 -974 -1576 -1184 -122 882 1090 333 -925 -1869 -1892 -1041
1442a041J142O47l39j089j120m13N39J137R82J30p86j136p30J59R88J153N98l57
$$ -1041 101 748 409 -680 -1800 -2213 -1674 -537 445 575 -211 -1347 -2077 -1918 -930 223 821 464
1460D64j012r70k47O82J201R36J15p52j079o20K63J021J133N19l99j027r51k02
$$ 464 -548 -1518 -1765 -1083 118 1054 1169 417 -662 -1282 -1019 2 1135 1654 1255 228 -723 -925
1478i25O92J138P97n7q47j128o18K49R58R82K85n94j140r42j61O77J012O01k23
$$ -925 -233 905 1702 1645 798 -330 -948 -699 259 1241 1526 932 -208 -1150 -1311 -634 378 979 756
1497G56r97j125n42L03R17Q67J74o81j120q58p4P18R86N84k81r34j015m33M31
$$ 756 -241 -1366 -1908 -1605 -688 179 353 -328 -1448 -2306 -2380 -1662 -676 -92 -373 -1307 -2322 -2755 -2324
1516b324J009Q92J78o03r96o72J30Q70J071O25k33q36q36j76O29J101R13J74n98
$$ -2324 -1315 -423 -245 -848 -1844 -2516 -2386 -1516 -445 180 -53 -889 -1725 -1901 -1272 -171 742 916 318
1535C18q88m86K89R76J079N25k88q17p61r7O79J076Q05N6o46q81m78K90R22R30
$$ 318 -570 -1056 -767 209 1288 1813 1525 708 -53 -150 529 1605 2410 2466 1820 939 461 751 1673 2603
1555B603L91m09r12p80j24O16R25O19j37p90r58n12K60Q01P72J76n82r88p80j12
$$ 2603 2994 2585 1673 893 769 1385 2310 2929 2792 2002 1044 532 792 1593 2365 2541 1959 971 191 79
1575G9O09Q47M66k77q52r39m26L37Q08P05J05n98r44o73NO67Q50M55k68q16q22
$$ 79 688 1535 2001 1724 872 -67 -493 -156 652 1357 1462 864 -80 -753 -748 -81 769 1224 956 140 -682
1596f82k96M34Q76P20J11n65q48n40J43P76Q70M33k71p53p15j47N54Q89O59L1
$$ -682 -978 -544 332 1052 1163 598 -250 -790 -647 129 999 1432 1161 408 -307 -454 100 989 1648 1679
1616A679n93q03m29K52P70P91K92l68p89o68j17N31Q15N39j10o59q23m38K28P05
$$ 1679 1086 283 -146 106 876 1667 1959 1591 802 134 17 548 1363 1902 1792 1133 310 -128 100 805
1636H05O81J86m54q41o87j07M91P31M18k00p41q42l88K41O75O00Q3n57q39n98
$$ 805 1486 1672 1218 377 -310 -417 74 805 1223 1023 282 -560 -948 -707 -32 568 651 94 -745 -1343
1656a343j4N50P10L62k61p29p03k48L65P16O12P4n04p17m48J20O52P55L91k11
$$ -1343 -1357 -807 -97 265 4 -725 -1428 -1676 -1311 -595 17 91 -413 -1130 -1578 -1458 -806 -51 340 129
1676A29o48n73j36M52P96O22R4m76o33l47K15O97P54L35k41o21n26n6N01P47N10
$$ 129 -519 -1092 -1228 -776 20 642 736 260 -373 -720 -505 192 946 1281 1040 419 -107 -163 338 1085 1595
1697A595l0n36o67l37K26O28N89J56l93p22n86r0M09N99L39k13o68p37l90J54
$$ 1595 1565 1029 362 25 251 879 1468 1624 1231 509 -77 -167 242 841 1180 967 299 -438 -828 -674
1717f74N27M65L4n08p67o03r4L69N37K52k64o72p07l10K11N28M66Km86o84m42
$$ -674 -147 318 352 -156 -923 -1526 -1620 -1251 -714 -462 -726 -1398 -2105 -2415 -2204 -1676 -1210 -1208 -1694 -2378 -2820
1738b820N9M95O15L10k11n45n07j02M14O91N50J06l42n10k36K52O67P16L92j09
$$ -2820 -2761 -2266 -1651 -1341 -1552 -2097 -2604 -2706 -2292 -1601 -1051 -945 -1287 -1797 -2033 -1781 -1114 -398 -6 -115
1758a15m42l74L3N19P45N80J24l36m59j88K81O41O60L02k06m83m01J7M42O36M06
$$ -115 -557 -931 -898 -379 366 946 1070 734 275 87 368 1009 1669 1971 1765 1282 881 898 1340 1976 2382
1779B382q0m80n55k72K06N00M59O3l95o54m97p7L35M57K13k34o15o35l06J33M33
$$ 2382 2302 1822 1267 995 1201 1701 2160 2223 1828 1174 677 600 935 1392 1605 1371 756 121 -185 -52 381
1800C81L70k6m54o47m71m2L59M76K15k21n50n40j95K63N11M16M1l78n34k98J25
$$ 381 751 725 271 -376 -847 -889 -530 -54 161 -60 -610 -1150 -1345 -1082 -571 -155 -114 -492 -1026 -1324 -1199
1821a199M91N75K62j60m59l87j8L85O05M62N7l34m29k17K19N39N48K34k03m45
$$ -1199 -708 -133 129 -31 -490 -877 -895 -510 95 557 614 280 -149 -366 -147 392 940 1174 971 526
1841E26l90k6L65N20L53o0m06n00k68J51M15M10P3l14n51m39q1K83M36K10j86
$$ 526 136 110 475 995 1348 1288 882 382 114 265 680 1090 1163 849 298 -141 -222 61 497 707 521
1862E21n17n50k68J34M02L36ml82n52m05j6L23M18K03j79m58m44j48K36M61L97
$$ 521 4 -546 -814 -680 -278 58 54 -328 -880 -1285 -1301 -978 -560 -357 -536 -994 -1438 -1586 -1350 -889 -492
1883d92O4k86m13k43J23M40N30K87q6l51l00j5L59N65M36Q8k43l61j57K08M93
$$ -492 -428 -714 -1127 -1370 -1247 -807 -277 10 -76 -427 -727 -742 -383 182 618 706 463 102 -55 153 646
1904F46N02K34j42l70k93%L55M74L31l4l40l95j96J33L88L57R6k60m54l80o9K36
$$ 646 1148 1382 1240 870 577 577 932 1406 1737 1703 1363 968 772 905 1293 1650 1746 1486 1032 652 583 819
1926H19L45J84j48m28m89k58Q1L07K64pl45m96l82n3K55L25J39j87m33m22j66
$$ 819 1164 1348 1200 772 283 25 106 413 677 670 325 -171 -553 -606 -351 -26 113 -74 -507 -929 -1095
1947a095J54L61K94nl04m09k63O4L34L86J77j41l34l18o0K52M11L20M3k35l42
$$ -1095 -941 -580 -286 -291 -595 -1004 -1267 -1203 -869 -483 -306 -447 -781 -1099 -1159 -907 -496 -176 -133 -368 -710
1968g10j58J26L60M10J77j20l18k65j2K82M05K77kk83l33j59J36L59L26R6j94
$$ -710 -868 -742 -382 28 205 85 -233 -498 -510 -228 177 454 452 169 -164 -323 -187 172 498 594 400
1989D00l64k71j4K52L39K06q8l32l42j62J23L19K69M9k35l52k69JK44L30J58j16
$$ 400 36 -235 -249 3 342 548 460 128 -214 -376 -253 66 335 384 149 -203 -472 -471 -227 103 261 145
2011A45l12l01j26J56L17K62L6k18l30k06O1K80L42J61j05k94k53l9K29L43K68
$$ 145 -167 -468 -594 -438 -121 141 177 -41 -371 -577 -516 -236 106 267 162 -132 -385 -424 -195 148 416
2032D16K4k03k78j49J23L12L27J52j18k57k21k2K52L36K49Nk16k48j28J23L14
$$ 416 440 237 -41 -190 -67 245 572 724 606 349 128 106 358 694 943 948 732 484 356 479 793
2053G93L00J13j27k47j99PK35L28K01k2k32k56r7J38K99K54P1j66k90k14L6K05
$$ 793 1093 1206 1079 832 633 640 875 1203 1404 1382 1150 894 797 935 1234 1488 1559 1393 1103 889 925 1130
2075A130K75J40r4k70k71j13J05K53J91pk21l17k13pJ77K05Q8j53l12k95j40R9
$$ 1130 1405 1545 1451 1181 910 797 902 1155 1346 1339 1118 801 588 581 758 963 1051 898 586 291 151 250
2097B50K08J28o1k68l28k22j8J85J83L9j69l11k67r2J22K37J57p2k28k82j44P9
$$ 250 458 586 525 257 -71 -293 -311 -126 57 96 -73 -384 -651 -743 -621 -384 -227 -299 -527 -809 -953 -874
2119h74K24K26Q2j41k55j75NJ99K86J81k1j78k11n7J45K78K61J09q9k01j36O8
$$ -874 -650 -424 -342 -483 -738 -913 -908 -709 -423 -242 -263 -441 -652 -709 -564 -286 -25 84 -5 -206 -342 -274
2141b74K21K97J90k3j76j80n2J49K54K18M7j44k32j59K1K00K26Q3j04k48k39j00
$$ -274 -53 244 434 411 235 55 3 152 406 624 671 527 295 136 157 357 583 666 562 314 75 -25
2163b5R4J86J40l7k26k80j77jJ43J55M1j47k51k49r3R3J81J22o1k14k37j38K5
$$ -25 69 255 395 358 132 -148 -325 -326 -183 -28 13 -134 -385 -634 -727 -634 -453 -331 -392 -606 -843 -981 -956
2186i56J85J88O7j14k11j66nJ89K16J73kj57j57m2J21K53K43Q5o7j56j03M0K15
$$ -956 -771 -583 -516 -630 -841 -1007 -1012 -823 -607 -434 -436 -593 -750 -792 -671 -418 -175 -90 -157 -313 -416 -376 -161
2209a61K45J63rj44j70k5J18K17J96M1j17j94j26K2J54J83R1p2k08j99q7R6J42
$$ -161 84 247 238 94 -76 -101 17 234 430 471 354 160 34 56 210 393 484 412 204 5 -82 14 156
2232A56J22l7j90k23j62j2J22J38K8j33k28j92o3Q4J46J08l3j53j82j04M9J70
$$ 156 278 241 51 -172 -334 -346 -224 -86 -58 -191 -419 -611 -674 -590 -444 -336 -369 -522 -704 -808 -759 -589
2254e89J68P7o3j48j15K7J59K25J54K8q4j13j5J28K20K24J02k3j03o1P6J89K40
$$ -589 -421 -344 -407 -555 -670 -643 -484 -259 -105 -77 -161 -274 -289 -161 59 283 385 362 259 198 274 463 703
2277G03J57J0q5j04k3J33K02J62N5r0j59r1J6J19J61N9p7j80j74q6N2R0P3l6j70
$$ 703 860 870 785 681 658 791 993 1155 1210 1120 961 870 886 1005 1166 1225 1148 968 794 708 760 850 923 887 717
2302G17k09j60m0O7Q9lj21k13j92r1K6R7N1n5j69j98j13KJ14J13K0q5j62j29J
$$ 717 508 348 308 375 464 461 340 127 -65 -156 -130 -33 18 -37 -206 -404 -517 -515 -401 -288 -268 -353 -515 -644 -643
2327f43R3J63J05Lj01r8m6R0J74J58Q4m4q3n8N5J34J85J33J1q3r2rR8J53J51M1
$$ -643 -550 -387 -282 -279 -380 -478 -524 -434 -260 -102 -18 -62 -145 -203 -148 -14 171 304 315 232 140 131 229 382 533 574
2353E74o0j03q4K0J18J33O7m2j38j18m9N3J07Q5k1j28j56j12j6P9R2J4r5j60j51
$$ 574 514 411 327 347 465 598 665 623 485 367 318 371 478 563 542 414 258 146 130 209 301 315 220 60 -91
2378i1o1L6R8M9m3j29j49r6J0R2R2L3q0j34j05k0R1J19Q8mj07j07l7N2J25J20
$$ -91 -152 -116 -18 31 -12 -141 -290 -386 -376 -284 -192 -159 -239 -373 -478 -498 -407 -288 -200 -204 -311 -418 -455 -403 -278 -158
2404a58M4m3j00q1K7R4J44R2op4j02l3O1J24J09L6n6r8p9KR8J05N5k9j14j00l3
$$ -158 -114 -157 -257 -338 -311 -217 -73 19 13 -61 -163 -196 -135 -11 98 134 78 -20 -99 -97 1 106 161 132 18 -82 -115
2431a15L0R6Q5op8j19q3JP3R0M7o4r5j21l0N0R8Q7j6q3j08o3J7R5J02L8l0r9q6
$$ -115 -85 11 96 90 12 -107 -190 -189 -116 -26 21 -43 -138 -259 -289 -239 -141 -54 -70 -153 -261 -324 -307 -212 -110 -72 -102 -201 -287
2460b87jP7J12P7Jo0q4k8L4J09J00L6k6r4n6kQ7J04Q0j2p2q8l4M0J08R1J2l8j01
$$ -287 -288 -211 -99 -22 -21 -81 -165 -193 -159 -50 50 86 60 -34 -90 -92 -5 99 179 167 95 7 -27 13 121 212 224 186 85
2489H5o0lP2Q8N8k7q9p5l8L8R5O4K7o3j04n3J2P9Q0M8k3p2p6j5N6Q9R4Mm7p2l5
$$ 85 25 22 94 182 240 213 124 49 11 49 144 208 235 172 68 15 27 106 186 234 211 139 63 48 104 193 287 291 244 172 137
2520A37K2R1R6N9k1p3n1nO9R4Q1Pn2p5l6L2P2Q6M6m2p4o5rN2Q0N5k4o1r5m7QO5
$$ 137 159 250 346 405 384 311 260 255 324 418 499 506 454 379 343 375 447 533 579 537 463 398 389 441 521 576 552 491 396 349 357 422
2552D22N8Ko4r3p7j2L8N5K9l7p8q9m0J8O0M1Po2r3m6MN3O2K3pp8o9rM7O8M9Km0
$$ 422 480 482 418 325 248 236 274 329 358 321 243 154 114 132 192 233 240 178 85 39 43 96 158 181 174 96 27 18 65 133 182 184 144
2585A44o5l5K4N6Q0L0j5p4m3j0M1P2M6Kn8o7n0NO5L4J4m0q5o7k3J8N5Ok2p5r4
$$ 144 79 44 68 124 204 234 219 145 102 92 133 205 251 253 195 128 78 83 148 182 196 156 71 4 -19 -1 54 60 38 -37 -131
2616a31m9%K8M3j8o0q2p3j4K8M8Rk8n6p8k5J1N1M3Pm1n8k6OM7P0N6j2l0k8JN4
$$ -131 -180 -180 -152 -109 -127 -187 -269 -342 -356 -328 -280 -271 -299 -355 -433 -458 -447 -396 -353 -346 -387 -445 -471 -465 -418 -348 -292 -304 -334 -362 -361 -307
2648c07P7O3M4k4k6nM4P1R6M2Ml0j5QN4O9O6Nk0l3k8L0N3M5L9l7o2n0qJ3M4J8
$$ -307 -230 -167 -123 -147 -173 -178 -134 -63 33 75 79 49 34 42 96 165 231 236 216 183 155 185 238 283 322 285 223 173 165 178 222 240
2680B40j1o0o3n5rL2K0j1n3p5o0l3J8J4K1l0p3o3m4RL1M3ok6o3m0KL8M8M0j6k3
$$ 240 229 169 106 51 42 74 94 83 30 -45 -105 -138 -120 -106 -85 -115 -188 -251 -295 -286 -255 -212 -218 -244 -307 -347 -345 -307 -259 -219 -235 -258
2712b58l6jL7O0O4K4j9k7j9K2P8N7M0J0k0k2J2N1N6L9K4j4l6k1J3M4O3J8k6l6
$$ -258 -294 -295 -258 -198 -134 -110 -129 -156 -175 -153 -75 -18 22 32 12 -10 2 53 109 148 172 158 122 101 114 158 221 239 213 177
2742A77m5j8K4L9J3j2n0m6l6j1K0K7jm0o4m2j2JJ5K3k5m3m9l9QJ9L9mj2o1m3N
$$ 177 132 114 138 177 190 178 128 82 46 35 55 82 81 41 -23 -65 -77 -76 -61 -38 -63 -106 -155 -194 -186 -167 -128 -132 -144 -205 -248 -243
2774b43M0N0L1ll2k9KK4N6N0K6qk0JK2O3M2L9Qk4oMM9O6L8J6pk9k1K1N3L8J4l
$$ -243 -203 -153 -122 -125 -157 -186 -184 -160 -104 -54 -28 -36 -56 -55 -33 30 72 111 119 95 89 93 142 208 246 262 255 226 205 226 279 317 331 328
2808C28l1k5j2J6M0K6pm3m0l3mL0J9Jm0n1l4k4J2K3Qj6m3o0k2NJ9L0kl4m0k8j8
$$ 328 297 272 260 276 316 342 335 292 252 219 215 245 264 265 225 174 140 116 128 151 159 143 100 40 18 23 42 72 70 36 -4 -32 -50
2841e0L3L5J2j5k7l1j4J6K6M2Qk5l0k2RK9L9K2Ol9k0oK2L6K5Qj4m8j1OK9K7Pj1
$$ -50 -17 18 30 15 -12 -43 -57 -41 -15 27 35 10 -20 -42 -33 -4 35 57 63 24 4 -2 20 56 81 89 75 27 16 22 51 78 85 74
2875G4l5k3j5K5K1J9ml8l5j7oK7J7Nk0m3l3j0J5K6J2k2k7l9j6KL3J7J4l7l8j3
$$ 74 39 16 1 26 47 66 62 24 -11 -28 -34 -7 10 15 -5 -48 -81 -91 -76 -50 -38 -60 -87 -126 -142 -140 -107 -90 -76 -113 -151 -164
2907a64nJ5K3K1ok6j1qOJ9K5L1k2k2j5J1J5M6J6j2j1k2pK1L8L1J0j0l6%mK6L5
$$ -164 -169 -154 -131 -110 -116 -142 -153 -161 -155 -136 -111 -80 -102 -124 -139 -128 -113 -67 -51 -63 -74 -96 -103 -82 -44 -13 -3 -13 -49 -49 -53 -27 8
2940HK3ok1l5J2K4K4K7mj1k6mNK6L3J0pj3l8PK3J3J9Rj5l7j3J6K2J7K0k1l6lj0
$$ 8 31 25 4 -31 -19 5 29 56 52 41 15 11 16 42 75 85 78 65 27 34 57 70 89 98 83 46 33 49 71 88 108 87 51 48 38
2975C8J1J7J9nl3k1k3K2J7J0Mnk7k0j1J8RJ8j3k7k2LlJ3J1Qok6k7nM4J7l%k2k0
$$ 38 49 66 85 80 47 26 3 25 42 52 56 51 24 4 -7 11 20 38 25 -2 -24 -21 -24 -11 0 8 2 -24 -51 -56 -12 5 2 2 -20 -40
3011d0pJ8K8J7jmk3jLK3K5J9Ll4k2RK0K9J9Rj5j4j5QK4K0Lql3j0KK0K4Nkl0j9
$$ -40 -47 -29 -1 16 15 11 -12 -13 -10 13 38 57 60 26 4 13 33 62 81 90 75 61 46 54 78 98 101 93 60 50 52 72 96 101 99 69 50
3048E0k0J0MJ8qk4j9k4j7J3J6Mj9l7j7k6QJ3J1j1k2l0j2j2RK1J3j4j2k6lJ0J4
$$ 50 30 40 44 62 54 30 11 -13 -30 -17 -1 3 -16 -53 -70 -96 -88 -75 -64 -75 -97 -127 -139 -151 -142 -121 -108 -122 -134 -160 -163 -153 -139
3081a39J7jk1rJ%K5K0OJ0j6j6OK7J7J9nOk0QPjL4J8lk8pmJ0J7PLj6j8j4PJ1J7
$$ -139 -122 -123 -144 -153 -152 -152 -127 -107 -101 -91 -107 -123 -117 -90 -73 -54 -59 -53 -73 -65 -58 -59 -25 -7 -10 -38 -45 -49 -39 -22 -15 -12 -28 -46 -60 -53 -42 -25
3119b5lj6k4mqRJ3JKk1j8jnJ9J4Jj1j1k0J6MJ5K6k4rpmJ6K3L0J7j3j3KQL4J5K1
$$ -25 -28 -44 -68 -72 -80 -71 -58 -57 -55 -76 -94 -95 -100 -81 -67 -66 -77 -88 -108 -92 -88 -73 -47 -71 -80 -87 -91 -75 -52 -22 -5 -18 -31 -29 -21 13 28 49
3157D9Jj1mRJ7K0K2Oj5%rJ9OJ4J8j4jj9LJ2J7LJk4k9MpROj5ml0j9OpJ3k3jk1j4
$$ 49 50 39 35 44 61 81 103 109 94 94 85 104 110 124 142 128 127 108 111 123 140 143 144 120 91 95 88 97 103 88 84 54 35 41 34 47 24 23 2 -12
3197a2j3j1J0K%k0nk6pJ5Q%nk0j2lJ2OK0j1pmjM%K4K0k0qj3J4mK2J2kLk3L%J0
$$ -12 -25 -36 -26 -24 -24 -44 -49 -75 -82 -67 -59 -59 -64 -84 -96 -99 -87 -81 -61 -72 -79 -83 -84 -80 -80 -56 -36 -56 -64 -77 -63 -67 -45 -33 -35 -32 -55 -52 -52 -42
3237d2J4Qj0j4j9J0J4j0K1Jj2pj9JOJ8okk7%oJ4J5%J1j7ooJ0J8QLoOj1RJ8J0J1
$$ -42 -28 -20 -30 -44 -63 -53 -39 -49 -28 -27 -39 -46 -65 -64 -58 -40 -46 -48 -75 -75 -81 -67 -52 -52 -41 -58 -64 -70 -60 -42 -34 -31 -37 -31 -42 -33 -15 -5 6
3276FKJ6j8J6J1J1J8J1%pMkK2K2PPj1lOQPJ2lkqj1NLJ3Onj1j7KJ%Mrpj5j4KKJ5
$$ 6 8 24 6 22 33 44 62 73 73 66 70 68 90 112 119 126 115 112 118 126 133 145 142 140 132 121 126 129 142 148 143 132 115 117 118 118 122 113 106 91 77 79 81 96
3320I6nj9qj7JlKLLj8j2j7MJ0NNj5Lk1LKRJ2ojqj0QMPNoJk0nK5jKqpj1KnJ2LM
$$ 96 91 72 64 47 48 45 47 50 53 35 23 6 10 20 25 30 15 18 -3 0 2 11 23 17 16 8 -2 6 10 17 22 16 17 -3 -8 17 16 18 10 3 -8 -6 -11 1 4 8
3366Hj3j5%qjM%rJj8JnJ3j2J0k1mmjmRMqnjj0NJ8KMMj1j2ORJ9OMj0rPJ0J0J4%
$$ 8 -5 -20 -20 -28 -29 -25 -25 -34 -33 -51 -50 -55 -42 -54 -44 -65 -69 -73 -74 -78 -69 -65 -73 -78 -79 -89 -84 -66 -64 -60 -56 -67 -79 -73 -64 -45 -39 -35 -45 -54 -47 -37 -27 -13 -13
3411a3oojJ1J0J1pJ1k0qKK0NNJj1LoLnQPj0kpJNNJ2j2j1Kj1KJ0LKj2llpJ2QmJ0
$$ -13 -19 -25 -26 -15 -5 6 -1 10 -10 -18 -16 4 9 14 15 4 7 1 4 -1 7 14 4 2 -5 -4 1 6 18 6 -5 -3 -14 -12 -2 1 3 -9 -12 -15 -22 -10 -2 -6 4
3456Dj8J1j0PMMQMj6MlJ9jP%kj0k%RJ5rMppjNJ1JrrjnJ0K%Jjj8kJ1oMLj1qJLk
$$ 4 -14 -3 -13 -6 -2 2 10 14 -2 2 -1 18 17 24 24 22 12 10 10 19 34 25 29 22 15 14 19 30 31 22 13 12 7 17 19 19 20 19 1 -1 10 4 8 11 0 -8 -7 -4 -6
3505fJ8m%j4LklJ2R%mlPlJ2MPljmMmK0j0QJoj6MJ0J2qkKj4KolJ4j0j6j1qOj0L
$$ -6 12 8 8 -6 -3 -5 -8 4 13 13 9 6 13 10 22 26 33 30 29 25 29 25 45 35 43 44 38 22 26 36 48 40 38 40 26 28 22 19 33 23 7 -4 -12 -6 -16 -13
3551a3jqJj1j1j1lQj0nmj2PjJ5Joj2nLLoK1JnJKJ1KPJPMQkJ4jJ2J4qLJ4qQJ0P
$$ -13 -14 -22 -21 -32 -43 -54 -57 -49 -59 -64 -68 -80 -73 -74 -59 -58 -64 -76 -81 -78 -75 -81 -60 -59 -64 -63 -61 -50 -48 -41 -40 -33 -29 -21 -23 -9 -10 2 16 8 11 25 17 25 35 42
3597D2JlLLklJ3nj1Kj0mklJ4j1rj8pLnNj2koj0j4k%lmJj7PkkP%lJ%mOJ8OLMLP
$$ 42 43 40 43 46 44 41 54 49 38 40 30 26 24 21 35 24 15 -3 -10 -7 -12 -7 -19 -21 -27 -37 -51 -53 -53 -56 -60 -59 -76 -69 -71 -73 -66 -66 -69 -68 -68 -72 -66 -48 -42 -39 -35 -32 -25
3646b5K5rK1MJ5jNJ5J1RJ3RlLmJ0J6JM%rllMj0QJk1mj4JMk3Lk6Lk1qppk6nj3k1
$$ -25 0 -9 12 16 31 30 35 50 61 70 83 92 89 92 88 98 114 115 119 119 110 107 104 108 98 106 107 86 82 68 69 73 50 53 27 30 9 1 -6 -13 -39 -44 -57 -78
3690g8nj3j0jj0qlljnnjNoJ1j1NOPQKj%J4K0OQLNK7lJ3J6J2RlJ4J0JJ2J2MQkj3
$$ -78 -83 -96 -106 -107 -117 -125 -128 -131 -132 -137 -142 -143 -138 -144 -133 -144 -139 -133 -126 -118 -116 -117 -117 -103 -83 -77 -69 -66 -61 -34 -37 -24 -8 4 13 10 24 34 35 47 59 63 71 69 56
3735E6K6jPmNk5KlKJMj6j5j2nnk0K2k3rooqpj2Kj1JroKj0QJj5Rj2NQ%PKRLJ4K
$$ 56 82 81 88 84 89 64 66 63 65 66 70 54 39 27 22 17 -3 19 -4 -13 -19 -25 -33 -40 -52 -50 -61 -60 -69 -75 -73 -83 -75 -74 -89 -80 -92 -87 -79 -79 -72 -70 -61 -58 -44 -42
3781d2jJ2K1RRLpJ3J6NJ7kRkJ7jQLjLJPqQOj%qj1Mmlj4Jok9Opomok3jmj6j3mJ
$$ -42 -43 -31 -10 -1 8 11 4 17 33 38 55 53 62 60 77 76 84 87 86 89 90 97 89 97 103 102 102 94 83 87 83 80 66 67 61 32 38 31 25 21 15 -8 -9 -13 -29 -42 -46 -45
3829d5qj8rmnJ3j7pjj7J1%J1ljMj3NQKQjJ0NKLMJ7J2O%kJ3J8kMJ4J1KLjPPJ3p
$$ -45 -53 -71 -80 -84 -89 -76 -93 -100 -101 -118 -107 -107 -96 -99 -100 -96 -109 -104 -96 -94 -86 -87 -77 -72 -70 -67 -63 -46 -34 -28 -28 -30 -17 1 -1 3 17 28 30 33 32 39 46 59 52
3874E2PmQnJ4jj2MJj1QmmMNj0j5plJ1j3lKj8jj0JMKj2ljj3pPmJ0Kmpj3NQPj1J3
$$ 52 59 55 63 58 72 71 59 63 64 53 61 57 53 57 62 52 37 30 27 38 25 22 24 6 5 -5 -4 0 2 -10 -13 -14 -27 -34 -27 -31 -21 -19 -23 -30 -43 -38 -30 -23 -34 -21
3920b1nj3K3%jRkJ1pPNQJ8LP%lmRK0J1ljRNNJ2lLOrMjnJ5Roj2PLqnKrnj6n%KK
$$ -21 -26 -39 -16 -16 -17 -8 -10 1 -6 1 6 14 32 35 42 42 39 35 44 64 75 72 71 80 85 90 102 99 102 108 99 103 102 97 112 121 115 103 110 113 105 100 102 93 88 72 67 67 69 71
3970G1rprj4mqNjnk1jrpQommpmmoMomQr%lJ1J8j1jNqJ0jJJ5lkOrJ6J6jQkQpQN
$$ 71 62 55 46 32 28 20 25 24 19 -2 -3 -12 -19 -11 -17 -21 -25 -32 -36 -40 -46 -42 -48 -52 -44 -53 -53 -56 -45 -27 -38 -39 -34 -42 -32 -33 -32 -17 -20 -22 -16 -25 -9 7 6 14 12 20 13 21 26
4021B6mJ6Opj2MOkQJrkmmj1PNj7pk0Nj3JMk0j0pj0k2Oj3Oj0j1k1oPMprJj4mj%
$$ 26 22 38 44 37 25 29 35 33 41 42 33 31 27 23 12 19 24 7 0 -20 -15 -28 -27 -23 -43 -53 -60 -70 -92 -86 -99 -93 -103 -114 -135 -141 -134 -130 -137 -146 -145 -159 -163 -164 -164
4066a64J6nNj4J4rQOJ0JJ1j0OJ4NK3kNQOkK1OLMJ7j3LJ0J4LJ1nkjORJ3m%%k3L
$$ -164 -148 -153 -148 -162 -148 -157 -149 -143 -133 -132 -121 -131 -125 -111 -106 -83 -85 -80 -72 -66 -68 -47 -41 -38 -34 -17 -30 -27 -17 -3 0 11 6 4 3 9 18 31 27 27 27 4 7
4109GjJ2Prj5Mj0Nj1Nklj4l%j0JRj5opJRj3J7oNoKqJ3KJ0KJpRNJ2NNRoPLOK0J5
$$ 7 6 18 25 16 1 5 -5 0 -11 -6 -8 -11 -25 -28 -28 -38 -37 -28 -43 -49 -56 -55 -46 -59 -42 -48 -43 -49 -47 -55 -42 -40 -30 -28 -27 -34 -25 -20 -8 -3 2 11 5 12 15 21 41 56
4157E6jOjKJ2J5PnJ4j7nJ6lJ5QrrJRj1J5Jj1%j2pkOJ1mj2%k2nPkKn%j7j8RJL%
$$ 56 55 61 60 62 74 89 96 91 105 88 83 99 96 111 119 110 101 102 111 100 115 116 105 105 93 86 84 90 101 97 85 85 63 58 65 63 65 60 60 43 25 34 35 38 38
4202C8ploj0lJ1LpLnj4OMJ0LqpkKlJ2KQknlLMJ2Lj3OrjLRJ0lrkkmK1J2j4Kolo
$$ 38 31 28 22 12 9 20 23 16 19 14 0 6 10 20 23 15 8 6 8 5 17 19 27 25 20 17 20 24 36 39 26 32 23 22 25 34 44 41 32 30 28 24 45 57 43 45 39 36 30
4251C0kOOmqNj7OKj%pJk1NNQpmj3j7j3RJ0lj0j3j3jqRonrqKqj0RJ1j0j0j2JnJ1
$$ 30 28 34 40 36 28 33 16 22 24 23 23 16 17 -4 1 6 14 7 3 -10 -27 -40 -31 -21 -24 -34 -47 -60 -61 -69 -60 -66 -71 -80 -88 -86 -94 -104 -95 -84 -94 -104 -116 -115 -120 -109
4297a09oRj2jpQnLJ2m%mK%PJ3OMMj6RNJ4J5NjqjJ3J3J2pJ7j2QOqJ6NqLomLNJ1
$$ -109 -115 -106 -118 -119 -126 -118 -123 -120 -108 -112 -112 -116 -114 -114 -107 -94 -88 -84 -80 -96 -87 -82 -68 -53 -48 -49 -57 -58 -45 -32 -20 -27 -10 -22 -14 -8 -16 0 5 -3 0 -6 -10 -7 -2 9
4343Ij3j0Kj2jQprj0J0j3j7klKoloj7nMLm%j2Qj9J7nJ0RnLQJJ6J1J3PqLJ0QJ5
$$ 9 -4 -14 -12 -24 -25 -17 -24 -33 -43 -33 -46 -63 -65 -68 -66 -72 -75 -81 -98 -103 -99 -96 -100 -100 -112 -104 -123 -106 -111 -101 -92 -97 -94 -86 -85 -69 -58 -45 -38 -46 -43 -33 -25 -10
4387a0J8QMKJ3J3J2J0J4MJ5mORJ3J0J1rLnMOkkJj1j5j2RRj3pj0mj7j4%%k5kj2
$$ -10 8 16 20 22 35 48 60 70 84 88 103 99 105 114 127 137 148 139 142 137 141 147 145 143 144 133 118 106 115 124 111 104 94 90 73 59 59 59 34 32 20
4428B0k1oj0kjj0j2j4Lj2oQqnj5JJKPJ5jJ0j1lJ9J8LJ1MRQJK5J1KK0pJ1pJ0L5
$$ 20 -1 -7 -17 -19 -20 -30 -42 -56 -53 -65 -71 -63 -71 -76 -91 -90 -89 -87 -80 -65 -66 -56 -67 -70 -51 -33 -30 -19 -15 -6 2 3 28 39 41 61 54 65 58 68 103
4469A03j1J0jrRPlJ0lj4Kj1qj2Pqj8j2j5rj1Kj1j3j5k2k0j5mp%k1k4j8olj0Lj0
$$ 103 92 102 101 92 101 108 105 115 112 98 100 89 81 69 76 68 50 38 23 14 3 5 -6 -19 -34 -56 -76 -91 -95 -102 -102 -123 -147 -165 -171 -174 -184 -181 -191
4508a91kj9kj2J3J7KKokKJ8J4MPJ6oKRK4JK6lJ6RLK4ORJ0J1KJ4nJ1J5JKjmmoQ
$$ -191 -193 -212 -214 -226 -213 -196 -194 -192 -198 -200 -198 -180 -166 -162 -155 -139 -145 -143 -134 -110 -109 -83 -86 -70 -61 -58 -34 -28 -19 -9 2 4 18 13 24 39 40 42 41 37 33 27 35
4551C5%j1Mj9j4rJ5j5j7j0j1j6pnoMk2pj5Mj0j6Rj4JmnjQ%NJ2j7J3MLJ5J0J4k
$$ 35 35 24 28 9 -5 -14 1 -14 -31 -41 -52 -68 -75 -80 -86 -82 -104 -111 -126 -122 -132 -148 -139 -153 -152 -156 -161 -162 -154 -154 -149 -137 -154 -141 -137 -134 -119 -109 -95 -97
4591i7J5J1QJ7JK7OJ7qJ0J7K1RNJ6llJ1J8RNJ0kj6J0QmJ0qopppJ2j6Pj4kj1j6
$$ -97 -82 -71 -63 -46 -45 -18 -12 5 -3 7 24 45 54 59 75 72 69 80 98 107 112 122 120 104 114 122 118 128 120 114 107 100 93 105 89 96 82 80 69 53
4631E3LjonJk4KnNqJlk0mKPNjj2PmLQjJ3nRMj4J3J9KJ2KkONQK0PkNkkOJ0lJ3p
$$ 53 56 55 49 44 45 21 23 18 23 15 16 13 -7 -11 -9 -2 3 2 -10 -3 -7 -4 4 3 16 11 20 24 10 23 42 44 56 58 56 62 67 75 95 102 100 105 103 101 107 117 114 127 120
4680A20k0J5pRjlMk1kk%oKoj1mjrpqnLpk2%qJ7j9qJpj0J3rNj9OrJkMmLj1ONj4
$$ 120 100 115 108 117 116 113 117 96 94 92 92 86 88 82 71 67 66 57 50 42 37 40 33 11 11 3 20 1 -7 -6 -13 -23 -10 -19 -14 -33 -27 -36 -35 -37 -33 -37 -34 -45 -39 -34 -48
4727d8QkJkJopRorROoqqJ4mOnnKrJjJPrLj1J0mMRoMnl%PRPkojmRPLkKJ0j1K0%
$$ -48 -40 -42 -41 -43 -42 -48 -55 -46 -52 -61 -52 -46 -52 -60 -68 -54 -58 -52 -57 -62 -60 -69 -68 -69 -68 -61 -70 -67 -78 -68 -72 -68 -59 -65 -61 -66 -69 -69 -62 -53 -46 -48 -54 -55 -59 -50 -43 -40 -42 -40 -30 -41 -21 -21
4781b1QJMkqQJQlPpKpQOj0MjokKKJ%j0%j2jpJ6k1mJ5k5Pj8J3j3%%JmKQJ0LkRn
$$ -21 -13 -12 -8 -10 -18 -10 -9 -1 -4 3 -4 -2 -9 -1 5 -5 -1 -2 -8 -10 -8 -6 -5 -5 -15 -15 -27 -28 -35 -19 -40 -44 -29 -54 -47 -65 -52 -65 -65 -65 -64 -68 -66 -58 -48 -45 -47 -38 -43
4830d3J0PjJ1J7kNJ1LJ6OJ7MNlJ8OPJ0J1qPJ1MJ0lMLj2MlLlj4Llj2j4k%j3Kj1
$$ -43 -33 -26 -27 -16 1 -1 4 15 18 34 40 57 61 66 63 81 87 94 104 115 107 114 125 129 139 136 140 143 131 135 132 135 132 118 121 118 106 92 90 90 77 79 68
4873F8rk3pqQj8J0j8j2Qj3lRjj3j6LpRkKMKNkRJ0kORJ6lOJ7J1J3LJ3mQQJ1J4J0
$$ 68 59 36 29 21 29 11 21 3 -9 -1 -14 -17 -8 -9 -22 -38 -35 -42 -33 -35 -33 -29 -27 -22 -24 -15 -5 -7 -1 8 24 21 27 44 55 68 71 84 80 88 96 107 121 131
4917A31Kj0lPOLjLj5Mj7N%Kk2j0j4mj3nk0jj7j2k1lrk0oj3j2k4oj4Mnk2kOqp%
$$ 131 133 123 120 127 133 136 135 138 123 127 110 115 115 117 95 85 71 67 54 49 29 28 11 -1 -22 -25 -34 -54 -60 -73 -85 -109 -115 -129 -125 -130 -152 -154 -148 -156 -163 -163
4959a63NonJ4j7K3mK5LJ7J2mNJ7RJ5KK2J7j1K3J2NLK5jJOR%LJ0Jj3%Lk%lj0j0
$$ -163 -158 -164 -169 -155 -172 -149 -153 -128 -125 -108 -96 -100 -95 -78 -69 -54 -52 -30 -13 -24 -1 11 16 19 44 43 44 50 59 59 62 72 73 60 60 63 61 61 58 48 38
5000C8j5pLj3pnmk1k3lpnJk0rj1j0rkrmj1jlo%OKJJPKRNROJ1J1LLJ3K0QJ3QJ1
$$ 38 23 16 19 6 -1 -6 -10 -31 -54 -57 -64 -69 -68 -88 -97 -108 -118 -127 -129 -138 -142 -153 -154 -157 -163 -163 -157 -155 -154 -153 -146 -144 -135 -130 -121 -115 -104 -93 -90 -87 -74 -54 -46 -33 -25 -14
5046a4OL0NJ3NJ1mJ6NJ9R%mpPjnMpJj1j4mjpqkj3j1Mk2Oj2j5pj8j2jkJkpjk4J
$$ -14 -8 22 27 40 45 56 52 68 73 92 101 101 97 90 97 96 91 95 88 89 78 64 60 59 52 44 42 29 18 22 0 6 -6 -21 -28 -46 -58 -59 -61 -60 -62 -69 -70 -94 -93
5091i3LjQmLJJ1mJ7J6KMOOPmL1J1J2jKJ4LJ6J0J6J1lJ0LJ3J0Lj%jLkJ4Mopjnj7
$$ -93 -90 -91 -83 -87 -84 -83 -72 -76 -59 -43 -41 -37 -31 -25 -18 -22 9 20 32 31 33 47 50 66 76 92 103 100 110 113 126 136 139 138 138 137 140 138 152 156 150 143 142 137 120
5136A20J4lqoqrqnLj3Kj8j7lKj2J2k4Pj1j4pK0rkJ1jk1QoOJ7lOj1jJ7J0KJJ1l
$$ 120 134 131 123 117 109 100 92 87 90 77 79 61 44 41 43 31 43 19 26 15 1 -6 14 5 3 14 13 -8 0 -6 0 17 14 20 9 8 25 35 37 38 49 46
5178D6kJ5PjJ3Kj1K2j7KRJ1oQj4nPMmnJmj9kJOrKj1j0qj3LlMoqqj4Jlm%J0j2q
$$ 46 44 59 66 65 78 80 69 91 74 76 85 96 90 98 84 79 86 90 86 81 82 78 59 57 58 64 55 57 46 36 28 15 18 15 19 13 5 -3 -17 -16 -19 -23 -23 -13 -25 -33
5224c3j1lJ5NnpLj4J9kRkrmJ4pJJ7Oj1KQj1KJ2J7JlqJLQlJ1pkjkNmOLMno%kQK
$$ -33 -44 -47 -32 -27 -32 -39 -36 -50 -31 -33 -24 -26 -35 -39 -25 -32 -31 -14 -8 -19 -17 -9 -20 -18 -6 11 12 9 1 2 5 13 10 21 14 12 11 9 14 10 16 19 23 18 12 12 10 18 20
5273B0Mj5kmPMNkj3j1lkJ4MLJj1ppPOLjlj6MmMJNLj0OolQJ6qJ2j0pK%LlRj2kl
$$ 20 24 9 7 3 10 14 19 17 4 -7 -10 -12 2 6 9 10 -1 -8 -15 -8 -2 1 0 -3 -19 -15 -19 -15 -14 -9 -6 -16 -10 -16 -19 -11 5 -3 9 -1 -8 -6 -6 -3 -6 3 -9 -11 -14
5322a4MJJ0j1j%pJ2QJlo%j6J3OQkrJ0j2MmJ4J6pooj0J4RNOj1LpPJ0Rnjj3JOol
$$ -14 -10 -9 1 -10 -11 -11 -18 -6 2 3 0 -6 -6 -22 -9 -3 5 3 -6 4 -8 -4 -8 6 22 15 9 3 -7 7 16 21 27 16 19 12 19 29 38 33 32 19 20 26 20 17
5368A7J0mj%j1nMmRrlj2KqMONj5qj5OJ6qJ4qj3j5kMJ6%Noj3lnJ6LROj2k0J2QO
$$ 17 27 23 22 22 11 6 10 6 15 6 3 -9 -7 -15 -11 -5 0 -15 -23 -38 -32 -16 -24 -10 -18 -31 -46 -48 -44 -28 -28 -23 -29 -42 -45 -50 -34 -31 -22 -16 -28 -48 -36 -28 -22
5413b2OOmKoPPoNLLlnRJ2Jjmj0MKLR%j8oQj5J4JKMj1lj0jJ0Kjqqj1OjJ5Pj6MJ
$$ -22 -16 -10 -14 -12 -18 -11 -4 -10 -5 -2 1 -2 -7 2 14 15 14 10 0 4 6 9 18 18 0 -6 2 -13 1 2 4 8 -3 -6 -16 -17 -7 -5 -6 -14 -22 -33 -27 -28 -13 -6 -22 -18 -17
5462a7KnNJ4Mpj0JJ2RJ0NQpKj6J9J3J1Rj1N%NRKPRjrqJ1J5kNkj7JlNJKmprj4K
$$ -17 -15 -20 -15 -1 3 -4 -14 -13 -1 8 18 23 31 24 26 10 29 42 53 62 51 56 56 61 70 72 79 88 87 78 70 81 96 94 99 97 80 81 78 83 84 86 82 75 66 52 54
5509E4Qkqjl0kNj4NoNk1moMnMoj3KqJJ3QJpj6Qj4J0J3jLj6J6rJ5QPMrmRkJ7J0
$$ 54 62 60 52 51 21 19 24 10 15 9 14 -7 -11 -17 -13 -18 -14 -20 -33 -31 -39 -38 -25 -17 -16 -23 -39 -31 -45 -35 -22 -23 -20 -36 -20 -29 -14 -6 1 5 -4 -8 1 -1 16 26
$$ [...]
8191E2
##END NTUPLES=NMR FID
##END=
