##TITLE=1H_AM_NVANIZOLE
 
 8 sc, 
 24.3.2023
##JCAMPDX= 6.0         $$ Bruker NMR JCAMP-DX V2.0
##DATA TYPE= NMR FID
##DATA CLASS= NTUPLES
##ORIGIN= UXNMR, Bruker Analytische Messtechnik GmbH
##OWNER= root
$$ XWIN-NMR		Version 3.5
$$ Fri Mar 24 14:07:17 2023 Russian Standard Time (UT+4h)  she@DPX200
##.OBSERVE FREQUENCY= 200.13135
##.OBSERVE NUCLEUS= ^1H
##.DELAY= (6, 6)
##.ACQUISITION MODE= SIMULTANEOUS
##.ACQUISITION SCHEME= undefined
##.AVERAGES= 8
##.DIGITISER RES= 18
##SPECTROMETER/DATA SYSTEM= spect
##.PULSE SEQUENCE= zg30
##.SOLVENT NAME= DMSO
##.SHIFT REFERENCE= (INTERNAL, DMSO, 0, 15.7039)
##AUDIT TRAIL= $$ (NUMBER, WHEN, WHO, WHERE, WHAT)
$$ ##TITLE= Audit trail, XWIN-NMR		Version 3.5
$$ ##JCAMPDX= 5.01
$$ ##ORIGIN= Bruker BioSpin GmbH
$$ ##OWNER= she
$$ F:/spectra/data/she/nmr/H-F/1/audita.txt
$$ ##AUDIT TRAIL=  $$ (NUMBER, WHEN, WHO, WHERE, WHAT)
(   1,<2023-03-24 14:05:48.71 +0400>,<she>,<DPX200>,
      <created by zg, POWCHK disabled, PULCHK disabled
       configuration hash MD5:
       00 E9 B6 7A A2 85 ED C7 34 08 36 98 17 FE 4E 26
       data hash MD5: 16K
       7C 85 C9 D6 7B B8 B0 A3 ED 14 D5 CA 0E 02 0B F4>)
$$ ##END=
$$ 
$$ hash MD5
$$ FF 09 4D 55 F6 0E 93 05 2D 7D EF BB 13 FE FD A2
##$RELAX= 
##$RELAX= 
##$RELAX= 
##$RELAX= 
##$RELAX= 
##$RELAX= 
$$ Bruker specific parameters
$$ --------------------------
##$DU= <F:/spectra>
##$EXPNO= 1
##$NAME= <H-F>
##$PROCNO= 1
##$TYPE= <nmr>
##$USER= <she>
##$AMP= (0..31)
100 100 100 100 100 100 100 100 100 100 100 100 100 100 100 100 100 100 
100 100 100 100 100 100 100 100 100 100 100 100 100 100 
##$AQSEQ= 0
##$AQ_mod= 1
##$AUNM= <au_zg>
##$AUTOPOS= <>
##$BF1= 200.13
##$BF2= 200.13
##$BF3= 200.13
##$BF4= 200.13
##$BF5= 200.13
##$BF6= 200.13
##$BF7= 200.13
##$BF8= 200.13
##$BYTORDA= 1
##$CFDGTYP= 0
##$CFRGTYP= 5
##$CHEMSTR= <none>
##$CNST= (0..31)
1 1 145 1 1 1 1 1 1 1 1 1 1 1 1 1 1 1 1 1 1 1 1 1 1 1 1 1 1 1 1 1 
##$CPDPRG= <>
##$CPDPRG1= <>
##$CPDPRG2= <>
##$CPDPRG3= <>
##$CPDPRG4= <mlev>
##$CPDPRG5= <mlev>
##$CPDPRG6= <mlev>
##$CPDPRG7= <mlev>
##$CPDPRG8= <mlev>
##$CPDPRGB= <>
##$CPDPRGT= <>
##$D= (0..31)
0 1.2 0 0 0 0 0 0 0 0.06 0 0.03 0 0 0 0 0.0002 0 0 0 0 0 0 0 0 0 0 0 0 
0 0 0 
##$DATE= 1679652348
##$DBL= (0..7)
120 120 120 120 120 120 120 120 
##$DBP= (0..7)
150 150 150 150 150 150 150 150 
##$DBP07= 0
##$DBPNAM0= <>
##$DBPNAM1= <>
##$DBPNAM2= <>
##$DBPNAM3= <>
##$DBPNAM4= <>
##$DBPNAM5= <>
##$DBPNAM6= <>
##$DBPNAM7= <>
##$DBPOAL= (0..7)
0.5 0.5 0.5 0.5 0.5 0.5 0.5 0.5 
##$DBPOFFS= (0..7)
0 0 0 0 0 0 0 0 
##$DE= 6
##$DECBNUC= <off>
##$DECIM= 32
##$DECNUC= <off>
##$DECSTAT= 4
##$DIGMOD= 1
##$DIGTYP= 9
##$DL= (0..7)
0 120 120 120 120 120 120 120 
##$DP= (0..7)
150 150 150 150 150 150 150 150 
##$DP07= 0
##$DPNAME0= <>
##$DPNAME1= <>
##$DPNAME2= <>
##$DPNAME3= <>
##$DPNAME4= <>
##$DPNAME5= <>
##$DPNAME6= <>
##$DPNAME7= <>
##$DPOAL= (0..7)
0.5 0.5 0.5 0.5 0.5 0.5 0.5 0.5 
##$DPOFFS= (0..7)
0 0 0 0 0 0 0 0 
##$DQDMODE= 0
##$DR= 18
##$DS= 0
##$DSLIST= <SSSSSSSSSSSSSSS>
$$ [...]
##$SUBNAM2= <"">
##$SUBNAM3= <"">
##$SUBNAM4= <"">
##$SUBNAM5= <"">
##$SUBNAM6= <"">
##$SUBNAM7= <"">
##$SUBNAM8= <"">
##$SUBNAM9= <"">
##$SW= 18.05172834244
##$SWIBOX= (0..15)
0 0 2 0 0 0 0 0 0 0 0 0 0 0 0 0 
##$SW_h= 3612.71676300578
##$TD= 16384
##$TD0= 1
##$TE= 0
##$TE2= 300
##$TE3= 300
##$TEG= 300
##$TL= (0..7)
0 120 120 120 120 120 120 120 
##$TP= (0..7)
150 150 150 150 150 150 150 150 
##$TP07= 0
##$TPNAME0= <>
##$TPNAME1= <>
##$TPNAME2= <>
##$TPNAME3= <>
##$TPNAME4= <>
##$TPNAME5= <>
##$TPNAME6= <>
##$TPNAME7= <>
##$TPOAL= (0..7)
0.5 0.5 0.5 0.5 0.5 0.5 0.5 0.5 
##$TPOFFS= (0..7)
0 0 0 0 0 0 0 0 
##$TUNHIN= 0
##$TUNHOUT= 0
##$TUNXOUT= 0
##$USERA1= <user>
##$USERA2= <user>
##$USERA3= <user>
##$USERA4= <user>
##$USERA5= <user>
##$V9= 5
##$VALIST= <valist>
##$VCLIST= <CCCCCCCCCCCCCCC>
##$VD= 0
##$VDLIST= <DDDDDDDDDDDDDDD>
##$VPLIST= <PPPPPPPPPPPPPPP>
##$VTLIST= <TTTTTTTTTTTTTTT>
##$WBST= 1024
##$WBSW= 4
##$XGAIN= (0..3)
0 0 0 0 
##$XL= 0
##$YL= 0
##$YMAX_a= 117273
##$YMIN_a= -157103
##$ZGOPTNS= <>
##$ZL1= 120
##$ZL2= 120
##$ZL3= 120
##$ZL4= 120
##$ABSF1= 10
##$ABSF2= 0
##$ABSG= 5
##$ABSL= 3
##$ALPHA= 0
##$AQORDER= 0
##$ASSFAC= 0
##$ASSFACI= 0
##$ASSFACX= 0
##$ASSWID= 0
##$AUNMP= <proc_1d>
##$AZFE= 0.1
##$AZFW= 0.1
##$BCFW= 1
##$BC_mod= 2
##$BYTORDP= 1
##$COROFFS= 0
##$CY= 11.3945322036743
##$DATMOD= 1
##$DC= 2
##$DFILT= <>
##$DTYPP= 0
##$F1P= 2.36226072786647
##$F2P= -0.459571619588291
##$FCOR= 0.5
##$FTSIZE= 0
##$FT_mod= 4
##$GAMMA= 1
##$GB= 0.15
##$INTBC= 1
##$INTSCL= 1
##$ISEN= 128
##$LB= 0.24
##$LEV0= 0
##$LPBIN= 0
##$MAXI= 10000
##$MC2= 0
##$MEAN= 0
##$ME_mod= 0
##$MI= 1.114404
##$NCOEF= 0
##$NC_proc= 0
##$NLEV= 6
##$NOISF1= 3.799351
##$NOISF2= 2.8
##$NSP= 1
##$NTH_PI= 0
##$NZP= 0
##$OFFSET= 15.70392
##$PC= 1
##$PHC0= -19164.13
##$PHC1= -7.199226
##$PH_mod= 1
##$PKNL= yes
##$PPARMOD= 0
##$PSCAL= 0
##$PSIGN= 0
##$REVERSE= no
##$SF= 200.130013532006
##$SI= 16384
##$SIGF1= 3
##$SIGF2= 2
##$SINO= 400
##$SIOLD= 16384
##$SREGLST= <1H.CDCl3>
##$SSB= 0
##$STSI= 0
##$STSR= 0
##$SW_p= 3612.71676300578
##$SYMM= 0
##$S_DEV= 0
##$TDeff= 0
##$TDoff= 0
##$TI= <>
##$TILT= no
##$TM1= 0
##$TM2= 0
##$TOPLEV= 0
##$USERP1= <user>
##$USERP2= <user>
##$USERP3= <user>
##$USERP4= <user>
##$USERP5= <user>
##$WDW= 1
##$XDIM= 8192
##$YMAX_p= 0
##$YMIN_p= 0
$$ End of Bruker specific parameters
$$ ---------------------------------
##NTUPLES= NMR FID
##VAR_NAME=  TIME,          FID/REAL,        FID/IMAG
##SYMBOL=    X,             R,               I
##VAR_TYPE=  INDEPENDENT,   DEPENDENT,       DEPENDENT
##VAR_FORM=  AFFN,          ASDF,            ASDF
##VAR_DIM=   8192,          8192,            8192
##UNITS=     SECONDS,       ARBITRARY UNITS, ARBITRARY UNITS
##FACTOR=    0.0002768,     1,               1
##FIRST=     0,             0,               0
##LAST=      2.2672688,     0,               0
##MIN=       0,             -157103,         0
##MAX=       2.2672688,     117273,          0
$$ Real data points
##PAGE= N=1
##DATA TABLE= (X++(R..R)), XYDATA
$$ [...]
1152D87k476K326J740l081k859K246L004j735k815J942L568j108l538O62L344
1167A707o43l821p5L803Q17l080l17M075J800k979j658K895J616l462l185J826
1183f81K189k612l143J907L512j026l015J347L756n36l747j35L337J03l704o74
1199c122L826J721k705r32L782K389k748k516K188K015l171l834J233K732j864
1214a006l372J438L991k17l254O02L850J13l951r25L346Q98l482j247L762K586
1230C132k317j620L296K857k435l294J372K349k557m236N18L134q53l401O97M129
1246G71P08l205l88L580Q92l679j790K956J802k837j850L294L289j662k256K437
1262B062L138j899l847M59K581j764m290p6L382J02l255M0M046J386l102j204
$$ plain form
1152 487 -1989 337 2077 -1004 -3863 -1617 1387 -348 -3163 -1221 2347 1239 -2299 -1637 1707
1167 1707 1064 -2757 -2832 971 1788 -1292 -1609 2466 4266 1287 -371 2524 4140 678 -2507 -681
1183 -681 1508 -1104 -4247 -2340 1172 146 -2869 -1522 2234 1698 -2049 -2184 1153 1256 -2448 -3122
1199 -3122 704 2425 -280 -1212 2570 4959 2211 -305 1883 3898 727 -3107 -1874 858 -1006
1214 -1006 -4378 -2940 1051 834 -2420 -1818 2032 2145 -1806 -2731 615 1513 -1969 -3216 546 3132
1230 3132 815 -805 2491 5348 2913 -381 991 3340 783 -3453 -2935 199 -654 -4055 -3358 771
1246 771 1479 -1726 -2114 1466 2358 -1321 -3111 -155 1647 -1190 -3040 254 3543 1881 -375 2062
1262 2062 5200 3301 -546 -87 2494 730 -3560 -3636 -254 -152 -3407 -3367 679 2065 -1037 -2241
1278b241L195J496l327k355K609K464k173k252K716L644j101k746J480L162j318
1293C253m068l84K653p97l987o81L368J059k882p31L612J987k730j957K564K054
1309B333k672k764K078K983j410k568J966L751n78l069N56L105o90m060r85K685
1325F61R1l621j121L233J747k517j371L074K384k339k475J955K456j949k983J456
1341a319L265o64k728J062L618L6l186l32K845O8l702j539K520R82k989j608K850
1358h21K282k053j920K382K626j816k817J362K744j270l053R10L337j17k867L44
1374g47L377M25l191r49K700O93l308j830K418J639k479j973K411K622j643k378
1390b213J730K812j243l004P55K941n13l042J87L234M70k859n15L037R84k918
$$ plain form
1278 -2241 954 2450 -877 -3232 -623 1841 -332 -2584 132 3776 2675 -71 1409 4571 3253
1293 3253 -815 -1199 1454 657 -3330 -4011 -643 416 -2466 -3197 415 2402 -328 -2285 279 2333
1309 2333 -339 -3103 -1025 1958 548 -2020 -54 3697 3119 50 606 3711 3021 -1039 -2024 661
1325 661 752 -2869 -3990 -757 990 -1527 -2898 176 2560 221 -2254 -299 2157 208 -2775 -1319
1341 -1319 1946 1282 -1446 -384 3234 3270 84 -248 2597 2665 -1037 -2576 -56 926 -2063 -3671 -821
1358 -821 1461 -592 -2512 -130 2496 680 -2137 -775 1969 699 -2354 -1444 1893 1776 -1091 -747
1374 -747 2630 3055 -136 -1085 1615 2308 -1000 -2830 -412 1227 -1252 -3225 -814 1808 165 -2213
1390 -2213 -483 2329 1086 -1918 -1163 1778 1265 -1777 -1590 1644 2114 -745 -1260 1777 2761 -157
1406a57j546K400J422k688k168K069K229j905k360J771K831j151k707J028K959
1421B027o10l029J73K979J29k990m68K975R31k754j186K646J521k471j931K102
1437D4K011j968k388J584K522j242k620R90K823n24k773K66K885J17k820m75K742
1454A174P43k695j183K445J357k382j725K123J981j839k098J702K431j272k498
1469a736J042K612p57k752L51K726n0k692k26K758O54k558r36K408J122k446j674
1486b154J941J628j958j975J672K309j145k091J252K600o28k488L95K464k47k674
1502a099l27K467N05k414o95K450J135k182j377J928J375k102k029J439J821j451
1518e56k051J367K543n66k040Q94K616k29k467j02K265M9k583o93K252Q69k117
$$ plain form
1406 -157 -1703 697 2119 -569 -2737 -668 1561 -344 -2704 -933 1898 747 -1960 -932 2027
1421 2027 1417 -1612 -1439 1540 1669 -1321 -1789 1186 2117 -637 -1823 823 2344 -127 -2058 44
1437 44 2055 87 -2301 -717 1805 563 -2057 -1067 1756 1232 -1541 -1275 1610 1727 -1093 -1568 1174
1454 1174 1917 -778 -1961 484 1841 -541 -2266 -143 1838 -1 -2099 -397 2034 762 -1736
1469 -1736 -694 1918 1161 -1591 -1240 1486 1436 -1256 -1482 1276 1930 -628 -1564 844 1966 -480 -2154
1486 -2154 -213 1415 -543 -2518 -846 1463 318 -1773 -521 2079 1451 -1037 -642 1822 1575 -1099
1502 -1099 -1426 1041 1546 -868 -1563 887 2022 -160 -1537 391 1766 -336 -2365 -926 895 -556
1518 -556 -2607 -1240 1303 737 -1303 -409 2207 1978 -489 -591 1674 1723 -860 -1553 699 1568 -549
1535e49j003K181J406j895j708J477J498j777k225J013K000q87j984J033K687
1550A267Pj953M41K486J45k449o31K000M07k383j059K084J256j818j268J901J616
1567B049j699k015J072J620j496k360P75K221m19j911Q31K816M01j957K4K333
1583B285L63k462j093J818P26k182j329J879J634j493j555J477J826j391k327
1598a824N78J763j008k403M21K417K34j776M38K789Q48j912n24K046O67k364j530
1615a140J548J137j844j584J650J935j168j838J063J902j120k531J72J859n37
1630d96k308J56K555P53j631N8K659J155j832j085J699R59k148j873J238J501
1646A360j376j764J257K161p44k042M78J929o92k602l05J917O9k078j96K580J298
$$ plain form
1535 -549 -1552 629 2035 140 -1568 -91 1407 -370 -2595 -1582 418 -469 -2453 -1420 1267
1550 1267 1274 -679 -238 2248 2393 -56 -687 1313 1720 -663 -1722 362 1618 -200 -1468 433 2049
1567 2049 350 -1665 -593 1027 -469 -2829 -2054 167 -252 -2163 -1332 1484 1885 -72 -48 2285
1583 2285 2648 186 -907 911 1637 -545 -1874 5 1639 146 -1409 68 1894 503 -1824
1598 -1824 -1246 517 -491 -2894 -2473 -56 178 -1598 -1160 1629 2477 565 41 2087 2754 390 -1140
1615 -1140 408 1545 -299 -1883 -233 1702 534 -1304 -241 1661 541 -1990 -1818 41 -496
1630 -496 -2804 -2648 -93 660 -971 -913 1746 2901 1069 -16 1683 2642 494 -1379 -141 1360
1646 1360 -16 -1780 -523 1638 894 -1148 -670 1259 567 -2035 -2340 -423 -354 -2432 -2628 -48 1250
1663A250j445l88K352J419j734j540J282J180j827k112R60J788r45j858Q88K241
1679A511l93k188J7J855l06k510o53J904O10j789m39K423J666j169q24J888J559
1696C162j492j910Q16J359j346k173N77J976l98j887M20K155j5k171n04J709J14
1713C92k286q89J828J083j436o56K182J882j003j171J432J608j304k128M76J516
1729A526r59k145L55K079l2j876L4K065K60k158q61J563N19k006j104J725J511
1746D96j104r27J855K043p90j531R25J671j016k285J07J662m69k103K1K125L86
1763A066j858l99J911N58k066j191J467R11j706j286J620J835q39j183J495K125
1779B460o38j805N00J717o80k339k14J790Qk002l33K066P65j778q43J673R24j827
$$ plain form
1663 1250 -195 -583 1769 3188 1454 -86 1196 2376 549 -1563 -603 1185 240 -1618 -730 1511
1679 1511 1118 -1070 -1053 802 496 -2014 -2667 -763 -153 -1942 -2381 42 1708 539 -285 1603 3162
1696 3162 1670 -240 576 1935 589 -1584 -1007 969 571 -1316 -896 1259 1244 -927 -1431 278 392
1713 392 -1894 -2783 -955 128 -1308 -1964 218 2100 1097 -74 1358 2966 1662 -466 10 1526
1729 1526 567 -1578 -1223 856 824 -1052 -1018 1047 1307 -851 -1712 -149 370 -1636 -2740 -1015 496
1746 496 -608 -1535 320 2363 1573 42 967 2638 1622 -663 -556 1106 637 -1466 -1445 680 1066
1763 1066 -792 -1191 720 1278 -788 -1979 -512 399 -1307 -2593 -973 862 23 -1160 335 2460
1779 2460 1822 17 517 2234 1554 -785 -999 791 799 -1203 -1536 530 1295 -483 -1326 347 1271 -556
1797e56j516J235J335j282j494J308K083m74j488R48K137k95k019j5J756j97k269
1814h03n40J808N15j863p05J879J120j620j240J427J249j509j724J021J658q72
1830a99j678R28K185j55j700M19K081L5k051m77J726L16k052r14J691R80j584
1847d49j138J553J442j290j579J029J584j010j867O00J900l67j794L88K133K00
1863A335j790j68J931M41j926q29J602P89j739j188J458J309j299j410J189J610
1879A315r37j713O92J739n21j880K68J893J5j806j30J896N04j730o47J677Q41
1896A476j615j122J380J202j318j421J083J532r02j616P19J749m63j751L14J805
1912A052m2j790j60J776L51j761o19J612P67j580r86J443J151j248j274J150J432
$$ plain form
1797 -556 -2072 -837 498 -784 -2278 -970 1113 639 -849 99 2236 1941 -78 -93 1663 1466 -803
1814 -803 -1343 465 980 -883 -1588 291 1411 -209 -1449 -22 1227 -282 -2006 -985 673 -199
1830 -199 -1877 -949 1236 1081 -619 -200 1881 1916 -135 -612 1114 1430 -622 -1536 155 1135 -449
1847 -449 -1587 -34 1408 118 -1461 -432 1152 142 -1725 -1125 775 408 -1386 -998 1135 1335
1863 1335 -455 -623 1308 1749 -177 -1006 596 1385 -354 -1542 -84 1225 -74 -1484 -295 1315
1879 1315 378 -1335 -643 1096 575 -1305 -1037 856 871 -935 -1065 831 1335 -395 -1042 635 1476
1896 1476 -139 -1261 119 1321 3 -1418 -335 1197 295 -1321 -602 1147 684 -1067 -753 1052
1912 1052 1010 -780 -940 836 1187 -574 -1193 419 1186 -394 -1380 63 1214 -34 -1308 -158 1274
1929A274r54j554P26J613n67j700L52J763l2j665l1J782L66j653n93J526O28j616
1947c35j050J253J025j259j213J125J476q00j378P84J585n27j643K67J608j68
1963G50j661pJ705L83j480l35J611O52j486r32J183P70j428j321R42J182r28j268
1981a668Q90J608l99j376M63J584k07j613j08J499J92j516l04J598P48j231o38
1998d78J353Q91j287j270P96R07j150j499N96J349m76j284N81J711oj360R0J495
2016I59J01j568m20J367M94j291n48J446R99r94q53J045R66j083j456M22R66q51
2034b99j514L53J434r2j176L12J646L18j276k64J315L53j371p15J161P82r85p16
2052g34J168J181p31j048O37J003q37j562P6R80m81j399J27J418K75j025O2J489
$$ plain form
1929 1274 320 -1234 -508 1105 538 -1162 -810 953 921 -744 -775 1007 1373 -280 -873 653 1281 -335
1947 -335 -1385 -132 893 -366 -1579 -454 1022 222 -1156 -372 1213 686 -957 -690 918 750
1963 750 -911 -918 787 1170 -310 -645 966 1618 132 -800 383 1153 -275 -1596 -654 528 -400 -1668
1981 -1668 -778 830 431 -945 -482 1102 895 -718 -826 673 865 -651 -955 643 1391 160 -478
1998 -478 875 1766 479 -791 5 912 -238 -1737 -1141 208 -268 -1552 -971 740 734 -626 -536 959
2016 959 1060 -508 -928 439 933 -358 -906 540 1539 545 -308 737 1703 620 -836 -414 552 -299
2034 -299 -1813 -1460 -26 -118 -1294 -982 664 982 -294 -558 757 1110 -261 -976 185 967 -18 -734
2052 -734 434 1615 884 -164 473 1476 639 -923 -847 133 -348 -1747 -1620 -202 73 -952 -890 599
2070E99N14j144n03J074N13j184q04R87R38p38p80R27J169n31j140L24R44o26
2088E39j539j44R78j59j235k0J368N20q91j60J289O36j025p15Q50O69r34q99P93
2107g9J068m99q67O77J162l82j207N0Q76m10j461k77R91J05j058j25J316O84p98
2126b34l53J082P05r23q49P01P62p32r32O41J132l04r23M07J097k60j261j75Q46
2145D27j77j324l88J000L85q97k67J179Q25p23n64Q80P74p71r60N18Q94n14r46
2164f49M68J145j51r78J61J032j20j248l37Q37M2j192m31J002N57p67m00J052
2182B3Q69o49p22O84Q30o49j011L86R78l08j002K72J165J2j047q6J008O9j199
2201c77n03Q27L30j028n72R31P80o41o18Q51R57n20q90M61R27m18j093K03J052
$$ plain form
2070 599 1113 -31 -534 540 1053 -131 -935 52 990 252 -528 399 1568 1037 -103 221 1165 539
2088 539 -1000 -1144 -166 -325 -1560 -1580 -212 308 -583 -743 546 1182 157 -558 292 961 27 -872 -79
2107 -79 989 490 -377 300 1462 1080 -127 -77 799 389 -1072 -1349 -358 -253 -1311 -1436 -120 564 -234
2126 -234 -587 495 1200 277 -572 129 891 159 -773 -132 1000 696 -227 180 1277 1017 -244 -419 427
2145 427 250 -1074 -1462 -462 -77 -974 -1241 -62 763 40 -524 356 1130 359 -601 -83 811 297 -649
2164 -649 -181 964 813 -165 -4 1028 908 -340 -677 160 202 -990 -1421 -419 138 -629 -1029 23
2182 23 892 243 -479 205 1035 386 -625 -239 739 431 -571 -299 866 878 -169 -255 753 822 -377
2201 -377 -880 -53 277 -751 -1323 -392 388 -253 -871 -20 937 417 -473 -12 915 497 -596 -393 659
2220F59r6j023N1J107J77j054k93R21K86j085o20Q02N47q33o81P88Q92n00p76
2239g31N97J000l62r84K35R68j75j059NJ032J30r96k02R95L64r49n06Q24N14q73
2259a73p23O85P50o36p95N79R41l62q97L51J006j87j005N2R76L3j026j76R66K99
2279F58r38m05Q91M96q23o15P30O96o53p77N45Q62m44q98L45R41j95r64Q9R90
2299E31L9r72j55R46K77r33m08Q48M63q28n92P24O71o24p03O04Q32m20q40L79
2319a61Q88k65r57J05Q97p0r42q8R14K21q65k95Q68L93q14n38P07N43o92o79N86
2340b44P88m06p39M54R13k13q55J60Q64r7r90j26Q18J24q97k71Q59M00p53m41
2360f52P40N27p02o84N45O57n26p45M64Q74k11p34L19R44o9q69k3Q09or69k94
$$ plain form
2220 659 563 -460 -409 698 875 -179 -472 449 735 -350 -970 -168 379 -454 -1135 -347 545 45 -731
2239 -731 -134 866 504 -480 -245 723 548 -511 -506 526 656 -340 -542 453 817 -132 -638 186 700 -173
2259 -173 -896 -211 539 -97 -892 -313 628 266 -631 -280 726 539 -466 -414 562 595 -431 -607 359 658
2279 658 -280 -685 206 702 -121 -736 -6 690 37 -740 -195 667 223 -675 -330 611 416 -548 -459 531
2299 531 570 -402 -557 389 666 -267 -675 173 636 -192 -784 -60 611 -13 -716 -112 720 300 -540 -161
2319 -161 727 462 -495 -390 507 437 -505 -593 321 542 -323 -618 250 643 -171 -709 -2 541 -151 -830 -244
2340 -244 544 138 -601 -147 766 553 -302 -142 722 625 -365 -491 327 451 -446 -717 142 542 -211 -652
2360 -652 88 615 -87 -771 -226 431 -95 -840 -376 498 287 -447 -128 816 747 -122 -145 664 658 -311 -605
2381f05P64K60q12l79P86N34o38n57O06O18n69p86L88P40l29p92L13R53qp42J30
2402a25R21R6q73k56P18J71r16m71O87M38o82m99O77O69n06o77M29P07m17q35
2422g44K33P95j46p54J65R56J66p19m8Q40K22q41m31O04L00p93n89N78N75n24
2442a55n94N13P59l50p62K54P29k26q56N0Q23Q8p23lR09L38o84k47P16L46p52
2463A73n88M85M39o27o72M46O76l31o60L58P67k00p70P6P21o2p94p1P73K42o38
2484b57j57Q14M26n88m16N62M33o31o67L55N25m51o87L12P36j61o74J50P57k8
2504C53p50r3O79J25p17k16P31L87n59k87O64M99n12n14M13M93n05p01K42N82
2524C14k82o76J95P14l4o59K4O99Q1p06j91O30K40o21k94O45M59m71m03N33N46
$$ plain form
2381 -605 159 419 -393 -772 14 548 -90 -647 -41 577 8 -778 -390 350 21 -771 -458 495 487 -255 -125
2402 -125 796 892 19 -237 481 652 -264 -735 -48 390 -292 -791 -114 555 49 -628 -199 508 91 -744
2422 -744 -511 284 138 -616 -451 505 671 -48 -96 744 966 125 -306 298 598 -195 -784 -206 369 -155
2442 -155 -749 -236 523 173 -589 -335 394 168 -688 -638 185 273 -450 -453 456 794 110 -137 579 925 173
2463 173 -415 70 509 -118 -790 -344 332 1 -659 -301 466 266 -504 -428 293 231 -563 -634 139 381 -257
2484 -257 -414 400 826 238 -178 384 817 186 -481 -126 399 -52 -739 -427 309 148 -526 -376 381 353
2504 353 -397 -490 189 314 -403 -619 112 499 -60 -347 317 816 304 -210 203 696 191 -510 -268 314
2524 314 32 -644 -449 265 231 -428 -404 295 376 -330 -521 109 349 -272 -566 79 538 67 -336 197 743
2545G43m20o07K89N38l45p04J46O45j28o71N2P14J11o63j28O66K06o55l02N89
2565G6L48n43l93N39N33m12m91L92N69l30o37J98N86k06o99O7O45%o43n6O68J91
2587D02o13k34O03L12n74l88N16M43m43m91M14N70l13n81K62O21j93o66O2O38
2607C47l4o80p3O63J29o23k04O16L05n66l31N30M13m84m57M09N28l66n73K77O03
2628D29k17o28J34O43m4o48j8O39J15o39j83O04K64n80l29N31M12m83m42M38N31
2649E29l57n62K68N84k38o61J25N99o2o53j2O52J25o05j32O12K70n62l30N14L70
2670D74m83m41M22M91l41n01L09N66k16n84J22N61j20o60l7N81M9n83j22O20K60
2691C67m84k55N46L67m80m17L88M27l80n01K94N43j96n25J78N82q0o08l3N19J
$$ plain form
2545 743 323 -284 5 543 198 -506 -360 285 157 -514 -462 252 363 -300 -428 238 444 -211 -513 76
2565 76 424 -119 -512 27 560 148 -343 49 618 288 -349 -151 435 229 -470 -403 242 242 -401 -457 211 402
2587 402 -211 -445 158 470 -104 -492 24 467 24 -467 -53 517 204 -377 -115 506 313 -353 -291 347
2607 347 313 -367 -440 223 352 -271 -475 141 446 -120 -451 79 492 8 -449 -40 488 122 -451 -174 429
2628 429 212 -416 -282 361 317 -331 -349 290 405 -234 -417 187 451 -129 -458 73 485 2 -440 -2 529
2649 529 172 -390 -122 462 224 -437 -312 287 225 -428 -440 212 337 -268 -400 212 482 -80 -410 104 474
2670 474 -9 -450 -28 463 122 -379 -70 496 280 -304 -182 379 259 -401 -438 143 192 -391 -513 107 367
2691 367 -117 -372 174 541 61 -356 32 459 79 -422 -128 415 219 -306 -128 454 374 -234 -267 252 253
2712B53o48j52N21K05n10j87N56L69l95l00M28M10l67m82K61M62k68n18K01N45
2732C84p4n26Q0N44qo06j34M61O4n59k61M80L01l97k50M82M47k85l78L26M46k80
2754B57n30J59M76j46n19R9N60K4n06l7M88Q1n68k46L94J55m95l01M41L63k86
2775a37k77M17M79k17l98K10M24k08n38O9M68o0m72K1N28R6m71j38M46J10n30
2796a78l24L43K39m19l31M11M59k25l02L41N32j74m65J11M47j45n41j1M79L9m59
2817a73m9M97J72m60k24L65J72m94l78K94L14l25l40L47N20j35l29K51N04j08
2837D21m80J7M14m2n24q2M54J45m13j44M58K40m38l19L01K39m26m27K54L78k12
2858a86l54K78N54m3l72J32M83k8m92r4M01L4m85j45M43K03l77k06L93K79m04
$$ plain form
2712 253 -395 -547 -26 179 -331 -518 38 407 12 -288 140 550 183 -299 -38 424 156 -362 -161 384
2732 384 310 -216 -136 408 400 -206 -340 121 185 -374 -635 -155 146 -251 -501 -19 428 143 -235 91 537 257
2754 257 -273 -114 362 216 -303 -204 356 380 -126 -163 325 406 -162 -408 -14 141 -354 -655 -214 149 -137
2775 -137 -414 3 482 265 -133 77 501 293 -245 -176 292 232 -240 -219 309 405 -66 -204 242 352 -178
2796 -178 -502 -159 80 -339 -670 -259 200 -25 -327 14 546 372 -93 18 465 320 -221 -232 247 286 -173
2817 -173 -222 275 447 -13 -237 128 300 -194 -572 -278 36 -289 -629 -282 238 103 -226 25 529 421
2837 421 -59 -42 372 330 -194 -276 178 323 -90 -234 224 464 26 -293 8 247 -179 -606 -352 26 -186
2858 -186 -540 -262 292 249 -123 9 492 464 -28 -122 279 313 -172 -317 126 329 -48 -254 139 418 14
2879A4l63K27K85l49m27K16M30j25l51K36N39K4m03M7M61J6n04j46L75J29m51
2900a20j93M10K79l39k86L24L15l39m54J71L51k47m52J56M89l0l68J32N41P3m22
2921in9M29Q1m84k17L63K16m03k52L73L24k90l21K42L51k83m66J17L87j56m45
2942e02J01N21N5l90M1N11J31m41j57M01J60m57k89L47K86l37l32L25L97k61m11
2963c01J90L89j96m97P9M38m9m58K8N25J15m03o2M87J88m38k35L68K37m15l25
2984c35L15L62k87m01K57M33j80m71J07M50r6n23NM79O4m66q6N17K15m25k14M53
3006A73K91m17l52L30L65l24m42K56M36j81m69J54M83o9n13J4M96L5m97j11M87
3027A45J72m45k13M38K81l89l13L54L69l21m30K62M38k17m74J31M90q5n14L5N02
$$ plain form
2879 14 -349 -122 163 -186 -613 -397 33 -92 -443 -207 332 356 -47 0 461 477 -27 -173 202 331 -120
2900 -120 -313 97 376 37 -249 75 390 51 -403 -232 119 -128 -580 -424 65 35 -333 -201 340 413 -9
2921 -9 -68 361 442 -42 -259 104 320 -83 -335 38 362 72 -249 -7 344 61 -405 -288 99 -57 -502
2942 -502 -401 120 175 -215 -174 337 468 27 -130 271 431 -26 -315 32 318 -19 -351 -26 371 110 -301
2963 -301 -111 278 82 -415 -336 102 53 -405 -377 148 263 -140 -202 285 473 35 -200 168 405 -10 -335
2984 -335 -20 342 55 -346 -89 344 164 -307 -200 250 154 -369 -364 115 179 -287 -373 144 359 -66 -280 173
3006 173 464 47 -305 25 390 66 -376 -120 316 135 -334 -180 303 234 -279 -265 231 266 -231 -342 145
3027 145 317 -128 -341 97 378 -11 -324 30 399 78 -352 -90 348 131 -343 -212 278 193 -321 -286 216
3048B16O3m97r3N08J71m43k17M22K86m14l66L52L57l27m14K76M41j92m71J75M86
3069C19r0n08J6M88J8m96q1M95J71m44j63M60L03l96l22L46L10l69m32K17M02
3090B44k34m73J78M97p6m55O0N11L0n15r1M57J23m50j93M73L10l47k68M20L84
3111E85l29m01K21L52k94n26J07M13j27m67Q7N13P2m46n3M75J21m79k15M18K31
3132B58l90k57M32M02k54l05L22M06k43m82J11L40k18n48j0M51jm69J6N21J74
3153B56m13j40M33K04m42k98L62L00l01k93L77M73j75l50K14M29j93n36l6L43
3173B14j42n65p3M51J14l97q2N11K54l71k26L66K71l75l63K96L89k00l24K94N37
3194E79p3m07R5M22j24n85j57L42m2n39j64M38K47l38j67M64L40l10l44K88L27
$$ plain form
3048 216 279 -218 -311 197 368 -75 -292 130 416 2 -364 -12 345 18 -396 -120 321 129 -342 -167 319
3069 319 229 -279 -263 225 243 -253 -334 161 332 -112 -275 185 488 92 -230 116 426 57 -375 -158 244
3090 244 10 -463 -285 212 136 -319 -259 252 282 -233 -324 133 256 -194 -387 86 396 49 -219 201 585
3111 585 256 -145 76 428 134 -392 -285 128 1 -466 -379 134 206 -240 -293 182 303 -176 -391 27 258
3132 258 -132 -389 43 445 191 -114 208 614 371 -111 0 340 122 -426 -436 15 14 -455 -439 82 256
3153 256 -157 -297 136 340 -102 -400 -38 262 -39 -332 45 518 343 -7 207 636 443 -93 -129 214
3173 214 72 -493 -566 -115 -1 -398 -480 31 285 -86 -312 54 325 -50 -413 -117 272 72 -252 42 579
3194 579 506 99 194 616 492 -93 -250 92 50 -489 -653 -215 32 -306 -473 -9 331 21 -323 -35 292
3215B92k85m10K25M52p6l65K06N41K0m47l6L84n2n68k73L14P7m55k24M25L35k61
3237a81k31L80L95k38m07J80L74j90m36J35M96L5l53P6N21J01m46j87L31M8n51
3258a48l47K73J96l71k91L68M33j79k91K73M24j68m31P6L84o1m07M2M98J33l44
3279F2k9M69J55m23k86K64J07m54l96K20K95k59l04K71M60q6l37J41M24n9m61
3300b26mL79L9l75n3M77K02l00j38L69K13l81l57J94J91l57l92J65L47j42l17
3321d66K03M42l1l30L8L97j1m11q4L84J03l27j09M17K42k81k08K84K37l30l83
3342b24J28K44k47l90J24L84o3l32J19M42L3l67l2L68P3l79j47L54J93k95j65
3363a79L47K71k39k76K07K66k63l87R1K85j49l81O8M04Ol27K9L86P8l44r5L27
$$ plain form
3215 292 7 -403 -178 274 198 -167 39 580 600 153 117 501 449 -119 -392 -78 -1 -456 -680 -255 80 -181
3237 -181 -412 -32 363 125 -282 -102 272 82 -354 -219 277 312 -41 35 556 657 211 24 355 403 -148
3258 -148 -495 -222 -26 -397 -688 -320 113 -66 -357 -84 340 172 -259 -183 201 140 -267 -225 273 406 62
3279 62 33 502 657 234 -52 212 319 -135 -531 -311 -16 -275 -579 -308 152 66 -271 -130 294 235 -226
3300 -226 -230 149 188 -187 -240 237 439 139 1 370 583 202 -155 39 230 -127 -519 -354 -7 -149 -466
3321 -466 -263 179 148 -182 -144 253 242 -169 -253 131 234 -93 -202 215 457 176 -32 252 489 159 -224
3342 -224 -96 148 -99 -489 -365 19 -44 -376 -257 185 218 -149 -181 187 260 -119 -266 88 281 -14 -179
3363 -179 168 439 200 -76 131 397 134 -253 -162 123 -26 -407 -339 65 71 -256 -227 159 237 -107 -202 125
3385A25J22l31j73L02K33k50k29K67L06k13l20J57K96j68l97O3L33p5l67K6L90
3406I7O8l27n9L72J28l42j56L13J88k96k44K64K89k23k96K01L28j54l66J12L28
3427B25r1l80L0L48Ql52o1L77J20l46j25L22J98l01k16K65K51k28l06K03L12j65
3449H8l35J15L49q4l53M7L67J6l55m8L54R2l51j38L26J72l11k21K84K58k59k71
3471b58K14L01j85l44J32L32j16l49L9L60Kl34lL72J08l27j02L21J56l24k05K60
3493E0K10k64k55K14K98j80l13J67L22j27l70M2L29m2l68j7L80R0l08p7L79J75
3515C35k87j72K71K06l05k83K22K44k16k92J76L27j10l25Q5L21o0l78m0L27K2
3536F8l47n7L69J57k39j23L43K45k78k25K08K38k56l27J30K91j46l25J18L50l0
$$ plain form
3385 125 247 -84 -257 45 278 28 -201 66 372 159 -161 -4 292 124 -273 -210 123 48 -319 -293 97
3406 97 165 -162 -221 151 279 -63 -219 94 282 -14 -258 6 295 72 -224 -23 305 151 -215 -103 225
3427 225 134 -246 -216 132 140 -212 -273 104 224 -122 -247 75 273 -28 -244 21 272 44 -262 -59 253 88
3449 88 -247 -132 217 133 -220 -173 194 210 -145 -193 161 253 -98 -236 90 262 -49 -270 14 272 13 -258
3471 -258 -44 257 72 -272 -140 192 76 -273 -234 126 128 -206 -209 163 271 -56 -158 163 319 -5 -210 50
3493 50 260 -4 -259 -45 253 73 -240 -73 249 122 -248 -206 123 81 -287 -304 76 166 -142 -219 160 335
3515 335 48 -124 147 353 48 -235 -13 231 15 -277 -101 226 116 -209 -124 197 137 -241 -281 46 68
3536 68 -279 -336 33 190 -49 -172 171 416 138 -87 121 359 103 -224 -94 197 51 -274 -156 194 164
3557A64l54j0L32Kl92r6L12J09l06j21L64K41k03j68K91K87k27k95J53K45j99
3578A29l61Q7L09o7l23L7L66K0l46p9L12N1l64j71K96J90k70j50L30L11j79k10
3600h2K29L13j85l63P1K91j51l81K2L61Pl35l7L79Q5l59j46K67J44l45k20K90
3622a45K66k00k15L03L58j18k74J50L24j23m04%K94n0l98m1L42R9l27r9L40J48
3644B30l30k32K50K08k79k93K46L49j28k60K29L91n6l19N6L27m4m13q8L01M7l81
3666a89j08L42J69k95j81K79K13k76k86J86K58k02k96J84L56m1k75J30L78J5l30
3687C1m0L09Pl83j50K79J17l03j71K97K23k41k41K14K70k14l40J34L10j20l10
3708c22J12L92J8k88K4L81P9l49j22K91R4l65k08K64J95k64k30K42K78j87l04
$$ plain form
3557 164 -190 -200 132 134 -258 -354 -42 67 -239 -360 4 245 42 -126 165 452 225 -70 83 328 129
3578 129 -232 -145 164 97 -226 -189 177 197 -149 -228 84 135 -229 -400 -104 86 -184 -334 -4 307 128 -82
3600 -82 147 460 275 -88 -17 274 123 -258 -236 125 132 -203 -240 139 224 -135 -281 -14 130 -215 -435 -145
3622 -145 121 -79 -294 9 367 249 -25 125 449 326 -78 -78 216 166 -232 -273 69 168 -159 -258 82 230
3644 230 -100 -332 -82 126 -153 -446 -200 149 21 -239 -10 381 325 6 62 389 345 -68 -156 145 192 -189
3666 -189 -297 45 214 -81 -262 17 230 -46 -332 -146 112 -90 -386 -202 154 113 -162 -32 346 361 31
3687 31 -9 300 307 -76 -226 53 170 -133 -304 -7 216 -25 -266 -52 218 4 -336 -202 108 -12 -322
3708 -322 -210 182 200 -88 -64 317 396 47 -75 216 310 -55 -263 1 196 -68 -298 -56 222 35 -269
3729b69J58K78j35l32N4L14k8k90M2L58Q7k80m5L36J14l08j71K36J56k96k38K03
3751e6K50j86k61J68K95j22l21Q9K98n7l45kL33L7k88l5L45J30k73j28K82J71
3773C24k73k27K06K03k22k68J59K78j36k77J14K97o1l11J7L11ml07o1L09J11k82
3795a00j00L09J90k67j83K33K13k20k87J68K60j56k94R7L04o0l13L9L13Pl17n0
3817b14L11O7k82j25L00J50k53j76K46K28k06k28J72K48j64k68J00K80p5k92M2
3838a39K97J2l04m4L03O8k77j13K74J41k46j87K33K02k07k33J72K45j47k62J07
3859a05K80o9k86M2K98qk99j8K88O5k81r7K70J29k46j47K26J96k10k19J72K07
3881A88j52k48R6K56q6k58N1K85Kk69pK76N2k68r0K48J16k51j40K39J79j96j78
$$ plain form
3729 -269 -111 167 32 -300 -246 68 40 -250 -208 150 237 -43 -88 248 362 54 -117 119 275 -21 -259 -56
3751 -56 194 8 -253 -85 210 88 -233 -144 154 97 -248 -250 83 120 -168 -203 142 272 -1 -129 153 324
3773 324 51 -176 30 233 11 -257 -98 180 44 -233 -119 178 117 -194 -177 134 130 -177 -238 71 182 -100
3795 -100 -200 109 299 32 -151 82 295 75 -212 -44 216 60 -234 -137 167 107 -206 -167 146 153 -164 -214
3817 -214 97 164 -118 -243 57 207 -46 -222 24 252 46 -182 -10 238 74 -194 -94 186 111 -181 -139
3838 -139 158 170 -134 -178 125 193 -84 -197 77 218 -28 -215 18 220 13 -220 -48 197 50 -212 -105
3859 -105 175 106 -180 -138 160 152 -147 -165 123 188 -93 -190 80 209 -37 -184 42 238 28 -191 -19 188
3881 188 36 -212 -116 140 54 -204 -153 132 134 -135 -142 134 186 -82 -172 76 192 -59 -199 40 219 23 -155
3904a55J66K22j56k50Q9K27j02k78N6K61k2k56J7K88O4k60m3K53Q7k37j38K18
3926E1J41j92j58J75K06j36k13J39K11j22k62M3K20p9k69PK64L0k25k1K69J04
3948A83k12j04K20J14k14j49J83J71j58j83J65K31j08k35P8K31r5k88mK19k0k74
3970b49j8K72Q6k19n1K68J27j96j54J95J57j93j92J50K12j22k01J24K44o4k67
3991i1K6K38p8k93m8K33K9k49o4K70J47j93q8K46J72k00j84J54K08j62k25J13
4013c9K41o0k25O8K55l1k85m1K26%l05j05K24Q8k25q8K48J94j39j44J85K06j47
4036A01k23J06K17j00k44P8K70j7k44J2K60K1k94q6K10L4k68j46K11J51j73j45
4058b69K13K51j31j97J45K42j12k68O6K32l9k61K1K68N0k51m4K35O4k64j47J79
$$ plain form
3904 -155 11 233 77 -173 -84 143 41 -237 -181 80 58 -198 -181 107 171 -89 -132 121 208 -29 -167 51
3926 51 192 0 -158 17 223 87 -126 13 224 102 -160 -117 103 24 -245 -238 26 56 -169 -190 79 183
3948 183 -29 -133 87 201 -13 -162 21 192 34 -149 16 247 139 -96 -18 213 118 -170 -174 45 25 -249
3970 -249 -267 5 91 -128 -179 89 216 20 -134 61 218 25 -167 -17 195 73 -128 -4 240 176 -91
3991 -91 -65 173 95 -198 -246 -13 16 -233 -297 -27 120 -73 -161 85 257 57 -127 27 235 73 -152 -39
4013 -39 202 142 -83 -15 240 209 -76 -117 109 109 -196 -301 -77 11 -214 -302 -54 140 1 -143 42 248 101
4036 101 -122 -16 201 101 -143 -65 205 188 -56 -44 216 237 -57 -143 67 101 -167 -313 -102 49 -124 -269
4058 -269 -56 195 64 -133 12 254 142 -126 -60 172 133 -128 -107 161 211 -40 -84 151 215 -49 -196 -17
4080a7R6k23j87J81K08j23j72J79K59q5k14P5K46n1k66OK37K5k46l9K56R6k43
4103bj05K02J15k38j90J36J70j83k09J44K40p3k08J09K64k1k35J6K38kk51m7K40
4126A10P1k26p8K15J31j90j69J74J46j72k21J05J99j13k24J07K44l3k11M1K60
4147A66J2k37l5K19N7k32r9K11J17k03j42J93J59j60j86J26J97j37k25P9K15o1
4169C4k17L4K57K3k26j4K37N9k40p1K05J05j96j55J90J53j62j70J31J94j22j98
4191a49P5K23p0k23L1K24J2k36k8K35N5k28p8K13J17k03j42J90J54j71j73J39
4213c3J93j20k14Q5K12m7k13N6K28pk09j9K28M3k30q2J98Q9k08j21J72J45j48
4236bj77J47J87j16k06O9J99p1k11L3K30Lk00J4K33O4k02o6J96P8j97j35J45J23
$$ plain form
4080 -17 79 -144 -331 -150 58 -65 -237 -58 201 116 -98 -23 223 172 -94 -88 149 174 -72 -111 145 241 -2
4103 -2 -107 95 210 -28 -218 -82 88 -95 -304 -160 80 7 -201 -92 172 151 -84 -68 170 168 -83 -130 110
4126 110 181 -45 -123 92 223 33 -136 38 184 12 -209 -104 95 -18 -242 -135 109 76 -135 -94 166
4147 166 178 -59 -94 125 182 -50 -149 62 179 -24 -166 27 186 26 -160 -34 163 26 -199 -120 95 34
4169 34 -183 -149 108 131 -95 -109 128 187 -53 -124 81 186 -10 -165 25 178 16 -154 -23 171 49 -149
4191 -149 -74 149 79 -144 -113 111 123 -113 -141 94 149 -79 -157 56 173 -30 -172 18 172 1 -172 -33
4213 -33 160 40 -174 -89 123 76 -137 -81 147 140 -69 -88 140 183 -47 -129 69 158 -50 -171 1 146 -2
4236 -2 -179 -32 155 39 -167 -98 101 30 -181 -148 82 85 -115 -101 132 196 -6 -72 124 202 5 -130 15 138
4260A38j73j59J45J86j08j80Q0K04p8k07L5J84k1k01oK23O4j64l2K12J03j78j01
4283c4J34J03j69j76J01J36j18j77J00J97n8j76M0J82k6j95k3J74L8j85j9J98
4305D7J09j27n6J71J35j46j46R7J00j37j94N6J56p4j72N5J91j5j63oJ77lj91m3
4329a79J47P8j46m0J84J23p9q1J40J21j16j60M2J06j17j72K8J43k4j59M3J79R
4352G0j65j5J41K6j76o4J55P9r6m9J53J55p9r2Q9J16r7j78RR3q3j63J8J49Kj35
4378a37jJ82K2j50n1J35M2j38p9J46J16p8o1J30J66o4j15N5J12r1j76k0R8m9j58
4403a64kJ63J9j30j0J44N2j37q0J13O4j28o4J27J26n3o2J17J47n5j38K6J01p3
4427A03j71k9J07qj57k4J71M7j29l6J39O0j22q3R6R5r9r4J16J45l7r8R9J51n6
$$ plain form
4260 138 -35 -194 -49 137 29 -151 -71 133 55 -152 -117 67 46 -155 -161 62 126 -38 -70 142 245 67 -34
4283 -34 100 203 34 -142 -41 95 -23 -200 -100 97 39 -137 -97 85 59 -136 -159 15 53 -132 -151 47
4305 47 156 29 -27 144 279 133 -13 84 184 47 -147 -91 65 -9 -181 -126 65 50 -113 -119 58 55 -136 -179
4329 -179 -32 46 -100 -140 44 167 88 7 147 268 152 -8 34 140 23 -149 -121 22 -2 -161 -118 61 70
4352 70 -95 -110 31 57 -119 -183 -28 51 -45 -94 59 214 135 43 132 248 151 -27 -18 75 -8 -171 -153 -4 -2 -137
4378 -137 -138 44 66 -84 -135 0 42 -96 -175 -29 87 9 -52 78 244 180 65 120 232 141 -35 -55 43 -6 -164
4403 -164 -166 -3 16 -114 -124 20 72 -65 -145 -32 32 -96 -160 -33 93 40 -22 95 242 187 49 75 176 103
4427 103 -68 -97 10 2 -155 -179 -8 39 -90 -126 13 73 -49 -132 -36 59 -40 -134 -18 127 90 -8 91 242 186
4452A86j51j3J14n0j83m6J26J3j46k8J45Q3j12n4J12Q7j16j11J02J10p2j03J03
4475dJ52k2j16N9J50m0j57m2J06j8j65n1J23M3j10n7J35R5r9r3Q9J00q8j23P4
4500e9J36n2j09O9J51j1j26J9J37nj68n7J17J5j53n1J26O0j06n8J15J00p9j15
4524a04Q3J19p2j33N2J43k7j27L1J49J0j34pJ18K8j56o8J16M0j27q5J11R8r8q0
4549a20J03J07p0j22N6J40n9j26K9J51pj41OJ48K8j52k7J19N1j43q0J10Q3j15
4573c1r2R8J22r4j12P6J38o2j32L9J37j7j49nJ54%j27l8J35N3j42o1J25R0j31
4598b6q3J12J16j02j24P9J37o1j41N2J46k4j41QJ55Oj52m0J37L6j61p0J31R3j37
4623e4q4J18J19q0j09Q6J32o2j37M2J31l4j43J0J51J8j40l8J57L5j50p4J00P0
$$ plain form
4452 186 35 22 136 86 -97 -143 -17 -4 -150 -178 -33 50 -62 -116 -4 83 -33 -144 -42 68 -4 -107 -4
4475 -4 148 126 10 69 219 179 22 -20 86 68 -97 -148 -25 18 -92 -149 -14 81 -18 -111 -22 78 -10 -133 -59
4500 -59 77 25 -84 -15 136 125 -1 18 155 150 -18 -75 42 57 -96 -147 -21 39 -67 -125 -10 90 11 -104
4524 -104 -21 98 26 -107 -55 88 61 -66 -35 114 124 -10 -17 101 129 -27 -95 21 61 -66 -151 -40 58 -40 -120
4549 -120 -17 90 20 -102 -46 94 35 -91 -62 89 82 -59 -53 95 123 -29 -56 63 114 -29 -109 1 84 -31
4573 -31 -123 -25 97 3 -109 -33 105 43 -89 -50 87 70 -79 -84 70 70 -57 -95 40 93 -49 -110 15 105 -26
4598 -26 -109 3 119 17 -107 -28 109 48 -93 -41 105 81 -60 -52 103 109 -43 -83 54 90 -71 -141 -10 83 -54
4623 -54 -138 -20 99 19 -90 -4 128 66 -71 -29 102 68 -75 -65 86 104 -36 -74 83 118 -32 -106 -6 64
4647F4j36r7J01J14q1j05J07J53n1j22N5J49l4j65%J35Qj48k1J36O2j45o2J34
4671E1N5j31j34J01P8j16j18Q6J49n2r5Q7J62j1j24J3J54qj69k6J20L9j26n3J29
4696F1P6j04j01R9P2j20j40N8R1p4j23N9J54Rj05M8J67L1j46oJ23Mj35p2J19O3
4722A08j17o6J09R9r1j15N7Q5r0j60K7J20l2j17L2J72L8q6RJ65M0j32n1J07L4
4747A45j28r4J08P8q2r3Q2J10p7j36K9R2o6j59lJ33j2j07K4J76O6q5j7J57N4j16
4773G9q2R4M7j23q2Q4Q9n3j07N8J15n9j34j4Q7l9j46j0J24M5r7j0J60J00p8m7
4799AJ18O2r4j18O7Q5q5j09N8J11l5j03J5J14j8j68j1R6k4j28k9J24N7p0kJ32
4825D6J00o1n6O9P6p3j25L6R2n6j12L4J15qj09lP9J0j41n7P4K7r5o1J23R5o2k0
$$ plain form
4647 64 -72 -169 -68 46 -35 -140 -33 120 69 -53 2 151 117 -48 -48 87 95 -53 -74 62 124 -21 -83 51
4671 51 106 -25 -159 -58 20 -96 -214 -128 21 -31 -126 -39 123 112 -12 1 155 147 -22 -48 72 111 -15 -68 61
4696 61 137 33 -68 31 103 -17 -157 -99 -8 -82 -205 -146 8 17 -88 -40 127 158 12 6 129 133 -2 -74 45 108
4722 108 -9 -75 34 133 42 -73 -16 69 -21 -181 -154 -34 -66 -183 -151 21 59 -27 -18 147 187 55 4 111 145
4747 145 17 -77 31 109 27 -66 16 126 49 -87 -58 34 -32 -191 -194 -61 -73 -180 -156 20 86 1 -16 141 195 79
4773 79 -3 91 138 15 -67 17 106 53 -54 4 119 60 -74 -88 -1 -40 -186 -196 -72 -27 -124 -134 26 126 48 1
4799 1 119 181 87 -31 36 121 36 -73 -15 96 61 -42 -27 87 69 -99 -110 -14 -38 -166 -195 -71 -14 -84 -86 46
4825 46 146 85 29 98 174 101 -24 12 104 48 -64 -30 85 77 -32 -35 44 54 -87 -144 -70 -43 -138 -199 -76 19 -43 -63
4853f3J00J16m5q7N1R0o4j30K0Q9j4j07J0J11Mr8l3P6K3j25o2P6L5q4m6R5J01
4880C9l6n9Q2R9k7j01K6P7k2j17oQ7Lp8j1Q7L0j06m1P6L3j03n3N7O5n0o7P2J14
4909G0k2o1N0P8j8p5j5P5j4j00j4Q1J8p2k8P2L8r5m8P3K9p7o0N1O2l2m9O0R0o
4939F1o7K3P9j6p9mN8Mr6MO4J7o1l1O9L8q3n2N5L5o0n3N1P0l2m7M3R0k7o5K0O9
4971G7k1q6JO7Lp7j6P2K3o5m6P5M6o4o4O2M8n1n1L3Q0k7o2K9R0k1o7JP3j0q7%
5003c5O5Oo9j3P0K7p4m4O5L1m2o1M6O9m2p0M3P3j8p4K2P1j3o9%P7K0r5k0P6L3
5034E5p3m6P3M5o1m7N0O5m7o2M0P2k7q3J7Q4k9q4mQ1Jp0j8P1L4p2l4P4M5o6m9
5065f5O0N3m1n8M2P9l7o8M6O4l4p7PP4j6r7rQ6J5p0k4Q6M0o8l5N2M3n5n7M6O9
$$ plain form
4853 -63 37 153 108 21 72 162 98 -32 -12 77 63 -44 -34 77 81 -17 -50 26 49 -76 -138 -62 -27 -111 -157 -62 39
4880 39 3 -56 26 125 98 -3 23 100 78 -39 -45 42 45 -33 -44 43 73 -33 -74 2 35 -68 -121 -64 1 -49 -116 -44 70
4909 70 48 -13 37 115 97 22 7 82 68 -32 -46 35 53 -19 -47 25 63 -32 -80 -7 22 -55 -115 -64 -2 -34 -83 -23 67 61
4939 61 -6 17 96 80 1 -3 55 59 -37 -33 31 48 -13 -44 25 63 -20 -72 -17 18 -42 -95 -44 26 -6 -53 -10 80 53 -12 8 77
4971 77 56 -30 -29 38 41 -36 -52 20 43 -22 -68 7 53 -11 -75 -13 35 -16 -67 -34 46 19 -43 -14 76 55 -12 -11 62 52 -35 -35
5003 -35 30 36 -33 -46 24 51 -23 -67 -2 29 -13 -74 -28 41 -1 -71 -28 45 27 -47 -25 46 33 -36 -36 41 61 -34 -54 22 55
5034 55 -18 -64 9 54 -7 -54 -4 61 14 -48 -8 64 37 -46 -29 55 26 -58 -62 19 20 -50 -68 3 37 -35 -69 5 50 -16 -65
5065 -65 -5 48 7 -51 -9 70 33 -35 11 75 41 -36 -29 45 29 -68 -77 9 24 -46 -70 16 56 -12 -47 5 48 -7 -64 -18 51
5096E1l6o4N0Q5l8o4LQ8j3j08j5P6kr9j4P0M7o6k5P3N5n7m6N7O3m7p6L7Q9k3q0
5127b9M0Q9pq9lO8j2j06m6P2J4q5k9Q0N3l8n2P2O4l2p7L4P6l5p8L5Q8lp3K4R3
5158A08Mr2l4P0Nj05o7P0K7p5m7Q6P6l9o0P0Q0m7p3K6O1np5MR3L4q1rR7J3j07
5189Hm6O0J5j04o7L8O5l9o4O7J03k6o9L9R4k6q9J3R0Rr1OJ06L1p7k4P8L7j21o0
5219d4L6L5r3q5N2P1l7o9O6R9pp6J9R0Pj03j0Q8K9o5k3R5O1o7n1O0L7q3r7J6N9
5250A0o2q9K6R0np0L7R3K0p5pQ3J5q5k5P6M6o9l9P7P4n3q2N2N4o4j03kO8l6q7
5281a32J1R7K4p0J5R2L7q4j8P4L1p9l0N8O4m3n4N1P3m3q1J5N7m1j10jO3jr3%J05
5312a3K5o8qR1M9q0l4N1M2n4m6N0O9k8o2L3P9k8p8OM5j7r0j8O2J7n7k5P8N3n8
$$ plain form
5096 51 15 -49 1 86 48 -16 -13 75 62 -46 -61 15 13 -86 -100 -30 17 -49 -74 -1 54 -3 -49 8 71 24 -52 -15 74 51 -29
5127 -29 11 100 93 4 1 69 57 -49 -95 -23 -9 -94 -123 -43 10 -28 -80 -8 56 24 -53 -19 57 22 -56 -21 67 64 -9 15 108
5158 108 112 20 -14 56 61 -44 -111 -41 -14 -89 -136 -50 26 -13 -73 -3 77 30 -43 -17 44 39 -36 -32 61 95 14 5 102 115 8
5189 8 -38 22 37 -67 -134 -96 -31 -70 -134 -67 36 10 -59 -20 74 48 -41 -28 62 71 -20 -14 92 123 46 22 100 137 16 -44
5219 -44 -8 27 -66 -151 -99 -28 -65 -134 -68 31 24 -52 -33 57 64 -39 -49 39 68 3 -20 75 136 69 18 78 115 32 -65 -49 10
5250 10 -52 -141 -115 -25 -30 -100 -63 30 50 -25 -32 51 66 -19 -44 32 78 9 -30 47 121 68 -14 38 92 28 -75 -77 -9 -45 -132
5281 -132 -121 -24 0 -70 -55 37 74 -10 -28 46 77 -2 -32 26 90 47 -7 44 117 74 -7 8 65 24 -86 -87 -24 -25 -118 -118 -13
5312 -13 12 -56 -64 27 76 -4 -38 13 55 1 -45 5 74 46 -16 17 96 68 -10 -4 41 24 -66 -84 -22 -5 -62 -87 -9 44 -14
5343a4k8O2M2n0n1M8M8m0o3M5O0j9n3J3O6j9p4k0O4Np9j1M9L5o2k5P1M9n0l8N4
5374A5N8n4n0L8O2m2n2J9O9k1n8QO4j6o5j0N6Ro7l6N9M3o0l2O1L9m3n0N5N1l9
5405A1n7L0O4j9o1K3M2qn0j2P0Ro1k4O5L2o6k8N3L3l3m8L9N2l2n8J8O6k4o4K3
5436a5M4qn9lO0ko5rO6K4n4j2N4L9n2l5M3L4l7n1K8N0l4m2K6N7j4p4J1N8jo4j4
5469e1O6J2n5j2O4K3l8j9L9L8m3m5K8L7l9o0L3M2j8n2J1N7pm9qN5J2o7j2N0L0
5500B2l5k2M4N6l3l2M9L2m3m1J2L3l2m6MM8lo2RO0Ko4qM1J2m9k6N6K9l7oN1N4
5533G5j3n8K9M5m1n2QM3l0n8jO2%m6%O1rm7k0N1J2m2l9N8N3k5k6N2N3k8m1J0L6
5566G2l3o5pM0no8kO2J5o3pO0J5n7l9M6M4l4l7O0O2j8m5M9N9j8n9J0M5l6p6j8
$$ plain form
5343 -14 -42 20 62 12 -39 9 57 17 -46 -1 59 40 -13 0 66 47 -27 -47 17 22 -57 -68 -19 16 -46 -71 0 49 -1 -39 15
5374 15 73 19 -31 7 69 27 -25 -6 63 42 -16 -8 56 40 -25 -35 21 30 -37 -73 -14 29 -31 -63 -2 37 -6 -56 -1 50 11
5405 11 -46 -16 48 29 -32 -9 33 25 -25 -37 33 42 -19 -43 22 54 -12 -40 13 46 13 -35 4 56 24 -34 -16 50 26 -38 -15
5436 -15 29 21 -38 -41 19 17 -48 -57 9 33 -21 -33 21 60 8 -27 16 50 13 -38 -10 40 6 -36 -10 47 33 -41 -30 28 27 -37 -51
5469 -51 15 27 -28 -40 24 47 9 -10 29 67 24 -21 7 44 5 -55 -22 20 2 -50 -39 18 11 -38 -46 9 21 -46 -58 -8 22
5500 22 -13 -35 9 65 32 0 49 81 38 -3 9 42 10 -36 -32 16 13 -49 -40 20 22 -42 -50 -9 3 -46 -72 -16 13 -24 -30 21 75
5533 75 62 4 33 78 37 -15 -7 36 6 -52 -53 9 9 -37 -37 24 15 -32 -52 -1 11 -31 -70 -12 41 16 -10 42 95 67 26 36 72
5566 72 39 -26 -33 7 2 -66 -68 -6 9 -54 -61 -1 14 -43 -82 -36 8 -26 -63 -3 59 41 -4 45 104 86 27 37 82 46 -30 -48
5598d8O3po3lM9K6m0k8M7Nk4n6L9N6k1n8L2R0Kn8K3P2j7o0j4M9j1q5j3M9J2n5
5630d7k4N3N5n3m5M7L6m5m7L5N6qo3M1Q7Ko2PO2Lo8l7M4Qp2m2N3L8n7l2L9N2l5
5663a9n1L7N7l3n9K5O9pn0K5P5J1n0j0N4J3o8l6M1Nn9l1K8N9l5n1L4N9k7n9J5
5694c8M9j1m6jO6J4m0lN7K4m5l0L8L3o2n0M6L1o0l8L3O2l2n4L4M7Np2J8N0Lm8
5726b0j1O3K5n9j3O4K3m5m9M7K1n4m0L3L3l0m6L1N2j3n4MO2%m5rM8J1m7oN3K6
5758E5m9k7L9L8l2n3K8N0l3n5K5N6qo4qO4j4l9j1O4Rn4j2L5M1n7l4M0M0m1l3K6
5790a4M8j9n4K4M8j4m3QM3Po2LN0K0n4k3N7L0n2l5N1M0m7l9K9M2m3n0L0M8j3m4
5822b8MM6Jm8mN1Mn0%M1J0l1k7N4M0m9k5J6M3l4m6LM2j8m3%O7qm7QN8J2m3k0M9
$$ plain form
5598 -48 15 8 -55 -58 -9 17 -23 -51 -4 1 -23 -79 -40 16 -5 -63 -31 59 61 3 26 98 81 21 7 56 45 -40 -53 -4 8 -47
5630 -47 -71 -18 37 -16 -61 -14 22 -23 -70 -35 21 13 -50 -9 78 80 18 25 87 90 22 -15 29 37 -35 -77 -24 14 -43 -75 -36 16 -19
5663 -19 -70 -33 24 -9 -68 -43 26 19 -31 -6 69 80 30 20 74 87 19 -17 24 29 -30 -61 -33 26 -9 -60 -26 33 6 -53 -38
5694 -38 11 0 -46 -47 19 33 -7 -10 47 71 26 -4 34 67 5 -45 1 32 -28 -66 -33 29 -3 -57 -23 24 29 -43 -25 25 28 -20
5726 -20 -31 32 57 -2 -15 49 72 27 -22 25 46 -8 -48 -15 18 -12 -58 -27 25 12 -42 -38 24 24 -21 -30 18 29 -18 -24 29 55
5758 55 6 -21 18 56 24 -29 -1 49 16 -39 -14 42 34 -30 -38 26 12 -27 -38 26 35 -19 -31 4 45 -12 -46 -6 34 -7 -40 -14
5790 -14 34 15 -39 -15 33 19 -24 -16 27 34 -28 -25 25 45 -9 -32 25 55 3 -32 19 59 12 -27 2 44 1 -49 -19 29 16 -28
5822 -28 -24 22 23 -25 -29 22 26 -24 -24 17 27 -4 -31 23 63 14 -11 5 48 14 -32 -29 13 -5 -48 -48 19 11 -36 -28 30 42 -1 -21 28
5857B8K7n0l8M2M5m1l6L0M5k7l6KK9j0n7nN0k4k6JM4K0m0%N5K8l8l5L9J7k1k9
5889a1L1L9k6l5K4L7j3n3mL7pn6j1L5ll6%M9J8l1j2L3L9k4l1K5K5k5l5K5L4j5
5921B3l9J4L2Jm7jK5nm2k5L5J7j9rL6L9j9k4L3L2k1k6qM2k0k8OL0j4l1QJ8Ql2
5955a1k8J8Kk8j6K6K2k4JM4K5j6j7L1K7k3l6J3K6jl8KL9J0m5JK1nm6j0L3rl3k1
5989f6L1K5j8oK6M3j0k9QL3j2l2MJ6K2m6J3L0Ml4j8J9J2l5k9K5J1l4j1L0L8j8
6021hrK2L7j7j2J6J1ol3qL5J1l5j6K5Nk8j2J6%l7qRRoj2J6K7J3k0K4K8Ll1jJ9
6057B7J3l1kJ7Ok8oK1Rj9k4J3Lj2k6RJ6kj5J0L3Nj1PJ8jj0j8K2jk7j6J7J4pj8
6093a4J9J3k8j4jL1k7j9NL3oj0J4K9lq%J9J0l8j5L7j0j6j6K2J4l3mJ5J8j8l3O
$$ plain form
5857 28 55 5 -33 9 54 13 -23 7 52 25 -11 -9 20 10 -47 -52 -2 -26 -52 -51 -7 13 -27 -27 28 56 18 -17 22 39 18 -11
5889 -11 20 59 33 -2 22 59 46 -7 -11 26 19 -37 -48 -13 -16 -52 -52 -3 15 -16 -28 5 44 20 -11 14 39 14 -21 4 38 23
5921 23 -16 -2 30 31 -16 -17 8 3 -39 -64 -29 -12 -31 -40 -4 35 16 -8 25 57 36 10 2 44 24 -4 2 32 18 -13 -5 13 21 -11
5955 -11 -39 -21 -19 -47 -63 -37 -15 -39 -38 6 31 15 -2 29 56 33 -3 10 36 35 -3 -1 38 48 3 4 25 20 -26 -36 -3 -12 -45 -66
5989 -66 -35 -10 -28 -34 -8 35 25 -4 4 37 25 -7 -3 13 35 -11 2 32 36 2 -16 3 15 -20 -49 -24 -13 -47 -58 -28 10 -8
6021 -8 -17 5 42 25 13 29 40 34 1 -7 28 39 4 -12 13 18 -10 -22 -6 -6 -43 -51 -42 -33 -39 -51 -35 -8 5 -15 9 37 40 9 8 27
6057 27 40 9 7 24 30 2 -4 17 26 7 -17 -4 -1 -13 -39 -30 -14 -16 -31 -21 12 17 6 13 31 30 20 2 24 23 -4 -20 -3 11 4 -14
6093 -14 5 18 -10 -24 -25 6 -21 -40 -35 -2 -8 -18 -4 25 22 14 14 33 43 5 -10 27 17 1 -15 7 21 -12 -16 -1 17 -1 -34 -28
6127b8J7oj3J0K6oj3RJ5J0j0jJ4Kk2mK4nj9j2K5J0qk1J2J1j6j7J6Nrk1J6J2Nk2
6163a4QK6jk2lJ8Nj8j8L6pj5k7K4J8j6j4OK4pk4kK7pk3J8L6j2k1%L1Jk5j6L0M
6199B0j4k1K3K2k8j4J3Nlk4J1K5j2j6oL0Lk6j4L6nj1lK8mj5j5J9J5j6j7K2K3k0
6233A1k9RK7Jl6J2J6J1k1pK2J3l4j5K8qj1j3J6J8k3j5J9K0j2k7J6K3rj5kK5mj8
6267a2J8J9J0k7%K1J1l2j4J3Mj2j9MK8nk2KK6nk7MJ9%j8NJ5J7j3mJ7J7k8qjK6
6303B9l2j0J0oj5pJ1J5Lk3J1K3Ql0JK6Pj6j2K9J4j3nK5K1k5k7J1Pk4k7NR%l8J7
6339b8K9j3j2JJ9J1k3KJ0J4j7NK8K1j6nJ4J2j4k6KRj1l6KJ3j0lLK1Nk3QJ2J3p
6375A0k1K1Lrj0K6L1j7oKJ6j9k6j4J0km0OJ8Pj6lL2J5l1PK0joj4J6J1MrJ5K8j6
$$ plain form
6127 -28 -11 -17 -30 -20 6 0 -13 -4 11 21 11 10 24 26 4 0 24 19 0 -12 13 23 15 -6 6 17 1 -16 0 5 -4 -25 -9 3 8 -14
6163 -14 -6 20 19 -3 -6 12 17 -1 -19 17 10 -5 -32 -8 10 -6 -20 -14 10 3 -21 -23 4 -3 -26 -8 28 16 -5 -5 26 27 2 -14 16 20
6199 20 6 -15 8 30 2 -12 1 6 3 -21 -10 15 3 -13 -19 11 14 -12 -26 10 5 -6 -9 19 15 0 -15 4 19 3 -14 8 31 11
6233 11 -18 -9 18 19 -17 -5 11 22 1 -6 16 29 -5 -20 8 0 -11 -24 -8 10 -13 -28 -9 11 -1 -28 -12 11 2 -13 -15 10 6 -12
6267 -12 6 25 35 8 8 29 40 8 -6 7 11 -1 -20 -16 12 7 -15 -13 13 8 -19 -15 4 4 -14 -9 6 23 10 6 23 40 12 4 3 29
6303 29 -3 -13 -3 -9 -24 -31 -20 -5 -2 -25 -14 9 17 -13 -12 14 21 5 -7 22 36 23 18 43 64 39 12 23 30 6 -21 -16 -7 -7 -45 -28
6339 -28 1 -12 -24 -23 -4 7 -16 -14 -4 10 -7 -2 26 47 31 26 40 52 38 12 14 23 12 -24 -22 -9 -19 -22 -19 2 7 -16 -8 4 17 10
6375 10 -11 10 13 4 -6 20 51 34 28 30 46 27 1 -13 -3 -5 -45 -39 -21 -14 -30 -33 -1 14 -17 -10 10 9 3 -11 5 16 20 11 26 54 38
6412C8j3RJ1k3k2rJnj1j1K0Jj5kJ7J5nokJ6rj7J7K0njJ7K2oj0j2PJk5k0J1Jj6
6450b1oJ0RNj0J5K2k3lKJ6j0ojJ9LJqK3lj1j0njok9PJ4pj4MJ9MkKMQj5NJ0jqJ2
6493A4J1Nj6MKLoqKqnj7Nj5%J6qMJ5j0J5j5J7no%OjnJ9mJ0NrrqJOjQj4MnJpRR
6540IkOqMkj4LPMrmJ0KoJJ3rnrJ0omLjjjNJ4j0Rk3J7JMqRJ3j6%PKJjj3KQj0pO
6589AjLolP%j0L%KMlJ2j9L%RPj9J2NMqrJ3KjnONnj1J4Oj2jjLOrQMj2qJ1oPj3M
6638aJ2k0LjJ4mj3lJ2J0j1jKkMpQnLlQ%nMJklm%J2Nj9QjK0j4pkRj3kJ7j2onJ3
6684aMkj1QPrnlMj1NJ3LPj4RJ7MlpmpQokRj0nJ0Lj5jRMj1jkmJ0qJJ0Oj1NMOJj2
6733BJ3rpj5J0J4j6rPmJ7qMpJ2j2NJ5rl%K0Klj2J1JoKj4J4j2k0J2Nj1j3J3MKq
$$ plain form
6412 38 25 34 45 22 0 -9 -8 -13 -24 -35 -15 -14 -29 -31 -14 1 -4 -10 -12 4 -5 -22 -5 15 10 9 26 48 42 32 20 27 28 3 -17 -6 -5 -21
6450 -21 -27 -17 -8 -3 -13 2 24 1 -2 0 16 6 0 -1 18 21 22 14 37 34 23 13 8 7 1 -28 -21 -7 -14 -28 -24 -5 -1 -3 -1 3 11 -4 1 11 10 2 14
6493 14 25 30 14 18 20 23 17 9 11 3 -2 -19 -14 -29 -29 -13 -21 -17 -2 -12 3 -12 5 0 -6 -6 0 -1 -6 13 9 19 24 15 6 -2 -1 5 4 12 -2 2 -3 -2 -9 0 9
6540 9 7 13 5 9 7 -7 -4 3 7 -2 -6 4 6 0 1 14 5 0 -9 1 -5 -9 -6 -7 -8 -9 -4 10 0 9 -14 3 4 8 0 9 22 6 6 13 15 16 15 2 4 12 2 -5 1
6589 1 0 3 -3 -6 1 1 -9 -6 -6 -4 0 -3 9 -10 -7 -7 2 9 -10 2 7 11 3 -6 7 9 8 3 9 14 9 -2 12 18 6 5 4 7 13 4 12 16 4 -4 7 1 8 -5 -1
6638 -1 11 -9 -6 -7 7 3 -10 -13 -1 9 -2 -3 -1 -3 1 -6 2 -3 0 -3 5 5 0 4 5 3 0 -4 -4 8 13 -6 2 1 21 7 0 -2 7 -6 -8 9 -3 -9 -14 -1
6684 -1 3 1 -10 -2 5 -4 -9 -12 -8 -19 -14 -1 2 9 -5 4 21 25 22 15 11 4 12 6 4 13 3 -2 8 11 -4 -5 4 8 -3 -4 -6 -10 0 -8 -7 3 9 -2 3 7 13 14 2
6733 2 15 6 -1 -16 -6 8 -8 -17 -10 -14 3 -5 -1 -8 4 -8 -3 12 3 0 0 20 22 19 7 18 19 13 15 1 15 3 -17 -5 0 -11 -24 -11 -7 -5 -13
6774a3mK2j4m%J2J2qlJ1J0jrJ0Qpj3lJ0j0j7PJ1kk0J7M%j3nJJ6lj1J3%%j0J4J8
6814B6mj0JLlj3kNpj7J3OMj3LK1j1LrJ0J0j3j2J5J9pj6RK0kj8MOmk4lJ5pj3kN
6855a2J2kq%QlpkJ5onJ7PKmmJ8lmm%nj0mJ9mknrRMj2N%j2LpK4j0kPMRp%Rjj8P
6904GMlj4MJ%rkQJ1nnMRj1OJJ7k4J1J3PKk7J7mRk6mOOj0j8J2LjlkPn%lK6k3KP
6950AJ0Nj3%J4Kj5MJ1Rk1rJ6j0j1KORLj1Kl%j2MJ2J4k5lK2lrlJ4Jqj0J1Plj1j
6992bJ5j6j4J4QnqPJ4kj0OOMj8nK2pmOMJ0k5NRKj2ojK%j7J7Njj4MMQj7PJ5llk0
7037a6K2Rj7JJ4jmj2QPlnJ2Mrj2mJ6%j1LJ0oqlJ0Oj6rQJ3kj7mK1rrJ7%Oj3OkJ0
7081A1j9JJ9oj1QJ2Nmk0J1Pj4j0J3KMj1%MLj1jK0pqnONj8lK4%nKQnrlOOMk5JK1
$$ plain form
6774 -13 -17 5 -9 -13 -13 -1 11 3 0 11 21 20 11 21 29 22 9 6 16 6 -11 -4 7 5 -15 2 6 6 -7 -12 -11 5 2 -9 4 4 4 -6 8 26
6814 26 22 12 13 16 13 0 -2 3 -4 -21 -8 -2 2 -11 -8 13 2 5 -4 6 16 3 -9 6 25 18 2 11 31 29 11 15 21 17 -7 -10 5 -2 -15 -17 -12
6855 -12 0 -2 -10 -10 -2 -5 -12 -14 1 -5 -10 7 14 16 12 8 26 23 19 15 15 10 0 -4 15 11 9 4 -5 4 8 -4 1 1 -11 -8 -15 9 -1 -3 4 8 17 10 10 19 18 0 7
6904 7 11 8 -6 -2 -1 -1 -10 -12 -4 7 2 -3 1 10 -1 5 6 23 -1 10 23 30 32 5 22 18 27 1 -3 3 9 -1 -19 -7 -4 -5 -8 -10 -3 -8 -8 -11 15 -8 -6 1
6950 1 11 16 3 3 17 19 4 8 19 28 7 -2 14 4 -7 -5 1 10 13 2 4 1 1 -11 -7 5 19 -6 -9 13 10 1 -2 12 13 5 -5 6 13 10 -1 -2
6992 -2 13 -3 -17 -3 5 0 -8 -1 13 11 1 7 13 17 -1 -6 16 9 5 11 15 25 0 5 14 16 4 -2 -3 -1 -1 -18 -1 4 3 -11 -7 -3 5 -12 -5 10 7 4 -16
7037 -16 6 15 -2 -1 13 12 8 -4 4 11 8 3 15 19 10 -2 -6 10 10 -1 2 12 6 -2 -5 5 11 -5 -14 -6 7 5 -12 -16 5 -4 -13 4 4 10 -3 3 1 11
7081 11 -8 -7 12 6 -5 3 15 20 16 -4 7 14 0 -10 3 5 9 -2 -2 2 5 -6 -7 13 6 -2 -7 -1 4 -14 -17 7 7 2 4 12 7 -2 -5 1 7 11 -14 -13 8
7126Hj3joK6kk2J6J9mj5mJ2Qj5j8L3mkrnJ7j3k8J3K0j7j7nK2Nk0qK2nNjJ3Ppj7
7166a2K2Oj1pQKNj5OJ1mrj5K4j0k1oK7j1pnK2J1j0nRJ9j5j6J3Oj9nMJ9j0%rJ5
7205GOk8qJ8jj1oNJ2jmJ9J2j1pJ1J6j4j8J2J3kk0KJ4jpj0NKj0k9J4Qj0JkK3j4
7244a4NkJ7Rj6KJ9qql%J2j5jJ7Pj4jmJQk8J4kkj8J6J3pnKJ8j0MmJ5qj7LJ2Rk1
7286eKRjok2K6rppQJ1oqRK%J6mK9rk4J0MolmOJ6nk3J7rqj3LJ1j6rOJ4Jj3jK1j1
7331hQnJ7Qj1nJ0Oj6nMJ3j7jNQlj6kJ7j3oNJJ1j1KRQj1JL%mj3J2Rrj0LJ3qqlJ6
7376Dj1rQQQk8J4J2Jj6MJ3jPk1QQllpK0j3j2J2Rr%KqJ2j4pOJ7j1qqK2qj1J2Lk
7419@rJQRj2NJkLoNLpKNKqjMJ5j1pJ2KMk2NRj4%mRmJj0J9mkklJ4j1j5K2JlM%J1
$$ plain form
7126 8 -5 -6 -12 14 12 -10 6 25 21 6 2 14 22 7 -11 22 18 16 7 2 19 6 -22 -9 11 -6 -23 -28 -6 -1 -21 -29 -7 -12 -7 -8 5 12 5 -12
7166 -12 10 16 5 -2 6 8 13 -2 4 15 11 2 -13 11 1 -20 -26 1 -10 -17 -22 0 11 1 -4 5 24 9 -7 6 12 -7 -12 -8 11 1 1 -8 7
7205 7 13 -15 -23 -5 -6 -17 -23 -18 -6 -7 -11 8 20 9 2 13 29 15 -3 9 22 20 0 2 16 15 8 -2 3 5 -5 -34 -20 -12 -22 -21 -23 0 -14
7244 -14 -9 -11 6 15 -1 1 20 12 4 1 1 13 -2 -3 14 21 7 6 2 3 11 -17 -3 -5 -7 -25 -9 4 -3 -8 -6 12 2 6 2 17 9 -8 -5 7 16 -5
7286 -5 -3 6 5 -1 -23 3 -6 -13 -20 -12 -1 -7 -15 -6 -4 -4 12 8 37 28 4 14 18 12 9 5 11 27 22 -1 16 7 -1 -14 -11 0 -16 -25 -19 -5 -4 -17 -18 3 -8
7331 -8 0 -5 12 20 9 4 14 20 4 -1 3 16 -1 -2 3 11 8 -8 -10 7 -6 -12 -7 -6 5 -6 -4 5 13 2 3 6 6 2 -11 1 10 1 -9 -6 7 -1 -9 -12 4
7376 4 -7 -16 -8 0 8 -20 -6 6 7 -9 -5 8 7 14 -7 1 9 6 3 -4 16 3 -9 3 12 3 3 5 -3 9 -5 -12 -6 11 0 -8 -16 6 -2 -13 -1 2 0
7419 0 -9 -8 0 9 -3 2 3 1 4 -2 3 6 -1 1 6 8 0 -1 3 18 7 0 12 14 18 -4 1 10 -4 -4 -8 1 -3 -2 -12 7 3 1 -1 -4 10 -1 -16 6 7 4 8 8 19
7468A9j4mJ0Lnj0MNKMj2J4mjj1J3Lk2LQnPMn%KkJ6j1qm%J0j4j0jJ8nolJ2jkmR
7513BNk0PMOkj6QL9k1mQJmj5rJ7joqPlj0QPlj3JNJ0j3kJ6NJlNRonqK3j2poNom
7561hk%J0mLKp%j2K6nj4J5mQkqKJ5j1LoPmj1j1J3lpJmJ1l%J1KJrJJ8k%kJ2nko
7608IRNj7%jqj4JOPlpjJ5jpLOl%lJ7qrmJ9%mMJ0Mj2j4J3j1nrRJ0j0mJ0NnnJ4q
7655CKkJRrJkK1j8RqLJ2k0Kj2KJoj1J4%%J0kOj1mJ5L%klONj1J8ppJOOmj3%oj4
7702a6nJ3QMj4jJ5Kj4jJ4%j3jPJ1j4J4OMkqlj%j3O%Qj9QJ0Kk1J0K2j1mqJ7Qj7
7744CnJ1Npk%kmJJljqNL%j1LPOqKORjkJ1MrlPjJj9NJ9qlrJ3Jj5pNLooJ5Jrj0O
7796fJ0j4%OPnmJ3j2MrMNPrqK6nqPkJpMj1K5j1oRNqoNoJ0j6j%J4j2nKJ3j7PKJ1
$$ plain form
7468 19 5 1 11 14 9 -1 3 8 10 14 2 16 12 11 0 13 16 -6 -3 5 0 7 11 6 6 8 6 22 11 3 -1 -1 9 -5 -15 -16 2 -3 -9 -12 0 -1 -3 -7 2
7513 2 7 -13 -6 -2 4 2 -14 -6 33 12 8 16 17 13 -2 -11 6 5 -1 -9 -2 -5 -15 -7 0 -3 -16 -15 -10 0 -13 -15 1 6 7 4 9 18 12 7 -1 22 10 3 -3 2 -4 -8
7561 -8 -10 -10 0 -4 -1 1 -6 -6 -18 8 3 -11 4 0 8 6 -2 0 15 4 7 1 8 4 -7 -18 -5 -8 -15 -14 -18 -7 -10 -10 1 3 4 -5 -4 14 12 12 10 22 17 15 9
7608 9 18 23 6 6 5 -3 -17 -16 -10 -3 -6 -13 -14 1 0 -7 -4 2 -1 -1 -4 13 5 -4 -8 11 11 7 11 21 25 13 -1 12 1 -4 -13 -4 6 -4 -8 2 7 2 -3 11 3
7655 3 5 3 4 13 4 5 3 24 6 15 7 10 22 2 4 -8 -6 -5 -11 -22 -8 -8 -8 2 0 6 -5 -9 6 9 9 7 4 10 15 4 22 15 8 9 15 21 17 4 4 -2 -16
7702 -16 -21 -8 0 4 -10 -11 4 6 -8 -9 5 5 -8 -9 -2 9 -5 9 15 19 17 9 6 5 5 -8 -2 -2 6 -13 -5 5 7 -14 -4 18 7 3 -5 12 20 3
7744 3 -2 9 14 7 5 5 3 -1 0 1 -2 -3 -11 -6 -3 -3 -14 -11 -4 2 -6 -4 2 11 10 8 19 23 14 11 18 17 18 -1 4 23 15 12 3 16 17 2 -5 0 3 -3 -9 6 7 -2 -12 -6
7796 -6 4 -10 -10 -4 3 -2 -6 7 -5 -1 -10 -6 -1 6 -3 -11 15 10 2 9 7 8 1 5 -6 19 8 2 11 16 8 2 7 1 11 -5 -6 -6 8 -4 -9 -7 6 -11 -4 -2 9
7843IroJJ1JrRLkj0nJ7Nj4mJ6Mk1J1OmkqKR%j1OJLj5OJ0Jj0rOJrNK2rj0rJ5kj2
7890a0lJJ3npKJ0J5j2LQ%j4KJ1Jj0KJ%jqJ9%j2j2J2Nmk7PJ9nj7J4Qmj1LJ0J7j9
7932BMQmj0LKPLj2J1Nj9M%Qj1j0QJ0rjLJ7jj2J0jlklOQrqLnjmONopmPkoqJ6Rq
7982aMO%loJ6J7k0lNk%j1%J8mk1LPNk1NNkj0lKJ1kJ0J0j4J2j3MJ2pj2kJ9j0%q
8025dJ4m%mLJnqQPnqMJ2j1LNJ1j1NkKrqpJ0%Mj2J5Lj4kmJ5j0pOJ2j9OORoJNRj
8073A5j0J2ljj4mOPjrJ3prOlJKqpLLoPJ6r%LJ0j2%lKKrNmOpqJ1J5jnj2POj0kQ
8122BJ6q%nkM%kJ1j3Pj8J1nj0%RmrRj0PoKMJnJ4j1J6j1QL%oMJ2j2k%Pmj1RRj1
8168@JknJ0ooPRpoNjkMrlQj4JJ6nNK
$$ plain form
7843 9 0 -6 -5 6 7 -2 7 10 8 -2 -7 10 15 1 -3 13 17 -4 7 13 9 7 -1 1 10 10 -1 5 6 9 -6 0 10 11 1 -8 -2 -1 -10 -5 17 8 -2 -11 4 2 -10
7890 -10 -13 -12 1 -4 -11 -9 1 16 4 7 15 15 1 3 14 15 5 7 8 8 7 -1 18 18 6 -6 6 11 7 -20 -13 6 1 -16 -2 6 2 -9 -6 4 21 2
7932 2 6 14 10 0 3 5 12 15 3 14 19 0 4 4 12 1 -9 -1 9 0 -1 2 19 18 6 16 15 12 10 7 13 21 12 4 7 2 1 -3 3 8 2 -5 -9 -2 -4 -10 -18 -2 7 -1
7982 -1 3 9 9 6 0 16 33 13 10 15 13 13 2 2 20 16 -5 -2 5 10 -11 -6 -1 -3 -13 -16 -14 -3 -5 5 15 1 13 0 4 16 9 -3 -5 14 4 4 -4
8025 -4 10 6 6 2 5 6 1 -7 1 8 3 -5 -1 11 0 3 8 19 8 13 11 13 4 -4 -11 -1 -1 3 -9 6 9 -5 -7 -11 4 -6 -13 -7 5 -14 -8 -2 7 1 2 7 16 15
8073 15 5 17 14 13 -1 -5 1 8 7 -2 11 4 -5 1 -2 -1 1 -7 -14 -11 -8 -14 -7 9 0 0 3 13 1 1 -2 0 2 -7 -2 -6 0 -7 -15 -4 11 10 5 -7 0 6 -4 -6 2
8122 2 18 10 10 5 3 7 7 5 16 3 10 -8 3 -2 -12 -12 -3 -7 -16 -7 -17 -10 -16 -14 -10 -9 -14 0 -11 5 -6 2 5 5 -1 3 15 3 1 1 8 4 -7 2 11 0
8168 0 1 -1 -6 4 -2 -8 -1 8 1 -5 0 -1 -3 1 -8 -11 -3 -17 -16 0 -5 0 2
8191B
$$ Imaginary data points
##PAGE= N=2
##DATA TABLE= (X++(I..I)), XYDATA
0@%%%%%%%%%%%%%qJ6j6J6j6K4l2L2m0M8n6O5p3Q8j04J20j37J61j84K08k40K72
35A44l04L37l78M26m74N28n89O54p24Q01q85R76j078J189j310J444j589J751j932
54a013K134k361K616k909L249l648M123m699N419o348P594r368J2116j6980K8178
69A8103j01640m0036J33303n3058n3157O1677J29830j4798q5223L948R2283j1312
81G9920j01247l0023Q2905K4976p1470k8565Q4694N2734n6322n2319N0530M2532
93G8345o5806q3911J9831M8038l9997p1181K6686Q1363O106n1020K1262Q3753
105E3469J6160o3664j6635N7306J4076o8445l5419N2548L7654m4482l3851N1910
117B0627N2629l5123n2122K3328M1165l8114p0431K633M6434j3899n5324Q632
$$ plain form
0 0 0 0 0 0 0 0 0 0 0 0 0 0 0 -8 8 -8 8 -8 16 -16 16 -24 24 -32 33 -40 48 -56 64 -73 88 -96 112 -128 144
35 144 -160 177 -201 225 -249 279 -310 344 -380 421 -464 512 -566 623 -687 757 -832 919 -1013
54 -1013 1121 -1240 1376 -1533 1716 -1932 2191 -2508 2911 -3437 4157 -5211 6905 -10075 18103
69 18103 -83537 -123573 9730 -43328 -96485 -34808 95022 80224 -4999 -1051 91232 79920
81 79920 -21327 -51350 31555 56531 -14939 -43504 41190 93924 37602 -14717 35813 78345
93 78345 12539 -71372 -51541 -3503 -43500 -114681 -87995 -6632 -526 -51546 -30284 53469
105 53469 69629 5965 -10670 46636 60712 -7733 -43152 9396 47050 2568 -31283 20627
117 20627 73256 38133 -13989 9339 50504 12390 -58041 -55408 -8974 -22873 -78197 -69565
129f9565O6578J8678l9867L87O0266K2655m7795k6914L8649K2410m5298l6262
141c6078L4695L9263k5074l4091K9490M5521j8645m7521O309L5415j8350n5637
153d4703o722L9589K854m0719k649N1292K4338l0358j1466M1604K4783l4852l0384
166a7393K5178K5983k8515l4215K1872L7706j3017l2816J4673L8131q474m0998
178a1885l289L0156m722m2229j0747L3075J1527k9336q804L6824K3917k2241j6738
191a4492K6564K3166k3405k8237J5488K4892j6471k8795J2501L1543n485k8338
203a1069M978L0231k132l3514p171K5404K756l1490j1471K7404J5024k2095j2177
216b5322K7227K2320j8082j9423J8361K1944j6853k6169J0460K4247r584k6189
$$ plain form
129 -69565 -2987 15691 -24176 -23789 36477 59132 11337 -15577 23072 45482 184 -36078
141 -36078 -1383 37880 12806 -21285 8205 53726 35081 -12440 -6131 29284 10934 -44703
153 -44703 -51425 -11836 -8982 -49701 -52350 -1058 23280 -7078 -18544 23060 47843 12991 -17393
166 -17393 7785 33768 5253 -28962 -7090 30616 17599 -15217 -544 37587 29113 -11885
178 -11885 -15174 14982 10260 -31969 -42716 -9641 1886 -27450 -36254 570 24487 2246 -14492
191 -14492 12072 35238 11833 -16404 -916 23976 7505 -21290 -8789 22754 17269 -11069
203 -11069 -6091 24140 22008 -11506 -18677 6727 9483 -22007 -33478 -6074 8950 -13145 -25322
216 -25322 1905 24225 6143 -13280 5081 27025 10172 -15997 -5537 18710 9126 -17063
228a7063O695K7980j623k6203m78K5851K344k7866r130K2644Q178k4360j2758
241b5789K2504J6757j7519j5216J9379K1134j3673k0763J1764K1780j0230k4576
253a4448N415K3498l568k4282N49K4649L121k3634n726K2715P973k2438j1714
266a7890J9717J3175j8440j5496J6637J8114j3253j8478J1944K0659q604k0989
278a2904N989K1233l670k1961K28K1048J620k1249m716J9992O824j8847q801J8043
292B829J1691j5475j2497J4741J4927j2392j6203R989J6563q722j8397N478J8313
305A0845l531j8597J551J9117J152j8564l378J7523M674j7788p888J5810R285
318A0211j4406j0064J4669J3771j0540j2576J0735J4885q538j6383M908J4726
$$ plain form
228 -17063 -10368 17612 15989 -10214 -10692 15159 17503 -10363 -19493 3151 11329 -13031 -25789
241 -25789 -3285 13472 -4047 -19263 116 21250 7577 -13186 -1422 20358 10128 -14448
253 -14448 -9033 14465 10897 -13385 -12836 11813 14934 -8700 -14426 8289 16262 -6176 -17890
266 -17890 1827 15002 -3438 -18934 -2297 15817 2564 -15914 -3970 16689 8085 -12904
278 -12904 -6915 14318 10648 -11313 -11085 9963 11583 -9666 -14382 5610 12434 -6413 -15214 2829
292 2829 14520 -955 -13452 1289 16216 3824 -12379 -2390 14173 5451 -12946 -7468 10845
305 10845 7314 -11283 -9732 9385 10537 -8027 -11405 6118 10792 -6996 -14884 926 10211
318 10211 -4195 -14259 410 14181 3641 -8935 1800 16685 8147 -8236 -3328 11398
330A1398n441j7464J520J6293Q0j5672j099J6373M062j5108n897J3574O283j4094
344e192r233J1995J0408r706r616J1041J3925o196j1900O499J3171n555j5516
357e875J053J2328k649j5130r13J4117K750j2714k813J3694N413j2524p117J0572
371A92O796j1091r130R627J0824o503q680Q769J3072m156j1256L679J0938m338
385H743j4345r07J0434j036j2719j464J2577L933j0342l349J1397N410j0755p501
399i924Q514O874q901q363Q499J1034m411q071P138J2214l428j1615J575R698
413A0833l730j4087j990J0249N62j1552j959J2441N232r717m512J0331N983j0197
427b113q473P595P986p200q474P834J2118k832q565N317J1710k637j2360q70Q862
$$ plain form
330 11398 5957 -11507 -9987 6306 6386 -9286 -10385 5988 10050 -5058 -10955 2619 8902 -5192
344 -5192 -14425 -2430 7978 -1728 -11344 -303 13622 7426 -4474 2025 15196 9641 -5875
357 -5875 -4822 7506 4857 -10273 -11186 2931 5681 -7033 -9846 3848 9261 -3263 -10380 192
371 192 6988 -4103 -13233 -3606 7218 715 -7965 804 13876 9720 -1536 2143 13081 8743
385 8743 -5602 -6509 3925 2889 -9830 -11294 1283 5216 -5126 -8475 2922 8332 -2423 -9924
399 -9924 -1410 5464 -3437 -11800 -3301 7733 3322 -4749 2389 14603 11175 -440 1135 10833
413 10833 7103 -6984 -8974 1275 1837 -9715 -11674 767 5999 -3718 -8230 2101 8084 -2113
427 -2113 -10586 -2991 4995 -2205 -10679 -2845 9273 6441 -2124 3193 14903 12266 -94 -964 7898
442G898k218j3476l358J0085K833j0019l028J1463O625q478o143Q397O885q631
456a165r417O132R240m973q553O322J2612j075r153K813J1057j502j2913l086
470c661Q396l98j2617m461R987N014q577m268J0420P861p548p667O687P627p086
485b91r935M745J0191k692q493M558J2563M90r516K21R902k32j2571n034P597
500A503J773j0949n511R302O973o955n594Q655Q694o227r008M691Q461n066j0267
515i525L291J1059m94q582K525J2218J856r937k301Q923J233j1983o531P148L904
530B804r144o319Q341Q399n376o786O587R045m733r642K756Q752k767r758J672
545f169J0918J512q174L44J0897K917r552m352P442K579j0474p438O357N685p179
$$ plain form
442 7898 5680 -7796 -11154 -1069 1764 -8255 -11283 180 6805 -1673 -7816 581 7466 -1165
456 -1165 -10582 -4450 4790 -183 -8736 -2414 10198 9123 -30 2783 13840 12338 -575 -3661
470 -3661 4735 4337 -8280 -12741 -2754 2260 -6317 -10585 -165 7696 148 -7519 -832 6795 -291
485 -291 -10226 -5481 4710 2018 -6475 -1917 10646 11136 1620 1841 11743 11511 -1060 -6094 1503
500 1503 3276 -7673 -13184 -3882 3091 -3864 -9458 -803 7891 1664 -7344 -2653 5808 742 -9525
515 -9525 -6234 4825 4331 -4251 -1726 10492 12348 2411 110 9033 10266 -1717 -8248 -1100 2804
530 2804 -6340 -12659 -4318 4081 -1295 -8081 -1494 7551 2818 -6824 -4068 4684 1917 -7841 -6169
545 -6169 4749 6261 -1913 -1569 9328 12245 2693 -1659 5783 8362 -2112 -9550 -3193 2492 -4687
560d687o842P162R253m029p715M684R249l350j0171J247R310r17r588L53J0984
575D943L001q224j675R878L919r403o191O537M123r080q180N703P338n273p507
590a0091N573R874k518q623K542R327j577j0148n02R349J320q927j517J0261M636
605H979p795l935Q410N207q465p724N330N894p094q914M565Q825l329q379L636
620d789J0282r38r341L61R411M32r958k289R208L391q294l488R086O008o990n937
636c845O650O459o704q679L813P264m569r074K709R289j085q538J144R776R72
651E582r007j832Q667K552q773m039Q097N162p041n333P243P083n708p371M783
666F5P510m602r129K299Q312k152r154Q20R370P74q570j143R019K770q304l733
$$ plain form
560 -4687 -11529 -4367 4886 857 -6858 -2174 7075 3725 -6446 -5199 4111 3194 -6394 -6041 4943
575 4943 7944 -280 -1955 7923 11842 2439 -3752 2785 6908 -2172 -10352 -4649 2689 -2584 -10091
590 -10091 -4518 5356 2838 -5785 -3243 6084 4507 -5641 -6143 3206 4526 -4401 -5918 4343 8979
605 8979 1184 -2751 5659 10866 2401 -5323 7 5901 -1193 -10107 -5542 3283 -46 -8425 -4789
620 -4789 5493 4555 -4786 -4425 4986 5418 -4540 -6829 2379 5770 -2524 -6012 3074 9082 2092 -3845
636 -3845 2805 9264 2560 -6119 -2306 4958 389 -8685 -5976 3313 2228 -6310 -5166 4610 5582
651 5582 -3425 -5257 3410 5962 -2811 -6850 1247 6409 -632 -5965 1278 8361 2653 -4718 65
666 65 7575 2973 -6156 -3857 4455 2303 -6851 -6031 3339 4113 -4457 -5600 3419 6189 -2115 -5848
682e848P731M486p347n544O539O388n506o746M912P607l753p979K619Q041j963
697C637q656M93Q309K81q352j332Q285K551p697l225P537M345o830n052O227N794
713F315n566o556M599O914l918p589K801P741j943p935J045Q187K10p821r30P886
729C440K011p534k979O968L661o609m519N983N310n104n672M562O336l775o937
744d858K534O678k339p550Q47P297l2p075l14P719K080o608k164O819L215o495
760b46m290N478M441n389n363M651O062l620o098L173O606k485p315Q55O512j059
776A913p486m91P111J577o237j311P261L519n602l338N675M031n464n327M000
791a69N010l916n793L193O399j948o198J475O385j114p157q66N891L77o721j706
$$ plain form
682 -5848 1883 6369 -978 -6522 17 6405 899 -5847 -935 6672 2919 -5060 -2441 5600 3637
697 3637 -5019 -4526 3783 4064 -4288 -5620 2665 5216 -2481 -5706 1831 6176 -654 -5706 521 6315
713 6315 749 -5807 -1208 5706 1788 -5801 -3000 4741 2798 -5137 -4092 4095 4305 -3516 -4446 3440
729 3440 5451 -2083 -5062 1906 5567 -1042 -5561 422 5732 628 -5044 -482 5854 2079 -4858
744 -4858 -2324 4354 2015 -5535 -4688 2609 2577 -4498 -4812 2907 4987 -1621 -3785 3034 6249 -246
760 -246 -4536 942 5383 -6 -5369 -718 5344 1724 -4374 -1201 5405 2920 -4395 -3540 2972 1913
776 1913 -5573 -6064 1047 2624 -3613 -4924 2337 5856 254 -3084 2591 6622 1158 -4169 -169
791 -169 4841 925 -4868 -1675 4724 2776 -3422 -1947 4438 3324 -3833 -4699 1192 1569 -5152 -6858
807f858O560L149n072k200O425M548m570m329M317M514m428o031K675N477k576
822A601n959K007O585o45o211M1N973J0o922k166N292J672n776k516N914M346
838C246l764k957N211N109l422n050K669M654l097o193J240N553r86n617O49O192
854C437O71n784j450N136J088o205l220M511K870m509l084N040N228k587l624
869b482L878N325k442n546J281M697j848o057J11N445L77n179n54N568J636n160
885i50k593M122K000n091l801L531L701l009l335L801N423j304l833K245M935
900E842j330n365r9M264n68n325q15M856J429m340j453M591K206m385l208L157
916e43K506l940l849K829M096j897l335K887N180o50l902J100M363p14m994q37
$$ plain form
807 -6858 -298 2851 -2221 -4421 2004 6552 1982 -2347 1970 6484 2056 -3975 -1300 4177 1601
822 1601 -4358 -2351 4234 3589 -2622 -2581 3392 3402 -3520 -5686 -394 1278 -4498 -7014 -1100 3246
838 3246 -518 -3475 1736 6845 3423 -1627 1042 5696 2599 -3594 -2354 3199 2213 -3404 -2755 3437
854 3437 4108 -1676 -3126 2010 3098 -3107 -6327 -1816 1054 -3455 -6539 -1499 3729 1142 -2482
869 -2482 1396 6721 4279 -1267 14 4711 2863 -3194 -3083 2362 2739 -2440 -2994 2574 4210 -950
885 -950 -3543 579 2579 -2512 -6313 -2782 919 -2090 -5425 -1624 3799 2495 -1338 907 5842
900 5842 4512 -853 -952 3312 2744 -2581 -3396 1460 2889 -1451 -2904 1687 3893 -492 -3700 -543
916 -543 1963 -1977 -5826 -2997 1099 -798 -4133 -1246 3934 3284 -618 482 4845 4131 -863 -1700
932a700L862K86m551j263M273J962l608j973L624K383l581l399K329K791k804
947a369l581K186M115r45l177J891M618j65l811J40L783j59m476j269L525R26
963B232l848j556L726K232l145k334K961K543l007l414J982L028k039l394J770
978b263M076n08l201J154M170Ml763m55L416L04m029j454L247J416l276j781L202
995B59K383k702k542K371K642k379l315J638L187j381l275J326L916k36l297M92
1011i13L802K13l765q40L310P39l724j611L215J808l045k086K951K598k520k845
1027b713K148K965j972l361J420L476r63l433P96L834ol524j90L629O42l634j263
1044b149L250J377l300j997K941K270k688k544K444K937k015l092J703L354j269
$$ plain form
932 -1700 2162 2448 -2103 -3366 907 2869 -739 -2712 912 3295 -286 -3685 -1356 1435 -1369
947 -1369 -4950 -2764 1351 406 -2771 -880 3738 3573 -238 -98 3685 3526 -950 -2219 1306 2232
963 2232 -1616 -3172 554 2786 -359 -2693 268 2811 -196 -3610 -1628 1400 -639 -4033 -2263
978 -2263 1813 1305 -1896 -742 3428 3432 -331 -786 2630 2934 -1095 -2549 698 2114 -1162 -2943 259
995 259 2642 -60 -2602 -231 2411 32 -3283 -1645 1542 161 -3114 -1788 2128 1892 -1405 -913
1011 -913 2889 3102 -663 -1503 1807 2546 -1178 -2789 426 2234 -811 -2897 54 2652 132 -2713
1027 -2713 -565 2400 428 -2933 -1513 1963 1000 -2433 -1637 2197 2191 -1333 -1523 2106 2748 -886 -2149
1044 -2149 1101 2478 -822 -2819 122 2392 -296 -2840 -396 2541 526 -2566 -863 2491 1222
1059A222l493Q91L623m83l674K0L651L71l652q58L538J259l384j661L206K038
1075B614k954k433K613K675k343k972J971L282j423l239J278L629o06l568K41
1090a235L481k2l782q23L290Q59l444j416L298J935k827j984K864K535k435k820
1106b526K037K933j837l244J470L560p78l278Q17L791r7l691m69L293L04l944
1122a659j499L107J376l238j753L237K592k379k302K571K948k079l255J471L188
1137B326j291l448R84L842l1l277J90L721M69l733j375K874P77l808k189K759
1153a210K074k643k101K922L246j729k702J969L242j562l639Q19L406o27l490
1168b025M57M025O86l251m84L558Q48l820k178K490J201l573k621K527K744k001
$$ plain form
1059 1222 -2271 -1380 2243 1760 -1914 -1894 1757 2128 -1524 -2382 1156 2415 -969 -2630 576 2614
1075 2614 -340 -2773 -160 2515 172 -2800 -829 2453 1030 -2209 -931 2698 2092 -1476 -1235
1090 -1235 2246 2224 -1558 -2381 909 1768 -1676 -3092 206 2141 -686 -2670 194 2729 294 -2526
1106 -2526 -489 2444 607 -2637 -1167 2393 1615 -1663 -846 2945 2848 -843 -1312 1981 2285 -1659
1122 -1659 -3158 -51 1325 -1913 -3666 -429 2163 -216 -2518 53 3001 922 -2333 -862 2326
1137 2326 1035 -2413 -1429 2413 2382 -895 -705 3016 3485 -248 -1623 1251 2028 -1780 -3969 -1210
1153 -1210 864 -1779 -3880 -958 2288 559 -2143 -174 3068 1506 -2133 -1314 2092 1465 -2025
1168 -2025 -1568 2457 3143 -108 -592 2966 3814 -6 -2184 306 1507 -2066 -4687 -2160 584 -1417
1184a417k357K631L719j170l091J297L365j019l859J28L523J83l359j49M030J399
1200C854l115j333L113J332l716l023J948J818l015l055K220L478j197k645K089
1215a247M096n63l492M64L465l61m023n72L661J051l190q21L881K051k965k197
1231g62K534J824l427l697J382K419k201l307J680L995k36k826J227M155K33l604
1247f11n79L277N08l724j382L408J976k674j563L306K633k505k973J669K220k767
1263B19m066P26K885j228l316J093M233N86k896L63L956Q32l597j361L014J220
1279B663l339j913L088K605k159k155K599K935k048l479Q61K485j951m082J32
1294c758L165j88l105L87M108J352k755n97L444J422l237k098K538J909k636k373
$$ plain form
1184 -1417 -3774 -1143 2576 1406 -1685 -388 2977 1958 -1901 -1773 1750 1933 -1426 -1575 2455 3854
1200 3854 739 -594 2519 3851 135 -2888 -940 878 -2137 -5192 -2972 506 -691 -3336 -1247
1215 -1247 2849 2286 -1206 -742 2723 2362 -1661 -2233 1428 2479 -711 -1532 2349 4400 1435 -762
1231 -762 1772 3596 169 -3528 -2146 273 -1928 -5235 -3555 440 204 -2622 -1395 2760 2993 -611
1247 -611 -1190 2087 2595 -1129 -2511 897 2873 199 -1364 1942 4575 2070 -903 766 2986 219
1263 219 -3847 -3121 -236 -1464 -4780 -3687 546 1132 -1764 -1401 2555 3387 -210 -1571 1443 2663
1279 2663 -676 -2589 499 3104 945 -1210 1389 4324 2276 -1203 -342 2143 192 -3890 -3758
1294 -3758 -593 -781 -3886 -3499 609 1961 -794 -1391 2053 3475 238 -1860 678 2587 -49 -2422
1310b422K512L062j546k655J755L082j493l735J31K673j063l931l17L300O55k901
1326b893k86L845J835k602j353K916J860k797k556K054K414j957k651J841L267
1341B937r35k919Q50L056p52l730n44K682j13l483q60L152J430k492r97L239K228
1358B749k259k003K246K225k190k835J526K768j294k832J184L311m62l092J76
1373g82K983j58l553r67K744O50l079j255K964J914k231j566K670K449j922k467
1389a606J668K547j568k970R45K953o06k952M18L179J55l083n76K840O09l128
1405a175j428K550J433k564j749K484K331j842k165J966K666j409k766J083K781
1420B196q70l038L48L007l0k979k91K996P08k884j094K652J293k595j764K258
$$ plain form
1310 -2422 90 3152 1606 -1049 706 3788 2295 -1440 -1309 1364 301 -3630 -3947 -647 8 -2893
1326 -2893 -3179 666 2501 -101 -1454 1462 3322 525 -2031 23 2437 480 -2171 -330 2937
1341 2937 2002 -917 -67 2989 2237 -1493 -2037 645 532 -2951 -3811 -659 771 -1721 -2718 521 2749
1358 2749 490 -1513 733 2958 768 -2067 -541 2227 933 -1899 -715 2596 2134 -958 -782
1373 -782 2201 2043 -1510 -2477 267 917 -2162 -3417 -453 1461 -770 -2336 334 2783 861 -1606
1389 -1606 62 2609 1041 -1929 -984 1969 1363 -1589 -1171 2008 2163 -920 -1496 1344 1953 -1175
1405 -1175 -2603 -53 1380 -1184 -2933 -449 1882 40 -2125 -159 2507 1098 -1668 -585 2196
1420 2196 1326 -1712 -1364 1643 1613 -1366 -1657 1339 2047 -837 -1931 721 2014 -581 -2345 -87
1436h7J966k020k183J828K509j360k536J150K761p54k813L88K818j18k886l34
1452a671K750N83k766r80K590J277k409j501K315J909j948k006J818K271j515
1467G17k492J132K513r29k708N37K755j87k704q3K725M33k711q74K437R75k485
1484i49j422K214J707j836j700J960K274j300k151J217K344j022k664M01K368
1499A441m00k654m9K587M42k402n77K439Q94k390j345J974J306k070j689J844
1515f49K064j262j761J621K453q39k234O76K234p04k721j32K230m1k479l91K452
1532E17Q49k148r06K137J164k127j662J597J550j630j791J542K327p11j748J187
1548A47K508m25k336J09K044l86k710n93K064M25k229o96K295J229j903j262J831
$$ plain form
1436 -87 1879 -141 -2324 -496 2013 653 -1883 -733 2028 1274 -1539 -1151 1667 1549 -1337 -1671
1452 -1671 1079 1662 -1104 -2084 506 1783 -626 -2127 188 2097 149 -1857 -39 2232 717
1467 717 -1775 -643 1870 941 -1767 -1230 1525 1338 -1366 -1449 1276 1709 -1002 -1876 561 1536 -949
1484 -949 -2371 -157 1550 -286 -1986 -26 2248 948 -1203 14 2358 1336 -1328 -927 1441
1499 1441 1041 -1613 -1662 925 1367 -1035 -1612 827 1721 -669 -2014 -40 1266 -804 -2493 -649
1515 -649 1415 153 -1608 13 2466 1627 -607 69 2303 1599 -1122 -1254 976 935 -1544 -1935 517
1532 517 1366 -782 -1688 449 1613 -514 -2176 -579 971 -659 -2450 -908 1419 708 -1040 147
1548 147 2655 2230 -106 3 2047 1661 -1049 -1642 422 847 -1382 -2078 217 1446 -457 -1719 112
1565A12J371j900j948J316J808j237j847J359K582k94j813Q38K488k07k481m03
1581b56J904j18k668r57K013Q51j978r81K132J577j649j604J438J580j557k165
1597b438R27K097o66j853J008K739K14j843K86K308J23k540r83J671K96k486j295
1614b435J864J333j664j236J843J835j400j911J011J765j199k275O57K306j32
1629C62j808O70K791N94j900k54K078L94k531j451J432P09k147j546J643J744
1645G80j217j524J412K017j022k168M95J885o58k267K83K434M66j690K21K651
1661B098R62j868q68J748O49k373j856J193J111j745j716J406K052q38j719J013
1677g51K078o89k293R1J936j88k149j1K439R42j515k10K366J205j778j349J296
$$ plain form
1565 112 1483 -417 -2365 -1049 759 -478 -2325 -966 1616 1322 -491 347 2835 2628 147 -256
1581 -256 1648 1530 -1138 -2095 -82 769 -1209 -2190 -58 1519 -130 -1734 -296 1284 -273 -2438
1597 -2438 -1511 586 -80 -1933 -925 1814 2028 185 471 2779 2902 362 -621 1050 1346 -1140 -2435
1614 -2435 -571 762 -902 -2138 -295 1540 140 -1771 -760 1005 -194 -2469 -1812 494 362
1629 362 -1446 -776 2015 2609 709 455 2533 2927 396 -1055 377 1086 -1061 -2607 -964 780
1645 780 -437 -1961 -549 1468 446 -1722 -1227 658 0 -2267 -1984 450 916 -774 -553 2098
1661 2098 3060 1192 324 2072 2721 348 -1508 -315 796 -949 -2665 -1259 793 -45 -1764 -751
1677 -751 1327 638 -1655 -1564 372 184 -1965 -1976 463 1405 -110 -320 2046 3251 1473 124 1420
1694A420Q93k036k090Q64J448j175j779J036K190l70j821M57K014k79k272l17
1710a817J890L34j889l11K332J301j329o16J978J321j659j707R41J064j716k147
1726b030O85J690p40j779P51K245q0j911M1J933L7k187o26J868P71j644n92K161
1744E93J591j171j029J546J456j464k040N67J299j258k217M25J927k62j782L49
1760a470K232K75j944m17J837M20k059q85J813J167j417q64J930J797j060j408
1776e3J180J535j260k229K88J516q23k188J73K070J66j793o6K130N93j913q20
1793a494J664Q41j788j198J603J576j081j216J502J940p57j770O54J676q32k313
1809i93r2J707k47k098j91K085O13j741n27J935R35j769j193J487J216j476j455
$$ plain form
1694 1420 2313 277 -1813 -949 499 -676 -2455 -1419 771 401 -1420 -963 1051 772 -1500 -1817
1710 -1817 73 407 -1482 -1793 539 1840 511 -105 1873 3194 1535 -172 769 1833 117 -2030
1726 -2030 -1345 345 -395 -2174 -1423 822 742 -1169 -1128 805 842 -1345 -1971 -103 668 -976 -1568 593
1744 593 2184 1013 -16 1530 2986 1522 -518 49 1348 90 -2127 -1702 225 -37 -1819 -1470
1760 -1470 762 1037 -907 -1324 513 933 -1126 -2011 -198 969 -448 -1312 618 2415 1355 -53
1776 -53 1127 2662 1402 -827 -539 977 154 -2034 -1861 209 375 -1418 -1484 646 1239 -674 -1494
1793 -1494 170 1011 -777 -1975 -372 1204 123 -1093 409 2349 1592 -178 476 2152 1320 -993
1809 -993 -1085 622 375 -1723 -1914 171 784 -957 -1484 451 1386 -383 -1576 -89 1127 -349 -1804
1826a804J355J833q15j509J055K024n10j973K06J759l64k244m23J767L04j931
1842a270o11J933J022j565r90J615J291j426j526J140J568j013j681Q91J965l94
1858I49j754M55K012q9k006k69J755J86k034p43J710P74j690r55J638J300j327
1875h8j310J263J522j059j682Q08J733n99j795M40J920r2j819n2J853L10j856
1892e03o14J669P06j688j016J482J153j347j290J220J501r72j554Q43J690n78
1908G02j755L86J790j93j825q0J754K43j783n01J697O81j584q45J535J082j336
1925c2j194J197J368j058j510Q22J602o33j643M88J762j71j720jJ693J66j797
1942f61n53J524N50j608q47J458J096j194j054J291J412r18j416P98J469o90j654
$$ plain form
1826 -1804 -449 1384 569 -940 115 2139 1629 -344 -138 1621 1257 -987 -1410 357 661 -1270
1842 -1270 -1881 52 1074 -491 -1481 134 1425 -1 -1527 -387 1181 168 -1513 -622 1343 949
1858 949 -805 -350 1662 1573 -433 -702 1053 1239 -795 -1538 172 946 -744 -1699 -61 1239 -88
1875 -88 -1398 -135 1387 328 -1354 -546 1187 588 -1207 -767 1153 1061 -758 -810 1043 1353 -503
1892 -503 -1117 552 1258 -430 -1446 36 1189 -158 -1448 -228 1273 301 -1253 -410 1280 702
1908 702 -1053 -667 1123 930 -895 -975 779 1022 -761 -1262 435 1116 -468 -1313 222 1304 -32
1925 -32 -1226 -29 1339 281 -1229 -407 1195 562 -1081 -593 1169 998 -722 -723 970 1136 -661
1942 -661 -1214 310 860 -748 -1595 -137 959 -235 -1289 2 1414 496 -920 -122 1347 657 -997
1959i97L64J612k02j609J06J738K23j614m00J478M20j680r02J244P86j342j019
1976a794J251J365p99j103J028J534n73j501M15J445m05j662L6J565J54j483k09
1993g36J593N47j441p92J204O34j487j201R26J041r64j136R97J593l70j162O68
2010h6J585k58j530j0J352o3j593k96J454N13j289m80J400P45j274j045Q73P64
2028G62j237j362O79J187n79j110P65J678lj146L15J475K5j517l70J194K41j391
2046c94n64J292P90j017p44J077R17j052j240M95Q61q90j364M01J296j67j020
2063a323N09J624K72j081jJ284J71j378o07J028M35j166o58J107R01q17q40P95
2081B55R08q63j322K75Q83o07j281K64J343J29r08K75J513M42j035l01J071L34
$$ plain form
1959 -997 -633 979 777 -832 -726 1012 1235 -379 -779 699 1119 -561 -1463 -219 567 -775 -1794
1976 -1794 -543 822 23 -1080 -52 1482 909 -592 -177 1268 863 -799 -763 802 956 -527 -736
1993 -736 857 1404 -37 -829 375 1009 -478 -1679 -753 288 -676 -1812 -815 778 408 -754 -86
2010 -86 1499 1241 -289 -299 1053 990 -603 -899 555 1068 -221 -701 699 1444 170 -875 -2 762
2028 762 -475 -1837 -1158 29 -550 -1660 -895 783 780 -366 -51 1424 1449 -68 -438 756 997 -394
2046 -394 -958 334 1124 107 -637 440 1357 305 -935 -440 421 -469 -1833 -1432 -136 -303 -1323
2063 -1323 -814 810 1082 1 0 1284 1455 77 -530 498 933 -233 -891 216 1117 300 -540 255
2081 255 1163 300 -1022 -747 136 -471 -1752 -1488 -145 -16 -924 -649 864 1306 271 -30 1041 1375
2099A375j242p83Q65O41r19p79R01J033o20r88N23R31o68j352O1R52l11j174J52
2118a402J343L63q38P1J364N06r97n07Q86M37j101q71P57P73p17q18P27J038m79
2137E35j064K81R06m66j310q5R86jj043LJ318N56p86j80J166O08r28p30P22N82
2157A070r09r35O17R04n11r05N11J071l36j131P9R10k59j243j74J032K21r46j19
2176a053J235O51p40l92R89O57q64q62N87P07p27r78M91J006l37r81L01J079j75
2195E94j163j17R48Mj158l29J030M67q38l39J099P86o92o52P86P70p18r87M30
2214g9Q58m88j038L08J069j56j011O1J058K5j118k97R27K64j033m43R58O49p45
2233b31n33Q98Q47o02q15N71Q58n08j040K53R45k31j050R6J047P5j014j68R85
$$ plain form
2099 1375 133 -650 215 856 -63 -842 59 1092 472 -516 7 938 270 -1082 -1021 -69 -380 -1554 -1402
2118 -1402 -59 304 -534 -463 901 1407 410 -97 789 1226 125 -746 11 784 67 -751 -24 1014 535
2137 535 -529 -248 658 192 -1118 -1203 -217 -218 -1261 -1258 60 616 -170 -350 816 1424 496 -234 488 1070
2157 1070 161 -774 -157 747 236 -669 -158 913 577 -554 -475 435 176 -1067 -1241 -209 12 -934 -1053
2176 -1053 182 833 93 -299 690 1347 483 -379 208 915 188 -790 -299 707 370 -611 -310 769 594
2195 594 -569 -686 262 266 -892 -1221 -191 276 -562 -901 198 984 292 -360 426 1196 478 -509 -79
2214 -79 779 291 -747 -439 630 474 -537 -476 582 607 -511 -808 119 383 -650 -1093 -135 514 -231
2233 -231 -764 134 981 379 -436 135 993 485 -555 -302 643 412 -638 -542 505 580 -434 -602 383
2252C83K61j004m72Q73N00q56o02Q07P67o00p43O37R02m50r22L57R32k90j032
2271e52J05R61j2j021j07R91K44r52l50R14M61q60n70P87O57o90p43O06Q44m94
2291B19q75L88R24k50r82J48R70k9r73j04R53K01r45l45Q74M51q22n10P88O58
2311G39o59o75O19P84n19q58L69Q26l35r35J58R02p6r00j1R54J55q81k47Q65L34
2332F09q46m79P62N57o77n90O64P90m85p26M52Q03l53r36J22Q12j84r57l4R02
2352B06J30q43j61R07L67q07m02P43M67p28o13O41O72m96o60N52Q66l07q04K71
2372AQ09k53r81m1P66m4r28j66Q75L01p42k83Q44M92p12n45O31N68n98o98M91
2393b13P95l16p05L75R22j32q61M6P81r0r93k75P39J59q39l24Q21N09o33m30P11
$$ plain form
2252 383 644 -360 -832 41 541 -315 -917 -110 657 57 -686 -49 853 403 -519 -162 770 480 -552
2271 -552 -447 514 502 -519 -626 365 609 -343 -693 221 682 -178 -748 39 696 6 -737 -131 713 219
2291 219 -656 -268 656 406 -576 -428 542 513 -460 -564 389 590 -355 -700 174 625 -197 -707 81 739
2311 739 80 -595 24 808 289 -569 -200 626 291 -644 -486 416 340 -560 -571 383 538 -343 -590 275 609
2332 609 -237 -716 46 603 -74 -664 0 790 305 -421 31 834 481 -455 -333 479 295 -662 -696 206
2352 206 336 -507 -668 239 606 -201 -603 140 607 -121 -734 -93 579 83 -577 -25 841 534 -270 1
2372 1 810 557 -424 -465 301 257 -671 -837 38 339 -403 -686 158 650 -62 -607 24 592 -6 -704 -213
2393 -213 582 266 -439 -64 858 726 -135 -89 692 602 -391 -666 73 232 -607 -931 -110 399 -234 -664 47
2414D7O16n70o84M61O67m19p50L43Q67j45p17K12Q83Jq61j62P21L7r31l96O54
2435a26L28p12m11P13O33m85n32N35P02m29p52K85P30k32p85J86Q91O1p20oQ32
2456G06J61q39l68O18K20q15n51N91M76n37n18N85P38l46o25L78P22k86p90J22
2476c58P58n8p36L6Q34J97o74j68P13K59p55n05N09L50o65o03M79O14l81n65M23
2497b96P73k12o75J70P22r5p74k8P18J33o65j45P57L19o15l33N95L57o38n95M14
2518a13M43n06o20L73O63k43n79K70P52r1o69L0O91Po99j38O76K34o12k42O53
2539B80L94n47m44M79M47n31o20L08N39l40o39K51O98q4o32J21P15M0o87j04O38
2560B82J64o44k59O22L38n40l64N52M43m48n34L74N21m07o31K29O07k10o34J42
$$ plain form
2414 47 663 93 -591 -130 537 118 -632 -289 578 433 -284 -72 811 812 -49 -211 510 547 -384 -780 -126
2435 -126 202 -510 -921 -208 425 -60 -592 -57 645 216 -536 -251 479 247 -538 -352 539 600 -120 -126 706
2456 706 867 28 -340 278 498 -317 -868 -277 199 -338 -856 -271 467 121 -504 -126 596 310 -480 -358
2476 -358 400 342 -394 -358 476 673 -1 -169 544 803 48 -457 52 402 -263 -866 -387 227 -154 -719 -296
2497 -296 477 265 -410 -240 482 387 -387 -415 303 436 -229 -374 383 702 87 -246 349 706 68 -527 -113
2518 -113 330 -176 -796 -423 240 -3 -582 -312 440 349 -320 -290 401 408 -291 -429 247 481 -131 -373 280
2539 280 674 127 -317 162 609 78 -542 -234 305 -35 -674 -423 275 191 -441 -320 395 435 -252 -356 282
2560 282 446 -198 -457 165 503 -37 -401 151 594 146 -388 -14 507 100 -531 -302 305 95 -539 -397
2580c97O90Ko34j1O78J23o36k10O03K65n76l59N44M22m76m71M42N36l83n81K80
2601a49N84k35o67J16O53m6o60kO66J24o23j63O19K57n73l32N48L82n03m54M48
2622a0M79l77n61L23N83k56o05J78O42r5o42J2O47P7o47j59O20K27n93k93N51
2643A01L85m93m35M50M87m05n65L13N55k60o33J61O47o9o23M5O83R3o13j44O08
2664B88K05o05l06N23L44n09l97M62M62l67n01L31N06k78n99J47N59j28o22N3
2684d32O38P6n58n2O37K25n45k67N19K87n29m28M18M06l82m73L47N31k43n37J82
2705a80N50j62o26JN49Pn71n6O24K16m73j43N77K96m75l58L97L41m50m85L08M47
2727C34k73m71K37N33j16n57P0N00n7o12r7N12J14m81j32N91L27l95k31M86L60
$$ plain form
2580 -397 293 295 -339 -350 328 451 -185 -395 208 473 -103 -462 82 504 28 -443 -1 535 152 -429 -149
2601 -149 435 200 -467 -351 302 256 -404 -406 260 384 -239 -402 217 474 -99 -431 117 499 -4 -458 -10
2622 -10 469 92 -469 -146 437 181 -424 -246 396 301 -341 -329 318 395 -252 -411 209 436 -157 -450 101
2643 101 486 -7 -442 8 495 90 -475 -162 393 133 -500 -339 308 239 -384 -339 344 437 -176 -320 288
2664 288 493 -112 -418 105 449 -60 -457 5 467 100 -401 -70 436 158 -441 -294 265 137 -485 -432
2684 -432 206 282 -276 -328 309 534 -11 -278 241 528 -1 -429 -11 395 13 -460 -113 418 175 -362 -180
2705 -180 370 208 -418 -417 132 139 -432 -488 136 352 -121 -264 313 609 134 -224 173 514 64 -421 -113 334
2727 334 61 -410 -173 360 244 -313 -243 257 200 -412 -509 3 117 -364 -496 95 422 27 -204 282 642
2748F42m03m40K81L77l44n21K06M87j49m85J30N46l3n53n4M61K9n57j85M73K31
2769A39m17j65N25L97l11k85L69L86l55m78J75L73k54n10J24N09p3m52N2N11M3
2790C03n43j32M13J01n06k29M70L01l17k29M72M54k47l62K66M08k98n39R3M02
2810B81j59n26P0N25K9m61l6M78Q8n15k28L91J75m33k76M37L87k40k51L97M87
2831F20k16m05J64L92k28n52J5M08o8m64k2N00J21m42j29M32J67m78l15L42K69
2852A11l58l19L82M64j54l05L02M79j36m54M7L83j40n40o7M06N6m50q1M77J96
2873B99m21k06L74K16m25l43K92L31k76l10L31M88j01l28J97M73r3n09k0L70o6
2894B73n27j15M29J21m23j38M46K57l89k99L11K81l70l86K65M08j90l53K55N47
$$ plain form
2748 642 239 -201 80 457 113 -408 -202 285 136 -349 -219 327 294 -259 -313 148 177 -380 -565 -92 139
2769 139 -278 -443 82 479 168 -117 252 638 283 -195 -20 353 99 -411 -287 222 149 -303 -251 260 303
2790 303 -240 -372 41 142 -364 -593 -123 178 -139 -368 104 558 311 -51 215 623 325 -214 -121 281
2810 281 122 -404 -334 191 220 -241 -277 201 289 -226 -454 -63 112 -321 -597 -160 227 -13 -264 133 620
2831 620 404 -1 163 555 327 -225 -210 198 130 -334 -356 144 265 -177 -306 126 293 -185 -500 -158 111
2852 111 -247 -566 -184 280 126 -179 123 602 466 12 59 442 302 -238 -305 101 157 -293 -374 103 299
2873 299 -122 -328 46 262 -163 -506 -214 117 -159 -469 -138 350 249 -79 118 591 498 -11 -31 339 273
2894 273 -254 -369 60 181 -242 -380 66 323 -66 -365 -54 227 -143 -529 -264 144 -46 -399 -144 403
2914D03m2l99R9M63m1n22j04L66L4n00j70M24K00l76k02L93K88l46l43K75L25
2935B25k92m12K07M45j02l69J73N33Jm21pM37L1n19j93L77J37m53k32M00K96l46
2957h4k88L42L56k94m06K07L93k02m40J50M85k1m22P7N26N6m52j02M38J04n06
2978h3k42L81K10l86l14L75L57k84l89K79M13k31m54J49M57j12m78O8N19O0m62
2999a67n0N11J57m78k31M35K30m46l39L48L57l39m05K98M44k06m66J75M77j08
3019A97n02N5M95J4m93o1M99J48m74j87M51K53m36k98L65L41l43m02K88M15k21
3040A04m61J83M83j22m88O0N11M1n05o1M93J42m88k21M49K37m48l31L96L52l37
3061a1l74K95M42k19m57J77M80j26n05N4M97J6m96m3N24J29m48j72M43K18m54
$$ plain form
2914 403 361 -38 61 524 483 -39 -143 223 257 -243 -413 11 211 -165 -367 26 314 -32 -375 -100 225
2935 225 -67 -479 -272 173 71 -298 -125 408 409 -12 -19 418 449 -70 -263 114 251 -202 -434 -34 262 -84
2957 -84 -372 -30 326 32 -374 -167 226 24 -416 -266 219 198 -224 -147 379 435 -17 -119 319 423 -83
2978 -83 -325 56 266 -120 -434 -59 298 14 -375 -96 317 86 -368 -219 238 126 -352 -284 235 295 -167
2999 -167 -217 294 451 -27 -258 177 407 -39 -378 -30 327 -12 -417 -119 325 119 -347 -172 305 197
3019 197 -305 -250 245 259 -234 -295 204 352 -122 -309 142 395 -41 -339 26 367 24 -378 -90 325 104
3040 104 -357 -174 309 187 -301 -241 270 311 -194 -255 238 380 -108 -329 120 357 -91 -422 -26 326 -11
3061 -11 -385 -90 352 133 -324 -147 333 207 -298 -244 253 269 -227 -270 254 383 -65 -237 206 424 -30
3082c0l44L51K97l90l87K90M32k15l98K18N22j13m76P1M84j7n17o8M87J41m51
3103a13j41M88K70m19k81L49K88m08m49K32L41k75m68K13N05p9m02J47N29%m63
3124a36n1M57P2m93j58M58K18l78k12M28L26l28l74K52L13l46n14J24L72j73m50
3145e93J24N55M1l75M9N13J26m60j73M09J59m44k43M14L15l03k91L55L93k87m58
3166a74J44L26k82n50J8M25n7m28P9N56J53l50k7M84J88m46k58L57K48l99l01
3187b94L47M02k36l34K56M29k24n29K2L39j93n72n5M48Q2m11oN71K81l27j56M35
3209B75K59m10l47K77L16k88l61K74M77j30l92J45M09j35n63r2L12p4n34j35M45
3230b72K16l22q8N10L55k84k46L33L13l26m17J92L80j66m07J91M93k6m43J7L89
$$ plain form
3082 -30 -374 -23 274 -116 -503 -213 219 4 -394 -176 346 233 -243 -172 312 295 -222 -290 197 338 -113
3103 -113 -254 234 504 85 -196 153 441 33 -416 -184 157 -118 -586 -373 132 53 -349 -202 327 327 -136
3124 -136 -187 270 342 -151 -309 149 367 -11 -223 205 531 203 -171 81 394 48 -466 -342 30 -143 -593
3145 -593 -469 86 127 -248 -199 314 440 -20 -193 216 375 -69 -312 102 417 114 -177 178 571 284 -174
3166 -174 -30 296 14 -536 -518 -93 -150 -578 -499 57 210 -140 -167 317 505 59 -199 158 406 7 -294
3187 -294 53 455 219 -115 141 570 346 -183 -161 178 -15 -587 -642 -194 -112 -523 -529 42 323 -4 -160 275
3209 275 534 124 -223 54 370 82 -279 -5 472 342 -50 95 504 369 -194 -286 26 -48 -582 -717 -272
3230 -272 -56 -378 -466 44 399 115 -131 202 515 189 -228 -36 344 178 -229 -38 455 429 -14 3 392
3251C92m4n63k29L23N5m88j95M34L34k53j71M49M20k21l54K43L44k46m42J09M14
3272C11o4l91R0M76N7m43j19L66J7n20k85K81J43l71k34L72L95j58k22L19M30
3293D50j42l88J10L62j32m47J9M29M1l71l4M42J21m04k26L09J00m45l39K49K51
3314d5k67k73L11M49j10k60K19M14j15l91L0L42m3m09m7L98J14l38r9L72J59l62
3336D9k70K27J68l55l45K12L15j78k87K38M44n0k93J02L93j9m26m7L55L4l84j05
3358b22L78J80l24j69L16K04l28l17J93K40k59l43J59L61j14k95J46M22kl25K6
3379g3L56K5l86r9L35J06l45j52L24K17k82k28K50K56k59l31J60K90j83l63J38
3400b44L79m8l17O0L95K9l39n1L51R5l68j65L13J88l11k31K87K64k36l07K10K97
$$ plain form
3251 392 348 -215 -444 -121 -66 -554 -749 -315 19 -234 -405 44 464 243 -111 132 476 230 -212 -103 311
3272 311 247 -144 -54 422 479 36 -83 283 300 -220 -505 -224 -81 -452 -686 -314 81 -77 -299 20 450
3293 450 308 -80 30 392 260 -187 -168 261 302 -69 -103 339 460 56 -170 139 239 -206 -545 -296 -45
3314 -45 -312 -585 -274 175 65 -195 24 438 323 -68 -38 304 261 -148 -195 203 317 -21 -120 252 411 49
3336 49 -221 6 174 -181 -526 -314 1 -177 -464 -226 218 168 -125 -23 370 351 -75 -122 233 267 -117 -222
3358 -222 156 336 12 -157 159 363 35 -282 -89 151 -108 -451 -292 69 -45 -340 -194 228 226 -99 -73
3379 -73 283 308 -78 -177 158 264 -81 -233 91 308 26 -202 48 304 45 -286 -126 164 -19 -382 -244
3400 -244 135 87 -230 -170 225 254 -85 -136 215 310 -58 -223 90 278 -33 -264 23 287 51 -256 -46 251
3422B51j87l47J32L23j01l49P1L74ql37j6L65Q6l46j23L22J63l20k06K82K35k60
3444Dk70K14L03j88l26J58L41j00l58P7L56rl63l0L57O8l68j31L45J56l20j89
3466b73L12K32k66k68K32K75k00l27J53L33j20l40J04L72j1l30lL62O3l62j03
3487a65L01J09l42j98K88K04k51k37K58K81k06l05J68L01j43l54Q5L55k9l41L5
3508a86L92R3l32o4L47J16l61j95K50J69l20k40K32K66j98k66K12L20j42l30R8
3529a39L15p6l66J9L65M5l10j4L94J43l02j42K94J47l28k75J99K15k62l05K06
3550a77L20j37l01J47L49p5l68L5L28j6l45m9L87J31k81q3L75J96k81k09K35K02
3572C83l11l35J36K59k01l26J66L52o5l17P2L58j5l63n4L30M9l26p7L54K21k44
$$ plain form
3422 251 64 -283 -151 172 71 -278 -207 167 159 -178 -194 171 257 -89 -212 110 273 -47 -253 29 264 4
3444 4 -266 -52 251 63 -263 -105 236 136 -222 -145 211 202 -161 -191 166 234 -134 -265 80 236 -84 -273
3466 -273 39 271 5 -263 -31 244 44 -283 -130 203 83 -257 -153 219 208 -122 -125 237 300 -62 -165
3487 -165 136 245 -97 -295 -7 197 -54 -291 -33 248 42 -263 -95 206 63 -291 -206 149 120 -221 -186
3508 -186 206 299 -33 -97 250 366 5 -190 60 229 -91 -331 -99 167 -31 -297 -85 235 93 -237 -139
3529 -139 176 100 -266 -247 118 163 -147 -161 233 376 74 -68 226 373 45 -230 -31 184 -78 -383 -177
3550 -177 143 6 -295 -148 201 126 -242 -207 121 105 -240 -289 98 229 -52 -135 240 436 155 -54 181 383
3572 383 72 -263 -127 132 -69 -395 -229 123 58 -259 -187 171 156 -207 -261 69 118 -208 -285 69 290 46
3594D6j58L27K62k55k93J73K33k62l83J04K97j21l36Q4L97Ml32OL44N8l76j18
3616b99L21J62l11j52L37K91k05k19K76K85k11l60R3K52j92l93L3L18j7l43K6
3637c08L96P8l20r7L24J35l30j98K85K20k30k13K91L44j42k74J76L29j66l98J9
3658g9K76j04m10k8L44O3l24n4L66J62l11j67K81J90k81k60K39L04j73k39K16
3679A1L63r7k97P8L18r2m00n0K59%l60j05L41J40k90j14L24K00k58k47K41K42
3701B07k27k80J81L46j05k77J41L76k9l48KL09j1l98j38K94P1l36j49L20J88k34
3723i7j87K51K66k21k72J60K80j26l10J26L44l1k78M7L49L0l26q8K82N7l53j78
3745b75K54J60k82k02K64K52j97k34J93K88j57l00R3L08p0l09N1L48K3k90j4L25
$$ plain form
3594 46 -112 215 477 222 -71 102 335 73 -310 -206 91 -30 -366 -282 115 119 -213 -207 137 195 -181 -299
3616 -299 22 184 -127 -279 58 349 144 -75 201 486 275 -85 8 260 68 -325 -292 26 9 -334 -308
3637 -308 88 166 -154 -251 73 208 -122 -320 -35 185 -45 -258 33 377 235 -39 137 466 300 -98 -79
3658 -79 197 93 -317 -345 -1 62 -262 -316 50 212 -99 -266 15 205 -76 -336 -97 207 34 -205 11
3679 11 374 277 -20 58 376 284 -116 -166 93 93 -267 -372 -31 109 -181 -295 29 229 -29 -276 -35 207
3701 207 -20 -300 -119 227 122 -155 -14 362 333 -15 -13 296 285 -113 -251 43 114 -222 -371 -51 137 -97
3723 -97 -284 -33 233 12 -260 -100 180 54 -256 -130 214 183 -95 -48 301 331 5 -83 199 256 -97 -275
3745 -275 -21 139 -143 -345 -81 171 -26 -260 -67 221 64 -236 -143 165 95 -214 -163 185 208 -82 -96 229
3767B29Q7l18j57K61J15k92k12K38J99k12k38K11K82j40k74J19K97r2l07M5L08
3788A49Pl02k7L30Q7k92j00K91J37k84k00K16K09k56k42J96K56j51k80J36L02
3809A82o8l11M7L20ll31m1L26O8k91r0K87J52k64j77K35K00k14k43J87K41j65
3831D7k78J29K84q9k90N4K91j0l00j7L03M9k89q5K79J25k63j64K50J83k16k30
3853b37J94K48j65k59J39K73q2k89N9K94k5k94j4K78N1k80p7K71J24k70j32K23
3875C0J81k29k06J74K14j75k36J45K54q5k46P8K91l0k77LK64L0k87p6K55J04k35
3898e9j34K47J65k06j97J75J89j82k38J22K38j07k48R7K75j7k34K6K70M4k78o6
3920a18K48O8k56j25K32J49k20j47J85J89j74k16J17J98j37k56O8K43l3k32O1
$$ plain form
3767 229 316 -2 -159 102 217 -75 -287 -49 150 -62 -300 -89 193 53 -221 -102 195 103 -204 -159 149
3788 149 156 -146 -173 157 244 -48 -148 143 280 -4 -204 12 221 -35 -277 -81 175 24 -256 -120 182
3809 182 114 -197 -150 170 167 -164 -205 121 189 -102 -192 95 247 -17 -194 41 241 27 -216 -29 212 47
3831 47 -231 -102 182 93 -197 -143 148 138 -162 -179 124 173 -116 -201 78 203 -60 -224 26 209 -7 -237
3853 -237 -43 205 40 -219 -80 193 111 -178 -119 175 150 -144 -158 120 171 -109 -186 85 209 -61 -193 30
3875 30 211 -18 -224 -50 164 -11 -247 -102 152 67 -179 -101 190 160 -117 -114 150 180 -107 -183 72 176 -59
3898 -59 -193 54 219 13 -184 -9 180 -2 -240 -118 120 13 -235 -138 137 120 -114 -88 182 226 -52 -118
3920 -118 130 198 -58 -183 49 198 -22 -169 16 205 31 -185 -68 130 -7 -263 -195 48 15 -217 -156
3941a56K87K9k18j1K56O1k53j10K09R9k29j45J98J78j73j84J69J94j37k61Q6K06
3963I5j00k63M1K66Lk24L4K87P0k08o2K33Q8k37j48J78J31j91j77J72J96j32k12
3986a60J17K09j05k68L7K19n0k56j0K84O4k02j6K96J16k30j08K13J30k25j99J50
4008FJ85j71k03J35K44j08k55Q9K13n4l00k0K33Rk53k9K75J27j85p0K60J68j99
4031I7j63J70J58j99k25J22K18j20k25R5K52m8k59nK39k2k78q1K40O3k29p4K64
4054a0J78j61j22K34K02j78k31J36J90j43k67P8K39n3k42L1K67kk56p0K33L7k66
4077a76j25K28J35j96j04K27K13j19j65J59K28j37k37N1K22q6k57J6K47Rk49k7
4099a43K41P1k65j16K03J07k32j60J97J91j63j44J84K43r2k11J04K35p4k67J7
$$ plain form
3941 -156 131 160 -58 -69 187 248 -5 -115 94 193 -36 -181 17 195 22 -162 7 201 64 -197 -111 95
3963 95 -5 -268 -227 39 42 -182 -148 139 209 1 -61 172 260 23 -125 53 184 -7 -184 -12 184 52 -160
3986 -160 -43 166 61 -207 -170 49 -1 -257 -267 17 81 -121 -137 159 275 45 -63 150 280 55 -144 6
4008 6 191 20 -183 -48 196 88 -167 -78 135 81 -219 -239 -6 3 -250 -279 -4 123 -62 -132 128 296 97
4031 97 -66 104 262 63 -162 -40 178 58 -167 -72 180 132 -127 -132 107 85 -193 -274 -34 29 -200 -274 -10
4054 -10 168 7 -115 119 321 143 -88 48 238 95 -172 -94 145 92 -150 -119 148 146 -110 -180 53 90 -176
4077 -176 -301 -73 62 -134 -238 -11 202 83 -82 77 305 168 -69 -18 204 118 -139 -123 124 133 -116 -143
4099 -143 98 169 -96 -212 -9 98 -134 -294 -97 94 -69 -213 -29 214 122 -89 15 250 176 -91 -74
4120g4K25j9k42n1K63N3k33p9K23R5k13j59J76J41j89j75J60K17j04j85J31K47
4142B08m9k30L3K31k3k62l3K18M3k28q2K35R6k05j30J91J51j82j89J53J85j33
4164bj97J07K38n1k30O7K36Kk38j6K22L5k36q5K07R0j97j30J94J49j84j62J40
4187d1J99j31k01J06K11o1k34M3K43j3k28rK25L0k21o7K22R4k18j02J85J42j94
4210b0j53J49J78j18j96J08K10o6k16O1K29k7k36j5K20J8k33n8K06P4j97r9J77
4233dJ46j60j45J52J58j27j89J05J89o0j98P1K28k1j86pK23Qk22p6J77N0k03j28
4257b19J81J26j57j30J64J77j08j74R8J72p5j95L7K12k3j76K0K21N1j90m5J70
4279A37O9k21j14J14R4j67j62J46J65j00j45J18J90p1j71M4J76k9j86lJ95L9j54
$$ plain form
4120 -74 151 132 -110 -161 102 155 -78 -157 66 161 -52 -211 -35 106 -83 -258 -98 119 15 -170 -39 208
4142 208 159 -71 -38 193 170 -92 -125 93 136 -92 -174 61 157 -48 -178 13 164 -18 -207 -54 131 -2
4164 -2 -199 -92 146 95 -135 -68 168 170 -68 -84 138 173 -63 -148 59 149 -48 -178 16 165 -19 -181 -41
4187 -41 158 27 -174 -68 143 82 -152 -109 134 121 -107 -116 109 139 -82 -149 73 167 -51 -153 32 174 -20
4210 -20 -173 -24 154 36 -160 -52 158 92 -124 -63 166 139 -97 -112 108 126 -107 -165 41 115 -82 -181 -4
4233 -4 142 -18 -163 -11 147 20 -169 -64 125 65 -133 -62 166 145 -41 -48 175 183 -39 -115 62 112 -91 -219
4257 -219 -38 88 -69 -199 -35 142 34 -140 -42 130 55 -140 -103 109 86 -90 -70 151 202 12 -33 137
4279 137 206 -15 -129 -15 79 -88 -250 -104 61 -39 -184 -66 124 53 -118 -74 102 73 -113 -116 79 118 -36
4302c6mJ95Q6j72q6J29P5j94j59Q6J14j43j39R4J84n2j36P3J89l1j67PJ60Lj70
4327i4j9J83P8j31l9J70J08j47j23Q6P9j65j74O5J12q7j42Q2J78mj32M4J66oj51
4352f3l1J60K0j52k4J68R2j10o0J40J05j34j53O4P6j48j73N0J44n7j27O1J88J0
4376D6j28J1J59J6j53m5J43N9j29m9J63J01r0q2J08R3j19j57J8P9j10j68M4J44
4400d6k1j24N4J76L2j19j8J48K4j53o2J50P4j06o5J50J19r2j08Q2R0j15j69J1
4424h8R8p2j60J8J61J2j17K5J71N7j28n4J38N1j28q6J28J06q2r3J12J38p9j29
4448aL9R9q8j71j1J02k8j55J9J60L9j03rJ57O7j19o3J22O2j26q2J04J30q4j02
4473d2R6J39o0j50J6R7o2j70j3J08Pj34j5J63N0q9m3J45Q3j26q2R9Q5q9j12R4
$$ plain form
4302 -36 -40 155 241 69 -17 112 187 -7 -166 -80 34 -109 -248 -154 30 -22 -158 -85 104 73 -94 -87 73 76 -94
4327 -94 -113 70 148 17 -22 148 256 109 -14 72 151 -14 -188 -123 -11 -98 -240 -158 20 16 -116 -72 94 88 -63
4352 -63 -94 66 86 -66 -90 78 170 60 0 140 245 111 -42 22 98 -50 -223 -173 -29 -86 -213 -152 36 46
4376 46 -82 -71 88 104 -49 -94 49 108 -21 -70 93 194 104 22 130 223 104 -53 -35 44 -66 -234 -190 -46
4400 -46 -67 -191 -137 39 71 -48 -66 82 106 -47 -109 41 115 9 -56 94 213 121 13 95 185 70 -99 -88
4424 -88 10 -62 -222 -204 -43 -31 -148 -123 48 105 -23 -77 61 112 -16 -102 26 132 50 -43 69 207 128 -1
4448 -1 38 137 49 -122 -133 -31 -59 -214 -195 -35 4 -99 -108 49 116 -3 -66 56 118 -8 -90 14 144 60 -42
4473 -42 54 193 133 -17 -1 96 34 -136 -149 -41 -34 -168 -183 -20 30 -59 -102 43 126 0 -82 17 102 13 -99 -5
4499eJ38n3j15N9J37m9j50nJ04k6j59l3J28K4j09l8J51Q0j03n3J09R4r8j16J02
4524A4R1p6j12O2J41l2j39L6J33k7j50l1J36mj52m2J32O5j16n5J40R2j01j02J24
4549B7R2p9j25P3J24n6j40N5J47l5j49J4J35J2j62k5J23L8j38n0J16Q5j05r0J11
4574bJ12q2j34Q9J28n1j49M4J34l5j40K1J32Qj42j8J20O2j41n4J37P9j21j06J25
4599A6J06j06j18R2J26p6j42O7J37k6j62J6J51j5j54j9J38L7j45n1J38R6j10q0
4623h4J18J10q8j21Q1J16p8j48M2J51l8j49J2J54Jj48l3J46K0j51n7J20Q1j11
4647e4o9J33J16p8j04J09J33q2j45N5J07m2j77QJ55j1j31k0J45M4j51o1J25N2
4671E7j36r3J21R9r4p7J10J61m8j01O3J30l8j63LJ17l5j57j9J33L3j29m9J37O9
$$ plain form
4499 -5 133 80 -35 24 161 112 -38 -43 61 35 -124 -157 -29 -5 -114 -152 -1 79 -24 -77 32 126 28 -88 14
4524 14 105 29 -83 -21 120 88 -51 -15 118 91 -59 -90 46 42 -110 -152 -20 45 -71 -126 14 106 5 -97 27
4549 27 119 40 -85 -12 112 56 -84 -29 118 83 -66 -52 83 95 -67 -92 31 69 -69 -119 -3 82 -23 -113 -2
4574 -2 110 28 -106 -17 111 60 -89 -45 89 54 -86 -65 67 75 -67 -85 35 97 -44 -98 39 118 -3 -109 16
4599 16 122 16 -102 -10 116 40 -102 -35 102 76 -86 -70 81 66 -88 -107 31 68 -77 -128 10 106 -4 -84
4623 -84 34 144 56 -65 16 132 54 -94 -52 99 61 -88 -76 78 79 -69 -102 44 64 -87 -144 -24 57 -54
4647 -54 -123 10 126 48 -56 53 186 104 -41 14 121 79 -98 -90 65 54 -77 -97 48 92 -59 -120 5 57
4671 57 -79 -172 -51 48 -46 -123 -13 148 100 -1 62 192 154 -9 -6 111 76 -81 -100 33 66 -63 -112 25 94
4696I4j37q8Q5P2j09j08Q7J45n3r6J04J55k2j09L6J28k1j68l2J00J3j53m7J20
4720dO7j09p6J20P4j07j24R3R1r6j13P1J51j3q9O6J66J6j30JJ07Oj61o9Q3M3j31
4747f7p0J15Q2r1r8J05Q9r8j33N6J11o0j00M4J62K4q9L4J69L0j40l0R8Qj40r0
4773g9P3O5j14q0J00R5o9j11O1R9o6j39L2J08pj05K8J62O2j02K4J31N1j22p2P5
4799A00L5j32j15Q5O7p4j01O8J34m7j33M1J01l5j40PJ12K6r6J1J51P8p3l7J17
4824A50N9j11j06N7N4j00j19M7R9m6r9N1J07k6j07j6J16j0j29j0J08O4q2j4J31
4849F8Q9o6n3P7O6q5j13M1N8o1j28K9J01j4r5J9J03nj04l4R2K7r9l8R9P3o0k4
4877c7R8R4m7r1O4N6o4j05NP2l0j11J2J03Rr2LQ9Pr9l9Q9K9p9l3Q8P5m3l9Q5O5
$$ plain form
4696 94 -43 -131 -46 26 -83 -191 -104 41 -12 -108 -4 151 129 20 56 184 163 -5 -37 63 76 -77 -124 -4
4720 -4 63 -46 -122 -2 72 -35 -159 -66 25 -71 -184 -113 38 25 -64 2 168 184 54 55 162 168 7 -62 21 64 -67
4747 -67 -137 -22 60 -31 -129 -24 65 -33 -166 -110 1 -59 -159 -115 47 71 -18 16 185 215 75 45 143 151 11 -79
4773 -79 -6 59 -55 -135 -35 60 -9 -120 -59 40 -26 -165 -133 -25 -32 -137 -109 53 115 13 37 168 219 97 25 100
4799 100 135 3 -112 -27 40 -34 -135 -67 67 20 -113 -72 29 -6 -146 -139 -27 -1 -97 -86 65 143 70 33 150
4824 150 209 98 -8 49 103 3 -116 -69 30 -16 -115 -64 43 17 -90 -106 10 0 -129 -139 -31 33 -49 -63 68
4849 68 157 91 38 115 181 96 -17 24 82 21 -107 -78 23 9 -86 -67 36 31 -73 -107 -15 12 -87 -125 -26 47 -13 -37
4877 -37 61 155 108 17 81 137 73 -32 -27 45 15 -96 -84 19 28 -64 -61 28 35 -64 -103 -14 15 -64 -97 -9 66 23 -16 69 134
4908A34l5r7L8O7n2j09MP3j6q4jQ3K6q4k2Q1K3q8m1P0M5m2n3R0O4l8m5N6P2l8
4938H1p3J0M3k2r7QP3qp1mP6J6p0j9O2K9p2m5O5N9n7l4N4P4k4p0N0N9m3p5QP1
4970E4j9j01J1P2Ko8rP8K3p4l3P3K4o3l6N9N3m3n7O3O8l5o7K5Q1k6q5oP9k0o7
5001d4j0P6J4q1j3P0L7o3m6O9M3o8l7M4N7m4n7M6P8l9p3J3P4j2q5OP9J3q5pP1
5032B6K1n8m5P4M4p4m6O2N9n1o5L6O4k6q4L1O3j7o8lP4J3q6PQ9J4p4k8P2L7o2
5063an0N7O1n4o1M2Q0m8p8K6O7l9p0NQ4j7o6J1P9K1p5j1P6L1o7l9N7N7q7m6N1
5094dP0l0p6L8O6l7q5J5P7k8j07RQ3J7p5j8R3N5q2j4Q2K9o0n7N4P5p5o9O2O1j6
5125E3q7L2P0l8r2rO3Jr8j5Q2L7o1j6R2N8n7m3P4M9n4q3N8O2m3p0L3R6k4r2LR4
$$ plain form
4908 134 99 2 40 107 55 -54 -50 23 7 -77 -78 5 31 -53 -75 6 29 -59 -100 -30 15 -27 -80 10 74 36 -9 47 119 81
4938 81 8 18 61 39 -58 -50 23 15 -56 -60 16 32 -38 -57 5 34 -38 -83 -18 41 -16 -50 4 78 54 -16 34 93 50 -25 -17 54
4970 54 35 -66 -55 17 19 -49 -58 20 43 -31 -64 9 33 -30 -66 -7 46 3 -54 9 77 42 -25 0 81 55 -30 -36 43 23 -44
5001 -44 -54 22 36 -45 -58 12 49 -14 -60 9 52 -16 -53 -9 48 4 -53 -7 71 32 -41 -28 46 34 -51 -45 34 47 -38 -45 26
5032 26 47 -11 -56 18 62 -12 -58 4 63 12 -53 -17 47 21 -63 -32 31 14 -54 -57 17 30 -56 -49 40 54 -20 -48 24 61 -1
5063 -1 -51 6 67 13 -48 -6 74 26 -52 -26 41 2 -68 -63 21 4 -62 -51 28 49 -26 -37 39 70 3 -36 21 78 -9 -55 -4
5094 -4 66 36 -40 -2 64 27 -58 -43 34 6 -101 -92 -9 8 -67 -85 8 63 -19 -33 49 78 18 -39 15 90 15 -54 8 69 53
5125 53 -34 -2 68 30 -62 -71 -8 -7 -105 -120 -38 -1 -62 -78 14 72 15 -28 46 95 41 -42 16 78 35 -35 -2 94 70 -22 -19 75
5157G5l6j08j4N3Mp3l9R6N9n3l2R1P6n5n8N6N8m5q9K4P7k3p7J7R7jr7k4P4jj19
5188h7l7O2L5q2l0Q3Q5m2l5P8Q8m1p4L2P6m1j06K6P8Kq3j0R5J7j07k7N2J3j00
5217h0p0N4P3o8n6Q6J10k2n9N6R1k0q9NP8Jj09j3Q3K9q8j3Q5L0r2p6M6L1q2q5
5247a64N3Q2k0p2P1J05Jp2K6R8nr9j4P9Nq9k5Q9M1q7l8O3M7p6q1L6M9p3p4K9R9
5278a6j7n1N0R5Pp0RQ1K2j01l5P5L6p7m9P3O1o4o2M0N4o7q1J9O0l5q6K0R9Kn5
5309f3K0R1L3o3k1N8L8q3m9O6N3p0n0N5O2m2p2K9M6l1r1J0O3j8p1K6P6K8n2j9
5339d1R3K2o7k3O8J6o9l2L6N4m4n0L9N8m7n4QN5k5o7%N6J5p1RP5K3l6l4P2L3o0
5371A2l4L7N3o2m5L6N8m5n7K5N6j3n7%N8qo7rO7K3o1nN5L2n6l0O0M2n9n0N2L8
$$ plain form
5157 75 39 -69 -83 -30 -26 -99 -138 -42 17 -36 -68 23 99 44 -14 42 100 55 -34 -10 67 44 -33 -16 81 80 -17 -41 33 32 -87
5188 -87 -124 -62 -27 -109 -139 -56 29 -13 -48 30 118 77 3 35 111 70 -36 -10 68 70 -13 -23 72 89 -18 -45 7 20 -80
5217 -80 -150 -96 -23 -91 -147 -61 49 27 -32 24 115 95 6 11 89 90 -19 -32 51 80 -8 -21 64 94 2 -74 -28 3 -79 -164
5247 -164 -111 -29 -49 -121 -50 55 56 -16 10 108 103 4 -10 69 74 -15 -40 49 90 3 -35 28 75 -1 -82 -46 3 -70 -144 -115 -16
5278 -16 -33 -84 -34 61 68 -2 7 88 110 9 -26 49 85 8 -41 32 93 29 -33 7 61 -6 -87 -68 -8 -43 -129 -109 -10 -8 -63
5309 -63 -43 48 81 18 -3 55 93 10 -39 27 80 10 -40 15 77 35 -37 -8 38 7 -84 -74 -11 -29 -100 -74 2 30 -22 -41
5339 -41 52 74 7 -16 52 68 -1 -33 3 57 13 -37 2 60 13 -41 -33 22 -3 -70 -70 -14 1 -70 -61 14 37 1 -33 39 72 12
5371 12 -22 15 68 6 -39 -3 55 10 -47 -22 34 21 -36 -36 22 14 -53 -62 5 28 -33 -38 17 49 -7 -37 23 65 6 -44 8 46
5403D6l4o6M2N1k0o7K4O2pp4J8N0K0o9k5P6Rl6l8N9K5m6l9M0M7m5n0M2M0l0m9
5434d4MP3j6m9MN3Lm5j2O4K4o4k3N6L7n5m8L8M1n2m3K4O3l5l5J8M9po8K5O0j2
5466B8m9rN6K0n2j3N1K5m0m0M1L5o1l9K2L2k3n7L3N8rn0J8N2mn9KN6J2o1nO7K6
5499F3m3k4N5K6l0n7M0K1n3m4K0K7k8n3M2N8j5m9MO4jm7k6P4J4n4qN6K8l0k5M9
5531E4L7o0n4K1L0l8o5K5M3k3m1J7O6Jm8MN8J0n7k3O5K5m9j4N9M1l5l9L8L7n7
$$ plain form
5403 46 12 -54 -12 39 19 -48 -24 38 31 -43 -25 25 45 -24 -49 27 36 0 -38 21 46 0 -39 1 48 3 -47 -5 35 5 -44
5434 -44 -40 33 17 -32 -28 25 28 -17 -29 35 59 -5 -28 28 65 10 -38 0 41 -11 -54 -30 33 -2 -37 -19 30 23 -45 -20 40 28
5466 28 -21 -30 26 46 -6 -19 32 57 17 -23 18 53 -8 -47 -25 7 -16 -73 -40 18 9 -41 -23 29 25 -34 -32 24 36 -25 -30 37 63
5499 63 20 -4 51 77 47 -10 30 51 -2 -46 -26 1 -27 -80 -38 20 5 -44 -40 24 23 -24 -50 24 38 -16 -24 32 60 30 5 54
5531 54 91 31 -23 -2 28 -10 -75 -50 -7 -30 -71 -54 12 13 -35 -31 27 37 -20 -43 22 47 -2 -16 43 84 49 10 48 85 28
$$ [...]
8191g
##END NTUPLES=NMR FID
##END=
