##TITLE=1H_AM_NVACRILAM'
 CDCl3
 8 sc, 
 30.8.2023
##JCAMPDX= 6.0         $$ Bruker NMR JCAMP-DX V2.0
##DATA TYPE= NMR FID
##DATA CLASS= NTUPLES
##ORIGIN= UXNMR, Bruker Analytische Messtechnik GmbH
##OWNER= root
$$ XWIN-NMR		Version 3.5
$$ Wed Aug 30 17:06:44 2023 Russian Standard Time (UT+4h)  she@DPX200
##.OBSERVE FREQUENCY= 200.13135
##.OBSERVE NUCLEUS= ^1H
##.DELAY= (6, 6)
##.ACQUISITION MODE= SIMULTANEOUS
##.ACQUISITION SCHEME= undefined
##.AVERAGES= 8
##.DIGITISER RES= 18
##SPECTROMETER/DATA SYSTEM= spect
##.PULSE SEQUENCE= zg30
##.SOLVENT NAME= CDCl3
##.SHIFT REFERENCE= (INTERNAL, CDCl3, 0, 15.7039)
##AUDIT TRAIL= $$ (NUMBER, WHEN, WHO, WHERE, WHAT)
$$ ##TITLE= Audit trail, XWIN-NMR		Version 3.5
$$ ##JCAMPDX= 5.01
$$ ##ORIGIN= Bruker BioSpin GmbH
$$ ##OWNER= she
$$ F:/spectra/data/she/nmr/H-F/1/audita.txt
$$ ##AUDIT TRAIL=  $$ (NUMBER, WHEN, WHO, WHERE, WHAT)
(   1,<2023-08-30 17:04:58.01 +0400>,<she>,<DPX200>,
      <created by zg, POWCHK disabled, PULCHK disabled
       configuration hash MD5:
       00 E9 B6 7A A2 85 ED C7 34 08 36 98 17 FE 4E 26
       data hash MD5: 16K
       B2 05 3B F3 26 64 D4 39 18 E3 A2 82 45 10 AA 43>)
$$ ##END=
$$ 
$$ hash MD5
$$ 65 F0 97 6E 17 06 65 94 E2 C7 C2 DF 67 28 FA 9E
##$RELAX= 
##$RELAX= 
##$RELAX= 
##$RELAX= 
##$RELAX= 
##$RELAX= 
$$ Bruker specific parameters
$$ --------------------------
##$DU= <F:/spectra>
##$EXPNO= 1
##$NAME= <H-F>
##$PROCNO= 1
##$TYPE= <nmr>
##$USER= <she>
##$AMP= (0..31)
100 100 100 100 100 100 100 100 100 100 100 100 100 100 100 100 100 100 
100 100 100 100 100 100 100 100 100 100 100 100 100 100 
##$AQSEQ= 0
##$AQ_mod= 1
##$AUNM= <au_zg>
##$AUTOPOS= <>
##$BF1= 200.13
##$BF2= 200.13
##$BF3= 200.13
##$BF4= 200.13
##$BF5= 200.13
##$BF6= 200.13
##$BF7= 200.13
##$BF8= 200.13
##$BYTORDA= 1
##$CFDGTYP= 0
##$CFRGTYP= 5
##$CHEMSTR= <none>
##$CNST= (0..31)
1 1 145 1 1 1 1 1 1 1 1 1 1 1 1 1 1 1 1 1 1 1 1 1 1 1 1 1 1 1 1 1 
##$CPDPRG= <>
##$CPDPRG1= <>
##$CPDPRG2= <>
##$CPDPRG3= <>
##$CPDPRG4= <mlev>
##$CPDPRG5= <mlev>
##$CPDPRG6= <mlev>
##$CPDPRG7= <mlev>
##$CPDPRG8= <mlev>
##$CPDPRGB= <>
##$CPDPRGT= <>
##$D= (0..31)
0 1.2 0 0 0 0 0 0 0 0.06 0 0.03 0 0 0 0 0.0002 0 0 0 0 0 0 0 0 0 0 0 0 
0 0 0 
##$DATE= 1693400697
##$DBL= (0..7)
120 120 120 120 120 120 120 120 
##$DBP= (0..7)
150 150 150 150 150 150 150 150 
##$DBP07= 0
##$DBPNAM0= <>
##$DBPNAM1= <>
##$DBPNAM2= <>
##$DBPNAM3= <>
##$DBPNAM4= <>
##$DBPNAM5= <>
##$DBPNAM6= <>
##$DBPNAM7= <>
##$DBPOAL= (0..7)
0.5 0.5 0.5 0.5 0.5 0.5 0.5 0.5 
##$DBPOFFS= (0..7)
0 0 0 0 0 0 0 0 
##$DE= 6
##$DECBNUC= <off>
##$DECIM= 32
##$DECNUC= <off>
##$DECSTAT= 4
##$DIGMOD= 1
##$DIGTYP= 9
##$DL= (0..7)
0 120 120 120 120 120 120 120 
##$DP= (0..7)
150 150 150 150 150 150 150 150 
##$DP07= 0
##$DPNAME0= <>
##$DPNAME1= <>
##$DPNAME2= <>
##$DPNAME3= <>
##$DPNAME4= <>
##$DPNAME5= <>
##$DPNAME6= <>
##$DPNAME7= <>
##$DPOAL= (0..7)
0.5 0.5 0.5 0.5 0.5 0.5 0.5 0.5 
##$DPOFFS= (0..7)
0 0 0 0 0 0 0 0 
##$DQDMODE= 0
##$DR= 18
##$DS= 0
##$DSLIST= <SSSSSSSSSSSSSSS>
$$ [...]
##$SUBNAM2= <"">
##$SUBNAM3= <"">
##$SUBNAM4= <"">
##$SUBNAM5= <"">
##$SUBNAM6= <"">
##$SUBNAM7= <"">
##$SUBNAM8= <"">
##$SUBNAM9= <"">
##$SW= 18.05172834244
##$SWIBOX= (0..15)
0 0 2 0 0 0 0 0 0 0 0 0 0 0 0 0 
##$SW_h= 3612.71676300578
##$TD= 16384
##$TD0= 1
##$TE= 0
##$TE2= 300
##$TE3= 300
##$TEG= 300
##$TL= (0..7)
0 120 120 120 120 120 120 120 
##$TP= (0..7)
150 150 150 150 150 150 150 150 
##$TP07= 0
##$TPNAME0= <>
##$TPNAME1= <>
##$TPNAME2= <>
##$TPNAME3= <>
##$TPNAME4= <>
##$TPNAME5= <>
##$TPNAME6= <>
##$TPNAME7= <>
##$TPOAL= (0..7)
0.5 0.5 0.5 0.5 0.5 0.5 0.5 0.5 
##$TPOFFS= (0..7)
0 0 0 0 0 0 0 0 
##$TUNHIN= 0
##$TUNHOUT= 0
##$TUNXOUT= 0
##$USERA1= <user>
##$USERA2= <user>
##$USERA3= <user>
##$USERA4= <user>
##$USERA5= <user>
##$V9= 5
##$VALIST= <valist>
##$VCLIST= <CCCCCCCCCCCCCCC>
##$VD= 0
##$VDLIST= <DDDDDDDDDDDDDDD>
##$VPLIST= <PPPPPPPPPPPPPPP>
##$VTLIST= <TTTTTTTTTTTTTTT>
##$WBST= 1024
##$WBSW= 4
##$XGAIN= (0..3)
0 0 0 0 
##$XL= 0
##$YL= 0
##$YMAX_a= 35723
##$YMIN_a= -58985
##$ZGOPTNS= <>
##$ZL1= 120
##$ZL2= 120
##$ZL3= 120
##$ZL4= 120
##$ABSF1= 10
##$ABSF2= 0
##$ABSG= 5
##$ABSL= 3
##$ALPHA= 0
##$AQORDER= 0
##$ASSFAC= 0
##$ASSFACI= 0
##$ASSFACX= 0
##$ASSWID= 0
##$AUNMP= <proc_1d>
##$AZFE= 0.1
##$AZFW= 0.1
##$BCFW= 1
##$BC_mod= 2
##$BYTORDP= 1
##$COROFFS= 0
##$CY= 11.3945322036743
##$DATMOD= 1
##$DC= 2
##$DFILT= <>
##$DTYPP= 0
##$F1P= 15.7292609196834
##$F2P= 12.9074282941183
##$FCOR= 0.5
##$FTSIZE= 0
##$FT_mod= 4
##$GAMMA= 1
##$GB= 0.15
##$INTBC= 1
##$INTSCL= 1
##$ISEN= 128
##$LB= 0.24
##$LEV0= 0
##$LPBIN= 0
##$MAXI= 10000
##$MC2= 0
##$MEAN= 0
##$ME_mod= 0
##$MI= 1.114404
##$NCOEF= 0
##$NC_proc= 0
##$NLEV= 6
##$NOISF1= 3.799351
##$NOISF2= 2.8
##$NSP= 1
##$NTH_PI= 0
##$NZP= 0
##$OFFSET= 15.70392
##$PC= 1
##$PHC0= -21048.4
##$PHC1= 15.85272
##$PH_mod= 1
##$PKNL= yes
##$PPARMOD= 0
##$PSCAL= 0
##$PSIGN= 0
##$REVERSE= no
##$SF= 200.130013532006
##$SI= 16384
##$SIGF1= 3
##$SIGF2= 2
##$SINO= 400
##$SIOLD= 16384
##$SREGLST= <1H.CDCl3>
##$SSB= 0
##$STSI= 0
##$STSR= 0
##$SW_p= 3612.71676300578
##$SYMM= 0
##$S_DEV= 0
##$TDeff= 0
##$TDoff= 0
##$TI= <>
##$TILT= no
##$TM1= 0
##$TM2= 0
##$TOPLEV= 0
##$USERP1= <user>
##$USERP2= <user>
##$USERP3= <user>
##$USERP4= <user>
##$USERP5= <user>
##$WDW= 1
##$XDIM= 8192
##$YMAX_p= 0
##$YMIN_p= 0
$$ End of Bruker specific parameters
$$ ---------------------------------
##NTUPLES= NMR FID
##VAR_NAME=  TIME,          FID/REAL,        FID/IMAG
##SYMBOL=    X,             R,               I
##VAR_TYPE=  INDEPENDENT,   DEPENDENT,       DEPENDENT
##VAR_FORM=  AFFN,          ASDF,            ASDF
##VAR_DIM=   8192,          8192,            8192
##UNITS=     SECONDS,       ARBITRARY UNITS, ARBITRARY UNITS
##FACTOR=    0.0002768,     1,               1
##FIRST=     0,             0,               0
##LAST=      2.2672688,     0,               0
##MIN=       0,             -58985,          0
##MAX=       2.2672688,     35723,           0
$$ Real data points
##PAGE= N=1
##DATA TABLE= (X++(R..R)), XYDATA
$$ plain form
0 0 0 0 0 0 0 0 0 0 0 0 0 0 0 0 0 0 0 0 0 -8 8 -8 8 -8 8 -14 16 -16 17 -24 24 -29 32 -37 40 -48 53 -59 65 -73
40 -73 82 -91 101 -110 125 -135 150 -166 183 -201 222 -243 270 -299 329 -365 404 -452 506 -569 645
61 645 -738 857 -1014 1229 -1545 2054 -3029 5563 -28153 -58985 -42860 -46682 -39400 -29205 -14462
76 -14462 -10261 265 11566 18746 16693 20421 22892 19797 12637 12608 11583 6236 2072 5862 7133
91 7133 4346 5894 12320 12842 10558 12779 15443 10468 5480 5243 2268 -6221 -11005 -10779 -14676 -20090
107 -20090 -18817 -15298 -15453 -15053 -8539 -3291 -2731 -248 5791 7309 5016 5366 7393 4175 118 157
123 157 392 -3422 -5353 -2183 -800 -2537 -233 4874 5152 4282 7527 9878 7155 4908 6103 4558
139 4558 -578 -2435 -1659 -4351 -7599 -6366 -4060 -5228 -4952 -1069 1437 815 1833 5136 4904 2465
$$ packed form
0@%%%%%%%%%%%%%%%%%%%qJ6j6J6j6J6k2L0l2L3m1M8n3O1o9P7q8J01j12J24j38
40g3J55j73J92k11K35k60K85l16L49l84M23m65N13n69O28o94P69q56R58j075J214
61F45j383J595j871K243k774L599n083Q592l3716l0832J6125l822P282J0195J4743
76a4462M201J0526J1301P180k053L728K471l095p160k9j025n347m164L790J271
91G133k787J548O426N22k284K221K664m975m988k37k975q489m784K26l897n414
107b0090J273L519j55M00O514N248N60K483O039J518k293L50K027l218m057L9
123A57K35l814j931L170J383j737K304N107K78q70L245K351k723k247J195j545
139D558n136j857P76k692l248J233K306j168K76L883K506o22J018L303k32k439
$$ plain form
155 2465 2325 3182 -150 -3489 -2910 -3157 -6508 -7167 -4457 -3732 -4748 -2136 1696 2229 2211 5202 6964
172 6964 5195 4570 5818 4875 1480 784 1271 -716 -3104 -2065 -1161 -2569 -2832 -382 614 -819 -43
189 -43 2126 1237 -963 -505 125 -2423 -4257 -3158 -3136 -5437 -5217 -2833 -2643 -3343 -1003 1872 1723 1992
207 1992 4349 5701 4295 4353 5615 4985 2699 2847 3347 1688 -131 777 1322 -264 -910 733 676 -1092
225 -1092 -803 313 -928 -2526 -1790 -1649 -3722 -4745 -3654 -3781 -5464 -5082 -3538 -3731 -4158 -2482 -715
242 -715 -1183 -849 1505 2399 1786 2531 4469 4251 3401 4410 5377 4270 3411 4423 4371 2707 2252 2922 1930
261 1930 466 448 865 -478 -1768 -893 -1020 -2613 -2805 -2128 -2511 -3578 -3382 -2670 -3640 -4246 -3373 -2717 -3561
280 -3561 -3398 -1951 -1371 -1672 -784 1017 1215 1145 2390 3620 2790 2559 3410 3057 1620 1415 1849 921 -91
$$ packed form
155B465j40Q57l332l339N79k47l351o59K710P25j016K612L832N33j8K991J762
172F964j769o25J248r43l395o96M87j987k388J039R04j408k63K450R96j433P76
189d3K169q89k200M58O30k548j834J099K2k301K20K384J90p00K340K875j49K69
207A992K357J352j406N8J262o30k286J48N00j659j819R08N45j586o46J643n7j768
225a092K89J116j241j598P36J41k073j023J091j27j683L82J544j93m27J676J767
242g15m68L34K354Q94o13P45J938k18q50J009R67j107q59J012n2j664m55O70r92
261A930j464j8M17j343j290Q75j27j593j92O77l83j067J96P12r70o06Q73O56q44
280c561J63J447N80l01Q88J801J98p0J245J230q30k31Q51l53j437k05M34r28j012
$$ plain form
299 -91 239 792 259 168 1527 1957 1593 2206 3136 2797 1916 2101 1979 656 -794 -1001 -1516 -3237 -3729 -3226
319 -3226 -3531 -4055 -3292 -2316 -2296 -2255 -983 -522 -866 -894 -113 -675 -1724 -1694 -1438 -1943 -2200 -1209 -216 126 1158
340 1158 3023 3934 4550 5545 6522 6562 5753 5709 4775 3024 1496 544 -846 -2654 -3512 -3325 -4226 -4560 -3858
359 -3858 -2880 -2914 -2334 -1088 -882 -1138 -821 -628 -1318 -1987 -2220 -2203 -2825 -2643 -2016 -1324 -783 618 2234 3292
379 3292 3897 5326 6160 5824 5365 5102 4013 2450 1046 107 -1412 -2841 -2993 -3143 -3801 -3514 -2451 -1783
397 -1783 -1270 -403 420 465 347 190 6 -948 -1904 -2265 -2806 -3490 -3779 -3052 -2529 -1823 -381 1214 2385
416 2385 3313 4822 5652 5418 5412 5488 4594 3066 2142 1225 -132 -1151 -1804 -1845 -2177 -2060 -1305 -903 -592 -290
436 -290 -43 -385 -836 -1293 -2085 -3468 -4127 -4749 -5553 -5835 -5620 -4757 -3937 -2812 -1073 1065 2500 3834
$$ packed form
299i1L30N53n33r1J359M30l64O13R30l39q81J85j22j323j450k07n15j721m92N03
319c226l05n24P63R76K0M1J272M61l44k8P81n62j049L0K56n05k57R91R93L42J032
340A158J865R11O16R95R77M0q09m4r34j751j528r52j390j808q58J87r01l34P02
359c858R78l4N80J246K06k56L17J93o90o69k33J7o22J82O27O92N41J401J616J058
379C292O05J429Q34l36m59k63j089j563j404r39j519j429j52j50o58K87J063O68
397a783N13Q67Q23M5j18j57j84r54r56l61n41o84k89P27N23P06J442J595J171
416B385R28J509Q30k34oP6q94j528r24r17j357j019o53m1l32J17P55M02L11L02
436b90K47l42m51m57p92j383o59o22q04k82K15Q63Q20J125J739K138J435J334
$$ plain form
454 3834 5629 6555 6773 7266 7083 6201 5281 4468 3339 1965 1163 419 -378 -734 -781 -809 -802 -872 -919 -976 -1554
475 -1554 -2162 -2814 -3614 -4517 -5265 -5921 -6315 -6454 -5877 -4898 -4268 -2782 -1115 426 1970 3513 4862 5430
493 5430 5694 6005 5805 5093 4347 3686 2629 1665 1109 545 -124 -271 48 -72 43 289 305 206 -289 -634
513 -634 -1054 -1713 -2548 -2920 -3494 -3885 -3877 -3650 -3397 -2871 -2107 -880 -131 633 1559 2386 2072 2837 2623 2293 1855
534 1855 1369 736 125 -256 -352 -536 -583 -351 -167 301 545 830 1266 1441 1019 1248 842 251 -179 -388 -878
555 -878 -1459 -1426 -1374 -1500 -1245 -796 -274 -107 356 726 898 1068 973 947 624 203 40 -317 -787 -1009 -935 -1007
577 -1007 -1082 -870 -420 -176 -114 171 557 375 553 764 618 230 444 339 -49 -84 18 35 -117 -16 317
598 317 310 238 572 548 503 507 570 306 -132 -234 -296 -570 -963 -981 -997 -1119 -1268 -1022 -819 -782 -509 -94 -11 130 595
$$ packed form
454C834J795R26K18M93j83q82r20q13j129j374q02p44p97l56m7k8Pp0m7n7n78
475a554o08o52q00r03p48o56l94j39N77R79O30J486J667J541J544J543J349N68
493E430K64L11k00p12p46o61j057r64n56n64o69j47L19j20J15K46J6r9m95l45
513f34m20o59q35l72n74l91QK27K53N26P64J227P49P64R26Q27l14P65k14l30m38
534A855m86o33o11l81r6j84m7K32J84M68K44K85M36J75m22K29m06n91m30k09m90
555h78n81L3N2j26K55M49N22J67M63L70J72J70r5k6l23m21j63l57m70k22P4p2
577a007p5K12M50K44O2K85L86j82J78K11j46l88K14j05l88l5J02J7j52J01L33
598C17pp2L34k4m5MO3k64m38j02o2k74l93j8j6j22j49K46K03L7K73M15Q3J41M65
$$ plain form
623 595 1053 1048 1019 1245 1305 1153 1102 1396 870 682 609 365 -134 -312 -500 -707 -1081 -1122 -1084 -1171 -1808 -1488 -1347
646 -1347 -1271 -1452 -1041 -782 -888 -702 -255 -157 -164 327 738 885 1010 1574 1739 1801 2064 2257 2124 1950 1895 1686
668 1686 1303 586 316 -49 -858 -1307 -1362 -1704 -2194 -2084 -1787 -1883 -1813 -1373 -804 -750 -441 -5 186 4 234
689 234 384 240 74 268 473 191 147 628 691 444 784 1000 950 592 999 651 101 -162 -105 -517 -781 -806
711 -806 -867 -910 -940 -506 -181 202 364 1193 1334 1404 1423 1728 1537 1066 953 635 -123 -746 -933 -1088 -1723 -1946
733 -1946 -1658 -1788 -1911 -1409 -1117 -930 -1122 -591 -273 -430 -381 -121 -43 -332 -24 566 478 621 1327 1827 1968
754 1968 2327 2812 2886 2592 2628 2609 1992 1105 858 300 -605 -1282 -1687 -2306 -2898 -2972 -2672 -2832 -2845 -2151 -1755 -1753
776 -1753 -1385 -720 -565 -548 -492 77 162 178 395 815 722 996 1575 2037 1947 2430 2678 2616 2478 2352 2292 1537 933
$$ packed form
623E95M58nk9K26O0j52n1K94n26j88p3k44m99j78j88k07l74m1L8q7o37L20J41
646a347P6j81M11K59j06J86M47R8pM91M11J47J25N64J65O2K63J93j33j74n5k09
668A686l83p17k70l65q09m49n5l42m90J10K97r6P0M40N69N4L09M36J91j82K30
689B34J50j44j66J94K05k82m4M81O3k47L40K16n0l58M07l48n50k63N7m12k64k5
711h06o1m3l0M34L25L83J62Q29J41P0J9L05j91m71j13l18p58o23j87j55o35k23
733a946K88j30j23N02K92J87j92N31L18j57M9K60P8k89L08N90q8J43P06N00J41
754A968L59M85P4k94L6j9o17q87k47n58r05o77m05o19n92p4L00j60j3O94L96K
776a753L68O65J55J7N6N69Q5J6K17M20r3K74N79M62r0M83K48o2j38j26o0p55o04
$$ plain form
799 933 637 -11 -754 -1419 -1697 -1972 -2593 -2561 -2418 -2358 -2511 -1984 -1532 -1471 -1295 -768 -531 -370 -274 184 154 422
821 422 634 1038 985 1317 1859 2196 2064 2383 2536 2374 1950 1812 1673 1145 571 195 -480 -1256 -1676 -1903 -2068
842 -2068 -2774 -2619 -2487 -2443 -2401 -1782 -1409 -1314 -970 -305 -234 -38 491 994 900 989 1524 1734 1789 2139 2131 2175 1954
865 1954 2163 2156 1780 1314 1007 746 27 -750 -764 -1455 -2025 -2282 -2174 -2389 -2707 -2450 -1935 -1865 -1605 -949 -615
886 -615 -426 69 612 799 914 1373 1505 1443 1605 1577 1683 1459 1222 1448 1217 659 651 708 64 -460 -499 -670
908 -670 -1202 -1373 -1267 -1511 -1891 -1495 -1254 -1220 -1258 -800 -283 -336 112 527 939 680 1121 1192 1198 1021 1356 1267 918
931 918 752 695 501 145 -34 57 -267 -856 -644 -715 -960 -1081 -950 -979 -965 -688 -561 -585 -412 -137 240 143 289
954 289 644 618 622 878 834 880 748 729 812 377 242 332 38 -172 -358 -266 -465 -643 -817 -743 -750 -868 -686 -385
$$ packed form
799I33k96o48p43o65k78k75o21L2J43O0j53N27M52O1J76N27K37J61R6M58l0K68
821D22K12M04n3L32N42L37j32L19J53j62m24j38j39n28n74l76o75p76m20k27j65
842b068p06J55J32M4M2O19L73R5L44O65P1J96N29N03r4Q9N35K10N5L50qM4k21
865A954K09pl76m66l07k61p19p77j4o91n70k57J08k15l18K57N15P0K60O56L34
886f15J89M95N43J87J15M59J32o2J62k8J06k24k37K26k31n58qN7o44n24l9j71
908f70n32j71J06k44l80L96K41L4l8M58N17n3M48M15M12k59M41P1Oj77L35q9l49
931I18j66n7j94l56j79R1l24n89K12p1k45j21J31k9J4K77J27k4J73K75L77r7J46
954B89L55k6MK56m4M6j32j9Q3m35j35R0k94k10j86R2j99j78j74P4pj18J82L01
$$ plain form
978 -385 -526 -460 20 -75 10 6 444 514 384 658 569 420 528 416 448 425 452 276 -3 -133 -52 -221 -414 -569
1002 -569 -391 -351 -594 -555 -368 -436 -627 -229 -51 -87 -116 130 348 263 591 579 674 457 433 572 599 589 279 95
1026 95 86 85 -18 -239 -380 -470 -442 -494 -677 -767 -555 -767 -789 -625 -609 -497 -451 -115 -159 79 239 437 517 634 814
1051 814 925 881 910 1095 1039 795 789 604 413 277 174 19 -310 -306 -358 -499 -777 -733 -863 -1204 -1215 -1179 -1050 -1214
1075 -1214 -1086 -859 -690 -789 -591 -37 48 343 809 979 1067 1284 1473 1542 1509 1630 1591 1243 1111 927 705 414
1097 414 -53 -149 -190 -745 -943 -990 -1350 -1480 -1147 -1387 -1406 -1499 -1296 -1255 -1397 -1101 -818 -728 -419 -60 171 463
1119 463 751 1054 1500 1519 1764 1837 1722 1646 1618 1476 1059 673 274 -2 -397 -755 -904 -1121 -1298 -1194 -1236 -1252
1141 -1252 -1253 -889 -907 -849 -607 -313 -207 -165 131 58 168 466 488 802 896 811 1154 1275 1127 1217 878 820 666
$$ packed form
978c85j41O6M80r5Q5mM38P0j30K74q9j49J08j12L2k3K7j76k79j30Q1j69j93j55
1002e69J78M0k43L9J87o8j91L98J78l6k9K46K18q5L28j2R5k17k4J39K7j0l10j84
1026I5rjj03k21j41r0K8n2j83r0K12k12k2J64J6J12M6L36m4K38J60J98Q0J17J80
1051H14J11m4K9J85n6k44oj85j91j36j03j55l29Mn2j41k78M4j30l41j1L6J29j64
1075a214J28K27J69r9J98N54Q5K95M66J70Q8K17J89O9l3J21l9l48j32j84k22k91
1097D14m67r6m1n55j98m7l60j30L33k40j9r3K03M1j42K96K83R0L09L59K31K92
1119D63K88L03M46J9K45P3j15p6k8j42m17l86l99k76l95l58j49k17j77J04m2j6
1141a252jL64j8N8K42K94J06M2K96p3J10K98K2L14R4q5L43J21j48R0l39n8j54
$$ plain form
1164 666 332 192 -398 -607 -840 -1223 -1439 -1447 -1363 -1220 -1267 -834 -766 -577 0 194 309 440 660 658 674 629 687
1187 687 589 577 487 483 634 317 349 418 466 175 263 352 131 -258 -216 -407 -767 -993 -994 -1130 -1193 -870 -1101 -919 -530
1212 -530 -219 59 302 335 637 822 957 921 841 467 324 359 192 -136 -119 -109 -89 -187 0 187 -19 92 137
1235 137 264 46 -58 16 -62 -427 -521 -588 -587 -664 -526 -411 -372 -322 7 86 227 323 683 666 619 372 560 289
1259 289 168 93 40 -202 -182 -320 -160 140 41 393 282 403 396 348 112 212 -190 -243 -539 -559 -821 -955 -896
1282 -896 -968 -865 -764 -575 -513 -241 -34 -1 478 574 357 650 596 558 598 610 666 563 615 746 639 620 661 652 544
1307 544 460 363 374 -56 -196 -462 -515 -800 -980 -1037 -1305 -1368 -1265 -1180 -1118 -1052 -680 -561 -487 -149 14 166 414
1330 414 437 759 741 658 950 709 895 957 927 731 733 906 969 712 707 652 640 218 -10 19 -135 -553 -578 -649 -790
$$ packed form
1164F66l34j40n90k09k33l83k16qQ4J43m7M33O8J89N77J94J15J31K20kJ6m5N8
1187F87r8j2r0mJ51l17L2O9M8k91Q8Q9k21l89M2j91l60k26jj36o3L23k31J82L89
1212e30L11K78K43L3L02J85J35l6q0l74j43L5j67l28J7J0K0r8J87J87k06J11M5
1235A37J27k18j04P4p8l65r4o7Jp7J38J15L9N0L29P9J41R6L60j7m7k47J88k71
1259B89j21p5n3k42K0j38J60L00r9L52j11J21pm8k36J00m02n3k96k0k62j34N9
1282h96p2J03J01J89O2K72K07L3M79R6k17K93n4l8M0J2N6j03N2J31j07j9M1rj08
1307E44q4r7J1m30j40k66n3k85j80n7k68o3J03Q5O2O6L72J19P4L38J63J52K48
1330D14K3L22j8q3K92k41J86O2l0j96KJ73O3k57nn5j2m22k28K9j54m18k5p1j41
$$ plain form
1355 -790 -851 -757 -869 -931 -899 -839 -1044 -918 -794 -508 -381 -347 -164 -8 -144 80 432 289 505 570 964 659
1377 659 707 778 877 880 704 835 579 754 595 476 617 281 191 6 -75 -354 -350 -527 -841 -803 -918 -1018 -1058 -818
1401 -818 -751 -924 -630 -325 -323 -181 -103 172 222 273 531 416 502 406 401 538 457 460 443 435 448 564 576 384 425 365 314
1428 314 177 74 -48 -84 -203 -418 -561 -694 -896 -808 -752 -769 -500 -319 -89 -90 21 138 231 201 317 242 149
1451 149 111 108 108 -46 77 7 195 189 503 749 704 750 827 904 793 626 463 235 -129 -136 -432 -690 -989 -1164 -998
1476 -998 -943 -856 -823 -774 -806 -557 -202 -247 -162 -106 -169 -326 -256 -36 -180 -236 -2 440 408 656 970 1182 1421 1727
1500 1727 1693 1711 1434 1107 1115 561 108 -209 -657 -1026 -1277 -1442 -1428 -1540 -1534 -1175 -892 -1048 -795 -474 -438 -326
1522 -326 -208 -142 -276 -292 -71 -92 47 89 397 476 615 948 1179 1410 1353 1396 1429 1103 1053 593 205 -278 -452
$$ packed form
1355g90o1R4j12o2L2O0k05J26J24K86J27L4J83J56j36K24L52j43K16O5L94l05
1377F59M8P1R9Lj76J31k56J75j59j19J41l36r0j85q1k79Mj77l14L8j15j00m0K40
1401h18O7j73K94L05KJ42P8K75N0N1K58j15Q6r6nJ37q1Lj7qJ3J16J2j92M1o0n1
1428C14j37j03j22l6j19k15j43j33k02Q8N6j7K69J81K30jJ11J17R3l0J16p5r3
1451A49l8l%j54J23p0J88oL14K46m5M6P7P7j11j67j63k28l64pk96k58k99j75J66
1476i98N5Q7L3M9l2K49L55m5Q5N6o3j57P0K20j44n6K34M42l2K48L14K12K39L06
1500A727l4J8k77l27Qn54m53l17m48l69k51j65J4j12OL59K83j56K53L21L6J12
1522c26J18O6j34j6K21k1J39M2L08P9J39L33K31K31n7M3L3l26n0m60l88m83j74
$$ plain form
1545 -452 -539 -1152 -1250 -1022 -1200 -917 -836 -524 -193 -9 154 479 387 328 363 242 136 -23 -172 -187 -374 -392 -316
1568 -316 -309 -285 -118 121 282 342 299 219 172 111 -109 -341 -582 -605 -725 -643 -506 -569 -234 -95 194 512 769 1187
1592 1187 1269 1371 1391 1165 977 910 436 104 -114 -191 -382 -703 -782 -764 -811 -808 -449 -415 -408 -235 -286 -446 -370 -426 -605
1617 -605 -587 -773 -627 -725 -597 -240 120 167 593 909 1275 1304 1436 1645 1477 1105 1034 793 394 276 -127 -371
1639 -371 -445 -684 -734 -703 -731 -620 -665 -574 -582 -666 -276 -504 -632 -569 -746 -634 -675 -501 -297 -452 -58 38 432 591
1663 591 1044 1123 1138 1457 1460 1240 992 882 759 335 40 -74 -353 -342 -714 -632 -931 -885 -817 -734 -785 -765 -750 -703
1687 -703 -802 -592 -762 -583 -645 -351 -113 -144 -50 444 610 602 741 1126 1121 1087 1198 1323 1193 1051 860 517 371
1710 371 177 -116 -368 -623 -522 -560 -763 -1006 -864 -790 -847 -838 -672 -785 -715 -610 -510 -473 -467 -326 -24 -135 59
$$ packed form
1545d52q7o13r8K28j78K83Q1L12L31J84J63L25r2n9L5j21j06j59j49j5j87j8P6
1568c16PK4J67K39J61O0m3q0m7o1k20k32k41k3j20Q2J37o3L35J39K89L18K57M18
1592A187Q2J02K0k26j88o7m74l32k18p7j91l21p9J8m7LL59L4PJ73n1j60P6n6j79
1617f05J8j86J46r8J28L57L60M7M26L16L66K9J32K09j68l72p1k41l99j18m03k44
1639c71p4k39n0L1k8J11m5R1qq4L90k28j28O3j77J12m1J74K04j55L94R6L94J59
1663E91M53P9J5L19Lk20k48j10j23m24k95j14k79J1l72Q2k99M6O8Q3n1K0J5M7
1687g03r9K10j70J79o2K94K38l1R4M94J66qJ39L85nl4J11J25j30j42j91l43j46
1710C71j94k93k52k55J01l8k03k43J42P4n7RJ66j13P0J05J00L7OJ41L02j11J94
$$ plain form
1733 59 195 309 275 314 555 698 602 708 781 519 603 602 557 403 520 414 280 138 -15 156 85 -69 -188
1756 -188 80 -191 -200 -148 -46 -320 -360 -128 -206 -470 -318 -224 -456 -642 -638 -591 -750 -749 -697 -754 -789 -607 -396 -189 -141
1781 -141 231 325 548 615 776 936 949 985 964 997 686 860 628 585 532 514 259 291 111 175 19 -215 -317 -538
1805 -538 -726 -1101 -969 -1017 -1209 -1415 -1493 -1321 -1229 -1092 -811 -590 -357 140 308 649 829 986 1209 1193 1115 1261
1827 1261 922 748 909 577 534 438 407 169 190 34 150 77 -104 -177 -165 -441 -641 -704 -990 -1112 -1054 -1060 -976 -950
1851 -950 -597 -485 -309 -56 259 485 691 816 1000 966 937 921 915 485 454 357 250 96 -55 -26 -40 -42 -30 59
1875 59 55 -178 -12 -42 -512 -466 -669 -606 -957 -901 -841 -929 -877 -633 -468 -179 60 438 547 722 934 1024 1054 794
1899 794 719 713 533 310 76 169 -132 -32 -247 -24 -103 163 288 69 169 -13 -55 -123 -321 -427 -497 -857 -761
$$ packed form
1733E9J36J14l4L9K41J43r6J06P3k62Q4jm5j54J17j06j34j42j53J71p1j54j19
1756a88K68k71rN2J02k74m0K32p8k64J52R4k32j86MM7j59JN2n7l5J82K11K07M8
1781a41L72R4K23O7J61J60J3L6k1L3l11J74k32m3n3j8k55L2j80O4j56k34j02k21
1805e38j88l75J32m8j92k06p8J72R2J37K81K21K33M97J68L41J80J57K23j6p8J46
1827A261l39j74J61l32m3r6l1k38K1j56J16p3j81p3J2k76k00o3k86j22N8oQ4K6
1851i50L53J12J76K53L15K26K06J25J84l4k9j6om30l1r7j07j54j51K9j4kJ2Q9
1875E9mk33J66l0m70M6k03O3l51N6O0q8N2K44J65K89K39L78J09J75K12R0L0k60
1899G94p5oj80k23k34R3l01J00k15K23p9K66J25k19J00j82m2o8j98j06p0l60R6
$$ plain form
1922 -761 -611 -692 -664 -357 -262 -108 158 319 660 413 598 706 631 378 417 229 -59 -224 -377 -430 -561 -384
1944 -384 -499 -406 -98 111 246 278 606 624 431 398 396 524 274 62 -83 -44 -77 24 136 77 80 120 243 402
1968 402 113 -96 -66 -10 -322 -756 -734 -951 -985 -1077 -1055 -996 -971 -736 -614 -374 -12 515 457 673 794 833 899 941
1992 941 1004 905 605 889 837 554 383 386 381 425 466 314 212 103 -24 -174 -569 -652 -893 -936 -975 -1245 -1114 -1161
2016 -1161 -1053 -1004 -802 -610 -426 14 275 451 369 584 804 637 922 777 576 511 425 631 406 314 389 444
2038 444 326 200 335 328 5 152 41 -217 -201 -225 -475 -577 -561 -395 -642 -474 -542 -408 -340 -257 -91 36 113
2061 113 201 157 98 157 132 100 143 326 154 193 75 95 80 219 75 3 249 301 295 251 397 117 65 147 0 -50
2087 -50 -317 -210 -255 -282 -405 -403 -369 -170 -326 -199 -215 -89 -138 -72 -18 -40 -15 62 51 23 125 55 223 243 341 297
$$ packed form
1922g61J50q1K8L07R5J54K66J61L41k47J85J08p5k53L9j88k88j65j53n3j31J77
1944c84j15R3L08K09J35L2L28J8j93l3kJ28k50k12j45L9l3J01J12n9LM0J23J59
1968D02k89k09L0N6l12m34K2k17l4r2K2N9K5K35J22K40L62N27n8K16J21L9O6M2
1992I41O3r9l00K84n2k83j71LnM4M1j52j02j09j27j50l95q3k41m3l9k70J31m7
2016a161J08M9K02J92J84M40K61J76q2K15K20j67K85j45k01o5q6K06k25r2P5N5
2038D44j18j26J35pl23J47j11k58J6k4k50j02J6J66k47J68o8J34O8Q3J66J27P7
2061A13Q8m4n9N9k5l2M3J83j72L9j18K0j5J39j44p2K46N2om4J46k80n2Q2j47n0
2087e0k67J07m5k7j23KL4J99j56J27j6J26m9O6N4k2K5P7j1k8J02p0J68K0R8m4
$$ plain form
2113 297 442 430 380 372 456 497 272 203 317 94 -4 -97 -92 -237 -408 -357 -395 -584 -591 -557 -501 -585 -336 -537 -294 -296 -304
2140 -304 -129 -147 -158 85 325 203 230 204 247 426 466 475 537 432 542 605 488 557 584 408 490 313 302 200 67
2165 67 -28 -248 -442 -787 -717 -813 -916 -719 -801 -610 -783 -706 -521 -418 -339 -154 -131 39 -9 25 106 224 213 420
2189 420 580 474 536 608 876 801 773 813 879 687 565 325 270 49 40 -278 -391 -503 -516 -689 -823 -787 -498 -465
2213 -465 -520 -375 -368 -276 -262 -80 -103 8 -66 -28 4 -25 -97 4 152 203 317 517 507 450 442 506 453 413 302 248 19
2240 19 -7 -316 -320 -310 -413 -358 -399 -172 -147 -143 -173 3 165 200 127 100 106 -105 -84 -253 -266 -332 -526 -451 -478 -307 -72
2267 -72 114 25 40 246 335 194 300 171 100 -23 -41 10 -39 -95 -181 4 -112 1 57 65 141 241 150 78 106 56
2293 56 -123 -5 -272 -376 -376 -467 -430 -252 -359 -86 -103 113 189 245 351 404 315 474 377 271 162 219 122 -139
$$ packed form
2113B97J45j2n0qQ4M1k25o9J14k23r8r3Nj45j71N1l8j89pL4N6q4K49k01K43kq
2140c04J75j8j1K43K40j22K7k6M3J79M0RO2j05J10O3j17O9K7j76Q2j77j1j02j33
2165F7r5k20j94l45P0r6j03J97q2J91j73P7J85J03P9J85K3J70m8L4Q1J18j1K07
2189D20J60j06O2P2K68p5k8M0O6j92j22k40n5k21rl18j13j12j3j73j34L6K89L3
2213d65n5J45PR2J4J82k3J11p4L8L2k9p2J01J48N1J14K00j0n7qO4n3m0j11n4k29
2240A9k6l09mJ0j03N5m1K27K5Ml0J76J62L5p3k7Ok11K1j69j3o6j94P5k7J71K35
2267g2J86q9J5K06Q9j41J06j29p1j23j8N1m9n6q6J85j16J13N6QP6J00r1p2K8n0
2293E6j79J18k67j04%r1L7J78j07K73j7K16P6N6J06N3q9J59r7j06j09N7r7k61
$$ plain form
2317 -139 -38 -122 -99 -200 -46 8 -18 120 -40 61 -77 20 -120 -157 -194 -267 -36 -171 -196 -335 62 -203 -76
2340 -76 30 211 296 261 348 179 305 298 177 64 -84 -64 -71 -96 -145 -9 -234 -156 -133 118 148 42 245 293 230
2365 230 232 378 111 109 156 198 3 28 68 -2 -120 -104 -69 -62 -225 -136 -186 -159 -217 -143 -238 -330 -452 -486 -340 -223 -422
2392 -422 -119 -65 -91 28 184 198 242 513 529 531 532 516 690 285 434 335 259 139 -5 18 -104 -157 -115 -258 -333
2417 -333 -290 -269 -414 -608 -292 -187 -494 -527 -549 -423 -51 -323 -186 -173 -112 150 331 150 253 339 453 618
2439 618 486 469 397 445 463 435 318 206 271 219 -105 -58 -98 -11 -159 -134 -241 -211 -351 -336 -150 -382 -494 -297
2463 -297 -172 -216 -278 -78 5 -50 -139 61 50 253 135 257 204 246 328 151 275 268 226 174 198 175 138 -59 77
2488 77 143 50 -81 -187 -97 -150 -152 -134 -319 -228 -209 -279 131 -164 0 89 97 -110 13 141 77 102 109 104 123 100 -44
$$ packed form
2317a39J01q4K3j01J54N4k6J38j60J01j38R7j40l7l7p3K31j35k5j39L97k65J27
2340g6J06J81Q5l5Q7j69J26pj21j13j48K0pk5m9J36k25P8K3K51L0j06K03M8o3
2365B30KJ46k67kM7M2j95K5M0p0j18J6L5Pj63Q9n0K7n8P4r5r2j22l4J46J17j99
2392d22L03N4k6J19J56J4M4K71J6KJj6J74m05J49r9p6j20j44K3j22n3M2j43p5
2417c33M3K1j45j94L16J05l07l3k2J26L72k72J37J3O1K62J81j81J03Q6J14J65
2439F18j32j7p2M8J8k8j17j12O5n2l24M7m0Q7j48K5j07L0j40J5J86k32j12J97
2463b97J25m4o2K00Q3n5q9K00j1K03j18J22n3M2Q2j77J24pm2n2K4k3l7j97J36
2488G7O6r3j31j06R0n3kJ8j85R1J9p0M10k95J64Q9Qk07J23J28o4K5PnJ9k3j44
$$ plain form
2515 -44 289 158 -6 -48 -106 58 131 147 -58 -186 -68 -87 -177 -91 11 -94 -94 13 110 55 -1 -40 47 -122 -29
2540 -29 -5 23 -55 12 -37 -122 -247 -124 -207 -146 -53 135 -276 -93 104 -4 117 86 180 34 114 239 309 135 236
2565 236 78 294 245 94 105 261 123 17 209 -47 -89 -56 -208 -35 -143 -388 -409 -458 -345 -364 -433 -332 -216
2588 -216 -227 -152 43 140 251 47 241 468 323 227 361 453 334 193 398 271 89 267 269 166 232 -73 -18
2611 -18 37 -295 -155 -158 -283 -426 -508 -478 -441 -544 -375 -120 -320 -226 -267 52 50 257 327 191 325 559 195 350
2635 350 273 228 257 234 132 145 285 24 12 -27 -164 -225 -122 -173 -323 -223 -89 -360 -265 -146 -37 -216 -100
2658 -100 -68 -55 -72 85 244 88 369 223 240 191 306 395 18 178 72 165 95 7 106 -28 -71 -209 -221 -533
2682 -533 -256 -197 8 -251 -112 -112 -280 -233 -102 -57 -145 231 -47 57 51 148 174 237 331 392 296 210 300 215 122 72
$$ packed form
2515d4L33j31j64m2n8J64P3J6k05j28J18j9r0Q6J02j05%J07R7n5n6l9Q7j69R3
2540b9K4K8p8O7m9q5j25J23q3O1R3J88m11J83J97j08J21l1R4j46Q0J25P0j74J01
2565B36j58K16m9j51J1J56j38j06J92k56m2L3j52J73j08k45k1m9J13j9o9J01J16
2588b16j1P5J95R7J11k04J94K27j45r6J34R2j19j41K05j27j82J78Kj03O6l05N5
2611a8N5l32J40lj25j43q2L0L7j03J69K55k00R4m1L19kK07P0j36J34K34l64J55
2635C50p7m5K9k3j02J3J40k61j2l9j37o1J03n1j50J00J34k71R5J19J09j79J16
2658a00L2J3j7J57J59j56K81j46J7m9J15Q9l77J60j06R3p0q8R9j34m3j38j2l12
2682e33K77N9K05k59J39%j68M7J31M5q8L76k78J04oR7K6O3R4O1r6q6R0q5r3n0
$$ plain form
2708 72 53 -127 -3 1 -141 -199 -171 -240 -308 -103 -328 -234 -280 -142 -249 -112 -309 -90 -45 -61 -26 -51 58 110 155
2733 155 159 77 156 286 239 298 157 174 150 267 71 -43 33 -43 -79 -212 14 -166 -134 -101 -217 -208 -315 -250 -175 -241
2759 -241 -205 -233 85 -72 1 55 282 183 161 130 183 266 187 208 211 178 112 179 92 27 -10 47 -71 -149 -235 -194 -311 -294
2787 -294 -172 -148 -230 -233 -168 -208 -151 114 -78 -202 37 268 97 107 128 119 246 -91 265 153 77 162 164 6 43
2812 43 89 53 -171 -84 -231 -230 -167 -164 -112 -228 -348 -210 -44 -167 -86 -31 -116 -141 93 -7 212 206 190 165 117 176 -67
2839 -67 14 -32 248 98 -74 -110 36 116 -257 -33 -51 -252 -171 -218 -105 -37 -44 60 131 -2 -63 177 100 17 100
2864 100 132 42 129 180 193 74 81 217 -54 68 -60 59 -119 -120 -19 -72 -259 -75 -80 -93 -224 -7 30 46 -138
2889 -138 175 -58 -58 143 133 178 35 227 127 253 24 128 128 118 -119 213 35 41 59 30 -147 -153 -239 -108 -183
$$ packed form
2708G2j9j80J24Mj42n8K8o9o8K05k25R4m6J38j07J37j97K19M5j6L5k5J09N2M5
2733A55Mq2P9J30m7N9j41J7k4J17j96j14P6p6l6j33K26j80L2L3j16Rj07O5P5o6
2759b41L6k8L18j57P3N4K27r9k2l1N3Q3p9K1Ll3o6O7q7o5l7N7j18p8q6M1j17J7
2787b94J22K4q2lO5m0N7K65j92j24K39K31j71J0K1rJ27l37L56j12p6Q5Kj58L7
2812D3M6l6k24Q7j47JO3LN2j16j20J38J66j23Q1N5q5k5K34j00K19oj6k5m8N9k43
2839f7Q1m6K80j50j72l6J46Q0l73K24j8k01Q1m7J13O8pJ04P1j33o1K40p7q3Q3
2864A00L2r0Q7N1J3j19PJ36k71J22j28J19j78jJ01n3j87J84nj3j31K17L7J6j84
2889a38L13k33%K01j0M5j43J92j00J26k29J04%j0k37L32j78OJ8k9j77oq6J31p5
$$ plain form
2914 -183 -174 -1 -22 -119 -62 -50 -100 -61 -50 145 113 83 88 87 130 79 172 23 27 127 174 56 82 45 117 -75 -5 -26 -113
2943 -113 -37 79 -58 -95 -74 -169 -109 -45 -110 -13 -76 81 -102 -47 130 -24 235 342 74 194 154 158 40 111 228
2968 228 97 104 -53 -83 -50 -70 -128 1 -53 -347 -26 -76 -214 -55 -78 -83 -52 -45 -179 -56 -176 54 -49 -33 -95
2993 -95 197 136 75 192 98 253 135 164 310 121 204 -73 -72 5 -55 -127 -103 -240 -210 -167 -193 -18 -211 -450 -380
3018 -380 -305 -129 -198 -53 101 -59 -139 48 189 64 152 440 373 287 274 417 251 204 352 268 75 155 -39
3041 -39 -112 -163 -95 -127 -343 -313 -74 -292 -389 -148 -224 -118 -160 -318 -26 -316 -10 -127 -75 104 104 90 157 81 249
3066 249 181 316 197 248 216 239 221 67 35 96 40 165 -208 -182 -249 -104 -162 -129 -3 -109 -186 61 -26 -70 -65 -142
3092 -142 -68 -84 -278 -51 -7 -25 103 15 126 -103 115 23 -42 55 107 88 131 -32 -7 -78 -246 63 -61 -92 -113
$$ packed form
2914a83RJ73k1r7N7J2n0L9J1J95l2l0NjM3n1R3j49MJ00M7j18K6l7P2j92P0k1q7
2943a13P6J16j37l7K1r5O0O4o5R7o3J57j83N5J77j54K59J07k68J20m0Mj18P1J17
2968B28j31Pj57l0L3k0n8J29n4k94L21n0j38J59k3nL1Pj34J23j20K30j03J6o2
2993i5K92o1o1J17r4J55j18K9J46j89Q3k77JP7o0p2K4j37L0M3k6J75j93k39P0
3018c80P5J76o9J45J54j60q0J87J41j25Q8K88o7q6j3J43j66m7J48q4j93Q0j94
3041c9p3n1O8l2k16L0K39k18r7K41p6J06m2j58K92k90L06j17N2J79%j4O7p6J68
3066B49o8J35j19N1l2K3j8j54l2O1n6J25l73K6o7J45n8L3J26j06p7K47q7m4Np7
3092a42P4j6j94K27M4j8J28q8J11k29K18r2o5R7N2j9M3j63K5p1j68L09j24l1k1
$$ plain form
3117 -113 -33 -126 -145 -35 85 68 -37 -76 94 121 1 -84 -20 -18 -122 -54 -106 -153 -205 -88 -150 -259 -104 89 43
3142 43 -53 284 134 29 -17 125 -27 71 42 146 24 17 -81 11 32 82 15 0 -187 1 -35 -2 -119 109 -40
3167 -40 -129 -237 -121 -264 -172 -83 -192 -114 -178 113 -108 85 72 92 158 99 142 20 251 -35 206 86 55 62 119
3192 119 254 140 13 8 -40 7 -13 -59 -24 -16 -127 -66 -69 -174 -186 -152 -99 -94 -305 -202 -231 -135 88 -95 -200 -133 -30
3219 -30 -25 -60 -104 -7 181 55 57 14 -56 104 79 96 41 71 120 42 82 178 153 245 49 43 -100 -4 -21 -51 -124 -85 -123
3248 -123 -130 -46 -40 -66 -78 -79 -15 -114 -120 -24 -11 55 -4 -80 -64 120 -54 12 35 17 -10 63 15 78 -56 91 -57 159 136
3277 136 136 144 50 192 -26 34 260 -33 79 135 -76 -154 58 51 -66 -7 -55 106 -73 -77 -116 -150 -295 -115 -216
3302 -216 -239 -373 -11 -149 -126 -108 -103 -28 58 -67 48 300 140 64 270 281 121 142 172 127 257 16 144 -139
$$ packed form
3117a13Q0r3j9J10J20j7j05l9J70K7j20q5O4Kj04O8n2m7n2J17o2j09J55J93m6
3142D3r6L37j50j05m6J42j52R8k9J04j22pr8R2K1N0o7j5j87J88l6L3j17K28j49
3167d0q9j08J16j43R2Q9j09P8o4K91k21J93j3K0O6n9M3j22K31k86K41j20l1PN7
3192A19J35j14j27nm8M7k0m6L5Qj11O1lj05j2L4N3Nk11J03k9R6K23j83j05O7J03
3219c0Nl5m4R7J88j26Km3p0J60k5J7n5L0M9p8M0R6k5R2j96oj43R6j7l0p3L9l8
3248a23pQ4Ok6j2jO4r9oR6J3O6n9p6J6J84j74O6K3j8k7P3m8O3j34J47j48K16k3
3277A36%Qr4J42k18O0K26k93J12N6k11p8K12pj17N9m8J61j79ml9l4j45J80j01
3302b16k3j34L62j38K3J8NP5Q6j25J15K52j60p6K06J1j60K1L0m5J30k41J28k83
$$ plain form
3326 -139 77 -94 -48 159 -47 -35 19 -66 -36 49 -183 -192 -62 -14 -97 -155 -107 31 -187 77 -38 68 -54 64
3350 64 73 253 303 267 101 169 210 49 14 18 -14 111 -30 -35 -38 67 -96 8 -110 -146 -43 7 -84 29 -87 -260
3376 -260 4 -13 -291 -200 -258 -207 -78 -162 -211 -5 -98 -44 -5 20 137 111 115 33 148 -23 111 0 164 75 272
3401 272 -39 1 -19 197 145 58 163 94 212 86 -79 -44 -29 -124 -168 -302 -398 -267 -75 -324 -232 -263 -300 -69
3425 -69 -96 -133 -46 59 -3 37 228 89 109 300 79 227 199 259 279 256 186 153 227 118 195 125 43 114 -90 -84 -223
3452 -223 -209 -364 -229 -342 -372 -339 -536 -353 -306 -252 -140 -132 -181 -166 -158 -228 181 -77 214 53 110 113 115 198 279 400
3478 400 302 238 246 259 191 255 164 88 60 -47 -154 -15 -114 -124 -188 -270 -243 -209 -135 -194 -336 -210 -215 -145 -112 -126 -96 39
3506 39 89 -148 48 -75 76 -45 -25 143 89 206 107 210 137 105 262 178 75 -46 149 12 12 -20 100 23
$$ packed form
3326a39K16j71M6K07k06J2N4q5L0Q5k32rJ30M8q3n8M8J38k18K64j15J06j22J18
3350F4RJ80N0l6j66O8M1j61l5Ml2J25j41nlJ05j63J04j18l6J03N0r1J13j16j73
3376b60K64j7k78R1n8N1J29q4m9K06r3N4L9K5J17k6Mq2J15j71J34j11J64q9J97
3401B72l11M0k0K16n2q7J05o9J18j26j65L5J5r5m4j34r6J31J92k49R2l1l7K31
3425f9k7l7Q7J05o2M0J91j39K0J91k21J48k8O0K0k3p0l3P4j09P7p0q2P1k04Oj39
3452b23J4j55J35j13l0L3j97J83M7N4J12Qm9J5Qp0M09k58K91j61N7LKQ3Q1J21
3478D00r8o4QJ3o8O4r1p6k8j07j07J39r9j0o4q2K7L4P4n9j42J26nP0L3j4L0J35
3506C9N0k37J96j23J51j21K0J68n4J17r9J03p3l2J57q4j03j21J95j37%l2J20p7
$$ plain form
3530 23 -65 21 71 -79 -183 -63 -108 -13 -2 -37 5 45 18 -190 -112 -10 -60 -124 -23 -200 -154 -70 7 107 29 3
3556 3 -78 71 -91 238 -22 191 -52 -35 186 1 -104 -34 -56 45 5 23 -14 18 212 62 169 -78 -2 -41
3580 -41 -120 37 -63 -73 -74 -56 -51 -50 99 -98 207 -160 151 -38 -54 43 43 55 83 133 231 57 85 5 203 219 -76
3607 -76 175 89 88 3 -24 -201 42 -14 -232 -87 -111 -208 -116 -98 -260 -192 -112 -171 -157 -287 -42 -164 13 -159 -25
3632 -25 91 225 312 181 284 166 134 171 258 302 210 -2 112 50 130 164 177 176 178 -25 26 -21 -315 -2 -52 -280
3658 -280 -153 -74 -276 -253 -291 -309 -191 -232 -255 -66 20 -22 -78 35 83 104 53 22 220 151 65 52 33 108 153 -78
3684 -78 69 24 64 139 213 248 152 259 105 33 -52 -106 -4 -61 -56 16 -96 -96 -105 -273 -98 13 -13 10 -175 -1 8
3711 8 -37 -139 6 -8 -172 -115 -112 -83 -10 -65 -77 88 64 -42 154 25 247 182 240 184 132 134 151 38 130 31 0
$$ packed form
3530B3q8Q6N0j50j04J20m5R5J1l5M2M0k7k08P8J02n0o4J01j77M6Q4P7J00p8k6
3556Cq1J49j62L29k60K13k43J7K21j85j05P0k2J01m0J8l7L2J94j50J07k47P6l9
3580d1p9J57j00j0jJ8NJJ49j97L05l67L11j89j6R7%J2K8N0R8j74K8q0J98J6k95
3607g6K51q6jq5k7j77K43n6k18J45k4r7R2J8j62O8Q0n9J4j30K45j22J77j72J34
3632b5J16J34Q7j31J03j18l2L7Q7M4r2k12J14o2Q0L4J3jKk03N1m7k94L13n0k28
3658b80J27P9k02K3l8j8J18m1k3J89Q6m2n6J13M8K1n1l1J98o9q6j3j9P5M5k31
3684g8J47m5M0P5P4L5r6J07j54p2q5n4J02n7NP2j12%rj68J75J11k6K3j85J74R
3711Hm5j02J45j4j64N7LK9P3n5j2J65k4j06J96j29K22o5N8n6n2KJ7j13R2r9l1
$$ plain form
3738 0 36 -20 46 -165 -204 -27 -62 -107 -16 -79 -131 -106 -61 -209 -158 -281 47 -180 -166 -165 -34 14 79 54 202 162 224
3765 224 286 215 297 42 260 225 155 176 79 154 54 64 -25 -33 -83 1 48 -126 -166 -44 -143 -135 -178 -131 -223 -226 -183 -218 -186
3794 -186 -217 16 -61 35 100 193 334 220 250 295 142 381 151 215 115 78 97 -9 -225 -79 52 -132 -90 93
3818 93 -83 -263 -245 -78 -239 -295 -248 -374 -214 -363 -218 -182 -86 -205 -135 -15 69 149 65 93 160 373 287 308 390
3843 390 269 173 248 298 28 18 93 -23 68 107 -160 -24 -268 -93 -214 -69 -107 -213 -233 -192 -216 -162 -206 -219 -1
3868 -1 -202 -139 -108 -131 -37 -57 -105 62 111 113 -19 171 111 183 199 110 54 -17 141 81 127 103 133 -27 -11 28 183 66
3896 66 -75 34 -59 82 -82 -71 18 -208 -135 -126 -140 -87 70 27 -197 -124 -170 -85 -136 -176 69 -50 19 -153 75
3921 75 -58 75 18 22 241 60 195 157 30 17 272 211 190 241 236 201 97 223 151 -38 -60 -126 78 -83 -112
$$ packed form
3738@L6n6O6k11l9J77l5m5R1o3n2K5M5j48N1j23L28k27J4JJ31M8O5k5J48m0O2
3765B24O2p1Q2k55K18l5p0K1r7P5j00J0q9qn0Q4M7j74m0J22r9Qm3M7r2lM3l5L2
3794a86l1K33p7R6O5R3J41j14L0M5j53K39k30O4j00l7J9j06k16J46J31j84M2J83
3818I3j76j80J8J67j61n6M7j26J60j49J45L6R6j19P0J20Q4Q0q4K8O7K13q6K1Q2
3843C90j21r6P5N0k70j0P5j16R1L9k67J36k44J75j21J45l8j06k0M1k4N4m4j3K18
3868ak01O3L1k3R4k0m8J67M9Kj32J90o0P2J6q9n6p1J58o0M6k4L0j60J6L9J55j17
3896F6j41J09r3J41j64J1Q9k26P3Rj4N3J57m3k24P3m6Q5n1m0K45j19O9j72K28
3921G5j33J33n7MK19j81J35l8j27j3K55o1k1N1nl5j04J26p2j89k2o6K04j61k9
$$ plain form
3946 -112 -90 -118 -163 -323 -39 -124 -269 -234 -64 -135 -118 -246 36 -153 77 4 58 74 -39 86 1 -67 131 134 164
3971 164 171 -29 127 173 78 225 128 -4 5 111 -78 98 -166 -21 -68 7 -38 -101 -80 -74 -10 5 -175 -45 -212
3996 -212 -114 107 79 -44 9 108 74 -69 11 169 212 88 50 -1 136 53 -67 103 -28 -77 27 99 48 -50 -25
4021 -25 -8 -163 -48 2 -43 -81 -126 60 -28 53 -78 0 105 -65 101 -85 -112 40 76 9 -16 0 -6 -54 113 141
4047 141 70 4 38 70 62 75 160 77 -27 25 95 131 -70 15 13 75 -127 5 -173 19 -38 -57 -52 -30 -194 -75 -73 -155
4075 -155 -266 -154 -131 -54 143 1 25 -53 8 70 -49 -56 143 84 109 128 216 185 41 139 82 115 291 48 159
4100 159 170 -39 69 126 -70 -27 54 -30 -86 -21 -230 -237 -193 -217 -416 -150 -242 -182 -94 -91 -84 -56 -162 76 -16 25 47
4127 47 212 48 201 126 104 135 115 396 203 216 128 131 68 201 106 -61 83 43 -28 -41 -8 -18 -141 -133 -146 120
$$ packed form
3946a12K2k8m5j60K84q5j45L5J70p1J7j28K82j89K30p3N4J6j13J25q5o8J98LL0
3971A64Pk00J56M6r5J47r7j32RJ06j89J76k64J45m7P5m5o3K1OO4J5j80J30j67
3996b12R8K21k8j23N3R9l4j43Q0J58M3j24l8n1J37q3j20J70j31m9J04P2n1r8K5
4021b5J7j55J15N0m5l8m5J86q8Q1j31P8J05j70J66j86k7J52L6o7k5J6om8J67K8
4047A41p1o6L4L2qJ3Q5q3j04N2P0L6k01Q5kO2k02J32j78J92n7j9NK2j64J19Kq2
4075a55j11J12K3P7J97j42K4p8O1O2j19pJ99n9K5J9Q8l1j44R8n7L3J76k43J11
4100A59J1k09J08N7j96M3Q1q4n6O5k09pM4k4j99K66r2O0Q8LPK8j06K38r2M1K2
4127D7J65j64J53p5k2L1k0K81j93J3q8Lo3J33r5j67J44m0p1j3L3j0j23Qj3K66
$$ plain form
4153 120 -113 -168 -43 -97 -75 -155 -9 -17 166 -108 26 78 29 64 192 -37 20 106 40 247 -103 157 226 10
4177 10 51 174 79 99 -18 -8 48 -67 122 -71 -45 -47 -74 -22 -15 -6 18 9 -66 134 45 -77 98 -70 -101 -80 2 62
4205 62 43 -152 -25 -50 -40 129 16 176 -25 123 -47 194 149 77 25 -2 72 68 -13 -21 51 -74 -114 -76 -94 -180
4231 -180 -115 -91 -175 -99 -214 -122 -20 75 -11 42 14 -116 -1 98 9 51 -46 109 69 40 223 188 -54 93 -47
4256 -47 131 -28 48 160 -52 104 -25 -57 64 -37 -180 -134 -56 -124 -13 5 18 -75 -45 -178 -124 -108 -231 -59
4280 -59 -39 100 24 22 -79 -97 193 -170 94 192 86 141 71 154 174 61 117 73 -120 55 -12 -6 37 -83 11 -80
4306 -80 -46 -33 57 -81 13 -76 48 -89 -116 -176 -142 16 -54 1 40 -30 -101 31 -36 25 -143 -44 -65 -9 32 -149 -81
4333 -81 75 147 -57 -194 144 44 -29 -66 31 108 6 85 186 7 70 34 77 6 114 -105 -7 53 43 -49 53
$$ packed form
4153A20k33n5J25n4K2q0J46qJ83k74J34N2m9L5J28k29N7Q6o6K07l50K60O9k16
4177A0M1J23r5K0j17J0N6j15J89j93K6kk7N2PRK4rp5K00q9j22J75j68l1K1Q2O0
4205F2j9j95J27k5J0J69j13J60k01J48j70K41m5p2n2k7P4mq1qP2j25m0L8j8q6
4231a80O5K4q4P6j15R2J02R5q6N3k8j30J15R9q9M2r7J55m0k9J83l5k42J47j40
4256d7J78j59P6J12k12J56j29l2J21j01j43M6P8o8J11J8J3r3L0j33N4J6j23J72
4280e9K0J39p6kj01j8K90l63K64R8j06N5p0Q3K0j13N6m4j93J75o7OM3j20R4r1
4306h0L4J3R0j38R4q9J24j37k7o0L4J58p0N5L9p0p1J32o7O1j68R9k1N6M1j81O8
4333h1J56P2k04j37L38j00p3l7R7P7j02P9J01j79O3l6M3p1J08k19R8O0j0r2J02
$$ plain form
4358 53 -147 -67 -141 -168 -197 -22 -243 -58 -72 -19 -91 -13 -45 28 -38 144 -5 80 105 121 7 -29 -8 48 13 104 91
4385 91 132 82 38 -16 -192 82 -168 37 -58 9 -114 30 -59 83 -59 -225 -66 -203 -247 114 67 -80 -42 -72
4409 -72 26 -50 195 -77 106 -38 39 184 114 75 -50 -8 -30 46 -24 62 -162 59 108 98 -97 95 118 -83 -72
4434 -72 -147 105 -163 17 -72 -68 -51 -57 107 6 181 4 -19 109 79 49 67 139 166 38 48 19 63 -53 13 30
4460 30 150 60 -14 89 57 125 41 35 -74 41 -60 -118 -76 64 61 -9 12 -97 -43 -128 -130 46 -17 29 -64 -74 -86 -84
4488 -84 4 -41 -82 60 -186 39 27 -125 59 -92 6 -89 -74 36 -59 -30 13 100 -16 64 92 48 142 47 -91 -44
4514 -44 62 125 192 1 18 60 -196 -27 -68 -123 -111 -120 -66 -171 -172 -85 -146 -146 -170 0 40 27 -67 -105 -23 6 1 56 50 50
4544 50 130 25 30 150 -7 13 117 219 28 153 -36 79 11 73 6 -78 39 52 -26 -123 -145 3 -10 -95 -129
$$ packed form
4358E3k00Q0p4k7k9J75k21J85j4N3p2P8l2P3o6J82j49Q5K5J6j14l6K1N6l5R1j3
4385I1M1n0m4n4j76K74k50K05r5O7j23J44q9J42j42j66J59j37m4L61m7j47L8l0
4409g2R8p6K45k72J83j44P7J45p0l9j25M2k2P6p0Q6k24K21M9j0j95J92K3k01J1
4434g2p5K52k68J80q9MJ7oJ64j01J75j77k3J28l0l0J8P2K7j28J0k9M4j16O6J7
4460C0J20r0p4J03l2O8q4oj09J15j01n8M2J40lp0K1j09N4q5kJ76o3M6r3j0j2K
4488h4Q8m5m1J42k46K25j2j52J84j51R8r5J5J10r5K9M3Q7j16Q0K8m4R4r5j38M7
4514d4J06O3O7j91J7M2k56J69m1n5J2rN4j05jQ7o1%k4J70M0j3r4l8Q2K9nN5o%
4544E0Q0j05NJ20j57K0J04J02j91J25j89J15o8O2o7q4J17J3p8r7k2J48j3q5l4
$$ plain form
4569 -129 -134 -61 -270 -1 -32 -87 97 17 176 30 39 97 53 1 11 40 -160 -48 44 110 -59 -4 -110 -13 -163 -158
4595 -158 -24 35 -144 100 50 -77 52 88 166 -137 -21 -52 -94 308 -20 0 162 -107 48 -116 60 186
4617 186 -13 11 -63 8 45 -82 24 -101 -39 -200 -31 -53 -46 47 -103 90 -93 17 48 -59 78 -41 4 15
4641 15 -125 111 67 -23 59 113 25 85 76 183 -50 -144 6 -106 -71 -49 -14 -64 23 46 62 -105 -34 -62 -61 -131 -6
4668 -6 46 -58 3 56 -31 -35 175 -11 142 96 2 -6 -94 121 49 41 83 175 -193 -75 71 -25 81 -5 -138 45 -78
4695 -78 63 -22 -167 -34 -56 -76 -31 86 35 -31 62 38 -39 -128 59 13 10 2 -56 -55 91 51 117 134 -2 61 -145 -1
4723 -1 -104 153 89 4 60 216 64 -74 22 48 82 45 -79 51 -47 -68 58 16 48 119 -19 62 41 5 1 -30 -68
4750 -68 -23 -122 -153 -44 37 10 63 28 -36 -72 -57 -132 -81 55 154 55 -74 31 -48 -12 94 150 110 155 55 11 -45
$$ packed form
4569a29nP3k09K69l1n5J84q0J59j46RN8m4n2J0K9k00J12R2O6j69N5j06R7j50N
4595a58J34N9j79K44n0j27J29L6P8l03J16l1m2M02l28K0J62k69J55j64J76J26
4617A86j99K4p4P1L7j27J06j25O2j61J69k2PR3j50J93j83J10L1j07J37j19M5J1
4641A5j40K36m4r0Q2N4q8O0rJ07k33r4J50j12L5K2L5n0Q7K3J6j67P1k8Jp0J25
4668fN2j04O1N3q7mK10j86J53m6r4qq8K15p2qM2R2l68J18J46r6J06q6j33J83j23
4695g8J41q5j45J33k2k0M5J17n1o6R3k4p7q9J87m6lqn8JJ46m0O6J7j36O3k06J44
4723aj03K57o4q5N6J56j52j38R6K6L4l7j24J30r8k1J26m2L2P1j38Q1k1l6ml1l8
4750f8M5r9l1J09Q1k7N3l5o4l6J5p5N1J36R9r9j29J05p9L6J06N6m0M5j00m4n6
$$ plain form
4777 -45 32 -93 168 92 -30 -71 -44 -124 -52 -118 -138 -198 124 -27 7 54 -219 -89 126 -112 75 -74 -73 139 -131
4802 -131 199 60 116 -35 -12 -139 25 -13 105 -99 54 -36 -85 9 116 -86 -247 -7 -10 -137 -66 -25 146
4825 146 -27 77 -180 -23 89 53 60 -18 -43 73 13 131 88 -59 -42 7 89 -101 52 101 -56 41 112 143 74
4850 74 144 36 -18 46 -21 -48 -2 -67 61 -157 39 -127 41 1 -103 63 23 79 -103 25 12 85 24 73 16
4875 16 -12 -32 -55 71 241 98 -35 -70 72 4 148 31 54 -161 148 -33 -71 -54 7 -11 183 145 -31 78
4899 78 -117 42 -43 14 -116 -88 53 -12 119 -73 -218 -25 -16 112 -136 -84 54 -1 -27 -32 -6 -140 -47 17 -1
4924 -1 -82 53 -8 -28 105 -18 -51 27 -52 -22 -10 -11 99 84 18 110 -29 33 7 -139 -67 -14 9 -220 23 -111 -55
4951 -55 -152 -121 130 57 -7 -15 -2 -4 -167 3 -60 -36 109 30 104 -5 -129 20 -73 43 212 175 90 -27 -64 37
$$ packed form
4777d5P7j25K61p6j22m1K7q0P2o6k0o0L22j51L4M7k73J30K15k38J87j49JK12k70
4802a31L30j39N6j51K3j27J64l8J18k04J53r0m9R4J07k02j61K40lj27P1M1J71
4825A46j73J04k57J57J12l6Pp8k5J16o0J18m3j47J7M9Q2j90J53M9j57R7P1L1o9
4850G4P0j08n4O4o7k7M6o5J28k18J96j66J68m0j04J66m0N6j82J28j3P3o1M9n7
4875A6k8k0k3J26J70j43j33l5J42o8J44j17K3k15L09j81l8J7O1j8J94l8j76J09
4899G8j95J59q5N7j30K8J41o5J31j92j45J93RJ28k48N2J38n5k6nK6j34R3O4j8
4924aq1J35o1k0J33j23l3P8p9L0J2jJ10j5o6R2j39O2k6j46P2N3K3k29K43j34N6
4951e5r7L1K51p3o4qJ3kj63J70o3K4J45p9P4j09j24J49r3J16J69l7q5j17l7J01
$$ plain form
4977 37 100 150 94 -42 -19 -43 62 -10 -14 -202 47 189 -98 -58 -115 -89 109 -172 96 -9 122 -48 69 -9
5001 -9 104 34 -61 79 75 64 -54 -107 82 42 -27 24 -67 -11 -5 57 -10 153 144 -6 -46 -86 -58 25 82 -14 72 -42 70
5030 70 25 24 67 1 -46 -34 -184 7 53 -13 -240 -170 -68 -5 -13 -83 66 -62 16 -68 2 -41 76 23 67 -150 -16
5057 -16 42 65 35 -13 150 -104 -25 -123 73 -127 -55 -108 -69 15 -157 45 -54 16 -76 -62 47 -167 -29 -162 -109
5082 -109 -70 70 50 31 -10 129 -14 20 -101 0 184 13 36 126 18 -5 53 131 25 150 46 61 2 -145
5106 -145 -70 48 -168 13 -110 -155 -30 -139 -118 -47 195 -223 -191 -218 -139 -109 -199 -52 14 97 -83 54 106 -80
5130 -80 69 202 -53 4 153 155 153 33 -30 -10 62 74 187 21 -108 -72 -21 83 -31 28 -83 -33 -69 -45 1 -18
5156 -18 61 -124 -146 -193 -33 90 -219 -64 -104 94 -112 124 -126 93 200 109 14 90 53 14 182 -98 78
$$ packed form
4977C7O3N0n6j36K3k4J05p2mj88K49J42k87M0n7K6J98k81K68j05J31j70J17p8
5001iJ13p0r5J40mj1j18n3J89m0o9N1r1N6OO2o7J63rj50m0m0K8Q3N7r6Q6j14J12
5030G0m5jM3o6m7J2j50J91M6o6k27P0J02O3qp0J49j28P8q4P0m3J17n3M4k17J34
5057a6N8K3l0m8J63k54P9r8J96k00P2n3L9Q4j72K02r9P0r2J4J09k14J38j33N3
5082a09L9J40k0j9m1J39j43L4j21J01J84j71K3R0j08k3N8P8j06J25j04J5n9j47
5106a45P5J18k16J81j23m5J25j09K1P1K42m18L2k7P9L0r0J47O6Q3j80J37N2j86
5130h0J49J33k55N7J49Kkj20o3K0P2J2J13j66j29L6N1J04j14N9j11N0l6K4M6j9
5156a8P9j85k2m7J60J23l09J55m0J98k06K36k50K19J07r1r5P6l7l9J68k80J76
$$ plain form
5179 78 154 114 -30 88 -41 -51 32 -21 96 -57 89 22 79 -52 -157 163 -65 -13 -75 62 -104 -101 -190 -167 -108
5204 -108 31 -128 8 -73 -14 67 111 70 134 -51 -134 -10 -26 138 204 99 228 246 64 127 40 51 8 15 36 -73
5230 -73 165 85 87 -16 17 -148 110 -99 -148 -174 45 -14 -46 -159 -147 -33 84 -27 108 -44 -89 28 -68 -11
5254 -11 114 64 -90 75 -74 -32 176 134 9 74 23 107 -28 -78 -28 -35 -90 28 -69 -46 -100 -98 -234 -111 -124 -91
5280 -91 -133 -79 19 -173 18 -18 -107 80 64 23 -66 98 -34 32 -69 31 159 8 99 -67 78 139 -267 -12
5304 -12 133 -41 37 -107 -5 40 -86 87 -48 -116 -53 19 -105 6 42 57 -14 -53 95 -61 -137 -2 -35 -60
5328 -60 -44 -96 -224 30 12 62 -61 -113 -15 50 90 -36 97 212 11 33 -74 129 162 36 10 151 -19 92
5352 92 78 -23 -129 -35 -36 -38 -139 -41 -1 -187 -3 -227 14 69 -49 -20 -71 20 -19 -109 -26 128 86 -33 56 -116
$$ packed form
5179G8P6m0j44J18j29j0Q3n3J17j53J46o7N7j31j05L20k28N2o2J37j66Lq9K3N9
5204a08J39j59J36q1N9Q1M4m1O4j85q3J24j6J64O6j05J29J8j82O3q7J1m3PK1j09
5230g3K38q0Kj03L3j65K58k09m9k6K19n9l2j13J2J14J17j11J35j52m5J17r6N7
5254a1J25n0j54J65j49M2K08m2j25O5n1Q4j35n0N0pn5J18r7K3n4Kj36J23j3L3
5280i1m2N4R8j92J91l6q9J87j6m1q9J64j32O6j01J00J28j51R1j66J45O1m06K55
5304a2J45j74P8j44J02M5j26J73j35o8O3P2j24J11L6J5p1l9J48j56p6J35l3k5
5328f0J6n2j28K54j8N0j23n2R8O5M0j26J33J15k01K2j07K03L3j26k6J41j70J11
5352I2j4j01j06R4jkj01R8M0j86J84k24K41N5j18K9n1R1l9r0Q3J54m2j19Q9j72
$$ plain form
5378 -116 -14 -130 122 87 68 58 40 -11 5 -17 129 -3 -87 6 -75 137 62 -68 -119 70 -54 -126 30 -123
5402 -123 -316 -66 -127 16 8 -113 -28 20 -104 5 -12 -183 -44 -22 95 128 74 -71 28 2 -67 95 38 329
5426 329 -48 62 96 17 134 115 134 -99 -47 71 -115 -208 -154 50 162 -7 -19 -165 -42 -7 -150 -17 4
5449 4 23 92 -141 51 72 -65 -70 37 95 -12 -34 60 27 145 141 146 75 16 -140 -12 113 -11 -219 -98 -10 -93
5475 -93 -63 27 12 107 -128 -73 -52 21 25 -193 53 -111 -5 -4 -117 118 -76 21 -69 124 162 -70 157 48 39 15
5501 15 2 -64 17 72 27 89 87 -23 16 41 -19 -61 -13 36 146 131 -93 100 15 -15 -78 25 218 19 6 164 -225
5528 -225 -11 -10 -129 -25 -20 53 -107 15 5 141 -19 95 130 -86 121 -15 22 278 144 -9 95 233 155
5551 155 20 -26 79 192 -108 -1 2 -78 -58 -90 -118 -96 -103 -52 -12 31 -93 -154 -167 -56 -186 89 -24 -11 284
$$ packed form
5378a16J02j16K52l5j9j0j8n1J6k2J46j32q4R3q1K12p5j30n1J89j24p2J56j53
5402a23j93K50o1J43qj21Q5M8j24J09j7j71J39K2J17L3n4j45R9k6o9J62n7K91
5426C29l77J10L4p9J17j9J9k33N2J18j86r3N4K04J12j69j2j46J23L5j43J33K1
5449DJ9O9k33J92K1j37nJ07N8j07k2R4l3J18mNp1n9j56J28J25j24k08J21Q8q3
5475i3L0R0j5R5k35N5K1P3Mk18K46j64J06Jj13K35j94R7r0J93L8k32K27j09rk4
5501A5j3o6Q1N5m5O2kj10L9K5o0m2M8M9J10j5k24J93q5l0o3J03J93j99j3J58l89
5528b25K14Jj19J04NP3j60J22j0J36j60J14L5k16K07j36L7K56j34j53J04J38p8
5551A55j35m6J05J13l00J07Lq0K0l2k8K2pN1M0M3j24o1j3J11j30K75j13J3K95
$$ plain form
5576 284 92 129 14 78 22 139 110 321 64 69 210 48 85 200 34 50 110 -56 58 -27 -88 -113 -134 -88 60
5601 60 -213 -76 -16 -70 -111 -13 -40 146 -190 -182 -12 93 -56 -66 6 76 34 116 -52 45 -128 109 -93 1 41
5626 41 -80 -32 -123 8 54 7 168 94 -50 -83 -83 77 117 132 86 -49 -62 62 -36 31 57 48 187 -14 57 71 -127
5653 -127 0 -15 28 -42 -121 -36 54 -162 32 -41 87 -96 21 50 100 133 53 26 -58 97 -137 83 1 74 -72
5678 -72 -78 -57 -33 -52 99 10 97 -66 76 -33 7 -22 29 -119 -74 -30 -37 -111 2 158 12 53 13 -66 46 25 -288
5705 -288 88 79 27 152 40 -51 66 50 47 204 124 -89 51 89 -180 -165 -189 4 82 -134 -92 46 -93 -248
5729 -248 -133 -57 -69 15 -35 -34 51 -112 -157 -32 45 -71 -57 123 -67 44 268 222 -19 -21 75 -15 221 50 -41
5754 -41 24 39 -62 -121 -68 81 31 -131 36 -8 -48 -96 -87 -99 136 -212 -12 -41 -13 78 -76 -100 -4 80 178 8
$$ packed form
5576B84j92L7j15O4n6J17k9K11k57NJ41j62L7J15j66J6O0j66J14q5o1k5k1M6J48
5601F0k73J37O0n4m1R8k7J86l36QJ70J05j49j0P2P0m2Q2j68R7j73K37k02R4M0
5626D1j21M8r1J31M6m7J61p4j44l3%J60M0J5m6j35j3J24r8O7K6rJ39k01P1J4j98
5653a27J27j5M3p0p9Q5R0k16J94p3J28j83J17K9N0L3q0k7q4J55k34K20q2P3j46
5678g2oK1K4j9J51q9Q7j63J42j09M0k9N1j48M5M4pp4J13J56j46M1m0p9J12k1l13
5705b88L76rn2J25j12r1J17j6lJ57q0k13J40L8k69J5k4J93P8k16M2J38j39j55
5729b48J15P6j2Q4n0JQ5j63m5J25P7j16J4J80j90J11K24m6k41kR6r0K36j71r1
5754d1O5J5j01n9N3J49n0j62J67m4m0m8Rj2K35l48K00k9K8R1j54k4R6Q4R8j70
$$ plain form
5780 8 -47 30 60 -27 96 253 210 3 107 -18 106 132 33 165 148 1 93 62 117 36 -57 -94 22 16 31 -11 -398
5807 -398 -139 50 -80 1 -21 134 37 -6 -158 10 88 -33 -96 16 7 -4 -81 62 98 -16 -45 211 67 4
5831 4 -5 -13 -11 24 34 148 13 83 255 9 79 53 188 -66 -142 -81 42 -56 -13 -145 -152 -195 -71 -133 86 86 -86 74
5859 74 4 -20 87 -178 4 21 -157 129 86 -167 129 -83 54 -74 37 201 158 -47 -105 -78 -49 106 -260
5882 -260 -92 43 94 -159 50 25 108 -142 112 -52 24 33 -288 -91 -93 -121 -128 -180 44 20 256 -56 -284 -50
5906 -50 -95 40 4 74 127 174 58 -5 -140 -37 -92 -11 -10 106 -75 -28 -3 -24 -34 29 -122 -25 -137 72 -155 50
5932 50 -12 126 -21 133 -57 -29 -9 28 14 -32 -24 29 123 55 -91 85 32 -11 34 58 178 11 -18 -93 215 -85
5958 -85 107 73 26 47 108 196 55 76 71 -106 -139 -40 74 -128 -27 74 -107 -16 82 7 -48 9 61 3 -29 -47 -188
$$ packed form
5780Hn5P7L0q7J23J57m3k07J04j25J24K6r9J32j7j47R2l1N5q1r3l7J16oJ5m2l87
5807c98K59J89j30Q1k2J55r7m3j52J68P8j21o3J12rj1p7J43L6j14k9K56j44o3
5831DrqKL5J0J14j35P0J72k46P0k6J35k54p6O1J23r8M3j32pm3J24o2K19%j72J60
5859G4p0k4J07k65J82J7j78K86m3k53K96k12J37j28J11J64m3k05n8K7K9J55l66
5882b60J68J35N1k53K09k5Q3k50K54j64P6Rl21J97kk8pn2K24k4K36l12k28K34
5906e0m5J35l6P0N3M7j16o3j35J03n5Q1JJ16j81M7K5k1j0O3j51R7j12K09k27K05
5932E0o2J38j47J54j90K8K0L7j4m6QN3R4o8j46J76n3m3M5K4J20j67k9p5L08l00
5958h5J92l4m7K1O1Q8j41K1nj77l3R9J14k02J01J01j81R1R8p5n5N7N2n8l2j8j41
$$ plain form
5985 -188 74 15 -75 24 2 -68 -26 -52 106 44 -61 75 -9 -52 -13 25 -10 168 -67 28 51 137 102 -34 -82 -80 108
6012 108 -21 124 -100 -52 -111 113 28 -35 37 -43 94 -36 -17 -146 -106 -16 -279 -3 31 10 152 109 94 -58
6036 -58 -25 111 53 -31 103 57 141 41 81 63 -72 -89 -36 -68 33 -50 -7 -127 15 70 -135 60 47 -11 105
6061 105 37 -68 -127 58 81 124 29 99 -2 60 17 -75 16 -63 90 -4 10 -13 -69 38 -33 200 -46 87 23 -2
6087 -2 -74 21 -15 152 -47 -27 -10 -48 -13 -72 93 18 -3 97 -13 62 -35 34 69 10 97 43 37 -173 33 42 -50 53
6115 53 -38 -22 -70 75 -13 5 -55 71 -28 -153 13 147 75 18 -22 -106 -118 -134 -133 67 24 120 21 -73 78 -135 -11
6142 -11 -10 126 0 92 2 -24 -129 -27 72 85 10 -93 14 -112 218 -203 2 55 -26 -88 -91 62 -96 117 -1
6167 -1 -118 69 114 -98 35 40 -24 3 -42 140 -160 -41 -1 -112 -82 -199 82 -153 -173 28 -144 11 -101 -68
$$ packed form
5985a88K62n9r0R9k2p0M2k6J58o2j05J36q4m3L9L8l5J78k35R5K3Q6l5j36m8KJ88
6012A08j29J45k24M8n9K24q5o3P2q0J37j30J9j29M0R0k63K76L4k1J42m3j5j52
6036e8L3J36n8q4J34m6Q4j00M0j8j35j7N3l2J01q3M3j20J42N5k05J95j3n8J16
6061A05o8j05n9J85K3M3r5P0j01O2m3r2R1p9J53r4J4k3n6J07p1K33k46J33o4k5
6087bp2R5l6J67j99K0J7l8L5n9J65p5k1J00j10P5r7O9L5n9Q7n4ok10K06Rr2J03
6115E3r1J6m8J45q8J8o0J26r9j25J66J34p2n7m0q4j2j6JK00m3R6r9r4J51k13J24
6142a1JJ36j26R2r0k6j05J02R9J3p5j03J07j26L30m21K05N3q1o2lJ53j58K13j18
6167aj17J87M5k12J33No4K7m5J82l00J19M0j11L0j17K81k35k0K01j72J55j12L3
$$ plain form
6191 -68 -53 -130 99 28 141 40 146 -15 79 139 101 -24 -70 36 105 77 -6 -76 -149 -131 -52 -88 44 114 -209 43
6217 43 120 -1 -83 111 44 -87 130 52 -8 -69 114 100 18 -3 -19 114 -130 117 -39 -26 4 154 31 -46 128
6242 128 6 -23 -53 -121 72 -62 129 175 49 -76 9 17 -43 74 -61 38 -87 33 -78 56 -51 -48 -1 57
6266 57 14 -41 64 -130 32 95 40 -55 -123 81 32 129 73 178 63 67 -44 118 79 18 207 19 -123 -99 2
6291 2 -69 8 231 21 -106 -24 -53 93 104 -52 85 5 -111 26 29 -48 -86 67 -20 -77 84 62 33 -145 -67 63
6317 63 55 21 34 -27 -142 147 78 30 83 41 146 -117 57 41 6 41 -104 175 -67 26 -17 61 41 -220 -178 -73
6343 -73 -225 101 17 33 -39 -131 76 -63 -16 14 118 44 61 62 254 8 14 41 -217 -202 -47 -18 -67 52 -74 141
6369 141 13 -122 119 -40 -42 -94 96 -6 -38 -67 20 -44 -13 100 -31 54 -100 -157 -109 -2 -173 187 -53 -5
$$ packed form
6191f8J5p7K29p1J13j01J06j61R4O0l8j25m6J06O9k8q3p0p3J8P9l6J32P0l23K52
6217D3P7j21q2J94o7j31K17p8o0o1J83j4q2k1j6J33k44K47j56J3L0J50j23p7J74
6242A28j22k9l0o8J93j34J91M6j26j25Q5Qo0J17j35R9j25J20j11J34j07LM7N8
6266E7m3n5J05j94J62O3n5r5o8K04m9R7n6J05j15Mj11J62l9o1J89j88j42K4J01
6291Bp1P7K23k10j27Q2k9J46J1j56J37q0j16J37Lp7l8J53q7n7J61k2k9j78P8J30
6317F3ql4J3o1j15K89o9m8N3m2J05k63J74j6l5L5j45K79k42R3m3P8k0k61M2J05
6343g3j52L26q4J6p2r2K07j39M7L0J04p4J7JJ92k46OK7k58J5J55K9m9J19j26K15
6369A41j28j35K41j59kn2J90j02l2k9Q7o4L1J13j31Q5j54n7M8J07j71L60k40M8
$$ plain form
6393 -5 -12 11 61 9 43 87 50 49 -55 -73 -25 93 150 -56 -128 115 -147 62 37 123 85 -33 28 34 11 11 120 81 -26
6422 -26 7 -55 48 152 -22 52 95 -10 3 -111 77 45 -38 111 -19 16 -80 -62 -86 11 -44 128 -119 26 -12
6447 -12 111 95 14 33 100 -45 68 -79 90 -58 19 69 -86 132 -203 47 6 -34 -20 105 -80 23 -29 -158
6471 -158 55 -119 -26 21 37 -194 2 176 -42 146 112 -5 47 31 44 50 -59 -75 -56 38 -61 -55 94 -164 -88
6496 -88 -30 50 151 103 -15 5 -4 77 65 108 -33 -72 102 44 -26 8 -60 14 167 -105 103 33 -119 82 56 -78
6522 -78 24 -1 -156 -52 108 63 -118 84 57 -17 -13 -178 48 -29 127 -42 4 -199 -76 56 72 155 222 120
6546 120 35 -13 -10 196 -49 93 75 -30 -52 -15 122 -152 -178 21 -46 12 -72 119 -86 -147 -5 55 -150 10
6570 10 89 62 -71 -13 -95 -1 61 -53 31 -98 -192 165 19 74 -171 21 -54 -63 -63 -9 -119 40 -89 172 26
$$ packed form
6393epK3N0n2L4M4l7jj04j8M8J18N7k06p2K43k62K09k5Q6l8j18O1Ok3%J09l9j07
6422b6L3o2J03J04j74P4M3j05J3j14J88l2q3J49j30L5r6J8k4R7n5J72k47J45l8
6447a2J23j6q1J9O7j45J13j47J69j48P7N0j55K18l35K50m1m0J4J25j85J03n2j29
6471a58K13j74R3M7J6k31J96J74k18J88l4j17N2j6J3Oj09j6J9R4r9OJ49k58P6
6496h8N8Q0J01m8j18K0rQ1j2M3j41l9J74n8p0L4o8P4J53k72K08p0j52K01k6j34
6522g8J02k5j55J04J60m5j81K02k7p4Mj65K26p7J56j69M6k03J23J32J6Q3O7j02
6546A20q5m8LK06k45J42j8j05k2L7J37k74k6J99o7N8q4J91k05o1J42O0k05J60
6570A0P9k7j33N8q2R4O2j14Q4j29r4L57j46N5k45J92p5r%N4j10J59j29K61j46
$$ plain form
6595 26 -98 -50 9 152 -177 105 114 -69 141 13 -169 146 140 -168 -109 60 57 13 -52 117 88 73 88 45 -73
6620 -73 0 -59 -12 -5 32 74 65 -33 122 -113 108 207 -62 -85 0 -73 18 31 27 -2 10 17 -130 -147 -81 -172 268 236 -18
6649 -18 -47 -8 239 -190 30 -37 157 28 -133 -54 72 88 -1 -35 -112 55 -44 25 15 151 -117 -90 -15 12 2
6674 2 54 3 75 -3 -125 158 82 68 -1 16 -27 27 -5 6 2 97 -108 -132 -6 103 -75 -37 7 52 19 -70 148 38
6702 38 20 -70 -89 -17 -54 18 1 -68 -59 -9 120 81 14 -100 -154 83 190 -87 56 115 -47 21 -56 -147 -212 -170 -67
6729 -67 158 84 24 112 -58 -21 51 76 35 46 59 -78 84 158 18 -12 86 50 84 136 -58 87 50 110 -16 12
6755 12 -111 32 -23 -9 -92 -210 -42 45 54 104 -66 52 -178 117 147 -64 49 93 -76 59 15 -6 -47 168
6779 168 -46 57 41 44 102 51 53 49 -125 -2 -9 6 -39 -126 0 -37 2 71 -15 -65 55 23 -81 84 -87 -19 -6
$$ packed form
6595B6j24M8N9J43l29K82Rj83K10j28j82L15ol08N9J69lm4o5J69k9j5J5m3j18
6620g3P3n9M7PL7M2rr8J55k35K21R9k69k3Q5p3R1J3mk9J2Pj47j7O6r1M40l2k54
6649a8k9L9K47m29K20o7J94j29j61P9J26J6q9l4p7J67r9O9j0J36k68K7P5K7j0
6674BN2n1P2p8j22K83p6j4o9J7m3N4l2J1mR5k05k4J26J09j78L8M4M5l3q9K18j10
6702C8j8r0j9P2l7P2j7o9RN0J29l9o7j14n4K37J07k77J43N9j62O8p7r1o5M2J03
6729f7K25p4o0Q8j70L7P2K5m1J1J3j37J62P4j40l0R8l6L4N2j94J45l7O0j26K8
6755A2j23J43n5J4q3j18J68Q7RN0j70J18k30K95L0k11J13M4j69J35m4k1m1K15
6779A68k14J03j6LN8n1Kmj74J23pJ5m5q7J26l7L9O9q6n0J20l2j04J65j71O8J3
$$ plain form
6806 -6 88 42 250 186 28 121 -113 110 96 25 -92 113 -78 -57 -36 17 -145 -70 191 -30 -59 51 -106 -27 -29
6831 -29 2 -41 -25 -223 46 -4 -10 20 -97 -10 54 -193 57 -1 118 39 66 47 -3 3 -134 47 -75 -19 -32 19 -2
6858 -2 -25 15 -19 -44 -87 -123 36 112 108 -67 128 135 89 19 54 -54 91 42 -61 62 134 100 -66 47 26 -260 -46
6885 -46 -9 -30 90 45 -187 -88 32 -239 -57 -88 -173 44 141 -22 8 -43 105 -32 42 20 2 103 -69 -52 54
6910 54 -92 6 176 109 43 71 26 -148 -40 -93 131 -31 -32 -33 -90 25 -109 113 58 66 -97 -65 -78 -64 -99 94
6936 94 -98 95 -71 -125 165 -53 -45 -91 115 -115 168 -103 -93 61 -99 122 27 -189 -115 20 -66 -22 69 187
6960 187 20 43 -86 3 -154 -43 -28 84 -2 -17 82 98 114 39 90 107 -228 39 -110 30 -111 -12 79 -30
6984 -30 -51 62 -32 -69 -46 8 40 92 36 -24 122 78 120 -81 100 84 49 64 -32 77 -109 -54 9 177 -3 123
$$ packed form
6806fR4m6K08o4j58R3k34K23j4p1j17K05j91K1K1N3j62P5K61k21k9J10j57P9k
6831b9L1m3J6j98K69n0oL0j17Q7O4k47K50n8J19p9K7j9n0Oj37J81j22N6j3N1k1
6858bk3M0l4k5m3l6J59P6mj75J95Pm6p0L5j08J45m9j03J23P2l4j66J13k1k86K14
6885d6L7k1J20m5k32R9J20k71J82l1q5K17R7j63L0n1J48j37P4k2j8J01j72J7J06
6910E4j46R8J70o7o6K8m5j74J08n3K24j62jjn7J15j34K22n5Qj63L2j3J4l5J93
6936I4j92J93j66n4K90k18Qm6K06k30K83k71J0J54j60K21r5k16P4J35q6M4R1J18
6960A87j67K3j29Q9j57J11J5J12q6j5R9J6J6p5N1J7l35K67j49J40j41R9R1j09
6984c0k1J13r4l7K3N4L2N2n6o0J46m4M2k01J81j6l5J5r6J09j86N5O3J68j80J26
$$ plain form
7010 123 2 -85 74 -151 -139 -52 -45 -78 29 -7 -141 12 33 126 -78 -91 -56 88 -143 93 -2 47 -22 31 47
7035 47 4 45 -136 91 -34 -38 -48 8 35 111 -100 263 -116 -63 -95 -67 -23 49 22 -186 12 40 -73 -24 7 -33
7061 -33 -67 -118 7 -105 -94 -164 57 -202 -36 100 11 -110 216 21 -35 146 -93 -23 142 -68 -43 4 -115
7084 -115 -47 -87 88 10 106 -7 -68 88 42 -207 -80 -103 -97 -104 47 31 -35 48 71 133 -67 -67 -61 -95 -164 119 -8
7111 -8 -83 96 -100 18 -25 19 99 27 41 -112 -104 65 87 37 45 135 -119 144 -11 -67 41 102 -5 -95 112 -45
7137 -45 17 -60 -57 -78 -46 -32 -141 -83 4 60 -123 54 -87 -6 147 1 123 64 80 110 -3 -147 -51 86 -78
7162 -78 -119 137 -31 150 78 45 -54 77 63 21 180 32 80 -192 -105 16 -111 -70 -7 -56 70 4 49 8 -73
7187 -73 64 112 -48 78 -36 -114 61 -58 132 93 138 72 125 48 112 -58 35 -5 -21 84 63 6 -32 -168 -77
$$ packed form
7010A23j21q7J59k25J2Q7Pl3J07l6j34J53K1R3k04j3L5J44k31K36r5M9o9N3J6
7035D7m3M1j81K27j25mj0N6K7P6k11L63l79N3l2K8M4P2k7k08J98K8j13M9L1m0
7061c3l4n1J25j12J1p0K21k59J66J36q9j21L26j95n6J81k39P0J65k10K5M7j19
7084a15O8m0J75p8R6j13o1J56m6k49J27k3OpJ51j6o6Q3K3O2k00%Ol4o9K83j27
7111hp5J79j96J18m3M4Q0p2J4j53QJ69K2n0QR0k54K63j55n6J08O1j07r0K07j57
7137d5O2p7Lk1L2J4j09N8Q7N6j83J77j41Q1J53j46J22n9J6L0j13j44R6J37j64
7162g8m1K56j68J81p2l3r9J31j4m2J59j48M8k72Q7J21j27M1O3m9J26o6M5m1q1
7187g3J37M8j60J26j14p8J75j19J90l9M5o6N3p7O4j70R3m0j6J05k1n7l8j36R1
$$ plain form
7212 -77 -117 -67 -22 -45 -63 33 74 -217 -47 47 22 27 30 -225 88 118 18 151 13 50 -30 67 19 99 -20 -59 -39
7239 -39 -164 32 -43 -39 -26 157 62 -20 56 -182 -84 -56 52 -8 76 -5 4 13 -11 49 37 79 32 24 84 -46 41 -3 26
7268 26 -57 -53 69 0 42 86 -107 49 16 17 7 87 65 -52 87 -36 40 132 111 88 -60 -17 52 -17 133 -45 97
7295 97 37 111 -6 -8 -5 125 111 -126 100 -122 -23 55 16 110 180 -130 -193 30 41 -231 76 -53 -119 132 -2
7320 -2 0 78 -7 213 -2 -11 128 18 196 177 -63 175 143 52 -12 -106 -56 42 -195 34 -148 -61 -11 44 -155 8
7346 8 70 -138 18 -92 -105 -92 -72 -51 23 -26 10 83 64 -102 53 109 19 84 103 -104 -134 -40 64 -16 108 -31
7372 -31 130 96 -4 -87 -193 -85 211 56 -33 -11 -78 7 -162 46 35 -70 -51 -49 47 75 -72 76 39 -241 -15
7397 -15 84 147 61 115 1 -89 -43 63 -1 -81 -85 -20 -2 101 -22 -104 -69 103 40 10 -145 -123 -22 55 -27 -26 -12 34
$$ packed form
7212g7m0N0M5k3j8R6M1k91J70R4k5NLk55L13L0j00J33j38L7q0R7m8Q0j19l9K0
7239c9j25J96p5MJ3J83r5q2P6k38R8K8J08o0Q4q1RRk4O0j2M2m7qO0j30Q7m4K9
7268B6q3MJ22o9M2M4j93J56l3Jj0Q0k2j17J39j23P6R2k1k3j48M3O9o9J50j78J42
7295I7o0P4j17kLJ30j4k37K26k22R9P8l9R4P0l10o3K23J1k72L07j29o6K51j34
7320bKP8q5K20k15rJ39j10J78j9k40K38l2r1o4r4N0R8k37K29j82Q7N0N5j99J63
7346HO2k08J56j10j3J3K0K1P4m9L6P3j9j66J55N6r0O5J9k07l0R4J04q0J24j39
7372c1J61l4j00q3j06J08K96j55q9K2o7Q5j69K08j1j05J9KR6K8j47J48l7k80K26
7397a5R9O3q6N4j14r0M6J06o4q0mO5J8J03j23q2L5J72o3l0j55K2J01P7q2JJ4M6
$$ plain form
7425 34 98 -43 97 -190 68 -93 -87 84 16 108 -138 62 -19 113 11 54 -15 0 -59 -7 139 -8 -53 -29 22
7450 22 -60 -104 -66 42 67 -30 -36 198 -160 -36 -126 162 -2 -96 -160 -41 -152 -77 -87 -254 -83 119 -19 -38 -61
7475 -61 -65 -64 -44 -129 83 -45 -5 83 174 -86 252 215 34 -44 -100 18 35 47 -33 -75 -1 25 88 2 154 -43 -97
7502 -97 -56 -62 35 37 -140 134 -35 -75 -58 18 -44 2 52 -30 15 -40 -109 -11 69 24 76 26 7 -66 44 62 -35 -35 29 192
7532 192 27 -59 -32 147 28 -5 -86 7 -21 -67 10 -11 92 -17 -24 5 -29 -87 19 -29 -6 36 139 -27 89 31
7558 31 135 16 -144 -19 -46 -86 -26 81 -50 13 27 -60 113 -189 -4 -56 28 26 85 -52 -9 109 9 84 64
7583 64 119 79 -10 -87 -113 -13 37 108 -81 -164 -21 8 -66 24 -15 -98 48 68 -22 -69 62 -18 70 -45 -64 -79 -14
7610 -14 -162 -41 -32 38 -94 -113 110 -88 46 12 -3 16 -143 -182 -13 17 -7 -106 -3 -57 -145 -133 -27 -131 -29
$$ packed form
7425C4O4j41J40k87K58j61OJ71o8R2k46K00q1J32j02M3o9J5n9N2J46j47m5K4N1
7450B2q2m4L8J08K5r7oK34l58J24r0K88j64r4o4J19j11P5j0j67J71K02j38j9k3
7475f1mJK0q5K12j28M0Q8R1k60L38l7j81p8n6J18J7J2q0m2P4K6O3q6J52j97n4
7502i7M1oR7Kj77K74j69m0J7P6o2M6N0q2M5n5o9R8Q0m5N2n0j9p3J10J8r7%O4J63
7532A92j65q6K7J79j19l3q1R3k8m6P7k1J03j09pK9l4n8J06m8K3M2J03j66J16n8
7558C1J04j19j60J25k7m0O0J07j31O3J4q7J73l02J85n2Q4kN9j37M3J18j00P5k0
7583F4N5m0q9p7k6J00N0P1j89q3J43K9p4R0l9q3J46K0r0m7J31q0Q8j15j9j5O5
7610a4j48J21RP0j32j9K23j98J34l4j5J9j59l9J69L0k4r9J03n4q8J2J06j04J02
$$ plain form
7635 -29 -46 -52 52 -84 -12 190 144 75 42 35 7 206 86 -3 18 22 -213 36 6 47 53 -77 -158 1 -121 -45 -55
7662 -55 -22 59 -41 -12 -105 -3 193 5 -146 -158 53 -56 95 37 -107 212 -108 39 136 24 -64 -58 203 -15
7686 -15 -5 -49 -214 144 -10 -87 -58 24 -133 142 -108 -33 59 13 -31 -88 98 70 -260 45 -42 42 -14 -148 53
7711 53 79 92 8 49 -35 -94 -65 -134 -40 -10 69 28 84 81 -71 -140 69 -65 -20 -50 -17 193 62 -61 -56 -8 -24 -15 -8
7740 -8 -15 -62 -60 -8 96 63 -56 -119 168 150 -58 -38 -20 28 14 70 58 40 -189 69 -37 64 17 2 84 -28 -25 -103
7768 -103 202 150 -136 3 -38 38 -76 84 35 79 91 75 -111 3 36 -23 -70 -22 -21 15 55 -77 -44 73 6 14
7794 14 62 -113 4 40 -90 65 -136 -120 34 -32 3 34 -63 -40 -39 79 -21 -31 30 70 40 -63 -33 -87 34 -13
7820 -13 -101 10 -69 -89 -68 -10 5 -120 96 61 16 -83 -44 -2 45 31 66 -139 -24 -9 134 147 39 -15 -113 -25 127
$$ packed form
7635b9j7oJ04j36P2K02m6o9l3pk8J99j20q9K1Mk35K49l0M1Oj30q1J59j22P6j0
7662e5L3Q1j00K9r3J02J96j88j51j2K11j09J51n8j44L19l20J47R7j12q8OK61k18
7686a5J0m4j65L58j54p7K9Q2j57K75k50P5R2m6m4n7J86k8l30L05q7Q4n6j34K01
7711E3K6J3q4M1q4n9K9o9R4L0P9m1N6lj52o9K09j34M5l0L3K10j31j23NM8j6RP
7740hpm7KN2J04l3j19o3K87j8k08K0J8M8j4N6j2j8k29K58j06J01m7j5Q2j12Lp8
7768a03L05n2k86J39m1P6j14J60m9M4J2j6j86J14L3n9m7M8JL6M0j32L3J17o7Q
7794A4M8j75J17L6j30J55k01J6J54o6L5L1r7K3JJ18j00j0O1M0l0j03L0n4J21m7
7820a3q8J11p9k0K1N8J5j25K16l5m5r9L9M2M7j4L5k05J15J5J43J3j08n4r8Q8J52
$$ plain form
7847 127 -12 14 113 -49 86 -55 97 -143 173 -32 32 7 100 114 -55 54 84 43 13 36 16 73 117 -40
7871 -40 137 13 75 100 65 -45 16 84 31 77 -207 -106 58 -104 20 -108 32 -67 6 18 -201 -72 -148 -49
7895 -49 6 122 13 -14 -96 15 46 80 -119 -132 113 -8 35 -69 69 129 -17 -37 -138 -21 -13 0 20 93 57
7920 57 22 -123 162 75 -18 37 -36 -31 -31 -122 -27 46 80 77 62 -19 -29 4 76 -61 44 35 -87 15 53 -61 94 -37
7948 -37 58 -62 85 28 -39 -29 231 -163 -136 -74 -2 -15 -65 -275 -147 -6 -71 36 42 40 -17 15 -105 -119 -47 31 47
7975 47 -91 -45 -116 82 -66 -48 162 15 133 -12 92 -82 -189 -37 -16 31 46 102 -24 -48 -46 20 -141 80
7999 80 84 -122 -109 26 97 -15 104 22 116 31 -33 -43 112 -4 0 119 -43 25 -64 -96 120 35 59 -50 30 -80
8025 -80 2 -56 -59 106 -174 31 -130 -25 96 12 123 -28 57 48 93 70 186 20 -2 -86 -158 158 -117 -49 63
$$ packed form
7847A27j39K6R9j62J35j41J52k40L16k05O4k5R3J4j69J09L0m1l0K3k0N7M4j57
7871d0J77j24O2K5l5j10O1O8n3M6k84J01J64j62J24j28J40r9P3J2k19J29p6R9
7895d9N5J16j09k7q2J11L1L4j99j3K45j21M3j04J38O0j46k0j01J17QJ3K0P3l6
7920E7l5j45K85q7r3N5p3N%r1R5P3L4lj5q1j0L3P2j37J05rj22J02L8j14J55j31
7948c7R5j20J47n7o7J0K60l94K7O2P2j3n0k10J28J41o5J07Okn7L2j20j4P2P8J6
7975D7j38M6p1J98j48J8K10j47J18j45J04j74j07J52K1M7J5N6j26k4KO6j61K21
7999H0Mk06J3J35P1j12J19q2R4q5o4j0J55j16MJ19j62O8q9l2K16q5K4j09Q0j10
8025h0Q2n8lJ65k80K05j61J05J21q4J11j51Q5rM5k3J16j66k2q4p2L16k75O8J12
$$ plain form
8050 63 -146 -24 50 146 35 240 -116 -56 45 104 64 -67 17 -23 6 -138 42 51 2 67 -79 -125 105 -19 -70
8075 -70 108 27 85 19 28 -68 -155 -40 153 117 149 47 -59 -54 -111 38 54 -140 -94 100 2 -45 31 28 -76 87 -138
8102 -138 -138 -38 -1 -51 7 -19 -101 -26 -144 109 -2 -58 87 -176 -59 35 -155 49 -92 -74 73 -28 83 -189
8126 -189 51 -70 9 -69 21 6 116 123 5 -135 -22 71 -30 -13 -34 11 -93 -63 -49 20 -45 58 -94 -25 35
8151 35 -216 23 46 2 30 -14 -9 -57 -95 28 53 20 109 -141 127 -11 5 29 -144 -57 -83 34 -76 -171 70 59
8177 59 -35 23 -105 -1 -13 -80 70 -34 -38 228 -59 63 35 -15
$$ packed form
8050F3k09J22P4R6j11K05l56O0J01N9m0j31Q4m0K9j44J80Rm9O5j46m6K30j24n1
8075g0J78q1N8o6Rr6q7J15J93l6L2j02j06Nn7J49J6j94M6J94r8m7P6lj04J63k25
8102a38%J00L7n0N8k6q2P5j18K53j11n6J45k63J17R4j90K04j41J8J47j01J11k72
8126a89K40j21P9p8R0j5J10Pj18j40J13R3j01J7k1M5j04L0J4O9o5J03j52O9O0
8151C5k51K39K3m4K8m4Nm8l8J23K5l3Q9k50K68j38J6K4j73Q7k6J17j10r5K41j1
8177E9r4N8j28J04j2o7J50j04mK66k87J22k8n0
8191a5
$$ Imaginary data points
##PAGE= N=2
##DATA TABLE= (X++(I..I)), XYDATA
$$ plain form
0 0 0 0 0 0 0 0 0 0 0 0 0 0 0 0 0 0 0 0 0 0 0 0 0 0 4 -8 8 -8 8 -8 8 -9 15 -16 16 -17 21 -24 25 -29 33 -36 40 -44 48
45 48 -54 60 -65 71 -78 87 -97 105 -117 129 -144 160 -176 197 -222 252 -288 332 -391 470 -587
66 -587 771 -1105 1940 -9505 -6275 6673 10697 24568 32976 33654 32397 35723 31273 21904 15975
81 15975 14895 7798 -11 -766 1337 -1655 -2600 2720 6228 3797 4404 8652 7292 831 -528 -1109
97 -1109 -7561 -14758 -14929 -16115 -21865 -23159 -18268 -16285 -16826 -11501 -3668 -1179 479 6483 11097 9561
113 9561 9061 11686 10734 5938 4261 5434 2721 -1099 454 2822 1352 906 5484 7597 5681 6260
129 6260 9472 7770 3607 3118 2762 -2311 -6744 -6518 -7727 -12087 -12632 -9632 -9177 -9983 -6296 -1628 -953
146 -953 -182 3916 6432 4625 4254 6123 4854 1393 754 1670 -676 -3232 -1301 204 -1171 -750 2824
$$ packed form
0@%%%%%%%%%%%%%%%%%%%%%%%%Mj2J6j6J6j6J6j7K4l1L2l3L8m5M9n4O2o9P6q4R2
45D8j02J14j25J36j49J65j84K02k22K46k73L04l36L73m19M74n40O20p23Q61j057
66e87J358j876L045j1445L230J2948M024J3871Q408O78j257L326m450r369n929
81A5975j080p097p809p55K103k992r45N320L508k431O07M248j360o461j359n81
97a109o452p197j71j186n750j294M891J983n41N325P833K489J658O004M614j536
113I561n00K625r52m796j677J173k713l820J553K368j470m46M578K113j916N79
129F260L212j702m163m89l56n073m433K26j209m360n45L000M55q06L687M668O75
146i53P71M098K516j807l71J869j269l461o39R16k346k556J931J505j375M21L574
$$ plain form
163 2824 3994 2615 3895 6340 4661 2251 2502 2374 -1372 -3816 -3090 -4107 -7125 -7115 -4757 -5047 -5710
180 -5710 -3061 -65 -119 249 3151 4396 2724 2595 4107 2999 368 199 1165 -1086 -2694 -1130 -232
197 -232 -1566 -1254 1471 1833 671 1871 3919 2616 1175 2340 2535 6 -1120 -99 -588 -2599
213 -2599 -2225 -750 -1226 -2194 -606 846 -281 -651 1061 1225 -765 -635 175 -1058 -3324 -2579 -2044
230 -2044 -3627 -4467 -2954 -2360 -3578 -2584 -347 -176 -314 1439 3250 2846 2747 4649 5289 4352 4346 5601
248 5601 5050 3668 4014 4445 2799 1354 1813 1464 -550 -1594 -993 -2074 -4009 -3941 -3546 -4770 -5809
265 -5809 -5150 -4609 -5746 -5853 -4325 -4153 -4675 -3587 -2120 -1873 -1808 75 1562 1767 2378 4552 5495 5145
283 5145 5786 7005 6593 5502 5459 5513 3713 2319 2186 1164 -774 -1735 -1217 -2190 -3286 -2732 -1985 -2525
$$ packed form
163B824J170j379J280K445j679k410K51j28l746k444P26j017l018J0K358k90o63
180e710K649K996n4L68K902J245j672j29J512j108k631j69R66k251j608J564Q98
197b32j334L12K725L62j162J200K048j303j441J165J95k529j126J021m89k011
213b599L74J475m76r68J588J452j127l70J712J64j990J30Q10j233k266P45N35
230b044j583q40J513N94j218R94K237J71j38J753J811m04r9J902O40r37oJ255
248E601n51j382L46M31j646j445M59l49k014j044O01j081j935O8L95j224j039
265e809O59N41j137j07J528J72n22J088J467K47O5J883J487K05O11K174R43l50
283E145O41J219m12j091m3N4j800j394j33j022j938r61N18r73j096N54P47n40
$$ plain form
301 -2525 -2690 -1364 -1204 -1842 -1800 -1168 -1580 -2563 -2503 -1970 -2695 -3270 -2253 -1735 -1829 -1374 439 1102 928 1824
321 1824 2976 2751 2083 2684 2343 1061 371 339 -354 -1368 -1410 -769 -651 -555 673 1992 2082 2835 3854
340 3854 4270 3481 3258 3194 1945 486 -303 -1232 -2730 -3917 -3444 -3726 -4133 -3480 -2415 -1987 -1810 -683
358 -683 210 47 -23 305 -73 -981 -1356 -1515 -2182 -2395 -1938 -1214 -684 211 1871 3107 3787 4933 5983
377 5983 6197 5727 5303 4773 3138 1468 434 -790 -2734 -3790 -3985 -4339 -4675 -3966 -3120 -2756 -2135 -1070
395 -1070 -473 -682 -549 -430 -987 -1872 -1979 -2250 -2504 -2480 -1935 -909 -141 1294 2802 4120 5281 6272 7044
414 7044 7287 6713 6293 5186 3427 1739 293 -1432 -3174 -4218 -4881 -5516 -5665 -5190 -4698 -4233 -3575 -2913
432 -2913 -2204 -2186 -2067 -1945 -2144 -2293 -2296 -2226 -2147 -1640 -587 484 1900 3437 5240 6427 7639 8605 9230
$$ packed form
301b525j65J326J60o38M2O32m12r83O0N33p25n75J017N18r4M55J813O63j74Q96
321A824J152k25o68O01l41j282o90l2o93j014m2O41J18R6J228J319R0P53J019
340C854M16p89k23o4j249j459p89r29j498j187M73k82m07O53J065M28J77J127
358f83Q93j63p0L28l78r08l75j59o67k13M57P24N30Q95J660J236O80J146J050
377E983K14m70m24n30j635j670j034j224j944j056j95l54l36P09Q46L64O21J065
395a070N97k09J33J19n57q85j07k71k54K4N45J026P68J435J508J318J161R91P72
414G044K43n74m20j107j759j688j446j725j742j044o63o35j49M75M92M65O58O62
432b913P09J8J19J22j99j49lP0P9N07J053J071J416J537J803J187J212R66O25
$$ plain form
451 9230 8666 8046 7294 5578 3781 1819 201 -2038 -4020 -4916 -5787 -6511 -6741 -6334 -6000 -5525 -4596 -3967
469 -3967 -3255 -3112 -2639 -2334 -2306 -2354 -1887 -1670 -1575 -781 209 1179 2239 3743 4928 5774 6486 7215 7150 6795
489 6795 6110 5154 3713 2059 901 -695 -2240 -3141 -3993 -4336 -4581 -4115 -3828 -3207 -2448 -1851 -1087 -627
507 -627 -130 -85 -69 -320 -573 -672 -941 -1315 -1011 -798 -533 -155 710 1128 1532 2072 2452 2294 2023 1725 1322
528 1322 734 54 -514 -973 -1523 -1773 -1732 -1557 -1014 -424 250 881 1373 2044 2281 2284 2484 2292 1561 1106 524
549 524 -50 -828 -1464 -1384 -1973 -2009 -1881 -1696 -1554 -1454 -958 -550 -603 -441 -338 -323 -524 -391 -319 -626 -651 -116
571 -116 108 101 641 1127 1471 1689 1989 2196 2413 2026 2021 1608 1043 637 281 -351 -1080 -1211 -1338 -1865 -2030 -1769
593 -1769 -1617 -1658 -1438 -728 -896 -730 -114 34 -100 63 187 519 502 611 731 859 783 835 1073 1140 870 1067
$$ packed form
451I230n64o20p52j716j797j962j618k239j982q96q71p24k30M07L34M75R29O29
469c967P12J43M73L05K8m8M67K17R5P94R90R70J060J504J185Q46P12P29o5l55
489F795o85r56j441j654j158j596j545r01q52l43k45M66K87O21P59N97P64M60
507f27M97M5J6k51k53r9k69l74L04K13K65L78Q65M18M04N40L80j58k71k98m03
528A322n88o80n68m59n50k50M1J75N43N90O74O31M92O71K37LK00j92p31m55n82
549E24n74p78o36Q0n89l6J28J85J42J00M96M08n3J62J03J5k01J33P2l07k5N35
571a16K24pN40M86L44K18L00K07K17l87nm13n65m06l56o32p29j31j27n27j65K61
593a769J52m1K20P10j68J66O16J48j34J63J24L32j7J09J20J28p6N2K38O7k70J97
$$ plain form
615 1067 1119 893 767 760 535 -3 -202 -252 -666 -1051 -988 -1034 -1541 -1573 -1219 -1486 -1657 -1228 -1153 -1047 -811 -256 -21
638 -21 -67 360 662 1006 998 1165 1333 1136 1046 1180 1193 885 615 530 526 142 18 366 79 -121 -43 -53 -468 -511
662 -511 -310 -460 -882 -969 -826 -1034 -1197 -1260 -977 -1062 -1022 -427 -204 -20 312 918 933 1005 1189 1296 871 614
684 614 591 275 -334 -389 -665 -751 -1033 -861 -411 -800 -699 91 335 117 583 951 707 552 825 994 567
705 567 403 488 401 527 567 785 899 685 627 890 508 315 275 -109 -806 -1168 -1348 -1905 -2504 -2778 -2653 -2908
727 -2908 -2741 -2266 -1853 -1550 -913 22 707 878 1728 2252 2292 2200 2417 2454 2207 1913 1784 1707 1250 1216 1366 1039
749 1039 733 724 778 219 -165 -268 -849 -1574 -1882 -2165 -2769 -3085 -2933 -2835 -3041 -2843 -1959 -1366 -969 -385 246
770 246 975 1294 1912 2424 2281 2209 2182 2278 1871 1301 1516 1172 560 505 638 546 204 356 423 41 -237 69
$$ packed form
615A067N2k26j26pk25n38j99n0m14l85O3m6n07l2L54k67j71M29P5J06K36N55K35
638b1m6M27L02L44qJ67J68j97r0J34J3l08k70q5ml84j24L48k87k00P8j0m15m3
662e11K01j50m22q7J43k08j63o3K83q5M0N95K23J84L32O06J5P2J84J07m25k57
684F14k3l16o09n5k76q6k82J72M50l89J01P90K44k18M66L68k44j55K73J69m27
705E67j64Q5q7J26M0K18J14k14n8K63l82j93m0l84o97l62j80n57n99k74J25k55
727b908J67M75M13L03O37R35O85J71Q50N24M0r2K17L7k47k94j29p7m57l4J50l27
749A039l06rN4n59l84j03n81p25l08k83o04l16J52R8k06J98Q84N93L97N84O31
770B46P29L19O18N12j43p2k7R6m07n70K15l44o12n5J33r2l42J52O7l82k78L06
$$ plain form
792 69 -558 -990 -1004 -1184 -1603 -2004 -1872 -1775 -1758 -1756 -1100 -839 -795 -152 503 662 683 1035 1474 1019 809 1049 1051 604
816 604 452 526 321 5 431 638 474 428 769 897 471 434 752 266 -158 -394 -555 -969 -1363 -1444 -1470 -1884
838 -1884 -1759 -1205 -1140 -1200 -530 -283 -58 74 371 607 578 589 918 870 692 824 1048 991 883 1252 1185 1076
860 1076 944 1112 960 709 331 482 -27 -611 -803 -981 -1509 -1785 -1707 -1757 -1989 -1883 -1444 -1424 -1291 -680 -323
881 -323 -249 233 628 905 842 1104 1416 1156 1137 1286 1228 956 850 1192 914 703 553 616 350 -73 -261 -352
903 -352 -676 -1063 -883 -937 -1411 -1396 -1112 -1122 -1279 -977 -553 -461 -368 13 323 359 574 888 1002 747 783 910 970
926 970 790 796 804 424 193 211 277 0 -75 -106 -346 -524 -470 -252 -695 -686 -513 -588 -598 -597 -412 -389 -647 -294 77 7
952 7 173 458 399 413 365 691 701 318 427 571 377 113 271 427 -84 97 20 27 -224 -262 -121 -196 -320 -467
$$ packed form
792F9o27m32j4j80m19m01J32R7J7KO56K61M4O43O55J59K1L52M39m55k10K40Km47
816F04j52P4k05l16M26K07j64m6L41J28m26l7L18m86m24k36j61m14l94q1k6m14
838a884J25N54O5o0O70K47K25J32K97K36k9J1L29m8j78J32K24n7j08L69o7j09
860A076j32J68j52k51l78J51n09n84j92j78n28k76P8n0k32J06M39K0J33O11L57
881c23P4M82L95K77o3K62L12k60j9J49n8k72j06L42k78k11j50O3k66m23j88r1
903c52l24l87J80n4m74J5K84j0j57L02M24R2R3L81L10L6K15L14J14k55L6J27O0
926I70j80OQl80k31J8O6k77p5l1k40j78N4K18m43RJ73p5j0JJ85K3k58L53L71p0
952GJ66K85n9J4m8L26J0l83J09J44j94k64J58J56n11J81p7Pk51l8J41p5j24j47
$$ plain form
976 -467 -329 -507 -521 -407 -427 -621 -408 -252 -166 -349 52 228 -26 130 271 304 339 461 497 515 424 513 718
999 718 434 511 530 387 331 12 260 -131 -305 -179 -301 -478 -530 -616 -530 -647 -615 -526 -369 -488 -320 -226 -226 30
1023 30 -41 174 134 211 456 332 263 338 302 428 226 263 320 258 82 171 13 -85 -96 -79 92 -159 -90 -129 -27
1048 -27 -77 -74 -48 -60 39 221 202 -77 68 74 -70 25 9 11 -74 -243 -56 -394 -392 -340 -253 -538 -600 -461 -251 -468 -478
1075 -478 -124 -106 128 165 578 447 702 1010 979 1055 869 1011 1063 746 577 387 222 -112 -61 -305 -721 -675
1097 -675 -764 -915 -1123 -1106 -1083 -1256 -1097 -970 -1097 -1055 -944 -421 -483 -507 171 292 469 786 1140 1364 1328 1667
1119 1667 1779 1837 1614 1510 1372 937 446 232 45 -414 -721 -1069 -1069 -1428 -1481 -1359 -1501 -1470 -1175 -993 -977 -666
1141 -666 -445 -218 -460 -91 131 191 363 619 728 898 923 1311 1342 1208 1278 1428 1098 921 717 583 -174
$$ packed form
976d67J38j78j4J14k0j94K13J56Q6j83M01J76k54J56J41L3L5J22L6J8r1Q9K05
999G18k84P7J9j43n6l19K48l91j74J26j22j77n2q6Q6j17L2Q9J57j19J68R4%K56
1023C0p1K15m0P7K45j24o9P5l6J26k02L7N7o2j76Q9j58r8j1J7J71k51O9l9J02
1048b7n0LK6j2R9J82j9k79J45Oj44R5j6Kq5j69J87l38KN2Q7k85o2J39K10k17j0
1075d78L54J8K34L7M13j31K55L08l1P6j86J42N2l17j69j90j65l34N1k44m16M6
1097f75q9j51k08J7K3j73J59J27j27M2J11N23o2k4O78J21J77L17L54K24l6L39
1119A667J12N8k23j04j38m35m91k14j87m59l07l48%l59n3J22j42L1K95J82J6L11
1141f66K21K27k42L69K22O0J72K56J09J70K5L88L1j34P0J50l30j77k04j34p57
$$ plain form
1162 -174 -342 -573 -963 -1170 -1352 -1533 -1389 -1287 -1164 -1049 -745 -591 -277 41 83 336 576 559 464 662 563
1183 563 593 577 756 623 574 406 736 744 647 629 676 364 49 -9 -276 -671 -1026 -1128 -1304 -1421 -1412 -1260 -1318 -924
1207 -924 -652 -272 -24 16 394 665 676 897 1010 873 657 736 601 529 347 410 436 292 264 492 399 213 67
1230 67 110 132 -297 -329 -506 -789 -1028 -1171 -1325 -1473 -1252 -986 -1051 -730 -409 -26 123 501 779 964 1049 1094
1252 1094 1239 1078 831 910 651 440 425 258 50 92 121 -80 -90 -222 -288 -575 -688 -742 -847 -1006 -1353 -1317
1274 -1317 -1388 -1272 -1279 -1148 -839 -442 -347 172 640 901 1234 1678 1678 1749 1652 1700 1590 1185 1185 901 505 163 114 -148
1298 -148 -308 -597 -775 -826 -1023 -946 -1169 -1326 -1464 -1304 -1348 -1383 -1250 -1174 -1097 -914 -613 -447 -61 210 534 959
1320 959 1251 1455 1730 1580 1692 1600 1536 1254 1163 752 527 193 233 -190 -352 -237 -673 -645 -617 -589 -727 -826 -739
$$ packed form
1162a74j68k31l90k07j82j81J44J02J23J15L04J54L14L18M2K53K40j7r5J98r9
1183E63L0j6J79j33m9j68L30Qr7j8M7l12l15n8k67l95l55j02j76j17RJ52n8L94
1207i24K72L80K48M0L78K71J1K21J13j37k16P9j35p2j82O3K6j44k8K28r3j86j46
1230F7M3K2m29l2j77k83k39j43j54j48K21K66o5L21L21L83J49L78K78J85Q5M5
1252A094J45j61k47P9k59k11j5j67k08M2K9k01j0j32o6k87j13n4j05j59l47L6
1274a317p1J16pJ31L09L97R5N19M68K61L33M44%P1r7M8j10m05%k84l96l42m9k62
1298a48j60k89j78n1j97P7k23j57j38J60m4l5J33P6P7J83L01J66L86K71L24M25
1320I59K92K04K75j50J12r2o4k82r1m11k25l34M0m23j62J15m36K8K8K8j38r9Q7
$$ plain form
1343 -739 -792 -588 -472 -675 -372 -424 -429 -359 -234 -299 -113 49 206 258 195 108 275 289 211 426 320 47 148 281
1367 281 273 -48 -11 162 152 30 150 414 243 380 381 417 372 376 498 467 71 210 276 22 -171 -73 -277 -574
1391 -574 -526 -755 -704 -973 -1164 -940 -899 -796 -574 -545 -327 -198 45 273 365 557 650 598 702 920 816 796 698
1414 698 829 918 636 517 660 548 557 610 281 20 16 -260 -622 -918 -1033 -1234 -1387 -1426 -1478 -1264 -1205 -1053 -930
1437 -930 -452 -176 85 460 551 640 835 1024 849 891 875 888 766 832 619 569 585 747 647 606 229 367 263
1460 263 -21 -269 -556 -628 -1101 -1290 -1308 -1676 -1614 -1679 -1434 -1305 -1143 -653 -513 -37 317 680 965 973 1218 1197
1482 1197 1295 901 1103 1065 956 725 746 816 706 712 783 643 500 523 170 64 -184 -504 -843 -1310 -1473 -1533 -1666
1505 -1666 -1795 -1879 -1423 -1381 -1211 -671 -287 121 615 724 1010 941 1077 1375 1008 825 657 655 512 164 159 440
$$ packed form
1343g39n3K04J16k03L03n2nP0J25o5J86J62J57N2o3q7J67J4p8K15j06k73J01J33
1367B81ql21L7J73j0j22J20K64j71J37JL6m5MJ22l1l96J39O6k54j93R8k04k97
1391e74M8k29N1k69j91K24M1J03K22K9K18J29K43K28R2J92R3n2J04K18j04k0r8
1414F98J31Q9k82j19J43j12RN3l29k61mk76l62k96j15k01j53l9n2K14N9J52J23
1437i30M78K76K61L75R1Q9J95J89j75M2j6J3j22O6k13n0J6J62j00m1l77J38j04
1460B63k84k48k87p2m73j89j8l68O2o5K45J29J62M90J40M76L54L63K85QK45k1
1482A197R8l94K02l8j09k31K1P0j10OP1j40j43K3l53j06k48l20l39m67j63o0j33
1505a666j29q4M56M2J70N40L84M08M94J09K86o9J36K98l67j83j68kj43l48nK81
$$ plain form
1527 440 235 268 534 365 309 364 490 126 -104 -100 -506 -528 -1087 -1006 -949 -1018 -839 -757 -636 -300 222 422 660
1550 660 724 1103 989 826 662 658 74 17 -246 -618 -966 -868 -978 -884 -872 -659 -452 -138 -33 207 379 334 362
1573 362 554 388 308 197 403 210 284 262 512 489 861 898 1307 994 960 925 774 562 204 7 -673 -854
1595 -854 -1363 -1530 -1527 -1816 -1536 -1441 -1405 -1012 -601 -299 -112 157 481 458 661 612 485 490 416 631 393 349 436 658
1619 658 461 638 914 921 861 677 761 557 394 87 -225 -539 -937 -881 -1108 -1159 -1196 -987 -917 -863 -441 -153 -84
1642 -84 100 388 405 285 707 542 345 285 92 350 -43 136 181 100 224 297 482 606 700 624 700 328 445
1665 445 158 -14 -320 -333 -364 -576 -852 -734 -574 -698 -680 -316 -395 -208 -163 44 117 140 54 -5 59 -15 30 183
1689 183 156 127 219 178 472 587 807 575 798 774 838 763 482 656 266 131 -175 -239 -309 -555 -671 -612 -641 -841
$$ packed form
1527D40k05L3K66j69n6N5J26l64k30Mm06k2n59Q1N7o9J79Q2J21L36N22K00K38
1550F60O4L79j14j63j64mn84n7k63l72l48R8j10R4J2K13K07L14J05K40J72m5K8
1573C62J92j66q0j11K06j93P4k2K50k3L72L7M09l13l4l5j51k12l58j97o80j81
1595h54n09j67Lk89K80R5L6L93M11L02J87K69L24k3K03m9j27Np4K15k38m4Q7K22
1619F58j97J77K76Po0j84Q4k04j63l07l12l14l98N6k27n1l7K09P0N4M22K88O9
1642h4J84K88J7j20M22j65j97o0j93K58l93J79M5q1J24P3J85J24R4p6P6l72J17
1665D45k87j72l06j3l1k12k76J18J60j24J8L64p9J87M5K07P3K3q6n9O4p4M5J53
1689A83k7k9R2m1K94J15K20k32K23k4O4p5k81J74l90j35l06o4p0k46j16N9k9k00
$$ plain form
1713 -841 -829 -647 -477 -629 -648 -472 -409 -533 -329 -406 -265 -13 144 152 -93 235 531 328 624 848 819 847 921
1736 921 1129 946 915 746 764 582 529 406 221 51 -32 -323 -180 -564 -578 -577 -934 -976 -811 -905 -929 -910 -902 -834 -694
1761 -694 -778 -627 -365 -403 -126 -118 -106 115 259 271 601 518 648 848 789 960 1188 1244 1005 1089 1032 634 702 608
1785 608 202 -90 -154 -323 -453 -632 -878 -838 -888 -958 -870 -621 -828 -697 -617 -604 -554 -447 -481 -361 -348 -274 -210 -78
1809 -78 -152 80 499 534 759 999 1026 980 1108 1007 813 598 635 421 88 -65 -124 -348 -519 -348 -340 -422 -428 -261
1833 -261 -377 -325 -195 -112 -38 -210 -199 -253 -522 -342 -487 -306 -402 -484 -196 -63 37 169 419 694 670 724 837
1856 837 568 663 516 156 134 -52 120 -331 -282 -262 -168 -109 -65 -58 66 -39 145 183 -51 -141 -243 -470 -533 -787
1880 -787 -664 -737 -810 -584 -399 -368 -122 242 585 680 772 1015 984 929 680 759 582 269 139 127 -62 -78 -41 -57
$$ packed form
1713h41J2J82J70j52j9J76O3j24K04p7J41K52J57Qk45L28K96k03K96K24k9K8P4
1736I21K08j83l1j69J8j82n3j23j85j70q3k91J43l84j4Jl57m2J65r4k4J9QO8J40
1761f94q4J51K62l8K77QJ2K21J44J2L30q3J30K00n9J71K28N6k39Q4n7l98O8r4
1785F08m06k92o4j69j30j79k46M0n0p0Q8K49k07J31Q0J3N0J07l4J20J3P4O4J32
1809g8p4K32M19L5K25K40K7m6J28j01j94k15L7k14l33j53n9k24j71J71Qq2oJ67
1833b61j16N2J30Q3P4j72J1n4k69J80j45J81r6q2K88J33J00J32K50K75k4N4J13
1856H37k69R5j47l60k2j86J72m51M9K0R4N9M4PJ24j05J84L8k34r0j02k27o3k54
1880g87J23p3p3K26J85L1K46L64L43R5R2K43l1n5k49P9j77l13j30j2j89j6L7j6
$$ plain form
1904 -57 74 -92 47 -46 5 -86 -131 -125 -421 -542 -561 -789 -951 -1101 -864 -757 -684 -308 -266 -42 405 511 736
1927 736 869 1074 1084 802 860 670 388 147 26 142 -144 -192 -149 -76 39 105 288 321 28 197 83 -50
1949 -50 131 6 -133 -511 -582 -441 -469 -525 -470 -253 -51 -8 162 333 178 241 334 355 21 -133 -59 -317 -422
1972 -422 -614 -331 -553 -531 -214 -91 -55 248 428 594 701 874 817 842 733 541 734 389 295 220 234 3
1994 3 42 113 -47 46 130 21 -95 -396 -224 -546 -399 -835 -977 -882 -1228 -931 -1041 -694 -885 -546 -349 75
2016 75 69 459 587 738 843 953 951 1024 981 669 828 614 485 410 282 320 445 296 157 80 -121 -35 -174 -381
2040 -381 -248 -687 -844 -816 -852 -1020 -944 -1107 -935 -693 -565 -473 -203 -136 103 329 393 705 714 700 791 602 682 686
2064 686 518 446 441 281 131 506 225 19 169 51 -117 -116 -305 -146 -468 -583 -589 -483 -726 -699 -693 -653 -545 -473
$$ packed form
1904e7J31j66J39r3N1r1m5Ok96j21j9k28j62j50K37J07P3L76M2K24M47J06K25
1927G36J33K05J0k82N8j90k82k41j21J16k86m8M3P3J15O6J83L3k93J69j14j33
1949e0J81j25j39l78p1J41k8n6N5K17K02M3J70J71j55O3R3K1l34j54P4k58j05
1972d22j92K83k22K2L17J23L6L03J80J66J07J73n7K5j09j92J93l45r4p5J4k31
1994CL9P1j60R3Q4j09j16l01J72l22J47m36j42R5l46K97j10L47j91L39J97M24
2016G5oL90J28J51J05J10kP3m3l12J59k14j29p5j28L8J25j49j39p7k01Q6j39k07
2040c81J33m39j57K8l6j68P6j63J72K42J28R2K70O7K39K26O4L12Rj4R1j89Q0M
2064F86j68p2nj60j50L75k81k06J50j18j68Jj89J59l22j15oJ06k43K7OM0J08P2
$$ plain form
2088 -473 -245 -111 -67 137 336 234 341 528 580 478 625 557 405 471 354 283 172 282 166 -137 -84 -78 -79
2111 -79 -266 -296 -304 -372 -400 -237 -483 -373 -398 -492 -392 -281 -220 -66 -111 -178 -155 58 246 161 122 106 227 208 368
2136 368 382 360 254 403 194 340 127 198 168 287 48 259 100 48 130 50 112 -31 146 138 93 71 -158 108
2160 108 -245 -190 -333 -450 -352 -472 -559 -591 -576 -431 -432 -342 -204 -257 -156 105 31 112 266 244 241 239 603 575 480 604
2186 604 602 730 696 551 709 729 627 560 353 335 94 -193 -354 -465 -706 -745 -899 -1005 -1108 -1115 -680 -926 -880
2209 -880 -482 -353 -114 5 32 198 167 251 251 323 244 280 528 534 623 616 686 640 809 626 509 496 390 254 153
2234 153 -132 -376 -567 -637 -553 -840 -724 -631 -493 -529 -456 -308 -215 -178 -20 90 201 341 360 333 244 120 145 236
2258 236 126 158 210 349 266 181 322 441 405 135 95 -15 -50 -134 -218 -331 -557 -628 -428 -369 -451 -313 -293 -189
$$ packed form
2088d73K28J34M4K04J99j02J07J87N2j02J47o8j52O6j17p1j11J10j16l03N3Oj
2111g9j87l0qo8k8J63k46J10k5r4J00J11O1J54m5o7K3K13J88q5l9j6J21j9J60
2136C68J4k2j06J49k09J46k13P1l0J19k39K11j59n2Q2q0O2j43J77qm5k2k29K66
2160A08l53N5j43j17R8j20q7l2J5J45jR0J38n3J01K61p4Q1J54k2lkL64k8r5J24
2186F04kJ28l4j45J58K0j02o7k07j8k41k87j61j11k41l9j54j06j03pM35k46M6
2209h80L98J29K39J19K7J66l1Q4%P2p9L6K48OQ9pP0m6J69j83j17j3j06j36j01
2234A53k85k44j91p0Q4k87J16R3J38l6P3J48R3L7J58J10J11J40J9k7q9j24K5R1
2258B36j10L2N2J39q3q5J41J19l6k70m0j10l5q4q4j13k26p1K00N9q2J38K0J04
$$ plain form
2282 -189 98 241 120 289 97 261 350 190 129 115 68 50 -139 -90 50 0 123 -40 -36 48 162 104 66 -40
2306 -40 -189 -248 -261 -216 -210 -422 -449 -493 -169 -105 -181 37 112 275 404 307 299 410 393 489 189 376 98 104 -320 -291
2332 -291 75 -100 -214 -50 -252 -71 -99 -110 -202 -55 -102 -37 -65 -126 -223 -101 -25 -146 -147 -12 97 72 394 196
2356 196 324 360 728 582 478 306 183 45 -79 -61 -165 -535 -600 -478 -624 -464 -446 -346 -286 -329 -103 -139
2378 -139 -293 53 -78 142 42 -2 148 164 160 293 566 519 518 827 542 461 471 498 364 319 314 122 -137 -134 -257
2403 -257 -477 -551 -656 -522 -498 -761 -552 -438 -317 -306 -361 -258 -236 -86 35 -62 139 261 221 136 305 517 438
2426 438 373 332 425 409 383 434 384 383 242 209 20 -71 -151 -63 -326 -187 -218 -164 -334 -325 -199 -135 -136 3 84 -151 52
2453 52 18 39 -16 54 131 99 43 -75 -53 8 -155 -19 245 5 -6 188 206 11 184 -11 194 12 -5 82 29
$$ packed form
2282a89K87J43j21J69j92J64Q9j60o1j4m7j8j89M9J40n0J23j63MQ4J14n8l8j06
2306d0j49n9j3M5Ok12k7m4L24O4p6K18P5J63J29r7qJ11j7R6l00J87k78Om24K9
2332b91L66j75j14J64k02J81k8j1r2J47m7O5k8o1r7J22P6j21jJ35J09k5L22j98
2356A96J28L6L68j46j04j72j23j38j24J8j04l70o5J22j46J60J8J00O0m3K26l6
2378a39j54L46j31K20j00m4J50J6mJ33K73m7jL09k85q1J0K7j34m5nj92k59Lj23
2403b57k20p4j05J34K4k63K09J14J21J1n5J03K2J50J21r7K01J22m0q5J69K12p9
2426D38o5m1R3j6k6N1n0jj41l3j89r1q0Q8k63J39l1N4j70RJ26O4jJ39Q1k35K03
2453E2l4K1n5P0P7l2n6j18K2O1j63J36K64k40j1J94J8j95J73j95K05j82j7Q7n3
$$ plain form
2478 29 -40 103 172 188 227 54 126 91 38 139 -43 49 -64 -88 -19 -185 -99 -231 -199 -152 -226 -368 -251 -302 -146
2503 -146 -135 -130 -86 27 -106 112 146 91 178 226 421 252 199 216 297 185 118 65 142 -123 20 10 -67 -140 -94 -216
2529 -216 -154 -332 -436 -220 -175 -206 -329 -255 -292 -388 -185 -199 -46 -24 73 -82 113 311 249 373 208 247 319 287
2553 287 239 441 242 280 68 44 -58 -13 -17 -183 -286 -203 -178 -296 -150 -271 -403 -325 -310 -417 -325 -404 -277 -188
2577 -188 -171 -64 -56 172 32 187 146 373 384 340 482 328 477 592 388 258 159 86 230 -76 24 -101 -79
2600 -79 -316 -149 -144 -309 -337 -355 -305 -249 -349 -395 -232 -302 -49 -97 -107 -317 9 93 127 216 165 320 347 336 337 122
2626 122 333 309 222 65 30 40 -81 -246 -249 -164 -219 -178 -138 -236 -70 -104 -13 -19 -116 171 43 -12 -27 163 21 -118
2652 -118 -3 180 279 51 105 31 -42 20 -69 78 -31 -71 -101 -119 -353 -194 -131 -191 -164 -100 25 -182 -119 -42 190
$$ packed form
2478B9o9J43O9J6L9j73P2l5n3J01j82R2j13k4O9j66Q6j32L2M7p4j42J17n1J56
2503a46J1NM4J13j33K18L4n5Q7M8J95j69n3J7Q1j12o7n3P7k65J43j0p7p3M6j22
2529b16O2j78j04K16M5l1j23P4l7r6K03j4J53K2R7j55J95J98o2J24j65L9P2l2
2553B87m8K02j99L8k12k4j02M5mj66j03Q3K5j18J46j21j32P8J5j07R2p9J27Q9
2577a88J7J07QK28j40J55m1K27J1m4J42j54J49J15k04j30r9p3J44l06J00j25K2
2600g9k37J67Nj65k8j8N0N6j00m6J63p0K53m8j0k10L26Q4L4Q9n1J55K7j1Jk15
2626A22K11k4q7j57l5J0j21j65lQ5n5M1M0r8J66l4R1or7K87j28n5j5J90j42j39
2652a18J15J83R9k28N4p4p3O2q9J47j09m0l0j8k34J59O3o0K7O4J25k07O3P7K32
$$ plain form
2677 190 85 99 259 159 82 135 111 15 122 205 182 -22 7 100 38 91 164 120 -54 -30 101 -140 10 -183 -73
2702 -73 -161 -310 -61 -24 -34 -220 68 63 -60 -239 66 144 116 -61 52 -5 31 100 55 -70 105 -49 -87 -40 -31
2727 -31 125 -86 32 93 29 71 134 224 88 -33 70 -4 69 39 43 -44 -79 -263 -35 -125 -175 76 -221 -89 -80 35
2753 35 -180 -290 -19 20 -11 -131 -55 68 47 1 85 -17 52 286 67 78 128 34 153 -29 0 37 313 -31
2777 -31 -176 -41 -137 -41 -194 15 -119 -153 -240 -24 -110 -31 -127 -77 -109 -168 -56 80 -110 -34 209 134 100 198 88
2802 88 156 63 156 -15 -30 66 122 -102 -85 122 -161 12 -27 74 -186 -245 -127 -166 -311 -106 74 -178 -164 -177
2826 -177 117 60 -16 161 257 79 89 114 197 289 162 86 -74 155 126 179 -37 -42 212 -81 83 72 -52 8 23
2851 23 -201 50 -155 -209 -221 -183 -205 -255 26 31 -69 24 55 -150 -38 -33 24 165 21 151 75 51 -13 46 2 27
$$ packed form
2677A90j05J4J60j00p7N3k4r6J07Q3k3k04K9R3o2N3P3m4j74K4J31k41J50j93J10
2702g3q8j49K49L7j0j86K88nj23j79L05P8k8j77J13n7L6O9m5j25J75j54l8M7R
2727c1J56k11J18O1o4M2O3R0j36j21J03p4P3l0Mq7l5j84K28r0n0K51k97J32RJ15
2753C5k15j10K71L9l1j20P6J23k1m6Q4j02O9K34k19J1N0r4J19j82K9L7K76l44
2777c1j45J35r6R6j53K09j34l4q7K16q6P9r6N0l2n9J12J36j90P6K43p5l4R8j10
2802H8O8r3R3j71j5R6N6k24J7K07k83J73l9J01k60n9J18l9j45K05J80k52J4j3
2826a77K94n7p6J77R6j78J0K5Q3R2j27p6j60K29k9N3k16nK54k93J64j1j24O0J5
2851B3k24K51k05n4j2L8k2n0K81Nj00R3L1k05J12NN7J41j44J30p6k4o4N9m4K5
$$ plain form
2877 27 63 46 -72 -38 77 3 -23 94 -21 45 -51 -126 -129 -14 -218 -106 56 -29 -78 160 -62 52 117 -64 12
2902 12 82 85 107 -70 86 116 -61 -34 129 -15 -28 30 -41 99 -97 29 -72 -202 -70 -19 -85 -136 -125 -39 -127
2927 -127 -60 16 64 -64 27 126 89 175 99 197 133 139 145 -56 58 155 -135 73 -192 41 -96 42 -30 -66 -43 -157
2953 -157 -68 -43 -166 5 -137 112 49 -47 -46 30 -47 103 -11 204 97 120 90 59 44 14 51 -98 -125 9 55
2978 55 -118 -158 -89 24 -115 -74 -109 -54 -86 161 -66 -35 104 249 101 46 98 323 116 -98 5 5 -23 -116 39
3003 39 -21 -87 -142 -37 -169 -93 -155 -14 -146 -237 -229 -171 -106 -126 40 59 57 84 -52 153 48 208 303 121 86 302
3029 302 88 244 84 152 94 88 48 -152 -211 -61 -193 -292 -156 -417 -347 -172 -322 -178 -13 -179 -198 -259 -196 -86
3053 -86 47 -131 3 -51 182 327 255 367 258 179 309 265 381 239 76 216 132 25 46 30 -143 -300 -373
$$ packed form
2877B7L6j7j18L4J15p4k6J17j15O6r6p5lJ15k04J12J62q5m9K38k22J14O5j81P6
2902A2P0LK2j77J56L0j77K7J63j44j3N8p1J40j96J26j01j30J32N1o6n1J1Q6q8
2927a27O7P6M8j28R1R9l7Q6p6R8o4OOk01J14R7k90K08k65K33j37J38p2l6K3j14
2953a57Q9K5j23J71j42K49o3r6JP6p7J50j14K15j07K3l0l1j5l0L7j49k7J34M6
2978E5j73m0O9J13j39M1l5N5l2K47k27L1J39J45j48n5N2K25k07k14J03%k8r3J55
3003C9o0o6n5J05j32P6o2J41j32r1QN8O5k0J66J9kK7j36K05j05J60R5j82l5K16
3029C02k14J56j60O8n8om0k00n9J50j32r9J36k61P0J75j50J44J65j66j9o1O3J10
3053h6J33j78J34n4K33J45p2J12j09p9J30m4J16j42j63J40q4j07K1j6j73j57p3
$$ plain form
3076 -373 -401 -285 -184 -246 -243 -280 -275 -262 -88 -179 -228 -67 106 -121 97 33 97 42 197 367 132 270 313 189 236
3101 236 255 123 224 54 -27 15 -131 -182 -117 -223 -63 -253 -246 -189 -199 -210 -29 -161 -178 -157 91 -98 -68 110
3125 110 -34 -54 98 213 175 129 100 260 125 212 125 138 325 309 212 169 206 7 -54 -60 -158 -69 -76 -208 -164 -304
3151 -304 -245 -135 -164 -279 31 -112 -53 -12 189 3 61 3 93 136 178 -97 -23 26 71 81 17 19 137 138 29 7
3177 7 26 -144 -160 99 -89 -151 -96 15 -128 53 16 10 -140 37 73 -11 192 99 170 -74 -53 203 -89 -143 66
3202 66 -4 -76 -75 -41 -34 -69 -151 -102 -107 -184 -58 -22 -44 -34 -61 120 -66 47 -12 187 -6 237 235 325 147 227 164 137
3230 137 43 299 314 175 51 106 8 -35 -50 -146 -378 -284 -263 -245 -331 -148 -213 -168 -191 -159 45 -133 -89 43 32 -73
3256 -73 87 129 162 162 240 240 114 89 326 301 349 223 -31 153 64 260 -16 -8 -52 72 -89 -294 -228 33 -139
$$ packed form
3076c73k8J16J01o2Ll7NJ3J74r1m9J61J73k27K18o4O4n5J55J70k35J38M3j24M7
3101B36J9j32J01j70q1M2j46n1O5j06J60j90PN7j0j1J81j32j7K1K48j89L0J78
3125A10j44k0J52J15l8m6k9J60j35Q7q7J3J87j6r7m3L7j99o1or8Q9pj32M4j40
3151c04N9J10k9j15L10j43N9M1K01j86N8n8R0M3M2k75P4M9M5J0o4KJ18Jj09k2
3177GJ9j70j6K59j88o2N5J11j43J81l7oj50J77L6q4K03r3P1k44K1K56k92n4K09
3202F6p0p2JL4Pl5q2M9np7J26L6k2J0k7J81j86J13n9J99j93K43kR0j78Q0o3k7
3230A37r4K56J5j39j24N5r8m3j5r6k32R4K1J8q6J83o5M5k3L2K04j78M4J32j1j05
3256g3J60M2L3%P8%j26k5K37k5M8j26k54J84q9J96k76Qm4J24j61k05O6K61j72
$$ plain form
3281 -139 -260 -104 -169 -198 -197 -176 -167 -41 -42 21 8 -135 197 211 95 194 21 86 29 97 168 22 -151 -71 64 46
3307 46 -45 -35 -63 153 -22 132 -12 -114 -33 -156 -7 27 -84 136 -76 -7 81 -55 -189 71 141 -213 65
3330 65 -30 -34 -71 -163 -133 -98 -46 -187 -86 -35 -78 -288 -182 -127 -9 60 -64 22 -7 146 -1 152 67 36 141 10
3356 10 -49 37 178 73 138 -72 -32 138 34 -59 -122 -239 -44 53 -136 -123 30 -139 -211 -106 -263 -172 -179 15
3380 15 113 -67 155 136 63 221 279 340 127 314 90 133 64 187 23 85 13 103 -144 3 20 21 -197 -86 -217
3405 -217 -173 -161 -280 -364 -382 -360 -297 -186 -346 -210 -1 -17 -12 105 94 184 161 247 335 172 325 349 446 324 251 149
3431 149 82 136 99 176 -17 37 -88 57 -142 -149 -194 -162 -588 -200 -249 -324 -366 -319 -257 -461 -156 -254 93 64 11 -82
3457 -82 99 51 187 198 296 118 260 203 85 432 104 433 120 177 177 38 -17 99 -46 -67 -8 -45 -69 102
$$ packed form
3281a39j21J56o5k9JK1RJ26jO3j3j43L32J4j16R9j73O5n7O8P1j46j73Q0J35j8
3307D6r1J0k8K16j75J54j44j02Q1j23J49L4j11K20k12O9Q8j36j34K60P0l54K78
3330F5r5ml7r2L0L5N2j41J01N1m3k10J06N5J18O9j24Q6k9J53j47J53q5l1J05j31
3356A0n9Q6J41j05O5k10M0J70j04r3o3j17J95R7j89J3J53j69p2J05j57R1pJ94
3380A5R8j80K22j9p3J58N8O1k13J87k24M3o9J23j64O2p2R0k47J47J7Jk18J11j31
3405b17M4J2j19q4j8K2O3J11j60J36K09j6NJ17j1R0k3Q6Q8j63J53K4R7j22p3j02
3431A49o7N4l7P7j93N4j25J45j99pm5L2m26L88m9p5m2M7O2k04L05r8L47k9n3r3
3457h2J81m8J36J1R8j78J42n7j18L47l28L29l13N7%j39n5J16j45k1N9l7k4J71
$$ plain form
3481 102 -110 -167 -142 -183 -219 -121 -299 -167 -213 32 -20 -92 -27 -80 3 -8 144 57 63 -114 -9 -2 40 24 -54 -65 81
3508 81 -27 -125 -79 208 125 74 205 165 111 284 -80 91 105 -257 66 130 -188 136 -115 -39 -74 -62 45 -54
3532 -54 14 -404 51 5 91 -144 -2 -147 -96 0 7 -107 36 -85 136 31 -83 36 8 97 96 96 279 129 133
3557 133 -46 13 51 -98 -9 80 -172 -163 -177 -69 -255 -275 -214 -6 -94 -94 -154 -89 68 -5 -38 4 -63 -72 58 58 125 163
3585 163 207 166 -66 91 127 7 99 176 135 94 162 3 57 87 28 -33 -131 -137 -143 -136 -148 -204 -54 -230 -240 -122 -179 42
3613 42 27 -63 -213 -61 -48 11 160 82 142 345 -82 182 305 149 220 71 198 229 7 153 164 70 60 104
3637 104 153 -184 196 90 -166 -143 -44 -46 -115 9 -140 -216 -255 12 43 -48 -217 -47 -85 -71 -133 -76 -18 -71 -210
3662 -210 -28 -38 111 14 136 26 127 -124 -48 108 39 229 126 -21 324 292 161 194 -74 -87 91 76 70
$$ packed form
3481A02k12n7K5m1l6R8j78J32m6K45n2p2O5n3Q3j1J52q7Oj77J05PM2j6p8j1J46
3508H1j08r8M6K87q3n1J31m0n4J73l64J71J4l62L23O4l18L24k51P6l5J2J07r9
3532e4O8m18M55m6Q6k35J42j45N1R6Pj14J43j21K21j05j14J19k8Q9j%J83j50M
3557A33j79N9L8j49Q9Q9k52Rj4J08j86k0O1K08q8%o0O5J57p3l3M2o7rJ30%O7L8
3585A63M4m1k32J57L6j20R2P7m1m1O8j59N4L0n9o1r8ooPj2n6J50j76j0J18n7K21
3613D2j5r0j50J52J3N9J49p8O0K03m27K64J23j56P1j49J27L1k22J46J1r4j0M4
3637A04M9l37L80j06k56K3R9ko9J24j49p6l9K67L1r1j69J70l8J4o2N7N8n3j39
3662b10J82j0J49r7J22j10J01k51P6J56o9J90j03j47L45l2j31L3k68j3J78j5o
$$ plain form
3685 70 58 -36 -96 -73 8 -88 -108 -127 -22 -152 -99 -283 -370 -224 -249 -164 -197 -56 -126 -102 11 176 107 -134 31 54
3711 54 95 191 43 -17 208 151 398 153 196 65 172 261 255 170 174 122 -9 -100 -204 -198 -143 -126 -188 -422 -184 -148 -296
3738 -296 -189 -41 -228 -51 -52 -193 6 -7 198 -60 87 69 117 67 -38 158 153 185 118 196 273 198 238 184 205
3763 205 81 -173 34 184 -18 -104 -59 -149 -207 9 -213 -93 -147 -223 29 4 -290 -229 -10 -69 49 -20 118
3786 118 7 73 7 37 130 146 54 225 176 123 123 217 118 125 212 182 -37 97 103 111 41 -65 -9 -60 -85 -150 -124 -105 -148
3815 -148 -106 -26 -16 -110 -144 -141 -240 -163 -43 -21 -44 -152 -108 -98 45 134 215 132 196 -8 205 329 172 306 178 286
3841 286 91 -84 31 37 23 19 90 -85 -148 -23 -85 -175 -116 -279 -218 -106 -129 -196 -190 -135 -211 -63 -104 58 -121 87
3867 87 -86 58 5 146 306 324 154 74 276 309 164 65 230 78 236 -2 -62 67 -60 59 -31 -29 -13 -215
$$ packed form
3685G0j2r4o0K3Q1r6k0j9J05j30N3j84q7J46k5Q5l3J41p0K4J13J65o9k41J65K3
3711E4M1R6j48o0K25n7K47k45M3j31J07Q9oq5Mn2j31r1j04ON5J7o2k34K38L6j48
3738b96J07J48j87J77jj41J99j3K05k58J47j8M8n0j05J96nL2o7P8P7p5M0n4K1
3763B05j24k54K07J50k02q6M5r0n8K16k22J20n4p6K52k5k94O1K19n9J18o9J38
3786A18j11O6o6L0R3J6r2J71m9n3%R4r9PQ7l0k19J34OQp0j06N6n1k5o5K6J9m3
3815a48M2Q0J0r4l4Lr9P7J20K2k3j08M4J0J43Q9Q1q3O4k04K13J24j57J34j28J08
3841B86j95j75J15Oj4mP1j75o3J25o2r0N9j63O1J12k3o7ON5p6J48m1J62j79K08
3867H7j73J44n3J41J60J8j70q0K02L3j45r9J65j52J58k38o0J29j27J19r0KJ6k02
$$ plain form
3891 -215 -171 -47 -169 -63 -34 -305 -58 -136 -312 -7 -83 -113 -206 -71 -37 -156 -26 341 37 40 75 138 106 88
3915 88 106 172 217 1 37 73 160 122 49 180 -78 52 37 124 43 48 -149 -110 -40 -207 -18 12 -130 -76 -234 -197
3941 -197 58 -86 -74 -16 103 -141 -18 -112 -42 81 -41 27 -102 -126 -5 183 -48 162 7 188 42 178
3963 178 42 -14 149 117 156 24 73 -44 184 127 152 -81 83 38 -31 -157 48 -19 10 -64 -93 -158 -106 -39 20
3988 20 -180 -101 -50 20 12 126 90 -61 133 -13 139 73 6 159 13 22 162 159 15 -10 105 -34 65 65 -79 -104
4014 -104 -73 -165 -69 -86 -25 27 -143 -181 -161 -72 56 21 -23 26 73 87 79 -73 -111 181 125 56 106 255 -29 33 116
4041 116 157 72 110 155 232 149 -108 45 74 -233 -27 -163 -160 -214 -47 -127 11 -35 -98 -234 -23 28 -4 -12 -46 -55 55
4068 55 117 -15 159 -32 160 -69 -20 37 109 76 223 172 -6 81 72 81 89 -2 -9 120 103 -44 90 21 20 30 -72
$$ packed form
3891b15M4J24j22J06K9k71K47p8j76L05p6l0r3J35L4j19J30L67l04LL5O3l2j8
3915H8J8O6M5k16L6L6Q7l8p3J31k58J30j5Q7q1Nj97L9P0j67J89L0j42N4j58L7
3941a97K55j44J2N8J19k44J23r4P0J23j22O8j29k4J21J88k31K10j55J81j46J36
3963A78j36n6J63l2L9j32M9j17K28n7K5k33J64m5o9j26K05o7K9p4k9o5N2O7N9
3988B0k00P9N1P0qJ14l6j51J94j46J52o6o7J53j46RJ40lj44k5J15j39R9%j44k5
4014a04L1r2R6j7O1N2j70l8K0Q9J28l5m4M9M7J4qj52l8K92n6o9N0J49k84O2Q3
4041A16M1q5L8M5P7q3k57J53K9l07K06j36Ln4J67q0J38m6o3j36K11N1l2ql4rJ10
4068E5O2j32J74j91J92k29M9N7P2l3J47n1j78Q7rRQr1pJ29j7j47J34o9jJ0j02
$$ plain form
4095 -72 139 59 -127 19 32 -74 -81 -130 -103 -49 -33 -234 -54 -21 40 -110 -158 -136 -194 -42 -107 86 44 -136 -14
4120 -14 -16 225 173 107 55 -32 178 207 69 220 155 87 146 71 16 -40 62 107 55 -156 -49 5 -143 -35 -232 -153
4146 -153 -263 -152 -166 -131 -119 -57 24 -91 -10 -80 63 -6 171 -15 140 69 83 165 2 136 126 301 18 140
4170 140 41 38 107 105 -6 -110 46 11 -161 -133 -21 -175 -51 -220 -98 -267 -107 -28 110 -20 26 -162 11
4193 11 -34 -68 0 181 224 -56 101 100 152 122 139 75 168 36 65 11 -22 57 137 40 -17 -158 -39 -74 -72 -58 -133 86
4221 86 -135 -119 -267 19 -4 -87 -92 -200 -214 78 -22 56 -103 -28 93 79 -133 62 52 61 154 57 68 92 161 209
4247 209 -45 20 -132 -31 -74 -100 -177 -76 6 -89 -121 -31 152 41 -138 -11 20 92 54 -117 90 88 -116 60
4271 60 110 84 30 56 -143 32 73 36 75 -143 210 92 118 49 1 -155 97 7 148 133 77 -169 -63 88 37
$$ packed form
4095g2K11q0j86J46J3j06pm9K7N4J6k01J80L3O1j50m8K2n8J52o5J93m2j80J22
4120a4kK41n2o6n2q7K10K9j38J51o5o8N9p5n5n6J02M5n2k11J07N4j48J08j97P9
4146a53j10J11j4L5J2O2Q1j15Q1p0J43o9J77j86J55p1J4Q2j63J34j0J75k83J22
4170A40r9lO9kj11j04J56l5j72K8J12j54J24j69J22j69J60P9J38j30M6j88J73
4193A1m5l4O8J81M3k80J57jN2l0J7o4R3j32K9n4l3P9Q0r7n7j41J19l5KJ4p5K19
4221H6k21J6j48K86k3q3nj08j4K92j00P8j59P5J21j4k12J95j0RR3r7J1K4O9M8
4247B09k54O5j52J01m3k6p7J01Q2r5l2R0J83j11j79J27L1P2l8j71K07kk04J76
4271F0N0k6n4K6j99J75M1l7L9k18L53j18K6o9m8j56K52r0J41j5n6k46J06J51n1
$$ plain form
4296 37 160 5 -92 -89 -8 65 -104 -136 76 -150 -121 -25 27 -41 -64 -119 -126 -185 -359 -76 -101 -83 35 20 -78 30 -20
4323 -20 178 -52 -25 -38 207 138 -52 168 17 224 27 11 83 51 39 68 -44 -82 -58 -61 -79 118 -50 -127 -282
4348 -282 -118 -23 65 -42 -152 -93 -57 -94 163 20 -27 83 9 -25 -30 -23 83 146 118 54 31 -43 89 60 -26 76
4374 76 8 104 -57 -76 -60 64 -84 87 -95 -182 66 -121 -93 74 -11 -57 -102 -121 -122 96 6 -42 -6 -13 88 -12
4400 -12 21 117 -130 26 36 13 76 41 -210 -13 42 -135 -99 27 39 -138 33 -106 140 93 -133 33 -101 110
4424 110 84 -2 38 -109 65 55 9 33 41 -61 -9 -65 -122 -198 -69 -10 84 -28 99 -48 -8 -156 -41 30 63 46
4450 46 -18 83 -40 -150 129 157 22 -113 52 112 -23 -20 -10 77 -30 -29 20 -49 -6 19 -27 -117 -68 -40 -117 42
4476 42 -47 -295 -133 9 27 -48 21 -41 5 44 -48 -26 106 -108 37 58 -107 -21 128 87 -119 36 146 139 147 91
$$ packed form
4296C7J23j55r7LQ1P3j69l2K12k26K9R6N2o8k3n5pn9j74K83k5J8J18j5r8J08n0
4323b0J98k30K7j3K45o9j90K20j51K07j97j6P2l2j2K9j12l8K4lj8J97j68p7j55
4348b82J64R5Q8j07j10N9L6l7K57j43m7J10p4l4nPJ06O3k8o4k3p4J32k9q6J02
4374G6o8R6j61j9J6J24j48J71j82q7K48j87K8J67q5m6m5j9jK18r0m8L6pJ01j00
4400a2L3R6k47J56J0k3O3l5k51J97N5j77L6J26J2j77J71j39K46m7k26J66j34K11
4424A10k6q6M0j47J74j0m6K4Qj02N2n6n7p6J29N9R4j12J27j47M0j48J15P1L3j7
4450D6o4J01j23j10K79K8j35j35J65O0j35LJ0Q7j07JM9o9M3K5m6r0M9K8p7J59
4476D2q9k48J62J42J8p5O9o2M6L9r2K2J32k14J45K1j65Q6J49m1k06J55J10pQn6
$$ plain form
4502 91 58 27 110 -114 -66 -66 -56 -8 18 -29 -85 -82 -142 -59 -93 -263 -92 -33 37 1 -49 76 -16 73 81 -116 124 -32
4530 -32 0 130 102 -9 38 61 57 29 52 -103 -128 -107 -104 -129 64 -90 -134 122 -59 -187 79 155 -283 -7 -5 7
4556 7 -40 87 49 91 88 -57 -38 3 94 223 91 47 125 70 -19 89 -32 -125 -5 0 91 -68 -2 99 -20 -83 -54
4583 -54 -10 -109 -99 -8 -61 93 100 125 84 -80 59 -216 -36 19 63 97 -184 13 32 52 -27 11 50 -80 -3 -41 24
4610 24 -178 -75 114 35 -28 65 -6 -73 -48 -4 -12 204 107 -48 18 38 -35 69 -7 -81 -51 -47 101 -153 23 58 -40
4637 -40 -163 -58 -145 95 -51 85 -29 45 96 16 -44 42 -80 86 57 65 20 -65 -65 -50 61 7 42 -13 16 -49 46
$$ packed form
4502I1l3l1Q3k24M8%J0M8K6m7n6Lo0Q3l4j70J71N9P0l6n0J25r2Q9Qj97K40j56
4530c2L2J30k8j11M7K3mk8K3j55k5K1Lk5J93j54m4K56j81j28K66P6m38K76KJ2
4556Gm7J27l8M2lj45J9M1R1J29j32m4P8n5q9J08j21r3J20NR1j59O6J01j19o3K9
4583e4M4r9J0R1n3J54PK5m1j64J39k75J80N5M4L4k81J97J9K0p9L8L9j30P7l8O5
4610B4k02J03J89p9o3R3p1o7K5M4qK16r7j55O6K0p3J04p6p4L0MJ48k54J76L5r8
4637d0j23J05q7K40j46J36j14P4N1q0o0Q6j22J66k9Qm5q5%J5J11n4L5n5K9o5R5
$$ [...]
8191a7
##END NTUPLES=NMR FID
##END=
