##TITLE=1H_AM_NVACRILAM
 CDCl3
 8 sc, 
 30.8.2023
##JCAMPDX= 6.0         $$ Bruker NMR JCAMP-DX V2.0
##DATA TYPE= NMR FID
##DATA CLASS= NTUPLES
##ORIGIN= UXNMR, Bruker Analytische Messtechnik GmbH
##OWNER= root
$$ XWIN-NMR		Version 3.5
$$ Wed Aug 30 16:56:17 2023 Russian Standard Time (UT+4h)  she@DPX200
##.OBSERVE FREQUENCY= 200.13135
##.OBSERVE NUCLEUS= ^1H
##.DELAY= (6, 6)
##.ACQUISITION MODE= SIMULTANEOUS
##.ACQUISITION SCHEME= undefined
##.AVERAGES= 8
##.DIGITISER RES= 18
##SPECTROMETER/DATA SYSTEM= spect
##.PULSE SEQUENCE= zg30
##.SOLVENT NAME= D2O
##.SHIFT REFERENCE= (INTERNAL, D2O, 0, 15.7039)
##AUDIT TRAIL= $$ (NUMBER, WHEN, WHO, WHERE, WHAT)
$$ ##TITLE= Audit trail, XWIN-NMR		Version 3.5
$$ ##JCAMPDX= 5.01
$$ ##ORIGIN= Bruker BioSpin GmbH
$$ ##OWNER= she
$$ F:/spectra/data/she/nmr/H-F/1/audita.txt
$$ ##AUDIT TRAIL=  $$ (NUMBER, WHEN, WHO, WHERE, WHAT)
(   1,<2023-08-30 16:53:20.78 +0400>,<she>,<DPX200>,
      <created by zg, POWCHK disabled, PULCHK disabled
       configuration hash MD5:
       00 E9 B6 7A A2 85 ED C7 34 08 36 98 17 FE 4E 26
       data hash MD5: 16K
       16 08 45 00 4F 33 95 38 46 51 79 FD F8 7C 74 81>)
$$ ##END=
$$ 
$$ hash MD5
$$ 00 D6 D8 C7 C9 23 6C 3C 4E CB B9 87 E6 50 3B 4C
##$RELAX= 
##$RELAX= 
##$RELAX= 
##$RELAX= 
##$RELAX= 
##$RELAX= 
$$ Bruker specific parameters
$$ --------------------------
##$DU= <F:/spectra>
##$EXPNO= 1
##$NAME= <H-F>
##$PROCNO= 1
##$TYPE= <nmr>
##$USER= <she>
##$AMP= (0..31)
100 100 100 100 100 100 100 100 100 100 100 100 100 100 100 100 100 100 
100 100 100 100 100 100 100 100 100 100 100 100 100 100 
##$AQSEQ= 0
##$AQ_mod= 1
##$AUNM= <au_zg>
##$AUTOPOS= <>
##$BF1= 200.13
##$BF2= 200.13
##$BF3= 200.13
##$BF4= 200.13
##$BF5= 200.13
##$BF6= 200.13
##$BF7= 200.13
##$BF8= 200.13
##$BYTORDA= 1
##$CFDGTYP= 0
##$CFRGTYP= 5
##$CHEMSTR= <none>
##$CNST= (0..31)
1 1 145 1 1 1 1 1 1 1 1 1 1 1 1 1 1 1 1 1 1 1 1 1 1 1 1 1 1 1 1 1 
##$CPDPRG= <>
##$CPDPRG1= <>
##$CPDPRG2= <>
##$CPDPRG3= <>
##$CPDPRG4= <mlev>
##$CPDPRG5= <mlev>
##$CPDPRG6= <mlev>
##$CPDPRG7= <mlev>
##$CPDPRG8= <mlev>
##$CPDPRGB= <>
##$CPDPRGT= <>
##$D= (0..31)
0 1.2 0 0 0 0 0 0 0 0.06 0 0.03 0 0 0 0 0.0002 0 0 0 0 0 0 0 0 0 0 0 0 
0 0 0 
##$DATE= 1693400000
##$DBL= (0..7)
120 120 120 120 120 120 120 120 
##$DBP= (0..7)
150 150 150 150 150 150 150 150 
##$DBP07= 0
##$DBPNAM0= <>
##$DBPNAM1= <>
##$DBPNAM2= <>
##$DBPNAM3= <>
##$DBPNAM4= <>
##$DBPNAM5= <>
##$DBPNAM6= <>
##$DBPNAM7= <>
##$DBPOAL= (0..7)
0.5 0.5 0.5 0.5 0.5 0.5 0.5 0.5 
##$DBPOFFS= (0..7)
0 0 0 0 0 0 0 0 
##$DE= 6
##$DECBNUC= <off>
##$DECIM= 32
##$DECNUC= <off>
##$DECSTAT= 4
##$DIGMOD= 1
##$DIGTYP= 9
##$DL= (0..7)
0 120 120 120 120 120 120 120 
##$DP= (0..7)
150 150 150 150 150 150 150 150 
##$DP07= 0
##$DPNAME0= <>
##$DPNAME1= <>
##$DPNAME2= <>
##$DPNAME3= <>
##$DPNAME4= <>
##$DPNAME5= <>
##$DPNAME6= <>
##$DPNAME7= <>
##$DPOAL= (0..7)
0.5 0.5 0.5 0.5 0.5 0.5 0.5 0.5 
##$DPOFFS= (0..7)
0 0 0 0 0 0 0 0 
##$DQDMODE= 0
##$DR= 18
##$DS= 0
##$DSLIST= <SSSSSSSSSSSSSSS>
$$ [...]
##$SUBNAM2= <"">
##$SUBNAM3= <"">
##$SUBNAM4= <"">
##$SUBNAM5= <"">
##$SUBNAM6= <"">
##$SUBNAM7= <"">
##$SUBNAM8= <"">
##$SUBNAM9= <"">
##$SW= 18.05172834244
##$SWIBOX= (0..15)
0 0 2 0 0 0 0 0 0 0 0 0 0 0 0 0 
##$SW_h= 3612.71676300578
##$TD= 16384
##$TD0= 1
##$TE= 0
##$TE2= 300
##$TE3= 300
##$TEG= 300
##$TL= (0..7)
0 120 120 120 120 120 120 120 
##$TP= (0..7)
150 150 150 150 150 150 150 150 
##$TP07= 0
##$TPNAME0= <>
##$TPNAME1= <>
##$TPNAME2= <>
##$TPNAME3= <>
##$TPNAME4= <>
##$TPNAME5= <>
##$TPNAME6= <>
##$TPNAME7= <>
##$TPOAL= (0..7)
0.5 0.5 0.5 0.5 0.5 0.5 0.5 0.5 
##$TPOFFS= (0..7)
0 0 0 0 0 0 0 0 
##$TUNHIN= 0
##$TUNHOUT= 0
##$TUNXOUT= 0
##$USERA1= <user>
##$USERA2= <user>
##$USERA3= <user>
##$USERA4= <user>
##$USERA5= <user>
##$V9= 5
##$VALIST= <valist>
##$VCLIST= <CCCCCCCCCCCCCCC>
##$VD= 0
##$VDLIST= <DDDDDDDDDDDDDDD>
##$VPLIST= <PPPPPPPPPPPPPPP>
##$VTLIST= <TTTTTTTTTTTTTTT>
##$WBST= 1024
##$WBSW= 4
##$XGAIN= (0..3)
0 0 0 0 
##$XL= 0
##$YL= 0
##$YMAX_a= 322358
##$YMIN_a= -370131
##$ZGOPTNS= <>
##$ZL1= 120
##$ZL2= 120
##$ZL3= 120
##$ZL4= 120
##$ABSF1= 10
##$ABSF2= 0
##$ABSG= 5
##$ABSL= 3
##$ALPHA= 0
##$AQORDER= 0
##$ASSFAC= 0
##$ASSFACI= 0
##$ASSFACX= 0
##$ASSWID= 0
##$AUNMP= <proc_1d>
##$AZFE= 0.1
##$AZFW= 0.1
##$BCFW= 1
##$BC_mod= 2
##$BYTORDP= 1
##$COROFFS= 0
##$CY= 11.3945322036743
##$DATMOD= 1
##$DC= 2
##$DFILT= <>
##$DTYPP= 0
##$F1P= 15.7292609196834
##$F2P= 12.9074282941183
##$FCOR= 0.5
##$FTSIZE= 0
##$FT_mod= 4
##$GAMMA= 1
##$GB= 0.15
##$INTBC= 1
##$INTSCL= 1
##$ISEN= 128
##$LB= 0.24
##$LEV0= 0
##$LPBIN= 0
##$MAXI= 10000
##$MC2= 0
##$MEAN= 0
##$ME_mod= 0
##$MI= 1.114404
##$NCOEF= 0
##$NC_proc= 0
##$NLEV= 6
##$NOISF1= 3.799351
##$NOISF2= 2.8
##$NSP= 1
##$NTH_PI= 0
##$NZP= 0
##$OFFSET= 15.70392
##$PC= 1
##$PHC0= -21053.35
##$PHC1= 15.85272
##$PH_mod= 1
##$PKNL= yes
##$PPARMOD= 0
##$PSCAL= 0
##$PSIGN= 0
##$REVERSE= no
##$SF= 200.130013532006
##$SI= 16384
##$SIGF1= 3
##$SIGF2= 2
##$SINO= 400
##$SIOLD= 16384
##$SREGLST= <1H.CDCl3>
##$SSB= 0
##$STSI= 0
##$STSR= 0
##$SW_p= 3612.71676300578
##$SYMM= 0
##$S_DEV= 0
##$TDeff= 0
##$TDoff= 0
##$TI= <>
##$TILT= no
##$TM1= 0
##$TM2= 0
##$TOPLEV= 0
##$USERP1= <user>
##$USERP2= <user>
##$USERP3= <user>
##$USERP4= <user>
##$USERP5= <user>
##$WDW= 1
##$XDIM= 8192
##$YMAX_p= 0
##$YMIN_p= 0
$$ End of Bruker specific parameters
$$ ---------------------------------
##NTUPLES= NMR FID
##VAR_NAME=  TIME,          FID/REAL,        FID/IMAG
##SYMBOL=    X,             R,               I
##VAR_TYPE=  INDEPENDENT,   DEPENDENT,       DEPENDENT
##VAR_FORM=  AFFN,          ASDF,            ASDF
##VAR_DIM=   8192,          8192,            8192
##UNITS=     SECONDS,       ARBITRARY UNITS, ARBITRARY UNITS
##FACTOR=    0.0002768,     1,               1
##FIRST=     0,             0,               0
##LAST=      2.2672688,     0,               0
##MIN=       0,             -370131,         0
##MAX=       2.2672688,     322358,          0
$$ Real data points
##PAGE= N=1
##DATA TABLE= (X++(R..R)), XYDATA
$$ [...]
3489I9m491k027Q51L755M846L548O21k681m698m229k355J111L902M705L376L85
3505F718k842m456m308k148J327L999M504L008p3k919m595m066j402J876M187
3520a190M886L002r0l056m533l757j237J646M346M315K412q03l420m838l787q32
3536f936K157M434M360K405q72l428m748l515m85K368M378M087K107r76l495m591
3552b750l112j40K675M502M228J694j158m099m572k918l80K600M329L818J344
3567F061j707l911m519k538J53L013M782L913J162j775l901m282k668O09L229
3582b379M586L558Q74k091m166m130k155M72L558M528K983O89k494m253m175k215
3598f810J226L384M322L058M91k458m241l661j720J502L897M350K960R2k834m109
$$ plain form
3489 99 -4392 -6419 -5568 -1813 3033 6581 7202 4521 -177 -4406 -6761 -5650 -1748 2957 6333 6718
3505 6718 3876 -580 -4888 -7036 -5709 -1710 2794 5802 5729 2810 -1785 -5851 -7253 -5377 -1190
3520 -1190 3696 6698 6608 3552 -981 -4738 -5975 -4329 17 4332 6744 5941 2521 -2317 -6104 -6936
3536 -6936 -4779 -345 4015 6420 5548 2120 -2628 -6143 -6628 -4260 118 4205 6312 5336 1841 -2750
3552 -2750 -5862 -6002 -3327 1175 5403 7097 5939 1840 -2732 -5650 -6030 -3430 899 4717 6061
3567 6061 4354 443 -4076 -6614 -6461 -3448 1334 5247 6409 4634 733 -3549 -6217 -5608 -2379
3582 -2379 2207 5765 6639 4548 382 -3748 -5903 -5431 -1873 2655 5638 6327 3833 -420 -4595 -6810
3598 -6810 -5584 -2200 2122 5180 5671 3213 -1028 -4689 -6409 -4907 -1010 3340 6300 6392 3558 -551
3614e51l805j446J356L641M288K521k58l115m304l613j112J733L873M148K371
3629E727o00l063m253l153r93K165L821M172K460n91l289m383l150m81K323M056
3645G68L748J917j219l412m303l152l41K290M108L723J495j233l426m115k728
3660e880k1K641M302L721J403j391l621m025k421L5K730M200L380J140j637l974
3676E82m158k323M67K888M099L288Q26j726m059l832k139Q79L119M155L099P09
3692E874k150l848l951j660J158L151M149K949J46k110m024l712j759R51L481
3707a355M072K550q1k443m172l396j269J476L573M300K448j60k665l935l389j074
3723e520J714L614L729K269n87k799m086l283o78J708L754L725K070n98l167l942
$$ plain form
3614 -551 -4356 -5802 -4446 -805 3483 6004 5746 2631 -1673 -5286 -6398 -4665 -792 3356 5727
3629 5727 5127 2064 -2189 -5342 -6335 -4170 -349 3823 6283 5692 2403 -1980 -5130 -5611 -3288 768
3645 768 4516 6433 5214 1802 -2501 -5653 -5994 -3704 404 4127 5622 4389 963 -3152 -5880
3660 -5880 -5901 -3260 1042 4763 6166 4775 1154 -2871 -5292 -5257 -2527 1673 5053 6193 4556 582
3676 582 -3576 -5899 -5432 -2544 1555 4843 5669 3943 -116 -3948 -6087 -5208 -2089 2066 5165 5874
3692 5874 3724 -124 -4075 -5735 -4577 -1426 2723 5672 5818 3708 -316 -4028 -5787 -4836 -1355
3707 -1355 2717 5267 5186 2743 -1429 -4825 -6094 -4618 -1045 3255 5703 5543 2878 -1057 -4446 -5520
3723 -5520 -3806 -192 3537 5806 5219 2420 -1666 -4949 -5627 -3919 -165 3560 5630 5032 1865 -2077
3739b077l006p13J956L702L741J805q67l188l833k637n9K153L854L581J625j012
3755E025l423l917k588m94K497L724L234J350j424l249l909k488K78K674L959
3770A249L202J071j557l428l723k142M17K788L657L083Q24j800l416l483j946
3785e204O03K957L876K636O94k165l778l327j966P81K831L750K650M51k056l530
3801g97l341j257J176L202L906K515Q6k420l646l241j448J308L039L642K388j49
3817D963k414l853l027r87J572L144L723J956n66k510l844k879q34J626L495L547
3833C112K002m84k543l667k499m35J904L490L209J519q09l110l785k669n99J983
3849c381L360L530J108p97l018l268k441j88K337L479L153J454j334l055l425
$$ plain form
3739 -2077 -5083 -5796 -3840 -138 3603 5408 4541 1353 -2480 -5117 -5176 -3023 831 4412 6037 5025
3755 5025 1602 -2315 -4903 -5397 -2900 824 4058 5408 3984 735 -3174 -5662 -5384 -2710 1249
3770 1249 4451 5522 3965 537 -3186 -5328 -4911 -2123 1534 4617 5441 3641 225 -3258 -5204
3785 -5204 -4601 -1644 2232 4868 5562 3397 -381 -3708 -5674 -4893 -2062 1688 4338 4789 2733 -797
3801 -797 -4138 -5395 -4219 -1017 2889 5404 5490 3070 -576 -3817 -5265 -3957 -918 2724 5112 4963
3817 4963 2549 -1304 -4331 -5318 -3746 -602 3121 5077 4511 2001 -1843 -4722 -5556 -3930 -435 3112
3833 3112 5114 4630 2087 -1580 -4079 -4514 -2610 880 4089 5608 4799 1689 -2096 -4765 -5364 -3381
3849 -3381 -21 3509 4617 3820 802 -2466 -4907 -5095 -2758 721 3874 5328 3994 939 -2486
3864b486k362J63K382L673L131J104j467l129l482k183O15K235L287K663P00j839
3880C005l530l263j774M52K688L740K977N75j708l180l127j586Q98K759L468K435
3896D829L89j984l417l252j368P98K806L557K358mk007l584k987j314R94L037
3912a149L352K147j90k114l445k838q64J390L207L564K129k78k162l467k927p38
3928d383J513K877L086J868p26k616l331k701p25J825L134K984J892o86k644l288
3944a921k538l00J662L259L279J377r51k465l433k226qJ970L323K955J064r02
3960D145k983l417k166o5J914L258K816R10j201l119l144j957M58K569L330K644
3976C992P36j320k984l080j769L89K467L301K369P83j627l207l148j463N64K594
$$ plain form
3864 -2486 -4848 -4685 -2303 1370 4501 5605 4138 1009 -2473 -4656 -4041 -1806 1481 4144 4844 3005
3880 3005 -525 -3788 -5562 -5110 -2422 1318 4295 4870 3162 -18 -3145 -4731 -3833 -1074 2394 4829
3896 4829 5218 3234 -183 -3435 -4803 -4005 -1199 2358 4716 4712 2705 -879 -3866 -5180 -4186 -1149
3912 -1149 2203 4350 4160 2046 -1399 -4237 -5101 -3711 -504 3060 5189 4911 2749 -718 -3645 -4383
3928 -4383 -2870 7 3093 4961 4235 1619 -1712 -4413 -5138 -3313 -179 2805 4697 4011 1367 -1921
3944 -1921 -4459 -4759 -3097 162 3441 4818 3867 1402 -2031 -4257 -4265 -2295 1028 3983 5047 4145
3960 4145 1162 -2255 -4421 -4486 -2572 686 3502 4412 3211 92 -3052 -5009 -4551 -1982 1348 3992
3976 3992 4728 3408 424 -2656 -4425 -4036 -1569 1732 4101 4884 3257 50 -3098 -4561 -3997 -1403
3992a403L368K321J71j839l300k782j388P71K543L456K052K33j703l299k637r87
4008d423R33K920L177K190j29k130l239k688j133J162K844L137J651m1k404l217
4024a390k543o99J209L016L004J642l02k379l243k299o37J716K930K980J775q46
4040C934k269l185k237m84J779K953K713J414r58k567l125k125k61J678L205K696
4056C161J096p63k566l114k091M4J850L058K878J024j192k723l046j707K15K119
4072a757L125K359R01j372k991k928j487K65K230L027K397L71j573k660k919j506
4088d518N81K641L004K265K87j620k755k846j431P50K675L080J969K14j786k977
4104d67k927r66R46K444K988J917K03k207k751k656j031J285K516K924J905j00
$$ plain form
3992 -1403 1965 4286 4457 2618 -682 -3464 -4852 -4081 -1538 1918 3970 4203 2500 -799 -3436 -4423
4008 -4423 -3490 -570 2607 4797 4668 2538 -701 -3389 -4522 -3360 -516 2621 4272 4231 1827 -1390
4024 -1390 -3933 -4632 -3423 -407 2597 4239 3937 1558 -1685 -3984 -4621 -2905 25 3005 4780 3934
4040 3934 1665 -1520 -3757 -4241 -2462 491 3204 4618 3660 1093 -2032 -4157 -4418 -2740 465 3161
4056 3161 4257 3494 928 -2186 -4277 -4233 -2383 675 3553 4577 3385 662 -2384 -4091 -3876 -1757
4072 -1757 1368 3727 4628 3256 265 -2663 -4150 -3885 -1655 1372 3769 4140 2567 -93 -3012 -4518
4088 -4518 -3937 -1296 1708 3973 4260 2640 -115 -2961 -4392 -3642 -967 2113 4082 4296 2510 -467
4104 -467 -3394 -4360 -3414 -970 2018 3935 4138 1931 -820 -3476 -4507 -3222 -706 2218 4123 4023
4120D023k012k926k678n83J229K791K707J683l23k192l024k388m15J206K713K803
4136B614J595o35k328k790k605n8J535K772K702J447o04k413l114j847j88J632
4152b285L053K432J127q90k506l039j706q0J761K613K553J113j191k396k929j857
4168d227K88K077K889K416P31j037k876k784j389M44J995K943K084O97j356k765
4184A30k701j420L94K083K901K215K68j474k723k643j213O27K335K786K052L33
4200C950j563k848k580q63Q53K356K762J948p2j636k812k543q89Q85K474K667
4216B089J489j46j715k700k408n62Q69K679K549J632j15j978k934k024p26J416
4232b585K499K687J383m04j934k734k256m75J560K454K661J091o16k251k801k037
$$ plain form
4120 4023 2011 -915 -3593 -4176 -2947 -156 2551 4234 3911 1719 -1305 -3693 -4108 -2902 -189 2614
4136 2614 4209 3574 1246 -1544 -4149 -4207 -2672 100 2802 4249 3645 1232 -1882 -3729 -3917 -2285
4152 -2285 768 3200 4327 3437 931 -2108 -3814 -3894 -2133 480 3033 4146 2955 559 -2370 -4227
4168 -4227 -3939 -1862 1027 3443 4174 3137 261 -2523 -3912 -3468 -1473 1470 3554 4251 2895 130
4184 130 -2571 -3991 -3597 -1514 1387 3602 3870 2396 -327 -2970 -4183 -3556 -1221 1565 3617 3950
4200 3950 2387 -461 -3041 -3904 -3051 -695 2067 4015 3943 2307 -505 -3048 -3937 -3052 -578 2089
4216 2089 3578 3432 1717 -983 -3391 -3953 -3084 -405 2144 3776 3661 1683 -1251 -3275 -4001 -2585
4232 -2585 -86 2601 3984 3580 1646 -1088 -3344 -3819 -2259 195 2856 3947 3331 1080 -1721 -3758
4248c758l96J668K702K484J059q47k193k746j535j58J738K618K497Q22p69k346
4264H40k829j375m4J764K655K193P62q25k821k742j254O2J929K734K068L72j045
4281B444k480k547j365M37K198K536K343K18j461k390k414j192N80K174K635J880
4297C596M08j676k427k356j249O05K126K666J837O9j658k679k225j046R06K169
4313i34K740J738m9j631k559k292p81R55K469K614J449j52k006k403k203o51J188
4330b508K286K675J284n60j697k791j987o15J182K733K210J288l96j931k706j880
4346c413q8J402K458K348J085o14k046k673j867j30J676K365K209J195j103k129
4362F75k399j848K08J407K580K056R23q40k389k404j603K21J698K702J910N82
$$ plain form
4248 -3758 -4154 -2486 216 2700 3759 2912 719 -2027 -3562 -3720 -1982 636 3133 3955 3186 840
4264 840 -1989 -3364 -3408 -1644 1011 3204 3966 3141 320 -2422 -3676 -3614 -1685 1049 3117 3489 2444
4281 2444 -36 -2583 -3948 -3511 -1313 1223 3566 3784 2323 -67 -2481 -3673 -3093 -919 1716 3596
4297 3596 4004 2328 -99 -2455 -3704 -3099 -973 1693 3530 3599 1941 -738 -2963 -4009 -3103 -934
4313 -934 1806 3544 3495 1864 -695 -2987 -3768 -2813 -344 2270 3719 3567 1561 -842 -3045 -3696 -2508
4330 -2508 -222 2453 3737 3177 1480 -1311 -3298 -3913 -2731 2 2212 3500 3104 1173 -1533 -3413
4346 -3413 -3501 -2099 359 2707 3792 3178 1132 -1541 -3408 -3538 -1862 503 2712 3907 2804 675
4362 675 -1724 -3572 -3364 -1957 623 2679 3602 2762 373 -2031 -3634 -3413 -1715 987 2897 3479
4378C479q63k158k488j461L32J796K582J967N62j339k466k376j338O79J810K453
4394A171J753M66j367k360k229j080P65J775K622J752K34j479k387k267r02Q04
4410b729K105K337J572K98j847k312k233q32J043K121K333J547k28j599k310k164
4426b898q16J147K189K465J290k31j627k346j902o89J167K294K242J068l49j800
4442A204k340j869m47J150K431K232R65l36k060k238j701m10J532K266K093R65
4458C437n27k159k407j618PJ373K353K051Q79p90k024k378j359j79J665K347J813
4475B484P49o89k269k242j379K24J726K327J902O47r36k069k299j372K94J786
4491a116K188J822M58j393j944k262j002M29J797K176J753K45j344k181k000q66
$$ plain form
4378 3479 2616 458 -2030 -3491 -3159 -1363 1219 3186 3748 2409 -57 -2433 -3771 -3092 -1282 1171
4394 1171 2924 3390 2023 -337 -2566 -3646 -2881 -1106 1516 3268 3502 2023 -364 -2631 -3533 -2729
4410 -2729 -624 1713 3285 3583 1736 -576 -2809 -3641 -2598 -477 1856 3403 3175 1576 -734 -2898
4426 -2898 -3714 -2567 -378 2087 3377 3146 1519 -827 -2729 -3418 -2251 43 2285 3353 3004 1204
4442 1204 -1136 -3005 -3452 -2302 129 2361 3326 2990 930 -1308 -3009 -3419 -1887 379 2472 3437
4458 3437 2910 751 -1656 -3274 -3267 -1894 459 2510 3389 2599 575 -1803 -3162 -3341 -1676 671 2484
4475 2484 3233 2544 275 -1967 -3346 -3122 -1396 931 2833 3480 2544 475 -1824 -3196 -2902 -1116
4491 -1116 1072 2894 3352 1959 15 -2247 -3249 -2820 -1023 1153 2906 3151 1807 -374 -2374 -3240
4507c240N41K039K146J589J36j373k120j936j179Q71J903K347J467r0j535k190
4523f24k009o84R14J989K182J466l13j462k384j914m86J016K054K081J538m05
4539B959j826k109j657l88R98K131K187J171o24j711k312j737k28J209K124K027
4555B214R16o08j675k315j592j41J304K135K038R31o85j948k097j601k3J560K164
4572E77J939Q41p80j892k290j457J20J669K145J971L28r09k000k290j307O7J848
4589a420K147J839L62r63j965k061j117N23J722K166J680K51j047k208j996r72
4605c059L38K020K065J654J20j311k195j866r74Q36J481K195J207K56j290k267
4621g90j707r05P58K000K142J420k9j506j803j729o32Q35K076J887J044j4j646
$$ plain form
4507 -3240 -2699 -660 1486 3075 3211 1838 -282 -2218 -3397 -2526 -623 1724 3191 3101 1566 -624
4523 -624 -2633 -3317 -2403 -414 1768 3234 2921 1459 -925 -2839 -3325 -2309 -255 1826 3364 2959
4539 2959 1133 -976 -2633 -3021 -2023 108 2295 3466 2842 1131 -1181 -2918 -3146 -1937 187 2214
4555 2214 3130 2522 847 -1468 -3060 -3201 -1897 238 2276 3207 2522 574 -1523 -3124 -3147 -1587 577
4572 577 2516 3357 2577 685 -1605 -3062 -2942 -1273 872 2843 3171 2262 262 -2028 -3335 -3268 -1420
4589 -1420 727 2566 2928 1965 0 -2061 -3178 -2655 -933 1233 2913 3164 2117 -91 -2087 -3059
4605 -3059 -2721 -701 1364 3018 3138 1827 -368 -2234 -3208 -2372 -891 1304 2511 2767 1477 -790
4621 -790 -2497 -3402 -2644 -644 1498 2918 2889 1383 -420 -2149 -2781 -1946 130 2017 3061 3047 1401
4638A401k254j810o05J052J872K337Q19p6j776k172j484m36R93K179J895J001
4654B936o10j606j817j658l95J485K018K047Q95n61j718j982j493l44J350K077
4670F24J495Q13o89j812k259j381Q4J334K274J765P35p62j805j970j304J75J444
4687a239K085J839M58r59k055j791j160L25J415K238J547K75q39k218j797j022
4703b898L10J459K019J648K43j271j876j947p14M95J782K117J505J77j148k142
4719b41j805p83N99J750J911J361r9j185k105j782n89P44J755K027J419l50j206
4736A421j946k041l64Q15J796J882J106k30j526j748j595k15Q81J853J928R40
4752B957l46j461k056j709k65J083J708J886R43l34j603k033j333j87J224K028
$$ plain form
4638 1401 -853 -2663 -3268 -2216 -344 1993 2812 2736 960 -1212 -2696 -3132 -2139 40 1935 2936
4654 2936 2326 720 -1097 -2755 -3150 -1665 353 2400 3295 2734 1016 -966 -2459 -2803 -1453 624
4670 624 2119 2932 2243 431 -1828 -3209 -3125 -1791 483 2248 2983 2221 416 -1554 -2858 -2683 -1239
4687 -1239 846 2685 3143 2184 129 -1662 -2822 -2497 -1082 1156 2703 2978 2139 -79 -1876 -2898
4703 -2898 -2588 -1129 890 2538 2781 1510 -366 -2313 -3027 -2532 -750 1367 2872 3049 1901 -241
4719 -241 -2046 -2829 -2230 -480 1431 2792 2693 1508 -597 -2379 -2968 -2224 -469 1558 2977 2627 1421
4736 1421 -525 -2566 -2930 -2115 -319 1563 2669 2439 913 -835 -2430 -2645 -1764 89 2017 2957
4752 2957 2611 1150 -906 -2615 -2880 -1797 -89 1797 2740 2406 803 -1230 -2563 -2750 -1526 502
4768E02J690P04m53j740k215j200q1J230K060J591O60o73j642j834j351J14J426
4785a212J932J837K66o99j889k084r82p6J505K075J582M20p73j800j715r91K76
4802b328J362K041J696J09j035j958j770r90M33J533J871J512L12j185j935j504
4818a836p33J21J856J849J499M7j497j689j680p71P01J590J992J158J56j214j970
4835d21j640o29Q12J561J779J144p2j377j998j576l67Q02J676J923J199l95j309
4852A112j956j531l34J105J533K079P71l38j467j866j548l72J203J780J650R15
4868B736n80j562j688j271m08J178J865J744N41n69j555j867j151o3J177K012
4884E39J500Q37p30j494j934j160L8J339J698J617M34q92j762j710j108K04J367
$$ plain form
4768 502 2192 2896 2443 703 -1512 -2712 -2793 -1563 497 2088 2748 2075 433 -1401 -2752 -2638 -1212
4785 -1212 720 2557 2823 2124 235 -1849 -2831 -2907 -1402 673 2255 2675 1902 102 -1613 -2604 -2328
4802 -2328 -966 1075 2771 2880 1845 -113 -1883 -2873 -2440 -907 964 2476 2788 1603 -332 -1836
4818 -1836 -2569 -2448 -592 1257 2756 2803 1306 -383 -2063 -2834 -2133 -543 1449 2607 2763 1549 -421
4835 -421 -2061 -2690 -1878 -317 1462 2606 2534 1157 -841 -2417 -2784 -1982 -306 1617 2816 2421 1112
4852 1112 -844 -2375 -2709 -1604 -71 2008 2779 2441 974 -892 -2440 -2812 -1609 171 1821 2736
4868 2736 2156 594 -1094 -2365 -2773 -1595 270 2014 2555 1986 431 -1436 -2587 -2650 -1473 539
4884 539 2039 2876 2146 652 -1282 -2442 -2404 -1065 633 2250 2684 1792 30 -1680 -2788 -2584 -1217
4901a217J956J407M50q82j712j830q04K70J346K082J327L95j053j663j720p49
4917b397J52J476K035J268K72j273j930j446q27L68J437J997J181k0r13j892j541
4934b053p13P38J402J869J206J20j087j932j454o37O96J743J773J033k07j313
4950A184j850j516m90P12J690J928Q51k66j241j897j544l04J008J654J769R73
4966B661l58j477j769j357k59J170J744J627O77l73j644j589j432p1J204J634
4982C88J519O63n57j677j631j102l58J295J786J472R51r43j538j665j032J28J249
4999a052J794J393O17o47j675k030r24L32J391J449J535M54r07j639j710p46R3
5016b272J328J737J361K10q86j702j684o94K54J535J852J284J68q18j655j670
$$ plain form
4901 -1217 739 2146 2596 1714 2 -1828 -2632 -2362 -1016 1066 2393 2788 1735 72 -1648 -2397
4917 -2397 -2245 -769 1266 2534 2806 1533 -397 -1843 -2670 -2302 -865 1132 2313 2293 1380 -512 -2053
4934 -2053 -2766 -2028 -626 1243 2449 2569 1482 -450 -1904 -2541 -1845 -102 1671 2704 2497 1184
4950 1184 -666 -2182 -2672 -1960 -270 1658 2509 2243 1002 -895 -2439 -2743 -1735 -81 1688 2661
4966 2661 2303 826 -943 -2300 -2559 -1389 355 1982 2659 2286 642 -947 -2379 -2450 -1246 388
4982 388 1907 2570 2013 336 -1295 -2397 -2755 -1460 326 1798 2749 1806 268 -1397 -2429 -2301 -1052
4999 -1052 742 2135 2752 2105 430 -1600 -2524 -2192 -801 648 2183 2637 1730 91 -1619 -2365 -2272
5016 -2272 -944 793 2154 2364 1478 -224 -1908 -2602 -2348 -813 1039 2323 2491 1673 18 -1652
5032a652q37O35J581J424J407l7j292j706j539o85O77J454J859J116j25j085j729
5049e34j566m14O78J600J541Q94R9j203j993j122m76P69J637J741J069l47j234
5066A139j697j360l94N84J733J469R36m49j413j790j201q7Q73J675J584J033o73
5083A962j263j640j337j22J006J636J728N47m74j574j594j080j07J191J799J389
5099B067O15p26j694j503j112o6J206J773J264M40o54j522j693j079M45J181K016
5116I58J308L75p67j659j661j042K71J419J694J372J09r63j458j683p86N12J367
5133f34J727J270J04j076j609j512p58L96J457J780J052j9r39j505j505o50O63
5150a758J409J661J179Nj259j724j595m40P10J419J680R75n1j194j700j416k83
$$ plain form
5032 -1652 -2489 -1854 -273 1151 2558 2521 1229 -477 -2016 -2701 -2024 -570 1289 2405 2280 1195 -534
5049 -534 -2100 -2514 -1836 -236 1305 2199 2298 1095 -898 -2020 -2496 -1727 -90 1651 2720 2373 1139
5066 1139 -558 -1918 -2312 -1728 5 1474 2410 1961 548 -1242 -2443 -2530 -1657 18 1602 2635 1962
5083 1962 699 -941 -2278 -2400 -1394 242 1970 2517 2043 469 -1125 -2205 -2312 -1121 678 2067
5099 2067 2682 1956 262 -1241 -2353 -2419 -1213 560 1824 2264 1610 88 -1605 -2684 -2239 -1058 958
5116 958 2266 2641 1874 215 -1446 -2488 -2217 -798 896 2268 2377 1414 -44 -1727 -2513 -2001 -634
5133 -634 1093 2363 2467 1391 -218 -1730 -2488 -2092 -635 1145 2197 2178 1239 -266 -1771 -2421 -1758
5150 -1758 -349 1312 2491 2496 1237 -487 -2082 -2522 -1812 -393 1287 2262 2211 1017 -683 -2099 -2382
5167b382P06J662J608R53l50j345j840j191m28R70J689J558Q37l13j502j560j198
5184b126k49Q57J629J596Q32n08j522j463j319k57J077J763J511O59n67j365j673
5201a125j055j11R47J826J499N77p39j600j535j080J16J215J512J744K24q05j377
5218B33j574r95L40J205J612J401J98r21j655j542q55L38J239J744J363K50r46
5235A435j499j553p76M96J224J681J147J64q88j735j675n54N01J507J694J089
5251B258Jr00j748j302o21N43J361J579J129j53j022j664j443n91O94J427J831
5268A379J059j53j224j844j269k37P83J516J438R25l27j350j563j300k34R13J657
5285A69J382Q97k55j286j912j154k13R21J686J645N24m78j474j544j168n5J082
$$ plain form
5167 -2382 -1676 -14 1594 2547 2197 852 -988 -2179 -2607 -1637 52 1610 2447 2134 632 -928 -2126
5184 -2126 -2375 -1518 111 1707 2539 2031 509 -954 -2273 -2530 -1453 310 1821 2480 1913 548 -1125
5201 -1125 -2180 -2291 -1344 482 1981 2558 1819 219 -1316 -2396 -2280 -1065 447 2191 2415 1610 233
5218 233 -1341 -2336 -1996 -791 821 2222 2420 1499 -156 -1698 -2553 -2215 -976 768 2131 2381 1435
5235 1435 -64 -1617 -2393 -1897 -673 1008 2155 2319 1431 -304 -1979 -2533 -2032 -525 1169 2258
5251 2258 2259 1359 -389 -1691 -2312 -1769 -408 1171 2300 2147 1125 -539 -1982 -2573 -1879 -452 1379
5268 1379 2438 2285 1061 -783 -2052 -2289 -1506 10 1448 2373 2046 696 -867 -2167 -2401 -1488 169
5285 169 1551 2448 2193 907 -1005 -2159 -2372 -1451 235 1880 2404 1926 452 -1092 -2260 -2315 -1233
5302a233J578J488M22k29j490j739r75n6J130J655J400N33n82j790j361j225N9
5319b415J445J663J281L71p73j510j430j089K89J176J712J461J58q20j562j412
5335a455r16K53J378J685J261L01j042j598j407p88L39J437J689J062J68j185
5351A182j566j298p46M57J536J609J202k68r21j596j459o21N82J651J468J145
5367B357k06q90j803j609j73O59J352J667J079k69j148j709j318l72P86J605J591
5384A599Q74l43j319j620j446j29Q52J527J550P53l36j363j593j202k34J174J390
5401A34J740N79o35j204j670j157j23J133J579J325Q49o18j377j766j087J87R40
5418a171J638J270O47p05j471j465j197L91R87J741J385Q1n14j465j529q02N1
$$ plain form
5302 -1233 345 1833 2255 2026 536 -1203 -2178 -2234 -1104 551 1951 2484 1902 112 -1249 -2474 -2415
5319 -2415 -970 693 1974 2345 1572 62 -1368 -2457 -2168 -992 720 2181 2339 1519 -43 -1455
5335 -1455 -2371 -2118 -740 945 2206 2507 1465 -133 -1540 -2328 -1989 -552 1137 2199 2367 1182
5351 1182 -384 -1682 -2428 -1971 -435 1174 2376 2108 1187 -409 -1868 -2489 -1907 -256 1212 2357
5367 2357 2151 1261 -542 -2151 -2324 -1665 -313 1354 2433 2164 1016 -693 -2011 -2383 -1597 8 1599
5384 1599 2473 2130 811 -809 -2255 -2384 -1532 -5 1545 2298 1962 599 -994 -2196 -2430 -1256 134
5401 134 1874 2453 1818 614 -1056 -2213 -2336 -1203 376 1701 2550 1932 555 -1211 -2298 -2111 -1171
5418 -1171 467 1737 2384 1679 208 -1257 -2454 -2063 -1076 665 2050 2131 1617 152 -1377 -2179 -2128
5435b128J226J716J267L20j046j441j200j038K66J454J640J197n4q09j537j465
5451a632r01N53J393J490J162K99j165j609j416o48N99J454J565J224Lj271j573
5468d73j319n84Q19J441J470Q81O7j292j523j338n27O47J429J729P12p8j223j817
5486i79j099k88P73J371J706Q65k31j271j901q45l38Q38J639J509Q00n32j197
5503H20j716j184pQ08J494J619L84n42j408j476j129n7R69J706J424M34n39j156
5521D44j779q39P0J001J907J344M77o68j704j533r42J21J253J546J327M44p80
5538A689j580j623q61J57J258J682J215K19p22j540j645p11K15J472J816J063
5554B104K68q55j637j389o00L18J373J695J067J17j044j561j764m96N12J312J516
$$ plain form
5435 -2128 -902 814 2081 2401 1355 -86 -1286 -2324 -2058 -604 1036 2233 2179 1370 -167 -1632
5451 -1632 -2533 -1980 -587 903 2065 2364 1199 -410 -1826 -2474 -1875 -421 1144 2368 2371 1100 -473
5468 -473 -1792 -2376 -1557 -116 1354 2235 2302 1010 -513 -1851 -2378 -1731 -302 1427 2139 2061 838 -979
5486 -979 -2078 -2366 -1593 -222 1484 2349 2118 847 -1054 -1899 -2237 -1399 240 1749 2549 2017 820
5503 820 -896 -2080 -2087 -1279 215 1834 2218 1676 268 -1208 -2337 -2394 -1425 281 1705 2139 1600 444
5521 444 -1335 -2174 -2104 -1103 804 2148 2625 1957 253 -1280 -2222 -2101 -848 698 2025 2469 1689
5538 1689 109 -1514 -2375 -2218 -960 722 1937 2156 1434 -106 -1751 -2462 -2247 -775 1041 2104
5554 2104 2372 1517 -120 -1509 -2109 -1791 -418 1277 2344 2461 1417 -144 -1908 -2404 -1892 -580 936
5571I36J135q1j014j515j406n82Q17J357J716Q62k33j057j537j335m39Q05J455
5588a16J748Q79k36j278j554j283l81P15J575J373R44m55j312j800j126j04Q00
5605a611J622J595P99n74j222j616j047l6Q56J611J431P63o53j404j638j098n6
5622b278J188J578J353M29n71j451j336j177j08J185J671J432J45n81j513j576
5638a610q46K93J265J724J369K83p01j598j366r15K20J512J368J185J71r90j780
5655d16j343p78L82J484J556J117K34j039j714j196p58N56J400J523J204J51j068
5672A295j606j527m47N75J553J736Q88k42r90j614j500m51N51J416J450J238m16
5689A909j123j674j255m09J062J414J496R53k77j288j464j238m08Q17J579J629
$$ plain form
5571 936 2071 1990 976 -539 -1945 -2527 -1710 -353 1363 2225 1992 935 -602 -1937 -2376 -1571 -116
5588 -116 1632 2511 2275 997 -557 -1840 -2221 -1506 69 1442 2386 1931 619 -1181 -2307 -2411 -1611
5605 -1611 11 1606 2405 1831 609 -1007 -2054 -2090 -1234 377 1808 2571 1918 514 -1124 -2222 -2278
5622 -2278 -1090 488 1841 2270 1699 248 -1088 -2265 -2373 -1188 483 1915 2060 1479 -34 -1610
5638 -1610 -2456 -2163 -898 826 2195 2478 1777 179 -1187 -2102 -1882 -370 998 2183 2354 1364 -416
5655 -416 -1759 -2537 -2155 -671 885 2002 2236 1197 -517 -1713 -2471 -1915 -515 1008 2212 2363 1295
5672 1295 -311 -1838 -2285 -1710 -157 1579 2467 2225 1235 -379 -1879 -2330 -1779 -363 1087 2325 1909
5689 1909 786 -888 -2143 -2552 -1490 -76 1420 2373 2096 808 -656 -1894 -2302 -1485 94 1723
5705A723P02j23j599j665j165p8R67J502J491O93p15j299j630j160r0J194J559
5722C07J377O70o42j411j522j085K72J172J489J395O45q30j483j496r59l2J247
5739h86J592J201M10q92j520j412r04K25J320J632J239K30p36j452j674p67L48
5756b046J563J667J002K70r28j586j572n22L66J407J482J085R1j150j713j315
5772a899n63N28J436J560J095P9j240j478j609k16O89J511J565J109k49j327j505
5789e14j374k36N33J792J339Q10k56j342j635j369k00Q40J544J559P38k81j289
5806F59j780r12l40J023J642J613N24m04j309j636j193q9J119J600J349N93o20
5823A839j525j750q14j24J174J708J263K87l63j704j585o94j70J476J624J384
$$ plain form
5705 1723 2425 2302 703 -962 -2127 -2205 -1238 264 1755 2448 1733 434 -1196 -2356 -2446 -1252 307
5722 307 1684 2354 1712 301 -1221 -2306 -2034 -862 627 2022 2667 1837 354 -1142 -2101 -2133 -886
5739 -886 706 1907 2317 1425 -95 -1507 -2411 -2186 -866 766 2005 2235 1499 47 -1627 -2394 -2046
5756 -2046 -483 1184 2186 2456 1528 -58 -1630 -2152 -1786 -379 1103 2188 2279 1129 -584 -1899
5772 -1899 -2462 -1934 -498 1062 2157 2236 996 -482 -2091 -2307 -1618 -107 1458 2567 2318 991 -514
5789 -514 -1888 -2124 -1591 201 1540 2350 2094 752 -883 -2252 -2452 -1612 -68 1491 2229 1948 659
5806 659 -1121 -2033 -2373 -1350 292 1905 2429 2025 716 -920 -2113 -2202 -1083 517 1866 2459 1839
5823 1839 314 -1436 -2250 -2374 -1200 508 1771 2058 1695 -9 -1594 -2288 -2458 -982 642 2026
5839B026M78o76j576j661o73J12J106J868J041M70r15j639j559o37J76J318J716
5856I75J090L29r84j651j428p10K76J217J750J099K66q16j806j445n15P50J249
5873c54J761J293k76j058j534j628n73M66J369J776Q85j25j021j789j552j97O91
5890a866J710J452R44k1j223j786j243k97P42J675J576Q81l69j321j551j395o2
5907b154J001J353J706M84m68j429j843j119M7O26J842J392P16n65j353j380j252
5924b396K23J317J510J499O95r52j289j690j112J89J148J447J382N08p55j559
5940A65j577j124P8J472J677J219K77q52j496j644p91K87J299K003J119M41r24
5957A629j568j261q21L96J393J613J131jr25j841j715n00L59J335J598J133Q5
$$ plain form
5839 2026 2504 1828 252 -1409 -2082 -1970 -864 1004 2045 2515 1600 -39 -1598 -2235 -2059 -741 975
5856 975 2065 2394 1410 -241 -1669 -2379 -2103 -886 864 1963 2229 1413 -393 -1838 -2353 -1603 -354
5873 -354 1407 2700 2424 1366 -168 -1796 -2369 -1903 -534 1242 2127 2002 981 -808 -2360 -2557 -1866
5890 -1866 -156 1296 2240 2219 996 -790 -2033 -2330 -1588 87 1663 2544 2175 854 -697 -2092 -2154
5907 -2154 -1153 200 1906 2390 1922 493 -1350 -2469 -2422 -1796 46 1438 2154 1589 236 -1144 -2396
5924 -2396 -2173 -856 654 2153 2848 1896 607 -1083 -2195 -2006 -858 589 1971 2479 1724 165
5940 165 -1412 -2536 -2458 -986 691 1910 2187 1335 -161 -1805 -2596 -2309 -1010 993 2112 2553 1629
5957 1629 61 -1200 -2021 -1625 -232 1381 2512 2511 1586 -255 -1970 -2470 -2111 -776 822 1955 2040
5974B040j055j598j439m31N92J396J832R57o2j174j637j407l58P22J737J555R87
5991B657k08j206j708j492l54P54J544J536P78m66j400j647j253k42P79J754J596
6008A422J030l97j254j518j210j31R43J724J400O95o32j602j667j047J05R61J694
6025E16J493N53o07j466j820j090l2R93J844J258P00q89j584j606q61M02J219
6042i77K011J364K89p52j526j664j003L47J362J355J367J99r74j635j716o15K93
6059b275J504J502J487J47j081j485j663p90O18J498J806Q88R1r04j669j377m65
6076b168N62J469J591J181n0j250k041j173p30O55J529J485J035j20j218j719
6092i62j309k97R06J677J565J006l37j346j743j015k93O16J807J572Q09n60j177
$$ plain form
5974 2040 985 -613 -2052 -2483 -1891 -495 1337 2294 2232 1058 -579 -1986 -2344 -1622 115 1670 2657
5991 2657 2449 1243 -465 -1957 -2311 -1557 -13 1523 2301 1835 435 -1212 -2465 -2707 -1928 -174 1422
6008 1422 2452 2055 801 -717 -1927 -2058 -1115 609 2009 2704 2072 470 -1197 -2244 -2139 -1178 516
6025 516 2009 2562 1955 489 -1331 -2421 -2453 -1460 384 1642 2342 1453 -131 -1737 -2598 -2196 -977
6042 -977 1034 2398 2687 1935 409 -1255 -2258 -1911 -549 806 2173 2372 1398 -237 -1953 -2568 -2275
6059 -2275 -771 731 2218 2365 1284 -201 -1864 -2654 -2036 -538 1268 2156 2247 1343 -326 -1703 -2168
6076 -2168 -1606 -137 1454 2635 2585 1335 -706 -1879 -2609 -1954 -425 1060 2095 1975 757 -962
6092 -962 -2271 -2568 -1662 15 1580 2586 2249 903 -840 -1855 -2148 -1532 275 1847 2656 2096 919
6109I19j704j430r5R83J418J776M24m41j394j731j281l0J154J594J585N69n34
6126A782j273j734r26J02Q27K064J242O75o74j704j679j072J19J236J699J243
6142A927M29p53j571j699p81N4J488J739J315J28p63j691j488p31K59J545J765
6159A172J321R2p97j817j620m87N08J230J542J274q9j144j677j704m70N64J651
6176d51J510J227pj129j653j523m36Q32J501J753Q37j32j089j737j463m56Q13
6193a603J624J661Q14k84j313j855j316l22Q16J751J674O37l93j315j601j143
6209b168k78R05J831J630R44p28j387j697j176k21J184J694J590M21o82j566j494
6226a198j249J44J052J705J392L94o39j601j559r03K32J152J756J555K72o21j569
$$ plain form
6109 919 -785 -2215 -2310 -1327 91 1867 2291 1850 456 -1275 -2556 -2586 -1432 162 1747 2316 1782
6126 1782 509 -1225 -2151 -2049 -1222 842 2084 2759 2085 381 -1298 -2370 -2251 -1015 684 1927
6142 1927 2356 1603 32 -1667 -2448 -2394 -906 833 2148 2276 1513 -178 -1666 -2397 -2138 -593 1172
6159 1172 2493 2585 1788 -29 -1649 -2136 -1628 -398 1144 2418 2329 1185 -492 -2196 -2666 -2102 -451
6176 -451 1059 2286 2279 1150 -503 -2026 -2462 -1630 -129 1624 2461 2329 1240 -497 -1960 -2416 -1603
6193 -1603 21 1682 2496 2212 899 -956 -2272 -2594 -1778 -27 1647 2284 1891 576 -1025 -2168
6209 -2168 -2446 -1541 290 1920 2864 2136 749 -948 -2124 -2345 -1161 533 2123 2544 1862 296 -1198
6226 -1198 -2447 -2303 -1251 454 1846 2240 1601 0 -1559 -2462 -2230 -1078 678 2233 2505 1884 315
6243C15j618j092K40J305J813J217J88j010j555j449q01L37J257J838J174K30
6259B389j136j547j586p57M97J448J880J187r5r59j651j460o24P38J535J667R66
6276B492N2j140j859j523n56R11J177J819P76q1j346j721j239k96O95J634J720
6293A515R15n2j385j870j326j14Q60J726J577Q41n03j333j765j208j98J041J562
6310B83J631M72m76j652j806r80o0J071J958J216N51l68j630j560r99L06J146
6327h97J891J352L30n56j693j725j148L70J057J759J319M60q96j554j738r02R9
6344b472J452J798J264L12q96j722j597q26N61J461J641J506K09j166j572j384
6360a431o55K61J612J572J124j33j017j945j469n35N92J343J882J081j60j153
$$ plain form
6243 315 -1303 -2395 -2155 -850 963 2180 2368 1358 -197 -1646 -2447 -2110 -853 985 2159 2389
6259 2389 1253 -294 -1880 -2637 -2140 -692 1188 2375 2280 1321 -330 -1790 -2414 -1676 -141 1526 2492
6276 2492 2544 1404 -455 -1978 -2534 -1623 -446 1373 2149 2068 722 -999 -2238 -2534 -1839 -205 1515
6293 1515 2430 2378 993 -877 -2203 -2317 -1457 269 1846 2687 2184 851 -914 -2122 -2320 -1279 283
6310 283 1914 2386 1910 258 -1548 -2528 -2588 -1517 441 1657 2208 1840 210 -1350 -2349 -2043 -897
6327 -897 994 2346 2676 2120 427 -1298 -2446 -2076 -1019 740 2059 2519 1623 69 -1669 -2571 -2472
6344 -2472 -1020 778 2042 2354 1458 -264 -1861 -2687 -2126 -665 976 2482 2691 1525 -47 -1431
6360 -1431 -2086 -1825 -213 1359 2483 2350 1333 -612 -2081 -2616 -2024 -681 1201 2282 2122 969
6376I69j620j492m91Q27J513J765R45j06j160j794j408k22Q43J600J853N69j89
6393B402j528j558j399m04Q29J522J671O62l85j381j746j393m0J081J846J602
6409A781P72n27j456j505j269L9Q69K086J245O70o70j674j653j074K49J202J419
6426E04J393O24o10j711j863j025L22J218J620J444L08o49j754j477p14K53J369
6443g48J894J158L43q08j804j537p75L58J287J582J366j3r59j664j582o65M80
6460b087J333J822J357k08j206j521j555m79N76J569J770J051j3j133j797j380
6476a901m48Q05J501J654J094l02j392j816j472k57Q09J466J673R16l08j269j743
6493i90j349k73J166J577J646O53k78j458j536j337k07J047J797J398P43n15j550
$$ plain form
6376 969 -651 -2143 -2634 -1807 -294 1471 2416 2310 1150 -644 -2052 -2274 -1431 169 2022 2591 2402
6393 2402 874 -684 -2083 -2487 -1658 -136 1535 2197 1812 431 -1315 -2708 -2748 -1667 179 1781
6409 1781 2553 2026 570 -935 -2204 -2165 -1296 790 2035 2705 2035 361 -1292 -2366 -2117 -915 504
6426 504 1897 2521 1911 200 -1663 -2688 -2366 -1148 472 1916 2224 1575 -179 -1656 -2370 -2117 -748
6443 -748 1146 2304 2647 1839 35 -1502 -2277 -1919 -632 950 2316 2303 1344 -320 -1902 -2567 -2087
6460 -2087 -754 1068 2425 2217 1011 -510 -2065 -2544 -1968 -399 1371 2422 2409 1276 -521 -1901
6476 -1901 -2349 -1544 -43 1611 2705 2403 1011 -805 -2277 -2534 -1725 -259 1414 2330 2022 753 -990
6493 -990 -2339 -2612 -1446 131 1777 2430 2152 694 -842 -2179 -2386 -1339 458 1856 2599 2084 534
6510E34j669j334P2J112J738J547M33o15j654j651q78j93J404J644J503M41o34
6527A800j506j622j046K25J207J912J503M2q25j646j645p71K45J329J667J331
6543B200K69j051j539j786p50N37J422J644J226J82j182j593j354p74N46J585
6559d18J722J061j9q79j946j530n08P39J530J710J048j74j212j823j497l03Q24
6576a675J364J804R03p4j411j800j237l43R90J658J466Q34k07j410j780j166m52
6593b536J160J633J549P93m22j567j799j058j28R59J607J566P73n15j600j755
6609a340r99J60J058J739J290N05o16j545j534j108J24J358J483J448M83q57j522
6626A27j779p73J12J224J902J406K50r21j603j536r23M45J588J480J443rr07j819
$$ plain form
6510 534 -1135 -2469 -2397 -1285 453 2000 2433 1818 164 -1487 -2365 -2558 -1154 490 1993 2434 1800
6527 1800 294 -1328 -2374 -2149 -942 970 2473 2515 1690 44 -1601 -2372 -2127 -798 869 2200
6543 2200 2469 1418 -121 -1907 -2657 -2120 -698 946 2172 2354 1172 -421 -1775 -2549 -2003 -418
6559 -418 1304 2365 2346 1467 -479 -2009 -2517 -1778 -248 1462 2510 2336 1124 -699 -2196 -2499 -1675
6576 -1675 -311 1493 2396 2322 911 -889 -2126 -2469 -1479 179 1645 2479 2272 862 -918 -2084 -2536
6593 -2536 -1376 257 1806 2599 2177 610 -1189 -2247 -2375 -1416 191 1757 2530 2015 415 -1340
6609 -1340 -2339 -2179 -1121 618 1908 2413 1797 252 -1282 -2390 -2266 -908 575 2023 2506 1649 127
6626 127 -1652 -2425 -2313 -1089 813 2219 2469 1548 -55 -1591 -2514 -2069 -481 999 2442 2433 1526 -293
6644b93j512o74L30J677J578J242l5j099j460j681n79N09J569J561J249j34j080
6661A168j621j575n22P60J575J676R42j67j174j683j369m83R28J657J364R22J4
6678B412j667j746j244k14Q93J647J600Q39m30j420j683j426jJ046J717J683M52
6695B458k36j472j830j344jJ324J603J398N87m42j454j950j048P9J079J578J550
6712A879N67o89j532j733q98mJ324J854J308M50q91j807j427p31R6J382J844J225
6730B217L16r40j712j592p67L58J424J675J221R9r50j770j599n13N25J435J840
6747A267R33K32j117j512j680m35N42J371J954J069k07j472j524j567l30P30J600
6764a46J650J090l20j288j669j327m51O60J751J522R87m20j357j794j070k73Q49
$$ plain form
6644 -293 -1805 -2479 -2149 -472 1106 2348 2313 1214 -246 -1927 -2506 -1997 -428 1133 2382 2248 1168
6661 1168 -453 -2028 -2550 -1790 -215 1461 2403 2236 1062 -621 -1990 -2473 -1545 112 1476 2398 2412
6678 2412 745 -1001 -2245 -2459 -1566 81 1681 2520 2090 670 -1013 -2439 -2440 -1394 323 2006 2458
6695 2458 2222 750 -1080 -2424 -2425 -1101 502 1900 2487 2045 591 -1359 -2407 -2328 -1249 329 1879
6712 1879 2446 1757 225 -1508 -2406 -2410 -1086 768 2076 2526 1635 -172 -1599 -2330 -2234 -852 992 2217
6730 2217 2533 1593 -119 -1711 -2478 -2120 -696 979 2200 2299 1349 -421 -2020 -2533 -2008 -573 1267
6747 1267 2200 2432 1315 -197 -1877 -2312 -1770 -399 1555 2624 2417 945 -579 -2146 -2476 -1746 -146
6764 -146 1504 2594 2274 986 -683 -2010 -2461 -1801 -50 1472 2459 2039 682 -1112 -2182 -2455 -1606
6781a606J774J574P50m64j254j688j201m02J190J552J608P18n65j522j627j239
6797b402m3J261J628J560M25o86j544j649r53M8J068J882J261N94q83j462j803
6814a698q31L03J624J420J392L46p70j581j703q78Q5J445J802J215K93r69j897
6831d02j304o29K02J550J682J147L15j238j741j443p21N57J572J655J152q2j061
6848A211j722j388n42N57J669J686R61j29j144j801j432l68O89J496J642Q90r4
6865B181j440j633j218l89R27J651J545R03l71j427j615j320q5P51J865J352O75
6882B352l03j320j821j103j26J106J690J385O39o43j442j764r37j04J222J672
6898E03J353N77n47j672j601j060K86J197J622J461L11o28j730j666p35R4J483
$$ plain form
6781 -1606 168 1742 2492 2028 774 -914 -2115 -2517 -1327 225 1833 2551 1986 464 -1163 -2402
6797 -2402 -2445 -1184 444 2004 2429 1743 199 -1450 -2403 -2355 -1287 595 1856 2450 1567 105 -1698
6814 -1698 -2529 -2226 -602 818 2210 2556 1786 205 -1498 -2376 -2291 -846 956 2171 2464 1495 -402
6831 -402 -1706 -2335 -2133 -583 1099 2246 2561 1323 -418 -1861 -2582 -2025 -453 1202 2354 2272 1211
6848 1211 -511 -1899 -2441 -1884 -215 1471 2432 2303 1159 -642 -2074 -2442 -1753 -257 1385 2275 2181
6865 2181 741 -892 -2110 -2499 -1572 79 1624 2527 2156 729 -886 -2206 -2291 -1540 325 1677 2352
6882 2352 2049 729 -1092 -2195 -2321 -1215 475 1860 2499 1856 414 -1350 -2287 -2391 -1169 503
6898 503 1856 2433 1886 214 -1387 -2447 -2161 -964 658 2119 2430 1802 72 -1594 -2329 -2235 -752
6915g52J603J273M29j059j562j567p56L12J245J752J140L39j084j655j451r46
6931b739P17J452J802J062N8j101j764j393k94L23J667J467J172Nj300j862j364
6948b092l93P58J389J849R02k20j046k109j172l80Q14J539J704P53j48j462j697
6965a011j258j52J006J670J684N34k68j387j636j377J0Q31J498J558P83n04j687
6982B94j619r19k56J060J701J622N00o52j268j744j156J16J221J553J589L07o89
6999A660j377j712r31L04J379J645J333L54j001j525j702r18L09J379J629J265
7015B091J44q47j728j527o86L39J527J800J224p6p36j645j552o80O04J356J683
7032A291Q88jr62j637j571o67Q01J463J711R78k37j045j774j355m48Q81J515J441
$$ plain form
6915 -752 851 2124 2553 1494 -68 -1635 -2391 -2079 -834 918 2058 2397 1313 -342 -1793 -2739
6931 -2739 -2022 -570 1232 2294 2352 1251 -513 -1906 -2200 -1877 -210 1257 2429 2434 1134 -728 -2092
6948 -2092 -2485 -1727 -338 1511 2413 2193 1147 -962 -2134 -2514 -1700 -161 1543 2296 2148 686 -1011
6965 -1011 -2269 -2421 -1415 255 1939 2473 2205 818 -818 -2195 -2185 -1354 144 1702 2485 1981 294
6982 294 -1325 -2244 -2500 -1440 261 1883 2383 1731 463 -1281 -2437 -2321 -1100 453 2042 2349 1660
6999 1660 283 -1429 -2360 -2056 -677 968 2301 2655 1654 129 -1573 -2491 -2182 -803 826 2091
7015 2091 2235 1388 -340 -1867 -2553 -2214 -687 1113 2337 2261 1525 -120 -1672 -2352 -1748 -392 1291
7032 1291 2179 2178 1216 -421 -1992 -2659 -1858 -395 1316 2294 2057 1012 -762 -2117 -2565 -1684 -169 1272
7050A272J035k06j211j776j143m22R31J678J514Q15l69j182j800j393J7Q16J702
7067B78J594N02n29j434j613j220l5J062J663J451N87m31j600j526j036j45J333
7084a099J684J515N50q14j464j707j079P6J422J748J248L33q87j492j770p46M18
7101b064J123J911J127K50q84j790j431p53L55J458J601J440L9r48j716j403p16
7118b401M81J608J505J117J8j020j760j613k95M20J747J463Q79K10j257j647j508
7135b053m28P07J363J664J016l6j334j833j070m30Q62J399J736R07j65j411j679
7152g85j361k76J009J421J637O37l98j202j965j005k22J089J680J626N59n33j353
7169E58j738j099J07J044J501J481L35n68j138j865r92K05J149J688J382L24o69
$$ plain form
7050 1272 2307 2101 890 -886 -2029 -2451 -1520 158 1672 2487 2118 936 -864 -2257 -2240 -1424 278
7067 278 1872 2374 1845 411 -1202 -2422 -2457 -1395 268 1719 2306 1875 275 -1251 -2287 -2432 -1099
7084 -1099 585 2100 2650 1836 372 -1335 -2414 -2338 -916 832 2080 2413 1526 34 -1736 -2482 -2064
7101 -2064 -941 970 2097 2347 1463 -327 -1758 -2511 -2156 -698 903 2343 2382 1434 -282 -1685 -2401
7118 -2401 -1920 -312 1193 2310 2328 1308 -452 -2065 -2360 -1940 -193 1270 2149 2359 1102 -545 -2053
7135 -2053 -2481 -1774 -411 1253 2269 2233 899 -934 -2004 -2434 -1572 -173 1563 2470 2305 894 -785
7152 -785 -2146 -2422 -1413 8 1645 2282 1884 682 -1283 -2288 -2510 -1421 259 1885 2444 1911 558
7169 558 -1180 -2279 -2172 -1128 373 1854 2189 1621 483 -1382 -2374 -2169 -1020 668 2050 2374 1705
7186A705j504j612q08R1J128J711J148L29p65j627j380p68L99J295J685J248P9
7203B354p13j655j764n70L16J445J436J423j36j035j607j321o34M71J563J856
7219A429Q80L0j158j728j218o36N92J450J710Q69O1j427j300j437m91Q38J665
7236A29J439R53l54j458j439j413k37O27J705J436Q92n63r90j776j024j69J018
7253a224J645J520M71k49j546j588j344R3R60J387J558O44n68j312j624j063l7
7270b277J295J735R64O56o46j605j575r89M4J215J903J439J36p53j250j599p23
7287b030K05J109J760J153J01q77j666j722o15M54J348J555J352J37p87j601j348
7304a472o14J74J635J461J141j61q44j751j498m32O10J333J680R93n5j013j668
$$ plain form
7186 1705 201 -1411 -2219 -2128 -1000 711 1859 2188 1423 -204 -1584 -2352 -1953 -658 1027 2275 2354
7203 2354 1641 -14 -1778 -2348 -2032 -587 849 2272 2136 1101 -506 -1827 -2461 -1990 -427 1429
7219 1429 2309 2339 1181 -547 -1765 -2401 -1809 -359 1351 2220 2281 854 -446 -1883 -2374 -1536 129
7236 129 1568 2521 2167 709 -730 -2143 -2380 -1753 -48 1388 2280 1717 727 -1049 -2073 -2242 -1224
7253 -1224 421 1941 2412 2163 617 -971 -2315 -2222 -1262 125 1683 2327 1759 447 -1177 -2240 -2277
7270 -2277 -982 753 1717 2373 1727 122 -1453 -2442 -2398 -1183 720 2159 2295 1542 292 -1307 -2030
7287 -2030 -1825 -716 1044 2197 2298 1421 -245 -1967 -2582 -2128 -780 775 2127 2264 1477 -124 -1472
7304 -1472 -2086 -1912 -277 1184 2325 2164 1320 -431 -1929 -2361 -1751 -418 1262 2255 2200 1187 -481
7321d81j397l52L92J669J520Q81j41j346j592j392r2O35J666J618R15l25j225
7338I53j544j367k14R04J506J398Q09o08j402j539j087j98J012J695J416O38p01
7355A671j341j386j185o0J100J525J392N65n43j552j501q94M5J226J674J310L82
7372B428p13j303j711r02J63J237J504J229K30p47j494j623p53M89J029J962J162
7389B187K0p11j613j518o43K69J355J640J208J4r46j368j574m68N32J270J607
7406A261Q97J37j258j649j228n39O01J239J677R05j55j182j382j260m32O93J619
7423e6J480Q03j67j072j657j159m16P88J672J407Q71m57j470j362j250j80Q15
7440a410J610J366O75m60j352j570j211L1R84J633J474N02n19j157j611j023j16
$$ plain form
7321 -481 -1878 -2230 -1838 -169 1351 2232 2091 745 -847 -2239 -2331 -1696 -30 1588 2503 2178 953
7338 953 -591 -1958 -2172 -1268 238 1636 2445 1837 435 -1104 -2191 -2389 -1377 318 1734 2372 1671
7355 1671 330 -1056 -2241 -2301 -1201 324 1716 2281 1738 186 -1315 -2209 -2164 -938 736 2046 2428
7372 2428 1715 412 -1299 -2201 -2038 -801 703 1932 2162 1415 -79 -1702 -2455 -1966 -937 1025 2187
7389 2187 2207 1496 -117 -1635 -2278 -2009 -654 986 2194 2208 1262 -106 -1680 -2148 -1616 -346 1261
7406 1261 2158 2295 1037 -612 -1840 -2379 -1778 -539 1138 2043 1888 706 -676 -1936 -2368 -1675 -56
7423 -56 1424 2227 2060 988 -669 -1828 -2244 -1456 216 1623 2494 2037 567 -795 -2045 -2225 -1410
7440 -1410 200 1566 2241 1781 429 -1141 -2352 -2321 -1337 296 1770 2272 1753 596 -1015 -2038 -2154
7457b154J281J544J349M04o45j579j500q80J84J000J616J258L44p19j481j608
7473a586q19K93J251J469J307L59q91j533j385p78M92J387J452J289Nr93j587
7490b68j408n46L59J349J695R37J18j147j452j540n55O75J432J457J009j57r23
7507A035j477j411m38P21J479J567Q28l08j022j511j319j43O57J448J418Q22l96
7524A950j211j653j194j67Q45J592J358P38k87j358j534j195o0Q98J726J242N82
7541B272l34j471j665r27n5J074J760J232M52q03j186j588r55J45J073J471J343
7558A838L06o27j610j311p23J10J129J592J265K15o69j485j581o15K46J180J571
7575H31J188O1o99j633j387p04N79J200J777Q73Mr26j487j379n94N85J274J523
$$ plain form
7457 -2154 -873 671 2020 2424 1779 200 -1300 -2180 -1996 -996 620 1878 2222 1503 22 -1586
7473 -1586 -2405 -2112 -861 608 1915 2274 1383 -150 -1535 -2313 -1821 -434 1018 2307 2312 1319 -268
7490 -268 -1676 -2222 -1863 -514 1181 2118 2236 1089 -363 -1903 -2458 -1783 -351 1106 2115 1958 1035
7507 1035 -442 -1853 -2291 -1570 -91 1476 2304 1996 974 -537 -1856 -1999 -1342 106 1524 2346 1950
7524 1950 739 -914 -2108 -2275 -1430 162 1520 2258 1971 613 -921 -2116 -2176 -1278 448 1690 2272
7541 2272 1938 467 -1198 -2125 -2180 -1106 654 1886 2338 1535 349 -1239 -2194 -2049 -976 495 1838
7558 1838 2144 1517 -93 -1404 -2127 -2017 -888 704 1969 2184 1515 30 -1551 -2166 -1920 -740 831
7575 831 2019 2080 1381 -252 -1639 -2343 -1764 -564 1213 2086 2090 1164 -323 -1702 -2296 -1711 -437 1086
7593A086J003j10r60j622j117o13Q28J317J383R34p3r74j790j206m85O67J532
7610b00J525Q73l11j225j416j341lO29J640J484M68j77j369j536j082k5P88J431
7628A53J375O57n93j096j534j027j35J095J468J503N31o96j274j686r17J91R30
7645a055J650J177N38o81j329j439r10O5J081J576J246L28q16j358j447r67K46
7662b095J316J396J351%p07j324j468p98M56J209J692J030O8q81j446j493o42
7679b336M71J504J388J144j70q73j217j524n27N04J430J533P06n2j042j657j073
7696a791n65Q55J502J162J029k77r62j532j410r0Q02J320J453P36l25j182j485
7713g60j033l17Q16J356J408O13m17j154j510r87k05R49J473J191P98n69j198
$$ plain form
7593 1086 2089 1979 1019 -603 -1720 -2333 -1505 -188 1195 2129 2056 1082 -708 -1914 -2399 -1732 -200
7610 -200 1325 2198 1887 662 -754 -2095 -2098 -1469 171 1655 2123 1946 577 -959 -2041 -2066 -1278 153
7628 153 1528 2185 1592 496 -1038 -2065 -2200 -1105 363 1866 2397 1701 427 -1259 -2176 -1985 -1055
7645 -1055 595 1772 2310 1629 300 -1139 -2049 -1984 -903 673 1919 2247 1431 73 -1374 -2341 -2095
7662 -2095 -779 617 1968 1968 1261 -63 -1531 -2329 -1873 -664 1028 2058 2126 1245 -201 -1694 -2336
7679 -2336 -1865 -361 1027 2171 2001 1128 -89 -1613 -2140 -1636 -206 1327 2033 1981 939 -718 -1791
7696 -1791 -2356 -1501 1 1163 2192 1915 953 -579 -1989 -2079 -1277 43 1496 2232 1907 725 -760
7713 -760 -1793 -2110 -1294 62 1470 2083 1666 512 -998 -1985 -2190 -1241 232 1423 2221 1652 454
7730D54j622j035R1J149J424J302M49n29j340j386r69P5R47J697R85M54p59j448
7748f1j334r42M30J025J497J158L26o96j556j035j029M42J300J320J012L29q85
7765A301j584j273n15M06J247J550R77m5r38j537j243m46K53J493J450Q63L8q63
7783A134j697j306l71O55J324J498Q89j84r58j495j204k18N87J522J192P60l10
7800A818j138j401j282k15P57J462J361P12m77j212j498p24l43Q05J705J261N95
7817B186n23j199j342j104n9R74J378J388N73o64j207j476r33J98R04J350J138
7834A582N07o29j270j480r18L78Q71J645J223J65o31j411j346o59J49J213J345
7851G34J158J33p65j226j419o28K84J162J427J059J05j041j298j290o06P40J038
$$ plain form
7730 454 -1168 -2203 -2112 -963 461 1763 2212 1683 343 -1043 -2012 -1937 -990 707 1692 2146 1387 -61
7748 -61 -1395 -2337 -1907 -882 615 1773 2099 1403 -153 -1188 -2217 -1775 -475 845 1857 2186 1301
7765 1301 -283 -1556 -2071 -1665 -418 1132 2109 2064 1126 -411 -1654 -2100 -1847 -354 1096 1959 1997 1134
7783 1134 -563 -1869 -2240 -1585 -261 1237 2126 1942 984 -511 -1715 -1933 -1346 176 1368 2128 1818
7800 1818 680 -721 -2003 -2218 -1461 1 1362 2074 1597 385 -1113 -1837 -2180 -1375 330 1591 2186
7817 2186 1663 464 -878 -1982 -2041 -1067 311 1699 2272 1608 401 -1075 -2008 -1810 -906 444 1582
7834 1582 2089 1460 190 -1290 -2208 -1830 -959 686 1909 2074 1443 32 -1314 -1973 -1824 -611 734
7851 734 1892 2025 1260 34 -1385 -2013 -1729 -567 860 1919 2024 983 -315 -1605 -2211 -1471 -433
7868d33J391R63j53p20j462j380n76R42J155J716N88o7j100j437j077m26N14J293
7886b69J594O55k97r84j319j135l81P47J403J353P39m60j015j504j065j13Q27
7903a224J389J380N54l24j155j497j038j35R10J341J404M42o05j237j247r32J16
7920a858Q80J262J297M64m11j377j399q54J98J059J375J054L81o46j223j361p15
7937a874K09Q39J629J135J17p73j372j428m89L19J032J563R45J62q36j331j294
7954a447m35L95J167J408R56j6j029j385j212m40N68J189J285R21J6q94j425j337
7972a715k89K52J452J479P21n5r46j670j003l05O50J498J474M39k88r90j253j272
7990a821k01R60J216J296N88k78j302j408r17j95Q90J172J262P54m41j346j166
$$ plain form
7868 -433 958 1921 1768 1048 -414 -1794 -2370 -1428 -273 1443 2031 1964 864 -573 -1650 -2076 -1562 -269
7886 -269 1325 1980 1683 699 -620 -1755 -2136 -1389 14 1367 2106 1646 631 -873 -1938 -2051 -1224
7903 -1224 165 1545 2099 1775 620 -877 -1915 -2050 -1140 201 1605 2047 1442 205 -1042 -1974 -1858
7920 -1858 -978 284 1581 2045 1634 257 -1142 -1996 -1798 -739 636 1690 2071 1425 202 -1159 -1874
7937 -1874 -1665 -826 803 1938 2055 1282 -90 -1518 -2007 -1688 -656 907 1852 2014 1178 -153 -1447
7954 -1447 -1882 -1487 -320 1088 2044 2028 999 -386 -1598 -2038 -1470 -281 1004 1925 1941 1047 -378 -1715
7972 -1715 -2004 -1752 -300 1179 1900 1845 899 -771 -1774 -2079 -1429 69 1543 1982 1694 704 -549 -1821
7990 -1821 -2022 -1062 154 1450 2038 1760 458 -950 -1867 -2062 -1172 0 1262 2016 1575 229 -937
8007i37r69J6J006J345J282L06l39j323j306q02J0P32J506J396J01o27j228j293
8025a124q15J05R74J415J009M84p91j394j433p19M84J042J403J086M53q56j435
8042a12j242m68L42J251J193J207k01r12j273j396k80J34J386J333R11k17n86
8059A070j562j288k49N97J307J230O41oq91j425j122k53P09J295J234Q46k21j091
8077H21j379j113q9O33J191J171O00k45j151j466q46j21P20J377J213O06l00j125
8095D97j525o21j00O48J307J442M36n48j033j394r45q2R30J556J188M48o46j274
8113B84j511p83K30Q38J347J109L29o74j225j178q32M53R88J293J348r6n49j276
8131I5j175p96L81Q50J389R59J16p23j434j109m35J86J186J397P88R6q87j339
$$ plain form
8007 -937 -1906 -1890 -884 461 1743 2049 1710 387 -919 -1721 -1711 -979 527 1923 2024 1397 169 -1124
8025 -1124 -1939 -1834 -860 555 1564 2048 1257 -137 -1570 -2289 -1805 -763 640 1726 2179 1323 -112
8042 -112 -1354 -1822 -1480 -229 964 2171 1970 1058 -215 -1611 -1891 -1757 -371 962 1873 1656 1070
8059 1070 -492 -1780 -2029 -1432 -125 1105 1746 1740 849 -576 -1698 -1951 -1242 53 1287 2133 1912 821
8077 821 -558 -1671 -1760 -1127 64 1235 1835 1590 439 -1027 -1873 -1994 -1274 103 1316 1922 1622 497
8095 497 -1028 -1649 -1749 -1101 206 1648 2084 1536 503 -891 -1836 -1918 -988 568 1756 2204 1558 284
8113 284 -1227 -2010 -1780 -942 405 1514 1843 1169 -56 -1234 -2066 -1613 -625 668 2016 1920 1371 95
8131 95 -1080 -1876 -1495 -645 744 1703 1819 1096 -338 -1447 -1882 -1696 -510 887 1675 1771 884 -455
8149d55j087n91O14J118J295R66q0q45j397r63n09Q24J155J318P70k93j031j475
8167f66r82l87O42J199J204O49q7j135j278q57l9M62J276J320O53l04j052j322
8185g04j121r2Q34J486J001N91
8191A995
$$ plain form
8149 -455 -1542 -2133 -1519 -401 894 1860 1780 935 -462 -1425 -1934 -1110 45 1363 2133 1840 809 -666
8167 -666 -1648 -2035 -1393 -194 1010 1659 1572 437 -841 -1698 -1737 -1275 1 1321 1974 1670 618 -704
8185 -704 -1825 -1917 -1083 403 1404 1995
8191 1995
$$ Imaginary data points
##PAGE= N=2
##DATA TABLE= (X++(I..I)), XYDATA
0@%%%%%%%%%%%%%%%kLrJ6j6J7j8K5l3L5m3N0n8P0p8Q9j02J17j34J50j70J92k13
38a12K40k71L02l35L69m09M54n03N56o12O75p44Q19r03R96j097J208j336J483
57G80j646J836k057K318k632L019l515M167n073O425q688J3374m0302J24239J93569
72B85814L1179r3002k00249j87877j01530M7230J59030K04047J41383J5783j25709
83A76099k02634j90821q5641N3678J69305J98617J37296Q232j21058j95584j74328
94b26839p3151O2428J65560J90521J23973O00j20701j80126j52997m9608P9549
105a80791J72909J85156J12239j2816j30094j86429j54278n2825O9671J54820
115b2438J62249Q9748k7680j32628j74636j33612k8942Q9724J66503J65033Q7496
$$ plain form
0 0 0 0 0 0 0 0 0 0 0 0 0 0 0 0 0 -2 1 -8 8 -8 9 -9 16 -17 18 -25 25 -33 37 -41 48 -54 63 -71 79 -91 101 -112
38 -112 128 -143 159 -176 193 -216 238 -265 291 -321 354 -390 429 -474 522 -575 633 -703 780
57 780 -866 970 -1087 1231 -1401 1618 -1897 2270 -2803 3622 -5066 8308 -31994 92245 285814
72 285814 316993 223991 23742 -164135 -265665 -218435 -59405 144642 286025 301808 176099
83 176099 -26535 -217356 -302997 -249319 -80014 118603 255899 264131 143073 -52511 -226839
94 -226839 -299990 -237562 -72002 118519 242492 243092 122391 -57735 -210732 -260340 -180791
105 -180791 -7882 177274 289513 276697 146603 -39826 -194104 -246929 -177258 -22438
115 -22438 139811 229559 201879 69251 -105385 -238997 -267939 -178215 -11712 153321 240817
126B40817k9974j30458j66622j23329k1050R0973J58966J50922P1993m0297j31775
137G0166j59306j09925q660R6303J54445J38455N5642n4808j39850j60161j05962
148b23661m301R6724J50341J30818M9381n4239j29962j41294q3710J5826J09213
159h4864J52009J23908L7813o4886j35659j41879q1392J6270J04714J41560J10261
170A77855K5384p1427j33932j32633o8452K7015J09419J38261J00536J4797p7856
181A08967j33487j25892n7938L6856J14336J37473R6470J1165p7629j26757j14156
192a30592m6256M4437J13799J28225Q1542n057q9628j32783j13756m2050M7460
203a44659J13222J23363P4811r732q8914j25110j00709k8110N7888J16856J20108
$$ plain form
126 240817 210843 80385 -86237 -209566 -230616 -139643 19323 170245 242238 201941 70166
137 70166 -89140 -199065 -207725 -111422 43023 181478 237120 182312 42462 -117699 -223661
148 -223661 -227962 -131238 19103 149921 199302 145063 15101 -126193 -209903 -194077 -84864
159 -84864 67145 191053 228866 163980 28321 -113558 -194950 -178680 -73966 67594 177855
170 177855 203239 131812 -2120 -134753 -203205 -176190 -66771 71490 172026 186823 108967
181 108967 -24520 -150412 -208350 -171494 -57158 80315 176785 187950 110321 -16436 -130592
192 -130592 -176848 -132411 -18612 109613 191155 186098 96470 -36313 -150069 -192119 -144659
203 -144659 -31437 91926 166737 157005 68091 -57019 -157728 -185838 -127950 -11094 109014
214A09014O6852j7776r2810j22811r3786j9722O3964J16974J14843N8309k5678
225A57373r6669j21266q8603j4048O5858J12959J05198M5815l5869j01251j18589
236h9092q0164l875P4267J16433J04269M2931l7711r8808j11560p0166N225P8798
248f9453J14456R6077L1999m7500j03945j11021o6029J0236Q0483J11148Q8733
259A35184K3183n3748j05036j06672n7570J8404Q4796J11420Q4275J7599n6436
270I5399j03331r9807m8483K6863Q9211J10018P8414J0269o2568j04789r7515
281a06319m3737L0224Q9115J04655O9597J017o8588j06106r3264l6926L6928R2195
293c1209J03627O5633l256o9781j02131q5215k6658M4987R5726J01597N9506j0222
$$ plain form
214 109014 175866 158090 65280 -57531 -151317 -171039 -107075 9899 124742 183051 157373
225 157373 60704 -60562 -149165 -163213 -97355 15604 120802 166617 130748 29497 -89092
236 -89092 -169256 -173131 -98864 17569 121838 164769 127058 28250 -83310 -153476 -148251 -69453
248 -69453 45003 141080 173079 125579 21634 -89387 -155416 -145180 -64697 46451 135184
259 135184 158367 104619 -417 -107089 -164659 -146255 -61459 49961 134236 151835 95399
270 95399 -7932 -107739 -156222 -129359 -40148 69870 148284 158553 95985 -8804 -106319
281 -106319 -150056 -119832 -30717 73938 143535 144552 75964 -30142 -123406 -160332 -123404 -31209
293 -31209 72418 138051 134795 65014 -37117 -122332 -148990 -104003 -8277 93320 152826 142604
305A42604p4792j03549q2633k3326M6642R3436R4742N0453j8581p9345j02479
316e6828p7107j5602N3283R6278R3073M6306k2825q0414r8625p0165p552N9126
328h1052R7563Q9938M0140k8108q2515r6359o3909j329O2049R5614Q3008L0112
340A45152l7609q7915r7442o1204L135O4903R4941P9423K5619l9668q5581r0032
352h6278n0468J3782P1963R6649P5717J9616m5459q8234q8967m7171J7064P2482
364c9304R2898O8965J2001n0930q9494q5793m1389K2073P4570R0557O3040M871
376A22065n5953r0374q1685l4721K9423P9121R1993O1501K767n6308q6935p5462
388i4568k7350L4701P9764Q7121N2667p553o4425r1348p5228k4666L7530Q0328
$$ plain form
305 142604 67812 -35737 -118370 -141696 -95054 -1618 93124 143577 124996 45651 -56828
316 -56828 -133935 -149537 -96254 24 93097 139403 116578 36164 -62461 -132626 -140178 -81052
328 -81052 16511 106449 146589 118481 35966 -60393 -124302 -125631 -63582 32032 115040 145152
340 145152 107543 19628 -77814 -139018 -135883 -70980 23961 103384 129003 89335 3754 -86278
352 -86278 -136746 -122964 -51001 45648 121365 140981 95522 7288 -81679 -128850 -111786 -39304
364 -39304 53594 122559 134560 83630 -5864 -91657 -133046 -110973 -36403 54154 117194 122065
376 122065 66112 -24262 -105947 -140668 -111245 -32124 59869 121370 124137 67829 -19106 -94568
388 -94568 -121918 -87217 -7453 79668 132335 124782 60357 -30991 -106219 -130885 -93355 -13027
400a3027Q4605M8355j1215o5495q8108o8374j6297M3858Q2676Q2719M2936j6793
412A05840o8299q6467o3547r408M9509Q5305Q0709L8531k1402p0912q6127o0370
424a06638o125N0404Q1360P3077K8810l0494p5760q5512n5147J080N6876Q5255
436A7186P3882K7268l0940p3627q0290m8133P622O0322Q4027O8162J9796l7856
448H7419p7294p9598m4112J2240O2834Q3197O3256J3369m3063p9576p8633m1042
460a21003J5590O3393Q0534N8259Q135m5948p8034p2244l1905K4957P0354Q3132
472E5220N7620N679m8256p8105p0552k9109K5836O8263P7352M8990l037n4557
484E5344q0175o8220k4422L0550P0566P6557M5726o898n6335p9046o3865j8800
$$ plain form
400 -13027 71578 119933 108718 43223 -44885 -113259 -129556 -85698 -3022 79697 122633 105840
412 105840 37541 -48926 -112473 -121881 -72372 12933 93642 132173 110771 39859 -46268 -106638
424 -106638 -112763 -62359 19001 92078 120888 90394 14634 -70878 -126025 -124945 -68069 17186
436 17186 91068 118336 87396 13769 -66521 -114654 -107032 -46710 37317 105479 125275 87419
448 87419 10125 -69473 -113585 -101345 -38511 44686 107942 121311 78248 -1328 -79961 -121003
460 -121003 -105413 -42020 38514 96773 104908 58960 -19074 -91318 -123223 -98266 -27912 55220
472 55220 112840 118519 70263 -7842 -78394 -107503 -81667 -13404 63948 112938 109901 55344
484 55344 -24831 -93051 -117473 -86923 -16357 60200 105926 99028 42693 -36353 -100218 -119018
496a19018L5528P2775P5461M2528r911n7060p5798n7820j1477M1175P4482P2536
508H3401L6506j6860o2751p8492n7604j0318M1062P1873O7520K9936k2067o3734
520A8472p5405n0946k257M7842P5086O6979K7606k4997o4432p3088m6404K825
532i8719N0729P4512O3251K1932k9768o6266p1801m2721O800N2450P2776N7929
544I1104J4948l5551o9424p0994l8974J1041N5294P3000N5473J2216l6591o7880
556f338o5564l1977J7605N9104P2891N1853P079m1323o9713o4614k9066K0163
568g9900N9429P0032M6851J581m5269p0042o1789k4602K4465O1344O8436M3252
580I3788k926m7368o9593n8213j8940K9317O3884O7822M0428o468m9774o8391
$$ plain form
496 -119018 -83490 -10715 64746 107274 97363 40303 -35495 -93315 -104792 -63617 10865 83401
508 83401 119907 103047 40296 -38196 -95800 -106118 -65056 6817 74337 104273 82206 18472
520 18472 -56933 -107879 -110136 -62294 12792 79771 107377 82380 17948 -55140 -101544 -98719
532 -98719 -47990 26522 89773 111705 81937 15671 -56130 -98851 -92051 -39601 33175 91104
544 91104 106052 70501 1077 -69917 -108891 -97850 -42556 30444 85917 98133 61542 -6338
556 -6338 -71902 -103879 -86274 -27170 45721 97574 104653 63330 -6383 -70997 -100063 -79900
568 -79900 -20471 49561 96412 97993 52724 -17318 -79107 -103709 -79244 -17900 50536 93788
580 93788 90862 43494 -26099 -84312 -103252 -73935 -10051 57771 98199 91731 41957 -26434
592b6434n4602j4602L2592O4061O4574L4829j2640n3334o9251n2574j0620L5475
604f2526O4678O2639L0695j5809n4982o7375m7928n544L9822O5681O0874K6743
616I6968j9700n6521o6087m4002p80M2539O6019N7852K2187k3949n8666o5106
628d9246m0814K670M4794O5509N4218J7132k8041n9959o3554l6784P452M7895
640c8728O5331N2079J3613l0861o0191o1181l2468J1883N0320O4875M8725R116
652I2513l4349o1513n9149k8787J5313N2003O3737M4884M710l7733o2205n6973
664f7549k4748J8999N3841O2512M1642O86m0344o2216n4210k0381K3031N5577
676a3160O1453L8183l060m2869o1929n1368j6527K6560N6622N9647L4368p587
$$ plain form
592 -26434 -81036 -95638 -63046 1015 65589 100418 87778 34444 -34807 -87381 -98001 -62526
604 -62526 2152 64791 95486 79677 24695 -42680 -90608 -96152 -56330 9351 70225 96968
616 96968 77268 20747 -45340 -89342 -90122 -47583 18436 76288 98475 74526 15860 -49246
628 -49246 -90060 -87390 -42596 22913 77131 94263 66222 6263 -57291 -94075 -86623 -38728
640 -38728 26603 78682 92295 61434 1243 -59938 -92406 -80523 -30203 34672 83397 92513
652 92513 58164 -3349 -62498 -91285 -75972 -23969 39768 84652 89362 51629 -10576 -67549
664 -67549 -92297 -73298 -19457 43055 84697 85383 45039 -17177 -71387 -91768 -68737 -13160
676 -13160 48293 86476 83416 40547 -21382 -72750 -89277 -62717 -6095 53552 87920 80333
688H0333m5558o1734m8795j2678K9968N7372N7703L0456j1251m7572o1151m5328
700g8235q004L3332N8259N5491K6595j5284m9586o0190m2284l934L5994N8535
712A0689N3211K2677j9189n1055n9218l8674N7L8986N8893N0899J8719k2333n2710
725A0952n7316l5336M087M1449N8757M8038J4707k5727n3658n6274l1922P799
737g4444M3225N7986M5247J0634k9070n4640n4401k8020J1238M5338N7747M2385
749G3225P148l1680n4995n1962k4194J5206M7223N7284L9534L264l4224n5378
761i549n0221k0878J8401M8390N5201L5691j139l7500n5892m7970j7292K1607
773f1151N0015N4446L2960l766l9223n5100m4837j2977K5235N1048N2983K9557
$$ plain form
688 80333 34775 -26959 -75754 -88432 -58464 -1092 56611 87067 75816 28244 -32907 -78235
700 -78235 -86239 -52907 5352 60843 87438 72154 22568 -37622 -79906 -83840 -47846 10689
712 10689 63900 86577 67388 16333 -42885 -81559 -81502 -42516 16377 67276 85995 63662 10952
725 10952 -46364 -81700 -77613 -36164 22593 70631 85338 59611 5953 -50321 -82243 -74444
737 -74444 -31219 26767 72014 82648 53578 -1062 -55463 -83483 -72245 -26907 30840 73225
749 73225 80373 48693 -6302 -58264 -82458 -67252 -20029 37255 76789 80053 45829 -9549
761 -9549 -59770 -80648 -62247 -13857 41344 77035 75896 38396 -17496 -65466 -82758 -61151
773 -61151 -11136 43310 76270 72504 33281 -21819 -66656 -79633 -54398 -3350 49633 79190
785G9190q327m1405n5158m2487r272K7905N1886N1058K5859j1760m3505n4675
797c0691l9823n850L0098N1919M8850K1900j5239m5402n3386l6080j777L3955
809d1526N3204M7636J9531j7799m6138n2222l3626J392L5258N2111M4108J4799
821G6728k1812m7934n1458l0397M928L7789N2832M2270J2189k4124m8406m9536
833d6931k7584Q009L9629N1647L9659Q199k6656m8929m7463k3542J2164M2006
845a9792N1773L7554M995k9485m9982m6612k1363J3974M2015M9828L3401J105
857F7411l1814m9841m3568j6853J8244M4619N0092L1498j668l4019m9870m2049
869e7818j4358K0180M5043M7905K8038n099l5798m8911l8910r940K4066M6263
$$ plain form
785 79190 70863 29458 -25700 -68187 -77459 -49554 2332 53390 79249 67489 23984 -30691
797 -30691 -70514 -76364 -46266 5653 54503 76403 61164 15762 -37624 -73704 -75481 -41526
809 -41526 11678 59314 78845 61046 14908 -37314 -70940 -69548 -34290 17821 61929 76728
821 76728 54916 6982 -44476 -74873 -69945 -32156 20676 62946 75135 51011 2605 -46931
833 -46931 -74515 -66506 -26877 24770 64429 72628 45972 -2957 -50420 -73962 -61798 -19792
845 -19792 31981 69535 74530 45045 -4937 -51549 -72912 -58938 -16923 32905 66306 67411
857 67411 35597 -14244 -57812 -74665 -56421 -11802 38290 69788 68120 34101 -15769 -57818
869 -57818 -72176 -51996 -6953 40952 68990 63891 28093 -20818 -59728 -69668 -45602 661
881F61M6827K4980q817l8378m9802l7732q036K5197M5902M4636K1827j1225l9236
894A6804m7648l3682l181K8754M7266M3722J8827j4550m0934m7849l2253j015
906f5739L0164M7097M1341J5995j6544m1403m5761k8358K469L2426M7028L8683
918E7398J1825k0832m3566m6125k7199M625L3701M6761L7249J0046k1596m2440
930a53m2703k2501R232L6152M6740L4293O247k5160m4425m2939k0868J1089L7267
943a7729M5569L2467L950k6345m4017m0641j7553J3694L8239M4060K8878o65k9680
956C0227m5014l9517j4662J6638M0210M4703K8337j388k9812m3289l6145j1132
968f0844J9270M0334M2196K3839o288l3659m5103l5314q732K1221M1430M1913
$$ plain form
881 661 47488 72468 63651 25273 -24529 -62261 -70297 -45100 802 45438 67265 56040 16804
894 16804 -30844 -64526 -67707 -38953 8313 52035 70862 56312 15378 -32471 -64724 -65739
906 -65739 -35575 11522 52863 68858 52314 10911 -34850 -63208 -60739 -28313 18715 57398
918 57398 69223 48391 4825 -41300 -68499 -63874 -30173 16588 53837 63883 42287 -153
930 -153 -42856 -65357 -56125 -19973 26767 61060 67307 42147 -2278 -45217 -66085 -54996 -17729
943 -17729 27840 60307 64257 37912 -6105 -46746 -64299 -50605 -12366 31694 60572 59907 30227
956 30227 -14787 -54304 -68966 -52328 -12118 32585 60922 59534 29722 -13567 -49712 -60844
968 -60844 -41574 -1240 40956 64795 58507 24848 -20255 -55569 -64301 -43080 -1650 40263
980D0263K1990p694l4186m3416l2569n899K3305M1472L9298J8430j1419l6037
992A3538m3052k9954k186K6604M3145L9440J6941j2545l6677m2210k7979m39K7031
1005b8343M1569L5543J2556j7154l8496m1769k5581L117L0029M2911L5190J1090
1017F0662j8180l8569m0103k2995N389L0862M1882L2583P649k0848l9340l8782
1029c9790j9815Q869L3605M2303L0981N147k3057m0140l8463j8218R880L3274
1041a5424M0219K7888J685k5359m0135l5854j4792J4073L5912M1073K6644N5k6515
1054B9470m0055l4536j2380J5495L6316L9310K3686l059k8313m0179l2891r803
1066e6939J8183L6794L8156K1324o083l0563m0693l1558p745J9610L7286L7005
$$ plain form
980 40263 62253 54559 20373 -23043 -55612 -61511 -38206 3266 42564 60994 49575 13538
992 13538 -29514 -59468 -61654 -35050 8095 47535 64476 51931 15254 -26956 -54935 -55374 -28343
1005 -28343 13226 48769 61325 44171 5675 -36094 -61675 -58558 -28529 14382 49572 60662
1017 60662 42482 3913 -36190 -59185 -53796 -22934 18948 51531 59180 38332 -1008 -39790
1029 -39790 -59605 -50736 -17131 25172 56153 61300 38243 -1897 -40360 -58578 -48698 -15424
1041 -15424 24795 52683 54368 29009 -11126 -46980 -61772 -47699 -11787 29286 55930 55985 29470
1054 29470 -10585 -45121 -57501 -42006 -5690 33620 57306 54247 25934 -14245 -47136 -56939
1066 -56939 -38756 -1962 36194 57518 51435 20872 -19821 -51379 -59124 -39514 -2228 34777
1078C4777J9372p860l0703l9079k8377l652K2765L8634L6490J7187j0374l2685
1090A6495l9046k7346k382K3751L7571L4058J3762j3319l4033l8556k5174L38
1102e3881K5269L8278L2640J1645j5123l4439l7298k2289L313K7433L8826L1658
1114D6032R757j6792l4815l5977j9894N517K8852L7999K9145O127j9538l6346
1126F7l5789j8614P492K9529L7261K7139L530k1251l6361l3853j5385J0571L1659
1139a4005L7491K5724K193k2553l5933l2248j2822J2949L2337L6328K2981j276
1151E1166k5087l7047l1171j0873J4410L2828L5340K0819l399k6233l6475k9385
1163d5107q061J6777L3591L4603J8699n709k7636l5830k7318n388J9130L4520
$$ plain form
1078 34777 54149 46289 15586 -23493 -51870 -55522 -32757 5877 42367 59554 49180 16495
1090 16495 -22551 -49897 -52279 -28528 9043 43101 56863 43544 9511 -29045 -54219 -53881
1102 -53881 -28612 9666 42306 53951 38828 4389 -32909 -55198 -51885 -24452 14374 46032
1114 46032 55789 38997 4182 -31795 -51689 -46172 -17320 20679 49824 55951 36413 67
1126 67 -35722 -54336 -46844 -17315 19946 47085 50615 29364 -6997 -40850 -56235 -45664 -14005
1139 -14005 23486 49210 51403 28850 -7083 -39331 -52153 -39204 -6867 29461 52442 51166
1151 51166 26079 -10968 -42139 -53012 -38602 -5774 29566 50385 46986 20753 -15722 -45107
1163 -45107 -53168 -36391 -2800 31803 50502 44793 17157 -18673 -45991 -51379 -32249 2271
1175B271L3863J7043p769k8479l5937k5735l662J9937L3934L1414J3928j0669
1187D0139l0456l5368k3734j080K2408L5125L1328J2686j1856l0357l4403k1724
1199d7292J123K3402L4455K8880R659j4392l1704l3629j9664L907K5543L4916
1211A5204K8144P824j6250l2079l3115j8178N060K5919L3516K5572M938j8461
1223B8094l2293l1128j5066Q572K8481L4868K4666L055j9523l3053l0725j3930
1235d7982R694K7854L2930K1861M85k1627l2937k8654j0552J2817K9914L3040
1247B6843K0670j586k2969l3786k8007r693J3402K9792L1463J8439l803k3795
1259A6970l2492k5096n808J6522L1108L1647J6407o155k5779l3324k5490n226
$$ plain form
1175 2271 36134 53177 45408 16929 -19008 -44743 -48405 -28468 5466 36880 50808 40139
1187 40139 9683 -25685 -49419 -50499 -28091 7034 38362 51048 39192 8835 -25568 -47292
1199 -47292 -46169 -22767 11688 40568 50227 35835 4131 -29498 -49162 -45255 -19712 15204
1211 15204 43348 51172 34922 2843 -30272 -48450 -43390 -17471 16045 41617 46555 28094
1223 28094 -4199 -35327 -50393 -41821 -13340 21528 46194 49249 29726 -3327 -34052 -47982
1235 -47982 -38288 -10434 22496 44357 44842 23215 -9722 -38376 -48928 -36111 -6197 26843
1247 26843 47513 45927 22958 -10828 -38835 -48528 -35126 -5334 26129 44568 40765 16970
1259 16970 -15522 -40618 -46426 -29904 1204 32851 49258 43103 17324 -16000 -41490 -46716
1271d6716J6668L0553K9580J4467p606k5641l1756k2015j975J9623L1803K9120
1283C6105J2365j0078k8003l2417k1682j077K0188L1169K7519J0581j1158k7562
1295E950l0257j8906K296K2236L1568K5776Q013j4118k9683l0910j7971L359K2984
1308a9663L1432K5410O771j4265k8335k8541j4900O388K4295L0857K2455L311
1320D5215j7846l0569k9289j4231P410K4970L0990K1743K605j7694k8951k6545
1332c2192j1057R906K6187L0052J9220m0k0355l0313k6370r815J1520K7500K9870
1345B4113J8685j360k0461k9575k4733p939J2759K6425K7791J5427m875k2809
1357A3448l0450k3622n672J5098K8497K9146J5527m665k2088k8826k1405l433
$$ plain form
1271 -46716 -30048 505 30085 44552 36946 11305 -20451 -42466 -44441 -24818 6985 36105
1283 36105 48470 38392 10389 -22028 -43710 -44787 -24599 6570 34089 44670 33512 5950
1295 5950 -24307 -43213 -40917 -18681 12887 38663 46676 32558 2875 -28035 -46006 -42647 -19663
1308 -19663 11769 37179 43950 29685 1350 -27191 -42091 -35703 -11408 19449 41904 45215
1320 45215 27369 -3200 -32489 -46720 -39310 -14340 16650 38393 40998 23304 -5647 -32192
1332 -32192 -43249 -33343 -7156 22896 42116 42076 21721 -8592 -34962 -44777 -33257 -5757 24113
1345 24113 42798 41438 20977 -8598 -33331 -41270 -28511 -2086 25705 41132 36257 13448
1357 13448 -17002 -40624 -46296 -31198 -2701 26445 41972 37307 15219 -13607 -35012 -38445
1369c8445J5960K7698K6367J2377q261k4740k9434k0938j892J7571K8751K6045
1381C1059J1218r101k4618k8946j9123n19J8387K7989K4196Q905j1190k5425k7793
1394b4961j6468K666K1067K9593K4475P936j2157k5854k7755j5796L180K0337
1406a3737K7374K1254M426j4831k6988k6730j3623N931K2528K8799K1148L779
1418C9330j5125k6890k5614j2035P239K2740K7912J9251J481j6620k6745k4227
1430b9303r679R331K4290K7663J7638k76j8737k7799k4168r224R931K3863K6099
1443A9629J5827k012j9231k6895k1767o179J2873K5620K6608J5146l569j9844
1455A6206k7145k1462n141J3265K5332K5018J3050n621k1228k6855j9602l230
$$ plain form
1369 -38445 -22485 5213 31580 43957 35696 10956 -18478 -39416 -41308 -23737 5014 31059
1381 31059 42277 33176 8558 -20388 -39511 -40030 -21643 6346 30542 39447 28257 2832 -24961
1394 -24961 -41429 -38763 -17696 11897 36372 44308 32151 6297 -21458 -37254 -34074 -13737
1406 -13737 13637 34891 39317 24486 -2502 -29232 -42855 -36924 -14396 14403 35551 39330
1418 39330 24205 -2685 -28299 -40334 -33095 -10355 17557 36808 38289 21669 -5076 -29303
1430 -29303 -38982 -29651 -5361 22302 39940 39664 20927 -6872 -31040 -40264 -30333 -6470 19629
1443 19629 35456 33444 14213 -12682 -34449 -40628 -27755 -2135 24473 39619 36050 16206
1455 16206 -10939 -32401 -37542 -24277 1055 26073 39123 33502 12274 -14581 -34183 -37413
1467c7413J5019K5430K4287J1115p381k2482k6813j8846j581J6151K5985K3618
1479B7089J0012q271k2387k5551j6287R10J7633K6415K2569P983j0479k3714k5869
1492a9947j5605J649J8032K5925K0938N969j2041k4100k4896j3854L821J9558
1504a4551K5909K0023M443j3061k4479k3796j1954N631K0531K6022J9297L109
1516C7124j4324k4402k3052j0504O841K1142K5145J6968R10j5984k5211k2656
1528b8003r475Q115K1520K4798J6013k98j6703k4690k1101p340R916K2967K4571
1541B0290J4822j617j7449k4787k0186n963J1327K3034K3344J3312l632j8881
1553A3614k4898j9354m658J2138K3167K2863J1654n218j9559k4320j8009k721
$$ plain form
1467 -37413 -22394 3036 27323 38438 31057 8575 -18238 -37084 -38665 -22514 3471 27089
1479 27089 37101 28830 6443 -19108 -35395 -34485 -16852 9563 32132 40115 29636 5922 -19947
1492 -19947 -35552 -33903 -15871 10054 30992 36961 24920 820 -24076 -37930 -34109 -14551
1504 -14551 11358 31381 35824 22763 -1716 -25512 -37466 -31835 -11304 14718 34015 37124
1516 37124 22800 -1602 -24654 -35158 -28317 -7175 17970 34938 35848 19864 -5347 -28003
1528 -28003 -37478 -29363 -7843 16955 32968 32670 15967 -8723 -29824 -37164 -27248 -4281 20290
1541 20290 35112 33495 16046 -8741 -28927 -34890 -23563 -529 22815 36127 32495 13614
1553 13614 -11284 -30638 -35296 -23158 9 22872 34526 29308 9749 -14571 -32580 -35301
1565c5301J3696K3746K2273J0561o564k0120k3781j6458j095J5068K3668K1662
1577B7355Q700q264k0841k4009j5333K61J5573K3646J9991O903r547k1407k3252
1590b0224j4003K283J7024K4075J9515N607j0590k1612k2614j2620L544J7604
1602a2011K3539J8066L923j1951k2273k1873j1003M868J8445K3617J7081K723
1614C3151j3247k2415k1267r883O022J9140K3123J5750J083j3989k2485j9991
1626b5008q173P954J9996K2723J4736n06j5327k2855j9460p202Q715K0007K1949
1639A7549J3072j544j6100k2216j8374n005J0381K1024K1749J2135l203j6831
1651A2637k2716j7401m343J1021K1023K0710J0666m651j7474k2279j6095k267
$$ plain form
1565 -35301 -21605 2141 24414 34975 28411 8291 -15490 -31948 -33043 -17975 5693 27355
1577 27355 36055 27791 6950 -17059 -32392 -32131 -16558 7088 27079 33982 24435 3028 -20224
1590 -20224 -34227 -31944 -14920 9155 28670 34277 23687 2075 -20539 -33159 -29615 -12011
1602 -12011 11528 29594 33517 21566 -707 -22580 -33583 -28715 -10270 13347 30428 33151
1614 33151 19904 -2511 -23778 -33661 -27639 -8499 14624 30374 31457 17468 -5017 -25008
1626 -25008 -33181 -25227 -5231 17492 32228 31722 16395 -6460 -25920 -33122 -24407 -4400 17549
1639 17549 30621 29077 12977 -9239 -27613 -32618 -22237 -1213 20536 32671 29468 12637
1651 12637 -10079 -27480 -31823 -20802 221 20931 31597 26946 9472 -12807 -28902 -31169
1663c1169J2484K1311K0278R179o123j8498k1957j5293j256J3638K1533J9187
1675B3314Q105p127j8535k1087j3689N53J4665K1720J8006O151q655j9941k1171
1688a7691j3148J471J5373K1403J7448M981r430j9593k0237j1091L452J6159K1500
1701A0597J6582L724j1023k0155j9924j0077M451J7156K1000J5493K494j1661
1713A8657k0416j9064r028N662J7337K0470J4103N58j3096k0674j8572p611P023
1726b4651J8152K0765J3317L3j3361k0149j7312n682Q232J8702J9832J2133k163
1739B7848j4551k0618j6990m901R165J8813J9267J0891l040j5553k0472j5870
1751b6011l474J0155J9022J8749R501m259j6118k0079j4453j953J1763J9896J8562
$$ plain form
1663 -31169 -18685 2626 22904 32083 25960 7462 -14495 -29788 -31044 -17406 4127 23314
1675 23314 31419 24292 5757 -15330 -29019 -28466 -13801 7919 25925 32076 23421 3480 -17691
1688 -17691 -30839 -29368 -13995 7408 24856 29837 20407 814 -19423 -30514 -27062 -10903 10597
1701 10597 27179 30903 19880 -275 -20199 -30276 -25825 -8669 12331 27824 30318 18657
1713 18657 -1759 -20823 -29851 -24189 -6852 13618 27721 28279 15183 -5491 -24063 -31674 -24651
1726 -24651 -6499 14266 27583 27616 14255 -5894 -23206 -28888 -20656 -1954 17878 30011 27848
1739 27848 13297 -7321 -24311 -29212 -20047 -1234 18033 28924 25884 10331 -10141 -26011
1751 -26011 -29485 -19330 -308 18441 27942 23683 7565 -12514 -26967 -28920 -17157 2739 21301
1764B1301Q520n183j6698j9669j3457r41J2193J9304J7454O641p216j7561j9714
1777a5026j2780L39J3126J9465J6757N602p786j7634j9002j1492K011J4118J9715
1790G413J6080M638q747j8010j8361j0012L212J4976J9525J5012L241j0206j8388
1803C73j8192r595L962J5068J8993J3824J648j1260j8702j7271p830N419J6229
1816g334J9267J3143J025j1585j8444j6518o472O488J6764J8644J2059m65j2890
1829A3682j8764j6078n614P491J6683J8157J0620j784j3573j8997j5199m438Q443
1842a9371J7384J7823R766k623j4021j8491j3821k910R765J7783J7267Q846l856
1855B3541j4748j8386j3577j820J0336J7563J6143P608n378j5666j8422j2444
$$ plain form
1764 21301 29821 24638 7940 -11729 -25186 -26127 -13934 5370 22824 29465 22249 4688 -15026
1777 -15026 -27806 -27467 -14341 5124 21881 27483 19697 2063 -16939 -28431 -26420 -12302 7413
1790 7413 23493 28131 19384 1374 -16987 -26999 -23787 -8811 10714 25726 28967 18761 373
1803 373 -17819 -27414 -23452 -8384 10609 24433 26081 14821 -3881 -21152 -28982 -23563 -7334
1816 -7334 11933 25076 26101 14516 -3928 -20446 -26918 -20430 -3666 14978 27037 26572 13682
1829 13682 -5082 -21160 -26774 -19283 -2600 15557 26177 24393 10820 -8177 -23376 -27814 -19371
1842 -19371 -1987 15836 25602 22979 8958 -9533 -23354 -26264 -16499 1284 18551 27397 23541
1855 23541 8793 -9593 -23170 -24990 -14654 2909 19052 26660 21282 5616 -12806 -25250
1867b5250p68J1380J7746J5823O775o421j5655j7512j1154P05J2345J8009J5463
1880B1486N224p182j6187j7235j0427J641J2889J7808J4138L723q234j6825j7040
1893a6221r479K802J3402J7732J3504K937r294j6809j6280q046L965J4280J7708
1906A0201J3101J764r891j6990j5779o950M840J4688J7116J1795N09j0962j7327
1919c885j5482o163O008J4980J7005J0842l92j1719j7057j4435n003P081J5775
1932b445J6557J0058j519j2205j7154j3763l738Q057J5673J6142Q863k968j2960
1945H598j6886j3066k912Q790J6206J5545P644l943j3429j6788j2050j376R733
1958a3934J6226J5065P010m814j3888j6548j1193m33J0457J6401J4213N674n844
$$ plain form
1867 -25250 -26018 -14638 3108 18931 25706 19285 3630 -13882 -25036 -24331 -11986 6023 21486
1880 21486 26710 19528 3341 -13894 -24321 -22680 -9791 8017 22155 25878 17644 819 -16221
1893 -16221 -25700 -22898 -9496 8236 21740 24677 15383 -1426 -17706 -25752 -21787 -7507 10201
1906 10201 23302 25066 15175 -1815 -17594 -24544 -19704 -5016 12100 23895 24404 13442 -3885
1919 -3885 -19367 -25530 -19522 -4542 12463 23305 22913 11194 -5863 -20298 -25301 -18220 -2445
1932 -2445 14112 24170 22651 10446 -6708 -20471 -24209 -16152 -479 15663 24526 21558 8598
1945 8598 -8288 -21354 -24266 -15476 730 16275 23919 19976 6547 -10241 -22291 -23667 -13934
1958 -13934 2292 17357 24367 19553 5665 -10883 -22076 -22509 -12052 4349 18562 24236 18392
1971A8392j4747j6256j0459O42J1157J6096J3892M536o639j4722j5806r244J680
1984b1478J1867J6371J3287L624p546j4925j5312q532K850J2372J5753J2258K565
1997B3154q447j5367j5132p520L509J2941J5929J1329J332r305j5209j4358o415
2010b3559M489J3645J5652J0959M47r592j5338j3682n299N569J4050J5298R888
2023B2527l88j0950j5758j3260m783O110J4159J4828Q914j862j1204j5414j2475
2036a9556l519P503J4353J4890Q088k419j1762j5065j1747k425Q369J4646J4115
2049A5471P330l387j2397j5354j0720j282Q464J4547J3431N999m773j3246j5186
2062a1103j0355n12R486J4856J3119N323n074j2957j4459q922R27J0297J5223
$$ plain form
1971 18392 3645 -12611 -23070 -22428 -11271 4825 18717 23253 16614 1892 -13914 -23158 -21478
1984 -21478 -9611 6760 20047 23671 16125 1200 -14112 -22644 -19794 -7422 8331 20589 23154
1997 23154 14707 -660 -15792 -23312 -19803 -6862 9067 20396 21728 12423 -2786 -17144 -23559
2010 -23559 -19070 -5425 10227 21186 21633 12041 -3297 -16979 -22278 -16709 -2659 12639 22527
2023 22527 22139 11189 -4569 -17829 -22612 -16502 -2343 12485 21399 19537 8333 -7081 -19556
2036 -19556 -23075 -15572 -1219 13671 21759 19340 7578 -7487 -19234 -21659 -13290 1356 15471
2049 15471 22801 19414 7017 -8337 -19057 -20339 -11875 2672 16103 22102 17329 4083 -11103
2062 -11103 -21458 -21970 -12484 2372 15491 20814 15740 2783 -11676 -20598 -19671 -9374 5849
2075E849J2570M254o186j3435j4566q780J598J0572J4699J1815K935o834j3838
2088F53j4370p738K404J1103J4524J1116K011p921j3832j3450o570L542J2013
2101f515J4941J1026J876q049j4004j2738n671M112J2066J4086R290J3r540j4683
2115c790j2931n057M761J2450J4152Q952l71r654j3979j2051l726N938J3257J3620
2129A1571Q332j420j0327j3764j1089k902P044J3446J3385P673k463j0974j4273
2142e761j1112k507O926J2747J2360O095l543j1591j4044r848j128Q330J3952
2155H76J3040O032l652j1178j3555r081k77Q827J3273J2127M364m775j2241j3515
2169i735q646N69R188J3586J1530L605n842j2502j3706q124R82R515J3421J0915
$$ plain form
2075 5849 18419 22673 16487 3052 -11514 -20294 -18696 -8124 6575 18390 21325 14491 653
2088 653 -13717 -21455 -19051 -7948 6576 17692 19703 11782 -2050 -15500 -22070 -18528 -6515
2101 -6515 8426 19452 21328 13279 -725 -13463 -19134 -15022 -2956 11130 20420 20433 10893 -3790
2115 -3790 -16721 -21778 -17017 -4567 9585 18537 18166 8512 -5467 -17518 -21244 -15306 -2049 11571
2129 11571 19903 18483 8156 -5608 -16697 -19599 -12555 891 14276 21949 19486 8512 -5761
2142 -5761 -16873 -19380 -12454 293 12653 18748 15205 3614 -10430 -20278 -21406 -13076 876
2155 876 13916 19948 16296 5118 -8437 -17518 -17795 -8968 4305 16432 20796 16021 3780 -9735
2169 -9735 -18381 -17812 -8624 4962 16492 20097 14255 1753 -11953 -20077 -19095 -9580 3841 14756
2183A4756K923o088j2170j2661o276K767J0828J3909J0657K344o943j2842j2740
2196a1536o506K716J0394J3037R135J032p853j3284j1939n221L655J1532J3307
2209H469Q923M32q301j3158j1579m724M779J1552J2975Q474j20q643j2866j0512
2223a4299l550N901J1871J2507P424j804r847j3389j0901l235N703J1726J2069
2236A0176O825j933r909j2761r456j663P212J2511J2161N994l099j0352j2780
2249g074r382j322P534J2276J1482N314l592j0802j2601q384j45P843J2279J0648
2263A4074M087n009j1095j2800q052N06Q519J2839J0751L895m871j1036j1652
2276i844o904J585R268J2529R822K596o280j1829j2094o719J898R411J2388R541
$$ plain form
2183 14756 17679 11591 -579 -13240 -19516 -16749 -5921 7988 18645 20989 14046 1204 -11536
2196 -11536 -18042 -15326 -4932 8105 17240 18272 10419 -2865 -14804 -20025 -16370 -4838 8469
2209 8469 17392 17824 9523 -3635 -15214 -19938 -15159 -3607 9368 17842 17722 9079 -3787 -14299
2223 -14299 -17849 -11948 -77 12430 19854 18050 8203 -5186 -16087 -19322 -13619 -1893 10176
2236 10176 17001 15068 5159 -7602 -17058 -18721 -11509 1002 13163 19157 16058 5706 -7074
2249 -7074 -16456 -17778 -10244 2032 13514 18828 15236 4434 -8167 -16551 -16696 -8853 3426 14074
2263 14074 18161 13152 2057 -10743 -18795 -18289 -9770 3069 13820 17715 12844 1808 -9844
2276 -9844 -16748 -15163 -5895 6634 16456 19052 12772 943 -11151 -17870 -15972 -6561 5827 15368
2290A5368J736o228j1788j1511n647K780J0016J2146Q888R20p185j1830j0971
2303a3306m809L807J0457J2438Q542N53p533j1948j0446m230M078J0508J1595
2316I706O983p83q646j2197j0245l425N159J0919J1864O873j026q402j1787r447
2330a4454k485N765J1228J1307O026k009r103j1812r101j969O421J1184J1061
2343A2059N282k742r730j2090q469j122O427J1422J0676M445l316r969j1350p768
2357a6245k18P839J1690J0422M026l913j0114j1460p126M75P565J1478R555K869
2371A6843n059j0630j1252o717J081Q322J1550R066K533n256j0601j0678n532
2384a6330J951Q813J1556Q812J819n645j0861j0467n078K510R045J1374P781R26
$$ plain form
2290 15368 17104 10876 -912 -12423 -18070 -15290 -5274 6872 15760 16680 9495 -2335 -13306
2303 -13306 -18115 -14308 -3851 8587 17129 17682 10149 -1799 -12245 -16475 -12397 -1889 9706
2316 9706 16689 15906 7260 -4937 -15182 -18607 -13448 -2529 9335 16208 15182 6780 -5007 -14454
2330 -14454 -16939 -11174 54 11361 17387 15378 6275 -5537 -14638 -16607 -10186 998 12059
2343 12059 17341 14599 4869 -7221 -15690 -16812 -10385 1037 11713 16158 12842 2873 -8477 -16245
2357 -16245 -16463 -8624 3066 13488 17514 13601 3487 -7973 -15099 -14624 -7059 4419 13974 16843
2371 16843 11784 1154 -10098 -16815 -15734 -7412 4138 13204 15737 10481 -120 -10798 -16330
2384 -16330 -14379 -5566 5990 14802 16621 10976 115 -10352 -15430 -12920 -3875 7499 15280 16206
2398A6206o689j1288j0128m704L071R248J1185P445J57o916j1062r637l656M072
2412a2696R732J1220P194k45p282j0844r214k837M615R852J0871O172j394q198
2426F946j1364r037k788N014R993J0330N610j889q314j0905q116j751O090J0549
2440C68J0116N293k362q783j0844p710p58O230J0776R639M394l029r133j0693
2454f496p484m11O769J0263R275L265l970r868j0467o916L53P135J0806R417L101
2469A4772m095r282r905n822J316P936J0640Q339K167m872j0101j0182n620J642
2483a3067P857J0594P926J572n580r844r923m916K078Q406J0358P333R18o129
2497G583j0218r071m123L183R267J0492P457O73o101j0108r010l551L439Q714
$$ plain form
2398 16206 9517 -1771 -11899 -16603 -13532 -4284 6901 14346 14503 7587 -3475 -13112 -16768 -12696
2412 -12696 -2964 8256 15450 15205 7923 -2921 -12135 -14972 -10357 -505 10366 16538 15144 6946
2426 6946 -4418 -13455 -16243 -11229 -1236 9094 14704 12815 4501 -6404 -14520 -16271 -10181 368
2440 368 10484 15777 13415 4632 -6212 -13922 -14680 -8450 2326 11965 16359 13330 4197 -6496
2454 -6496 -13980 -14391 -7622 2641 11916 15181 11211 1343 -9124 -16040 -15687 -8552 2254 11671 14772
2469 14772 10677 1395 -8510 -14332 -13016 -5080 5560 13899 16066 11194 1093 -9089 -14709 -13067
2483 -13067 -5210 5384 13310 14882 9302 -542 -10465 -15381 -13303 -4897 5461 12794 13712 7583
2497 7583 -2635 -11706 -15829 -12646 -3379 7113 14570 15243 9142 -966 -9976 -13527 -10088 -1374
2511a374R938O039p19p208j0686q864l075M160R217J0054O129j053p086j0013
2525d541q211k038M680R441R877N087j533p571j0051p572j451N633R824R395N024
2540A5993k344q288j0245p784j325N287R372Q594L714l110q382r940o594K2O610
2555h420J0092R189L867l038q504r687o155L95O688R695Q161K443l879r054r641
2570g848n549R43O904R928P832J932m576r689r357n558J341P379R850P442J658
2585A2632m965r036q474l853K588Q108J0096P205R24n684r459q974m168K302P734
2600c024R244O279Q5o059r619q313l138L465Q510R322O043j98o652r410q053k625
2616a4143L900Q509R399N616o34o638r253p223k004M557Q935Q628M750j830p614
$$ plain form
2511 -1374 8564 14603 13884 6676 -4010 -12874 -15949 -11789 -2572 7482 13611 12558 5472 -4541
2525 -4541 -12752 -14790 -10110 -669 9208 14295 12762 5191 -4860 -12432 -13883 -8250 1574 10969 15993
2540 15993 13649 5361 -4884 -12668 -13993 -8706 666 9260 12974 9864 1482 -8458 -15052 -15030 -8420
2555 -8420 1672 10861 14728 11690 3186 -6501 -12656 -12261 -5573 4122 12283 14726 10847 1793 -7848
2570 -7848 -13397 -12454 -5550 4378 12210 14142 9566 -123 -9480 -15038 -13697 -6318 3532 10974 12632
2585 12632 7667 -1369 -9843 -13696 -11108 -3000 7096 14301 15225 9541 82 -8892 -13060 -10758 -3024
2600 -3024 6220 12499 12584 6525 -3094 -11407 -14545 -11080 -2570 6752 12795 12597 5945 -3465 -11518 -14143
2616 -14143 -10243 -1734 7665 13281 12647 6009 -3244 -10467 -12471 -7914 1021 9649 14399 12569 4955
2631D955r832p409j752M605Q699Q644M328k010p198r031o307o74N559R315Q234
2646A0126L707k673p816r270o331j77N792Q973Q004L173l151p727r122n660K50
2661a1902N986R006P406K439m029q342r017n408J144O530R185P704K007l782q188
2676G39q314m473J603O882Q709O936J233m941q689q403m271J713P467Q781O454
2691A1426R90n121q513q103l534K422P349Q513O174L45n741q668p753k754L135
2706i833P807Q811N787j41n907q524p391k640L406P663Q305M884r67o775q523
2721d038p096k087M063Q258Q504M643j512o377q471o658j451M491Q140Q136L820
2736A2365j753o843q667o109r16N061Q345P634L568k470p270q535n889m43N289
$$ plain form
2631 4955 -4877 -12286 -14038 -9433 -734 7910 12238 10228 3030 -6001 -12308 -12982 -7423 1892 10126
2646 10126 13833 11160 3344 -5926 -12257 -12434 -6642 2331 10335 13508 10357 2630 -6492 -12152 -11902
2661 -11902 -5916 3090 10496 12935 8906 564 -8453 -13861 -12717 -6187 2998 10702 12709 8927 739
2676 739 -7575 -12048 -10445 -3563 5146 12082 13315 8374 -315 -8718 -12989 -11276 -3809 4972 11426
2691 11426 12416 7295 -1218 -9321 -12855 -10433 -3084 5429 11603 11948 6207 -2461 -10214 -12968 -9833
2706 -9833 -2026 6785 12572 12431 6524 -2000 -9391 -12031 -8625 -962 7343 12227 11260 4485 -4038
2721 -4038 -11134 -13221 -9158 -900 7604 12247 10735 4358 -4113 -10771 -12222 -7731 409 8545 12365
2736 12365 10612 3769 -4898 -11007 -11923 -6862 1483 9117 12685 10215 2945 -5590 -11479 -11922 -6633
2751f633Q129P446K888k809p554q183n271L73N905Q550P173K567l486p336q276
2766f517m795P84N933Q223O498J922l951p783p908m515J310O483Q140O517J378
2781A1719m356p838p683l904K014O518Q406N792J107m615q072p364l327K306O961
2796b336Q115N462L21n382q031p235l008L015O824Q086M912l40n352q150o412
2811i511k484L358P456P856M796o95n862p786o494j858L947P455P421L996r89
2826A0606o480p925o372j553M159P617P189L780j560o465p976n629q75M547P800
2841H63P336L198k090o527p923n159j06M808P581O967K833k678o831p782m970
2856a0480J06N131P697O166K254l231p043p294m649N53N651P923O287J843l261
$$ plain form
2751 -6633 1496 8942 11830 9021 1467 -6716 -11987 -11614 -5709 2841 10014 12581 9095 1759 -6517
2766 -6517 -11312 -10528 -4595 3628 10126 12048 8097 314 -7594 -12109 -10799 -4316 3824 10341 11719
2781 11719 7363 -475 -8158 -12062 -10048 -3530 4876 10668 11775 7160 -912 -8276 -11603 -9297 -2336
2796 -2336 5779 11241 11562 6180 -1851 -9086 -12094 -9079 -2255 5831 10743 10403 5051 -3099 -9511
2811 -9511 -11995 -8637 -1181 6675 11471 10776 4914 -2872 -9366 -11224 -7277 178 7599 11595 10606
2826 10606 4126 -3799 -10171 -11724 -7565 52 7241 11021 9461 2996 -4980 -10609 -11484 -6937 863
2841 863 8199 11397 9307 2780 -5143 -10302 -10408 -5600 1981 8948 11781 9103 2272 -5510 -10480
2856 -10480 -10374 -5243 2454 8620 10874 7643 600 -6694 -11343 -10790 -5139 2784 9071 10914 7653
2871G653p060p248m048J147N875Q163N565J250l926p203p373l756J711N926P756
2886D432N572O85m429p420o817l373K187O111P861M998K16m545p442o639k440
2901a1043K580O682P640M888j49m904p466o302k156K816O603P138M323q52n548
2916D250p635n998j709L604O686P135M034j090n597p378n811j166L808P008P024
2931G165L407j423n852p385n348p55M386P088O917K854j994o256p371n118n94
2946a0279M648O970O129K657k457o371p155m621J48N034P293O285K251k886o512
2961A134o773m195P04N185P226N807J690l300o813o830l726J005N432P120N321
2976H987J168l679o916o809l487J425N813P059N194Q09l968o722o110l190K231
$$ plain form
2871 7653 593 -6655 -10703 -9556 -3681 4482 10047 11297 7371 168 -7205 -10961 -9250 -3324 4432
2886 4432 10004 10689 6260 -1160 -7977 -11350 -9163 -3052 4809 9807 10023 5478 -1964 -8603 -11043
2901 -11043 -8463 -1781 5859 10747 10598 5694 -1772 -8074 -10230 -7414 -811 6327 10650 9798 4250
2916 4250 -3385 -9383 -11092 -7488 -802 6333 10367 9277 3680 -3698 -9509 -10675 -6867 141 7165
2931 7165 10572 9149 3297 -4088 -9436 -10191 -5805 1283 8200 11054 9060 2804 -4567 -9685 -10279
2946 -10279 -5631 1339 7468 10125 7668 1297 -5858 -10479 -10331 -5297 1996 8281 10532 7646 1134
2961 1134 -5639 -9834 -9130 -3945 3281 9088 10778 7478 665 -6165 -9891 -8886 -3454 3666 8987
2976 8987 10155 6476 -440 -7249 -10736 -9311 -3498 3561 8755 9564 5596 -1126 -7236 -10426 -8195
2991h195N932P159M934L83m236o834o231k746K398O027O818M292k50m654p090
3006b293o018k014K679O070O894M027o51m885o863n758j519L101O607O618L795
3021I790q09n178o853n192j017L477O487O451L080j386n483o994n148p87L634
3036e928O677N970K876j940n724o776m684j93L919P036N985K526k387n643o723
3051e009l997J29M443O925N500K156k648o194o537l945O23M834O604N197J441
3066I522l064o098o433l623J121M807O728N038J054l351o218o053k977J361N487
3081b699O610M782O58l453o347n882k746J845N306O510M221J11l977o551n649
3096g261k214K175N648O222M119j45m306o547n217j913K545N759O289L791o07
$$ plain form
2991 -8195 -2263 4896 9830 10213 5977 -857 -7088 -9834 -7436 -1409 5409 9701 9451 4797 -2293
3006 -2293 -8311 -10325 -7646 -1576 5318 9345 8694 3809 -3054 -8812 -10331 -7230 -623 5995 9790
3021 9790 8981 3803 -3050 -8242 -9259 -5782 705 7156 10236 8850 3367 -3627 -8775 -9562 -5928
3036 -5928 749 6719 9595 7655 1931 -4845 -9529 -9722 -5803 1233 7218 9744 7357 1714 -5009
3051 -5009 -9006 -8877 -4434 2491 7991 10147 7499 1305 -5232 -9177 -8554 -3720 2884 8081 9522
3066 9522 6458 360 -6073 -9696 -8575 -3768 2960 7998 9052 5701 -517 -6570 -9547 -8186 -2699
3081 -2699 3911 8693 9351 5898 -449 -6331 -9077 -7232 -1926 4584 8805 8916 4939 -1612 -7261
3096 -7261 -9475 -7300 -1652 4570 8689 8544 4238 -2309 -7526 -9439 -6894 -1135 5154 8945 8338
3111H338m429o494m931j529K963O129O088L237j103m553o498n091j162L250N924
3126A39N880K906j304n207o262m727o14L772N948N821K754j849n071o251m258
3141h323j90L693O348N589K039k041n194o190m183K95M173O117N298J569k624
3156F376n455n960l996P40M341O054N051J349k879n435n720l284R85M758O098
3171C023M910R99k941n835n681k911J157M874O032M404O35l419n838n562k757
3186h910J597N137N855M229L52l958n741n348k147J850N344N870L860K44m000
3201D234n968m873j593K120N566N552L568o54m184o011m785j375K656N265N590
3216E108L116j009m311n852m654r09K855N642N656K703r69m876n678m328m07L114
$$ plain form
3111 8338 3909 -2585 -7516 -9045 -6082 47 6135 9372 8269 3716 -2782 -7873 -9035 -5785 139
3126 139 6019 8925 7621 2414 -3848 -8575 -9189 -5417 531 6352 9106 7257 2186 -4065 -8323
3141 -8323 -8513 -4820 1528 7117 9156 7115 1921 -4269 -8452 -8157 -3984 2133 7431 9000 6376
3156 6376 921 -5039 -9035 -8295 -3954 2100 7151 8500 5621 186 -5534 -8818 -7833 -3075 3023
3171 3023 7933 8932 5991 156 -5525 -8436 -7279 -2405 3627 8031 8666 5247 -591 -6153 -8910
3186 -8910 -7313 -2176 3679 7908 8260 4302 -1439 -6787 -8934 -7084 -1740 4130 7990 8234 4234
3201 4234 -1734 -6607 -8200 -6080 -514 5038 8606 7952 3768 -2243 -7028 -8403 -5747 -482 5108
3216 5108 8224 7215 2904 -2948 -7602 -8511 -5656 -14 5642 8345 7376 2500 -3178 -7506 -7913 -4799
3232d799N532N423K525j761m807n702l933m94L590N630N066K149k011m866n976
3247d434l618j8L916N776N028J528k214n152n508l253L76M202N604M771J272k526
3263E750n206n419l103Q53M218N637M179J101l064n251n226k691J106M740N540
3278C164M156N38l114n400n180k150J485M567N487L988J56l328n488m987j965
3293h071J946M827N509L284J95l725n578m620j809K092M935N365L259n84l902
3308C123n484m262j358K457N241N317L059p12m353n377m189j189K844N244M660
3323E021K794j454m172n416l963n60L047N272M846K411j463m566n406l446k53
3338g308L096N276M635K022j793m502n288l334O7L769N317M460J593k213m790
$$ plain form
3232 -4799 733 6156 8681 6920 2113 -3589 -7522 -8016 -4426 1204 6270 8419 6408 1542 -4434
3247 -4434 -8052 -8070 -4154 1622 6650 8178 5964 812 -4696 -7949 -7573 -3371 2233 7004 8276 5750
3263 5750 544 -4875 -7978 -7125 -2907 2730 6909 8010 4946 -305 -5531 -8222 -7116 -2376 3164
3278 3164 7320 7858 4744 -656 -5836 -7986 -6501 -1934 3553 7541 7697 4369 -1119 -6106 -8071
3293 -8071 -6125 -1298 4211 7495 7690 3965 -1613 -6233 -8042 -5950 -1015 4350 7609 7025 3123
3308 3123 -2361 -6623 -7981 -5524 -283 5034 8093 7381 3028 -2349 -6538 -7727 -4883 361 5021
3323 5021 7815 6361 2189 -3227 -7190 -7750 -4703 569 5415 7826 6363 1797 -3609 -7055 -7308
3338 -7308 -4212 1064 5699 7721 5928 1426 -3862 -7196 -7129 -3360 1957 6417 8010 5797 1007
3353A007n148l421L41L846N183M271J070k338m651n188k400O88M130N546L843
3368F779R24k539n227m814k583J187M114N117L724O86k873n103m666k138J402
3383f010M341N222L523j89l091n166m756j937J855M465N176L268Ql131m958m186
3399e566j412K141M570N051K881m40l687n305m457j045K098M561M657K854p33
3414F168l764n193l682q37K576M863M668K275j033l988n041l785m18L014M809
3429F32M779K245j324l965m862l508k52K860M826M199J493j782m421n146l261
3444g487mL449M851M141J802j836m176m645k790N62L573M996L593J280k045m737
3460E27m745k564P38L670N099L797O30k270m836m590k438J002L660M527L404L53
$$ plain form
3353 1007 -4141 -7562 -7221 -3375 1808 6079 7149 4811 160 -5028 -7428 -6740 -2610 2936 6779
3368 6779 7703 5164 -63 -4877 -7460 -6273 -2159 2958 6682 7368 4495 -608 -5274 -7412 -6010
3383 -6010 -1669 3553 7076 6887 3796 -1370 -6126 -8063 -6208 -1743 3433 6701 6709 3578 -1380 -5566
3399 -5566 -6978 -4837 -267 4784 7665 7225 3538 -1767 -6224 -7269 -5171 -610 4047 6901 6168
3414 6168 2404 -2789 -6471 -7308 -4732 131 4799 7074 6041 2053 -2988 -6773 -7191 -4177 632
3429 632 5411 7656 6332 2367 -2495 -6003 -6255 -3395 1431 5630 7123 5341 920 -4226 -7487
3444 -7487 -7491 -4042 809 4950 6752 4916 740 -3905 -6695 -6133 -2560 2436 6029 7309 5264 527
3460 527 -4218 -6782 -6044 -2374 2725 6522 7152 4882 46 -4544 -6982 -5980 -2320 2207 5611 5964
3476E964k829m488m432j791J516L964N303L561J31k649m431m299j795J551L996
3491g28M614K779k15l195m684m124j506J688M560M542K905n85l157m780l929j296
3507g111J927M296M663K459o60l350m575l428o47K602M373M483K532j115l700
3522B749m819l615n58K298M444L918J820j397l925m635l025j21K985M730M090
3537D939J545j452l918m382k923l3L056M732L948J266j651m056m286k737L26L330
3553b296M453L745Q18k087m435m358k658N36L306M552L600N78k067m225m072k009
3569f619J120L731M647L463J28k093m473m075j994J113L633M462L046K53k692
3584C650m544m026j640J659L459M469K812p7l188m381l790j206J831L989M368
$$ plain form
3476 5964 3135 -1353 -5785 -7576 -6060 -2096 3207 6768 6899 4250 -181 -4480 -6275 -4724 -728
3491 -728 3886 6665 6450 3255 -1429 -5553 -7059 -5371 -811 3731 6636 6051 2894 -1886 -5815 -7111
3507 -7111 -5184 -888 3775 6234 5574 2224 -2351 -5779 -6426 -3824 549 5032 7564 6449 2749
3522 2749 -2070 -5685 -6243 -3945 499 4417 6237 4840 915 -3720 -6745 -6866 -3881 849 4939
3537 4939 6484 5032 1114 -3268 -6191 -6224 -3168 1564 5512 6778 5127 1071 -3215 -5952 -5626 -2296
3553 -2296 2157 5902 6720 4633 198 -4160 -6818 -6282 -2976 1576 5176 5754 3687 -538 -4610 -6619
3569 -6619 -5499 -1768 2879 6342 6470 4377 -96 -4171 -6165 -5052 -1419 3043 6089 6342 3650
3584 3650 -894 -4920 -6560 -4901 -1442 3027 5839 5762 2574 -1807 -5597 -6803 -4972 -983 3385
3599C385K752l23l007m200l561q39K062L884M306K326p99l464m525l408r69K172
3615d208M057L920J914p24l315m533k954n62K397M360L948J712j036l326m393
3630b743k876j07K657M198M016J416j479l714l983k956j9K697M237L514J186j761
3646D283l963m176k444K60L121M270L595R51j899l881l999k006O25L233M167L419
3662E556O29j969m037l895j906P04L288L897L233K01k299m240l729j655J053L536
3678a633M065L044N1k450l866l581j638J455L648L994K629M5k877l979l613j100
3694e806J711L540M108K117j62l089m021l409j043J783L765L811K001n32k936
3709A838l883l240n30K206L743L966J990p75l271l924k944o54K201L738L593J642
$$ plain form
3599 3385 6137 5814 2807 -1393 -4954 -5793 -3731 153 4459 6785 5986 2522 -2003 -5411 -6380 -4208
3615 -4208 -151 3769 5683 4959 1644 -2889 -5843 -6405 -4008 352 4300 6012 4976 1650 -2743
3630 -2743 -5619 -5726 -3069 1129 5145 6561 5082 1368 -2615 -5571 -5590 -2893 1344 4858 6044 4283
3646 4283 320 -3856 -6300 -6040 -2919 1351 4946 5897 3998 117 -3882 -5888 -5263 -2030 2137 5556
3662 5556 6185 4216 179 -3716 -5622 -4918 -1630 2267 5500 5701 3402 -838 -4567 -6222 -5169 -1633
3678 -1633 2432 5476 5527 3077 -789 -4370 -6008 -4553 -905 3089 5718 5763 2886 -1093 -4706 -5806
3694 -5806 -4095 -555 3553 5670 5508 2419 -1602 -5011 -6054 -4271 -506 3305 5306 4774 1838
3709 1838 -2045 -5285 -5815 -3609 134 4100 6090 5315 2044 -1880 -4824 -5478 -3277 461 4054 5696
3725E696j059l371l870k914j22K410L858L652J368j315l370l947k525JK593M032
3741A117L276J284j475l609l572k160K04K754L930L274R50j972l610l782k207
3756e598L61K850L925K847R12k006l554l505j763P28L100M026K680P35k360l555
3772a77l523j677R00L028L939K615J15j996l836l449j391J246L269L608K444j1
3788E104k815l663l307j159J505L217L716K437o5k641l369l084q23J587L447L514
3804C601J979o50k689l858k917q59J695L528L679J637p67k880l578k814l63J999
3820c257L556L274J589q70l122l632k414l07K320L779L082J583j034k993l671
3835b117k452j46K321L465L078Q80j355l339l676k177K81K447L667L084R35j246
$$ plain form
3725 5696 4637 1266 -2604 -5518 -5640 -3230 628 4280 5648 4333 963 -2984 -5509 -5508 -2915 1117
3741 1117 4393 5677 4202 593 -2979 -5139 -4935 -2181 1749 5023 5973 4001 391 -3391 -5598
3756 -5598 -5237 -2387 1538 4385 5297 3291 -263 -3768 -5531 -4803 -1703 2323 5003 5738 3378 -177
3772 -177 -3700 -5377 -4477 -1449 2490 5105 5220 3224 -612 -4061 -5452 -4206 -937 2671 5115 5104
3788 5104 2289 -1374 -4681 -5840 -4335 -1118 2598 5035 4970 2329 -1040 -4124 -4947 -3360 87 3601
3804 3601 5580 4930 2241 -1617 -4534 -5393 -3698 -170 3509 5146 4379 1499 -2079 -4893 -5256 -3257
3820 -3257 299 3573 5162 4292 1170 -2462 -4876 -5183 -2863 916 3998 5581 4547 1554 -2117
3835 -2117 -4569 -4715 -2394 1071 4149 5029 3674 335 -3341 -5518 -5237 -2790 877 3961 4896 3650
3851C650l346l275j918O01K590L501K890N83j812l187l379j893N84L008L658K530
3867D785L48j774l407l497j627O84K719L619K221J94k132l343l109j248J509K927
3883a131L673K314L00k060l501l081j001J240K909L337J958k04k518l579k918
3898d262p98J266L244L232J912l73k537l574k652p55J718L287L291J598m41k553
3914A603l417k453m04K051L278L223J619r75k846l432k621l91J986L048K993J221
3930D483j019k914l205k319p0K409L461K902J275j216k979l369k044K33K230L484
$$ plain form
3851 3650 304 -2971 -4889 -4288 -1698 1803 4693 5276 3464 277 -3102 -4995 -4411 -1403 2255 4785
3867 4785 5133 3359 -48 -3545 -5172 -4488 -1769 1850 4071 4265 2133 -1210 -4319 -5567 -4058 -1131
3883 -1131 2542 4856 5156 3096 -405 -3486 -4487 -3247 -338 2999 4957 4753 2235 -1344 -4262
3898 -4262 -5060 -3794 -550 2682 4594 4221 1684 -1890 -4542 -5297 -3579 -292 2999 4597 4156 1603
3914 1603 -1814 -4267 -4671 -2620 658 3881 5500 4525 1679 -1753 -4374 -4765 -2779 269 3262 4483
3930 4483 3464 550 -2655 -4974 -5044 -2635 826 3728 5003 3787 808 -2561 -4605 -4372 -2142 1342
$$ [...]
8191E9
##END NTUPLES=NMR FID
##END=
