##TITLE=1H_AM_NVACET_1280
 CDCl3
 8 sc, 
 8.04.2022
##JCAMPDX= 6.0         $$ Bruker NMR JCAMP-DX V2.0
##DATA TYPE= NMR FID
##DATA CLASS= NTUPLES
##ORIGIN= UXNMR, Bruker Analytische Messtechnik GmbH
##OWNER= root
$$ XWIN-NMR		Version 3.5
$$ Fri Apr  8 11:12:03 2022 Russian Standard Time (UT+4h)  she@DPX200
##.OBSERVE FREQUENCY= 200.13135
##.OBSERVE NUCLEUS= ^1H
##.DELAY= (6, 6)
##.ACQUISITION MODE= SIMULTANEOUS
##.ACQUISITION SCHEME= undefined
##.AVERAGES= 8
##.DIGITISER RES= 18
##SPECTROMETER/DATA SYSTEM= spect
##.PULSE SEQUENCE= zg30
##.SOLVENT NAME= CDCl3
##.SHIFT REFERENCE= (INTERNAL, CDCl3, 0, 15.7039)
##AUDIT TRAIL= $$ (NUMBER, WHEN, WHO, WHERE, WHAT)
$$ ##TITLE= Audit trail, XWIN-NMR		Version 3.5
$$ ##JCAMPDX= 5.01
$$ ##ORIGIN= Bruker BioSpin GmbH
$$ ##OWNER= she
$$ F:/spectra/data/she/nmr/H-F/1/audita.txt
$$ ##AUDIT TRAIL=  $$ (NUMBER, WHEN, WHO, WHERE, WHAT)
(   1,<2022-04-08 11:09:54.00 +0400>,<she>,<DPX200>,
      <created by zg, POWCHK disabled, PULCHK disabled
       configuration hash MD5:
       00 E9 B6 7A A2 85 ED C7 34 08 36 98 17 FE 4E 26
       data hash MD5: 16K
       8B 80 32 CB F8 9C 83 3B D9 0C C5 97 FA B7 FB 47>)
$$ ##END=
$$ 
$$ hash MD5
$$ AA FF BA 65 98 69 99 96 E2 76 76 0D 2D D6 03 B8
##$RELAX= 
##$RELAX= 
##$RELAX= 
##$RELAX= 
##$RELAX= 
##$RELAX= 
$$ Bruker specific parameters
$$ --------------------------
##$DU= <F:/spectra>
##$EXPNO= 1
##$NAME= <H-F>
##$PROCNO= 1
##$TYPE= <nmr>
##$USER= <she>
##$AMP= (0..31)
100 100 100 100 100 100 100 100 100 100 100 100 100 100 100 100 100 100 
100 100 100 100 100 100 100 100 100 100 100 100 100 100 
##$AQSEQ= 0
##$AQ_mod= 1
##$AUNM= <au_zg>
##$AUTOPOS= <>
##$BF1= 200.13
##$BF2= 200.13
##$BF3= 200.13
##$BF4= 200.13
##$BF5= 200.13
##$BF6= 200.13
##$BF7= 200.13
##$BF8= 200.13
##$BYTORDA= 1
##$CFDGTYP= 0
##$CFRGTYP= 5
##$CHEMSTR= <none>
##$CNST= (0..31)
1 1 145 1 1 1 1 1 1 1 1 1 1 1 1 1 1 1 1 1 1 1 1 1 1 1 1 1 1 1 1 1 
##$CPDPRG= <>
##$CPDPRG1= <>
##$CPDPRG2= <>
##$CPDPRG3= <>
##$CPDPRG4= <mlev>
##$CPDPRG5= <mlev>
##$CPDPRG6= <mlev>
##$CPDPRG7= <mlev>
##$CPDPRG8= <mlev>
##$CPDPRGB= <>
##$CPDPRGT= <>
##$D= (0..31)
0 1.2 0 0 0 0 0 0 0 0.06 0 0.03 0 0 0 0 0.0002 0 0 0 0 0 0 0 0 0 0 0 0 
0 0 0 
##$DATE= 1649401793
##$DBL= (0..7)
120 120 120 120 120 120 120 120 
##$DBP= (0..7)
150 150 150 150 150 150 150 150 
##$DBP07= 0
##$DBPNAM0= <>
##$DBPNAM1= <>
##$DBPNAM2= <>
##$DBPNAM3= <>
##$DBPNAM4= <>
##$DBPNAM5= <>
##$DBPNAM6= <>
##$DBPNAM7= <>
##$DBPOAL= (0..7)
0.5 0.5 0.5 0.5 0.5 0.5 0.5 0.5 
##$DBPOFFS= (0..7)
0 0 0 0 0 0 0 0 
##$DE= 6
##$DECBNUC= <off>
##$DECIM= 32
##$DECNUC= <off>
##$DECSTAT= 4
##$DIGMOD= 1
##$DIGTYP= 9
##$DL= (0..7)
0 120 120 120 120 120 120 120 
##$DP= (0..7)
150 150 150 150 150 150 150 150 
##$DP07= 0
##$DPNAME0= <>
##$DPNAME1= <>
##$DPNAME2= <>
##$DPNAME3= <>
##$DPNAME4= <>
##$DPNAME5= <>
##$DPNAME6= <>
##$DPNAME7= <>
##$DPOAL= (0..7)
0.5 0.5 0.5 0.5 0.5 0.5 0.5 0.5 
##$DPOFFS= (0..7)
0 0 0 0 0 0 0 0 
##$DQDMODE= 0
##$DR= 18
##$DS= 0
##$DSLIST= <SSSSSSSSSSSSSSS>
$$ [...]
##$SUBNAM2= <"">
##$SUBNAM3= <"">
##$SUBNAM4= <"">
##$SUBNAM5= <"">
##$SUBNAM6= <"">
##$SUBNAM7= <"">
##$SUBNAM8= <"">
##$SUBNAM9= <"">
##$SW= 18.05172834244
##$SWIBOX= (0..15)
0 0 2 0 0 0 0 0 0 0 0 0 0 0 0 0 
##$SW_h= 3612.71676300578
##$TD= 16384
##$TD0= 1
##$TE= 0
##$TE2= 300
##$TE3= 300
##$TEG= 300
##$TL= (0..7)
0 120 120 120 120 120 120 120 
##$TP= (0..7)
150 150 150 150 150 150 150 150 
##$TP07= 0
##$TPNAME0= <>
##$TPNAME1= <>
##$TPNAME2= <>
##$TPNAME3= <>
##$TPNAME4= <>
##$TPNAME5= <>
##$TPNAME6= <>
##$TPNAME7= <>
##$TPOAL= (0..7)
0.5 0.5 0.5 0.5 0.5 0.5 0.5 0.5 
##$TPOFFS= (0..7)
0 0 0 0 0 0 0 0 
##$TUNHIN= 0
##$TUNHOUT= 0
##$TUNXOUT= 0
##$USERA1= <user>
##$USERA2= <user>
##$USERA3= <user>
##$USERA4= <user>
##$USERA5= <user>
##$V9= 5
##$VALIST= <valist>
##$VCLIST= <CCCCCCCCCCCCCCC>
##$VD= 0
##$VDLIST= <DDDDDDDDDDDDDDD>
##$VPLIST= <PPPPPPPPPPPPPPP>
##$VTLIST= <TTTTTTTTTTTTTTT>
##$WBST= 1024
##$WBSW= 4
##$XGAIN= (0..3)
0 0 0 0 
##$XL= 0
##$YL= 0
##$YMAX_a= 307942
##$YMIN_a= -311871
##$ZGOPTNS= <>
##$ZL1= 120
##$ZL2= 120
##$ZL3= 120
##$ZL4= 120
##$ABSF1= 10
##$ABSF2= 0
##$ABSG= 5
##$ABSL= 3
##$ALPHA= 0
##$AQORDER= 0
##$ASSFAC= 0
##$ASSFACI= 0
##$ASSFACX= 0
##$ASSWID= 0
##$AUNMP= <proc_1d>
##$AZFE= 0.1
##$AZFW= 0.1
##$BCFW= 1
##$BC_mod= 2
##$BYTORDP= 1
##$COROFFS= 0
##$CY= 11.3945322036743
##$DATMOD= 1
##$DC= 2
##$DFILT= <>
##$DTYPP= 0
##$F1P= 2.36226072786647
##$F2P= -0.459571619588291
##$FCOR= 0.5
##$FTSIZE= 0
##$FT_mod= 4
##$GAMMA= 1
##$GB= 0.15
##$INTBC= 1
##$INTSCL= 1
##$ISEN= 128
##$LB= 0.24
##$LEV0= 0
##$LPBIN= 0
##$MAXI= 10000
##$MC2= 0
##$MEAN= 0
##$ME_mod= 0
##$MI= 1.114404
##$NCOEF= 0
##$NC_proc= 0
##$NLEV= 6
##$NOISF1= 3.799351
##$NOISF2= 2.8
##$NSP= 1
##$NTH_PI= 0
##$NZP= 0
##$OFFSET= 15.70392
##$PC= 1
##$PHC0= -18471.09
##$PHC1= 16.00078
##$PH_mod= 1
##$PKNL= yes
##$PPARMOD= 0
##$PSCAL= 0
##$PSIGN= 0
##$REVERSE= no
##$SF= 200.130013532006
##$SI= 16384
##$SIGF1= 3
##$SIGF2= 2
##$SINO= 400
##$SIOLD= 16384
##$SREGLST= <1H.CDCl3>
##$SSB= 0
##$STSI= 0
##$STSR= 0
##$SW_p= 3612.71676300578
##$SYMM= 0
##$S_DEV= 0
##$TDeff= 0
##$TDoff= 0
##$TI= <>
##$TILT= no
##$TM1= 0
##$TM2= 0
##$TOPLEV= 0
##$USERP1= <user>
##$USERP2= <user>
##$USERP3= <user>
##$USERP4= <user>
##$USERP5= <user>
##$WDW= 1
##$XDIM= 8192
##$YMAX_p= 0
##$YMIN_p= 0
$$ End of Bruker specific parameters
$$ ---------------------------------
##NTUPLES= NMR FID
##VAR_NAME=  TIME,          FID/REAL,        FID/IMAG
##SYMBOL=    X,             R,               I
##VAR_TYPE=  INDEPENDENT,   DEPENDENT,       DEPENDENT
##VAR_FORM=  AFFN,          ASDF,            ASDF
##VAR_DIM=   8192,          8192,            8192
##UNITS=     SECONDS,       ARBITRARY UNITS, ARBITRARY UNITS
##FACTOR=    0.0002768,     1,               1
##FIRST=     0,             0,               0
##LAST=      2.2672688,     0,               0
##MIN=       0,             -311871,         0
##MAX=       2.2672688,     307942,          0
$$ Real data points
##PAGE= N=1
##DATA TABLE= (X++(R..R)), XYDATA
0@%%%%%%%%%%%%%%%%%%Qj6J6j6J6k0K8l2L2l6M4m8N2o0O9q0Q8r7J12j27J36j45
40g6J61j82K03k22K44k70K99l29L60l95M36m80N28n85O51p25Q11r10J031j181
60f31J366j604J923k365L007m017N780r391J9265q9953k35251M25016J47164m66648
74b06339q199M55518j18382m09306K36208L39896l20181k45426L91835J37135
84B52759m36951k869M33270j35211l85468K47400K98393l29290j91760L75543
94A25816Q2444l84339K7128L74698j26927l39624K25603K74449l14795j80607
104b36154L64350O0019l81327N3886L53603j59844k95130K40585K22077k90773
114f8708j37664L32193M8615l46143N6308L30697j57155k82557K42516K01140
$$ plain form
0 0 0 0 0 0 0 0 0 0 0 0 0 0 0 0 0 0 0 0 8 -8 8 -8 8 -12 16 -16 16 -20 24 -24 28 -32 37 -43 45 -52 60 -67 69 -76
40 -76 85 -97 106 -116 128 -142 157 -172 188 -207 229 -251 277 -308 343 -382 429 -481 550 -631
60 -631 735 -869 1054 -1311 1696 -2321 3459 -5932 13333 -76620 -311871 113145 260309 -206339
74 -206339 -214538 240980 122598 -286708 -50500 289396 -30785 -276211 115624 252759
84 252759 -184192 -187061 246209 110998 -274470 -27070 271323 -57967 -249727 125816
94 125816 208260 -176079 -148951 225747 98820 -240804 -15201 259248 -55547 -236154
104 -236154 128196 188215 -193112 -139226 214377 54533 -240597 -12 222065 -68708
114 -68708 -206372 125821 174436 -171707 -115399 215298 58143 -224414 18102 219242
124B19242l02480j03014L21707M744l10295Q1985K81034j55511k33865K20485
134B4032J71401k71406r2561K98207k458k98082R3484K60447j73747j99777K26198
145C5738J28080k52671n3749K65580j7202k57073R2188K33482j60068j87322K19403
156D6386J18179k56972l5737K60762m5206k40204J12785K01586j66833j50689
166a55943K05367R3311k31219k9172K41899m4789k30547J16047J90685j74627
176a8988j33050K10349O5879k22079J464K15219n8897j93067J11648J63124j57155
187a5553j17919J94232N8561k12374Q038K06410p2693j79815J25108J35948j60539
198c0596q6305J79170L6260j88094J5319J84872p0432j65978J20898J29039j61772
$$ plain form
124 219242 -83238 -186252 135455 140199 -170096 -88111 192923 37412 -196453 24032
134 24032 195433 -75973 -168534 129673 127215 -170867 -77383 183064 9317 -190460 35738
145 35738 163818 -88853 -142602 122978 105776 -151297 -59109 174373 14305 -173017 46386
156 46386 164565 -92407 -128144 132618 87412 -152792 -40007 161579 -5254 -155943
166 -155943 49424 142735 -88484 -117656 124243 79454 -151093 -35046 155639 -18988
176 -18988 -152038 58311 124190 -97889 -96425 118794 59897 -133170 -21522 141602 -15553
187 -15553 -133472 60760 119321 -93053 -85015 121395 48702 -131113 -6005 129943 -30596
198 -30596 -116901 62269 98529 -89565 -74246 110626 40194 -125784 -4886 124153 -37619
209c7619p7931J85142J8297j85369L8729J68701q4035j40680J22191J06586j51111
220c7099o3640J70559J4020j76546L9928J64224r2419j32992J31812Q7991j53817
231d7979m0448J59850n155j55285M7399J40685q6889j16806J21156Q1771j47813
242d9514l5547J58845j5568j49950O1584J27350r6117r5801J21166O0654j35548
253d8446k3009J42077j6463j40008N8888J23564r8939r2088J26882N0611j40003
264e6934p209J38143l3258j24974O6843J04480r4474p9202J17755M6242j33680
275e6268n297J36197l7683j22810P5884R6805j03216o2496J17993K7108j21507
286e5290N811J18776l7974j09603P0292Q9956r8854n9877J17841K2075j23649
$$ plain form
209 -37619 -115550 69592 87889 -97480 -58751 109950 25915 -114765 7426 114012 -37099
220 -37099 -100739 69820 83840 -92706 -52778 111446 19027 -113965 17847 105838 -47979
231 -47979 -88427 71423 66268 -89017 -41618 99067 12178 -104628 16528 98299 -49514
242 -49514 -85061 73784 58216 -91734 -30150 97200 1083 -94718 26448 87102 -48446
253 -48446 -71455 70622 54159 -85849 -26961 96603 -2336 -94424 32458 83069 -56934
264 -56934 -64143 74000 40742 -84232 -17389 87091 -7383 -86585 31170 77412 -56268
275 -56268 -61565 74632 36949 -85861 -9977 86828 -16388 -78884 39109 66217 -55290
286 -55290 -49479 69297 31323 -78280 -7988 81968 -16886 -76763 41078 63153 -60496
297f0496J7483J14702n1648r5229P6306P1773r3915m6314J06861J7012j13397
308e6862J6286J10547n0948r5323Q1926O8155j02227l4096J08972J014j05420
319e7976K7618R5765n3092q1399P5667O1063r4892l3768J07119Oj07381L5203
331b6067R3963o3540p0988Q2007M5157r1593j9158R4915o119r3557L1803Q6462
343F3285n8605p0244Q2181M3541r5897j1713R6905j8599q7781M3213P2209o1350
355b855n4503P4528L5153q5450j1887R1599j6385q7830M5482P3008o8324m9149
367e6613Q2157K2381q5024K732Q0965k3657p3906M2494O3521o1805m7378P7779
379B3646K3398q6534M730Q4444l2333p1569N3479N2265o5771l2278P1805J3365
$$ plain form
297 -60496 -43013 71689 20041 -75188 1118 72891 -21024 -67338 39523 56535 -56862
308 -56862 -40576 69971 19023 -76300 5626 73781 -28446 -62542 46430 47444 -57976
319 -57976 -30358 65407 12315 -69084 6583 67646 -27246 -61014 46105 46111 -61270 -26067
331 -26067 67896 4356 -66632 15375 60532 -31061 -50219 44696 38577 -54980 -23177 63285
343 63285 4680 -65564 16617 60158 -35739 -47452 49453 30854 -56927 -13714 58495 -2855
355 -2855 -57358 17170 52323 -33127 -45014 46585 30200 -57630 -12148 60860 -7464 -56613
367 -56613 25544 47925 -37099 -34367 46598 22941 -50965 -8471 55050 -6755 -54133 23646
379 23646 47044 -39490 -34760 49684 17351 -54218 -739 51526 -14245 -46523 25282 38647
391C8647p5232O265P5114k8158o8660N0599N4141o8720l0648P8564M481p6437
403d0044J9238O7197l6619n5316M9529M1751o1154k6662O9717O515p4526J7165
415b3209P0013m0933n5300N8431L4691o6200j3368O6903m981o3562K0889N8037
427D1411l6360m9846N2166L5962o5256j4632P1340r074o6382L0834N4387m5597
439a047l8670N3870K2718n8735q669O0865q024o1630K6440N5067m5519m0513N9411
452A5564K0411o4223J389O1279j9013n2437L1899M2817m1868l2770N1319J9666
464C4033n9135j852O1778j8371n5635L7557M2308m9875k4401N4396P580n3996
476b5613N592N0956j8917m7847L1829L9944m5618k7094N5953Q873n8823J1907
$$ plain form
391 38647 -36585 -30320 44794 16636 -52024 -1425 52716 -16004 -46652 31912 36393 -40044
403 -40044 -20806 46391 9772 -45544 3985 45736 -15418 -42080 27637 34152 -40374 -23209
415 -23209 46804 5871 -49429 9002 43693 -22507 -35875 31028 26047 -37515 -16626 41411
427 41411 5051 -44795 7371 43333 -21923 -36555 34785 25711 -40671 -9837 44550 -1047
439 -1047 -39717 14153 36871 -21864 -30533 30332 22308 -39322 -12882 42185 -3334 -43847 15564
452 15564 35975 -28248 -26859 34420 15407 -37030 -5131 37686 -4182 -36952 14367 34033
464 34033 -25102 -26954 34824 16453 -39182 -1625 40683 -9192 -33593 20803 28383 -25613
476 -25613 -20021 30935 12018 -35829 -4000 35944 -9674 -36768 19185 28058 -30765 -18858
488a8858N3584k7997m1855L8763K9649m4833j7622M8772N397n1393Q601N1234
500C3442k4915m4636M1025L0940n0809j2995N2977m099m9338J7196M1847k7758
512B877l4854L5562K6043m4239j4619N0892j318n1209J9402M4781l3422l1841
524c1945M2402J7623m4974m627M4021o215m2495J6725L9708k8825l2473M0734
536I659K0146m7854l690M8640j2718m2895K4876L2653l3101k3422L7063J3756
548B3113m1363l611M4152r166m2521K4053L6076l5726k2977M3196Q343m3612N061
561a4982L9330j5210l4536K2823K8980l1040k1470L8767J0647m3116L782M2853
573B6828j8343l5783K9560K4055l5508j3428L6328L279l7192N438L6129j5217
$$ plain form
488 -18858 34726 6729 -35126 3637 33286 -11547 -29169 19603 25000 -26393 -17792 33442
500 33442 8527 -36109 4916 35856 -14953 -27948 25029 20930 -28408 -11212 30635 2877
512 2877 -31977 3585 29628 -14611 -29230 21662 20344 -30865 -11463 33318 -104 -31945
524 -31945 10457 28080 -16894 -21521 22500 16285 -26210 -9485 30223 1398 -31075 9659
536 9659 29805 -18049 -21739 26901 14183 -28712 -3836 28817 -4284 -27706 9357 23113
548 23113 -18250 -21861 22291 13125 -29396 -5343 30733 -4993 -27970 15226 23569 -20043 -14982
561 -14982 24348 9138 -25398 -2575 26405 -4635 -26105 12662 23309 -19807 -16025 26828
573 26828 8485 -27298 2262 26317 -9191 -22619 13709 16988 -20204 -14766 21363 6146
585F146l3008K6341K6906l5464j4303M1468L57l9600J2477L3665k1565k6680K7054
598C794J8597l1825j1307L5267K101l7596J0052L6105k2327k8002L1800J6756
610B3415l6004n160L5181n544l2575J2679K8375j9825k4432K7455J7926l3853
622a2362o586L7652n365l4831J7606K8209k5628j8926K8974R905l0719l147L1038
635A5820n020l1247J4143K8388k3697k1004L1727J0334l4418J762L2147j1463
647G472k7193J7581K1243k2579j6173K6724R670l0667o46L2743r829k9479K0754
660c79K2403k7269j2290K9599K925k8895M090K6588j0821k4764J7079K0941k4343
673e136j4366L0289M451l1848P009K8759j5919k2081K1389J4865k4141q625K5419
$$ plain form
585 6146 -26862 -521 26385 -9079 -23382 18086 18443 -21157 -8680 24985 3420 -23260 3794
598 3794 22391 -9434 -20741 14526 16627 -20969 -10917 25188 2861 -25141 6659 23415
610 23415 -12589 -17749 17432 11888 -20687 -8008 20367 542 -23890 3565 21491 -12362
622 -12362 -18948 18704 13339 -21492 -3886 24323 -1305 -20231 8743 18648 -12071 -15218 15820
635 15820 10800 -20447 -6304 22084 -1613 -22617 9110 19444 -14974 -13212 18935 7472
647 7472 -19721 -2140 19103 -3476 -19649 7075 16745 -13922 -14568 18175 8346 -21133 -379
660 -379 22024 -5245 -17535 12064 14989 -13906 -9816 16772 5951 -18813 -1734 19207 -5136
673 -5136 -19502 10787 15238 -16610 -9601 19158 3239 -18842 2547 17412 -6729 -15354 10065
686A0065K569k6867M282K7188j2988k3898K1954J6671k7245o612K8478k584k5945
699a4932R661K1632j4591j7894J8195J3935k3095q378K7091l86k7789J0199K4389
712A8037j8295j7287K3339R061k4264j969K3285l275k2663Q675K1467j5384j7968
725a7241K1970J1314k6376k078K7037p356k3120J4281J7153j7681j1901J9523
737E525P331k1611k381K3190m341k3195J2266J9709j9522j2445K3425L850k2893
750a1092L271K0273p923j7477J1620J4957j5559j1803J9923O397k3426J604K3493
763A4258j0303j9202J6539J2667j9222o335J9638J285j9250K943J8986p746j8257
776a3999J3875J4851j9912q034K2926l67k1884P656J8035j2344j3207J4650R218
$$ plain form
686 10065 12634 -14233 -9951 17237 4249 -19649 2305 18976 -8269 -14881 13597 11013 -14932
699 -14932 -5271 16361 1770 -16124 2071 16006 -7089 -15467 11624 11238 -16551 -6352 18037
712 18037 -258 -17545 5794 14855 -9409 -11378 11907 8632 -14031 -5356 16111 727 -17241
725 -17241 4729 16043 -10333 -12411 14626 7270 -15850 -1569 15584 -2097 -13998 5525
737 5525 12856 -8755 -11136 12054 7713 -15482 -3216 16493 -3029 -15474 7951 11801 -11092
750 -11092 -7821 12452 4529 -12948 -1328 13629 -1930 -13733 6190 12587 -10839 -9235 14258
763 14258 3955 -15247 1292 13959 -5263 -11598 8040 9325 -9925 -6982 12004 4258 -13999
776 -13999 -124 14727 -5185 -13219 9707 9340 -12544 -4888 13147 803 -12404 2246 11464
789A1464j6100n970J8141J645k0061M786J9385j1946j5244J7316Q622j9407j597
802h966J8317l588j5775O782J3961r612j2539J3618R559j7796m118K0151l226
815F768j9226J0303J4741j4764q916J6051M091j5926o06J6051k948j6266P598
828c049J5251j3231j1539J8010M955j9605K357J7642p789j3724J0755J0140j2202
841b029p311J3758M572j5829m63J7204n593j5998J1640J1448j5501n367J6072
854F603jj4591L630J2748n979j1579Q636J0482j2511p495J6221J871j7496M776
868d685J5463j0127j1020J3021O316j3480k604J3321Q3j3796L077J4151p836j2737
882a0853J2735Q397j6147k436J6480l537j4007P525J0558r126p881J0318O085
$$ plain form
789 11464 -4636 -10606 7535 9180 -10881 -6095 13290 1344 -13900 3416 12038 -7369 -8966
802 -8966 9351 5763 -10012 -3230 10731 1119 -11420 2198 11757 -6039 -10157 9994 6768
815 6768 -12458 -2155 12586 -2178 -11094 4957 9048 -6878 -7484 8567 5619 -10647 -3049
828 -3049 12202 -1029 -12568 5442 10397 -9208 -6851 10791 3002 -10722 33 10173 -2029
841 -2029 -9340 4418 8990 -6839 -7302 9902 4309 -11689 -49 11399 -4102 -9469 6603
854 6603 6602 -7989 -4359 8389 2410 -9169 -533 9949 -2562 -10057 6164 8035 -9461 -4685
868 -4685 10778 651 -10369 2652 8968 -4512 -7116 6205 6288 -7508 -4431 9720 1884 -10853
882 -10853 1882 10279 -5868 -8304 8176 4639 -9368 -1843 8715 -411 -8292 2026 8111
895H111j2141l468J4143q55j4834O211J2899j1142q375J3664L084j3160R35J1771
909F843l209j0655N294J0050q208q829J1646N446j4718k08J4927n677j2246R555
923A1Q225j0963m528J1284K136j1375J83J2104l293j2341P669J0368j2050o018
937h588J4094N55j3392L928J1005o383q276P667O617q820n167J0779K494j2797
951f284J704J2573o745j0129J0208N850j1464j599J0868j105r506K958R173m771
965A731q827P853P194j1184l624J2904j454j2339N934R433q553n851R252L400
979E869r200j656R953m56j0771L698J0354p834q111J0954L682j2070Q71J0664
993E947l922q311N485O825o380n559P985M180r896j420J1191k817j0612O910P499
$$ plain form
895 8111 -4030 -7498 6645 5790 -9044 -2833 10066 -1076 -9451 4213 7297 -5863 -4928 6843
909 6843 3634 -7021 -1727 8323 115 -8714 2932 8378 -6340 -6548 8379 2702 -9544 11
923 11 8236 -2727 -7255 4029 6165 -5210 -5027 7077 3784 -8557 -888 9480 -2570 -8588
937 -8588 5506 6061 -7331 -3403 7602 1219 -7057 610 7227 -1593 -6760 4019 6513 -6284
951 -6284 -4580 7993 1248 -8881 1327 7177 -4287 -5886 4982 3877 -5629 -2671 6502 1731
965 1731 -7096 757 7951 -3233 -6857 6047 4593 -7746 -1812 7621 -932 -6783 2469 5869
979 5869 -3331 -4987 4966 4510 -6261 -2563 7791 -43 -8154 2800 6482 -5588 -4717 5947
993 5947 2025 -6286 -801 6024 -356 -5915 2070 6250 -3646 -5066 6125 3308 -7304 -394 7105
1008G105r352l718R556P24q760J274Q169k663p962M706P619p733n711J0443J709
1023E406j1350K633R759n892o992P413M407p623k514P922J316q769Q34R588m309
1038A829q728P841N719j0020j812J0020j770q435L874O600m709n551N738M875
1052E471p583l180R392j1j0026L882Q510p102n406Q462K182q062N1P367j239p158
1068d450K683P256n027o492P783L998r758k10R676l487p679N703N157o313l261
1083d421O420K207p102r48Q130j541q537M803P094p799l945R062M05q304K291
1098b185O775l454n519M253M978n598m199P445K107r024J193Q887m804o755P120
1113A220L726p473j155O989l25o492J340O553k967o670N367N324p936k467Q968
$$ plain form
1008 7105 -2247 -5965 3591 4315 -4445 -3171 4998 2335 -5627 -921 6698 -1035 -6746 3697 5406
1023 5406 -5944 -3311 6448 556 -6436 977 5384 -2239 -4753 3169 4485 -4284 -3450 6138 1829
1038 1829 -6899 942 6661 -3359 -5171 4849 3079 -5356 -1482 5118 409 -5142 596 5471
1052 5471 -2112 -5292 4100 4089 -5937 -2055 6455 -647 -6053 2409 4591 -3471 -3420 3947 2708 -4450
1068 -4450 -1767 5489 462 -6030 1753 5751 -4007 -4217 5459 1972 -5707 -4 5153 -1160 -4421
1083 -4421 1999 4206 -2896 -3844 4286 2745 -5792 -989 6105 -1694 -5639 3423 3828 -4476 -2185
1098 -2185 4590 1136 -4383 -130 4848 -750 -4949 2496 4603 -4421 -3228 5659 855 -5900 1220
1113 1220 4946 -2527 -3682 3307 2982 -3510 -2170 4383 1416 -5254 113 5437 -2499 -4966 4002
1128D002j099q060L972O058n257l824N515K680n722j899O696L32p749K289P475
1143E409n461n584P679K401q095P39O997k434n573L253M968m185m566N702L398
1158D648p620j080Q549k430p723N453N190o740k398O689O53o100N24N984j520
1173B079o215L292N925n845m266P788J056q084K071O678m034m681M810L173m881
1188a134k322N415J565o574K19P291l166o542N888M107p360j118P142j226n910
1203c725K507M976l106m546M221M160o011k698P659j93p945L332O376n609l908
1218d510O283J625n906k39N490m83n681J722O002l861n201O136L021p435n4P129
1234D038k620n522L975L748m250k752M509K250n430j082O537j054o739L814N492
$$ plain form
1128 4002 2903 -5157 -1185 4873 -384 -4208 1307 3987 -1735 -3634 3062 3394 -4355 -2066 5409
1143 5409 -52 -5636 2043 4444 -3651 -2912 4085 1651 -3922 -669 4299 114 -4452 1250 4648
1158 4648 -2972 -4052 4497 2067 -5656 -203 4987 -1753 -4151 2538 3191 -2909 -2385 3599 2079
1173 2079 -4136 -844 5081 -764 -5030 2758 3814 -4270 -2199 4479 445 -4236 574 3747 -1134
1188 -1134 -3456 1959 3524 -3050 -2831 4460 1294 -5248 640 4747 -2613 -3731 3411 2185 -3725
1203 -3725 -1218 3758 652 -3894 327 4487 -1524 -4222 3437 3244 -4701 -1369 5007 -602 -4510
1218 -4510 1773 3398 -2508 -2747 2743 2260 -3421 -1699 4303 442 -4759 1377 4398 -3037 -3091 4038
1234 4038 1418 -4104 -129 3619 -631 -3383 1126 3376 -2054 -3136 3401 2347 -4392 -578 4914
1249D914o141k922O890J03o188J512N114k365m581L130M359m444l615O282J786
1264C834p410J205P061l968n165N464K761n633j128N171J81n123O03N494k046
1279A301n496M303M382o207j908O906q94o053K801M423l669l199L791K515m334
1294a338j951N429O45o278J816O118m343m291N980J774o140L18N268j616m557
1309c166K168M224l086m038M664L074o222p63O892j917n927M129L932n029k023
1324c088M778Q00m598k30M824p41n195K484M963m497l355O059Q92o098J435M926
1340C359k797l646L118K735l486k354M227J669n303K8N981k394n133M622L158
1355C784n491r80N221o51m515J387L988j993l967L092L701m732k284O047n9o032
$$ plain form
1249 4914 -1227 -4149 2741 2844 -3344 -1832 3282 917 -3664 -534 3825 -619 -4234 2048 3834
1264 3834 -3576 -2371 4690 722 -4443 1021 3782 -1851 -2979 2192 2373 -2750 -2147 3347 1301
1279 1301 -4195 108 4490 -1717 -3625 3281 2387 -3666 -865 3558 -111 -3310 481 2996 -1338
1294 -1338 -3289 2140 2785 -3493 -1677 4441 98 -4193 1787 3561 -2579 -2261 3007 1391 -3166
1309 -3166 -998 3226 140 -3898 766 3840 -2382 -3145 3747 1830 -4097 32 3964 -1065 -3088
1324 -3088 1690 2490 -2108 -2338 2486 1745 -3450 -966 3997 -500 -3855 2204 3096 -3002 -1567 3359
1340 3359 562 -3084 34 2769 -717 -3071 1156 2825 -2478 -2450 3531 1137 -3996 626 3784
1355 3784 -1707 -2687 2534 1883 -2632 -1245 2743 750 -3217 -125 3576 -1156 -3440 2607 2548 -3484
1371c484K457M772m012k976M313J458m097p72M060K47m562R48M964k811m195M718
1387A028K409n595j04N215j727m049K517K937k758k526L205K224m222j225N254
1402B583o68n324K888M165m513k238M912K96m375O76L779j162l668J931L753l195
1418a60l103M790J534n612P80N188k803l751L650K128l702j259L578P48l886j4
1434a894M450j320m493L254L459m778j462N068o04m347J769L268k239k606K509
1449C4K411l115j931M297P93m997J279M664l209l251M165J382m215j21L588n83
1465A191l355R97L508j878l462L406K633m698p57N094j315m347K797K864l298
1480f20j720L177J134l267p06L899j49m320J870M061l575k644M604O35m553R09
$$ plain form
1371 -3484 -1027 3745 -267 -3243 1070 2528 -1569 -2341 1719 1966 -2596 -1648 3316 505 -3690 1028
1387 1028 3437 -2158 -2262 2953 1226 -2823 -306 2631 -127 -2653 552 2776 -1446 -2671 2583
1402 2583 1915 -3409 -521 3644 -869 -3107 1805 2101 -2274 -1598 2181 1019 -2649 -718 3035 -160
1418 -160 -3263 1527 3061 -2551 -1771 3417 614 -3137 513 2641 -1061 -2320 1258 2006 -1880 -1894
1434 -1894 2556 1236 -3257 -3 3456 -1322 -2784 2284 1680 -2667 -898 2370 131 -2475 34
1449 34 2445 -670 -2601 1696 2489 -2508 -1229 3435 226 -3025 1140 2522 -1693 -1814 1774 1191
1465 1191 -2164 -1167 2341 463 -2999 407 3040 -1658 -2415 2679 1364 -2983 -186 2678 -620
1480 -620 -2340 837 1971 -1296 -2002 1897 1748 -2572 -702 3359 -216 -2860 1744 2379 -2174 -1265
1496a265L565j796k812J925K432k351k304L317J667m230j09M686j757l916L330
1511C82K359l852q69L478m6l135M15L157r86l331K137L197l543j967M628P9m582
1528b479J720L469k754k333K865J415k953j052L215O00l841O25M240k306l404
1543b973L859J850m326q0L875j157l075J584K418j804k361K363K170l400j191
1558b248M251m17m165K163L143l252j686L330M54k994J4K776l48l038J115L246
1574B344k356k653L763J336m338N73L941k009k820K524J797k619j347K706R79
1589A821l284l01L874j073l827K742K795l849j103L921l73l297J137K586j407
1604C62k291J703K314k469j887L544P58m049R77L643k400k443L017J122k909l76
$$ plain form
1496 -1265 2300 504 -2308 -383 2049 -302 -2606 711 2378 -1852 -1961 2725 968 -2948 382
1511 382 2741 -1111 -1980 1498 1452 -1683 -1268 1889 903 -2428 -291 2906 -637 -2604 2024 2103 -2479
1528 -2479 -759 2710 -44 -2377 488 1903 -1050 -2102 1113 1713 -2128 -1503 2737 431 -2973
1543 -2973 886 2736 -1590 -1670 2205 1048 -2027 -443 1975 171 -2190 173 2343 -1057 -2248
1558 -2248 2003 1586 -2579 -416 2727 -525 -2211 1119 1573 -1421 -1407 1369 1021 -2017 -902 2344
1574 2344 -12 -2665 1098 2434 -1904 -1331 2610 601 -2219 305 2102 -517 -1864 842 1821
1589 1821 -1463 -1764 2110 1037 -2790 -48 2747 -1102 -2205 1716 1343 -1954 -817 1769 362
1604 362 -1929 -226 2088 -381 -2268 1276 2034 -2015 -1038 2605 205 -2238 779 1901 -1008 -1384
1620a384K605jk701L64L065j389l062K753K201l861o22M060j034l357K088K339
1636B064k391j566K461J290k750q75L458j00l846J631L392l073k144L731N40l548
1652a726O04K835j086k350J256K338j785k254K738J541l614k19L818j379l151
1667b434K521J900k758q36K569M36k472o6K825n76l071J695K815l090j756L851
1683A553L4l757J329K852k007k038K217J577k376j237K916P19l549M52L723k039
1699C69k964L177J545l465k09L101n64k492R31K321j154k353J893K148k975j257
1715a948L574k91l545J598K602k407j527K477Q22k302m54K524J33k887P54L119
1731B242k086k538L246J190l703L11L320j366k490J847J905j965j581K346J321
$$ plain form
1620 -1384 1221 1220 -1481 -1117 1948 559 -2503 250 2451 -1410 -2032 2028 994 -2363 -275 2064
1636 2064 -327 -1893 568 1858 -892 -1767 1691 1591 -2255 -624 2768 -305 -2449 1282 1822 -1726
1652 -1726 -1122 1713 627 -1723 -467 1871 86 -2168 570 2111 -1503 -1722 2096 717 -2434
1667 -2434 87 1987 -771 -1607 962 1398 -1074 -1140 1685 1109 -1962 -267 2548 -542 -2298 1553
1683 1553 1587 -2170 -841 2011 4 -2034 183 1760 -616 -1853 1063 1782 -1767 -1315 2408 369
1699 369 -2595 582 2127 -1338 -1547 1554 990 -1502 -571 1750 596 -1757 136 2284 -691 -1948
1715 -1948 1626 1335 -2210 -612 1990 -417 -1944 533 1355 -947 -1401 1123 1256 -1631 -877 2242
1731 2242 156 -2382 864 2054 -1649 -1338 1982 616 -1874 -27 1878 -87 -1668 678 1999
1746A999l070n54L537q58l482K183K458l090j154L127P7k649M79K368o51k324
1762a604J177K447k091j993L060Q61l519N82L130j731k167K185J332k150q62K205
1778H62O00k606q2L005j064l025K336K125l309p59L404n06k854J333K236j561
1794A35j789J813J702k372j276L136K57l508J108L096k325k024K875Q35k701q3
1810a121K355k40k314N16K445j302k443K271J738l144m93L330q22k707J727J894
1826A690j899j222J966R97k218o80K711p3l091J294K784k532j760L178M38l046
1842a463N98K480j083k067J286J888j775j788K437J166l182l6L354j307k685K330
1858A53J683k499o92K372K44k202L2K332n25k573J382K346k495j474L139J61l011
$$ plain form
1746 1999 -1071 -1625 1912 1054 -2428 -245 2213 -877 -2031 1096 1173 -1476 -997 1371 720 -1604
1762 -1604 -427 2020 -71 -2064 996 1857 -1662 -1080 2050 319 -1848 337 1669 -481 -1343 862
1778 862 1462 -1144 -1226 1779 715 -2310 26 2151 -1158 -1917 1487 981 -1873 -540 1696 135
1794 135 -1654 159 1861 -511 -1787 1349 1606 -1902 -794 2302 -23 -2047 828 1663 -1038 -1121
1810 -1121 1234 994 -1320 -804 1641 339 -2104 167 1905 -1239 -1732 1598 776 -1931 -204 1690
1826 1690 -209 -1431 535 1532 -686 -1366 1345 1272 -1819 -525 2259 -273 -2033 1145 1583 -1463
1842 -1463 -865 1615 532 -1535 -249 1639 -136 -1924 513 1679 -1503 -1539 1815 508 -2177 153
1858 153 1836 -663 -1355 1017 1261 -941 -909 1423 898 -1675 -293 2053 -442 -1916 1223 1384 -1627
1875a627R49K396j526j720J693J265j829j136K216O95k878K43L065j534k471K568
1891C69J445k872k19K679m64k179P92J995j087k040J659J800k571j069L132j84
1907A186l075J382K374k089j399K191P31k047m26K109J33k468N09K616j559k223
1923b055K582J198k966P2K727r06k055J312J579j411j441J729J214k369o69K858
1939A399m45k908J643K191k452j085K579J90k246K94K020n24k034R39K089j713
1955f3j777K586Q46l011M11K751j391j954J848J230j857p87J852N55k139k09K482
1972A373o63k571J711J937k547q46K734j90k328Q69J814j037j535J248J501j750
1988b80j245K402M79k829O41K619j709j787K258Q41k191j61J953j09j910L56K046
$$ plain form
1875 -1627 -678 1718 192 -1528 165 1430 -399 -1535 681 1376 -1502 -1259 1806 272 -2199 369
1891 369 1814 -1058 -1277 1402 938 -1241 -449 1546 459 -1581 78 1878 -693 -1762 1370 1186
1907 1186 -1889 -507 1867 -222 -1621 570 1301 -746 -1172 937 1070 -1398 -889 1727 168 -2055
1923 -2055 527 1725 -1241 -1169 1558 652 -1403 -91 1488 77 -1364 365 1579 -790 -1459 1399
1939 1399 954 -1954 -311 1880 -572 -1657 922 1112 -1134 -840 1180 656 -1378 -439 1650 -63
1955 -63 -1840 746 1592 -1419 -1008 1743 352 -1602 246 1476 -381 -1168 684 1239 -900 -1109 1373
1972 1373 710 -1861 -150 1787 -760 -1606 1128 938 -1390 -521 1293 256 -1279 -31 1470 -280
1988 -280 -1525 877 1356 -1473 -832 1787 78 -1709 549 1390 -801 -962 991 882 -1028 -672 1374
2005A374r81k101J816J555k612n28K814o13k323J387J648j577j059J622Q32j756
2021e02o49K150N7k518Q42K333j890j589K472N35k386L43K010o99j623Q82J543
2038A311j188j542J777J125k484k76K692q88k261J753J444j959o32J905K56j732
2054f99m0J856l34k137J023J950j995j304K538J96k503P59K023j256j337J416
2070A56J047j411r01J739O10k248O5K419j120k084J951J233k288k46K132l29j678
2087i53N84J547p48j599J179J445j919r84K397m0k483J031J922j642j081J763
2103D19N94j567k94J652J33j885L49K051j203j812J998R49k389L2K181p75j620
2120a187J080J224j128j036J317R38j778n83K205k94k298J233J740j891q78K026
$$ plain form
2005 1374 393 -1708 108 1663 -949 -1477 1337 724 -1599 -212 1436 -141 -1200 422 1254 -502
2021 -502 -1151 999 1056 -1462 -620 1713 -177 -1766 706 1241 -1145 -802 1208 509 -1114 -232 1311
2038 1311 123 -1419 358 1483 -1001 -1277 1415 527 -1734 19 1463 -496 -1128 777 1033 -699
2054 -699 -739 1117 783 -1354 -331 1619 -376 -1680 858 1054 -1449 -690 1333 77 -1260 156
2070 156 1203 -208 -1109 630 1240 -1008 -943 1476 356 -1728 223 1456 -832 -1078 1054 725 -953
2087 -953 -369 1178 430 -1169 10 1455 -464 -1448 949 909 -1574 -543 1379 -263 -1344 419
2103 419 1013 -554 -848 804 937 -948 -599 1452 249 -1563 435 1384 -1005 -973 1208 433 -1187
2120 -1187 -107 1117 -11 -1047 270 1208 -570 -1153 1052 758 -1540 -307 1433 -458 -1336 690
2136F90J60j729K76J518l58j494O69J596j258j410J943P04k362K50K137j081j560
2153a309J459Q91j435n53J384M24j584j61J882m41j986J327J517j975o65K143
2169I18j70j811P09J384q28j131R51J119j277r73J821M07k166M38K031j311j449
2186a338J747O14j724j01J436j11j405K61J532o65j562J339J273j948m43K177
2202A082m37j821J076J242j238p85J196O21j300n01J589J39j894N91J831j407
2218a6j271J874M04j854K24J466n56j229O17J142q19j163J313R70j817k37K089
2235A137n91j764J308J125j539n08J415J40j291l2J365k09j551P32J532j422j063
2252a216J941K16j959N18J531r81j052R91P69j031o97J256N75j609m1J888o79
$$ plain form
2136 690 850 -879 -603 915 557 -937 -268 1328 70 -1340 603 1307 -1055 -805 1332 251 -1309
2153 -1309 150 1041 -394 -947 437 861 -723 -884 998 557 -1429 -102 1415 -560 -1225 918
2169 918 748 -1063 -354 1030 202 -929 22 1141 -136 -1109 712 1119 -1047 -609 1422 111 -1338
2186 -1338 409 1023 -701 -802 634 523 -882 -621 911 246 -1316 23 1296 -652 -1095 1082
2202 1082 645 -1176 -100 1142 -96 -881 315 936 -364 -865 724 863 -1031 -440 1391 -16
2218 -16 -1287 587 991 -863 -639 827 271 -958 -341 801 -18 -1181 132 1102 -715 -952 1137
2235 1137 546 -1218 90 1215 -324 -832 583 723 -568 -600 765 556 -995 -263 1269 -153 -1216
2252 -1216 725 941 -1018 -500 1031 50 -1002 -11 758 -273 -970 286 861 -748 -789 1099 420
2269D20j639J429J025j713k82J554k10j291L54J124m85j215P90J209j351q39J860
2286G40P8j919P21J506j238r10J311M23j211k43J204J39j384K24J619q23j413
2303a176J543Q34j855j1J689n79j319P97R12q43q29R13P80j269n59J683m5j802
2321a136Q29J447j372q07J509K10j325J00J131j82j149L77J312q30j188J441P25
2338A092j801P9J720p81j272J132P05j114m61J038L39j203j81J444k94j569R62
2355a65J267j526o02J704j02j445N45J083o29q78O80Q93q98q36J341M85j686J85
2373e84J681r08j215J298O06j311j68J110Qj082Q4J193l86j325R40J093j512m82
2391i60J732k71j504Q41J009r67o11R58M72r87l78J215J33j507M38J487j125j045
$$ plain form
2269 420 -1219 210 1235 -478 -760 794 584 -707 -353 771 286 -929 -139 1070 -281 -1120 740
2286 740 818 -1101 -380 1126 -112 -1022 289 712 -499 -742 462 601 -783 -559 1060 237 -1176
2303 -1176 367 1201 -654 -665 1024 445 -874 -77 835 -8 -837 76 856 -413 -972 711 666 -1136
2321 -1136 -307 1140 -232 -1039 470 680 -645 -545 586 404 -745 -368 944 114 -1074 367 1092
2338 1092 -709 -630 1090 309 -963 169 874 -240 -701 337 676 -527 -708 736 442 -1127 -165
2355 -165 1102 -424 -1026 678 576 -869 -324 759 130 -748 -68 825 -73 -909 432 917 -769 -584
2373 -584 1097 189 -1026 272 878 -433 -601 509 517 -565 -481 712 326 -999 -59 1034 -478 -960
2391 -960 772 501 -1003 -162 847 -120 -731 227 699 -288 -666 549 682 -825 -387 1100 -25 -1070
2409a070J513L64j505K00J230m62r65N04Q98n97r66R48Q42j432l55J676l54j511
2427a042R52J024j197m74J126K15j017j02J089m7j288M66J315j099r58J560K44
2444G67j619M28J279q08q45Q78N92q53n15J007M10j323l5J515o10j352J207Q20
2462I43j461j88J345k01j064L52R36l93r80O07J011j069p68J492J86j617M84J324
2480I39r51q33J069M29r89k49R68J71j147Q8J331o19j242J209P64j541q6J477
2498G88m98j097P39P55p25o14P98N94j065l92J403j05j490P22J202j224o66J369
2516D94R3j158J64R56k25r24L16J061o76j009J147O51j534k3J489o04j117Q96
2534cO84r09m15Q75L42r52k02J213j52j332P48J119j273n56J440q1j273M83R12
$$ plain form
2409 -1070 443 807 -698 -498 732 270 -695 -191 707 110 -856 92 934 -498 -853 823 469 -1042
2427 -1042 -90 934 -263 -737 389 604 -413 -515 574 527 -761 -295 1020 -79 -1037 523 767
2444 767 -852 -424 855 47 -798 80 672 -181 -696 311 721 -602 -637 878 268 -1084 123 943
2462 943 -518 -706 639 438 -626 -274 662 269 -711 -104 907 -162 -930 562 748 -869 -385 939
2480 939 -12 -845 224 653 -336 -585 383 554 -593 -505 826 207 -1035 174 938 -603 -689 788
2498 788 290 -807 -68 687 -38 -652 146 740 -325 -717 686 581 -909 -187 1015 -209 -875 494
2516 494 587 -571 -407 549 324 -600 -284 777 101 -908 239 890 -644 -667 822 218 -899 -3
2534 -3 681 -228 -643 232 574 -378 -580 633 481 -851 -103 1016 -257 -813 627 546 -727 -244 668
2553F68n94p13O11O96p74o41J134L44j414K02J398q15j042J146M85j157j13R68
2571C89l4q79J09J008k78j099P62R96j230n00J460j53j315N91R11p86o09P58M48
2590E49p92l87J009K15j240K66J298q60r47J229L75j299J22J043m04q02M57P10
2608E42n07p28Q17O66j149k57J393l12j266Q09Q24j050m06R27J30q53q2Q80j1
2627C67j040L54J127q06q71J262L34j345K34J098n68p89O39N51o48m94P68M61
2645F34j031j50J290l69j172Q88P72j173k69J093j55r05K60P13l14p67M85Q15
2663F45q13o28J210K11j317L96J103p88o91Q87L42q02k24P67J84r01pJ094l86
2682B82j066R16P29j225j85J179k92r48M73O59n36n76N51N84q03m42J117Q6j235
$$ plain form
2553 668 74 -639 -28 668 -106 -747 387 731 -683 -481 917 102 -940 206 691 -466 -579 389
2571 389 355 -524 -415 593 315 -784 -22 974 -256 -756 704 551 -764 -173 738 -48 -657 101 549
2590 549 -243 -630 379 594 -646 -380 918 58 -889 340 715 -584 -462 581 177 -625 -168 542
2608 542 35 -693 124 790 -359 -616 777 465 -801 8 832 -218 -624 303 433 -420 -502 378 367
2627 367 -673 -319 808 2 -869 393 727 -618 -384 714 146 -643 -4 547 -101 -595 173 634
2645 634 -397 -547 743 374 -798 90 862 -311 -580 513 358 -547 -287 426 112 -655 -170 645
2663 645 -168 -796 414 625 -692 -296 807 19 -672 215 557 -245 -469 298 482 -419 -426 668 282
2682 282 -784 132 861 -364 -549 630 338 -610 -137 522 -14 -590 -39 545 -258 -700 417 503 -732
2701g32M66J080q95o20J046J92r49P7P80j54p41K26Q37m87q32Q87N78j214o7J228
2721G06m40r52P04N71p59l43O68K87p75k05R41k2j097N20R88r54n45J160O2j028
2741e13K80P77l96o18M04O10n52o24Q48M16j131L1J181n36r25Q79M92r32j52P98
2761C37rp17L3P96j90r01N38Q45r44m58J185m4j094M85P87o51m73N97L60o17l51
2782d86P71K06j001J25J058n83q66R78L95j039L3Q74k43o84K87O22l52o56N65
2801DO40q88l58J146j29j074N86P73q00m09P89J65o96j06P13Lq42K06R20o18p53
2822g28R74L35j105J43R37m70o39N52M39n26l90O15L58p97j71J016k30r76O71
2841HO77r22k68R17p6p32J93O18k27o32L28O99o22n94R48K43j111K34R57n95o37
$$ plain form
2701 -732 -266 814 -81 -701 345 537 -412 -335 445 291 -450 -224 613 126 -706 181 759 -455 -522 706
2721 706 266 -686 18 589 -170 -513 155 442 -333 -538 403 381 -716 -196 792 -162 -707 453 515 -513
2741 -513 -233 544 148 -470 -66 544 -8 -632 216 632 -499 -468 713 177 -748 131 623 -309 -461 337
2761 337 328 -389 -356 440 250 -651 -113 732 -212 -670 515 471 -623 -138 649 -2 -475 122 482 -135 -486
2782 -486 285 491 -510 -385 673 90 -776 202 597 -442 -409 465 222 -462 -175 447 95 -561 4
2801 4 644 -244 -602 544 415 -659 -73 700 -100 -509 280 445 -251 -357 356 359 -483 -277 643 25 -728
2822 -728 246 581 -524 -381 556 86 -553 -1 438 -88 -478 137 495 -302 -473 543 313 -663 8
2841 8 685 -237 -505 412 336 -396 -203 415 188 -444 -116 583 -39 -633 315 558 -553 -319 638 43 -594
2862e94P08L24o54j94O24J58p09m0Q80k67q77O68O52r89j98J004k23p79M12N52
2882D58m36m55M55M38n92l64Q40J05j000L38Q77p07n58Q73J61p88P1O21j14o02
2902c79J61O89l53p06O77N26r59j28J013l04q10N63N00n96k98N37K47n97k03P47
2922C27K6q88L57Q14p08n02R36O6q58K30O45l44m83L41M51m27m61O19L49q58k3
2943c91R49m07p46O98M08p55j11O41k3n64M0O03j22p24L82O98p27m34R48K6q93
2964e04L38O64m89m22M89L10m80k97N75K23p80K3Q81m32p10P52L62q24QP16k14
2985A89n31K64M55k94m85M02M86o80k98Q71p8q54M56O17o33k99O19J06n36m0N12
3006B49J3o28J27P25m41o43P64L27q69O7P80l23n49M13L90l92l50M33L48o41k06
$$ plain form
2862 -594 114 438 -216 -410 214 372 -337 -377 503 236 -641 27 679 -310 -508 496 273 -506 -94 458
2882 458 22 -433 22 460 -132 -496 344 449 -551 -213 664 -43 -601 272 433 -355 -284 337 223 -379
2902 -379 -218 471 118 -588 89 615 -344 -472 541 237 -573 -10 490 -106 -404 133 380 -217 -420 327
2922 327 353 -535 -178 636 -72 -574 362 428 -430 -200 445 101 -382 -41 410 -17 -478 141 490 -368 -391
2943 -391 558 151 -595 103 511 -244 -355 286 263 -301 -261 342 220 -504 -122 576 -151 -585 363 389 -504
2964 -504 -166 498 9 -413 76 386 -94 -391 184 407 -373 -350 531 99 -611 141 503 -321 -313 403 189
2985 189 -342 -78 377 83 -402 0 486 -194 -492 379 301 -553 -97 520 -113 -412 207 313 -223 -263 249
3006 249 262 -366 -239 486 45 -598 166 493 -376 -309 471 148 -401 12 402 10 -340 93 441 -200 -406
3027d06Q08j15q38M87O10p34k63P52m1n93J51M78j63m88K21N44m35m78O89K33
3047D19q52J66P79m62n04N84K52n27j26M81J11n39o3O67j58p46N10N54p66k25
3067d45Q10j10o74L05M76l19l95L23M20m71l92O87J77q48J86P94n23n12P00K01
3087C90o43J1N14n5m93J06N39k48n87M93M79p73j56Q48k20o77M59M30m91k58M66
3108A34J83m64j98N91P0p46K17P34n58m90P58J60p33J31N82k25m56K37M29l08
3128D8m79M92L92p47j30Q51k47p24N40M64o29j57N68L2m87j3N28o4o15K47O22
3149D92n73m14P78P8p70K45O10l96l85M18K71l97k76M57K14o44m4P47k89o64N79
3170C7M19p18p8O47j01m99J67M48j88m87K98N11n50l75P73L8q01L00O53n22l52
$$ plain form
3027 -406 402 287 -551 -64 546 -188 -451 301 260 -333 -182 296 133 -355 -134 410 -25 -503 186 419
3047 419 -433 -267 512 50 -454 130 382 -145 -271 210 321 -218 -281 386 228 -518 -8 546 -220 -445
3067 -445 365 255 -419 -114 362 43 -352 -29 391 -80 -472 215 392 -456 -270 524 1 -511 189 390
3087 390 -253 -242 272 217 -276 -170 369 121 -466 27 506 -267 -423 425 205 -472 -13 417 -74 -332 134
3108 134 317 -147 -345 246 316 -430 -213 521 -37 -527 231 391 -342 -211 371 146 -310 -73 356 48
3128 48 -431 61 453 -294 -424 427 180 -544 -4 460 -169 -326 242 274 -213 -226 302 238 -377 -130 492
3149 492 -81 -495 283 361 -409 -164 446 50 -335 83 354 -43 -319 138 352 -292 -336 411 122 -542 37
3170 37 456 -262 -340 307 206 -293 -126 322 134 -353 -55 456 -94 -469 304 342 -459 -159 494 -28 -380
3191c80N45J73m78j01M61P1n77N1O53l31o00O02L48p67jP06k62m89L55L52l47
3212a6k83L60L08n11k21O71k2p43L48N97o00l09O69N5n57R4M59j08m67J57N16
3233C97l52n12O03K85p77N2P32l47n12M98K90m70j69M38J22m59r3N85j11o48L78
3254g0N32o47k28P18p1n96K75M18k78l26K88L20l73l20N32J74p03J16O95m34m83
3275d61O13K06n80j7M94n6m28O4M86j90n34M08M49o60j93P60j38o61L89M23m35
3296f1k39M03J80m11j64M96N5o13J72O12m44m31O49J24o46J50M90k35l53K48L11
3317B93k55l53M05K87n86j11P00k16o11M69L92n71j39N15%m31K7M37p8n09K23
3338a12N27m89l82O94O6o94K36N51m01l31M10K03l57j88M19J44n42J6O21k67n55
$$ plain form
3191 -380 165 338 -140 -241 220 291 -286 -235 418 87 -513 89 437 -330 -331 375 113 -376 -21 331 -16
3212 -16 -299 61 369 -142 -363 308 286 -457 -109 488 -112 -421 248 303 -254 -160 299 191 -276 -119 397
3233 397 45 -467 136 421 -356 -304 428 81 -431 67 357 -113 -282 156 278 -181 -274 311 200 -448 -70
3254 -70 462 -185 -413 305 234 -362 -87 331 53 -273 15 335 -38 -358 174 348 -355 -239 456 22 -461
3275 -461 152 358 -222 -239 255 199 -229 -165 321 131 -403 5 454 -206 -399 361 223 -438 -49 374 -61
3296 -61 -300 103 283 -128 -292 204 259 -354 -182 430 -14 -445 204 328 -318 -168 322 87 -266 -18 293
3317 293 38 -315 90 377 -209 -320 380 164 -447 22 414 -157 -296 219 219 -212 -185 252 174 -335 -112
3338 -112 415 -74 -456 238 304 -390 -154 397 -4 -335 75 278 -79 -267 152 296 -246 -230 391 124 -431
3359d31N27L27o41l1N67j65m31K22L42k33l59K87L60m51k75O47Mo80L00N35n00
3380g9k95N43P5m45k0M27nm70R9N44l13m93N59K82o93K0O59k84m61L74K84l46
3402c8k37L80J81m38j36N82q5o21L59M98n85k23O21m2n07J72L73j85l53K17L77
3423C10l42l45N30J90o78J07O49l74m51N04K19m81p4M21M1m34J4N03j59n48M04
3444FM34o14j83O89j20n74L03L83l43k68L36K14l61j95M92Q5o27J76N89m39l95
3465d12N94J10n72R2M50j61l63J63L70k28l88M05L15n95r0O72j91n74M15L63m95
3486a20j68M48O7m06k8M42l7n28K30N23m82l44O41O0o37J80M90l23l22L26K51
3507B63l40k16M11J82n49mO29k78n37N19K91n88m9N15r1m14J34L78j79l96L09
$$ plain form
3359 -431 96 423 -218 -249 318 153 -278 -56 286 53 -306 -19 341 -110 -385 262 266 -414 -114 421 -79
3380 -79 -374 169 244 -201 -221 206 201 -269 -170 374 61 -432 127 409 -284 -264 395 111 -350 24 308 -38
3402 -38 -275 105 286 -152 -288 294 209 -412 -53 445 -140 -363 258 216 -291 -119 254 69 -284 -67 310
3423 310 -32 -377 153 343 -335 -228 421 47 -404 100 319 -162 -236 185 226 -208 -194 309 150 -398 6
3444 6 440 -174 -357 332 212 -362 -59 324 -19 -287 49 263 -98 -293 199 284 -343 -167 422 -17 -412
3465 -412 182 292 -280 -188 262 101 -262 -99 271 43 -345 60 375 -220 -310 362 171 -403 12 375 -120
3486 -120 -288 160 227 -179 -207 235 198 -330 -100 423 -59 -403 238 298 -339 -159 331 8 -314 12 263
3507 263 -77 -293 118 300 -249 -253 376 98 -439 80 371 -217 -266 249 158 -256 -122 256 77 -319 -10
3528a0L93n04k37O62k4o54K87N09m75k84M70J16m29o4M30K1m98J18N30l11m77
3549d31N59K41o58M3N90k64m32L36K86l25k40L80K28m91j17O15r2o33L82M63n63
3570a23k15N90k1n01J14M16j46m18K34M24l81l67N80J66o92J25O24l90m20M76
3590G5K12m67q7M22O8m62J8N49j92n43M38M05o18j54O50j13n58K82L99l26l09
3611c11L54K66m17k25N73N6o57K15O10m71m10N93J35n72L6M78j21m40J82M52k83
3632D3m39M89L20o61o9P00k44n52M01L68m88k00M67J05m48m7N29o8n82K95N36
3653D55n35l12O59K8o45K00M88k96l74L30L25l76k92M99K10o44L2O83l23n67N30
3674G5L16o27r0N55o0m72J15M81j95m93L80M36n68k48P07l8o85K99N13m57l08
$$ plain form
3528 -10 383 -121 -358 304 280 -374 -87 422 -53 -337 133 249 -180 -244 186 207 -291 -173 357 46 -431
3549 -431 128 369 -289 -246 344 80 -352 -16 270 -55 -295 85 313 -178 -295 320 228 -405 -23 440 -123
3570 -123 -338 252 231 -270 -156 260 114 -304 -70 354 -27 -394 186 352 -340 -215 409 19 -401 75
3590 75 287 -180 -267 155 223 -239 -221 328 136 -407 31 436 -182 -336 314 201 -357 -75 324 -2 -311
3611 -311 43 309 -108 -333 240 296 -361 -146 464 -7 -417 176 311 -261 -225 253 132 -308 -126 326 43
3632 43 -396 93 413 -248 -317 383 139 -413 -12 356 -132 -332 135 240 -208 -255 274 206 -376 -81 455
3653 455 -80 -392 267 295 -350 -150 338 42 -332 -2 323 -53 -345 154 364 -280 -248 435 112 -455 75
3674 75 391 -236 -326 229 169 -303 -188 293 98 -395 -15 421 -147 -395 312 274 -411 -112 401 -56 -364
3695c64M74J79m43j19M92N2n61J25O07l84m90N93K36o83J0O05k16m79K78L89l27
3716b6l51M39K94n56j42O86j16o79M04M95n76k55N82O6n33N8M92j05n05K47N21
3737D40m47m13O42J67p24J24O18l41m67M41K80m46j90M60J50n44mO24k03o21M72
3758A8M30o43j77O66q6n65K16M48k57l96L40L85m71k88O30R3p18J83O43m52m43
3779d44N72K14n69n5N26m2m93J21N52k88n25N12L73o88j07P17j95n97L73M07m33
3800f9k69M33K08m81j45O13m9o61K82N95n37l67O66R6o46J06N32j99m50K70M38
3821C66l63l95N48K51o82j0P22k73o20M91L76n56j87N44N7n22J2N51j47n84L52
3842f9N19n78l16P13J9o92K26N55l60m06M16L01m48k23N35J33o43Q3O70l57n42
$$ plain form
3695 -364 110 289 -154 -273 219 271 -290 -165 442 58 -432 161 397 -286 -276 329 113 -366 -88 301 -26
3716 -26 -377 62 356 -200 -342 344 228 -451 -47 448 -128 -383 199 265 -268 -210 282 177 -328 -81 440
3737 440 -7 -420 222 389 -335 -211 407 66 -401 40 320 -126 -316 144 294 -250 -254 370 167 -454 18
3758 18 448 -195 -372 294 208 -357 -141 307 50 -346 -6 379 -92 -380 250 343 -375 -192 451 -1 -444
3779 -444 128 342 -227 -282 244 202 -291 -170 382 94 -431 81 454 -234 -341 376 181 -416 -43 364 -69
3800 -69 -338 95 303 -178 -323 290 241 -420 -138 457 -80 -447 219 315 -331 -225 307 108 -342 -72 366
3821 366 3 -392 156 407 -275 -285 437 164 -456 35 411 -145 -332 212 269 -253 -241 310 163 -421 -69
3842 -69 450 -128 -444 269 288 -404 -178 377 17 -389 27 328 -120 -343 192 325 -318 -235 435 78 -464
3863d64N85K99o65m3O02j16n07J86M67k83m49M06L91o00k06P29q3p03L50N27m96
3884g3l17N33J63n29p4N50j8n95J90O10m21m94O41K36p25M1O68k57n18L57L94
3905C62m15l14M86K50o13r0P13j75o68M31N01o03k45O42K1n71J07N11j90m97L01
3926e6M67m72l73O52J43p44J35O71l79m89N03K97n29j56N38O9n60L9O21k50n93
3947d66M96M41o76j75P20p9o37K72M85l45l92L93L48n03k63O57L9p29K36O52m96
3968b2m39O00K14o09l5N65q9n18J73N21l27m89N36L50p03o9P25j99o18M09M41
3989D17m86k66M86J94n50r4O06n9o66L11N83n48m00O90J25o89J28N84k57m67L12
4010d6M18m25l57N69K20o93PP21k88n95N10L78n85j65N77J6n41P8N47k11n32L64
$$ plain form
3863 -464 121 420 -245 -288 314 198 -309 -123 344 61 -388 18 409 -191 -397 332 249 -454 -104 423 -73
3884 -73 -390 143 306 -223 -297 253 235 -360 -170 440 19 -475 166 402 -323 -282 386 129 -389 -32 362
3905 362 -53 -367 119 369 -244 -334 379 204 -464 -33 468 -135 -380 262 283 -288 -181 330 140 -357 -56
3926 -56 411 -61 -434 218 361 -383 -248 423 44 -445 58 355 -174 -330 208 277 -283 -244 377 127 -466
3947 -466 30 471 -205 -380 340 261 -376 -104 381 36 -356 37 385 -118 -381 276 315 -414 -178 474 -22
3968 -22 -461 139 353 -256 -291 274 185 -333 -160 361 34 -455 81 431 -272 -341 384 185 -433 -24 417
3989 417 -69 -335 151 345 -205 -299 307 248 -418 -107 476 -72 -472 218 343 -346 -218 366 109 -358 -46
4010 -46 372 -53 -410 159 379 -314 -307 414 126 -469 41 419 -166 -331 246 262 -279 -201 346 135 -397 -33
4032c3M83n88k88P29mo97K51N66l88l95M51K95n06k13N67Q7o58J04O72l76n48
4053d89N92L12o73o1O43j15n54K29M78l16m40M34L51o03j82P16q2o96L56N35n10
4074g5l11N65J45n38l7N39n6n69K09N60m27m57O17K33p17N0O49k74n00L88L64
4095C58m19l00M79K22n99p3O76j78o54M29N01o04k47O62K9n84J16N34k19m77L20
4116b8M34m63l57O30J35p16J45O44l70m66N01K66n09j33N06L8n36O1N72k48n51
4137d45M68L84o21j63O93j00n89K71M63l44l69M18K92n03k14O14K9o79K13O30
4157D48m72m25O05K17o08j8N60j11n04J97M79l28m49N02L12o63o2O83j91n87L87
4178b8M17m72k48M77J42n10n2N59q9n87K78N31m92l62O35J10o43J27N63k58m47
$$ plain form
4032 -33 450 -138 -426 303 299 -398 -147 419 31 -364 87 382 -124 -337 230 317 -341 -237 435 59 -489
4053 -489 103 415 -258 -319 324 209 -345 -116 362 46 -394 40 391 -212 -394 322 240 -456 -100 435 -75
4074 -75 -386 179 324 -214 -251 288 232 -337 -128 432 5 -452 165 398 -319 -269 380 106 -394 -6 358
4095 358 -61 -361 118 340 -259 -332 344 166 -488 -59 442 -162 -409 253 282 -302 -186 348 129 -348 -28
4116 -28 406 -57 -414 216 351 -365 -220 424 54 -412 89 355 -154 -287 219 257 -279 -218 354 106 -445
4137 -445 23 407 -214 -377 316 216 -373 -102 361 17 -352 66 358 -145 -359 255 284 -395 -182 448
4157 448 -24 -449 156 373 -235 -253 307 196 -308 -111 368 40 -409 93 405 -258 -320 363 172 -415 -28
4178 -28 389 -83 -331 146 288 -222 -274 285 196 -391 -113 418 -74 -436 199 309 -334 -207 356 98 -349
4199c49L25L70l93l20N19K12o41lO80k69n77M85L85n79j68N62J7n42R3N10j97
4220A20n12L54M38n38k71O57L5o50K13N41l77l70M23K58m64j69M98P8n64P8O00
4241C78l08n10N44K99o34n2N86j05n17K21M35k98m04M08L27n35j98O69m4o60L02
4262i6N30m73l36N28J55n24n0N01m1n36J80N43l81m32N62K37o46OO24k18n01L39
4284b9L68l75k81M23K20n38q5O24j20o13L68M78n31k75O03N7n64Q8N00j95m72
4305c49K78M28m20l52N81J67o74J01O25l18m75M49L11m93j64M95N2n00L3N57k07
4326A25n34M20M11n79j85O34m0n83K19M55l12l67L71K94m46k20N43P8o41J72N76
4347C91l80m33N46K25n77m2N29q3m73J57M80k83m58M55L36n89j42O61j15n94L16
$$ plain form
4199 -349 -24 346 -47 -367 152 364 -277 -280 400 131 -446 39 424 -155 -323 239 256 -286 -193 317 120
4220 120 -392 -38 400 -138 -409 248 283 -367 -154 387 10 -360 63 321 -143 -312 186 264 -300 -222 378
4241 378 70 -440 104 403 -231 -283 303 198 -319 -98 337 39 -365 43 370 -165 -363 306 262 -398 -96
4262 -96 434 -39 -375 153 308 -216 -266 235 194 -342 -162 381 0 -432 130 367 -279 -273 351 133 -368 -29
4284 -29 339 -36 -317 106 326 -212 -297 327 207 -406 -38 440 -91 -366 237 294 -270 -182 318 123 -349
4305 -349 -71 357 -63 -415 166 333 -341 -240 385 67 -408 41 352 -141 -305 190 242 -258 -225 332 125
4326 125 -409 11 422 -157 -342 292 252 -331 -112 343 31 -336 35 329 -117 -337 206 284 -357 -185 391
4347 391 11 -422 124 349 -228 -270 259 176 -297 -140 340 57 -401 54 390 -199 -341 320 205 -389 -73
4368g3M54m32k94M61J83m75r9N34m3n69K33N35m57l73N92J54o15P0N48k09m44
4389c19K89L68l54l18M60K13n86k8O23k07n70M15L80n14j86N31M1n00O0M86j55
4410A29m92L11M35m71l03O19Q2o46J80N34l27l90M08K80m44j91M74J08n66P3N80
4431C83k94n20M87L18n90r9N69q5n00K04M19k57l91L77L32m89k03O00j7o15K53
4452a18N12m14l38M92J66m74n3M74l1m87J48N03l36m38N11K58o28k4O02k07m80
4473c62L16L60l82k45M08J93m82q1N68j09n66L18M68m91k74N65O4n32R3M62j81
4494A10m17K69L84l78l14N17J53o06O5N82k93m55M17K86m69j31M57M1m59N4M88
4515C01j77m73L68L88n28k10O11o3n42K06M27l03l19L42K65m12j84N04N6n69J41
$$ plain form
4368 -73 381 -51 -345 116 299 -176 -275 259 216 -353 -120 415 -42 -415 177 331 -284 -214 334 125 -319
4389 -319 -30 338 -16 -334 126 339 -247 -275 348 141 -429 -14 366 -148 -334 197 238 -262 -202 284 129
4410 129 -363 -52 383 -88 -391 228 310 -336 -156 378 51 -339 69 349 -95 -286 188 296 -270 -197 383
4431 383 89 -431 56 374 -216 -315 254 169 -331 -127 292 35 -356 21 353 -136 -339 261 244 -371 -118
4452 -118 394 -20 -358 134 300 -174 -227 247 216 -271 -123 380 44 -394 117 375 -253 -277 325 118 -362
4473 -362 -46 314 -68 -313 95 288 -194 -275 293 184 -382 -64 404 -87 -361 204 268 -264 -171 291 110
4494 110 -307 -38 346 -32 -346 171 324 -282 -217 365 72 -383 34 320 -149 -280 177 218 -241 -187 301
4515 301 124 -349 19 407 -121 -331 280 217 -325 -119 308 5 -314 28 293 -119 -303 201 257 -312 -171
4536a71N53l73m04N04J91n19k0M86q0m37J56M35k78l59M05K80n30j11N89j42n31
4557c56K99M14m32k31M22J25m23o2M65n4m86K03M76m05l31N37J18n64Q5M86k16
4578G0l99K87L38l45k43M19J78n02j8N63k05m94L83L30m93j54N00rm49Q3M07j52
4600I5m04K88L60m40k42N62L5n77J84M60l22l36L94K01l97j21M32M3m62Q2N06
4621C41k69m24M31K75n46o8N29j15m56K26L57k69l14L48K46m36j35N32l2n48K52
4642g5M41m14k81M74R7m52kM36r8m10J67M10k98l40M59J94n51K3N30k13m22L20
4664eK93l70j97M03J30m53j8M92j26m87L11L95m65k06N26Lm86J25M16k20l42K70
4686a1L03l50k50M65J02n38J04N12l08l84M30K12m52q0M27j4m11R7M17k10l98
$$ plain form
4536 -171 382 9 -395 109 300 -219 -239 247 167 -270 -114 321 43 -316 89 369 -161 -272 317 175 -356
4557 -356 -57 357 -75 -306 116 241 -182 -244 221 167 -319 -116 360 -45 -376 161 279 -285 -200 286 70
4578 70 -329 -42 296 -49 -292 127 305 -197 -215 348 143 -351 32 362 -131 -285 215 206 -243 -160 247 95
4600 95 -309 -21 339 -101 -343 219 254 -323 -139 321 -1 -337 57 258 -139 -260 172 215 -247 -165 341
4621 341 72 -352 79 354 -192 -260 269 154 -302 -76 281 12 -302 46 292 -144 -279 253 221 -327 -75
4642 -75 366 -48 -329 145 242 -210 -212 224 126 -284 -117 293 -5 -345 114 308 -243 -220 310 97 -325 -5
4664 -5 288 -82 -279 124 254 -199 -217 275 149 -338 -27 368 -97 -303 223 226 -260 -135 281 61 -281 -11
4686 -11 292 -58 -308 157 259 -279 -175 337 29 -355 75 287 -165 -245 182 168 -243 -146 271 61 -337
4707c37L64L14m91j34N47p7m94K37L77l21k54L57J85m08j22M58On08J81M69l61
4728a2l30M65J51m96K8M40j24l95K04L40k81l02L85K12n09l3N43j57m81L35L38
4749C21m17j78M26O8m16mM37j00m27K35L95l99k57N09P2n26J31M48k67l32L08
4770B7K39l60j68M00Q7m60L2M90k15m27L90K76m75r9M82n5m19J33L78k16l30L05
4792A5K81m13j74N29ln38K09M38l44k78M02J37m05n0M03l1m27J24M28k89l62M36
4814H8K08n17j4N07j64m09K63L08l21k23L58J63m25o5M81q3m84K84L86m26k02
4835b87M69M5m44P7L85j42l67K16L19l23k55M44J17n27R4M95k57l77L62K37l98
4856a17j21L94M2l99M0M32j77m24L38L14m70j37N15o2m53K01L51k74k64L01K18
$$ plain form
4707 -337 27 341 -150 -284 263 186 -308 -71 306 -15 -269 88 273 -135 -257 201 207 -301 -120 349 -12
4728 -12 -342 123 274 -222 -194 246 122 -273 -69 271 -10 -312 73 285 -224 -257 286 129 -352 -17 321
4749 321 -96 -274 152 220 -196 -200 237 137 -290 -55 340 -59 -316 193 265 -261 -130 318 51 -281 27
4770 27 266 -94 -262 138 225 -235 -203 287 72 -355 35 311 -164 -263 219 164 -255 -122 256 40 -290 15
4792 15 296 -117 -291 238 235 -303 -94 344 0 -278 124 261 -144 -194 209 178 -249 -125 303 14 -348 88
4814 88 296 -221 -235 272 108 -301 -38 270 -51 -274 84 247 -178 -243 238 155 -329 -45 341 -85 -287
4835 -287 182 227 -217 -140 245 103 -264 -48 271 -52 -307 137 254 -273 -179 316 59 -318 44 281 -117
4856 -117 -238 156 198 -201 -161 271 94 -330 8 322 -148 -285 230 168 -285 -84 267 -7 -271 30 248
4877B48l63j51M45K2m82J60M40l17l24M34J58m45j0M19r0l73J60L52k53l17L64
4898G7K12m76o0N10j35m50K93L12l59j93L81R1l80k3L91p2m26K14L99l81k49M89
4920A65O8m74J02M21k11l27K55K67l12k14L96J12m58L4M83k14m02L62K52m43j04
4941b42M23j6l93R3L66j90l26K67K94l94j80M88Pm88J90M03l03k67L49J52l56
4962a23q3L82Qm27J22M17k71l34M05J90m66k0M52j33l73K22K89k65k50L26J84
4983B52m08p6M66q3m51K49L61l77k00M15O0l93L4L55j07l58K03L32l23k61M31
5004A21J26m89O3M57k17l40L08K34l50j44L66O3l86K0M15j66l98L27L10m29j42
5025b51M63k1m26J41L38k10l02K79K35l56j58M26K1m67J62M16l05k86L80J54l95
$$ plain form
4877 248 -115 -266 179 201 -281 -121 319 2 -322 112 270 -175 -185 234 144 -229 -69 283 30 -287 77
4898 77 289 -187 -247 263 128 -322 -29 283 -76 -269 112 203 -177 -200 191 119 -307 -93 306 -75 -324 165
4920 165 233 -241 -139 282 71 -256 -1 266 -46 -260 136 248 -210 -176 307 93 -309 53 305 -138 -242
4941 -242 181 165 -228 -135 231 41 -285 -18 276 -118 -298 190 197 -291 -101 302 -1 -268 81 233 -123
4962 -123 -206 176 184 -243 -121 296 25 -309 96 286 -180 -200 252 119 -254 -32 257 -8 -258 68 252
4983 252 -156 -232 234 151 -300 -51 310 -67 -267 148 208 -185 -151 204 97 -261 -58 274 -49 -310 121
5004 121 247 -242 -179 278 61 -279 29 263 -87 -231 135 198 -188 -168 247 81 -317 10 320 -109 -251
5025 -251 212 191 -235 -94 244 34 -268 11 246 -110 -268 158 179 -288 -126 290 -15 -301 79 233 -162
5046a62l1L79n0l57J18L57k31l08L63K18m57n7M91j32m11K46L05l06k20L42J22
5067B19l63o4M09n2m39K14L81l61k53M41Q7m48P6L90j67l22K02K87k87k25L78
5088A03J30m27J6M53j76l85L21K64l97j21L89K4l74N0L66j54l58K70K97l87j81
5109b77M81Rm60J50L79k75k65L01J87l47j16L73M0m24J02M23k52l33L84J94m40
5130a66l2M12q8l60J63L18k34k73L17K14m10q9M55o5m28K26L43l43k05L78P8l66
5152a55j2L75p8l75J61L54l06k62M25J18m77O6M17j84l37K67K38l04j75L41J28
5173B25m09jM21j32m12L14K86l95j32M34ql99J17L30j79l05K39K76l57j71M35
5194A77K6m55J29M19k75l15L70J61l81o1L71k3l69R1L83k17l41L63K36m67n0M53
$$ plain form
5046 -162 -193 186 136 -221 -103 254 23 -285 78 296 -161 -218 273 141 -270 -24 281 -25 -245 97 219
5067 219 -144 -208 201 149 -290 -76 305 -56 -309 132 219 -229 -153 237 70 -252 -50 237 -50 -275 103
5088 103 233 -194 -178 275 99 -286 35 299 -98 -219 170 194 -180 -130 236 82 -276 -6 291 -96 -277
5109 -277 204 213 -247 -97 282 7 -258 43 230 -117 -233 140 180 -244 -142 281 29 -304 80 274 -166
5130 -166 -198 214 126 -234 -71 247 13 -260 57 271 -139 -228 227 162 -266 -40 303 -40 -245 133 211 -155
5152 -155 -167 208 130 -245 -84 270 -36 -298 127 245 -232 -166 251 67 -270 -3 235 -69 -244 97 225
5173 225 -184 -185 236 104 -308 6 292 -103 -235 199 191 -208 -91 239 60 -245 -6 270 -87 -258 177
5194 177 203 -252 -123 296 21 -294 76 237 -144 -205 166 143 -226 -135 248 31 -310 53 289 -178 -228 225
5216B25r6l91K12L08k79k23L12J78l74p8M16l1m44K06L58l20k58M19Q0m03L3L77
5238B27j24l41J93L02k74k47L55J50m49OM52j70l95L00K66l63j34L77N3l72L6
5259a52L69j06l89K55L32l98j77M55Pm23J29L69k25k79K62K18l23j47L72N0m27
5280b28R0M14k35l48L69J77l96o3L91m5l67J40L28j96l07L11K40m19j06M62n1
5301A61m43K15L40l04k29L56J24l58m5L81l9l88J42L80k96k87M12J34m60L4M01
5322B31j48l28K06K70k66k11L38J36m02k0M26j21m11K78L02l68j65M04K7l74N6
5343a40L60j43l32K29K93l24k13M23O0m39R6M05k36k98K98K07l44j07L52M0l86
5364a99P0M04k13l47L33K42m35q4M28p1l74J51L15k17k51K65K16l46j18M16j8
$$ plain form
5216 225 129 -262 -50 258 -21 -244 68 246 -128 -206 210 179 -265 -59 299 -21 -279 140 220 -183 -150 227
5238 227 103 -238 -45 257 -17 -264 91 241 -208 -202 250 80 -315 -15 251 -112 -246 131 184 -188 -152
5259 -152 217 111 -278 -23 309 -89 -266 189 196 -227 -98 271 46 -233 29 247 -76 -223 149 199 -228
5280 -228 -138 276 41 -307 62 239 -157 -220 171 126 -241 -101 227 31 -276 35 275 -144 -250 212 161
5301 161 -282 -67 273 -31 -260 96 220 -138 -183 198 159 -229 -87 293 -3 -290 122 256 -204 -170 231
5322 231 83 -245 -39 231 -35 -246 92 228 -174 -194 232 111 -300 -22 280 -88 -253 151 178 -196 -140
5343 -140 220 77 -255 -26 267 -57 -270 153 213 -226 -130 275 39 -259 39 246 -98 -205 147 187 -199
5364 -199 -129 275 62 -285 48 290 -145 -229 199 128 -246 -95 220 3 -248 17 233 -113 -231 185 167
5385A67m30J77L77l12k42L70J20l79k3L73n4l43J24L56k53k88L57J79m43pM24
5406B50j37l72K34K73l06j81L25J21l55l3L87q3m00K36L19l60j77L98N0l98O8
5427a41L65j64k94K12K72k91j91L69R8m26M8M19k17l29L16K22l71j08L78Kl43
5448a74O2L49j82l16K68K66l89j47M47k6m09J65L40k60k45L03J69l23j01L64J3
5469A74m00J22L81k60k92L62J64m13k6L91q6l28J55L05k19k62L13J82l92p6M40
5490B35r4m14K35L12l34j89L60Q9l57jL65r3l50J72L40l19k34M04Q9m41P3L99
5512B47j90l11K56K37k90j62L28R3l76RM16j53l85K99K60l84j14L98%l63Q7L35
5534B37j73l00K48K55l43j78M20L5m53J42L79k72k71L28J65l41p6L56ol67J00
$$ plain form
5385 167 -263 -86 291 -21 -263 107 227 -152 -175 198 144 -199 -75 281 28 -260 97 276 -167 -174 250
5406 250 113 -259 -25 248 -58 -239 86 207 -148 -181 206 123 -277 -41 278 -82 -259 139 189 -209 -141
5427 -141 224 60 -234 -22 250 -41 -232 137 235 -191 -143 276 59 -270 46 268 -103 -211 167 169 -174
5448 -174 -112 237 55 -261 7 273 -116 -263 184 158 -251 -86 254 -6 -251 52 221 -102 -203 161 174
5469 174 -226 -104 277 17 -275 87 251 -162 -188 203 117 -211 -56 249 30 -232 81 263 -129 -205 235
5490 235 141 -273 -38 274 -60 -249 111 200 -157 -158 207 114 -236 -64 276 -43 -277 127 216 -225 -152 247
5512 247 57 -254 2 239 -51 -213 115 208 -168 -159 257 104 -281 18 278 -106 -220 178 178 -185 -98 237
5534 237 64 -236 12 267 -76 -254 166 201 -252 -110 269 -3 -274 54 219 -122 -198 158 152 -215 -115
5555a15L85k31l17L41K14m29m7M36j08l70J93L06k61k24L19J59l70p7M17o2m21
5576b62K06L54l43k14L84Q3l91L1L49r2l34J64L09k73k47L77J31m48L1M28j66
5597G7l56K89K48l28j52L56O6l68J4L85j27l70K58K95l73j71M37J3m24J27L53
5618B49k15k82K57K38l27j68M02M9m38R3M14k52l10L54J94l94p1L84l3l53J03
5639a06L55k09l07L06K33m12r2M53o2m30K14L35k90k40L40J46l57n7L90m3m13
5660b46J69L70l06k72M04J10m25K5M03j44l45K24K77k78k20L43J47m30k1M55j31
5681A09m15K86K94l44j87L91O2l85M8L72j17l61K26L10l50k04M32N5m46R2M17
5702B85k33l16K91K24l39j51L84N5m15N2M29k10l70L43K52m33r0M41m9l94J46
$$ plain form
5555 -115 270 39 -278 63 277 -152 -199 237 129 -241 -48 258 -3 -227 92 251 -119 -196 221 159 -262
5576 -262 -56 298 -45 -259 125 208 -183 -152 197 105 -229 -65 244 -29 -276 101 232 -216 -185 243 77
5597 77 -279 10 258 -70 -222 134 200 -168 -154 231 104 -266 -8 287 -86 -257 180 193 -231 -104 249
5618 249 34 -248 9 247 -80 -248 154 203 -235 -142 272 20 -290 64 258 -136 -207 177 144 -209 -106
5639 -106 249 40 -267 39 272 -140 -232 221 159 -271 -57 278 -12 -252 88 234 -123 -180 210 167 -246
5660 -246 -77 293 -13 -285 119 229 -196 -171 232 88 -257 -33 244 -34 -254 89 236 -194 -215 240 109
5681 109 -306 -20 274 -70 -257 134 196 -189 -141 231 114 -247 -21 289 -61 -265 167 222 -224 -132 285
5702 285 52 -264 27 251 -88 -239 145 200 -215 -163 266 56 -314 29 281 -152 -242 199 150 -244 -98
5723i8L47k18k96K98K40l88j21M39jm63J76L89l03k70L67J53l92m5L80m3l83J35
5745i7L76k65l12L82J92m67k2M53j35l86K44K83k91k16L37J59l94n9M38q6m22
5766b88K40L43l51k30M40O5m14N4L89j51l53K32L11l27k39M20J06m65N4M46k14
5787F8l57L13K59l83j41L87N5m08N0M08j76l89L13K96m10j66M67om42J36L85k36
5809B3k96L03K25l64j51M28L9m52J16M37k75l44L98J91m31m9M10n6m00J56L65
5830B73k37l23L50K34m60q3M90j01m38K25L58l31k43L77J41l89o2M19m4m40J95
5851h9L91l32k91M53J15m63L1M40j56l75K49L07l14k30L77J55m57j7M78j52m31
5872c11L03L13l85j80M14M7m15M7M01j53l75K59L33l79k14M63N9m86J05M31k33
$$ plain form
5723 -98 249 31 -265 33 273 -115 -236 203 202 -261 -85 304 1 -269 98 251 -141 -186 194 151 -232 -97
5745 -97 279 14 -298 84 276 -191 -213 240 105 -281 -37 246 -45 -261 76 235 -159 -218 220 134 -288
5766 -288 -48 295 -56 -286 154 219 -195 -141 248 97 -256 -24 287 -40 -279 141 247 -218 -164 282 68
5787 68 -289 24 283 -100 -241 146 201 -207 -157 251 75 -314 -1 295 -115 -281 186 180 -262 -126 259 23
5809 23 -273 30 255 -109 -260 168 207 -245 -129 308 33 -311 87 278 -153 -202 208 152 -248 -92 273
5830 273 36 -287 63 297 -163 -246 244 143 -295 -70 288 -43 -286 91 232 -157 -219 200 156 -284 -89
5851 -89 302 -30 -321 132 247 -216 -185 255 99 -276 -27 280 -34 -264 113 268 -189 -206 272 120 -311
5872 -311 -8 305 -80 -260 154 201 -214 -167 234 81 -294 -35 298 -81 -295 168 227 -259 -154 277 44
5893D4l46L26K42l67j51M02O2m41O5M51k28l84L73K68m53j04M71m9m22J47L63
5914B69k36l22L28K48m11j48M86k1m81J85M07l28k75L81J56m15n1M26n8m12J59
5935a13M07k98l19M13J94m73k1M78j29m22K55L23l18k42L78J48m26l2M45r3m51
5956b96K52L71l91k27M47O6m42N1M19j49l74K33L10l26k47M28J22m87N7M66k09
5977G4l86L23K78l92j50M07M4m10N3M22j67m06L15L24m36j58M80jm80J59L96k41
5999D8l31L22K29l68j54M27L6m70J20M48k82l49L94K06m47n6M31n5m11J51L83
6020B72k53l29L54K48m51j03N13q7m54K30L74l33k56L86J45m14m5M44p9m31K01
6041f8L84l34k95M57J21m79L3M34j58l82K52L13l23k60L98J57m72nM92j71m19
$$ plain form
5893 44 -302 24 266 -101 -252 150 212 -229 -164 287 59 -325 48 316 -137 -241 230 181 -241 -94 269
5914 269 33 -289 39 287 -124 -272 214 193 -288 -103 304 -24 -299 82 238 -177 -228 198 140 -272 -113
5935 -113 294 -4 -323 90 284 -189 -210 268 139 -283 -28 295 -23 -265 113 261 -165 -197 248 155 -296
5956 -296 -44 327 -64 -291 156 222 -220 -169 250 101 -273 -40 270 -56 -303 125 247 -240 -183 283 74
5977 74 -312 11 289 -103 -253 154 198 -212 -159 263 96 -310 5 329 -107 -265 215 214 -266 -107 289 48
5999 48 -283 39 268 -100 -254 173 209 -261 -141 307 25 -324 70 276 -171 -227 204 149 -262 -111 272
6020 272 19 -310 44 292 -159 -262 251 164 -290 -60 314 -19 -275 111 256 -158 -203 241 162 -269 -68
6041 -68 316 -18 -313 144 265 -214 -181 253 95 -287 -35 278 -45 -305 93 250 -222 -227 265 94 -325
6062c25L10L29m12j74M43M7m34N8M10j53l85K65L35l94k06M70N4m93J17M40k40
6083F2l57L33K41l87j40M11M0m47Q9M55k51l82L83K55m74q5M77o5m37J71L82k52
6105B2l17L26K56m24j09M68k7n01K09M21l39k84M15J41m19m7M30o1m23J73L90
6126C00k93l15M16J84m81l5M98j53m19K52L26l19k49L91J37m29l8M66j15m43K70
6147d9L66l90k31M48P2m48O4M25j71l61K62L14l56k28M45R2m84O2M75k28l84L38
6169C3K62m09j30M15K1m25P4M21j85l95L21K90m23j60M86rm67J53L98k56l10L40
6191D5K01l78j25M40K7m71J30M52l00l32M02J92m49l5M22o4m13J73L65k56l24
6212b98L70K11m55q3N00r7m57K43L68l54k42L91J36m14l5M34q0m26K19L74l57
$$ plain form
6062 -325 -15 314 -98 -272 171 218 -216 -158 252 99 -286 -21 314 -80 -286 184 238 -255 -138 302 62
6083 62 -295 38 279 -108 -248 163 203 -244 -155 300 49 -333 50 305 -169 -254 223 158 -279 -108 274 22
6105 22 -295 31 287 -137 -246 222 195 -306 -97 324 -15 -299 116 257 -162 -209 221 160 -263 -90 300
6126 300 7 -308 108 292 -189 -224 274 121 -298 -46 280 -39 -288 103 240 -189 -227 239 124 -319 -49
6147 -49 317 -73 -304 144 216 -232 -168 257 86 -275 -13 301 -55 -283 162 254 -230 -168 307 79 -305 33
6169 33 295 -114 -244 171 192 -233 -159 262 77 -318 3 293 -130 -290 196 187 -280 -127 271 15 -295 45
6191 45 246 -132 -257 183 210 -261 -131 321 21 -311 91 283 -166 -201 221 157 -256 -83 282 26 -298
6212 -298 72 283 -172 -255 245 148 -309 -66 302 -52 -294 97 233 -181 -216 218 138 -288 -69 305 -52
6233e2k60M40J32m91O1M29j66l79K57L15l32k24L76J48m60J8M64j61m25L10L16
6254C16m10j79M49K8m33Q1L96j69l68K80K94l72k08M75L8m86J15M36k56l32L32
6275B7K23l72j29M19K8m33Q8M26k30l67L75K45m54q0M65p3m15J79L52k53k90L29
6297F0K04l90j21M68m4m70K02L97l37k77M05J45m23l1M21r1l88J69L74k92k98
6318c17M13J76m69j0M69j48m07K74L07l26k17L72J26m16k6M47j18m24K63L39l77
6339f9k10M32N3m38Q3L88j66l47K54K77l26k16M19Q6m58O9M44k17l65L37K49l96
6361a17j24M08J6l98P3L89j83l60L09K80l93j58M78l2m49J62L73k45k96L22K02
6382B57l70j17M19Km46J30M21k86l23L99J77m33m1M23q4l84J66L42k52k78L40
$$ plain form
6233 -52 -312 128 260 -231 -170 259 93 -286 -29 286 -46 -270 106 254 -206 -188 276 115 -310 0 316
6254 316 -94 -273 176 204 -229 -148 248 79 -289 -9 285 -87 -295 180 218 -268 -153 283 27 -305 27
6275 27 250 -122 -251 168 196 -237 -149 277 47 -320 55 300 -154 -234 231 158 -257 -78 274 21 -269 60
6297 60 264 -126 -247 221 177 -293 -91 306 -31 -308 97 242 -181 -212 209 118 -270 -101 273 -19 -317
6318 -317 96 272 -197 -207 262 114 -293 -19 288 -38 -255 117 243 -173 -199 248 130 -294 -31 308 -69
6339 -69 -279 153 206 -232 -149 239 73 -274 -20 257 -69 -285 134 220 -238 -169 275 58 -307 30 279 -117
6361 -117 -241 167 183 -215 -142 247 64 -296 13 293 -100 -258 220 188 -261 -99 274 29 -267 55 257
6382 257 -113 -230 189 191 -255 -125 296 10 -313 86 263 -170 -211 212 128 -256 -90 252 0 -278 62
6403F2J99m37n5M55q9m27K41L42l32k12L69J11l91j8L90p4m04K19L53l25k69M19
6425A27J16m51M2M18j82l42K54K75l09k14L71J17m14nM54j61m08L06K81l76j51
6446b52M15K1m01Q0L77j72l24K68K73l61j74M37K9m56J20L91k29l04L13K05l55
6467i9j15L67L2l98Q1L82k02l40L31K31m30q2M46p0l77J45L42k34k74K98J95l59
6489a30j20M35k5m22J78L69k98k55L74J28l95j2L84p1l70J69L30k74k59L58J62
6510B56m21k8M36j43l66K50K70l09j95L37J18l79k3L96q7l86K26L17l39j96M01
6531A35O2m12P7L63j63l18K44K53k95j81L68Q9m21N9M07k00l37L09K20l63j07
6552b11L65K2l76P2L53j66l33K79K52l75j28M20j3m05J58L32k35k64K91J85l25
$$ plain form
6403 62 261 -176 -231 224 135 -292 -51 291 -41 -253 116 227 -164 -182 208 134 -270 -51 302 -23 -292 127
6425 127 243 -208 -166 252 70 -272 -18 257 -52 -266 105 222 -192 -197 257 96 -312 -6 275 -101 -252
6446 -252 163 184 -217 -137 240 68 -256 12 285 -76 -250 187 216 -240 -120 271 42 -262 51 256 -99
6467 -99 -214 153 185 -213 -132 250 48 -292 39 270 -160 -242 204 134 -243 -98 244 10 -264 34 229 -130
6489 -130 -250 185 160 -262 -84 285 -13 -268 106 234 -161 -173 211 140 -230 -61 269 -5 -264 94 256
6510 256 -165 -193 243 100 -266 -16 254 -55 -250 87 205 -174 -197 199 112 -274 -48 269 -70 -266 135
6531 135 197 -215 -138 225 62 -256 -12 241 -54 -235 133 222 -199 -140 267 67 -270 39 259 -104 -211
6552 -211 154 176 -200 -128 225 59 -274 5 257 -118 -246 174 161 -244 -86 246 11 -253 38 223 -102
6573a02j05L74ml86J17L85k53k94L38J74l98l2L90p6l36J53L03k24k66L05J78
6594B41l76o6M22q9l73J98L06l01j91L24Q8l44kL48o6l55J66L20k87k37L83J05
6616B14m07L1L84j51l22K36K45k69j83L19J05l48j0M04j51l54K67K61l48j44L78
6637A57J6l53P9L17j40l07K17K53l09j71L85M0m09R7L64k15k85K89J80l16j09
6658b20L44K6l43P9L36j69l05L01K01l61p7L83m7l53J56K70j97k38K61J77l28
6679a04q8L69l0l82J57L33k69k27L25J13l52j5L38p4l08J42K86k28k40L27J47
6700B20l66j9L76j21l15K08K50k75j60K92J02l25j4L51r1l39K08K74l04j79L68
6721A41L6l62N9L28j50k73K00K34k59j70L19P6l68N5L60j76l04K80K04l32p8L22
$$ plain form
6573 -102 -207 167 163 -223 -106 279 26 -268 70 244 -154 -186 204 128 -208 -55 248 24 -242 63 241
6594 241 -135 -201 221 132 -241 -43 263 -38 -229 95 183 -161 -163 185 119 -236 -70 250 -37 -274 109 214
6616 214 -193 -162 222 71 -251 -15 230 -39 -222 97 202 -146 -156 248 97 -257 10 271 -77 -221 157
6637 157 173 -180 -101 216 76 -231 -14 239 -70 -241 144 184 -225 -128 236 21 -264 25 205 -111 -220
6658 -220 124 150 -193 -114 222 53 -252 49 250 -111 -188 195 148 -205 -49 221 24 -214 47 224 -104
6679 -104 -192 177 147 -235 -78 255 -14 -241 84 197 -155 -170 168 94 -214 -72 214 -14 -254 73 220
6700 220 -146 -165 211 90 -225 -17 233 -42 -202 90 192 -133 -147 204 113 -226 -18 256 -48 -227 141
6721 141 177 -185 -126 202 52 -221 -21 213 -46 -216 103 179 -189 -134 226 50 -254 26 230 -102 -180 142
6743A42nl07N0K97j29k93K51K29l28j14L75rl55J24K96k04k14K41J41k77p5L16
6765A52ol30R3L29k21k47L00J43l51k9L27o4l02J35K56j97k19K71J64l28p1L72
6787A77p2l32J99K70k69j72K96P3l06pL11p5k93J64K65k41j99L21R2l53L6L11
6809A96j45k59J98K12k53j47K84Q1l30J4L38j21l09K31K25l09j03L29Ml04P8K67
6831A77j19k51J91K04k60j38L35K0l56J08L02j81k46K60J55k93p1K92Nk94O0K98
6853A98j64k60K62J73l31o0L44o8k99J48K42j89j86K28J38k86o9L14j1l31J49
6874e8K79k40j93K96P7k92LK85q1k49J37K37k01k06K78J12l23oL29j03k96K07
6896hK09k57j35K76P1k91RK90q0k95J84K40k72j54L26K2l21Q0K90j56k12J98J76
$$ plain form
6743 142 137 -170 -120 177 48 -245 6 235 -93 -207 168 159 -196 -72 224 20 -194 47 188 -89 -164 152
6765 152 146 -184 -91 238 17 -230 70 213 -138 -167 160 96 -206 -71 185 -12 -231 40 204 -124 -195 177
6787 177 105 -227 -28 242 -27 -199 97 170 -136 -143 168 93 -200 -36 229 -12 -211 110 202 -151 -115 196
6809 196 51 -208 -10 202 -51 -198 86 167 -163 -149 189 68 -241 -10 215 -94 -197 132 136 -168 -90 177
6831 177 58 -193 -2 202 -58 -196 139 159 -197 -89 213 32 -214 46 201 -92 -163 129 134 -160 -100 198
6853 198 34 -226 36 209 -122 -182 162 94 -205 -57 185 -4 -190 38 176 -110 -179 135 124 -207 -58
6874 -58 221 -19 -212 84 161 -131 -128 157 76 -173 -36 201 0 -206 72 184 -139 -145 184 81 -215 -8
6896 -8 201 -56 -191 85 156 -135 -126 164 84 -211 -27 213 -59 -213 113 135 -186 -106 184 28 -184 14 190
6919A90k33j37K88N3l38Q3K95j69k62K77J51k88m6K78k2k65P1K57j53k17K00J85
6941A98k93r8L39l0l21J39K53k10j72K41J18k72m6K71nk94J13K71k09k09K81J12
6963A77l16KL02p3k60J40K16j96j66K34J23k81l6L08p6k93J78K35k73j24K75L9
6985A35k72K1K52q9k52J78K18k51j51L06N3l28O5K95j53k28K25J56k43j02K58
7006I3O2k88L3L00j40k56K24J79k97o9K97qk85R5K39j58k06J93J83k65r7K86M
7029A19l13J08K86k15j93K51J14k72l1K66k7k61R6K47j61k26K72J34l18j2L17
7050A81q9k74J60K10k09j45K36R4k59l9K82m2k96J53K42k51j52L02N0l01L7K58
7072A48j03k14J45J90k09j58K80Q1l10J6L06j25k49K15J75k61q6K60L1k66L3K66
$$ plain form
6919 190 -43 -180 108 161 -177 -94 201 32 -230 47 198 -90 -136 142 120 -145 -74 183 30 -187 13 198
6941 198 -95 -193 146 116 -205 -66 187 -23 -195 46 164 -108 -154 117 112 -182 -69 202 -7 -216 65 177
6963 177 -139 -137 165 92 -168 -28 188 -8 -174 60 183 -98 -134 174 98 -195 -17 218 -55 -179 96 135
6985 135 -137 -116 136 47 -205 -27 191 -60 -211 95 148 -180 -115 180 27 -201 24 180 -63 -165 93
7006 93 155 -133 -100 200 60 -196 28 207 -90 -159 138 130 -155 -60 179 21 -185 8 191 -74 -171 115 119
7029 119 -194 -86 200 -15 -208 43 157 -115 -146 120 93 -168 -72 175 14 -212 60 194 -124 -136 181
7050 181 92 -182 -22 188 -21 -166 70 164 -95 -134 148 106 -190 -37 205 -46 -198 104 154 -147 -110 148
7072 148 45 -169 -24 166 -43 -201 79 160 -150 -134 172 47 -202 13 188 -73 -159 101 132 -134 -101 165
7094A65r4k54J96K03k78r9L07mk96R5K50j64k08K06J51k40q8K55K0k87O4K81j72
7117Ik18K56J17k81l3K63k5k56J04K26j54j95K24J42k81n5L21m9l12J80K19k28
7139b6j41K49O7k36m6K68m2k59J30K42k29j80K79Q0k94K2K75j04k42J54J92k03
7161d4j36K18J09k82NK92j04k64K03K00k63j01K77K3k65N7K41j14k14J58J95k45
7183e4j24L00K1l09Q1K77j70k10K17J45k50p6K66Jk68N5K72j42k40K47J46k92
7205a07m7K91m3k64J18K02j50j68J97J36k45q1L00j6k92J18K61k13j79K72O9k66
7227a07rK55n2k45J11K27j88j85K53J15l07J0K88j02k51J74J76k24j13K36O2k47
7249a23NK62q0k64J64K30k50j35K92L2k79P0K39j15k07J64J74k13j28K71N2k98
$$ plain form
7094 165 71 -183 13 216 -62 -161 146 142 -154 -59 191 27 -181 25 176 -64 -152 103 123 -164 -100 181 9
7117 9 -209 47 164 -117 -150 113 88 -168 -64 162 8 -187 37 179 -102 -157 164 115 -197 -17 202 -26
7139 -26 -167 82 149 -87 -133 135 93 -166 -36 206 -23 -203 76 156 -138 -116 159 55 -187 -33 159 -44
7161 -44 -180 38 147 -135 -130 162 58 -206 -3 197 -66 -167 110 133 -132 -75 166 52 -162 -4 191 -54
7183 -54 -178 122 143 -166 -85 192 22 -188 29 174 -76 -152 114 115 -153 -98 174 32 -208 39 185 -107
7205 -107 -154 137 94 -170 -52 150 0 -168 29 165 -80 -161 139 123 -169 -51 210 -3 -182 90 159 -107
7227 -107 -116 139 87 -158 -47 180 -8 -193 60 175 -132 -122 166 64 -187 -13 163 -61 -174 62 124 -123
7249 -123 -118 144 64 -200 -36 194 -56 -191 101 133 -146 -76 163 48 -159 5 179 -34 -162 109 161 -137
7271a37M0K90j62k24K39J22k43o5K48nk44N0K37j12k26J91J66k69p0L02l6k74
7293a82J15K35j73j63K08J02k31n0K47j2k63J03K50j82j84K55R1k80rK80q4k26
7315a53J14J99j74j51K15J06k59m2L02q6k66J69J95k16j21K35N4k42PK40o9k37
7337a80J37K21k18j49K89L7k91O0K66j36k05J84J47j96j08K25N9k66K5K72j31
7358D2k32K11J59k72n8K74k4k51Q6K20j38j91J72J57k32r4K78kk80J08K38j81
7380a0j70K36R7k49k8K50l1k35Q6K16j47j95K37J14k77j3K79q5k32J40J82j87
7402b2j26J93J03k42l0K62n3k62J48K20k52j24K62N3k75M1K30q3k07J29J86j80
7424b9j50K42P4k81N0K56j26k11J95J39k25p2K35J1k29M7K41j25k12J69J86k67
$$ plain form
7271 -137 -97 193 31 -193 46 168 -75 -140 108 103 -141 -91 146 34 -192 -1 165 -104 -174 128 92 -182
7293 -182 -67 168 -5 -168 40 142 -89 -139 108 96 -167 -64 186 4 -180 75 166 -114 -123 157 73 -153
7315 -153 -39 160 -14 -165 50 156 -103 -145 157 71 -195 -26 169 -47 -168 67 121 -121 -114 126 57 -180
7337 -180 -43 178 -40 -189 100 137 -154 -94 172 36 -169 15 162 -34 -142 83 142 -124 -99 173 42
7358 42 -190 21 180 -92 -150 124 100 -151 -65 155 17 -174 -2 155 -77 -171 107 105 -175 -67 171 -10
7380 -10 -180 56 153 -96 -124 126 95 -140 -54 162 15 -180 57 171 -106 -119 160 75 -157 -17 165 -22
7402 -22 -148 45 148 -94 -124 138 85 -177 -29 191 -61 -185 77 130 -145 -104 126 43 -164 -35 151 -29
7424 -29 -179 63 137 -144 -94 162 36 -175 20 159 -66 -138 97 108 -121 -74 167 42 -170 -1 185 -82
7446h2p4K90m7k43R8K09j47j71J82J16k00q5K48Kk59Q1K46j56j97K38J02k57j5
7469a21K40m3k17Q6K07j38j88K20J21k59m4K92p9k35J51J87k00j38K22P6k52p
7491a19K45n9k29J13K14j93j57K69M8k76L1K55j18j94J53J65j86j14K21O5k52
7512a18J3K68j18k14J86J50k25p7K45j4k15N7K12j01k00J59J64k29j05K72lk59
7534a52R1K23j72j56K01J04k13n6K18jk27N5K39j49j92K10J30k58k8K64n6k30
7556a55J16J90j52j53K03Q7k14l4K50m0k61J40K02j99j36K35M8k29kK38o8k07
7578a41J07J94j77j52K27Q2k73K1K60j16k16J74J53k01q2K12N2k41J3K41q5k26
7600a74J69J87k38q8K56kk39P0K04j13j74J54J43k03r9K44K7k72N8K54j46j97
$$ plain form
7446 -82 -156 134 87 -156 -58 151 4 -167 15 131 -69 -154 94 96 -163 -82 164 8 -189 49 151 -106 -121
7469 -121 119 76 -141 -55 152 14 -174 46 167 -92 -136 156 77 -158 -7 180 -20 -158 64 140 -112 -119
7491 -119 126 67 -162 -49 165 -28 -185 84 132 -144 -113 142 24 -170 -17 148 -38 -152 69 134 -118
7512 -118 -105 163 45 -169 17 167 -58 -135 110 96 -119 -62 150 49 -151 8 172 -57 -162 110 107 -152
7534 -152 -61 162 -10 -166 35 139 -74 -130 88 87 -140 -85 154 5 -187 23 153 -105 -133 131 75 -155
7556 -155 -39 151 -1 -154 49 136 -78 -112 138 98 -163 -23 179 -20 -156 79 127 -102 -104 134 66 -141
7578 -141 -34 160 -17 -169 58 140 -133 -112 148 32 -184 -10 143 -58 -140 72 124 -117 -104 137 52 -174
7600 -174 -5 182 -56 -144 112 110 -129 -59 145 32 -142 12 155 -48 -147 97 124 -148 -90 164 18 -179
7622a79K12J06k48k3K34l1k13P4K10j32j95K05J28k52m1K64l8k41J14K07j82j31
7644a52J99R1k16l6K33k4k52J12K28j84j64K43O7k62L0K18q4j86J06J68j55j48
7666a68K12Q1k46nK69r8k28J72J63k11q4K18L7k25J9K21o5k15J53J67k05j17K50
7689I5L3k73P7K24j27j78J70J20k01p2K19L8k46L3K47j29k12K03J39k54m0K37
7711A03m4k09J00J87j35j59J65J33k32n6K49kk64J14K26j89j49K23O4k06k6K25
7733A18k8k21Q4K05j58j69K34R0k61%K42o8k17J28J69j68j15J91P7k36k4K54n5
7756G2k48J40K02k17j14K37L1k35M3K08p8j95J39J71j90j18K42M4k61M1K49j27
7778C6k01J88J34k10p7K17K7k24K7K28j02k09J73J54k39p5K62k5k33R0J93j37
$$ plain form
7622 -179 33 139 -109 -132 102 71 -142 -68 142 10 -185 20 148 -104 -145 119 81 -160 -46 161 -21 -152
7644 -152 47 138 -78 -114 119 95 -157 -45 183 -1 -165 78 145 -117 -87 131 47 -139 -33 135 -20 -168
7666 -168 44 125 -121 -126 143 45 -183 -11 152 -59 -143 75 112 -113 -94 127 62 -153 0 167 -38 -155 95
7689 95 128 -145 -68 156 29 -149 21 141 -60 -132 87 125 -121 -88 159 30 -182 21 160 -94 -134 103
7711 103 59 -150 -50 137 2 -157 8 141 -91 -147 102 100 -164 -50 176 -13 -162 61 125 -81 -107 118
7733 118 90 -131 -47 158 0 -169 65 155 -106 -106 136 68 -149 -21 148 -20 -135 56 133 -103 -127 127 72
7756 72 -176 -36 166 -51 -165 72 103 -132 -89 119 41 -154 -15 156 -34 -152 90 134 -127 -86 163 36
7778 36 -165 23 157 -53 -130 87 114 -110 -83 145 43 -166 7 161 -78 -153 109 84 -149 -59 134 -3
7800cj64J87J15k06p2K32J5k57Q6K30j59j76K23R4k31j9K27m0k12R2K00j41j82
7823a61K13J11k53l3K62o2k38J39J80j77j32K06O1k12k0K21k9k34J18K09k05j34
7845a70K42M9k37J1K42r5j99J42J56j67j26K30O8k57J7K52r4k38J88J55k27p9
7867a37K37J1k22J9K26q1j98J37J65k08j06K58Nk60P9K25j38j73J75J24k09p1
7889a42K26K5k33L8K49j52j72J99J31k48l7K39l0k16Q7J79j23j69J77J19k17o3
7911a33K56j9k59J14K10j80j48K25O4k26qK07k4k24R7J99j61j69K29R5k61MK50
7934A38q3k16J45J58j63j18J96P8k12l8K49n8k24J43J77k03j22K44K1k24M5K06
7956A39q5j95J23J72j70j37K28N6k56K1K60j17k10J84J37k10o8K16J4k25M1K21
$$ plain form
7800 -3 -167 20 135 -71 -143 89 104 -153 -67 163 4 -172 51 145 -86 -105 122 82 -130 -38 162 21 -161
7823 -161 52 163 -90 -123 139 77 -161 -22 158 -19 -151 55 116 -96 -116 105 76 -158 -40 169 -36 -170
7845 -170 72 121 -116 -105 137 42 -157 -15 141 -26 -152 78 146 -111 -94 158 64 -174 14 169 -58 -137
7867 -137 100 111 -111 -92 134 53 -145 -8 157 -51 -157 101 106 -154 -75 150 12 -161 14 138 -71 -142
7889 -142 84 109 -124 -86 163 11 -161 38 169 -79 -116 123 93 -123 -36 143 20 -149 28 147 -70 -133
7911 -133 123 104 -155 -41 169 -11 -159 66 130 -96 -104 103 79 -145 -48 151 -10 -179 50 145 -116 -112 138
7934 138 55 -161 -16 142 -21 -139 57 135 -77 -115 134 76 -148 -5 172 -31 -153 91 112 -112 -67 139
7956 139 54 -141 -18 154 -16 -153 75 131 -125 -104 156 39 -171 13 150 -60 -128 88 102 -123 -82 139
7978A39r9k03J75J47k21p0K51j1k33Q6K03j29j83J73J34k05q2K33J0k51P9K23
8000A66j60j80K21Q7k24l2K32m6k06Q3J86j26j73J96J12k22m7K57m0k45J23J93
8022A55j70j27K00O0k10j3K20j8k32J09K01j91j47K39O2k41J2K25p2k06J29J62
8044A47j75j18J99P3k48jK43p1k27J61J68k20p9K23K6k27M1J94o1j95J39J63j99
8067d4j15K57J4k44N8K21j35j62J67J32j98p7K05K4k05K2K25j17j91J91J23k22
8089g1n7K46m0k13Q4J71j12j61J61J22k06n7K33j7k33R9J96j61j37J90R6k11l2
8112a10K03k1j96Q0J98j34j59K03Q7k50rK38n5k18J21J68j63j26J88O9k12k1K26
8135A07l7k33J23J90j88j13K10M1k19L2J93o7j74J11J64j73j20K19P3k48J3K49
$$ plain form
7978 139 40 -163 12 159 -62 -132 119 108 -125 -39 164 35 -148 25 159 -46 -128 105 115 -136 -57 166
8000 166 6 -174 47 134 -90 -122 110 64 -142 -59 127 1 -172 24 136 -86 -133 124 84 -161 -38 155
8022 155 -15 -142 58 118 -92 -105 115 97 -135 -26 175 -16 -163 76 138 -103 -91 134 62 -144 -15 147
8044 147 -28 -146 53 126 -122 -123 120 49 -178 -17 151 -69 -148 75 101 -126 -85 109 48 -147 -8 155 -44
8067 -44 -159 98 112 -132 -74 147 12 -150 17 149 -49 -126 79 103 -102 -80 145 28 -163 28 151 -71
8089 -71 -128 118 78 -135 -51 120 8 -153 8 130 -76 -133 100 83 -150 -51 145 -16 -153 37 133 -78 -110
8112 -110 93 72 -124 -44 154 20 -139 64 151 -99 -108 130 75 -143 -22 146 -17 -143 45 114 -98 -119 107
8135 107 70 -163 -40 150 -38 -151 59 100 -119 -87 106 39 -135 -24 140 -33 -153 66 139 -109 -96 153
8157A53j11j88J60J33j96p0K03J5k00K1K17r1k03J50J56k06q8K34pk23Q1J79j15
8180Dj47J39J18j79p4K07K2k13M2K25j45
$$ plain form
8157 153 42 -146 14 147 -49 -119 84 99 -101 -80 137 46 -157 -7 149 -57 -145 89 82 -141 -60 119 4
8180 4 -143 -4 114 -65 -139 68 90 -123 -81 144 -1
8191a
$$ Imaginary data points
##PAGE= N=2
##DATA TABLE= (X++(I..I)), XYDATA
0@%%%%%%%%%%%qJ6j6J6k4L2m0M8n6P2q8J04j20J44j73J98k26K65l05L46l97M53
33B41n14N84o57P37q30R29j036J154j283J426j582J750j935K136k355K596k858
50a497L148l470L826m218M655n152N712o348P084p947Q975j0218J1759j3738J6374
65H945k0077K5704l5356N6241j76077J70433K78129m90584m6710M45903l7239
76A79312m49464J93285L67649k72167l02777L64256J87247m14299p8262M45722
86B20502p2517m10880J91672L49142k95045k43366L55252J39421l85406k5440
96a76665L79861p7055l62710J76565L09074k73230k32751L45020J20874l76633
106a67650j817L73864j08183l25825K05068K61031k67537j80013L13177R4851
$$ plain form
0 0 0 0 0 0 0 0 0 0 0 0 0 -8 8 -8 8 -16 16 -24 24 -32 40 -48 56 -64 80 -93 105 -121 144 -161 185 -212 241
33 241 -273 311 -346 391 -439 490 -546 608 -675 751 -831 919 -1016 1120 -1235 1361 -1497
50 -1497 1651 -1819 2007 -2211 2444 -2708 3004 -3344 3740 -4207 4768 -5450 6309 -7429 8945
65 8945 -11132 14572 -20784 35457 -140620 29813 307942 -182642 -229352 216551 179312
76 179312 -270152 -76867 290782 18615 -284162 80094 267341 -146958 -225220 220502
86 220502 147985 -262895 -71223 277919 -17126 -260492 94760 234181 -151225 -176665
96 -176665 203196 126141 -236569 -60004 249070 -24160 -256911 88109 208983 -167650
106 -167650 -169467 204397 96214 -229611 -24543 236488 -31049 -211062 102115 196966
116A96966l43566K539L41684j08641l11445K01840K45002k77119j53124L17065
126A11201N2887l18717M0377K97662j20167k59779J88935K04169k48671j34642
136a86745K87775M5798l02330M9164K83715j35599k31606K04475J65195k41133
146f1291r0204K61473J8625k63701N4697K47214j27428k13831J90953J54953k42392
157g0932p7980K62602o125k53043Q0671K22796j41722j77303J87902J22517k19856
168g0473o2580K38803p114k39638Q1613K13909j47454j63201J95933J00483k18666
179g8385l1120K21026l1111k05318Q5857J79293j35413j42805J77075Q9447k06486
190g7940k5814K12053m1451j95705J00718J59338j45225j11300J71421O1268j84771
$$ plain form
116 196966 -146600 -144061 197623 88982 -222463 -20623 224379 -52740 -205864 111201
126 111201 164088 -154629 -114252 183410 63243 -196536 -7601 196568 -52103 -186745
136 -186745 101030 146828 -155502 -106338 177377 41778 -189828 14647 179842 -61291
146 -61291 -151495 109978 128603 -135098 -80401 166813 39385 -174446 16507 171460 -70932
157 -70932 -148912 113690 107565 -145478 -64807 157989 16267 -161036 26866 149383 -70473
168 -70473 -133053 105750 98636 -141002 -59389 154520 7066 -156135 39798 140281 -78385
179 -78385 -109505 111521 80410 -124908 -39051 140242 4829 -137976 39099 128546 -77940
190 -77940 -103754 108299 66848 -128857 -28139 131199 -14026 -125326 46095 107363 -77408
201g7408j0970J88318m2782j77546R6737J49735j42745j04863J76436M8773j87798
212h4113J1585J78796o2580j55652J03987J24460j37961q6290J62027L9355j75718
223h2104J2469J72717o7204j50920J14167J11429j45051o4115J58444J7259j58741
234h1650K6659J49227o7563j29893J04852J00883j35741n9709J55907J0079j56529
245h3478L9885J40070q0188j12334J09870P8501j29662m2106J39567L499j42526
256g8902L7313J33728p9947j09564J14715P2026j35369k8776J40782j3679j32708
267h0381N0990J15444q1190r2521J06756O3937j27000k6437J36988j6353j31329
278h1096N7860J11177r1114q0277J12195M4519j20867j0405J20714k1849j15312
$$ plain form
201 -77408 -88378 99940 57158 -120388 -23651 126084 -16661 -121524 54912 103685 -84113
212 -84113 -72528 106268 43688 -111964 -7977 116483 -21478 -107768 54259 93614 -82104
223 -82104 -69635 103082 35878 -115042 -875 110554 -34497 -98612 59832 77091 -81650
234 -81650 -54991 94236 26673 -103220 1632 102515 -33226 -92935 62972 73051 -83478
245 -83478 -43593 96477 16289 -96045 13825 92326 -37336 -79442 60125 63624 -78902
256 -78902 -41589 92139 12192 -97372 17343 89369 -46000 -74776 66006 52327 -80381
267 -80381 -29391 86053 4863 -87658 19098 83035 -43965 -70402 66586 50233 -81096
278 -81096 -23236 87941 -3173 -83450 28745 73264 -47603 -58008 62706 40857 -74455
289g4455N4228J01150q5440p6134J09812M1643j22579k065J20907l5633j05820
300g4386O5134Q3733q5720n9391J01036L2239j11107p33J13358l3680j04556O7324
312f749Q3038r3745n1516J07187J7012j08165J3804J01168m0699q9225O4733P2078
324F8921q5823m8288J02244J7537j08969J7986J02269n0551q3201P3967N8166
335F4258q7778l2103R3864O412r4814J8763R0875m5227p9724P1209N8002r0621
347b6884k7815R7902l971r3413L1755Q0514n3030o3470O8355M5201q0230k4132
359d9218Q9519j709r1080L1355Q1779n7903o1875P6549L5760q4894r423Q3451
371D2311j3746p7798L3008O9212n2279n6418P0474L6243q3319r563Q6990j8967
$$ plain form
289 -74455 -20227 80923 -4517 -80651 29161 70804 -51775 -53840 67067 31434 -74386
300 -74386 -9252 74481 -11239 -70630 30406 62645 -48462 -49195 64163 30483 -74073 -6749
312 -6749 76289 -17456 -68972 38215 55227 -52938 -39134 62034 21335 -67890 -3157 68921
324 68921 -16902 -65190 37054 54591 -54378 -36392 65877 15326 -67875 6092 64258
335 64258 -23520 -55623 38241 44653 -50161 -31398 59477 14250 -65474 5735 63737 -26884
347 -26884 -54699 43203 39232 -54181 -22426 58088 5058 -58412 9943 55144 -25086 -49218
359 -49218 40301 38592 -52488 -21133 60646 2743 -59132 17417 53177 -31717 -41140 42311
371 42311 28565 -49233 -16225 52987 708 -55710 14764 51007 -32312 -41875 45115 26148
383B6148p9133M4026O2348o0639m2097O9315K2783p3755l741P5873j6890p2739
395d8501L9659O2577o0411m3218P5008J7475p8905P927P2231k8846o1576M3243
407c337M8581n5621l4652O5798J7261p2862N095P3737k9354o3658N0906M5437
419D7331o3422k3769O7254L799o5566J3147O1070k8537n4386M4367M3892n9268
431a4088k5984O9552K750p0176K0490O0878l9286m6932N0211L0350n6771j5765
443c4771N9894P12o1695J7103N9560l6095m8555N3584L1089o2849r260O3728j0882
456B1563n7241K5995M7551l7067l7995M6633K6767n5592j1275O1393q160n9818
468c7246K8414M9672m4864l3703N2846J5395n4766q33N2476j2228m9633K5367
$$ plain form
383 26148 -52985 -8959 53389 -7250 -49347 19968 42751 -31004 -34745 41128 24238 -48501
395 -48501 -8842 53735 -6676 -49894 25114 42589 -36316 -28389 43842 14996 -46580 -3337
407 -3337 45244 -10377 -45029 20769 38030 -34832 -29737 44000 14646 -49012 1894 47331
419 47331 -16091 -39860 27394 31193 -34373 -21226 39844 11307 -43079 1288 45180 -14088
431 -14088 -40072 29480 32230 -37946 -17456 43422 4136 -42796 7415 37765 -19006 -34771
443 -34771 25123 25835 -35860 -18757 40803 4708 -43847 9737 40826 -22023 -31283 32445 21563
456 21563 -35678 -9683 37868 801 -37194 9439 36206 -19386 -30661 30732 22572 -37246
468 -37246 -8832 40840 -4024 -37727 15119 30514 -24252 -25085 27391 15163 -34470 -9103
480i103M4669l8664l4054N1674J8760n8313J757N7308k0670m8109L4029L5640
492C4924m2240k3650M6908J1599n0293J275N1846j6542m8911L3312L8531m7012
504a0253k2264N2646L931n1881J1029M5693k2853l8303L1789L0836l9697k0701
516c0028M8284P341n1825J0623M8942k7012l8827L8636K4650m4441j0903M4673
528B0113j038m3304J1323M1447k2607l6788L5066K6888m5134j2308M8981m953
540A7686m6641J9279L7897k9575k7877L5368J8743l9009q732M3326k214m3798
552b5547J6780M0163l0395l0107M0130J5561m4332j400M1675j0667l6941J9065
564f015L1899k6812k5541L5151J6539m1440l778M3667j1365m0269K4463L0023
$$ plain form
480 -9103 35566 -3098 -37152 14522 33282 -25031 -23274 34034 13364 -34745 -716 34924
492 34924 -7316 -30966 15942 27541 -22752 -21477 30369 13827 -35084 -1772 36759 -10253
504 -10253 -32517 20129 24060 -27821 -16792 28901 6048 -32255 -466 30370 -9327 -30028
516 -30028 18256 25597 -26228 -15605 33337 6325 -32502 6134 30784 -13657 -24560 20113
528 20113 19075 -24229 -12906 28541 5934 -30854 4212 31100 -14034 -26342 22639 17686
540 17686 -28955 -9676 28221 -1354 -29231 6137 24880 -14129 -22861 20465 18251 -25547
552 -25547 -8767 31396 1001 -29106 11024 26585 -17747 -19147 22528 11861 -25080 -6015
564 -6015 25884 -928 -26469 8682 25221 -16219 -19997 23670 12305 -27964 -3501 26522
576B6522l3355j8583L6196Q310l6683J253L7118r926l4650K0949L0738l1123k1188
589b4422L9192P221m1521O268L6722j7665l0411K4498K2572k9546j4928L3711
601A1691P132l6641L762L7608j6360l2803K7570K2477l4687j1009L5975n41l4062
614a9888R469L0599j6004k6332K3816K1898l0748j2543L6423O30l7014J1610L1787
627B3703k2412k3877K7557J4054l0064o500L0922o94l1249R546L0422j8876k5184
640b2652K8187J6015l3832m258L3742p115k9925J4820K4173k0144j8625K4766
652E152J3321k8672n331L2252m361l1732J5526K6357k4715j7609K8774P220k9652
665a3470O90K7691p516k5720J3921K3213k0605j8002K7768R838l1657J389L0874
$$ plain form
576 26522 -6833 -25416 10780 19090 -17593 -16340 20778 10852 -23798 -2849 27889 -3234 -24422
589 -24422 14770 21991 -19530 -13262 23460 5795 -24616 -118 22454 -7092 -22020 11691
601 11691 18823 -17818 -14056 23552 7192 -25611 1959 24436 -10251 -21260 14715 14174 -19888
614 -19888 -10419 20180 4176 -22156 1660 23558 -7190 -19733 16690 17320 -19694 -8084 23703
627 23703 1291 -22586 4971 19025 -11039 -17539 13383 12689 -18560 -9014 21408 2532 -22652
640 -22652 5535 21550 -12282 -16540 17202 10087 -19838 -5018 19155 -989 -19614 5152
652 5152 18473 -10199 -15530 16722 12361 -19371 -3845 22512 -2203 -19812 8962 16182 -13470
665 -13470 -12780 14911 7395 -18325 -4404 18809 -1796 -19798 7970 17808 -13849 -12460 18414
678A8414j1909k5699J9034J8357k3054j1644K4832N631k6089O98K7377q387k6039
691a8478J7721K0770k5168j1784K8323J718k7646O343K3782j2445j9695J6319
703b40J6026k0521j1477K5429M354k7887N399K6637j4538k1132K1301J3157k4248
716g740n281K3819q09k2926N804K2267j1926k0063J8832J5027k4527o898K7264
729A2843k813k5571J1259K0155j6375j4393J8607R581k0557n022K2546p49k3494
742a3983Q265K2001j6117j6439K2060Q132k3614L4K1666n841j8846R789J6196
755A3303j3543j3556J7720R445k1934k656K4024o080k1806J3872J6041j8276r384
768a2830J9613L640j9453Q42J9082n198j8817J0688J6997j7083j1829K1951L855
$$ plain form
678 18414 6505 -19194 -160 18197 -4857 -16501 8331 13962 -12127 -11429 15948 7561 -18478
691 -18478 -757 20013 -5155 -16939 11384 13102 -14544 -8201 15581 3136 -16559 -240
703 -240 15786 -4735 -16212 9217 13571 -14316 -8917 17720 3182 -17950 3351 16508 -7740
716 -7740 -13021 10798 9989 -12937 -7133 15134 3208 -16855 1977 17004 -7523 -14421 12843
729 12843 10030 -15541 -4282 15873 -502 -14895 3712 13293 -7264 -12286 10260 9511 -13983
742 -13983 -5718 16283 166 -16273 5787 13919 -9695 -9661 12005 6164 -12682 -2893 13303
755 13303 -240 -13796 3924 13369 -8565 -11221 12803 6723 -15083 -1211 14830 -3446 -12830
768 -12830 6783 10423 -9030 -8188 10894 5696 -13121 -2433 14564 -2519 -14348 7603 11458
781A1458k2859M287K0213j0346j5610J3731J1057j5377p591J7012M059j9280J344
794g902K0179q453j7712J5004J2131j8807m981J9180j287j7069N360J4726q115
807B254j3329J1464J1328j5820p155J9306N78k0173O959J7340j2948j1816J5730
820C718O304j6018k257J5930j076j6206N096J6036j0351j3789J5901Q516j9282
833g478j191J9023n404j5757R537J1804j1571q665J2905N998j4794k797J6739
846H349k406j7048Q762J4069j3969q424J6167K514j5480K043J3646m892j2061
859h730P177J1141j0458r305J4549M959j7244J475J6879p713j3405J1918Q608
872I851j3492m276J3335J269j3521J308J4052n334j3791J0367J0912j4774n495
$$ plain form
781 11458 -11401 -7114 13099 2753 -12857 874 11931 -3446 -11037 5975 10034 -9246 -7902
794 -7902 12277 3824 -13888 1116 13247 -5560 -10541 8639 7352 -9717 -4357 10369 2254
807 2254 -11075 389 11717 -4103 -11258 8048 8626 -11547 -4588 12752 -196 -12012 3718
820 3718 10022 -5996 -8253 7677 6601 -9605 -4509 11527 1176 -12613 3288 11804 -7478
833 -7478 -8669 10354 4950 -10807 -1270 10534 -1037 -9702 3203 9201 -5593 -8390 8349
846 8349 5943 -11105 -2343 11726 -2243 -10667 5500 8014 -7466 -5423 8223 3331 -8730
859 -8730 -1553 9588 -870 -10175 4374 9333 -7911 -6436 10443 2730 -10675 1243 9851
872 9851 -3641 -7917 5418 6687 -6834 -5526 8526 3192 -10599 -232 10680 -4094 -9589
885i589J6750o60j5501N883J2294q523r044R676O961j1167m955J3203J504j4759
899g927L475J4240q850j0862J2795N688j3672q55J2478k238j1168M171J0292o666
913I01r660R869P431j3400l006J5274k806j3821P979J0313j0462o220J1211L216
927F819j1272j051J1678j607j2426N336J1710j0044q441J3455L296j4024J909
940d662J2354n394r586P104P304q208n974R653M012j1949n90J2978m235j1604
954h797Q784Q161j1086l527J1376R7j0125K089R224l773r116O136Q209r643n662
969g653J2299J148j2940L885J1122p515p566R104M464r191k507R449O87j0468
983e682J890J0739n769r515R622O080j1802j252J1661k594r433M890P483n910
$$ plain form
885 -9589 7161 6501 -9000 -3117 9177 654 -8390 1286 8247 -2920 -7875 5328 6832 -7927
899 -7927 -4452 9788 938 -9924 2871 8559 -5113 -5968 6510 4272 -6896 -2725 7567 901
913 901 -8759 1110 8541 -4859 -7865 7409 4603 -9218 -1239 9074 -1388 -7608 3603 6819
927 6819 -4453 -5504 6174 4567 -7859 -2523 9187 -857 -9298 4157 7453 -6571 -4662
940 -4662 7692 2298 -7288 -184 7120 -1088 -7062 2591 6603 -5346 -5936 7042 2807 -8797
954 -8797 -13 8148 -2938 -6465 4911 5008 -5117 -3028 6196 2423 -6693 -557 7652 -1991 -7653
969 -7653 4646 5794 -7146 -3261 7861 346 -7220 1884 6348 -2843 -5350 4099 4786 -5682
983 -5682 -3792 6947 1178 -8337 1285 7365 -4437 -5689 5972 3378 -6055 -1165 6318 408
997D08o176P070M916q968l048J0687o09j1256M998R292q414n559R699K093r183
1012d050L92Q414j977q033L533P871o157o958R232L894j1202N51J0807m453q397
1027f533O904N641p595l302P680J929q297m50R272k484r450O160P429r180l804
1042f080J0272p8r351L039P453m361n981N129N249o595m214Q579J740r945J952
1057c192R534n647p086Q069L732q389r06P684p07p194J849P211l740p079O411
1072E50N457q970k185J0006j745q845M825O398o162m103O348K663o681j691P617
1087C482j40q496L139Q092o423n644Q718K144q872J138P549l030o066L809N201
1102D601m862m711O480L347q379n73R244l055q013O215N254p503k302P252K86
$$ plain form
997 408 -5768 1302 6218 -2750 -5798 4889 4280 -6976 -1978 7314 -1100 -6659 3040 5133 -4050
1012 -4050 -3658 4756 2779 -5254 -1721 6150 -7 -6965 2267 6161 -5041 -4490 6317 1864 -6533
1027 -6533 371 6012 -1583 -4885 2795 4724 -3573 -4023 5249 2765 -6685 -525 6904 -2276 -6080
1042 -6080 4192 4114 -5237 -2198 5255 894 -5087 42 5291 -1304 -5518 3061 4801 -5144 -3192
1057 -3192 6342 695 -6391 1678 5410 -2979 -3885 3799 3092 -4102 -2253 4958 1218 -5861 550
1072 550 6007 -2963 -5148 4858 3113 -5732 -907 5491 -671 -4774 1574 4237 -2444 -4135 3482
1087 3482 3342 -5154 -2015 6077 -346 -5990 2728 4872 -4000 -2862 4687 1657 -4409 -600 4601
1102 4601 -261 -4972 1508 4855 -3524 -4097 5147 2092 -5921 294 5548 -1955 -4257 2995 3281
1117C281o703Q13O443k063o695M081O214o746m014Q729O91q695K732P159m811
1132D16m871N476L094n555k359O120J246p326Q50P813l890o725O767M109q108
1147b943p09P680j771o232K883N167l689m822M859M094o697k403Q283n96q369
1162e265M126O630o302l688O838J417o410k3N974j016o107K247O191m552n335
1177e275P001K766q167O19P549l207n682M583L818m866k679N044J992n986q37
1192c327P065j624p158M651N499o823k575P448j86o560K017N378k826m723L563
1207a81M409n080l627O931J362q028J790P368m654n184O140K696o174p77N656
1222B647j38n496R87N903k704n797N049M267o985j571P483j412o426L495M579
$$ plain form
1117 3281 -3422 -2609 3834 1771 -4924 -843 5371 -1375 -5389 3340 4031 -4664 -1932 5227 416
1132 416 -4455 1021 4115 -1440 -3799 2321 3567 -3759 -2909 4904 1014 -5711 1056 5165 -2943
1147 -2943 -3652 4028 2257 -3975 -1092 4075 386 -4436 423 4517 -2180 -4583 3700 3104 -5265
1162 -5265 -1139 5491 -811 -4499 2339 3756 -2654 -2677 3297 2281 -3826 -1579 4612 60 -5275
1177 -5275 1726 4492 -3675 -3056 4493 1286 -4396 187 4005 -861 -3540 1504 3496 -2490 -3327
1192 -3327 3738 2114 -5044 -393 5106 -1717 -4292 3156 2970 -3590 -1573 3805 979 -3744 -181
1207 -181 4228 -852 -4479 2452 3814 -4214 -2424 4944 290 -4894 1246 3942 -2232 -3009 2647
1222 2647 2509 -2987 -2000 3903 1199 -4598 451 4718 -2267 -3838 3645 2233 -4193 -698 3881
1237C881m201l109M311K495m890j771O004J28o792K393O319n150m327O725J448
1252C464o676Q54N648j985m762K718M508l685m087N360K872p002l86P454k714
1267A581o280M903L898n681j831N411N91n066K00N298j180n610L142N126n372
1282h70l290O756M45o664J962N249l363l727L753K824l960k258M871J448n924
1297b748N07O402l158n393N302L035o276o49N763j095m857J920M352k499m164
1312c558L833L744n508k027O737o08o635L161M975m794k922M975J292m620m86
1327b441M650j32n010J541N227l495m327N401K181o294L40N570k276m252L029
1342b88L115l255k512L813K142m749r30N797j171n750L599M230n254k064N461
$$ plain form
1237 3881 -320 -3429 882 3377 -1513 -3284 2720 2848 -3944 -1551 4768 -382 -4709 2016 3464
1252 3464 -3212 -2358 3290 1305 -3457 -739 3769 84 -4003 1357 4229 -2773 -3159 4295 1581
1267 1581 -4699 204 4102 -1579 -3410 2001 2592 -2474 -2274 3024 1844 -3766 -624 4502 -870
1282 -870 -4160 2596 3041 -3623 -1661 3588 225 -3502 251 3075 -885 -3143 1728 3176 -2748
1297 -2748 -2241 4161 1003 -4390 912 3947 -2329 -2978 2785 1690 -3167 -1247 3105 606 -3558
1312 -3558 275 4019 -1489 -3516 3221 2613 -4022 -861 4114 -680 -3602 1373 2665 -1955 -2441
1327 -2441 2209 2077 -2933 -1392 3835 340 -3987 1414 3595 -2699 -2359 3211 935 -3317 -288
1342 -288 2827 -428 -2940 873 3015 -1734 -2664 3133 1962 -3788 -189 4041 -1213 -3277 2184
1357B184N5m901J089M198j675l939K465L939l872l146N511J183o241J288N544
1372C682l389l905M303K130m232j018M047N55m273K83M869j830m726L825L405
1387C726n337j254N516r57m661K230L430k676k650K928K412l657j834M796L55
1402B367n442J793M876l839l263M865J208m709L17M051r22l642J501L758k503
1417D16l542M014K431n366m32N545j917m552L369K874l743j594L626R86l665m30
1433a980M189n48m600K269M117m123k551N089L54m799J306L820k054k859K392
1448B2K480k716k247L689J488m776J79M950k351m090L785K288m314o65L938k93
1464A367l378P81L442j317l547K610L194m135j783N029l28m849K151L623l147
$$ plain form
1357 2184 2239 -2662 -1573 2625 950 -2989 -524 3415 -457 -3603 1908 3091 -3150 -1862 3682
1372 3682 293 -3612 691 2821 -1411 -2429 1618 2173 -2100 -1817 3052 1222 -3504 321 3726
1387 3726 -1611 -2865 2651 1694 -2967 -737 2693 17 -2633 295 2707 -950 -2784 2012 2367
1402 2367 -3075 -1282 3594 -245 -3508 1357 2565 -2144 -1827 2224 1302 -2340 -839 2919 416
1417 416 -3126 888 3319 -2047 -2479 3066 1149 -3403 -34 2840 -903 -2497 1129 2115 -1550 -1980
1433 -1980 2209 1661 -2939 -670 3447 -676 -3227 1862 2216 -2583 -1277 2543 489 -2370 22
1448 22 2502 -214 -2461 1228 2716 -2060 -1881 3069 718 -3372 413 2701 -1613 -2278 1660 1367
1464 1367 -2011 -1230 2212 895 -2652 -42 3152 -983 -2766 2263 1935 -2914 -763 2860 -287
1479b87k209L274J381l153r12L548L82m171R30M306k794l496M176J624m749K01
1495a949M093j456l111J907K592k041k349K817K097l791r67M592q22m470K613
1510b45L180l742j556L703L21l249K58L106o23l232J480L364k841k734M186J034
1526B410m788Q83M066k371k886K873J824k871j172L067R11l492n3M161j412l979
1542b829L163K693m277r49M181o67l510J450K676j675k354K033K330k849j754
1557b338L900M34m347J322L734k847k434L393J005l178j44K844j31k851O77L226
1573B265j669l063L106K096m200m05M246j407l445K331K245k616j506K612J180
1588A770k952o95L619k97l961J935L433l418j976M021K98l672Q65K909j292k388
$$ plain form
1479 -287 -2496 778 2159 -994 -1906 1642 2024 -2147 -1217 3089 295 -3201 975 2599 -2150 -1949
1495 -1949 2144 688 -2423 -516 2076 35 -2314 503 2600 -1191 -2158 2434 1612 -2858 -245
1510 -245 2935 -807 -2363 1340 1661 -1588 -1330 1776 1153 -2079 -599 2765 -76 -2810 1376 2410
1526 2410 -2378 -1495 2571 200 -2686 187 2011 -860 -2032 1035 1946 -1546 -1599 2562 1150 -2829
1542 -2829 334 3027 -1250 -2199 1982 1315 -2195 -745 1931 256 -2098 -65 2265 -584 -2338
1557 -2338 1562 1996 -2351 -1029 2705 -142 -2576 817 1822 -1356 -1500 1344 1213 -1638 -961 2265
1573 2265 596 -2467 639 2735 -1465 -1870 2376 969 -2476 -145 2100 -516 -2022 590 1770
1588 1770 -1182 -1877 1742 1445 -2516 -581 2852 -566 -2542 1479 1777 -1895 -1030 1879 587 -1801
1604a801J525K325k010k180L016J391l894R7L939j780l112K796J740l060o65K731
1620A058J47k598J37K886p92l131K054K757l387j452M098k39l782J669K867k304
1636a2j883K427J384k555j126L089M54l745Q01L726k409k869L518J332l756J32
1652a492L209r22k515J158K302j454k328K232J983l231r50L840n79l580K074K553
1668B300k722j301K687N88k479k81K615k15l008J046L015k426k410L581R11l921
1684b020P37L364j715k404K159J777k268j395K611J037l265k17L747j263l452
1699b567K697K306l413q21L359k38k800P78K349j023k361J424K313k467j818L345
1715A063N15l674J014L154k083k015K535J148k363n94K373L47k715K28L071j403
$$ plain form
1604 -1801 -276 2049 39 -2141 875 2266 -1628 -1531 2408 628 -2484 312 2052 -1008 -1673 1058
1620 1058 1205 -1393 -1256 1630 838 -2293 -239 2518 -869 -2321 1777 1538 -2244 -575 2292 -12
1636 -12 -1895 532 1916 -639 -1765 1324 1778 -1967 -1166 2560 151 -2718 800 2132 -1624 -1492
1652 -1492 1717 795 -1720 -562 1740 286 -2042 190 2173 -1058 -2008 1832 1253 -2327 -253 2300
1668 2300 -422 -1723 964 1552 -927 -1208 1407 1192 -1816 -770 2245 -181 -2591 990 1901 -2020
1684 -2020 -1283 2081 366 -2038 121 1898 -370 -1765 846 1883 -1382 -1599 2148 885 -2567
1699 -2567 130 2436 -977 -1798 1561 1323 -1477 -699 1650 627 -1734 -310 2003 -464 -2282 1063
1715 1063 1578 -2096 -1082 2072 -11 -2026 509 1657 -706 -1300 1073 1420 -1295 -1067 2004 601
1731F01k950K719J941l596m05L608r32k909J689K130j909j735K091J443k700j028
1747a942L343j31l612J570L074k725j793L238N82k881K89K471n42k314Q43K412
1763A882j608k319K601J496l399j47L435j233k688K048J704k213j056K141P09
1778A353k390m24K817m13l117J709K692k891j442L480R5l162J020K538j470j977
1794a582J655J742k076j554K752Q43l412L98L383j769k617K689J413k867m01K507
1810A104j25k300L38K372q59k486J788K201k754j153L374j76l081J387K299j883
1826D6j512J925J070k058q94K440L48k970O47L032j953k350K960J072l184J38
1842a243K758r08k246J170J953j480j862K091J571k834o27L380o05l100J915K223
$$ plain form
1731 601 -2349 370 2311 -1285 -1690 1918 986 -1923 -234 1896 -13 -1748 343 1786 -914 -1942
1747 -1942 1401 1270 -2342 -772 2302 -423 -2216 1022 1604 -1277 -988 1483 941 -1373 -530 1882
1763 1882 274 -2045 556 2052 -1347 -1494 1941 708 -1980 68 1772 -441 -1497 644 1353
1778 1353 -1037 -1461 1356 943 -2174 -465 2227 -664 -2106 1374 1469 -1693 -673 1865 395 -1582
1794 -1582 73 1815 -261 -1815 937 1780 -1632 -1234 2149 380 -2237 452 1865 -1002 -1403 1104
1810 1104 979 -1321 -983 1389 530 -1956 -168 2033 -721 -1874 1500 1324 -1757 -370 1929 46
1826 46 -1466 459 1529 -529 -1423 1017 1365 -1605 -958 2074 121 -2229 731 1803 -1381 -1243
1842 -1243 1515 607 -1639 -469 1484 4 -1858 233 1804 -1030 -1657 1723 1118 -1982 -67 2156
1858B156k500j133K441M00k280j29K218k58k483Q90K539j956j999K909Q43l168
1874a510M65K735j320k039J630J448j755j199J993R95k553k80L081q54k841K143
1890A39K024k809q09K820j87k451O44K020r35k028J308J970k113j517K921M86
1906A483l187Q25K800j815j869K194J012k132n52K043K98k260J31K602j007k473
$$ plain form
1858 2156 -344 -1477 964 1364 -916 -1045 1173 915 -1568 -678 1861 -95 -2094 815 1658 -1510
1874 -1510 -1045 1690 370 -1669 -39 1409 -346 -1545 448 1443 -1110 -1390 1691 837 -2004 139
1890 139 2163 -646 -1455 1365 1178 -1273 -629 1391 456 -1572 -264 1706 -407 -1924 997 1483
1906 1483 -1704 -879 1921 106 -1763 431 1443 -689 -1241 802 1100 -1160 -1029 1573 566 -1907
$$ [...]
8191a55
##END NTUPLES=NMR FID
##END=
