##TITLE=1H_AM_NVACET01880
 CDCL3
 8 sc, 
 11.04.2022
##JCAMPDX= 6.0         $$ Bruker NMR JCAMP-DX V2.0
##DATA TYPE= NMR FID
##DATA CLASS= NTUPLES
##ORIGIN= UXNMR, Bruker Analytische Messtechnik GmbH
##OWNER= root
$$ XWIN-NMR		Version 3.5
$$ Mon Apr 11 13:43:00 2022 Russian Standard Time (UT+4h)  she@DPX200
##.OBSERVE FREQUENCY= 200.13135
##.OBSERVE NUCLEUS= ^1H
##.DELAY= (6, 6)
##.ACQUISITION MODE= SIMULTANEOUS
##.ACQUISITION SCHEME= undefined
##.AVERAGES= 8
##.DIGITISER RES= 18
##SPECTROMETER/DATA SYSTEM= spect
##.PULSE SEQUENCE= zg30
##.SOLVENT NAME= CDCl3
##.SHIFT REFERENCE= (INTERNAL, CDCl3, 0, 15.7039)
##AUDIT TRAIL= $$ (NUMBER, WHEN, WHO, WHERE, WHAT)
$$ ##TITLE= Audit trail, XWIN-NMR		Version 3.5
$$ ##JCAMPDX= 5.01
$$ ##ORIGIN= Bruker BioSpin GmbH
$$ ##OWNER= she
$$ F:/spectra/data/she/nmr/H-F/1/audita.txt
$$ ##AUDIT TRAIL=  $$ (NUMBER, WHEN, WHO, WHERE, WHAT)
(   1,<2022-04-11 13:41:38.34 +0400>,<she>,<DPX200>,
      <created by zg, POWCHK disabled, PULCHK disabled
       configuration hash MD5:
       00 E9 B6 7A A2 85 ED C7 34 08 36 98 17 FE 4E 26
       data hash MD5: 16K
       98 2C D7 81 95 25 5C EE 64 B9 50 CF C8 D9 B4 AE>)
$$ ##END=
$$ 
$$ hash MD5
$$ 7E AF 2B FF E8 B2 BB 0A 86 66 0D 0D E8 C3 06 16
##$RELAX= 
##$RELAX= 
##$RELAX= 
##$RELAX= 
##$RELAX= 
##$RELAX= 
$$ Bruker specific parameters
$$ --------------------------
##$DU= <F:/spectra>
##$EXPNO= 1
##$NAME= <H-F>
##$PROCNO= 1
##$TYPE= <nmr>
##$USER= <she>
##$AMP= (0..31)
100 100 100 100 100 100 100 100 100 100 100 100 100 100 100 100 100 100 
100 100 100 100 100 100 100 100 100 100 100 100 100 100 
##$AQSEQ= 0
##$AQ_mod= 1
##$AUNM= <au_zg>
##$AUTOPOS= <>
##$BF1= 200.13
##$BF2= 200.13
##$BF3= 200.13
##$BF4= 200.13
##$BF5= 200.13
##$BF6= 200.13
##$BF7= 200.13
##$BF8= 200.13
##$BYTORDA= 1
##$CFDGTYP= 0
##$CFRGTYP= 5
##$CHEMSTR= <none>
##$CNST= (0..31)
1 1 145 1 1 1 1 1 1 1 1 1 1 1 1 1 1 1 1 1 1 1 1 1 1 1 1 1 1 1 1 1 
##$CPDPRG= <>
##$CPDPRG1= <>
##$CPDPRG2= <>
##$CPDPRG3= <>
##$CPDPRG4= <mlev>
##$CPDPRG5= <mlev>
##$CPDPRG6= <mlev>
##$CPDPRG7= <mlev>
##$CPDPRG8= <mlev>
##$CPDPRGB= <>
##$CPDPRGT= <>
##$D= (0..31)
0 1.2 0 0 0 0 0 0 0 0.06 0 0.03 0 0 0 0 0.0002 0 0 0 0 0 0 0 0 0 0 0 0 
0 0 0 
##$DATE= 1649670097
##$DBL= (0..7)
120 120 120 120 120 120 120 120 
##$DBP= (0..7)
150 150 150 150 150 150 150 150 
##$DBP07= 0
##$DBPNAM0= <>
##$DBPNAM1= <>
##$DBPNAM2= <>
##$DBPNAM3= <>
##$DBPNAM4= <>
##$DBPNAM5= <>
##$DBPNAM6= <>
##$DBPNAM7= <>
##$DBPOAL= (0..7)
0.5 0.5 0.5 0.5 0.5 0.5 0.5 0.5 
##$DBPOFFS= (0..7)
0 0 0 0 0 0 0 0 
##$DE= 6
##$DECBNUC= <off>
##$DECIM= 32
##$DECNUC= <off>
##$DECSTAT= 4
##$DIGMOD= 1
##$DIGTYP= 9
##$DL= (0..7)
0 120 120 120 120 120 120 120 
##$DP= (0..7)
150 150 150 150 150 150 150 150 
##$DP07= 0
##$DPNAME0= <>
##$DPNAME1= <>
##$DPNAME2= <>
##$DPNAME3= <>
##$DPNAME4= <>
##$DPNAME5= <>
##$DPNAME6= <>
##$DPNAME7= <>
##$DPOAL= (0..7)
0.5 0.5 0.5 0.5 0.5 0.5 0.5 0.5 
##$DPOFFS= (0..7)
0 0 0 0 0 0 0 0 
##$DQDMODE= 0
##$DR= 18
##$DS= 0
##$DSLIST= <SSSSSSSSSSSSSSS>
$$ [...]
##$SUBNAM2= <"">
##$SUBNAM3= <"">
##$SUBNAM4= <"">
##$SUBNAM5= <"">
##$SUBNAM6= <"">
##$SUBNAM7= <"">
##$SUBNAM8= <"">
##$SUBNAM9= <"">
##$SW= 18.05172834244
##$SWIBOX= (0..15)
0 0 2 0 0 0 0 0 0 0 0 0 0 0 0 0 
##$SW_h= 3612.71676300578
##$TD= 16384
##$TD0= 1
##$TE= 0
##$TE2= 300
##$TE3= 300
##$TEG= 300
##$TL= (0..7)
0 120 120 120 120 120 120 120 
##$TP= (0..7)
150 150 150 150 150 150 150 150 
##$TP07= 0
##$TPNAME0= <>
##$TPNAME1= <>
##$TPNAME2= <>
##$TPNAME3= <>
##$TPNAME4= <>
##$TPNAME5= <>
##$TPNAME6= <>
##$TPNAME7= <>
##$TPOAL= (0..7)
0.5 0.5 0.5 0.5 0.5 0.5 0.5 0.5 
##$TPOFFS= (0..7)
0 0 0 0 0 0 0 0 
##$TUNHIN= 0
##$TUNHOUT= 0
##$TUNXOUT= 0
##$USERA1= <user>
##$USERA2= <user>
##$USERA3= <user>
##$USERA4= <user>
##$USERA5= <user>
##$V9= 5
##$VALIST= <valist>
##$VCLIST= <CCCCCCCCCCCCCCC>
##$VD= 0
##$VDLIST= <DDDDDDDDDDDDDDD>
##$VPLIST= <PPPPPPPPPPPPPPP>
##$VTLIST= <TTTTTTTTTTTTTTT>
##$WBST= 1024
##$WBSW= 4
##$XGAIN= (0..3)
0 0 0 0 
##$XL= 0
##$YL= 0
##$YMAX_a= 48813
##$YMIN_a= -54517
##$ZGOPTNS= <>
##$ZL1= 120
##$ZL2= 120
##$ZL3= 120
##$ZL4= 120
##$ABSF1= 10
##$ABSF2= 0
##$ABSG= 5
##$ABSL= 3
##$ALPHA= 0
##$AQORDER= 0
##$ASSFAC= 0
##$ASSFACI= 0
##$ASSFACX= 0
##$ASSWID= 0
##$AUNMP= <proc_1d>
##$AZFE= 0.1
##$AZFW= 0.1
##$BCFW= 1
##$BC_mod= 2
##$BYTORDP= 1
##$COROFFS= 0
##$CY= 11.3945322036743
##$DATMOD= 1
##$DC= 2
##$DFILT= <>
##$DTYPP= 0
##$F1P= 2.36226072786647
##$F2P= -0.459571619588291
##$FCOR= 0.5
##$FTSIZE= 0
##$FT_mod= 4
##$GAMMA= 1
##$GB= 0.15
##$INTBC= 1
##$INTSCL= 1
##$ISEN= 128
##$LB= 0.24
##$LEV0= 0
##$LPBIN= 0
##$MAXI= 10000
##$MC2= 0
##$MEAN= 0
##$ME_mod= 0
##$MI= 1.114404
##$NCOEF= 0
##$NC_proc= 0
##$NLEV= 6
##$NOISF1= 3.799351
##$NOISF2= 2.8
##$NSP= 1
##$NTH_PI= 0
##$NZP= 0
##$OFFSET= 15.70392
##$PC= 1
##$PHC0= -18296.62
##$PHC1= 5.800779
##$PH_mod= 1
##$PKNL= yes
##$PPARMOD= 0
##$PSCAL= 0
##$PSIGN= 0
##$REVERSE= no
##$SF= 200.130013532006
##$SI= 16384
##$SIGF1= 3
##$SIGF2= 2
##$SINO= 400
##$SIOLD= 16384
##$SREGLST= <1H.CDCl3>
##$SSB= 0
##$STSI= 0
##$STSR= 0
##$SW_p= 3612.71676300578
##$SYMM= 0
##$S_DEV= 0
##$TDeff= 0
##$TDoff= 0
##$TI= <>
##$TILT= no
##$TM1= 0
##$TM2= 0
##$TOPLEV= 0
##$USERP1= <user>
##$USERP2= <user>
##$USERP3= <user>
##$USERP4= <user>
##$USERP5= <user>
##$WDW= 1
##$XDIM= 8192
##$YMAX_p= 0
##$YMIN_p= 0
$$ End of Bruker specific parameters
$$ ---------------------------------
##NTUPLES= NMR FID
##VAR_NAME=  TIME,          FID/REAL,        FID/IMAG
##SYMBOL=    X,             R,               I
##VAR_TYPE=  INDEPENDENT,   DEPENDENT,       DEPENDENT
##VAR_FORM=  AFFN,          ASDF,            ASDF
##VAR_DIM=   8192,          8192,            8192
##UNITS=     SECONDS,       ARBITRARY UNITS, ARBITRARY UNITS
##FACTOR=    0.0002768,     1,               1
##FIRST=     0,             0,               0
##LAST=      2.2672688,     0,               0
##MIN=       0,             -54517,          0
##MAX=       2.2672688,     48813,           0
$$ Real data points
##PAGE= N=1
##DATA TABLE= (X++(R..R)), XYDATA
$$ [...]
$$ plain form
2240 -377 -1623 361 2391 1328 -1208 -1577 76 437 -1110 -1671 -124 645 -851 -1611 466 2521
2256 2521 1416 -1090 -1066 1260 2011 5 -1663 -680 714 -33 -1208 -210 1457 691 -1330 -948 1486
2273 1486 2056 -419 -2250 -961 1061 601 -1303 -1270 500 897 -433 -401 1417 1945 -220 -1736 -179
2290 -179 1826 913 -1695 -2052 76 1256 -8 -987 165 1331 290 -982 128 1745 738 -1837
2306 -1837 -1984 374 1560 -199 -1886 -836 1231 1166 -289 -188 1225 962 -937 -1169 846 1542 -557
2323 -557 -2322 -990 1414 1343 -718 -1300 430 1262 -52 -927 265 1049 -525 -1911 -566 1641 1196
2340 1196 -1106 -1490 738 2239 920 -871 -373 954 342 -1182 -849 688 289 -1737 -1897 434
2356 434 1895 373 -1566 -781 1417 1573 -259 -910 393 880 -464 -1049 536 1603 37 -1751
$$ packed form
2240c77j246J984K030j063k536l69J653L61j547n61J547P69j496p60K077K055
2256B521j105k506K4K326P51k006j668R83J394p47j175R98J667p66k021L82K434
2273A486N70k475j831J289K022m60j904L3J770L97j330L2J818N28k165j516J557
2290a79K005r13k608l57K128J180j264r79J152J166j041j272J110J617j007k575
2306a837j47K358J186j759j687J050K067o5j455J01J413k63j899k32K015O96k099
2323e57j765J332K404p1k061n82J730Q32j314q75J192P84j574j386J345K207m45
2340A196k302l84K228J501j319j791M98J327o12j524L33J537l99k026j60K331
2356D34J461j522j939P85K198J56j832o51J303M87j344n85J585J067j566j788
$$ plain form
2372 -1751 -670 1647 1576 -752 -1876 -343 1008 -26 -1353 -617 713 73 -1160 -303 1769 1597
2388 1597 -664 -1406 567 2070 753 -1393 -1192 541 717 -732 -946 467 735 -859 -1364 500
2404 500 1827 334 -1766 -1206 1054 1576 -291 -1380 -35 1168 301 -707 247 1357 254 -1491
2420 -1491 -896 1209 1360 -869 -2102 -496 1357 694 -1030 -800 730 763 -527 -411 1149 1277 -707
2437 -707 -1574 154 1834 732 -1477 -1462 573 1236 -270 -1163 -52 738 -382 -1229 92 1495 443
2454 443 -1511 -1086 1222 1905 15 -1395 -296 1265 712 -730 -486 718 268 -1252 -1034 845 1236
2471 1236 -721 -1994 -471 1508 1012 -913 -1154 564 1228 -9 -507 689 1200 -236 -1248 -19
2487 -19 1565 661 -1597 -1839 242 1269 -217 -1519 -565 799 350 -687 6 1369 812 -946 -887
$$ packed form
2372a751J081K317p1k328j124J533J351j034j327P36J330o40j233Q57K072j72
2388A597k261p42J973J503j317k146K01J733J76j449k14J413K68j594n05J864
2404E00J327j493k100N60K260N22j867j089J345J203q67j008R54J110j103j745
2420a491N95K105J51k229j233J606J853o63j724K30J530L3j290J16J560J28j984
2437g07q67J728J680j102k209J5K035O63j506q93J111P90j120q47J321J403j052
2454D43j954M25K308O83j890j410J099J561n53j442K44J204m50j520K18J879L91
2471A236j957j273J523J979m96j925k41J718O64j237m98J196N11j436j012J229
2487a9J584r04k258k42K081J027j486j302R54J364m49j037O93J363n57j758N9
$$ plain form
2504 -887 1145 1917 46 -1650 -631 1248 976 -737 -1050 189 412 -863 -1178 285 955 -592 -1850
2521 -1850 -485 1681 1444 -590 -1023 739 1825 672 -527 80 860 -80 -1343 -597 913 396 -1639
2538 -1639 -1907 212 1560 242 -1388 -734 991 931 -382 -411 784 786 -629 -876 819 1796 209 -1530
2556 -1530 -725 1277 1227 -776 -1603 -319 521 -468 -1161 -94 891 -47 -1167 -209 1810 1650 -454 -1306
2574 -1306 312 1589 449 -1177 -865 340 173 -877 -581 854 866 -792 -1304 486 1779 453
2590 453 -1520 -1175 702 1032 -377 -925 169 859 -84 -668 533 1519 251 -1501 -983 991 1180
2607 1180 -744 -1761 -380 1023 460 -612 -87 956 514 -772 -447 1093 1008 -991 -1912 -300 1342
2624 1342 525 -1133 -912 750 1167 71 -257 734 966 -456 -1255 16 1258 166 -1743 -1451 638
$$ packed form
2504h87K032P72j871j696J019J879k72j713l13J239K23j275l15J463O70j547j258
2521a850J365K166k37k034m33J762J086j153j199O07P80r40j263P46J510n17k035
2538a639k68K119J348j318j630O54J725o0j313k9J195Kj415k47J695R77j587j739
2556a530Q05K002n0k003q27J284Q40r89o93J067R85r38j120R58K019j60k104q52
2574a306J618J277j140j626L12J205j67j050K96J435J2j658n12J790J293j326
2590D53j973L45J877L30j409n48J094O90r43n84J201R86j268j752N18J974J89
2607A180j924j017J381J403n63j072N25J043m42j286L25J540q5j999r21J612J642
2624A342q17j658K21J662M17j096l28R91K32j422p99J271J242j092j909K92K089
$$ plain form
2641 638 1344 -96 -1084 -103 908 282 -656 -99 863 165 -1286 -933 1053 1596 -167 -1336 -26 1584
2659 1584 1063 -550 -731 294 251 -933 -1079 186 564 -835 -1634 -64 1775 1149 -733 -811 837
2676 837 1436 200 -765 -105 526 -274 -1123 -187 1150 510 -1235 -1134 833 1585 -32 -1467 -725 649
2694 649 403 -750 -589 549 558 -558 -489 1124 1735 110 -1339 -390 1270 838 -1017 -1474 -241 445
2712 445 -368 -819 165 937 29 -940 70 1640 1067 -947 -1364 316 1289 146 -1066 -461 658 430
2730 430 -480 -130 980 650 -1010 -1281 377 1246 -235 -1725 -948 818 933 -249 -516 536 987
2747 987 16 -424 573 1193 -153 -1617 -808 1008 881 -883 -1474 -28 1089 405 -574 -113 728 189
2765 189 -855 -388 997 810 -958 -1417 341 1609 584 -952 -612 711 762 -348 -693 212 300 -890
$$ packed form
2641F38P06j440r88R81J011o26r38N57R62o98j451L53J986N43j763j169J310J610
2659A584n21j613j81J025m3j184j46J265L78j399p99J570J839o26j882p8J648
2676H37N99j236r65O60O31q00q49R36J337o40j745J01J967P52j617j435P42J374
2694F49k46j153J61J138Rj116O9J613O11j625j449R49J660m32j855m57J233O86
2712D45q13m51R84P72r08r69J010J570n73k014m17J680R73j143j212O05J119k28
2730D30r10L50J110l30j660k71J658Q69j481j490P77J766J15j182k67J052M51
2747I87r71m40R97O20j346j464Q09J816j27j764n91J446J117o84r79M61Q41n39
2765A89j044M67J385j87j768m59J758J268j025j536L40J323N1j110l45R05Q8j190
$$ plain form
2783 -890 -1247 186 1280 164 -1308 -597 1277 1497 -13 -786 123 820 80 -752 -143 633 -118 -1346
2801 -1346 -732 1003 1096 -642 -1424 -43 1210 534 -758 -651 404 479 -433 -328 847 1005 -435 -1052
2819 -1052 349 1564 524 -1209 -1127 342 721 -430 -1082 -257 430 -199 -778 231 1303 503 -1001
2836 -1001 -603 1119 1424 -153 -1204 -355 826 417 -645 -440 451 232 -803 -639 764 980 -618
2853 -618 -1479 -205 1290 743 -790 -842 446 925 75 -378 437 797 -249 -1044 -33 1177 397 -1311
2871 -1311 -1307 373 1058 -49 -996 -337 647 363 -457 -68 913 449 -843 -760 883 1358 -173 -1318 -432
2890 -432 975 751 -531 -761 209 431 -451 -682 394 835 -387 -1329 -204 1281 855 -769 -1032 313
2908 313 1069 227 -615 -110 625 54 -783 -136 1017 528 -1027 -1156 423 1246 100 -1134 -595 651
$$ packed form
2783h90l57J433J094j116j472P11J874K20j510p73R09O97p40q32O09P76p51j228
2801a346O14J735R3j738p82J381J253o76j292J07J055P5r12J05J175J58j440o17
2819a052J401J215j040j733Q2J469L79j151o52Q25O87o29n79J009J072q00j504
2836a001L98J722L05j577j051Q49J181m09j062K05Q91k19j035J64J403K16j598
2853f18q61J274J495n47j533n2J288M79q50m53Q15L60j046p95J011J210p80j708
2871a311MJ680O85j107r47O59R84k84q20L89R81m64j292Q3J643M75j531j145Q86
2890d32J407k24j282k30R70K22q82k31J076M41j222r42J125J485m26j624k63J345
2908C13P56q42q42N05P35n71q37O47J153m89j555j29J579Q23j146j234N39J246
$$ plain form
2926 651 657 -324 -423 459 529 -535 -746 552 1175 -136 -1344 -537 1015 954 -510 -1006 38 723 43
2945 43 -576 86 707 -110 -1057 -288 1130 873 -734 -1125 246 1237 458 -724 -446 478 308 -589 -410
2964 -410 556 416 -899 -1105 367 1288 230 -1090 -627 812 1024 -117 -602 153 584 -192 -683 246
2982 246 930 12 -1188 -622 955 1040 -484 -1220 -186 799 253 -665 -348 468 163 -623 -223 1019 957
3001 957 -466 -1071 212 1281 452 -972 -919 224 477 -409 -664 215 501 -405 -772 392 1313 391
3019 391 -1021 -733 767 1094 -159 -950 -165 625 169 -515 -28 696 113 -1006 -647 740 879 -568
3037 -568 -1415 -348 954 603 -518 -455 530 716 -123 -205 715 836 -418 -1180 -101 1022 355 -1090
3055 -1090 -1106 274 879 -8 -649 10 575 -42 -655 40 923 273 -1027 -843 665 1232 23 -960 -227
$$ packed form
2926F51Or81r9Q82P0j064k11J298O23j311j208Q07J552o1j464m96J044O85o80
2945D3o19O62O21q17r47P69J418k57j607l91J371R91p79j182K78R24j70q97J79
2964d10R66j40j315k06J472R21j058j320M63J439K12j141m85P55M31p76m91R29
2982B46O84r18j200N66J577Q5j524p36J034R85n46r18L17Q16l05p86M00J242o2
3001I57j423o05J283J069q29j424N3J143K53q86k55Q79K86r06l67J164R21r22
3019C91j412K88J500L27j253p91P85P90m56o84M87P24n83j119L59J387J39j447
3037e68q47J067J302l51j121O3R85J86q39q2R20J21j254p62J079J123o67j445
3055a090j6J380O05q87o41O59N65o17o13O95Q83o50j300J84J508N67j209r83P33
$$ plain form
3074 -227 841 583 -384 -361 355 158 -806 -742 456 789 -412 -1238 -229 1155 909 -431 -736 263 734
3093 734 -78 -547 73 486 -284 -942 -94 1088 663 -769 -934 391 1127 136 -882 -471 394 107 -605
3112 -605 -299 606 378 -656 -632 694 1328 150 -987 -415 790 685 -457 -759 33 340 -331 -540
3130 -540 330 778 -148 -1037 -316 988 776 -670 -1136 10 827 181 -529 -76 629 276 -416 35 959
3149 959 682 -694 -1073 164 958 46 -1138 -799 339 481 -308 -384 390 480 -337 -550 450 1086 110
3168 110 -1061 -552 853 966 -250 -775 8 648 107 -489 -27 489 -146 -1066 -525 663 696 -614 -1113
3187 -1113 79 1128 587 -432 -253 555 514 -285 -260 482 425 -670 -1051 37 1003 231 -1024 -781 518
3206 518 819 -141 -621 23 456 -114 -498 185 894 264 -798 -489 897 1113 -197 -1024 -263 639 210
$$ packed form
3074b27J068k58r67K3P16j97r64O4J198L33j201q26J009J384k46j340l05R99M71
3093G34q12m69O20M13p70o58Q48J182m25j432j65J325P36r91j018M11Q65k87p12
3112f05L06R05k28j034K4J326O34j178j137N72J205j05j142l02P92L07o71k09
3130e40Q70M48r26q89P21J304k12j446m66J146Q17o46p10M53P05l53o92M51R24
3149I59k77j376l79J237P94r12j184L39J138J42p89p6P74R0q17k13J000O36r76
3168A10j171N09J405J13j216n25P83O40n41n96M62N16o35r20N41J188L3j310m99
3187a113J192J049n41j019J79Q08m1p99K5P42n7j095l81J088R66p72j255K43J299
3206E18L01r60m80O44M33n70l84O83P09o30j062L09J386K16j310q27P61R02m29
$$ plain form
3225 210 -656 -512 193 -16 -686 -436 645 825 -305 -918 133 1228 677 -584 -595 367 613 -125 -446
3244 -446 169 427 -335 -815 17 877 245 -1024 -949 384 855 -145 -832 -213 578 287 -252 86 746
3263 746 395 -573 -508 672 988 -264 -1217 -458 701 446 -612 -653 159 315 -260 -363 437 709 -186
3282 -186 -869 -38 1095 669 -640 -808 303 828 82 -573 -127 347 -85 -664 -181 630 265 -870 -899
3301 -899 449 1099 116 -817 -247 732 557 -180 -250 364 317 -476 -557 378 775 -251 -1171 -480 773 683
3321 683 -503 -815 67 556 27 -399 101 561 -9 -659 -110 942 696 -611 -933 205 960 167 -735
3340 -735 -453 306 183 -401 -253 481 376 -565 -703 371 1039 122 -958 -498 655 718 -222 -533 80
3359 80 405 -166 -468 197 669 -61 -927 -438 805 769 -461 -909 2 751 259 -411 -163 389 163 -496
$$ packed form
3225B10q66J44P05k09o70K50J081J80j130o13J051J095n51j261j1R62K46p38l21
3244d46O15K58p62m80Q32Q60o32j269P5J333M71j000o87O19P91k91n39L38O60
3263G46l51r68O5J180L16j252r53P59J159k55j058m1Q12J56n75j03Q00K72q95
3282a86o83Q31J133m26j309j68J111N25p46o55M46M74m32n79M83Q11l65j135k9
3301h99J348O50r83r33N70R79j75p37p0O14m7p93q1R35L97j026r20O91J253r0
3321F83j186l12Q82M89n29m26N00M60n70o50N49J052k46j307l22J138P55p93r02
3340g35K82P59j23n84J48P34j05r41j38J074O68r17j080M60J153O3r40l11O13
3359H0L25n71l02O65M72p30q66M89J243l6j230m48R11P49m92o70K48N52k26o59
$$ plain form
3379 -496 -272 631 582 -597 -982 136 991 314 -761 -572 376 510 -212 -377 158 376 -346 -630 244
3398 244 908 174 -893 -551 696 897 -156 -716 -87 469 82 -430 -106 444 39 -735 -434 715 815
3417 815 -381 -983 -78 831 408 -532 -484 241 330 -255 -263 423 580 -318 -759 122 972 378 -824 -784 292
3438 292 676 -97 -590 -79 385 3 -417 74 773 285 -761 -579 591 912 -160 -907 -306 570 360
3457 360 -348 -296 308 234 -452 -393 484 661 -343 -996 -164 877 551 -474 -566 280 627 35 -290 159
3477 159 444 -215 -764 -125 732 287 -855 -863 306 854 72 -611 -195 462 301 -273 -118 488 278 -581
3497 -581 -577 454 860 -73 -920 -336 683 562 -335 -551 70 268 -269 -450 197 577 -155 -795 -86 952
3517 952 731 -416 -680 199 724 131 -501 -242 240 -49 -583 -182 602 369 -612 -714 362 973 165
$$ packed form
3379d96K24R03m9j179l85J118Q55o77j075J89R48J34p22j65N35K18p22k84Q74
3398B44O64p34j067L42J247K01j053n60O29N56l87n12L24N50m05p74L01J149J00
3417H15j196o02R05R09m23r40M8P25Q9n85qO86J57q98m41Q81Q50n94j202M0J076
3438B92L84p73m93N11M64l82m20M91O99m88j046J82J170L21j072p47O01Q76k10
3457C60p08N2O04p4o86N9Q77J77j004o53Q32J041l26j025r2Q46L47n92l25M49
3477A59K85o59n49O39Q57m45j142qJ169N48p82o83M16O57j61n74J55O06k10q59
3497e81MJ031M06r33q47N84J019j21q97k16O21J98n37j81O47L80p32o40P09J038
3517I52k21j147k64Q79N25n93o32K59M82k89n34M01P84k33r81j02J076O11q08
$$ plain form
3536 165 -738 -414 463 474 -208 -299 258 376 -290 -483 364 840 -40 -934 -491 580 557 -468 -844 -139
3556 -139 429 43 -355 113 591 157 -510 -92 806 664 -464 -833 41 749 204 -584 -385 253 255 -273
3576 -273 -229 379 342 -500 -785 143 801 104 -831 -512 559 731 10 -345 182 484 7 -350 128 575
3596 575 -47 -919 -581 513 623 -355 -822 -106 647 322 -348 -188 336 183 -415 -290 501 594 -361 -766
3616 -766 86 920 455 -534 -553 254 425 -201 -472 -15 223 -362 -667 69 778 276 -638 -435 592 901
3636 901 77 -566 -81 460 153 -372 -156 350 67 -615 -445 505 682 -278 -884 -222 624 367 -463 -499
3656 -499 160 339 -126 -170 452 632 -95 -582 71 861 450 -655 -771 88 486 -115 -611 -206 273 13
3676 13 -436 53 638 315 -575 -558 422 827 -3 -717 -283 519 424 -215 -195 308 276 -354 -399 306 539 -285
$$ packed form
3536A65r03L24Q77J1o82r1N57J18o66j93Q47M76q80q94M43J071k3j025l76P05
3556a39N68l86l98M68M78m34o67M18Q98j42j128l69Q74P08n45p88J99O38Kn28
3576b73M4O08l7q42k85R28O58o97r35L19J071J72p21l55N27L02m77l57M78M47
3596E75o22q72L38J094J10r78m67P16P53l25o70J60N24j53n98J25P91R3r55m05
3616g66Q52Q34m65r89j9Q07J71o26k71M57K38n85l05P36P09n02r14K03J027L09
3636I01q24o43M85N41l07n25K16N06k83o82J70R50J77r60o06O62Q46k57q30l6
3656d99O59J79m65m4O22J80p27m87O53P90m11j105j16Q59L98o01m96M05M79k60
3676A3m49M89N85l23q90J7R80M05q30p14M34Q02r5o39K0N03l2o30m5P05K33q24
$$ plain form
3698 -285 -954 -345 613 462 -403 -599 187 579 143 -223 189 465 -52 -580 -126 643 358 -646 -804 161
3718 161 737 127 -562 -301 374 256 -301 -182 369 242 -499 -562 341 804 103 -658 -324 643 635 -142 -450
3739 -450 78 290 -209 -450 71 391 -184 -776 -254 670 634 -307 -667 84 649 194 -426 -182 281 38
3759 38 -428 -113 552 422 -417 -631 206 844 199 -676 -477 275 362 -272 -364 130 252 -256 -406 274 737
3780 737 141 -664 -410 565 637 -220 -686 -98 406 50 -320 -8 417 45 -515 -225 593 569 -367 -810 -62
3801 -62 629 271 -480 -362 278 327 -171 -167 334 386 -312 -611 96 702 166 -713 -578 306 561 -61 -429 44
3823 44 363 17 -316 89 537 67 -669 -456 454 654 -193 -747 -158 534 295 -309 -218 261 138 -374 -294
3844 -294 367 499 -298 -739 -80 744 426 -427 -482 243 473 -45 -304 81 264 -182 -537 6 621 267
$$ packed form
3698b85o69O09R58j51q65j96P86L92m36l66M12K76n17n28M54P69k85j004j58R65
3718A61N76o10o89K61O75j18n57J19N51j27p41o3R03M63p01p61L34R67qp77l08
3739d50N28K12m99k41N21L20n75n92N22R24l6r41l60P51N65m55o20K44M63k43
3759C8m66L15O65j30q39k14Q37O38o45q75J99P52Q7o34r2M94J22n08j50O80M63
3780G37n96q05K54R75P2q57m66N88N04l56l70L12M25l72n60K90Q18k4r36m43P48
3801f2O91l58p51J18O40M9m98MN01N2o98k99P07O06n36q79J35Q84K55o22l68M73
3823D4L19l46l33M05M48m70p36K13R10K00q47n54N89O92k39o04R1M79j23n12Q0
3844b94O61J32p97m41O59Q24l18q53n5P25K30n18k59L85J83m46l55N43O15l54
$$ plain form
3864 267 -591 -536 373 727 50 -519 -157 354 147 -303 -144 296 89 -476 -410 374 635 -143 -753 -211 612
3885 612 411 -311 -409 102 277 -124 -259 244 471 -136 -572 -69 684 436 -472 -654 117 530 1 -450
3905 -450 -133 241 -4 -351 -27 509 287 -444 -522 324 765 56 -646 -308 379 324 -230 -249 175 177 -296 -336
3927 -336 240 519 -87 -706 -275 578 491 -301 -509 74 440 57 -245 47 351 -10 -479 -147 533 374
3947 374 -479 -692 55 608 146 -489 -251 282 255 -175 -112 333 293 -308 -486 223 674 81 -685 -410 390
3968 390 439 -200 -423 -13 229 -125 -319 84 436 1 -568 -213 594 612 -208 -572 48 567 213 -287 -127
3989 -127 232 55 -377 -222 351 305 -401 -665 27 641 228 -513 -403 323 443 -60 -210 181 296 -137
4009 -137 -376 136 566 87 -626 -462 390 544 -169 -597 -78 336 112 -238 -47 332 53 -411 -229 498
$$ packed form
3864B67q58N5R09L54o77n69L62N11k07m50J59M40k07n65O6P84K61p78o10N42Q23
3885F12k01p22r8N11J75m01j35N03K27o07m36N03P53k48r08j82P71M13n29m51
3905d50L17L74k45l47L24N36k22p31p8Q46M41p09p02L38O87n5n54j9M24Km73m0
3927c36N76K79o06o19M31Q53q7p92k08N83L66l83l02K92L04l61m69L32O80j59
3947C74q53k13P47N53m62o35K38N33k7m30O3M45m0o01j78P09M51n93p66K75Q00
3968C90M9o39k23M10K42l54j94M03L52m35n69L55Q07J8q20l64O20N19l54n00J60
3989a27L59j77m32J55N73m6p06k64O92O14m13p41J10P26J20n03j50L91J15m33
4009a37k39N12M30m79p13J64Q52J54p13m28N19M14k24l50J91L79k79m64J82P27
$$ plain form
4029 498 560 -195 -593 -17 632 331 -329 -335 140 185 -220 -282 168 251 -276 -587 9 640 259 -541 -471 295
4051 295 563 0 -331 20 290 42 -273 42 464 144 -495 -425 354 595 -113 -645 -226 354 200 -301
4071 -301 -264 136 151 -285 -229 353 527 -104 -566 -28 651 463 -349 -429 158 380 -61 -293 10 219 -159
4092 -159 -481 -94 470 204 -545 -586 202 562 27 -465 -186 309 229 -130 -13 375 245 -312 -317 298 587
4113 587 -106 -684 -328 378 295 -306 -430 15 217 -113 -263 160 438 -66 -490 -62 615 480 -268 -491
4133 -491 134 546 131 -327 -132 207 19 -355 -157 310 132 -490 -585 121 585 68 -485 -234 375 470 -9
4154 -9 -114 247 300 -138 -291 216 486 -73 -659 -360 368 386 -294 -567 -102 279 32 -277 -27 300 39
4175 39 -363 -88 556 504 -206 -494 143 641 274 -318 -297 169 128 -280 -302 91 135 -354 -535 121 586 125
$$ packed form
4029D98O2p55l98N76O49l01o60oM75M5m05o2M50Q3n27l11N96O31l81q00P0P66
4051B95K68n63l31L51K70k48l15L15M22l20o39P0P79K41p08n32M19N80j54n01
4071c01L7M00J5m36N6N82J74o31m62N38O79j88q12q0N87K22m41k32L03K09l78
4092a59l22L87N64k66p49m1P88L60n35m92K79M95q0l59J17L88j30n57nO15K89
4113E87o93n78L56P06q3o01j24M45K02l30j50M23K78n04m24M28O77j35p48k23
4133d91O25M12m15m58J95L39j88l74J98M67j78o22r5P06M64n17n53K51O09R5m79
4154ij05L61N3m38j53N07K70n59n86K99P28J8o80k73M65L81k47l09K50L27k61
4175C9m02K75O44n2p10k88O37M98l67n92K1M66m1m08k2L93M4m89j81O56M65m61
$$ plain form
4197 125 -489 -290 403 512 10 -281 57 301 -17 -227 88 393 29 -502 -275 387 456 -247 -623 -167
4217 -167 335 161 -302 -190 198 144 -213 -109 422 443 -183 -468 91 615 218 -484 -473 100 260 -134 -308
4238 -308 23 210 -108 -331 100 539 174 -455 -372 319 519 -47 -458 -97 336 155 -176 -25 282 106
4258 106 -353 -282 303 375 -238 -667 -192 442 258 -256 -304 203 306 -48 -127 235 351 -166 -478 -33 507
4279 507 239 -454 -485 168 492 70 -289 -14 285 44 -261 -40 359 127 -464 -427 264 545 8 -492 -170
4300 -170 371 327 -148 -224 142 121 -260 -278 206 402 -98 -508 -73 548 466 -195 -361 119 345 -7 -285 -57
4322 -57 164 -139 -432 -81 425 283 -324 -394 225 592 178 -349 -179 237 169 -213 -152 226 153 -289 -300 240
4344 240 535 12 -526 -296 307 326 -240 -417 -27 189 -63 -194 178 421 73 -366 -53 518 429 -270 -516
$$ packed form
4197A25o14J99O93J09n02k91L38K44l18k10L15L05l64n31K27O62O9p03l76M56
4217a67N02j74m63J12L88n4l57J04N31K1o26k85N59N24l97p02J1N73J60l94j74
4238c08L31J87l18k23M31M39l65o29Q3O91K00n66m11L61M33j81l31J51L07j76
4258A06m59P1N85P2o13m29M75O34j84n14m8N07J03l54p9L62J16n17l12M45N40
4279E07k68o93l1O53L24m22l59K75K99k41l05K21L99k32n91L7O91K81n37n00L22
4300a70N41m4m75p6L66k1l81j8M84J96n00m10M35O21q2o61j66M80K26l52k78K28
4322e7K21l03k93L51N06j42o07p0O19L67m14n27J70M16o8l82O1L78p3m42j1N40
4344B40K95n23n38K30O03J9n66j77L90K16k52j31L72K43l48m39L13N71q9o99k46
$$ plain form
4365 -516 -58 339 16 -385 -183 156 46 -240 -80 396 296 -276 -446 123 531 157 -463 -306 254 326
4385 326 -36 -162 158 232 -142 -264 127 350 -69 -609 -385 242 371 -193 -423 -34 378 169 -106 83
4405 83 349 89 -311 -150 361 347 -291 -559 -44 470 185 -309 -280 176 186 -139 -181 137 175 -277 -446 51
4427 51 478 215 -345 -282 357 512 26 -269 -21 180 -63 -317 -45 199 -52 -471 -302 336 480 -63 -419
4448 -419 -43 426 264 -186 -162 175 86 -242 -197 227 326 -178 -457 -30 474 246 -365 -416 38 263 -112 -285
4470 -285 19 202 -86 -228 114 534 269 -304 -298 261 467 -30 -497 -244 137 0 -262 -114 181 84 -285
4491 -285 -200 308 448 -46 -463 -126 409 313 -187 -289 109 258 -44 -126 191 280 -135 -447 -135 338 169
4512 169 -427 -521 4 364 61 -245 -33 296 137 -139 51 376 201 -329 -375 148 440 6 -461 -245 278
$$ packed form
4365e16M58L97l23m01K02L39j10k86J60M76j00n72j70N69M08l74o20J57N60P2
4385C26l62j26L20P4l74j22L91K23m19n40K24O27J29n64k30L89M12k09k75J89
4405H3K66k60m00J61N11j4o38k68N15N14k85m94K9M56J0l25m2L18L8m52j69M97
4427E1M27k63n60O3O39J55m86k95K48K01k43k54K72K44k51m19J69O38J44n43l56
4448d19L76M69j62m50K4L37q9l28M5M24R9n04k79M27N04k28o11n1M54K25l75j73
4470b85L04J83k88j42L42M20k65n73ON59K06m97m67K53L81j37k62J48K95r7l69
4491b85Q5N08J40m94m17L37N35r6n00j02L98J49l02q2L17Q9m15l12L12M73j69
4512A69n96r4N25L60l03l06K12L29j59k76J90L25j75n30m6N23K92m34m67K16N23
$$ plain form
4533 278 262 -153 -186 134 165 -171 -235 137 365 -60 -442 -154 466 392 -148 -341 83 330 43 -193 -46 144
4555 144 -87 -368 -158 316 233 -327 -444 97 475 148 -295 -146 208 189 -137 -122 205 145 -219 -281 188 478
4577 478 89 -396 -248 306 354 -149 -327 -19 166 -96 -243 35 263 -39 -362 -155 409 392 -186 -418 18
4598 18 386 167 -213 -95 191 104 -187 -82 256 237 -251 -437 16 412 107 -429 -341 136 249 -74 -168 102
4620 102 239 -68 -153 186 460 130 -371 -253 316 387 -93 -433 -135 213 40 -261 -107 139 -8 -321 -215
4641 -215 304 366 -151 -395 22 479 310 -184 -185 185 209 -111 -177 87 154 -233 -402 -44 370 107 -398 -342
4663 -342 151 371 13 -247 -2 271 75 -110 115 354 169 -281 -227 258 405 -84 -504 -231 181 82 -290
4684 -290 -244 83 93 -181 -168 248 371 -63 -370 -3 462 295 -254 -316 113 299 22 -164 47 165 -53
$$ packed form
4533B78j6m15l3L20L1l36o4L72K28m25l82K88O20p4n40j93M24K47k87k36J47J90
4555A44k31k81K10M74q3n60j17N41L78l27m43J49L54j9l26J5L27o0l64o2M69K90
4577D78l89m85J48N54M8n03j78L08J85k62j47K78K28l02l23K07N64j7n78k32M36
4598A8L68k19l80J18K86q7k91J05L38j9m88j86M53L96l05n36Q8M77J13l23r4K70
4620A02J37l07q5L39K74l30n01J18N69P1m80l40K98L48j73l01J54K46j47l13J06
4641b15N19O2n17k44M17M57j69m94jL70K4l20o6K64O7l87j69L58M14k63n05N6
4663c42M93K20l58k60K45K73j96j85K25K39j85m50N4M85J47m89m20K73M12r9l72
4684b90M6L27J0k74J3M16J23m34l07L67M65j67n49o2M29J86k77j86K11J18k18
$$ plain form
4705 -53 -319 -20 298 97 -383 -408 132 393 26 -297 -70 285 214 -56 2 247 125 -263 -268 158 320 -125
4727 -125 -500 -233 271 251 -181 -241 62 227 -42 -129 108 225 -89 -365 -67 372 302 -218 -352 97 395
4748 395 95 -231 -119 96 -22 -259 -120 190 125 -291 -308 163 498 155 -281 -126 297 266 -113 -225 2
4769 2 76 -227 -278 92 286 -46 -372 -147 379 342 -127 -344 -9 235 -6 -197 -21 194 38 -234 -62 371
4791 371 313 -203 -395 9 328 39 -387 -301 57 104 -108 -108 231 276 -65 -177 215 432 94 -394 -301 141
4813 141 215 -174 -347 -88 157 -21 -149 85 348 48 -317 -154 293 324 -159 -378 -30 379 198 -88 -10
4834 -10 219 171 -141 -126 170 113 -339 -526 -97 274 93 -348 -270 204 333 98 -49 148 245 -48 -222 55
4856 55 289 13 -444 -319 185 334 -44 -324 -50 222 120 -171 -95 128 7 -311 -210 257 355 -50 -284
$$ packed form
4705e3k66K99L18k01m80k5N40K61l67l23K27L55p1k70N8K45j22l88nM26J62m45
4727a25l75K67N04k0m32o0L03J65k69q7K37J17l14k76K98M39p0n20j34M49K98
4748C95l00l26J12K15j18k37J39L10o5m16j7M71L35l43m36J55M23l1l79j12K27
4769BP4l03n1L70J94l32l26K25N26l7m69k17L35K44k41j91J76K15j56k72J72M33
4791C71n8n16j92M04L19k89m26Q6L58M7k12%L39M5l41j12L92K17l38m88R3M42
4813A41P4l89j73K59K45j78j28K34K63l00l65J63M47L1m83k19L48M09j81k86P8
4834a0K29m8l12J5K96n7m52j87M29L71j81m41P8M74J29k35j47J97R7k93j74K77
4856E5K34k76m57J25N04J49l78k80K74K72j02k91P6K23j21l18J01M67R8m05k34
$$ plain form
4877 -284 48 439 311 -118 -231 48 70 -187 -277 -21 47 -226 -370 -16 406 221 -209 -237 204 389 44
4898 44 -256 -85 140 -21 -221 -7 270 94 -246 -204 219 382 -36 -406 -228 171 106 -230 -238 56 117 -90
4920 -90 -95 290 403 21 -274 -32 365 203 -278 -396 -41 151 -71 -214 -4 181 -36 -197 20 322 175
4941 175 -288 -342 86 316 12 -272 -145 220 211 -32 -38 228 160 -208 -240 105 245 -112 -445 -232 244 264 -98
4964 -98 -198 114 277 61 -69 125 235 -54 -379 -132 240 173 -274 -388 26 319 114 -181 -77 141 45
4985 45 -195 -89 186 96 -261 -309 111 417 179 -216 -144 233 280 -62 -201 11 34 -200 -237 44 236 2
5007 2 -316 -126 290 345 -42 -277 -24 241 36 -192 -69 123 -40 -243 -100 284 269 -156 -310 42 357
5028 357 121 -255 -239 80 120 -127 -102 142 158 -128 -200 123 373 114 -292 -229 154 269 -56 -268 -35 161
$$ packed form
4877b84L32L91j28m29j13K79K2k57r0K56O8k73j44L54M22j85m30k8M41J85l45
4898D4l00J71K25j61k00K14K77j76l40M2M23J63m18l70J78L99o5l36qK94O1k07
4920i0nL85J13l82k95K42L97j62m81j18L55J92k22j43K10J85k17j61K17L02j47
4941A75m63n4M28K30l04k84J27L65rk43oK66o8l68l2L45J40l57l33K13M76K0l62
4964i8j00L12J63k16j30J94J10k89l25K47L72o7m47j14M14K93k05k95J04K18r6
4985D5k40J06K75r0l57m8M20L06k38l95P2L77M7l42j39K12K3k34l7K81J92k34
5007Bl18J90M16N5l87k35K53K65k05k28J23J92j63k03J43L84j5m25j54L52L15
5028C57k36l76J6L19M0k47K5K44J6k86p2L23K50k59m06O3L83J15l25k12K33J96
$$ plain form
5050 161 -2 -112 62 275 50 -271 -157 235 283 -148 -395 -125 208 139 -182 -130 129 122 -112 -79 225 249
5072 249 -119 -333 3 313 151 -265 -271 98 229 -19 -147 32 163 -59 -215 45 298 97 -282 -237 197
5093 197 352 16 -255 -45 227 116 -143 -79 92 15 -272 -225 152 199 -135 -395 -94 287 215 -162 -188 99
5115 99 184 -33 -78 150 198 -90 -258 -14 325 165 -281 -334 44 246 4 -260 -104 119 30 -167 7 280
5137 280 125 -221 -209 199 342 33 -313 -137 197 133 -136 -173 48 69 -151 -181 105 219 -76 -329 -84 313
5159 313 269 -146 -247 64 267 78 -134 25 153 -31 -227 -65 207 124 -273 -318 58 322 78 -247 -131
5180 -131 174 148 -76 -64 149 99 -208 -210 109 304 49 -316 -175 205 237 -85 -250 5 110 -71 -165 17
5202 17 202 -15 -245 -89 288 282 -112 -297 12 277 85 -201 -129 91 32 -140 -58 208 181 -137 -239 97
$$ packed form
5050A61j63j10J74K13k25l21J14L92M8m31k47K70L33o9l21N2K59pk34L3L04K4
5072B49l68k14L36L10j62m16oL69J31k48j28J79J31k22j56K60K53k01l79M5M34
5093A97J55l36k71K10K72j11k59O4J71p7k87M7L77M7l34k60L01L81p2l77k6K87
5115I9Q5k17m5K28M8k88j68K44L39j60m46n3L78K02k42k64J56K23q9j97J74K73
5137B80j55l46J2M08J43l09l46J76L34o4k69l7K21K1k20l0K86J14k95k53K45L97
5159C13m4m15j01L11K03j89k12J59J28j84j96J62K72q3l97m5L76K64k44l25J16
5180a31L05k6k24J2K13n0l07kL19J95k55l65J41L80L2l22j65K55J05j81r4J82
5202A7J85k17k30J56L77ol94j85L09K65j92k86P2K20n9j72Q2K66k7l18j02L36
$$ plain form
5224 97 351 109 -277 -225 122 192 -97 -164 8 130 -89 -131 128 277 36 -296 -220 197 245 -129 -328 -51
5246 -51 178 66 -110 30 209 80 -152 -58 241 240 -150 -357 -59 258 103 -215 -227 86 151 -53 -62 120 165
5269 165 -118 -238 3 272 67 -296 -236 169 292 47 -165 34 194 53 -133 -19 148 -25 -309 -238 135
5290 135 248 -83 -287 -38 278 203 -55 -81 126 122 -104 -135 149 174 -151 -331 -47 304 183 -191 -245 109
5312 109 197 -38 -170 -56 89 -75 -206 12 275 125 -171 -151 242 355 36 -279 -136 132 23 -167 -150
5333 -150 42 4 -189 -170 166 279 -28 -284 -42 284 217 -112 -221 32 143 -13 -133 90 205 -45 -216
5354 -216 -20 271 184 -273 -357 -33 185 -13 -247 -107 125 85 -77 12 226 157 -190 -192 139 293 -20 -308
5376 -308 -165 133 176 -96 -146 86 113 -59 -136 115 222 -77 -310 -121 236 228 -134 -231 32 227 84 -85
$$ packed form
5224I7K54k42l86N2L47P0k89o7J72J22k19m2K59J49k41l32P6M17M8l74j99K77
5246e1K29j12j76J40J79j29k32R4K99jl90k07K98L17j55l18j2L13O5k04rJ82M5
5269A65k83j20K41K69k05l63O0M05J23k45k12J99J60j41j86J14J67j73k84P1L73
5290A35J13l31k04K49L16p5k58k6K07mk26l1K84K5l25j80K84L51j21l74n4L54
5312A09Q8k35j32J14J45j64j31K18K63j50k96K0L93J13l19l15J43K68j09j90J7
5333a50J92l8j93J9L36J13l07k56K42L26o7l29j09K53J11j56j20K23J15k50j71
5354b16J96K91q7m57q4L24K18j98k34J40K32m0j62Q9K14o9l47kL31J54l13k88
5376c08J43K98M3k72n0K32K7j72p7K51J07k99k33J89L57ql62r7K63J95j43j69
$$ plain form
5398 -85 4 156 -15 -221 -108 162 115 -221 -348 27 294 84 -203 -111 170 174 -32 -55 130 110 -132 -196 113
5421 113 301 63 -295 -149 209 258 -57 -211 -33 96 -64 -184 -14 115 -33 -254 -127 271 293 -98 -219
5442 -219 41 276 131 -153 -104 60 35 -171 -114 137 122 -185 -243 39 318 103 -223 -192 103 209 -24 -112
5464 -112 26 119 -15 -107 100 267 66 -243 -174 190 216 -103 -313 -140 141 58 -149 -52 145 61 -142 -81 241
5487 241 240 -89 -291 -32 259 149 -185 -177 60 130 -44 -108 50 146 -114 -268 25 253 90 -257 -240 138 239
5510 239 33 -168 -45 133 66 -97 6 165 39 -241 -181 160 218 -43 -297 -110 196 128 -134 -149 17 85
5532 85 -111 -102 105 173 -94 -258 -1 311 205 -169 -233 69 207 42 -130 -12 121 -28 -190 -6 197 81
5554 81 -232 -222 86 250 23 -226 -96 140 107 -90 -40 155 125 -139 -150 171 272 -34 -289 -113 195 135
$$ packed form
5398h5Q9J52j71k06J13K70m7l36j27L75K67k10k87R2K81Mk06k3J85k0k42o4L09
5421A13J88k38l58J46L58M9l15j54J78J29j60j20J70J29j48k21J27L98K2l91j21
5442b19K60K35j45k84M9J64k5k06N7K51j5l07n8K82K79k15l26L1K95J06k33q8
5464a12J38R3j34r2K07J67k01l09O9L64K6l19k10J73K81q3k07R7J97q4k03O1L22
5487B41jl29k02K59K91j10l34QK37P0j74o4J58R6k60j54K93K28j63l47J7L78J01
5510B39k06k01J23J78o7j63J03J59j26k80O0L41N8k61k54J87L06o8k62j5J66O8
5532H5j96RK07O8k67j64K57L12j06l74o4L02J38j65j72J18J33j49j62J84K03j16
5554H1l13J0L08J64k27k49J30K36l3j97N0J95l0k64j1L21J01l06k55J76L08o0
$$ plain form
5576 135 -135 -223 -2 116 -10 -122 59 171 -20 -187 -10 276 207 -151 -199 69 280 51 -162 -84 99
5597 99 26 -167 -76 142 81 -201 -227 70 248 43 -242 -118 197 232 -21 -128 84 128 -43 -119 77 207 -60
5620 -60 -298 -155 191 165 -105 -249 -22 188 52 -101 -7 149 4 -139 -8 218 200 -145 -262 51 281
5641 281 102 -189 -153 76 100 -107 -142 55 80 -141 -198 74 289 52 -261 -150 167 219 -31 -195 -25 141
5663 141 26 -103 25 170 -7 -225 -67 229 262 -90 -272 -28 194 75 -140 -98 78 69 -126 -56 181 158
5685 158 -130 -221 7 259 99 -238 -203 91 200 -22 -129 47 134 -65 -171 68 233 16 -241 -224 137
5706 137 239 -65 -237 -54 189 97 -93 -33 124 59 -126 -113 177 200 -99 -287 -42 241 132 -158 -176 52
5728 52 120 -55 -134 33 103 -102 -236 39 262 132 -173 -201 105 258 43 -155 -56 88 7 -119 -34 125 23
$$ packed form
5576A35k70q8K21J18j26j12J81J12j91j67J77K86o9l58m8K68K11k29k13P8J83
5597I9p3j93R1K18o1k82k6K97J78k05k85J24L15L5k53j07K12M4j71p6J96J30k67
5620f0k38J43L46k6k70j44K27K10j36j53R4J56j45j43J31K26j8l45j17L13K30
5641B81j79k91L6K29K4k07l5J97K5k21n7K72K15k37l13J11L17N2k50j64J70J66
5663A41j15j29J28J45j77k18J58K96L3l52j82K44K22j19k15M2J76rj95P0K37k3
5685A58k88r1K28K52j60l37L5K94J09k22j07J76Q7j99j06K39J65k17k57J7L61
5706A37J02l04j72J83K43r2j90O0J57o5j85J3K90K3k99j88K45K83j09k90j8K28
5728E2O8j75p9J67P0k05j34K75K23j30l05k8L06J53k15j98R9J44q1j26Q5J59j02
$$ plain form
5751 23 -228 -161 109 277 -36 -248 -97 199 174 -86 -114 62 89 -49 -74 144 195 -65 -254 -51 237 171 -185
5774 -185 -253 2 127 -20 -138 -39 100 -29 -142 21 251 133 -173 -202 108 279 37 -246 -117 120 75
5795 75 -105 -78 88 50 -131 -135 116 272 -17 -274 -122 239 217 -73 -176 3 147 14 -72 78 162 -11 -260
5818 -260 -89 175 119 -210 -288 -13 235 40 -174 -101 113 58 -111 -48 167 121 -156 -199 88 294 72 -206
5840 -206 -151 160 185 -44 -126 30 83 -80 -164 62 181 -14 -256 -122 204 222 -75 -238 -23 176 55 -117
5862 -117 -32 86 35 -168 -59 173 179 -144 -274 23 267 97 -219 -177 81 121 -91 -101 74 112 -90 -158 91
5885 91 287 78 -215 -173 154 224 -47 -189 -35 120 8 -111 1 139 9 -222 -129 174 220 -74 -284 -91
5907 -91 228 125 -103 -87 112 129 -65 -52 135 137 -113 -247 -39 223 89 -228 -225 47 191 24 -134 3 122
$$ packed form
5751B3k51O7K70J68l13k12J51K96k5k60k8J76K7j38k5K18N1k60j89K03K88o6l56
5774a85o8K55J25j47j18R9J39j29j13J63K30j18l06k9L10J71k42k83J29K37m5
5795G5j80K7J66l8j81mK51J56k89k57J52L61k2k90j03J79J44j33q6J50Q4j73k49
5818b60J71K64n6l29p8K75K48j95k14P3K14n5j69O3K15m6k77m3K87K06k22k78
5840b06N5L11K5k29q2J56N3j63q4K26J19j95k42J34L26J8k97j63K15J99j21j72
5862a17Q5J18n1k03J09K32Ol23j30K97K44j70l16M2K58M0k12j0J75L8k02o8K49
5885I1J96k09k93M2L27P0k71j42J54J55j12j19J12J38j30k31R3L03M6k94k10J93
5907i1L19j03k28J6J99J7j94J3J87Kk50j34K08K62j34l17LK72J44j67j58J37J19
$$ plain form
5930 122 -8 -111 53 250 77 -200 -170 143 285 3 -233 -106 149 84 -138 -80 67 -12 -179 -173 107 204
5952 204 -66 -255 -75 257 164 -109 -142 72 153 -14 -87 51 110 -70 -225 -26 236 132 -206 -223 73 229
5974 229 50 -195 -70 96 35 -114 -5 147 95 -158 -145 159 263 10 -245 -117 152 132 -135 -173 -4 64
5996 64 -82 -150 109 206 1 -252 -58 232 200 -131 -206 11 168 36 -130 -9 135 37 -156 -2 210 147
6018 147 -185 -245 31 201 11 -229 -156 106 121 -44 -67 86 104 -95 -144 89 230 11 -246 -132 177 196
6040 196 -68 -184 -21 117 21 -102 7 130 -47 -237 -121 209 203 -119 -216 13 262 130 -84 -50 121 68
6062 68 -86 -82 127 95 -194 -268 -2 216 62 -224 -178 103 182 -34 -138 -5 94 -60 -145 46 208 50 -221
6085 -221 -126 190 284 -58 -247 -51 139 74 -135 -86 90 2 -176 -108 190 226 -65 -234 32 256 145 -139
$$ packed form
5930A22j30j03J64J97j73k77L0L13J42k82k36J27K55o5k22N8J47p9j67OK80R7
5952B04k70j89J80L32r3k73l3K14Q1j67p3J38N9j80j55J99K62j04l38j7K96J56
5974B29j79k45J25J66o1j49J09J52n2k53J3L04J04k53k55J28K69k0k67l8J69O8
5996F4j46o8K59R7k05k53J94K90l2l31p5K17J57j32j66J21J44r8j93J54K12o3
6018A47l32o0K76J70j90k40P3K62J5j65k3J53J8j99m9K33J41k19k57J14L09J9
6040A96k64j16J63J38r6j23J09J23j77j90J16L30ol22r7K29K49j32k14L4J71n3
6062F8j54MK09l2k89p4K66K18j54k86M6K81P9k16j04J33R9j54q5J91J62j58k71
6085b21R5L16R4l42j89J96J90o5k09M9J76q8j78O8K98L6k91j69K66K24j11k84
$$ plain form
6107 -139 -175 64 111 -62 -101 42 113 -119 -210 21 219 99 -232 -179 84 191 -24 -165 -29 107 35 -41 19
6130 19 208 68 -158 -121 178 221 -52 -300 -107 134 92 -102 -146 67 101 -74 -93 122 190 -64 -255 -17 225
6153 225 135 -171 -210 55 178 25 -135 2 108 -6 -138 -15 191 55 -183 -251 97 231 15 -226 -85
6174 -85 108 118 -61 -76 91 77 -159 -156 114 208 -47 -266 -83 192 182 -96 -177 5 134 -5 -111 34 119
6197 119 -54 -239 -66 218 141 -164 -244 26 233 96 -153 -102 75 39 -105 -46 104 83 -181 -205 84 261
6219 261 31 -220 -128 121 191 -55 -120 25 87 -54 -109 80 211 -7 -246 -114 194 206 -112 -241 -45 149
6241 149 42 -116 -64 74 4 -160 -97 173 148 -131 -197 34 242 112 -143 -127 117 131 -35 -71 69 101 -106
6264 -106 -186 50 259 12 -250 -121 149 207 -25 -159 -35 140 45 -115 -13 165 54 -190 -104 181 206 -108
$$ packed form
6107a39l6K39M7j73l9J43P1k32r1K31J98j20l31N3K63J07k15j41J36J36p2p6O0
6130A9J89j40k26L7K99M3k73k48J93K41m2j94m4K13L4j75j9K15O8k54j91K38K42
6153B25r0l06l9K65J23j53j60J37J06j14j32J23K06j36k38o8L48J34k16k41J41
6174h5J93J0j79j5J67j4k36LK70R4k55k19J83K75j0k78q1J82J29j39j06J45Q5
6197A19j73j85J73K84p7l05q0K70K07j37k49N1J77l6j44N9J50k1k64k4K89J77
6219B61k30k51R2K49P0k46o5J45O2j41n5J89J31k18k39J32L08J2l18j29J96J94
6241A49j07j58N2J38p0j64O3K70k5k79o6K31K08j30k55J6K44J4j66l6J40L2k07
6264a06q0K36K09k47k62J29K70N8k32j34J24J75r5j60J02J78j11k44Q6K85K5l14
$$ plain form
6286 -108 -265 -39 170 82 -111 -117 43 50 -80 -50 108 150 -108 -209 11 257 98 -217 -173 64 190 -16 -128
6309 -128 10 122 -51 -148 11 178 63 -218 -163 127 229 -41 -214 -90 136 109 -97 -65 104 59 -126 -77
6331 -77 134 208 -87 -270 -73 217 112 -144 -183 28 133 -16 -106 50 124 -68 -176 -10 220 123 -163 -196
6353 -196 91 244 50 -145 -40 120 68 -96 -29 102 51 -185 -190 109 222 -49 -248 -133 158 143 -57 -142
6375 -142 34 78 -62 -123 90 187 -48 -225 -55 231 175 -121 -201 39 183 47 -144 -72 62 6 -158 -39
6397 -39 181 122 -161 -166 101 269 47 -181 -130 85 94 -88 -120 27 50 -163 -154 96 226 11 -225 -115 164 207
6421 207 -63 -198 6 109 14 -79 10 149 -5 -174 -34 190 179 -116 -223 -10 203 80 -154 -124 55 75
6443 75 -72 -45 126 128 -120 -187 29 224 56 -206 -170 62 167 -64 -126 5 113 -21 -83 66 197 22 -208
$$ packed form
6286a08j57K26K09q8j93oJ60Pj30L0J58M2k58j01K20K46j59l15M4K37J26k06j12
6309a28J38J12j73r7J59J67j15k81N5K90J02k70j73J24K26k7k06L2J69m5j85M9
6331g7K11P4k95j83J97K90j05k56l9K11J05j49r0J56P4j92j08J66K30r7k86l3
6353a96K87J53j94j95J05J60n2j64O7J31n1k36nK99J13k71j99J15K91j5k00q5
6375a42J76M4j40o1K13R7k35j77J70K86n6k96q0K40J44j36j91P2J34n6j64J19
6397c9K20n9k83nK67J68k22k28N1K15Rj82l2J47K3k13RK50J30k15k36J10K79M3
6421B07k70j35K04J03r5r3Q9J39j54j69J40K24j1k95j07K13K13j23k34L0J79K0
6443G5j47K7J71Kk48o7K16J95j68k62L6K32J05k31o2J31J08j34o2J49J31j75k30
$$ plain form
6466 -208 -138 157 195 -79 -233 -19 132 94 -72 -40 105 80 -124 -73 143 149 -108 -251 -30 207 121 -157 -167
6489 -167 95 146 -7 -96 33 78 -101 -207 -36 163 41 -222 -204 112 216 28 -136 -15 153 79 -67 -7
6511 -7 108 26 -195 -137 159 222 -36 -227 -84 219 163 -77 -93 39 56 -92 -137 50 122 -61 -222 -7 253
6534 253 158 -120 -176 54 191 -19 -144 -61 34 -50 -147 -43 170 102 -164 -127 137 258 26 -195 -91 104 58
6557 58 -82 -98 66 72 -137 -124 108 216 -21 -236 -91 190 142 -103 -194 -10 107 -8 -63 43 145 13 -152
6580 -152 7 211 134 -143 -244 4 126 22 -175 -74 90 96 -48 -18 168 121 -124 -141 78 214 6 -259
6602 -259 -148 86 153 -58 -109 10 142 -12 -70 85 176 -18 -227 -102 163 161 -99 -218 16 183 79 -74
6624 -74 -10 96 9 -157 -92 101 95 -147 -244 22 224 113 -146 -60 128 151 18 -37 60 105 -97 -180 34 193
$$ packed form
6466b08P0K95L8k74j54K14J51l8j66L2J45k5k04N1K16Ok57j43K21K37q6k78j0
6489a67K62N1j53q9J29M5j79j06J71J99j22k63J8L16J04j88j64J21J68p4j46O0
6511gJ15q2k21N8K96O3k58j91J43L03n6k40j6J32J7j48m5J87P2j83j61K15K60
6534B53r5k78n6K30J37k10j25Q3R5q4r7J04K13o8k66L7K64J21k32k21J04J95m6
6557E8j40j6J64Ok09J3K32J08k37k15J45K81m8k45r1J84J17j15n5J06J02j32j65
6580a52J59K04p7k77j01K48J22j04j97J01J64Oj44L0J86m7k45j7K19J36k08k65
6602b59J11K34O7k11n1J19J32j54n8J55R1j94k09J25K65kk60j19K34J67j04j53
6624g4O4J06q7j66O5J93ok42r7K66K02j11k59Q6J88K3j33n5R7M5k02q3K14J59
$$ plain form
6648 193 35 -218 -148 140 236 -20 -173 -44 104 5 -120 -23 94 15 -134 -82 175 211 -68 -205 -4 203
6670 203 91 -131 -141 4 23 -130 -106 89 123 -64 -159 46 273 147 -156 -146 110 176 0 -123 -33 56 -40
6693 -40 -106 17 166 72 -173 -152 112 212 -49 -240 -111 78 72 -85 -41 78 69 -96 -61 151 177 -67 -245 -65
6717 -65 178 95 -163 -190 19 124 -8 -49 48 136 -29 -148 4 188 97 -204 -211 48 198 8 -171 -41 85
6740 85 64 -50 -18 113 52 -150 -146 101 201 -31 -228 -96 153 136 -78 -112 53 85 -40 -120 38 123 -82 -201
6764 -201 -51 203 143 -105 -186 39 184 54 -72 -22 82 13 -104 -39 133 106 -137 -243 54 207 62 -164
6786 -164 -130 98 115 -48 -116 44 33 -113 -140 100 207 13 -187 -97 164 181 -46 -191 -9 109 18 -89 13
6809 13 107 6 -149 -36 166 182 -93 -204 35 172 71 -127 -98 45 69 -57 -49 86 67 -143 -202 49 218
$$ packed form
6648A93j58k53P0K88R6k56j53J29J48r9j25R7J17p9j49N2K57L6k79j37K01K07
6670B03j12k22j0J45J9j53K4J95L4j87r5K05K27j26l03J0K56O6j76j23R0Q9r6
6693d0o6J23J49r4k45K1K64J00k61j91J29J89oj57M4J19rj65L5K12K6k44j78J80
6717f5K43q3k58k7K09J05j32m1R7Q8j65j19J52J84r1l01pK59J50j90j79J30J26
6740H5k1j14L2J31o1k02MK47J00k32j97J32K49j7k14l4J65L2j25q0J58Q5k05j19
6764b01J50K54o0k48q1K25J45j30j26N0J04o9j17O5J72k7k43j06K97J53j45k26
6786a64L4K28J7j63o8J60j1j46k7K40J07j94k00R0K61J7k27j45J82J18r1j07J02
6809A3R4j01j55J13K02J6k75j11K39J37j01j98K9J43K4j26QJ35j9k10n9K51J69
$$ plain form
6832 218 34 -193 -147 83 152 -11 -106 15 72 -14 -77 52 150 18 -204 -88 158 184 -73 -205 -29 163 60
6855 60 -132 -67 59 31 -96 -81 132 147 -106 -183 0 196 100 -153 -153 30 114 -43 -112 19 61 -34 -165 13
6879 13 199 60 -163 -175 104 184 6 -180 -58 114 19 -65 -6 111 55 -139 -117 138 205 -39 -219 -68 174
6902 174 130 -108 -104 58 91 0 -65 92 165 -72 -198 -36 175 74 -186 -182 19 158 25 -112 -26 89 15 -106
6926 -106 -13 151 56 -185 -170 71 210 15 -164 -72 146 160 -27 -39 55 58 -96 -144 82 104 -63 -239 -70 188
6950 188 149 -67 -154 21 137 18 -82 -3 86 -27 -202 -44 168 109 -141 -188 24 186 41 -140 -88 33
6972 33 32 -119 -51 93 63 -122 -112 133 265 78 -132 -69 120 159 -73 -159 -56 19 -73 -117 24 100 -47 -183
6996 -183 -84 182 182 -85 -185 -16 135 37 -109 -69 74 46 -79 -50 153 97 -133 -214 0 175 2 -214 -179
$$ packed form
6832B18j84k27M6K30O9j63r5J21N7q6o3J29R8j32k22J16K46K6k57j32J76J92j03
6855F0j92O5J26k8j27J5K13J5k53p7J83J96r6k53%J83Q4j57o9J31M2r5j31J78
6879A3J86j39k23j2K79Q0j78j86J22J72r5q4N9J17n6j94K2K55O7k44j80J51K42
6902A74m4k38MJ62L3r1o5J57P3k37j26J62K11j01k60MK01J39j33j37Q6J15p4j21
6926a06R3J64r5k41J5K41J39j95j79R2K18J4j87j2R4Lj54m8K26K2j67j76J69K58
6950A88l9k16q7J75J16j19j00P9Q9j13j75J58K12n9k50m7K12J62j45j81N2J21
6972C3jj51O8J44l0j85J0K45J32j87k10O3J89L9k32q6J03P5r2m4J41P6j47j36
6996a83R9K66%k67j00J69J51r8j46M0J43k8j25K9K03n6k30q1K14J75j73k16L5
$$ plain form
7019 -179 17 92 -29 -33 94 110 2 -70 104 211 33 -217 -155 99 122 -67 -199 -52 63 43 -64 8 126
7042 126 -8 -152 -90 122 130 -118 -256 -49 171 86 -97 -88 73 98 -47 -46 70 55 -115 -189 -28 157 46 -168
7066 -168 -145 126 214 42 -39 -2 91 13 -102 -17 115 -12 -197 -153 114 189 -11 -179 -35 184 80 -75 -79 20
7090 20 -4 -127 -95 81 102 -52 -208 -8 218 152 -101 -122 5 104 -14 -111 17 91 -9 -123 38 225 111
7113 111 -120 -128 75 162 0 -188 -125 38 -17 -116 -71 106 57 -134 -74 146 233 -2 -191 -88 129 101 -85 -139
7137 -139 13 85 -59 -93 76 135 -46 -183 -63 162 81 -137 -196 11 131 51 -68 13 108 61 -38 24 166 81
7161 81 -169 -214 26 124 -30 -205 -152 63 93 -34 -51 59 50 -63 -96 62 159 -26 -208 -85 130 152 -68 -145
7185 -145 7 128 -2 -94 9 72 -46 -155 -91 134 130 -103 -198 8 227 100 -79 -71 59 59 -75 -103 41 33
$$ packed form
7019a79J96P5j21mJ27J6j08p2J74J07j78k50O2K54K3j89j32J47J15k0j07P2J18
7042A26j34j44O2K12Qk48j38K07K20q5j83RJ61K5j45JJ16j5j70p4J61J85j11k14
7066a68K3K71Q8j72q1L7R3p8j15Q5J32j27j85M4K67P5k00j68J44K19j04j55mR9
7090B0k4j23L2J76K1j54j56K00K26o6k53k1J27R9j18r7J28P4j00j14J61J87j14
7113A11k31qK03Q7j62j88O3J63n5r9M5J77m9j91O0K20Q7k35j89J03K17k8j86n4
7137a39J52P2j44l4J69N9j81j37J20K25q1k18n9K07J20q0j19Q1R5m7r9O2J42q5
7161H1k50m5K40R8j54j75N3K15L0j27j7J10rj13l3J58R7j85j82J23K15K2k20p7
7185a45J52J21j30r2J03O3j18j09O4K25mk33r5K06K19j27j79QJ30%j34k8J44q
$$ plain form
7209 33 -147 -191 11 147 57 -176 -123 127 162 -24 -113 -12 61 -6 -89 20 125 12 -177 -84 168 186 -18 -192
7233 -192 -50 141 37 -84 -68 36 20 -95 -63 117 140 -93 -165 -6 200 69 -152 -164 13 72 -38 -96 14
7256 14 70 -53 -122 5 167 55 -177 -131 79 176 -9 -169 -72 99 57 -47 37 88 52 -131 -103 99 140 -72
7280 -72 -216 -59 154 108 -64 -103 25 71 -46 -37 49 120 -74 -171 -22 191 69 -165 -149 56 143 -12 -98 -19
7304 -19 50 -7 -100 -22 120 48 -153 -134 107 187 34 -166 -64 110 93 -45 -71 46 64 -84 -70 89 164 -36
7328 -36 -181 -39 223 129 -100 -132 -14 84 -14 -85 -9 82 -59 -141 -38 142 81 -148 -181 26 169 46 -120 -61
7352 -61 57 54 -18 -20 87 80 -90 -96 77 167 -8 -197 -87 104 123 -42 -124 13 54 -9 -70 28 88 -30 -188 -90
7378 -90 134 95 -109 -184 -38 106 55 -88 -55 62 32 -101 -23 93 55 -128 -173 37 205 72 -115 -73 83
$$ packed form
7209C3j80m4K02J36r0k33N3K50L5j86q9J01P3o7q3J09J05j13j89R3K52J8k04j74
7233a92J42J91j04j21J6J04j6j15L2J80K3k33p2J59K06j31k21j2J77N9j10n8J10
7256A4N6j23o9J27J62j12k32M6K10R7j85j60R7J71m2j04Q4N1l6j83K8K02M1k12
7280g2j44J57K13m6j72l9J28M6j17RQ6P1j94r7J49K13j22k34J6K05Q7j55q6P9
7304a9O9n7r3P8J42p2k01J9K41Q0j53k00J02J74j7j38k6J17J8j48J4J59P5k00
7328c6j45J42K62r4k29l2J18R8r8p1P6R1j41q2J03J80o1k29l3K07J43j23j66N9
7352f1J18lp2kJ07pj70oJ73R0j75j89J10J91J9j65q2J37M1o3o1R8O0j18j58R8
7378i0K24l9k04p5J46J44n1j43L3J17l0j33P8J16l8j83m5K10J68j33j87M2J56
$$ plain form
7401 83 112 -20 -72 35 30 -77 -128 25 126 -16 -189 -116 123 154 -43 -137 -30 81 -13 -79 -50 37 -9 -131 -66
7426 -66 156 140 -73 -159 5 149 81 -101 -120 20 40 -57 -60 60 90 -67 -110 57 189 77 -138 -117 80 131
7450 131 -15 -101 -18 61 11 -108 24 122 35 -157 -117 95 137 -16 -182 -90 93 78 -54 -51 68 43 -61 -36 87
7475 87 144 -60 -189 -28 134 63 -129 -133 66 127 16 -63 30 82 -16 -81 15 148 54 -139 -158 61 145 -18 -118
7500 -118 -67 47 30 -64 -39 54 -8 -140 -163 84 142 -51 -154 -56 175 103 -37 -81 34 66 -18 -88 28 75 -61
7525 -61 -166 -43 164 125 -97 -145 42 126 42 -92 -54 49 17 -88 0 96 77 -121 -136 64 177 16 -184 -140
7549 -140 43 77 -73 -118 -9 19 -60 -58 81 164 39 -141 -47 109 131 -40 -185 -48 89 -16 -102 -19 60 -23
7573 -23 -113 -42 122 111 -127 -169 15 165 47 -110 -74 81 71 -38 -28 74 59 -118 -136 15 123 -8 -185
$$ packed form
7401H3K9j32n2J07nj07n1J53J01j42j73P3K39L1j97r4J07J11r4o6K9Q7m6j22O5
7426f6K22j6k13q6J64J44o8j82j9J40K0r7lJ20L0j57m3J67J32j12k15K1J97N1
7450A31j46q6Q3P9n0j19J32R8q7j92M0K12M2j53j66R2J83j5j32LJ19k5j04K5J23
7475H7N7k04j29J61J62p1j92mJ99O1j11p9R3N2r8o5R6J33r4j93j9K19Q4j63j00
7500a18N1J14j7r4K5R3o2j32k3K47N8j93j03R8K31p2j40m4J15L2q4p0J16M7j36
7525f1j05J23K07l9k22m8J87Q4q4j34L8J03l2j05Q8R6j9j98j5K00J13j61k00M4
7549a40J83L4j50m5J09K8p9KJ39Q3j25j80R4J56K2j71j45J37J37j05q6Q3P9q3
7573b3r0P1J64j1k38m2J84J50j18j57L6J55j0j09J0J02j5j77j8J51J08j31j77
$$ plain form
7596 -185 -152 76 101 -22 -103 -19 100 1 -50 37 109 -2 -150 -77 113 131 -73 -182 -26 136 68 -63 -44 37
7620 37 37 -94 -45 85 101 -101 -148 2 180 62 -123 -113 31 102 -37 -68 -1 40 -50 -89 8 106 36 -148 -120 97
7646 97 154 1 -136 -45 64 47 -94 -17 60 31 -90 -57 112 141 -42 -144 -38 114 100 -89 -127 12 69 -24
7670 -24 -72 28 76 -52 -146 -5 144 43 -118 -172 14 90 2 -117 -49 80 28 -78 -9 133 41 -126 -124 80
7694 80 169 -1 -146 -70 82 71 -11 -47 9 22 -80 -67 45 92 -32 -162 -51 121 113 -70 -109 35 90 8 -60
7719 -60 -3 24 -23 -118 -27 107 50 -107 -156 41 163 44 -99 -82 61 31 -67 -38 31 53 -85 -113 65 176 30
7744 30 -122 -62 106 108 -57 -111 -11 42 -34 -91 3 95 -12 -147 -44 108 117 -85 -175 -6 100 3 -90 -54 43 49
7770 49 -66 -30 91 57 -76 -139 21 150 30 -170 -107 51 76 -16 -72 43 71 -8 -56 55 136 3 -131 -91
$$ packed form
7596a85L3K28K5j23q1Q4J19r9n1Q7P2j11j48P3J90J8k04j09J56J62o8j31J9Q1
7620C7%j31M9J30J6k02m7J50J78j18j85J0J44P1j39l1O7M1r0l9R7R8p0j84K8K17
7646I7N7j53j37R1J09j7j41P7P7k9j21L3J69K9j83j02J06J52j4j89l8J39N7r3
7670b4m8J00M8j28r4J41J49j01j61n4J86P6q8j19O8J29n2j06O9J42r2j67KK04
7694H0Q9j70j45P6J52j1q2l6N6J3j02J3J12M7j24j30J11J72qj83l9J44N5q2o8
7719f0N7K7m7r5R1J34n7j57m9J97J22j19j43J7J43l0r8K9O9K2j38k8J78J11j46
7744C0j52O0J68Kj65n4J00N3p6n7R4R2j07j35J03J52Rk02r0J69J06r7r3L6R7O
7770D9j15L6J21l4j33o3J60J29j20k00O3J58K5r2n6J15K8p9m8J11Q1j33j34M0
$$ plain form
7794 -91 60 101 -34 -173 -38 82 17 -57 -21 38 -9 -96 -64 93 78 -76 -181 -22 162 83 -53 -70 48 80
7818 80 -8 -39 54 60 -73 -104 29 143 64 -120 -118 51 141 8 -88 -31 37 -24 -72 -9 84 -10 -131 -77 91 122 -30
7845 -30 -152 -41 113 39 -71 -62 28 18 -119 -72 58 110 -43 -163 -27 140 100 -76 -113 53 94 -12 -96 -10
7869 -10 53 -12 -66 30 128 78 -116 -120 37 125 -11 -144 -67 55 19 -69 -27 57 6 -63 -81 79 130 -36 -150 -72 72
7896 72 90 -82 -110 -5 46 -35 -71 58 68 -21 -119 -23 129 93 -90 -125 27 118 34 -89 -36 60 17 -51 -28 41 24
7923 24 -116 -130 33 131 1 -157 -73 82 83 -44 -70 23 38 -49 -71 31 80 -25 -133 -59 107 99 -55 -140 12
7948 12 90 43 -44 13 34 3 -53 -26 102 86 -58 -139 -1 127 41 -118 -114 22 16 -46 -45 33 36 -86 -100 35 136 10
7976 10 -131 -91 75 137 -23 -95 -4 50 9 -46 26 87 19 -111 -73 79 117 -58 -152 -12 79 54 -72 -38 42 30
$$ packed form
7794i1J51M1j35j39J35J20o5p4L6N9m7q7L2J57j5j54j05J59J84p9j36j7J18L2
7818H0q8l1R3Oj33l1J33J14p9j84KJ69R0j33r6N7O8o1m8O3R3r4j21N4J68L1j52
7845c0j22J11J54p4j10RR0j0j37M7J30N2j53j20J36J67m0j76l7J66M1j06q4Q6
7869a0O3o5n4R6R8n0j94mJ57Q8j36j33P7J22l6q8M2Q4n1o9j8J60N1j66j14P8J44
7896G2J8j72k8J05N1q1l6J29J0q9r8R6J52l6j83l5J52R1q4j23N3R6m3o8K3O9j7
7923B4j40j4J63R8j30j58Q4J55Jj27k6R3J5q7k2J02M9j05j08P4J66qj54q5J52
7948A2P8m7q7N7K1l1n6K7J28j6j44q1J38J28q6j59MJ36oo2JP8Lj22j4J35J01j26
7976A0j41M0J66O2j60p2R1N4m1n5P2O1o8j30L8J52L8j75r4J40R1k5j26L4Q0j2
$$ plain form
8002 30 -42 -31 63 79 -42 -127 2 132 50 -109 -105 37 73 -23 -87 -29 30 -53 -98 -17 105 21 -137 -76 98 148 -1
8029 -1 -120 -28 70 40 -44 -28 46 20 -74 -77 89 86 -41 -153 -10 105 71 -63 -88 22 87 -20 -55 21 57 -29 -130
8056 -130 7 112 57 -114 -111 23 77 -21 -134 -70 21 -12 -59 5 113 28 -67 -51 74 155 -3 -107 -22 98 61
8081 61 -42 -49 28 27 -45 -67 43 88 -73 -153 -52 86 68 -90 -149 4 74 16 -60 4 48 -9 -68 -32 94 52 -123
8108 -123 -166 18 118 20 -106 -81 71 55 -10 -26 49 45 -39 -61 14 108 -18 -133 -72 83 97 -36 -91 10 78 -13
8134 -13 -64 -1 50 -75 -156 -55 91 67 -52 -134 16 122 36 -86 -42 55 6 -71 -6 57 46 -100 -113 31 157
8159 157 54 -84 -49 58 68 -24 -69 5 31 -67 -44 15 111 37 -79 -49 93 100 -22 -131 -36 56 -5 -80 -16 40 -12
8186 -12 -81 -53 91 95 -63
$$ packed form
8002C0p2J1R4J6j21q5J29J30q2j59MJ42L6r6o4N8N9q3m5Q1J22q4j58O1J74N0j49
8029aj19R2R8l0q4J6P4k6r4lJ66lj27j12J43J15l4j34k5J10O5j07l5P6L6q6j01
8056a30J37J05n5j71LJ34N4r8j13O4R1l3m7O4J08q5r5J6J25Q1j58j04Q5J20l7
8081F1j03pP7jp2k2J10M5j61q0J01J38j8j58n9J53P0n8p6O4M4n7n9L6J26m2j75
8108a23m3J84J00r8j26K5J52j6o5j6P5mq4k2P5R4j26j15O1J55J4j33n5J01O8r1
8134a3n1O3N1j25q1J01J46k4j19q2J50J06q6j22M4R7m9p7O5O3j1j46j3J44J26
8159A57j03j38L5J07J0r2m5P4K6r8K3N9R6p4j16L0J42Pj22j09R5R2o1p5O4N6n2
8186a2o9K8J44Mj58
8191f3
$$ Imaginary data points
##PAGE= N=2
##DATA TABLE= (X++(I..I)), XYDATA
$$ plain form
0 0 0 0 0 0 0 0 0 0 0 0 0 0 0 0 0 0 0 8 -8 8 -8 8 -10 16 -16 17 -24 24 -32 32 -40 45 -49 57 -65 73 -81 91 -104
39 -104 114 -129 142 -157 175 -193 213 -235 259 -285 315 -347 382 -421 464 -513 569 -632 702 -786
59 -786 884 -1003 1149 -1329 1568 -1892 2366 -3117 4516 -7999 36318 43138 -4282 33660 43444
74 43444 21373 -10489 -20410 -17759 -11600 -36427 -45187 -9723 14492 -19035 -39975 -8034 29419
87 29419 18218 -15861 -23570 4119 20110 5198 -7276 11709 31829 20114 379 17432
99 17432 44795 27103 -18315 -29762 -7289 2013 -22351 -49844 -41232 -8641 -3055 -18561 -4666
112 -4666 27303 26862 5487 6244 28739 38542 12963 -22787 -18337 14405 13540 -17978 -22715 1306
126 1306 10529 -1947 -8266 4137 14229 -2696 -28544 -20944 9634 10199 -20885 -29036 2280
$$ packed form
0@%%%%%%%%%%%%%%%%%Qj6J6j6J6j8K6l2L3m1M8n6O4p2Q5r4J06j22J38j54J72j95
39a04K18k43K71k99L32l68M06m48M94n44O00o62P29q03Q85r77J082j201J334j488
59g86J670j887K152k478K897l460M258n483P633j2515M4317O820m7420L7942R784
74D3444k2071l1862r921K651O159k4827q760L5464K4215l3527k0940L1941L7453
87B9419j1201l4079p709K7689J5991j4912j2474J8985K0120j1715j9735J7053
99A7432K7363j7692m5418j1447K2473R302k4364k7493Q612L2591N586j5506J3895
112d666L1969m41k1375P57K2495R803k5579l5750M450L2742q65l1518m737K4021
126A306R223j2476o319J2403J0092j6925k5848P600L0578N65l1084q151L1316
$$ plain form
139 2280 26923 16493 1357 10534 25148 18503 -35 -3231 10019 7466 -22647 -37423 -10085
152 -10085 13983 -2911 -24577 -12307 13765 19743 5295 -4169 5920 12854 -5376 -19792 -1645
165 -1645 15833 -1028 -22785 -10850 19308 26727 5003 -10146 3744 19253 6486 -13519
177 -13519 -9464 2734 -6907 -24701 -17283 8755 14789 -6480 -17358 4072 27038 17391 -7676
190 -7676 -9404 7587 7603 -9796 -12081 3701 8147 -6447 -13661 4007 24305 14673 -12384 -13894
204 -13894 9572 14341 -7554 -19497 -8556 924 -5085 -11848 -1911 14720 11095 -7856 -5896
217 -5896 18738 24584 -168 -17373 -5502 9819 3617 -11893 -11827 1908 4933 -6811 -7905 9858
231 9858 16613 -3131 -18028 -2984 16136 7823 -13655 -15770 1931 11855 1805 -6882 3772
$$ packed form
139B280K4643j0430j5136R177J4614o645j8538l196J3250k553l0113j4776K7338
152a0085K4068j6894k1666J2270K6072N978j4448r464J0089O934j8230j4416J8147
165a645J7478j6861k1757J1935L0158P419k1724j5149J3890J5509j2767k0005
177a3519M055J2198r641j7794P418K6038O034k1269j0878K1430K2966r647k5067
190g676j728J6991J6j7399k285J5782M446j4594p214J7668K0298r632k7057j510
204a3894K3466M769k1895j1943J0941R480o009o763R937J6631l625j8951J960
217e896K4634N846k4752j7205J1871J5321o202j5510O6J3735L025j1744j094J7763
231I858O755j9744j4897J5044J9120q313k1478k115J7701R924j0050q687J0654
$$ plain form
244 3772 14329 3507 -8819 1566 16139 6308 -15875 -18140 1173 11843 -2255 -17541 -8306
257 -8306 9411 7268 -4847 -1343 10937 7838 -7187 -8749 7384 15118 -1090 -17885 -8084
270 -8084 13018 11914 -6436 -10141 3652 8859 -1598 -7181 2073 8492 -2832 -15930 -6930 12837
284 12837 10873 -10413 -15240 3906 15373 4328 -7496 -2307 7776 4093 -7048 -4478 9231
297 9231 7779 -10764 -14986 4428 16029 2000 -13918 -7885 8430 9948 -3121 -7649 2970
310 2970 7264 -4295 -9571 3863 12902 -374 -15139 -7333 11069 12222 -4562 -12837 -519
323 -519 10952 3354 -7158 -1082 8169 981 -10474 -4783 9900 9142 -7632 -14867 172 14923
337 14923 6659 -9555 -6858 7176 7201 -4242 -5205 4656 5465 -6904 -12350 799 13562 4394
$$ packed form
244C772J0557j0822j2326J0385J4573r831k2183k265J9313J0670j4098j5286R235
257h306J7717k143j2115L504J2280l099j5025j562J6133P734j6208j6795R801
270h084K1102j104j8350l705J3793N207j0457n583R254O419j1324j3098R000J9767
284A2837j964k1286m827J9146J1467j1045j1824N189J0083l683j1141K570J3709
297I231j452j8543m222J9414J1601j4029j5918O033J6315J518j3069m528J0619
310B970M294j1559n276J3434R039j3276j4765P806J8402J153j6784q275J2318
323e19J1471p598j0512O076R251p188j1455N691J4683p58j6774p235J5039J4751
337A4923q264j6214K697J4034K5j1443r63R861Q09j2369n446J3149J2763r168
$$ plain form
351 4394 -12796 -9195 9719 13562 -1267 -8852 -30 6471 -852 -8310 -1881 7487 1321 -12013
365 -12013 -7676 11129 14812 -1853 -11361 9 12094 6230 -6818 -7059 2216 1947 -8254 -7820
379 -7820 5708 9041 -4748 -11708 1632 15142 8170 -8262 -9947 3218 8321 -2409 -9137
392 -9137 -332 6463 -1502 -7318 3173 14243 7020 -8365 -8620 6157 11666 -2611 -15380 -7858
406 -7858 4577 1018 -8010 -3123 7617 5589 -4255 -2966 10087 14169 -361 -13339 -5141 9675
420 9675 5901 -9233 -10370 1985 6196 -1259 -3570 4895 9011 -950 -10515 -3165 9507 4656
434 4656 -12270 -14449 1239 10136 1883 -5606 990 10018 6747 -1650 919 9362 4707 -10573
448 -10573 -13038 1186 8328 -3217 -14342 -7078 7577 8619 -1856 -3879 5247 6786 -3677
$$ packed form
351D394j7190L601J8914L843j4829p585Q822O501p323p458O429R368o166j3334
365a2013M337J8805L683j6665r508J1370J2085n864j3048k41R275k69j0201M34
379g820J3528L333j3789o960J3340J3510o972j6432j685J3165N103j0730o728
392i137Q805O795p965n816J0491J1070p223j5385k55J4777N509j4277j2769P522
406g858J2435l559r028M887J0740k028r844J289J3053M082j4530j2978Q198J4816
420I675l774j5134j137J2355M211p455k311Q465M116r961r565P350J2672m851
434D656j6926k179J5688Q897q253p489O596R028l271q397K569Q443m655j5280
448a0573k465J4224P142j1545j1125P264J4655J042j0475k023R126J539j0463
$$ plain form
461 -3677 -7099 3006 7826 -3093 -12840 -4547 11120 11895 -1644 -6584 4896 12525 3326 -6208
475 -6208 -2213 2465 -5248 -13934 -8328 3542 3180 -8602 -11256 3424 15546 7958 -4732 -1425
489 -1425 9109 7032 -2906 -3433 3802 3557 -5507 -7948 3328 12287 3455 -10297 -6824 7013 7055
504 7055 -6807 -12955 -5355 11 -5113 -8624 -508 8586 4576 -3665 2156 16657 17049 1582 -6829
519 -6829 1591 9268 1422 -10562 -9621 -1324 -2168 -9483 -6995 4188 5690 -5373 -9803 1471 11472
534 11472 4530 -8587 -7531 5392 9640 1103 -2151 6233 10395 2786 -2262 4278 9492 702
548 702 -12838 -13095 -1124 2514 -9229 -16747 -6789 4820 2779 -2248 3177 11070 8461 391 1136
563 1136 10243 11394 -1762 -11475 -3175 8395 3715 -8495 -8151 1679 3408 -3972 -6285 90 2494
$$ packed form
461c677l422J0105M820j0919r747Q293J5667P75j3539m940J1480P629r199r534
475f208L995M678p713q686N606J1870l62j1782k654J4680J2122p588j2690L307
489a425J0534k077r938n27P235k45r064k441J1276Q959q832j3752L473J3837M2
504G055j3862o148P600N366n124l511Q116R094m010q241N821J4501L92j5467q411
519f829Q420P677p846j1984R41Q297q44p315K488J1183J502j1063m430J1274J0001
534A1472o942j3117J056J2923M248q537l254Q384M162p609n048O540N214q790
548G02j3540k57J1971L638j1743p518R958J1609k041n027N425P893k609q070P45
563A136R107J151j3156r713Q300J1570m680j2210L44R830J729p380k313O375K404
$$ plain form
578 2494 -5645 -11437 -2929 8505 4872 -7051 -5682 8711 14870 6094 -994 3610 8583 2884
592 2884 -5333 -3569 2271 -2336 -13301 -12447 638 6440 -2582 -10119 -2594 9206 8151 -1397 -2405
607 -2405 4796 5041 -2742 -3782 4481 7513 -1214 -8283 -1351 10141 7939 -5184 -8845 642 5142
622 5142 -2910 -8779 -3527 1454 -2871 -7160 -804 9103 7663 -3021 -4993 6522 13142 3280 -7639
637 -7639 -4044 4102 1620 -5703 -4729 1898 1890 -5083 -6101 3650 9725 915 -9528 -4609 6947 6002
653 6002 -4700 -7526 173 4694 202 -2840 2935 7936 2067 -5665 -1500 8430 6612 -6000 -10664
668 -10664 -1302 6044 479 -7088 -3937 3469 2337 -3493 -1486 6128 5328 -4477 -7653 1822 8931
683 8931 1854 -8481 -5710 5266 7106 -967 -3437 3114 5147 -1479 -4703 1440 6092 -468 -9833
$$ packed form
578B494q139n792Q508J1434l633j1923J369J4393O159q776p088M604M973n699
592B884q217J764N840m607j0965Q54J3085N802r022p537P525J1800j055r548j008
607b405P201K45p783j040Q263L032q727p069O932J1492k202j3123l661R487M500
622E142q052n869N252M981m325m289O356R907j440j0684j972J1515O620r862j0919
637g639L595Q146k482p323R74O627qo973j018R751O075q810j0443M919J1556r45
653F002j0702k826P699M521m492l042N775N001n869p732M165R930j818j2612m664
668a0664R362P346n565p567L151P406j132n830K007P614q00r805l176R475P109
683H931p077j0335K771J0976J840q073k470O551K033o626l224O143M652o560r365
$$ plain form
698 -9833 -6961 4776 6954 -3547 -8641 -218 6866 2527 -3084 -72 4845 1816 -4708 -2999 5494
713 5494 6307 -3913 -9140 -139 8961 3968 -5729 -4714 3036 3792 -2386 -3855 1592 3240 -3272
728 -3272 -7019 515 8629 3435 -7020 -5405 5510 8210 -210 -5555 -761 4176 364 -4724 -1197
743 -1197 4642 982 -7156 -5159 5343 7918 -1675 -8219 -1688 7106 4404 -3774 -3478 2979 3041 -2942
759 -2942 -3111 3850 5588 -2473 -7956 -1224 7697 4348 -6141 -7139 1953 5724 -490 -4425 211
774 211 3813 -435 -4438 191 6760 3620 -5812 -6496 3688 8414 144 -7136 -2618 4402 2480
789 2480 -3318 -2461 2762 2133 -4277 -4805 3567 7467 -763 -8005 -2196 7383 5704 -3323 -5252 1178
805 1178 4006 -1057 -4046 720 4173 -1328 -6875 -1608 7198 5080 -4794 -6706 2047 7308 1524
$$ packed form
698i833K872J1737K178j0501n094Q423P084m339n611L012M917l029o524J709Q493
713E494Q13j0220n227R001R100m993r697J015P750P56o178j469N447J648o512
728c272l747P534Q114n194j0455J615J0915K700q420n345M794M937l812n088L527
743a197N839l660q138J997J0502K575r593o544O531Q794k702q178K96O457O2n983
759b942j69O961J738q061n483O732Q921l349j0489r98R092L771o214l935M636
774B11L602m248m003M629O569l140r432o84J0184M726q270p280M518P020j922
789B480n798Q57N223o29o410n28Q372L900q230p242N809R579j679r027j929O430
805A178K828n063k989M766L453n501n547N267Q806k118r874j912Q753N261n784
$$ plain form
820 1524 -4999 -2260 3438 1658 -3554 -1543 4664 3225 -4604 -5691 2803 7678 726 -7599 -4608
835 -4608 4099 4336 -2775 -4287 1489 3377 -1500 -3091 2854 6591 618 -6559 -3004 6083 5722 -4016
851 -4016 -7689 -607 4644 540 -3948 -783 3746 1143 -3952 -1358 5946 5230 -4005 -7303 893
866 893 7337 1947 -5821 -3838 3137 3598 -1702 -2595 2393 3179 -3151 -5855 1029 6379 576 -7477
882 -7477 -4699 4572 6407 -510 -4156 826 5060 1418 -2841 421 4426 104 -6621 -4242 4050
897 4050 4905 -3316 -7569 -1017 6092 3260 -3461 -2563 3013 2516 -2787 -2483 3515 4174 -2871 -6173
913 -6173 659 7671 3751 -4867 -4651 3239 5231 -1169 -4572 -479 2165 -2053 -5144 -357 5185
928 5185 1811 -5492 -4087 4980 7626 -50 -5565 -1149 4464 2064 -3172 -2183 2490 1420 -3915
$$ packed form
820A524o523K739N698j780n212K011O207j439p829j087Q494M875o952q325K991
835d608Q707K37p111j512N776J888m877j591N945L737n973p177L555R087l61r738
851d016l673P082N251m104m488L165M529k603n095K594P304p16r235l298Q196
866H93O444n390p768J983O975M61n300q93M988P86o330k704O884N350n803q053
882g477K778R271J835o917l646M982M234l642m259L262M005m322o725K379Q292
897D050Q55q221m253O552P109k832o721Q98N576m97n303L04N998O59p045l302
913f173O832P012l920q618K16P890J992o400l403M093K644m218l091M787N542
928E185l374p303J405R067K646p676n515M416N613k400n236R89M673j070n335
$$ plain form
943 -3915 -3176 4050 5922 -1567 -6686 -1224 5869 3372 -4304 -5307 783 3172 -1259 -3150 1717
958 1717 4414 -548 -4336 863 7153 3760 -4738 -5619 1809 5402 -331 -5612 -2284 2863 726
973 726 -3561 -880 4262 2089 -4528 -4330 3135 6229 -321 -6510 -2523 5100 4538 -1835 -2464 2706
989 2706 3511 -1324 -2608 2312 4175 -1907 -7318 -3238 4222 3104 -4695 -6348 557 4883 1054
1004 1054 -2623 537 4166 1341 -2903 -146 5488 3732 -3952 -5425 1861 6269 896 -5518 -3391
1019 -3391 2559 2115 -3068 -3364 1250 1492 -3824 -4613 2127 6093 783 -4990 -1601 6092 6405 -617
1035 -617 -3700 950 3876 -360 -3818 -412 2672 -1495 -6176 -2877 4069 3888 -3259 -6040 284
1050 284 5911 2456 -3308 -1710 3291 2414 -1937 -935 3947 3520 -2581 -4748 1064 5708 1137 -6168
$$ packed form
943c915P39P226J872p489n119N462P093k497p676j003O090K389m431j891M867
958A717K697m962l788N199O290l393q498q81P428L593n733n281L328N147k137
973G26m287K681N142k173o617J98P465L094o550o189L987P623n62o373o29N170
989B706Q05m835j284M920J863o082n411M080P460j118p799j653O905M326l829
1004A054l677L160L629k825m244K757N634j756p684j473P286M408n373o414K127
1019c391N950m44n183k96M614K42n316p89O740L966n310n773L389P693L13p022
1035f17l083M650K926m236l458L406L084m167m681L299O946j81p147k781O324
1050B84N627l455n764J598N001q77m351J002M882m27o101k167N812M644m571p305
$$ plain form
1066 -6168 -5074 1881 3174 -2218 -4173 318 2755 -715 -2581 1948 5833 1914 -4224 -2432 4801
1081 4801 5693 -1511 -5696 -1112 3653 948 -3592 -1923 2224 597 -4003 -2517 3562 3979 -2609
1096 -2609 -5849 -203 5833 3221 -3328 -3140 2678 3982 -636 -2121 1888 2955 -1994 -4626 34
1111 34 4698 1328 -5298 -4767 2336 5107 -160 -4208 -592 3508 1012 -2622 -149 3511 924 -4256
1127 -4256 -3298 3120 5096 -943 -5698 -1473 4796 3095 -2752 -2729 1810 2014 -2109 -2370 2301 3675
1143 3675 -1558 -5126 -634 5437 3334 -3754 -4656 1460 4199 -255 -3468 -331 2518 -380 -3310
1158 -3310 -51 4634 2553 -3646 -3909 2600 5647 205 -5023 -2387 2816 1868 -2625 -2151 1900 1612
1174 1612 -2787 -2817 2678 4843 -326 -4975 -1625 4683 4097 -2246 -4033 840 3244 -506 -2621 812
$$ packed form
1066f168J094O955J293n392j955M491K437l470j866M529L885l919o138J792P233
1081D801Q92p204m185M584M765k705m540J669M147j627m600J486O079M17o588
1096b609l240N646O036k612o549J88N818J304m618j485M009J067m949k632M660
1111C4M664l370o626N31P103K771n267m048L616M100k496l634K473L660k587n180
1127d256R58O418J976o039m755M225O269j701n847K3M539K04m123k61M671J374
1143C675n233l568M492O071k103p088r02O116K739m454l213L137K849k898k930
1158c310L259M685k081o199k63O509L047n442n228K636N203r48m493M74M051k88
1174A612m399l0N495K165n169m649L350O308n86o343j787M873K404l750k115L433
$$ plain form
1190 812 3001 -834 -4412 -1278 4071 2818 -3755 -5355 773 4991 1098 -3508 -1181 3232 1877
1205 1877 -1792 -441 3435 2259 -3014 -4010 1462 4874 251 -5546 -3370 2932 3215 -1803 -2923
1220 -2923 1024 2370 -1052 -2473 1319 3911 46 -4616 -2053 4224 4317 -1961 -4616 70 3875
1235 3875 977 -2744 -958 2237 346 -3197 -1395 3490 3106 -2614 -4634 728 5336 1962 -3664
1250 -3664 -2717 2302 2575 -1630 -2400 1224 1810 -2294 -3638 988 4565 1047 -4373 -2927 3385 4769
1266 4769 -668 -3644 92 3052 310 -2437 -32 2719 164 -3969 -2484 2976 3791 -1918 -5170
1281 -5170 -615 4316 2109 -2657 -1882 2103 1983 -1351 -1227 2558 3006 -1697 -4240 14 4539 1711
1297 1711 -4323 -4127 1478 3176 -976 -3115 -21 2236 -322 -2428 741 4330 1859 -3292 -2487
$$ packed form
1190H12K189l835l578L134N349j253o573j600O128M218l893m606K327M413j355
1205A877l669J351L876j176n273r96N472L412m623n797K176O302K83n018j120
1220b923L947J346l422j421L792K592l865m662K563O277R3o278k655M686L805
1235C875k898l721J786L195j891l543J802M885l84n720k020N362M608l374n626
1250c664R47N019K73m205p70L624N86m104j344M626L577l518n420J446O312J384
1266D769n437k976L736K960k742k747K405K751k555m133J485N460Q15n709l252
1281e170M555M931k207m766P75L985j20l334J24L785M48m703k543M254M525k828
1297A711o034J96N605J698m152k139L094K257k558k106L169L589k471n151Q05
$$ plain form
1312 -2487 3427 5001 -421 -4376 -1322 2798 1093 -2903 -2158 1160 341 -3283 -2601 2296 3595 -1095
1328 -1095 -4283 -340 4989 3537 -1926 -2572 1894 3284 -232 -1816 1032 2313 -1212 -3837 -706
1343 -706 3435 1442 -4245 -4726 880 3714 -190 -3613 -962 2641 1357 -1319 278 3521 2255
1358 2255 -2128 -2393 2542 4527 -435 -5020 -2363 2666 1885 -2596 -3023 584 1559 -1338 -2047 1625
1374 1625 3465 -374 -3908 -800 4380 3343 -2298 -3589 993 3707 622 -2326 -430 2056 -3
1389 -3 -2979 -1206 2639 1476 -3555 -4316 924 4279 862 -3362 -1548 2959 2853 -685 -1028 1953
1405 1953 1899 -1876 -2780 1185 3460 -338 -4580 -2306 3115 3309 -1599 -3339 287 2494 -163 -2272
1421 -2272 28 2156 -392 -3507 -1311 3570 3381 -1847 -3619 1048 4514 1643 -2438 -1491 1677
$$ packed form
1312b487N914J574n422l955L054M120j705l996P45L318q19l624O82M897J299m690
1328a095l188L943N329j452n463o46M466J390l516j584K848J281l525k625L131
1343g06M141j993n687m81N606K834l904l423K651L603j284k676J597L243j266
1358B255m383k65M935J985m962m585K657N029p81m481m27L607R75k897p09L672
1374A625J840l839l534L108N180j037n641j291M582K714l085k948J896K486k059
1389ck976J773L845j163n031p61N240L355l417m224J814M507j06l538l43K981
1405A953n4l775r04L965K275l798m242K274N421J94m908j740L626K207k657k109
1421b272K300K128k548l115K196M881j89n228j772M667L466k871m081R47L168
$$ plain form
1436 1677 958 -2165 -1751 1629 1626 -2470 -3617 946 4378 1083 -3636 -2429 2317 2900 -1000 -2624
1452 -2624 134 1855 -559 -2056 1041 3722 1010 -3076 -1504 3404 3709 -1350 -4180 -1091 2137
1467 2137 257 -2911 -1687 1339 579 -2262 -997 3231 3446 -1168 -3372 553 4329 1867 -2930
1482 -2930 -2685 1344 2123 -985 -1843 1018 1869 -1284 -3032 264 3386 647 -4082 -3410 1719 3297
1498 3297 -491 -2834 19 2992 1611 -723 757 3198 1360 -2656 -2297 1953 2636 -2131 -5119
1513 -5119 -1903 2301 1323 -2268 -2028 1321 2003 -659 -1019 2158 2986 -868 -3274 99 3993 2175
1529 2175 -2542 -2803 1473 3242 124 -2333 -478 1385 -817 -3163 -1024 2132 491 -3561 -2977
1544 -2977 2107 4295 831 -2353 -205 3465 2539 -912 -1038 1372 755 -2579 -2789 937 2370 -1287
$$ packed form
1436A677p19l123M14L380lm096j147M563L432l295m719J207M746N83l900j624
1452b624K758J721k414j497L097K681k712m086J572M908L05n059k830L089L228
1467B137j880l168J224L026p60k841J265M228K15m614k204L925L776k462m797
1482b930K45M029P79l108q58K861Q51l153j748L296L122k739m729O72N129J578
1498C297l788k343K853K973j381k334J480K441j838m016L59M250O83m767k988
1513e119L216M204r78l591K40L349O82k662l60L177Q28l854k406L373L894j818
1529B175m717k61M276J769l118k457J855J863k202k346K139L156j641m052N84
1544b977N084K188l464l184K148L670r26l451j26K410o17l334k10L726J433l657
$$ plain form
1560 -1287 -4161 -1281 3246 2710 -1535 -2529 766 2388 -54 -1697 467 2145 -262 -2613 -104
1575 -104 3672 2507 -2089 -2989 1019 3322 234 -3217 -2004 868 176 -2288 -1307 1849 1544 -1884
1591 -1884 -1985 2339 4442 907 -2914 -1398 2463 2258 -1449 -2615 102 1283 -1048 -2017 1053 2881
1607 2881 -62 -3101 -962 3112 2592 -1903 -3625 -357 2344 379 -2163 -671 1863 783 -1612
1622 -1612 -242 3067 2341 -1842 -3102 528 3235 650 -3170 -2291 1457 1984 -740 -1191 1385 1864
1638 1864 -1071 -2150 886 2866 -163 -3901 -2659 1698 2426 -1113 -2722 177 2625 1040 -875
1653 -875 822 2765 657 -2499 -1366 2333 2163 -2069 -3882 -590 2732 1206 -2020 -1555 1358 1376
1669 1376 -1213 -1236 1511 1621 -1789 -3091 363 3427 1426 -2285 -1793 2120 3299 304 -1692 144
$$ packed form
1560a287k874K880M527n36m245r94L295J622k442j643K164J678k407k351K509
1575a04L776j165m596r00M008K303l088l451J213K872o92k464R81L156l05l428
1591a884j01M324K103l535l821J516L861k05l707j166K717J181k331r69L070J828
1607B881k943l039K139M074n20m495j722L268K701j965k542J492K534j080k395
1622a612J370L309p26m183j260L630K707k585l820Q79L748N27k724m51K576M79
1638A864k935j079L036J980l029l738J242M357P28l539j609K899K448j585j915
1653h75J697J943k108l156J133L699j70m232j813L292L322j526l226M65K913J8
1669A376k589k3K747J10l410j302L454L064k001l711M92L913J179k995j996J836
$$ plain form
1685 144 1442 -804 -2701 -633 1585 -343 -3514 -2330 1998 3279 -71 -2443 12 3088 1928
1700 1928 -1032 -684 1523 669 -2044 -1600 1705 2266 -1214 -3191 -309 3176 1783 -2122 -2605 454
1716 454 1401 -1094 -2180 115 1389 -780 -2095 758 3793 2229 -1581 -1655 2030 3395 171 -2728
1732 -2728 -1362 941 -107 -2277 -1186 1332 573 -2213 -1713 2016 3184 -183 -3022 -1137 2268
1747 2268 1787 -1498 -1950 739 1651 -399 -812 1874 2842 -118 -2417 -342 2692 1495 -2608 -3587
1763 -3587 -392 1654 -426 -2358 -498 1678 500 -1234 417 2983 1771 -1872 -2359 1045 2906
1778 2906 166 -2925 -1540 1798 1766 -770 -832 1385 1326 -1315 -1858 793 1989 -909 -3721 -1957 1859
1795 1859 2075 -1110 -2037 837 2724 998 -568 870 2156 14 -2434 -1018 1941 1319 -2305 -3290
$$ packed form
1685A44J298k246j897K068K218j928l171J184M328J281l350k372K455L076j160
1700A928k960L48K207q54k713M44L305N61l480j977K882L485j393l905m83L059
1716D54R47k495j086K295J274k169j315K853L035j564l810p4L685J365l224k899
1732b728J366K303j048k170J091K518p59k786N00L729J168l367k839J885L405
1747B268m81l285m52K689R12k050m13K686R68k960k299K075L034j197m103r79
1763c587L195K046k080j932J860K176j178j734J651K566j212l643m87L404J861
1778B906k740l091J385L338l2k536o2K217n9k641n43K651J196k898k812J764L816
1795A859K16l185r27K874J887j726j566J438J286k142k448J416K959o22l624r85
$$ plain form
1811 -3290 57 2650 855 -1934 -1097 1438 980 -1347 -1029 1273 931 -1919 -2368 983 3266 1050
1827 1050 -1984 -912 2607 2978 -135 -1640 216 948 -1225 -2406 -416 1211 -777 -3106 -1521
1842 -1521 2222 2725 -546 -2229 298 2744 1147 -1299 -617 1255 455 -1574 -710 2019 2040 -1073
1858 -1073 -2417 360 2947 1040 -2524 -2417 359 853 -1404 -1921 255 1129 -720 -1424 1242 3431
1874 3431 1538 -1716 -1226 2083 2662 -542 -2621 -848 1074 -142 -1781 -512 1434 307 -2002
1889 -2002 -1149 1990 2383 -908 -2934 -619 2252 1288 -1513 -1349 1171 1532 -320 -456 1671 1962 -773
1906 -773 -2391 -236 2180 672 -2805 -2922 304 1788 -256 -1643 145 1713 474 -886 629
1921 629 2484 1044 -1988 -1844 1302 2467 -419 -2738 -977 1745 1138 -1102 -877 971 594 -1548
$$ packed form
1811c290L347K593j795k789Q37K535m58k327L18K302l42k850m49L351K283k216
1827A050l034J072L519L71l113j505J856P32k173j181J990J627j988k329J585
1842a521L743N03l271j683K527K446j597k446O82J872q00k029Q64K729K1l113
1858a073j344K777K587j907l564J07K776M94k257n17K176Q74j849p04K666K189
1874C431j893l254M90L309N79l204k079J773J922j216j639J269J946j127k309
1889b002Q53L139L93l291k026K315K871r64k801J64K520L61j852j36K127K91k735
1906g73j618K155K416j508l477j17L226J484k044j387J788J568j239j360J515
1921F29J855j440l032J44L146J165k886k319J761K722o07k240K25J848l77k142
$$ plain form
1937 -1548 -1539 984 1723 -1031 -2971 -703 2571 1964 -1044 -1428 1141 2264 400 -838 536 1387 -577
1954 -577 -2339 -681 1818 779 -2371 -2624 647 2450 382 -1818 -634 1499 935 -890 -389 1473
1970 1473 901 -1565 -1608 1302 2638 141 -2407 -1013 1916 1682 -1093 -1828 47 677 -1070 -1662 313
1987 313 1500 -412 -2208 -336 2810 2479 -749 -1689 866 2515 656 -1394 -579 784 -244 -1977
2003 -1977 -1020 1256 800 -2004 -2464 582 2591 602 -2020 -1133 1490 1625 -357 -674 1016 1367 -521
2020 -521 -1083 1163 2523 292 -2450 -1469 1442 1480 -1485 -2794 -879 697 -366 -1542 -156 1514
2036 1514 512 -1206 17 2798 2650 -488 -1840 453 2423 774 -1836 -1547 459 355 -1336 -1149
2052 -1149 778 940 -1341 -2132 355 2391 615 -2194 -1623 1329 2022 -65 -1085 528 1684 373
$$ packed form
1937a548RK523P39k754j940K268L274o07l008l84K569J123j864j238J374Q51j964
1954e77j762J658K499j039l150k53L271J803k068k200J184K133n64j825N01J862
1970A473n72k466m3K910J336k497k548J394K929k34k775p35J875O30j747n92J975
1987C13J187j912j796J872L146l31l228r40K555J649j859k050Q15J363j028j733
2003a977R57K276m56k804m60L046K009j989k622Q87K623J35j982l17J690L51j888
2020e21n62K246J360k231k742R81K911L8k965j309J915J576j063j176J386J670
2036A514j002j718J223K781j48l138j352K293J970j649k610K89K006j04j691J87
2052a149J927J62k281p91K487K036j776k809N71K952O93k087j020J613J156j311
$$ plain form
2068 373 -792 573 1942 266 -2382 -1867 1024 1459 -1370 -2931 -892 1480 884 -822 -300 1459
2084 1459 1198 -593 -432 1717 1820 -997 -2523 -342 2029 901 -1789 -1721 741 1558 -109 -937 437
2101 437 1083 -700 -1921 -154 1833 455 -2245 -1851 1251 2439 310 -1321 -36 1641 805 -913
2117 -913 -438 1009 174 -2028 -1687 1103 1963 -435 -2114 -277 2305 1766 -707 -1165 444 735 -966
2134 -966 -1509 174 921 -938 -2245 -201 2478 1796 -948 -1313 1120 2246 411 -1335 -510 702
2150 702 -249 -1593 -553 1512 808 -1620 -1619 1179 2408 100 -2135 -1166 952 697 -1139 -1244 521
2167 521 921 -629 -680 1674 2708 449 -1611 -313 1993 1352 -1492 -2460 -649 556 -601 -1576 -212
2184 -212 1170 72 -1306 76 2346 1682 -1181 -1865 415 1956 365 -1603 -923 1055 969 -463
$$ packed form
2068C73j165J365J369j676k648N15K891M35k829j561K039K372n96j706N22J759
2084A459k61j791J61K149J03k817j526K181K371j128k690O8K462Q17j667q28J374
2101D37O46j783j221J767J987j378k700L94L102J188k129j631J285J677q36j718
2117i13M75J447q35k202L41K790Q60k398j679J837K582n39k473m58J609K91j701
2134i66n43J683P47j859j307K044K679o82k744l65K433J126j835j746Q25J212
2150G02r51j344J040K065p04k428JK798J229k308k235R69K118k55j836j05J765
2167E21M00j550n1K354J034k259k060J298K306o41k844r68J811J205j157r75J364
2184b12J382j098j378J382K270o64k863o84K280J541j591j968O80J978q6j432
$$ plain form
2200 -463 -243 1419 1093 -1192 -1814 354 1553 -575 -2870 -1849 863 1322 -452 -970 823 1833
2216 1833 572 -272 1087 1969 81 -2081 -1129 1309 1121 -1490 -2413 -294 1541 623 -992 -431 990
2233 990 402 -1259 -806 1115 928 -1479 -2112 411 2403 1105 -1008 -569 1516 1841 -7 -855 250
2250 250 523 -1252 -2096 -302 1260 -202 -2220 -1246 1566 2141 91 -1245 116 1479 428 -1049
2266 -1049 -393 868 -16 -1719 -876 1616 1871 -510 -1694 185 2076 996 -1311 -1406 225 336 -1103
2283 -1103 -1174 623 1086 -698 -1437 653 2526 1178 -1342 -1334 845 1469 -394 -1637 -505 666 -176
2300 -176 -1066 253 1839 842 -1291 -910 1436 1864 -457 -2189 -995 902 456 -1169 -952 716 764
2317 764 -689 -470 1489 1822 -437 -1842 -252 1737 901 -1430 -1666 284 1237 -56 -829 461 1229
$$ packed form
2200d63K20J662l26k285o22K168J199k128k295J021K712M59j774n18J793J010
2216A833j261q44J359Q82j888k162R52K438j88k611r23K119J835r18j615N61J421
2233I90n88j661M53J921j87k407o33K523J992j298k113M39K085L25j848q48J105
2250B50K73j775q44J794J562j462k018R74K812N75k050j336J361J363j051j477
2266a049O56J261q84j703Q43K492K55k381j184J879J891j080k307r5J631J11j439
2283a103p1J797M63j784p39K090J873j348k520QK179O24j863j243J132J171q42
2300a76q90J319J586r97k133L81K346M28k321j732J194J897m46j625K17J668M8
2317G64j453K19J959L33k259j405J590J989q36k331k36J950R53j293p73J290P68
$$ plain form
2334 1229 -219 -1408 -73 1564 436 -1978 -1949 477 1687 117 -1362 -271 1449 1065 -324 82
2350 82 1367 705 -1310 -1410 686 1376 -682 -2381 -1052 1248 1175 -721 -1127 461 1052 -256 -799
2367 -799 573 1262 -367 -1730 -265 1922 1429 -911 -1433 564 1778 446 -1128 -511 635 -157
2383 -157 -1497 -709 990 523 -1517 -1594 811 2150 553 -1313 -597 1319 1271 -445 -793 486 651
2400 651 -883 -1206 582 1556 -167 -1883 -824 1441 1445 -743 -1654 -79 1083 97 -928 -11 1119
2417 1119 146 -1145 -202 1733 1436 -882 -1721 182 1694 440 -1501 -1135 490 480 -800 -661 828
2434 828 868 -873 -1309 646 1979 514 -1546 -1013 1152 1508 -304 -1146 59 875 -219 -1028 151
2451 151 1180 -115 -1816 -984 1254 1430 -716 -1757 -133 1509 827 -671 -336 951 595 -760
$$ packed form
2334A229j448j189J335J637j128k414K9K426J210j570j479J091J720l84j389M06
2350H2J285o62k015j00K096O90k058j699J329K300p3j896m06J588N91j308n43
2367g99J372O89j629j363J465K187m93k340n22J997J214j332j574O17J146p92
2383a57j340P88J699m67k040p7K405J339j597j866P16J916m8j716l48J279J65
2400F51j534l23J788R74j723j716J059K265Mk188r11J575J162r86j025R17J130
2417A119r73j291R43J935k97k318q39J903J512j254j941L66J625j0j280J39J489
2434H28M0j741m36J955J333j465k060N33K165L56j812q42J205Q16j094q09J179
2451A51J029j295j701Q32K238J76k146j041J624J642o82j498L35J287l56j355
$$ plain form
2467 -760 -436 1188 1139 -902 -1789 -36 1586 572 -1582 -1456 424 956 -411 -955 323 892 -305
2484 -305 -937 533 1903 724 -1301 -988 1140 1689 -250 -1632 -591 718 34 -1120 -523 689
2500 689 109 -1304 -837 1209 1624 -377 -1595 -91 1791 1197 -688 -769 688 930 -324 -612 594
2517 594 880 -788 -1848 -445 1236 362 -1747 -1798 328 1368 141 -839 149 1298 589 -377 402
2534 402 1624 718 -1253 -1266 708 1451 -395 -1976 -964 842 632 -797 -792 450 475 -772 -821 780
2552 780 1357 -286 -1557 -194 1837 1465 -553 -1035 525 1263 -2 -947 -167 469 -640 -1669 -623
2569 -623 1142 670 -1250 -1372 730 1960 650 -894 -311 993 626 -601 -519 638 385 -1096 -1234
2586 -1234 637 1643 88 -1587 -671 1237 1152 -607 -1205 -15 555 -368 -873 300 1164 11 -1209
$$ packed form
2467g60L24J624m9k041q87J753J622j014k154J26J880N32j367n44J278N69j197
2484c05o32J470J370j179k025L13K128N49j939j382J041J309o84j154N97J212
2500F89n80j413M67K046M15k001j218J504J882n94j885q1J457K42j254k88J206
2517E94K86j668j060J403J681q74k109n1K126J040j227r80R88J149p09r66P79
2534D02J222r06j971j3J974P43j846j581J012J806k10j429NJ242K5j247m9J601
2552G80N77j643j271J363K031l72k018m82J560P38j265r45P80O36j109j029J046
2569f23J765m72j920j22K102J230j310j544N83J304l67j227Q2J157k53j481j38
2586a234J871J006j555j675R16J908q5j759n98J190N70r23n05J173Q64j153j220
$$ plain form
2603 -1209 -218 1693 1416 -766 -1550 22 1160 102 -1197 -628 497 191 -773 -162 1337 1121 -741
2620 -741 -1261 447 1625 194 -1677 -1286 459 670 -553 -746 450 874 -155 -549 802 1716 335
2637 335 -1445 -942 1007 1153 -685 -1554 -285 857 234 -639 -46 857 164 -1159 -663 976 995 -990
2655 -990 -1803 -117 1534 776 -694 -451 965 1089 -51 -289 720 690 -882 -1645 -217 1124 26
2672 26 -1729 -1274 723 1385 65 -687 244 986 208 -658 83 1069 135 -1409 -952 1033 1475 -291
2690 -291 -1402 -213 1218 632 -754 -750 232 101 -1008 -870 589 1008 -452 -1317 200 1959 1256 -599
2708 -599 -826 559 967 -236 -986 -179 330 -588 -1278 -116 1302 594 -1147 -1010 917 1584 63 -1204
2726 -1204 -436 700 312 -623 -260 808 522 -738 -638 1055 1520 -250 -1619 -594 946 533 -1036
$$ packed form
2603a209R91J911k77k182p84J572J138j058j299N69J125l06r64O11J499k16j862
2620g41n20J708J178j431j871L91J745K11j223j93J196M24j029l94J351R14j381
2637C35j780N03J949J46j838q69J269J142o23q73N93R03o93j323M96J639J9j985
2655i90q13J686J651p58j470K43J416J24j140k38J009l0j572p63J428J341j098
2672B6j755M55J997O62j320p52R31P42p78q66P41R86r34j544M57J985M42j766
2690b91j111J189J431n86j386MR82j31j109J38J459M19j460q65J517J759p03j855
2708e99k27J385M08j203p50Q07N09r18o90J162J418p08j741J37J927O67j521j267
2726a204P68J136l88r35L63J068k86j260J00J693M65j770j369J025J540m13j569
$$ plain form
2743 -1036 -1254 -21 510 -289 -499 621 1235 52 -979 79 1619 933 -1053 -1447 134 1014 6
2760 6 -1004 -385 607 202 -637 -133 1051 617 -1079 -1248 496 1374 -29 -1411 -637 930 958 -195
2778 -195 -382 561 695 -454 -779 375 963 -478 -1796 -823 1022 903 -692 -1087 257 1151 426 -343
2796 -343 206 889 115 -960 -299 1095 771 -1044 -1428 187 1302 298 -1031 -709 486 441 -535 -589
2814 -589 460 476 -778 -1036 554 1620 389 -1096 -509 1130 1274 -203 -893 -88 457 -302 -963 -104
2832 -104 680 -176 -1340 -577 1188 1212 -454 -1136 113 1271 572 -567 -348 554 299 -646 -395 861
2850 861 823 -768 -1334 129 1305 350 -1243 -1013 376 743 -232 -619 218 692 -158 -630 455 1439
2868 1439 418 -1158 -780 894 1164 -342 -1223 -377 599 196 -690 -293 604 208 -885 -518 997 1154
$$ packed form
2743a036k18J233N31p99k10J120O14j183j031J058J540o86j986l94J581Q80j008
2760Fj010O19R92m05q39N04J184m34j696j69J744Q78j403j382P74J567K8j153
2778a95j87R43J34j149l25J154N88j441j318R73J845j19j595l95J344Q94p25p69
2796c43N49O83p74j075O61J394l24j815l84J615J115j004j329L22J195m5r76n4
2814e89J049J6j254k58J590J066j231j485N87J639J44j477o90Q05N45p59o61Q59
2832a04P84q56j164P63J765K4j666o82J249J158o99j139K19R02k55r45K51J256
2850H61l8j591n66J463J176r55j593K30J389L67r75l87Q37M74q50m72J085R84
2868A439j021j576L78J674K70j506q81Q46R76m03q86L97Q97l96j093L67J515J57
$$ plain form
2886 1154 -469 -1299 -67 1298 770 -645 -662 383 643 -268 -482 445 686 -513 -1200 20 1214
2903 1214 425 -1199 -1080 460 1051 3 -831 -135 643 136 -549 27 1011 403 -1025 -810 826 1273
2921 1273 -153 -1272 -477 819 598 -535 -611 334 413 -483 -566 647 1025 -314 -1244 -190 1242 790
2939 790 -752 -994 202 859 64 -616 5 588 -144 -928 -108 1089 497 -1088 -1116 443 1232 151
2957 151 -904 -363 736 593 -319 -182 691 423 -765 -828 533 1064 -248 -1452 -629 887 832 -424
2975 -424 -791 169 678 -84 -484 331 840 -135 -1090 -248 1152 870 -706 -1115 162 1086 271 -740 -428
2994 -428 379 86 -749 -379 688 492 -817 -979 531 1464 416 -886 -498 802 823 -280 -618 126
3012 126 294 -564 -859 261 948 -81 -1202 -509 1069 1094 -336 -949 -36 816 244 -541 -85 614 134
$$ packed form
2886A154j623q30J232J365n28j415j7J045K60r11k14R27K41j199o87J220J194
2903A214p89j624J19J540N91j048q34O96P78n07o85N76R84o08j428K15J636M47
2921A273j426j119P95J296k21j133p6R45P9q96q3J213L78j339r30J054J432m52
2939G90j542k42J196O57p95o80O21N83p32p84Q20J197n92j585k8J559P89j081
2957A51j055N41J099j43r12J37Q73k68j188o3J361N31j312j204Q23J516n5j256
2975d24l67R60N09p62m00Q15N09r75r55Q42J400k82j576m09J277R24q15j011L12
2994d28Q07k93q35L70J067j96j309j62J510R33j048j302L88J300K1j103l38P44
3012A26J68q58k95J120O87j029j121O93J578K5j430o13R13Q52n72p85M56O99m80
$$ plain form
3031 134 -744 -230 1030 858 -658 -1225 -9 1000 208 -1001 -880 244 425 -360 -366 579 759 -292
3049 -292 -649 526 1403 398 -1064 -794 592 867 -277 -923 -175 483 -61 -564 120 831 78 -1048
3067 -1048 -640 789 942 -463 -1265 -213 955 550 -396 -269 566 479 -400 -277 688 693 -622 -1289 -176
3086 -176 1019 398 -919 -891 397 930 67 -441 200 584 -158 -763 59 951 256 -1059 -857 647 1191
3105 1191 85 -848 -166 727 384 -451 -298 417 51 -917 -721 548 933 -271 -1121 -184 1158 847
3123 847 -377 -584 309 554 -227 -472 290 542 -351 -957 -76 1109 636 -804 -944 302 898 -29 -846
3142 -846 -385 338 9 -553 -60 832 526 -588 -557 777 1322 143 -1019 -472 636 470 -532 -676
3160 -676 85 233 -494 -581 418 897 -134 -1071 -323 1015 807 -540 -925 145 823 211 -362 132 661
$$ packed form
3031A34q78N14J260j72j516n67J216J009p92j209J21J124J81p85oR45J80j051
3049b92l57J175Q77j005j462K70J386K75j144o46P48O58n44n03O84P11p53j126
3067a048M08J429J53j405q02J052J168m05r46J27Q35q7q79J23R65Nj315o67J113
3086a76J195o21j317K8J288N33q63n08O41L84p42o05Q22Q92o95j315K02J504N44
3105A191j106r33O82Q93l43q35J53P15l66r68J96J269L85j204q50R37J342l11
3123H47j224k07Q93K45p81k45P62K52q93o06Q81J185m73j440j40J246N96r27q17
3142h46M61P23l29n62M93Q92l06j114L1J334N45j179j162N47J108j66j002j44
3160f76P61J48p27q7R99M79j031r37P48J338k08j347l85J070O78o12n73M94N29
$$ plain form
3179 661 81 -636 -82 882 489 -913 -1216 62 873 44 -970 -543 516 509 -172 -104 649 547 -431 -613
3199 -613 435 1049 23 -1148 -675 654 777 -368 -776 13 469 -92 -526 59 601 -134 -940 -380
3217 -380 920 928 -377 -869 222 1093 514 -447 -247 402 171 -586 -448 401 362 -801 -1113 95 1047
3236 1047 307 -873 -585 595 780 -82 -375 210 483 -191 -530 261 924 173 -966 -595 715 877
3254 877 -349 -1033 -276 499 73 -560 -252 424 123 -599 -238 870 969 -265 -928 59 1100 510 -661
3273 -661 -672 194 339 -322 -459 244 416 -431 -832 72 1033 386 -881 -747 538 951 31 -611 1 528
3293 528 142 -381 61 674 143 -879 -683 540 839 -346 -1150 -323 724 458 -390 -307 385 407 -234
3312 -234 -263 595 805 -267 -949 -103 1013 561 -728 -863 168 586 -92 -546 -56 376 -146 -671 -26
$$ packed form
3179F61n80p17N54R64l93j402l03J278Q11q29j014M27J059po81O8P53j02r78j82
3199f13J048O14j026j171M73J329J23j145m08P89M56n61m34N85N42p35q06N60
3217c80J300Qj305m92J091Q71n79r61K00O49k31p57J38Q49l9j163l12J208R52
3236A047p40j180K88J180J85q62k93N85K73o74l39P91O63p51j139L71J310J62
3254H77j226o84P57P75m26o33L08O76l01p22L61J108R9j234o63R87J041n90j171
3273f61j1Q66J45o61j37P03J72q47m01R04R61o47j267J34J285M13r20o42O12N27
3293E28l86n23M42O13n31j022J96J223K99j185q04Q27J047k66q48Q3O92K2o41
3312b34k9Q58K10j072o82Q46J116m52j289j35J031M18o78m54M90M32n22n25O45
$$ plain form
3331 -26 844 403 -747 -745 528 1107 138 -753 -277 585 351 -343 -243 381 228 -619 -586 454 886 -159
3351 -159 -1065 -331 813 655 -397 -616 161 482 -78 -352 217 580 -139 -819 -185 916 609 -687 -942
3370 -942 132 817 131 -613 -264 369 187 -398 -118 641 442 -613 -802 365 1020 59 -960 -492 576
3389 576 574 -237 -440 178 357 -295 -501 273 753 -113 -980 -386 789 747 -428 -783 58 662 188 -358
3409 -358 -32 441 19 -664 -278 716 578 -600 -932 158 964 294 -662 -453 363 393 -264 -325 294 342
3429 342 -417 -673 283 999 218 -843 -527 647 780 -160 -684 -97 369 -58 -487 1 563 29 -784
3448 -784 -410 778 867 -331 -894 -42 765 349 -460 -340 274 221 -358 -272 527 551 -421 -882 53 924 304
3469 304 -804 -670 315 603 -53 -388 157 494 -37 -448 196 852 237 -860 -684 502 744 -223 -881
$$ packed form
3331b6Q70m41j150KJ273N79r69q91M76Q62k34o94J00O24j53q47L3J040M32j045
3351a59r06P34J144j58j052k19P77L21n60k74N69L63p19o80O34J101l07j296k55
3370i42J074O85o86p44L49O33j82n85K80P59j99j055j89J167O55r61j019M68J068
3389E76kq11k03O18J79o52k06P74M80q66q67N94J175m2j175l55Q41O04m74n46
3409c58L26M73m22o83L86R94j38j178l32J090Q06o70r56K09Q16L0o57o1O19M8
3429C42p59k56R56P16p81j061L16J174J33r40n24N87M66m27m29M88N62n34q13
3448g84L74J188Q9j198n63Q52Q07m16q09J20O14n3n79Q6P99K4r72m61R35Q71o20
3469C04j108J34R85K88o56l35N45L37n31m11O44O56o15j097J76J186K42r67o58
$$ plain form
3488 -881 -284 466 240 -339 -172 440 237 -502 -370 569 766 -282 -937 -106 854 530 -448 -510 239 471
3508 471 -121 -386 166 393 -354 -859 -95 797 362 -708 -667 406 888 187 -440 -68 453 133 -386 -97
3528 -97 478 156 -768 -700 426 841 -130 -879 -309 587 467 -350 -426 195 261 -305 -381 401 730 -87 -749
3549 -749 -69 939 669 -446 -740 62 494 -67 -587 -206 267 -112 -589 -77 766 484 -525 -655 394
3568 394 923 164 -635 -333 406 336 -252 -229 343 303 -449 -526 344 771 -113 -968 -527 483 486 -385 -637 3
3590 3 462 70 -217 260 696 92 -583 -132 762 581 -513 -875 -45 638 174 -533 -287 297 196 -380
3610 -380 -204 447 364 -518 -721 199 871 216 -694 -432 519 658 -49 -303 199 295 -234 -542 37 508 -123
3631 -123 -931 -576 544 667 -228 -653 29 689 322 -230 -17 415 133 -484 -232 583 588 -414 -820 29
$$ packed form
3488h81N97P50k26n79J67O12k03p39J32R39J97j048o55Q31R60l24r78o2P49K32
3508D71n92k65N52K27p47n05P64Q92m35j070M1J073M82p01o27L72N21l20n19K89
3528i7N75l22r24O8J126M15r71p49N70Q96j20q17p6O21O6n66p6P82L29q17o62
3549g49O80J008k70j115k94Q02M32n61n20L81M73l79m77N12Q43k82j009j30J049
3568C94N29p59p99L02P39p0n88K3N72m0p52p7Q70M27q84q55M41J010Lq71k52O40
3590CM59l92k87M77M36o04o75M51Q94j81j094l62Q30O83m64p07K46N84j01n76
3610c80J76O51q3q82k03R20O72o55r10K62R51J39p07k54N02R6n29l08N79M71o31
3631a23q08L55J120J23q95m25O82O60l67n52K13M32k82o17K52Q15Nj002m06Q49
$$ plain form
3651 29 782 306 -593 -541 139 262 -314 -433 149 283 -319 -577 226 967 390 -553 -402 578 810 -11 -581
3672 -581 -146 297 -67 -491 -118 450 24 -676 -439 527 732 -213 -798 -164 594 355 -369 -316 275 315 -199
3693 -199 -175 536 568 -231 -714 -48 732 304 -700 -792 78 430 -138 -428 49 385 -39 -390 136 746 313
3714 313 -620 -571 403 783 -43 -722 -254 456 280 -282 -155 327 184 -461 -426 376 580 -246 -889 -279 675
3735 675 544 -309 -420 248 481 4 -245 192 393 -196 -691 -157 636 315 -625 -739 200 724 133 -453
3755 -453 -153 330 131 -325 -106 448 227 -544 -568 366 822 93 -664 -266 568 503 -204 -380 82 198 -285
3776 -285 -448 197 539 -91 -750 -212 714 645 -293 -629 71 543 76 -417 -124 285 -48 -485 -116 593
3796 593 435 -421 -665 207 783 186 -618 -404 279 278 -226 -247 264 285 -275 -414 322 778 110 -702 -417
$$ packed form
3651B9P53m76q99N2O80J23n76j19N82J34o02k58Q03P41n77r43J51R80K32q21n70
3672e81M35M43l64m24L73N68m26p00K37R66K05r45n85O34P58k39p24N3N91M0n14
3693a99K4P11L2p99m83O66P80m28j004r2Q70L52n68k90M77L36m24l51N26O10m33
3714C13r33M9R74L80q26o79M68P10j76n62J27M82j43o45L5Q02K04q26o43O10R54
3735F75j31q53j11O68K33m77k49M37K01n89m95N34P93l21r40j14R39N24n91n86
3755d53L00M83j99m56K19N54k21p71k4R34M56p29p57L98Q34o5p07j76M62J16m83
3776b85j63O45L42o30o59N38R26o9r38l36P00M72m67m93K93M09l33m37L69P09
3796E93j58q56k44Q72N76n97q04K14O83jn04k1N11K1n60j39P36M56o68q12K85
$$ plain form
3817 -417 466 538 -244 -595 -46 334 -26 -306 102 470 19 -542 -213 627 601 -350 -741 -48 633 222 -409
3838 -409 -264 235 206 -260 -168 420 378 -370 -645 96 713 192 -647 -508 341 545 -37 -323 123 336 -128
3859 -128 -372 142 563 75 -720 -490 460 634 -188 -638 -56 472 211 -262 -84 323 81 -408 -292 424
3879 424 520 -302 -745 -84 682 353 -441 -416 195 345 -113 -250 168 334 -222 -516 69 706 317 -558 -511
3900 -511 378 662 4 -475 -120 303 8 -378 -80 346 70 -543 -425 413 649 -104 -684 -152 546 369
3920 369 -273 -279 172 201 -215 -258 294 430 -190 -633 -88 666 404 -470 -593 163 484 19 -326 -4 298
3941 298 -11 -332 22 593 312 -516 -536 266 662 -18 -653 -305 280 192 -278 -212 203 178 -336 -320 357 650
3963 650 -19 -655 -211 594 506 -259 -454 90 324 -54 -264 78 316 -143 -596 -164 557 371 -450 -639
$$ packed form
3817d17Q83P2p82l51N49L80l60k80M08L68m51n61L29Q40k6r51l91O93O81m11o31
3838d09J45M99k9m66R2N88m2p48k75P41O17n21q39J39Q49K04n82k86M46K13m64
3859a28k44N14M21m88p95K30R50J74q22m50N82N28k61m73J78M07k42m89J16P16
3879D24R6q22m43O61P66l29p94K5O11J50m58j37M18J66n56k94N85O37l89q75M7
3900e11Q89K84o58m79L55M23k95l86K98M26k76o13J18Q38K36p53n80N32O98j77
3920C69o42oM51K9m16m3N52J36o20m43N45P54k62q74j23P56L21m65l45L22L02
3941B98l09l21L54N71k81q28k0Q02L96o80o35L48N85q8m70O6M15k5n14J6O77K93
3963F50o69o36M44Q05q8p65j95N44K34l78k10L42K38m59m53M32P21j86q21j89
$$ plain form
3983 -639 116 639 150 -354 -113 319 180 -210 -59 400 288 -409 -533 193 614 6 -699 -409 331 391
4003 391 -217 -370 76 250 -126 -267 228 541 40 -581 -228 571 583 -250 -549 -13 446 107 -317 -115
4023 -115 207 -32 -445 -175 437 372 -368 -615 126 691 246 -417 -277 304 332 -93 -169 210 237 -274 -474
4044 -474 121 529 49 -650 -453 362 530 -133 -476 -42 287 29 -219 51 402 104 -434 -220 499 585
4064 585 -185 -604 -37 567 245 -324 -263 139 95 -263 -252 234 291 -324 -577 36 671 274 -498 -427 285 479
4086 479 -16 -271 46 282 -53 -299 81 494 130 -573 -429 335 544 -161 -624 -217 323 135 -266 -160
4106 -160 235 125 -274 -190 447 570 -129 -551 -57 614 378 -329 -425 97 216 -147 -321 25 223 -234 -536
4127 -536 -58 557 257 -477 -492 246 587 107 -349 -59 331 170 -166 -14 401 139 -455 -429 259 497 -151
$$ packed form
3983f39P55N23m89n04K41M32j39l90J51M59j12o97j24P26M21o08p05K90P40O0
4003C91o08j53M46J74l76j41M95L13n01o21L53P99J2q33k99N36M59l39m24K02
4023a15L22k39m13K70O12o5p40k47P41N65m45o63J40N81K8m25p6L79K7n11k00
4044d74N95M08m80o99J97Q15J68o63l43M34L29k58k48K70L51k98n38K14P19Q6
4064E85p70m19N67O04l22n69O1M02m4l58J1M86N7o15k53O13O35l97p72P1P12J94
4086D79m95k55L17K36l35k46L80M13l64p03J44P64K09p05m63M07N40j88m01J06
4106a60L95j10l99Q4O37J23o99m22M94O71k36p07r6N22J19l63j74L46J98m57l02
4127e36M78O15l00p34j5P38L41m80m56K90L90j61l36J52M15k62n94K6O88K38o48
$$ plain form
4148 -151 -719 -311 320 257 -260 -295 160 260 -60 -139 328 508 -2 -452 -50 582 414 -343 -532 27 370
4169 370 -12 -370 -144 142 -88 -414 -150 367 239 -439 -508 246 661 171 -355 -158 404 395 -74 -106 229
4190 229 174 -317 -395 171 424 -159 -692 -378 365 397 -232 -424 47 307 59 -178 109 365 -10 -430 -89
4211 -89 543 444 -266 -538 55 535 140 -384 -264 108 57 -303 -248 245 224 -308 -394 248 674 205 -423 -280
4233 -280 365 424 -81 -312 32 163 -181 -336 76 414 1 -562 -268 445 503 -173 -558 -101 362 151 -279
4254 -279 -76 234 105 -246 -116 470 405 -224 -552 -8 490 168 -483 -429 118 245 -118 -184 187 285 -127
4275 -127 -313 150 561 180 -483 -421 268 454 -93 -427 -95 267 60 -218 34 348 109 -399 -284 359
4295 359 463 -173 -620 -150 387 276 -263 -217 145 212 -131 -167 240 285 -256 -533 -51 505 243 -371 -396 235
$$ packed form
4148a51n68M08O31o3n17l5M55J00l20p9M67J80n10m50M02O32j68p57j89N59L43
4169C70l82l58K26K86k30l26K64N17j28o78o9P54M15m90n26J97N62rm69l2L35
4190B29n5m91p8N66K53n83n33L14P43L2o29j92M71K60k48k37K87K56l75m20L41
4211h9O32r9p10k72N93M80l95n24J20L72n1l60N5M93k1n32q6O42M26m69o28J43
4233b80O45N9n05k31L44J31l44j55M12L38m13n63K94P13N8o76l85M57M63k11m30
4254b79K03L10j29l51J30N86o5o29l28N44M98l22o51N4N47J27l63o6L71R8m12
4275a27j86M63M11l81o63O2O89J86n47l34L32L62k07k78K52L14k39n08J15O43
4295C59J04o36m47M70N37j11n39M6L62O7l43l6M07M5n41k77M82N56k62o14k5O31
$$ plain form
4317 235 511 108 -174 73 294 -43 -303 -55 336 60 -544 -468 217 468 -17 -462 -147 346 248 -162 -140
4338 -140 165 73 -291 -230 286 437 -88 -494 -89 539 377 -229 -380 54 223 -98 -312 -9 199 -156 -414
4359 -414 -17 517 359 -255 -349 247 541 144 -339 -170 180 34 -282 -178 232 103 -340 -334 238 527 -2
4380 -2 -493 -263 307 290 -154 -297 80 210 -82 -150 249 459 36 -393 -101 438 344 -319 -553 -85 273 -13
4402 -13 -302 -81 238 77 -210 0 463 320 -264 -429 116 500 81 -430 -314 208 244 -111 -117 192 171 -221
4424 -221 -341 89 379 -46 -585 -329 310 405 -98 -316 91 375 123 -121 94 325 -11 -415 -202 301
4444 301 281 -293 -546 -55 424 195 -280 -174 199 176 -160 -139 249 212 -279 -416 91 525 217 -372 -324 255
4466 255 381 -62 -320 -61 85 -210 -369 -50 311 24 -412 -218 411 574 21 -336 19 363 173 -206
$$ packed form
4317B35K76m03k82K47K21l37k60K48L91k76o04P6O85K51m85m45L15M93r8m10K2
4338a40L05r2l64O1N16J51n25m06M05O28j62o06j51M34J69l21k14L03K08l55k58
4359d14L97N34j58o14r4N96K94l97m83J69L50j46l16J04M10j29m43ON72K89n29
4380bm91K30N70j7m44j43L77J30k92o8L99K10m23m29K92N39r4o63k34M68L58k86
4402a3k89K21L19j61k87K10M63j43n84j65N45L84m19n11J16N22L6l55oL09k1l92
4424b21j20M30K90m25n39K56O39R5n03k18M07K84k52k44K15K31l36m04K13N03
4444C01k0n74k53M91M79k29m75J06L73k3l36K1L88l7m91j37N07M34l08n89M8N79
4466B55J26m43k58K59J46k95j59L19L61k87m36J94O29J63n53l57L55L44j90l79
$$ plain form
4486 -206 -116 122 -29 -340 -195 252 299 -224 -497 -35 441 249 -327 -341 127 236 -84 -159 144 255 -71
4507 -71 -256 100 486 188 -407 -390 144 354 -115 -464 -179 144 21 -224 -10 323 110 -247 -183 373 479
4528 479 -51 -488 -136 367 251 -233 -252 124 132 -151 -154 157 260 -174 -503 -106 388 226 -347 -426 100 382
4550 382 73 -168 73 258 7 -198 31 332 137 -369 -416 151 425 -16 -447 -191 253 206 -133 -120 156
4571 156 117 -238 -232 208 377 -82 -453 -119 434 381 -154 -302 102 255 -18 -172 49 171 -116 -426 -121
4592 -121 336 213 -312 -461 85 397 80 -277 -102 192 109 -154 -41 284 195 -238 -259 207 482 65 -423
4613 -423 -279 236 274 -172 -326 -26 74 -166 -247 80 290 -28 -375 -125 419 408 -141 -354 25 368 112
4634 112 -208 -105 147 -16 -297 -139 230 166 -323 -480 -2 401 122 -328 -190 240 278 -11 -74 202 248
$$ packed form
4486b06R0K38j51l11J45M47M7n23k73M62M76j92n76j4M68J09l20p5L03J11l26
4507g1j85L56L86k98n95J7N34K10m69l49K85L23j23k45K14L33k13l57O4N56J06
4528D79n30m37L52N03j16m84j9L76Qk83lL11J03m34l29L97M94j62n73p9N26K82
4550C82l09k41K41J85k51k05K29L01j95n06m7N67K74m41m31K56M44m7l39J3K76
4571A56l9l55OM40J69m59l71L34N53n3n35j48M04J53k73j54K21J22k87l10L05
4592a21M57j23n25j49N46L12l17l57J75K94q3k63J13L25q9m33k1M66K75m17m88
4613d23J44N15L8m46j54L00J00k40q1L27K10l18l47K50N44j1n49k13L79L43k56
4634A12l20J03K52j63k81J58L69o4m89j57M78M03k79m50J38M30L8k89o3K76M6
$$ plain form
4655 248 -111 -237 134 403 43 -470 -327 214 286 -181 -401 -110 163 -34 -217 -16 244 44 -290 -103
4675 -103 381 466 -65 -355 8 425 207 -282 -247 76 67 -220 -218 101 143 -223 -404 29 444 221 -320 -275 213
4698 213 368 32 -214 27 216 1 -182 75 356 86 -368 -293 214 328 -154 -469 -173 181 85 -194 -99
4719 -99 197 141 -143 -91 316 375 -104 -420 -60 359 207 -302 -336 44 211 -49 -163 92 214 -75 -288 -17
4741 -17 379 165 -344 -368 145 399 42 -244 -78 242 132 -135 -25 192 57 -363 -358 123 301 -96 -457
4762 -457 -158 340 303 -61 -133 155 213 -72 -146 110 208 -155 -410 -125 341 242 -228 -324 105 345 71 -214
4784 -214 -55 139 -13 -247 -63 293 177 -270 -281 215 483 116 -330 -195 182 121 -217 -234 16 48 -256
4805 -256 -235 189 411 101 -276 -44 414 380 -109 -303 -11 156 -91 -233 -34 185 -72 -302 -82 343 290
$$ packed form
4655B48l59j26L71K69l60n13J43N41P2m67k20K91K73j97j83K01K60k00l34J87
4675a03M84Q5n31k90L63M17k18m89L5L23rk87KL19M2l66j81M33M15k23n41M5M88
4698B13J55l36k46K41J89k15j83K57K81k70m54P5N07J14m82l15K96L54r6k79R5
4719i9K96n6k84N2M07N9m79l16L60M19j52n09l4L80J67k60j14K55J22k89k13K71
4741a7L96k14n09k4N13K54l57k86J66L20j10k67J10K17j35m20NM81J78l97l61
4762d57K99M98l7l64p2K88N8k85p4K56R8l63k55K85M66r9m70r6M29K40k74k85
4784b14J59J94j52k34J84L56j16m47j1M96K68l67m46J35L77o1l38j7K50L2l04
4805b56K1M24K22l10l77K32M58l4m89j94K92J67k47j42J99K19k57k30K20M25n3
$$ plain form
4826 290 -245 -380 27 316 47 -269 -130 144 152 -73 17 310 287 -147 -265 140 332 -15 -480 -395 62 138
4848 138 -181 -284 14 184 9 -113 183 368 59 -313 -169 311 308 -162 -389 -61 296 148 -174 -63 197
4869 197 68 -225 -140 185 128 -276 -465 -11 390 213 -193 -123 242 334 52 -45 130 127 -206 -351 -33 205
4891 205 -47 -438 -303 207 369 14 -217 -8 238 77 -140 -23 176 -2 -309 -162 287 386 -53 -318
4911 -318 0 387 203 -200 -227 4 22 -223 -241 55 146 -182 -313 92 457 278 -172 -217 170 276 -23 -232
4933 -232 -84 81 -88 -229 -10 290 113 -276 -230 242 382 -19 -341 -176 190 133 -149 -91 158 160 -128 -67
4955 -67 306 355 -63 -368 -116 253 135 -294 -380 -27 156 -33 -116 95 235 -9 -191 60 367 191 -294
4976 -294 -344 64 296 17 -286 -87 188 112 -95 -7 236 97 -255 -253 104 298 -72 -379 -157 243 288 -16
$$ packed form
4826B90n35j35M07K89k69l16J39K74Qk25R0K93k3m34j18M05J92l47m65Q5M57P6
4848A38l19j03K98J70j75j22K96J85l09l72J44M80lm70k27L28L57j48l22J11K60
4869A97j29k93Q5L25n7m04j89M54M01j77m06P0L65R2k82r7J75ll33j45L18K38
4891B05k52l91J35N10J62l55k31K09K46j61k17J17J99j78l07J47M49R9m39k65
4911c18L18L87j84m03k7K31J8k45j8K96R1l28j31M05L65j79m50m5L87J06k99k09
4933b32J48J65j69j41K19L00j77l89M6M72J40m01l22J65L66n7k82N8K49Kk88O1
4955f7L73M9m18l05K52L69j18m29q6L53J83j89q3K11J40k44j82K51L07j76m85
4976b94n0M08K32k79l03J99K75p6k07Q8K43j39l52KL57J94l70l07K22M00M5l04
$$ plain form
4998 -16 -110 118 236 -52 -142 86 197 -137 -432 -156 271 205 -208 -312 57 296 101 -158 -35 146 -3
5019 -3 -245 -77 215 114 -251 -317 91 380 157 -258 -160 205 198 -105 -166 83 81 -187 -224 132 315 27 -327
5042 -327 -148 280 303 -64 -282 -44 116 -32 -197 -17 141 -25 -243 -49 316 274 -147 -331 23 302 101
5063 101 -225 -190 83 66 -142 -86 183 169 -150 -231 118 383 124 -274 -195 180 255 -47 -220 -4 151 -53
$$ packed form
4998a6r4K28J18k88r0K28J11l34k95K76M27o6m13j04L69K39j95k59J23J81j49
5019ck42J68K92j01l65o6M08K89k23m15R8L65pl03o1K49kk68l7L56J83k88l54
5042c27J79M28K3l67k18K38J60j48j65J80J58j66k18J94L65m2m21j84L54K79k01
5063A01l26L5K73j7k08N6K69j4l19q1L49K65k59l98P9L75P5l02j73K16J55k04
$$ [...]
8191h7
##END NTUPLES=NMR FID
##END=
